Console Output

Skipping 63,468 KB.. Full Log
a.out`main:
->  0x100003ef0 <+272>: movb   $0x61, (%rax)
    0x100003ef3 <+275>: leaq   0x94(%rip), %rdi          ; "Got there on time and it did not crash.\n"
    0x100003efa <+282>: movb   $0x0, %al
    0x100003efc <+284>: callq  0x100003f10               ; symbol stub for: printf
(lldb) frame var touch_me_not
(lldb) settings set interpreter.prompt-on-quit false
quit
settings set interpreter.prompt-on-quit false
(lldb) quit
(lldb) settings clear -all
(lldb) settings set symbols.enable-external-lookup false
(lldb) settings set target.inherit-tcc true
(lldb) settings set target.detach-on-error false
(lldb) settings set target.auto-apply-fixits false
(lldb) settings set plugin.process.gdb-remote.packet-timeout 60
(lldb) settings set symbols.clang-modules-cache-path "/Users/buildslave/jenkins/workspace/lldb-cmake-matrix/lldb-build/lldb-test-build.noindex/module-cache-lldb/lldb-api"
(lldb) settings set use-color false
(lldb) setting set target.prefer-dynamic-value no-dynamic-values
(lldb) target create "/Users/buildslave/jenkins/workspace/lldb-cmake-matrix/lldb-build/lldb-test-build.noindex/driver/batch_mode/TestBatchMode.test_batch_mode_run_exit/a.out"

Locating external symbol file for a.out...


Loading Apple DWARF index for a.out...


Locating external symbol file for dyld...


Parsing symbol table for dyld...


Locating external symbol file for libc++.1.dylib...


Parsing symbol table for libc++.1.dylib...


Locating external symbol file for libSystem.B.dylib...


Parsing symbol table for libSystem.B.dylib...


Locating external symbol file for libc++abi.dylib...


Parsing symbol table for libc++abi.dylib...


Locating external symbol file for libcache.dylib...


Parsing symbol table for libcache.dylib...


Locating external symbol file for libcommonCrypto.dylib...


Parsing symbol table for libcommonCrypto.dylib...


Locating external symbol file for libcompiler_rt.dylib...


Parsing symbol table for libcompiler_rt.dylib...


Locating external symbol file for libcopyfile.dylib...


Parsing symbol table for libcopyfile.dylib...


Locating external symbol file for libcorecrypto.dylib...


Parsing symbol table for libcorecrypto.dylib...


Locating external symbol file for libdispatch.dylib...


Parsing symbol table for libdispatch.dylib...


Locating external symbol file for libdyld.dylib...


Parsing symbol table for libdyld.dylib...


Locating external symbol file for libkeymgr.dylib...


Parsing symbol table for libkeymgr.dylib...


Locating external symbol file for liblaunch.dylib...


Parsing symbol table for liblaunch.dylib...


Locating external symbol file for libmacho.dylib...


Parsing symbol table for libmacho.dylib...


Locating external symbol file for libquarantine.dylib...


Parsing symbol table for libquarantine.dylib...


Locating external symbol file for libremovefile.dylib...


Parsing symbol table for libremovefile.dylib...


Locating external symbol file for libsystem_asl.dylib...


Parsing symbol table for libsystem_asl.dylib...


Locating external symbol file for libsystem_blocks.dylib...


Parsing symbol table for libsystem_blocks.dylib...


Locating external symbol file for libsystem_c.dylib...


Parsing symbol table for libsystem_c.dylib...


Locating external symbol file for libsystem_configuration.dylib...


Parsing symbol table for libsystem_configuration.dylib...


Locating external symbol file for libsystem_coreservices.dylib...


Parsing symbol table for libsystem_coreservices.dylib...


Locating external symbol file for libsystem_darwin.dylib...


Parsing symbol table for libsystem_darwin.dylib...


Locating external symbol file for libsystem_dnssd.dylib...


Parsing symbol table for libsystem_dnssd.dylib...


Locating external symbol file for libsystem_featureflags.dylib...


Parsing symbol table for libsystem_featureflags.dylib...


Locating external symbol file for libsystem_info.dylib...


Parsing symbol table for libsystem_info.dylib...


Locating external symbol file for libsystem_m.dylib...


Parsing symbol table for libsystem_m.dylib...


Locating external symbol file for libsystem_malloc.dylib...


Parsing symbol table for libsystem_malloc.dylib...


Locating external symbol file for libsystem_networkextension.dylib...


Parsing symbol table for libsystem_networkextension.dylib...


Locating external symbol file for libsystem_notify.dylib...


Parsing symbol table for libsystem_notify.dylib...


Locating external symbol file for libsystem_sandbox.dylib...


Parsing symbol table for libsystem_sandbox.dylib...


Locating external symbol file for libsystem_secinit.dylib...


Parsing symbol table for libsystem_secinit.dylib...


Locating external symbol file for libsystem_kernel.dylib...


Parsing symbol table for libsystem_kernel.dylib...


Locating external symbol file for libsystem_platform.dylib...


Parsing symbol table for libsystem_platform.dylib...


Locating external symbol file for libsystem_pthread.dylib...


Parsing symbol table for libsystem_pthread.dylib...


Locating external symbol file for libsystem_symptoms.dylib...


Parsing symbol table for libsystem_symptoms.dylib...


Locating external symbol file for libsystem_trace.dylib...


Parsing symbol table for libsystem_trace.dylib...


Locating external symbol file for libunwind.dylib...


Parsing symbol table for libunwind.dylib...


Locating external symbol file for libxpc.dylib...


Parsing symbol table for libxpc.dylib...


Locating external symbol file for libobjc.A.dylib...


Parsing symbol table for libobjc.A.dylib...


Parsing symbol table for a.out...

Current executable set to '/Users/buildslave/jenkins/workspace/lldb-cmake-matrix/lldb-build/lldb-test-build.noindex/driver/batch_mode/TestBatchMode.test_batch_mode_run_exit/a.out' (x86_64).
(lldb) settings set -- target.run-args  "NOCRASH"
(lldb) break set -n main
Breakpoint 1: where = a.out`main, address = 0x0000000100003de0
(lldb) run
Process 89188 stopped
* thread #1, queue = 'com.apple.main-thread', stop reason = breakpoint 1.1
    frame #0: 0x0000000100003de0 a.out`main
a.out`main:
->  0x100003de0 <+0>: pushq  %rbp
    0x100003de1 <+1>: movq   %rsp, %rbp
    0x100003de4 <+4>: subq   $0x30, %rsp
    0x100003de8 <+8>: movl   $0x0, -0x4(%rbp)
Process 89188 launched: '/Users/buildslave/jenkins/workspace/lldb-cmake-matrix/lldb-build/lldb-test-build.noindex/driver/batch_mode/TestBatchMode.test_batch_mode_run_exit/a.out' (x86_64)
(lldb) continue
PID: 89188 END

Got there on time and it did not crash.

Process 89188 resuming
Process 89188 exited with status = 0 (0x00000000)
Skipping the following test categories: ['gmodules', 'watchpoint', 'llgs', 'debugserver', 'libstdcxx', 'dwo', 'llgs', 'fork']

Hide Details

-- Command Output (stderr): -- Change dir to: /Users/buildslave/jenkins/workspace/lldb-cmake-matrix/llvm-project/lldb/test/API/driver/batch_mode runCmd: settings clear -all output:

Hide Details

runCmd: settings set symbols.enable-external-lookup false output:

Hide Details

runCmd: settings set target.inherit-tcc true output:

Hide Details

runCmd: settings set target.detach-on-error false output:

Hide Details

runCmd: settings set target.auto-apply-fixits false output:

Hide Details

runCmd: settings set plugin.process.gdb-remote.packet-timeout 60 output:

Hide Details

runCmd: settings set symbols.clang-modules-cache-path "/Users/buildslave/jenkins/workspace/lldb-cmake-matrix/lldb-build/lldb-test-build.noindex/module-cache-lldb/lldb-api" output:

Hide Details

runCmd: settings set use-color false output:

Hide Details

runCmd: setting set target.prefer-dynamic-value no-dynamic-values output:

Hide Details

make VPATH=/Users/buildslave/jenkins/workspace/lldb-cmake-matrix/llvm-project/lldb/test/API/driver/batch_mode -C /Users/buildslave/jenkins/workspace/lldb-cmake-matrix/lldb-build/lldb-test-build.noindex/driver/batch_mode/TestBatchMode.test_batch_mode_attach_exit -I /Users/buildslave/jenkins/workspace/lldb-cmake-matrix/llvm-project/lldb/test/API/driver/batch_mode -I /Users/buildslave/jenkins/workspace/lldb-cmake-matrix/llvm-project/lldb/packages/Python/lldbsuite/test/make -f /Users/buildslave/jenkins/workspace/lldb-cmake-matrix/llvm-project/lldb/test/API/driver/batch_mode/Makefile all ARCH=x86_64 'CC="/Users/buildslave/jenkins/workspace/lldb-cmake-matrix/lldb-build/bin/clang"' DSYMUTIL=/Users/buildslave/jenkins/workspace/lldb-cmake-matrix/lldb-build/./bin/dsymutil CODESIGN=codesign CLANG_MODULE_CACHE_DIR=/Users/buildslave/jenkins/workspace/lldb-cmake-matrix/lldb-build/lldb-test-build.noindex/module-cache-clang/lldb-api USE_HERMETIC_LIBCPP=1

Hide Details

"/Users/buildslave/jenkins/workspace/lldb-cmake-matrix/lldb-build/bin/clang" -gdwarf-5 -isysroot "/Applications/Xcode.app/Contents/Developer/Platforms/MacOSX.platform/Developer/SDKs/MacOSX11.1.sdk" -arch x86_64 -I/Users/buildslave/jenkins/workspace/lldb-cmake-matrix/llvm-project/lldb/packages/Python/lldbsuite/test/make/../../../../../include -I/Users/buildslave/jenkins/workspace/lldb-cmake-matrix/llvm-project/lldb/test/API/driver/batch_mode -I/Users/buildslave/jenkins/workspace/lldb-cmake-matrix/llvm-project/lldb/packages/Python/lldbsuite/test/make -include /Users/buildslave/jenkins/workspace/lldb-cmake-matrix/llvm-project/lldb/packages/Python/lldbsuite/test/make/test_common.h -fno-limit-debug-info -MT main.o -MD -MP -MF main.d -c -o main.o /Users/buildslave/jenkins/workspace/lldb-cmake-matrix/llvm-project/lldb/test/API/driver/batch_mode/main.c "/Users/buildslave/jenkins/workspace/lldb-cmake-matrix/lldb-build/bin/clang" main.o -gdwarf-5 -isysroot "/Applications/Xcode.app/Contents/Developer/Platforms/MacOSX.platform/Developer/SDKs/MacOSX11.1.sdk" -arch x86_64 -I/Users/buildslave/jenkins/workspace/lldb-cmake-matrix/llvm-project/lldb/packages/Python/lldbsuite/test/make/../../../../../include -I/Users/buildslave/jenkins/workspace/lldb-cmake-matrix/llvm-project/lldb/test/API/driver/batch_mode -I/Users/buildslave/jenkins/workspace/lldb-cmake-matrix/llvm-project/lldb/packages/Python/lldbsuite/test/make -include /Users/buildslave/jenkins/workspace/lldb-cmake-matrix/llvm-project/lldb/packages/Python/lldbsuite/test/make/test_common.h -fno-limit-debug-info --driver-mode=g++ -o "a.out" codesign -s - "a.out" "/Users/buildslave/jenkins/workspace/lldb-cmake-matrix/lldb-build/./bin/dsymutil" -o "a.out.dSYM" "a.out" warning: no relocation for offset 14 in debug_addr section note: while processing /Users/buildslave/jenkins/workspace/lldb-cmake-matrix/lldb-build/lldb-test-build.noindex/driver/batch_mode/TestBatchMode.test_batch_mode_attach_exit/main.o

Hide Details

Hide Details

Adding tearDown hook: def closeVictim(self): if self.victim is not None: self.victim.close() self.victim = None

Hide Details

Hide Details

FAIL: LLDB (/Users/buildslave/jenkins/workspace/lldb-cmake-matrix/lldb-build/bin/clang-x86_64) :: test_batch_mode_attach_exit (TestBatchMode.DriverBatchModeTest) tearing down the child process....

Hide Details

Executing tearDown hook: def closeVictim(self): if self.victim is not None: self.victim.close() self.victim = None

Hide Details

Hide Details

runCmd: settings clear -all output:

Hide Details

runCmd: settings set symbols.enable-external-lookup false output:

Hide Details

runCmd: settings set target.inherit-tcc true output:

Hide Details

runCmd: settings set target.detach-on-error false output:

Hide Details

runCmd: settings set target.auto-apply-fixits false output:

Hide Details

runCmd: settings set plugin.process.gdb-remote.packet-timeout 60 output:

Hide Details

runCmd: settings set symbols.clang-modules-cache-path "/Users/buildslave/jenkins/workspace/lldb-cmake-matrix/lldb-build/lldb-test-build.noindex/module-cache-lldb/lldb-api" output:

Hide Details

runCmd: settings set use-color false output:

Hide Details

runCmd: setting set target.prefer-dynamic-value no-dynamic-values output:

Hide Details

make VPATH=/Users/buildslave/jenkins/workspace/lldb-cmake-matrix/llvm-project/lldb/test/API/driver/batch_mode -C /Users/buildslave/jenkins/workspace/lldb-cmake-matrix/lldb-build/lldb-test-build.noindex/driver/batch_mode/TestBatchMode.test_batch_mode_launch_stop_at_entry -I /Users/buildslave/jenkins/workspace/lldb-cmake-matrix/llvm-project/lldb/test/API/driver/batch_mode -I /Users/buildslave/jenkins/workspace/lldb-cmake-matrix/llvm-project/lldb/packages/Python/lldbsuite/test/make -f /Users/buildslave/jenkins/workspace/lldb-cmake-matrix/llvm-project/lldb/test/API/driver/batch_mode/Makefile all ARCH=x86_64 'CC="/Users/buildslave/jenkins/workspace/lldb-cmake-matrix/lldb-build/bin/clang"' DSYMUTIL=/Users/buildslave/jenkins/workspace/lldb-cmake-matrix/lldb-build/./bin/dsymutil CODESIGN=codesign CLANG_MODULE_CACHE_DIR=/Users/buildslave/jenkins/workspace/lldb-cmake-matrix/lldb-build/lldb-test-build.noindex/module-cache-clang/lldb-api USE_HERMETIC_LIBCPP=1

Hide Details

"/Users/buildslave/jenkins/workspace/lldb-cmake-matrix/lldb-build/bin/clang" -gdwarf-5 -isysroot "/Applications/Xcode.app/Contents/Developer/Platforms/MacOSX.platform/Developer/SDKs/MacOSX11.1.sdk" -arch x86_64 -I/Users/buildslave/jenkins/workspace/lldb-cmake-matrix/llvm-project/lldb/packages/Python/lldbsuite/test/make/../../../../../include -I/Users/buildslave/jenkins/workspace/lldb-cmake-matrix/llvm-project/lldb/test/API/driver/batch_mode -I/Users/buildslave/jenkins/workspace/lldb-cmake-matrix/llvm-project/lldb/packages/Python/lldbsuite/test/make -include /Users/buildslave/jenkins/workspace/lldb-cmake-matrix/llvm-project/lldb/packages/Python/lldbsuite/test/make/test_common.h -fno-limit-debug-info -MT main.o -MD -MP -MF main.d -c -o main.o /Users/buildslave/jenkins/workspace/lldb-cmake-matrix/llvm-project/lldb/test/API/driver/batch_mode/main.c "/Users/buildslave/jenkins/workspace/lldb-cmake-matrix/lldb-build/bin/clang" main.o -gdwarf-5 -isysroot "/Applications/Xcode.app/Contents/Developer/Platforms/MacOSX.platform/Developer/SDKs/MacOSX11.1.sdk" -arch x86_64 -I/Users/buildslave/jenkins/workspace/lldb-cmake-matrix/llvm-project/lldb/packages/Python/lldbsuite/test/make/../../../../../include -I/Users/buildslave/jenkins/workspace/lldb-cmake-matrix/llvm-project/lldb/test/API/driver/batch_mode -I/Users/buildslave/jenkins/workspace/lldb-cmake-matrix/llvm-project/lldb/packages/Python/lldbsuite/test/make -include /Users/buildslave/jenkins/workspace/lldb-cmake-matrix/llvm-project/lldb/packages/Python/lldbsuite/test/make/test_common.h -fno-limit-debug-info --driver-mode=g++ -o "a.out" codesign -s - "a.out" "/Users/buildslave/jenkins/workspace/lldb-cmake-matrix/lldb-build/./bin/dsymutil" -o "a.out.dSYM" "a.out" warning: no relocation for offset 14 in debug_addr section note: while processing /Users/buildslave/jenkins/workspace/lldb-cmake-matrix/lldb-build/lldb-test-build.noindex/driver/batch_mode/TestBatchMode.test_batch_mode_launch_stop_at_entry/main.o

Hide Details

Hide Details

PASS: LLDB (/Users/buildslave/jenkins/workspace/lldb-cmake-matrix/lldb-build/bin/clang-x86_64) :: test_batch_mode_launch_stop_at_entry (TestBatchMode.DriverBatchModeTest) runCmd: settings clear -all output:

Hide Details

runCmd: settings set symbols.enable-external-lookup false output:

Hide Details

runCmd: settings set target.inherit-tcc true output:

Hide Details

runCmd: settings set target.detach-on-error false output:

Hide Details

runCmd: settings set target.auto-apply-fixits false output:

Hide Details

runCmd: settings set plugin.process.gdb-remote.packet-timeout 60 output:

Hide Details

runCmd: settings set symbols.clang-modules-cache-path "/Users/buildslave/jenkins/workspace/lldb-cmake-matrix/lldb-build/lldb-test-build.noindex/module-cache-lldb/lldb-api" output:

Hide Details

runCmd: settings set use-color false output:

Hide Details

runCmd: setting set target.prefer-dynamic-value no-dynamic-values output:

Hide Details

make VPATH=/Users/buildslave/jenkins/workspace/lldb-cmake-matrix/llvm-project/lldb/test/API/driver/batch_mode -C /Users/buildslave/jenkins/workspace/lldb-cmake-matrix/lldb-build/lldb-test-build.noindex/driver/batch_mode/TestBatchMode.test_batch_mode_run_crash -I /Users/buildslave/jenkins/workspace/lldb-cmake-matrix/llvm-project/lldb/test/API/driver/batch_mode -I /Users/buildslave/jenkins/workspace/lldb-cmake-matrix/llvm-project/lldb/packages/Python/lldbsuite/test/make -f /Users/buildslave/jenkins/workspace/lldb-cmake-matrix/llvm-project/lldb/test/API/driver/batch_mode/Makefile all ARCH=x86_64 'CC="/Users/buildslave/jenkins/workspace/lldb-cmake-matrix/lldb-build/bin/clang"' DSYMUTIL=/Users/buildslave/jenkins/workspace/lldb-cmake-matrix/lldb-build/./bin/dsymutil CODESIGN=codesign CLANG_MODULE_CACHE_DIR=/Users/buildslave/jenkins/workspace/lldb-cmake-matrix/lldb-build/lldb-test-build.noindex/module-cache-clang/lldb-api USE_HERMETIC_LIBCPP=1

Hide Details

"/Users/buildslave/jenkins/workspace/lldb-cmake-matrix/lldb-build/bin/clang" -gdwarf-5 -isysroot "/Applications/Xcode.app/Contents/Developer/Platforms/MacOSX.platform/Developer/SDKs/MacOSX11.1.sdk" -arch x86_64 -I/Users/buildslave/jenkins/workspace/lldb-cmake-matrix/llvm-project/lldb/packages/Python/lldbsuite/test/make/../../../../../include -I/Users/buildslave/jenkins/workspace/lldb-cmake-matrix/llvm-project/lldb/test/API/driver/batch_mode -I/Users/buildslave/jenkins/workspace/lldb-cmake-matrix/llvm-project/lldb/packages/Python/lldbsuite/test/make -include /Users/buildslave/jenkins/workspace/lldb-cmake-matrix/llvm-project/lldb/packages/Python/lldbsuite/test/make/test_common.h -fno-limit-debug-info -MT main.o -MD -MP -MF main.d -c -o main.o /Users/buildslave/jenkins/workspace/lldb-cmake-matrix/llvm-project/lldb/test/API/driver/batch_mode/main.c "/Users/buildslave/jenkins/workspace/lldb-cmake-matrix/lldb-build/bin/clang" main.o -gdwarf-5 -isysroot "/Applications/Xcode.app/Contents/Developer/Platforms/MacOSX.platform/Developer/SDKs/MacOSX11.1.sdk" -arch x86_64 -I/Users/buildslave/jenkins/workspace/lldb-cmake-matrix/llvm-project/lldb/packages/Python/lldbsuite/test/make/../../../../../include -I/Users/buildslave/jenkins/workspace/lldb-cmake-matrix/llvm-project/lldb/test/API/driver/batch_mode -I/Users/buildslave/jenkins/workspace/lldb-cmake-matrix/llvm-project/lldb/packages/Python/lldbsuite/test/make -include /Users/buildslave/jenkins/workspace/lldb-cmake-matrix/llvm-project/lldb/packages/Python/lldbsuite/test/make/test_common.h -fno-limit-debug-info --driver-mode=g++ -o "a.out" codesign -s - "a.out" "/Users/buildslave/jenkins/workspace/lldb-cmake-matrix/lldb-build/./bin/dsymutil" -o "a.out.dSYM" "a.out" warning: no relocation for offset 14 in debug_addr section note: while processing /Users/buildslave/jenkins/workspace/lldb-cmake-matrix/lldb-build/lldb-test-build.noindex/driver/batch_mode/TestBatchMode.test_batch_mode_run_crash/main.o

Hide Details

Hide Details

FAIL: LLDB (/Users/buildslave/jenkins/workspace/lldb-cmake-matrix/lldb-build/bin/clang-x86_64) :: test_batch_mode_run_crash (TestBatchMode.DriverBatchModeTest) tearing down the child process....

Hide Details

runCmd: settings clear -all output:

Hide Details

runCmd: settings set symbols.enable-external-lookup false output:

Hide Details

runCmd: settings set target.inherit-tcc true output:

Hide Details

runCmd: settings set target.detach-on-error false output:

Hide Details

runCmd: settings set target.auto-apply-fixits false output:

Hide Details

runCmd: settings set plugin.process.gdb-remote.packet-timeout 60 output:

Hide Details

runCmd: settings set symbols.clang-modules-cache-path "/Users/buildslave/jenkins/workspace/lldb-cmake-matrix/lldb-build/lldb-test-build.noindex/module-cache-lldb/lldb-api" output:

Hide Details

runCmd: settings set use-color false output:

Hide Details

runCmd: setting set target.prefer-dynamic-value no-dynamic-values output:

Hide Details

make VPATH=/Users/buildslave/jenkins/workspace/lldb-cmake-matrix/llvm-project/lldb/test/API/driver/batch_mode -C /Users/buildslave/jenkins/workspace/lldb-cmake-matrix/lldb-build/lldb-test-build.noindex/driver/batch_mode/TestBatchMode.test_batch_mode_run_exit -I /Users/buildslave/jenkins/workspace/lldb-cmake-matrix/llvm-project/lldb/test/API/driver/batch_mode -I /Users/buildslave/jenkins/workspace/lldb-cmake-matrix/llvm-project/lldb/packages/Python/lldbsuite/test/make -f /Users/buildslave/jenkins/workspace/lldb-cmake-matrix/llvm-project/lldb/test/API/driver/batch_mode/Makefile all ARCH=x86_64 'CC="/Users/buildslave/jenkins/workspace/lldb-cmake-matrix/lldb-build/bin/clang"' DSYMUTIL=/Users/buildslave/jenkins/workspace/lldb-cmake-matrix/lldb-build/./bin/dsymutil CODESIGN=codesign CLANG_MODULE_CACHE_DIR=/Users/buildslave/jenkins/workspace/lldb-cmake-matrix/lldb-build/lldb-test-build.noindex/module-cache-clang/lldb-api USE_HERMETIC_LIBCPP=1

Hide Details

"/Users/buildslave/jenkins/workspace/lldb-cmake-matrix/lldb-build/bin/clang" -gdwarf-5 -isysroot "/Applications/Xcode.app/Contents/Developer/Platforms/MacOSX.platform/Developer/SDKs/MacOSX11.1.sdk" -arch x86_64 -I/Users/buildslave/jenkins/workspace/lldb-cmake-matrix/llvm-project/lldb/packages/Python/lldbsuite/test/make/../../../../../include -I/Users/buildslave/jenkins/workspace/lldb-cmake-matrix/llvm-project/lldb/test/API/driver/batch_mode -I/Users/buildslave/jenkins/workspace/lldb-cmake-matrix/llvm-project/lldb/packages/Python/lldbsuite/test/make -include /Users/buildslave/jenkins/workspace/lldb-cmake-matrix/llvm-project/lldb/packages/Python/lldbsuite/test/make/test_common.h -fno-limit-debug-info -MT main.o -MD -MP -MF main.d -c -o main.o /Users/buildslave/jenkins/workspace/lldb-cmake-matrix/llvm-project/lldb/test/API/driver/batch_mode/main.c "/Users/buildslave/jenkins/workspace/lldb-cmake-matrix/lldb-build/bin/clang" main.o -gdwarf-5 -isysroot "/Applications/Xcode.app/Contents/Developer/Platforms/MacOSX.platform/Developer/SDKs/MacOSX11.1.sdk" -arch x86_64 -I/Users/buildslave/jenkins/workspace/lldb-cmake-matrix/llvm-project/lldb/packages/Python/lldbsuite/test/make/../../../../../include -I/Users/buildslave/jenkins/workspace/lldb-cmake-matrix/llvm-project/lldb/test/API/driver/batch_mode -I/Users/buildslave/jenkins/workspace/lldb-cmake-matrix/llvm-project/lldb/packages/Python/lldbsuite/test/make -include /Users/buildslave/jenkins/workspace/lldb-cmake-matrix/llvm-project/lldb/packages/Python/lldbsuite/test/make/test_common.h -fno-limit-debug-info --driver-mode=g++ -o "a.out" codesign -s - "a.out" "/Users/buildslave/jenkins/workspace/lldb-cmake-matrix/lldb-build/./bin/dsymutil" -o "a.out.dSYM" "a.out" warning: no relocation for offset 14 in debug_addr section note: while processing /Users/buildslave/jenkins/workspace/lldb-cmake-matrix/lldb-build/lldb-test-build.noindex/driver/batch_mode/TestBatchMode.test_batch_mode_run_exit/main.o

Hide Details

Hide Details

PASS: LLDB (/Users/buildslave/jenkins/workspace/lldb-cmake-matrix/lldb-build/bin/clang-x86_64) :: test_batch_mode_run_exit (TestBatchMode.DriverBatchModeTest) Restore dir to: /Users/buildslave/jenkins/workspace/lldb-cmake-matrix/lldb-build/tools/lldb/test ====================================================================== ERROR: test_batch_mode_attach_exit (TestBatchMode.DriverBatchModeTest) Test that the lldb driver's batch mode works correctly. ---------------------------------------------------------------------- Traceback (most recent call last): File "/Users/buildslave/jenkins/workspace/lldb-cmake-matrix/llvm-project/lldb/third_party/Python/module/pexpect-4.6/pexpect/expect.py", line 111, in expect_loop incoming = spawn.read_nonblocking(spawn.maxread, timeout) File "/Users/buildslave/jenkins/workspace/lldb-cmake-matrix/llvm-project/lldb/third_party/Python/module/pexpect-4.6/pexpect/pty_spawn.py", line 482, in read_nonblocking raise TIMEOUT('Timeout exceeded.') pexpect.exceptions.TIMEOUT: Timeout exceeded.

Hide Details

During handling of the above exception, another exception occurred:

Hide Details

Traceback (most recent call last): File "/Users/buildslave/jenkins/workspace/lldb-cmake-matrix/llvm-project/lldb/packages/Python/lldbsuite/test/decorators.py", line 157, in wrapper return func(*args, **kwargs) File "/Users/buildslave/jenkins/workspace/lldb-cmake-matrix/llvm-project/lldb/packages/Python/lldbsuite/test/decorators.py", line 459, in wrapper func(*args, **kwargs) File "/Users/buildslave/jenkins/workspace/lldb-cmake-matrix/llvm-project/lldb/packages/Python/lldbsuite/test/decorators.py", line 127, in wrapper func(*args, **kwargs) File "/Users/buildslave/jenkins/workspace/lldb-cmake-matrix/llvm-project/lldb/test/API/driver/batch_mode/TestBatchMode.py", line 156, in test_batch_mode_attach_exit child.expect_exact(self.PROMPT + "continue") File "/Users/buildslave/jenkins/workspace/lldb-cmake-matrix/llvm-project/lldb/third_party/Python/module/pexpect-4.6/pexpect/spawnbase.py", line 418, in expect_exact return exp.expect_loop(timeout) File "/Users/buildslave/jenkins/workspace/lldb-cmake-matrix/llvm-project/lldb/third_party/Python/module/pexpect-4.6/pexpect/expect.py", line 119, in expect_loop return self.timeout(e) File "/Users/buildslave/jenkins/workspace/lldb-cmake-matrix/llvm-project/lldb/third_party/Python/module/pexpect-4.6/pexpect/expect.py", line 82, in timeout raise TIMEOUT(msg) pexpect.exceptions.TIMEOUT: Timeout exceeded. <pexpect.pty_spawn.spawn object at 0x1028c7760> command: /Users/buildslave/jenkins/workspace/lldb-cmake-matrix/lldb-build/bin/lldb args: ['/Users/buildslave/jenkins/workspace/lldb-cmake-matrix/lldb-build/bin/lldb', '--no-lldbinit', '--no-use-colors', '-O', 'settings clear -all', '-O', 'settings set symbols.enable-external-lookup false', '-O', 'settings set target.inherit-tcc true', '-O', 'settings set target.detach-on-error false', '-O', 'settings set target.auto-apply-fixits false', '-O', 'settings set plugin.process.gdb-remote.packet-timeout 60', '-O', 'settings set symbols.clang-modules-cache-path "/Users/buildslave/jenkins/workspace/lldb-cmake-matrix/lldb-build/lldb-test-build.noindex/module-cache-lldb/lldb-api"', '-O', 'settings set use-color false', '-O', 'setting set target.prefer-dynamic-value no-dynamic-values', '--file', '/Users/buildslave/jenkins/workspace/lldb-cmake-matrix/lldb-build/lldb-test-build.noindex/driver/batch_mode/TestBatchMode.test_batch_mode_attach_exit/a.out', '-b', '-o', 'process attach -p 86455', '-o', "breakpoint set --file 'main.c' -p 'Stop here to unset keep_waiting' -N keep_waiting", '-o', 'continue', '-o', 'break delete keep_waiting', '-o', 'expr keep_waiting = 0', '-o', 'continue'] buffer (last 100 chars): b'\r\n' before (last 100 chars): b'\r\n' after: <class 'pexpect.exceptions.TIMEOUT'> match: None match_index: None exitstatus: None flag_eof: False pid: 86472 child_fd: 9 closed: False timeout: 60 delimiter: <class 'pexpect.exceptions.EOF'> logfile: <_io.BufferedWriter name='<stdout>'> logfile_read: None logfile_send: None maxread: 2000 ignorecase: False searchwindowsize: None delaybeforesend: 0.05 delayafterclose: 0.1 delayafterterminate: 0.1 searcher: searcher_string: 0: b'(lldb) continue' Config=x86_64-/Users/buildslave/jenkins/workspace/lldb-cmake-matrix/lldb-build/bin/clang ====================================================================== ERROR: test_batch_mode_run_crash (TestBatchMode.DriverBatchModeTest) Test that the lldb driver's batch mode works correctly. ---------------------------------------------------------------------- Traceback (most recent call last): File "/Users/buildslave/jenkins/workspace/lldb-cmake-matrix/llvm-project/lldb/third_party/Python/module/pexpect-4.6/pexpect/expect.py", line 111, in expect_loop incoming = spawn.read_nonblocking(spawn.maxread, timeout) File "/Users/buildslave/jenkins/workspace/lldb-cmake-matrix/llvm-project/lldb/third_party/Python/module/pexpect-4.6/pexpect/pty_spawn.py", line 482, in read_nonblocking raise TIMEOUT('Timeout exceeded.') pexpect.exceptions.TIMEOUT: Timeout exceeded.

Hide Details

During handling of the above exception, another exception occurred:

Hide Details

Traceback (most recent call last): File "/Users/buildslave/jenkins/workspace/lldb-cmake-matrix/llvm-project/lldb/packages/Python/lldbsuite/test/decorators.py", line 157, in wrapper return func(*args, **kwargs) File "/Users/buildslave/jenkins/workspace/lldb-cmake-matrix/llvm-project/lldb/packages/Python/lldbsuite/test/decorators.py", line 459, in wrapper func(*args, **kwargs) File "/Users/buildslave/jenkins/workspace/lldb-cmake-matrix/llvm-project/lldb/test/API/driver/batch_mode/TestBatchMode.py", line 43, in test_batch_mode_run_crash child.expect_exact('(char *) touch_me_not') File "/Users/buildslave/jenkins/workspace/lldb-cmake-matrix/llvm-project/lldb/third_party/Python/module/pexpect-4.6/pexpect/spawnbase.py", line 418, in expect_exact return exp.expect_loop(timeout) File "/Users/buildslave/jenkins/workspace/lldb-cmake-matrix/llvm-project/lldb/third_party/Python/module/pexpect-4.6/pexpect/expect.py", line 119, in expect_loop return self.timeout(e) File "/Users/buildslave/jenkins/workspace/lldb-cmake-matrix/llvm-project/lldb/third_party/Python/module/pexpect-4.6/pexpect/expect.py", line 82, in timeout raise TIMEOUT(msg) pexpect.exceptions.TIMEOUT: Timeout exceeded. <pexpect.pty_spawn.spawn object at 0x102a2c520> command: /Users/buildslave/jenkins/workspace/lldb-cmake-matrix/lldb-build/bin/lldb args: ['/Users/buildslave/jenkins/workspace/lldb-cmake-matrix/lldb-build/bin/lldb', '--no-lldbinit', '--no-use-colors', '-O', 'settings clear -all', '-O', 'settings set symbols.enable-external-lookup false', '-O', 'settings set target.inherit-tcc true', '-O', 'settings set target.detach-on-error false', '-O', 'settings set target.auto-apply-fixits false', '-O', 'settings set plugin.process.gdb-remote.packet-timeout 60', '-O', 'settings set symbols.clang-modules-cache-path "/Users/buildslave/jenkins/workspace/lldb-cmake-matrix/lldb-build/lldb-test-build.noindex/module-cache-lldb/lldb-api"', '-O', 'settings set use-color false', '-O', 'setting set target.prefer-dynamic-value no-dynamic-values', '--file', '/Users/buildslave/jenkins/workspace/lldb-cmake-matrix/lldb-build/lldb-test-build.noindex/driver/batch_mode/TestBatchMode.test_batch_mode_run_crash/a.out', '-b', '-o', 'break set -n main', '-o', 'run', '-o', 'continue', '-k', 'frame var touch_me_not', '--', 'CRASH'] buffer (last 100 chars): b': callq 0x100003f10 ; symbol stub for: printf\r\n(lldb) frame var touch_me_not\r\n(lldb) ' before (last 100 chars): b': callq 0x100003f10 ; symbol stub for: printf\r\n(lldb) frame var touch_me_not\r\n(lldb) ' after: <class 'pexpect.exceptions.TIMEOUT'> match: None match_index: None exitstatus: None flag_eof: False pid: 89119 child_fd: 9 closed: False timeout: 60 delimiter: <class 'pexpect.exceptions.EOF'> logfile: <_io.BufferedWriter name='<stdout>'> logfile_read: None logfile_send: None maxread: 2000 ignorecase: False searchwindowsize: None delaybeforesend: 0.05 delayafterclose: 0.1 delayafterterminate: 0.1 searcher: searcher_string: 0: b'(char *) touch_me_not' Config=x86_64-/Users/buildslave/jenkins/workspace/lldb-cmake-matrix/lldb-build/bin/clang ---------------------------------------------------------------------- Ran 4 tests in 198.803s

Hide Details

RESULT: FAILED (2 passes, 0 failures, 2 errors, 0 skipped, 0 expected failures, 0 unexpected successes)

Hide Details

--

Hide Details

******************** TIMEOUT: lldb-api :: commands/expression/persistent_ptr_update/TestPersistentPtrUpdate.py (1921 of 1923) ******************** TEST 'lldb-api :: commands/expression/persistent_ptr_update/TestPersistentPtrUpdate.py' FAILED ******************** Script: -- /Applications/Xcode.app/Contents/Developer/Library/Frameworks/Python3.framework/Versions/3.8/bin/python3.8 /Users/buildslave/jenkins/workspace/lldb-cmake-matrix/llvm-project/lldb/test/API/dotest.py -u CXXFLAGS -u CFLAGS --codesign-identity lldb_codesign --arch x86_64 --build-dir /Users/buildslave/jenkins/workspace/lldb-cmake-matrix/lldb-build/lldb-test-build.noindex -t --env TERM=vt100 --skip-category gmodules --skip-category watchpoint --skip-category llgs --skip-category debugserver --arch=x86_64 --dwarf-version=5 --env LLVM_LIBS_DIR=/Users/buildslave/jenkins/workspace/lldb-cmake-matrix/lldb-build/./lib --env LLVM_INCLUDE_DIR=/Users/buildslave/jenkins/workspace/lldb-cmake-matrix/lldb-build/include --env LLVM_TOOLS_DIR=/Users/buildslave/jenkins/workspace/lldb-cmake-matrix/lldb-build/./bin --hermetic-libcxx --arch x86_64 --build-dir /Users/buildslave/jenkins/workspace/lldb-cmake-matrix/lldb-build/lldb-test-build.noindex --lldb-module-cache-dir /Users/buildslave/jenkins/workspace/lldb-cmake-matrix/lldb-build/lldb-test-build.noindex/module-cache-lldb/lldb-api --clang-module-cache-dir /Users/buildslave/jenkins/workspace/lldb-cmake-matrix/lldb-build/lldb-test-build.noindex/module-cache-clang/lldb-api --executable /Users/buildslave/jenkins/workspace/lldb-cmake-matrix/lldb-build/./bin/lldb --compiler /Users/buildslave/jenkins/workspace/lldb-cmake-matrix/lldb-build/./bin/clang --dsymutil /Users/buildslave/jenkins/workspace/lldb-cmake-matrix/lldb-build/./bin/dsymutil --llvm-tools-dir /Users/buildslave/jenkins/workspace/lldb-cmake-matrix/lldb-build/./bin --lldb-libs-dir /Users/buildslave/jenkins/workspace/lldb-cmake-matrix/lldb-build/./lib /Users/buildslave/jenkins/workspace/lldb-cmake-matrix/llvm-project/lldb/test/API/commands/expression/persistent_ptr_update -p TestPersistentPtrUpdate.py -- Exit Code: -9 Timeout: Reached timeout of 600 seconds

Hide Details

Command Output (stdout): -- lldb version 16.0.99git (http://labmaster3.local/git/llvm-project.git revision b2de84633a0a262b894e7cf87d29b167787aa2d6) clang revision b2de84633a0a262b894e7cf87d29b167787aa2d6 llvm revision b2de84633a0a262b894e7cf87d29b167787aa2d6

Hide Details

--

Hide Details

******************** TIMEOUT: lldb-api :: python_api/lldbutil/iter/TestRegistersIterator.py (1922 of 1923) ******************** TEST 'lldb-api :: python_api/lldbutil/iter/TestRegistersIterator.py' FAILED ******************** Script: -- /Applications/Xcode.app/Contents/Developer/Library/Frameworks/Python3.framework/Versions/3.8/bin/python3.8 /Users/buildslave/jenkins/workspace/lldb-cmake-matrix/llvm-project/lldb/test/API/dotest.py -u CXXFLAGS -u CFLAGS --codesign-identity lldb_codesign --arch x86_64 --build-dir /Users/buildslave/jenkins/workspace/lldb-cmake-matrix/lldb-build/lldb-test-build.noindex -t --env TERM=vt100 --skip-category gmodules --skip-category watchpoint --skip-category llgs --skip-category debugserver --arch=x86_64 --dwarf-version=5 --env LLVM_LIBS_DIR=/Users/buildslave/jenkins/workspace/lldb-cmake-matrix/lldb-build/./lib --env LLVM_INCLUDE_DIR=/Users/buildslave/jenkins/workspace/lldb-cmake-matrix/lldb-build/include --env LLVM_TOOLS_DIR=/Users/buildslave/jenkins/workspace/lldb-cmake-matrix/lldb-build/./bin --hermetic-libcxx --arch x86_64 --build-dir /Users/buildslave/jenkins/workspace/lldb-cmake-matrix/lldb-build/lldb-test-build.noindex --lldb-module-cache-dir /Users/buildslave/jenkins/workspace/lldb-cmake-matrix/lldb-build/lldb-test-build.noindex/module-cache-lldb/lldb-api --clang-module-cache-dir /Users/buildslave/jenkins/workspace/lldb-cmake-matrix/lldb-build/lldb-test-build.noindex/module-cache-clang/lldb-api --executable /Users/buildslave/jenkins/workspace/lldb-cmake-matrix/lldb-build/./bin/lldb --compiler /Users/buildslave/jenkins/workspace/lldb-cmake-matrix/lldb-build/./bin/clang --dsymutil /Users/buildslave/jenkins/workspace/lldb-cmake-matrix/lldb-build/./bin/dsymutil --llvm-tools-dir /Users/buildslave/jenkins/workspace/lldb-cmake-matrix/lldb-build/./bin --lldb-libs-dir /Users/buildslave/jenkins/workspace/lldb-cmake-matrix/lldb-build/./lib /Users/buildslave/jenkins/workspace/lldb-cmake-matrix/llvm-project/lldb/test/API/python_api/lldbutil/iter -p TestRegistersIterator.py -- Exit Code: -9 Timeout: Reached timeout of 600 seconds

Hide Details

Command Output (stdout): -- lldb version 16.0.99git (http://labmaster3.local/git/llvm-project.git revision b2de84633a0a262b894e7cf87d29b167787aa2d6) clang revision b2de84633a0a262b894e7cf87d29b167787aa2d6 llvm revision b2de84633a0a262b894e7cf87d29b167787aa2d6

Hide Details

-- Command Output (stderr): -- warning: (x86_64) /Users/buildslave/jenkins/workspace/lldb-cmake-matrix/lldb-build/lldb-test-build.noindex/python_api/lldbutil/iter/TestRegistersIterator.test_iter_registers_dsym/a.out empty dSYM file detected, dSYM was created with an executable with no debug info.

Hide Details

--

Hide Details

******************** TIMEOUT: lldb-api :: python_api/lldbutil/iter/TestLLDBIterator.py (1923 of 1923) ******************** TEST 'lldb-api :: python_api/lldbutil/iter/TestLLDBIterator.py' FAILED ******************** Script: -- /Applications/Xcode.app/Contents/Developer/Library/Frameworks/Python3.framework/Versions/3.8/bin/python3.8 /Users/buildslave/jenkins/workspace/lldb-cmake-matrix/llvm-project/lldb/test/API/dotest.py -u CXXFLAGS -u CFLAGS --codesign-identity lldb_codesign --arch x86_64 --build-dir /Users/buildslave/jenkins/workspace/lldb-cmake-matrix/lldb-build/lldb-test-build.noindex -t --env TERM=vt100 --skip-category gmodules --skip-category watchpoint --skip-category llgs --skip-category debugserver --arch=x86_64 --dwarf-version=5 --env LLVM_LIBS_DIR=/Users/buildslave/jenkins/workspace/lldb-cmake-matrix/lldb-build/./lib --env LLVM_INCLUDE_DIR=/Users/buildslave/jenkins/workspace/lldb-cmake-matrix/lldb-build/include --env LLVM_TOOLS_DIR=/Users/buildslave/jenkins/workspace/lldb-cmake-matrix/lldb-build/./bin --hermetic-libcxx --arch x86_64 --build-dir /Users/buildslave/jenkins/workspace/lldb-cmake-matrix/lldb-build/lldb-test-build.noindex --lldb-module-cache-dir /Users/buildslave/jenkins/workspace/lldb-cmake-matrix/lldb-build/lldb-test-build.noindex/module-cache-lldb/lldb-api --clang-module-cache-dir /Users/buildslave/jenkins/workspace/lldb-cmake-matrix/lldb-build/lldb-test-build.noindex/module-cache-clang/lldb-api --executable /Users/buildslave/jenkins/workspace/lldb-cmake-matrix/lldb-build/./bin/lldb --compiler /Users/buildslave/jenkins/workspace/lldb-cmake-matrix/lldb-build/./bin/clang --dsymutil /Users/buildslave/jenkins/workspace/lldb-cmake-matrix/lldb-build/./bin/dsymutil --llvm-tools-dir /Users/buildslave/jenkins/workspace/lldb-cmake-matrix/lldb-build/./bin --lldb-libs-dir /Users/buildslave/jenkins/workspace/lldb-cmake-matrix/lldb-build/./lib /Users/buildslave/jenkins/workspace/lldb-cmake-matrix/llvm-project/lldb/test/API/python_api/lldbutil/iter -p TestLLDBIterator.py -- Exit Code: -9 Timeout: Reached timeout of 600 seconds

Hide Details

Command Output (stdout): -- lldb version 16.0.99git (http://labmaster3.local/git/llvm-project.git revision b2de84633a0a262b894e7cf87d29b167787aa2d6) clang revision b2de84633a0a262b894e7cf87d29b167787aa2d6 llvm revision b2de84633a0a262b894e7cf87d29b167787aa2d6

Hide Details

-- Command Output (stderr): -- warning: (x86_64) /Users/buildslave/jenkins/workspace/lldb-cmake-matrix/lldb-build/lldb-test-build.noindex/python_api/lldbutil/iter/TestLLDBIterator.test_lldb_iter_breakpoint_dsym/a.out empty dSYM file detected, dSYM was created with an executable with no debug info. warning: (x86_64) /Users/buildslave/jenkins/workspace/lldb-cmake-matrix/lldb-build/lldb-test-build.noindex/python_api/lldbutil/iter/TestLLDBIterator.test_lldb_iter_frame_dsym/a.out empty dSYM file detected, dSYM was created with an executable with no debug info.

Hide Details

--

Hide Details

******************** Slowest Tests: -------------------------------------------------------------------------- 600.00s: lldb-api :: commands/expression/persistent_ptr_update/TestPersistentPtrUpdate.py 600.00s: lldb-api :: python_api/lldbutil/iter/TestRegistersIterator.py 600.00s: lldb-api :: python_api/lldbutil/iter/TestLLDBIterator.py 200.57s: lldb-api :: driver/batch_mode/TestBatchMode.py 106.55s: lldb-api :: api/multithreaded/TestMultithreaded.py 72.15s: lldb-api :: commands/process/attach/TestProcessAttach.py 70.65s: lldb-api :: commands/expression/multiline-completion/TestMultilineCompletion.py 70.62s: lldb-api :: macosx/nslog/TestDarwinNSLogOutput.py 69.70s: lldb-api :: commands/gui/basic/TestGuiBasic.py 69.60s: lldb-api :: commands/gui/breakpoints/TestGuiBreakpoints.py 69.26s: lldb-api :: commands/gui/viewlarge/TestGuiViewLarge.py 62.69s: lldb-api :: lang/objc/foundation/TestFoundationDisassembly.py 53.40s: lldb-api :: functionalities/completion/TestCompletion.py 38.56s: lldb-api :: python_api/target/TestTargetAPI.py 35.65s: lldb-api :: commands/process/attach-resume/TestAttachResume.py 32.23s: lldb-api :: functionalities/gdb_remote_client/TestPlatformMacOSX.py 32.06s: lldb-api :: lang/objc/hidden-ivars/TestHiddenIvars.py 28.23s: lldb-api :: lang/objc/exceptions/TestObjCExceptions.py 27.54s: lldb-api :: lang/objc/foundation/TestObjCMethods.py 26.27s: lldb-api :: lang/objc/real-definition/TestRealDefinition.py

Hide Details

Tests Times: -------------------------------------------------------------------------- [ Range ] :: [ Percentage ] :: [ Count ] -------------------------------------------------------------------------- [550s,600s) :: [ ] :: [ 3/1800] [500s,550s) :: [ ] :: [ 0/1800] [450s,500s) :: [ ] :: [ 0/1800] [400s,450s) :: [ ] :: [ 0/1800] [350s,400s) :: [ ] :: [ 0/1800] [300s,350s) :: [ ] :: [ 0/1800] [250s,300s) :: [ ] :: [ 0/1800] [200s,250s) :: [ ] :: [ 1/1800] [150s,200s) :: [ ] :: [ 0/1800] [100s,150s) :: [ ] :: [ 1/1800] [ 50s,100s) :: [ ] :: [ 8/1800] [ 0s, 50s) :: [*************************************** ] :: [1787/1800] -------------------------------------------------------------------------- ******************** Unresolved Tests (12): lldb-api :: commands/expression/multiline-completion/TestMultilineCompletion.py lldb-api :: commands/gui/basic/TestGuiBasic.py lldb-api :: commands/gui/breakpoints/TestGuiBreakpoints.py lldb-api :: commands/gui/viewlarge/TestGuiViewLarge.py lldb-api :: driver/batch_mode/TestBatchMode.py lldb-api :: functionalities/breakpoint/step_over_breakpoint/TestStepOverBreakpoint.py lldb-api :: macosx/nslog/TestDarwinNSLogOutput.py lldb-api :: python_api/objc_type/TestObjCType.py lldb-api :: python_api/signals/TestSignalsAPI.py lldb-api :: tools/lldb-vscode/breakpoint/TestVSCode_setFunctionBreakpoints.py lldb-api :: tools/lldb-vscode/evaluate/TestVSCode_evaluate.py lldb-api :: tools/lldb-vscode/runInTerminal/TestVSCode_runInTerminal.py

Hide Details

******************** Timed Out Tests (3): lldb-api :: commands/expression/persistent_ptr_update/TestPersistentPtrUpdate.py lldb-api :: python_api/lldbutil/iter/TestLLDBIterator.py lldb-api :: python_api/lldbutil/iter/TestRegistersIterator.py

Hide Details

******************** Failed Tests (622): lldb-api :: api/check_public_api_headers/TestPublicAPIHeaders.py lldb-api :: commands/apropos/with-process/TestAproposWithProcess.py lldb-api :: commands/command/nested_alias/TestNestedAlias.py lldb-api :: commands/command/script/TestCommandScript.py lldb-api :: commands/disassemble/basic/TestDisassembleBreakpoint.py lldb-api :: commands/disassemble/basic/TestFrameDisassemble.py lldb-api :: commands/expression/anonymous-struct/TestCallUserAnonTypedef.py lldb-api :: commands/expression/argument_passing_restrictions/TestArgumentPassingRestrictions.py lldb-api :: commands/expression/call-function/TestCallStdStringFunction.py lldb-api :: commands/expression/call-function/TestCallStopAndContinue.py lldb-api :: commands/expression/call-function/TestCallUserDefinedFunction.py lldb-api :: commands/expression/call-throws/TestCallThatThrows.py lldb-api :: commands/expression/cast_int_to_anonymous_enum/TestCastIntToAnonymousEnum.py lldb-api :: commands/expression/char/TestExprsChar.py lldb-api :: commands/expression/class_template_specialization_empty_pack/TestClassTemplateSpecializationParametersHandling.py lldb-api :: commands/expression/codegen-crash-import-def-arraytype-element/TestImportDefinitionArrayType.py lldb-api :: commands/expression/codegen-crash-typedefdecl-not-in_declcontext/TestCodegenCrashTypedefDeclNotInDeclContext.py lldb-api :: commands/expression/completion-crash-incomplete-record/TestCompletionCrashIncompleteRecord.py lldb-api :: commands/expression/completion-in-lambda-and-unnamed-class/TestCompletionInLambdaAndUnnamedClass.py lldb-api :: commands/expression/completion/TestExprCompletion.py lldb-api :: commands/expression/context-object-objc/TestContextObjectObjc.py lldb-api :: commands/expression/context-object/TestContextObject.py lldb-api :: commands/expression/deleting-implicit-copy-constructor/TestDeletingImplicitCopyConstructor.py lldb-api :: commands/expression/diagnostics/TestExprDiagnostics.py lldb-api :: commands/expression/dollar-in-variable/TestDollarInVariable.py lldb-api :: commands/expression/dont_allow_jit/TestAllowJIT.py lldb-api :: commands/expression/entry-bp/TestExprEntryBP.py lldb-api :: commands/expression/expr-in-syscall/TestExpressionInSyscall.py lldb-api :: commands/expression/expr_inside_lambda/TestExprInsideLambdas.py lldb-api :: commands/expression/fixits/TestFixIts.py lldb-api :: commands/expression/formatters/TestFormatters.py lldb-api :: commands/expression/function_template_specialization_temp_args/TestFunctionTemplateSpecializationTempArgs.py lldb-api :: commands/expression/ignore-artificial-constructors/TestIgnoreArtificialConstructors.py lldb-api :: commands/expression/import-std-module/array/TestArrayFromStdModule.py lldb-api :: commands/expression/import-std-module/basic/TestImportStdModule.py lldb-api :: commands/expression/import-std-module/conflicts/TestStdModuleWithConflicts.py lldb-api :: commands/expression/import-std-module/deque-basic/TestDequeFromStdModule.py lldb-api :: commands/expression/import-std-module/deque-dbg-info-content/TestDbgInfoContentDequeFromStdModule.py lldb-api :: commands/expression/import-std-module/empty-module/TestEmptyStdModule.py lldb-api :: commands/expression/import-std-module/forward_decl_from_module/TestForwardDeclFromStdModule.py lldb-api :: commands/expression/import-std-module/forward_list-dbg-info-content/TestDbgInfoContentForwardListFromStdModule.py lldb-api :: commands/expression/import-std-module/forward_list/TestForwardListFromStdModule.py lldb-api :: commands/expression/import-std-module/iterator/TestIteratorFromStdModule.py lldb-api :: commands/expression/import-std-module/list-dbg-info-content/TestDbgInfoContentListFromStdModule.py lldb-api :: commands/expression/import-std-module/list/TestListFromStdModule.py lldb-api :: commands/expression/import-std-module/missing-module-sources/TestStdModuleSourcesMissing.py lldb-api :: commands/expression/import-std-module/module-build-errors/TestStdModuleBuildErrors.py lldb-api :: commands/expression/import-std-module/no-std-module/TestMissingStdModule.py lldb-api :: commands/expression/import-std-module/non-module-type-separation/TestNonModuleTypeSeparation.py lldb-api :: commands/expression/import-std-module/queue/TestQueueFromStdModule.py lldb-api :: commands/expression/import-std-module/retry-with-std-module/TestRetryWithStdModule.py lldb-api :: commands/expression/import-std-module/shared_ptr-dbg-info-content/TestSharedPtrDbgInfoContentFromStdModule.py lldb-api :: commands/expression/import-std-module/shared_ptr/TestSharedPtrFromStdModule.py lldb-api :: commands/expression/import-std-module/sysroot/TestStdModuleSysroot.py lldb-api :: commands/expression/import-std-module/unique_ptr-dbg-info-content/TestUniquePtrDbgInfoContent.py lldb-api :: commands/expression/import-std-module/unique_ptr/TestUniquePtrFromStdModule.py lldb-api :: commands/expression/import-std-module/vector-bool/TestVectorBoolFromStdModule.py lldb-api :: commands/expression/import-std-module/vector-dbg-info-content/TestDbgInfoContentVectorFromStdModule.py lldb-api :: commands/expression/import-std-module/vector-of-vectors/TestVectorOfVectorsFromStdModule.py lldb-api :: commands/expression/import-std-module/vector/TestVectorFromStdModule.py lldb-api :: commands/expression/import-std-module/weak_ptr-dbg-info-content/TestDbgInfoContentWeakPtrFromStdModule.py lldb-api :: commands/expression/import-std-module/weak_ptr/TestWeakPtrFromStdModule.py lldb-api :: commands/expression/import_base_class_when_class_has_derived_member/TestImportBaseClassWhenClassHasDerivedMember.py lldb-api :: commands/expression/inline-namespace/TestInlineNamespace.py lldb-api :: commands/expression/ir-interpreter-phi-nodes/TestIRInterpreterPHINodes.py lldb-api :: commands/expression/ir-interpreter/TestIRInterpreter.py lldb-api :: commands/expression/issue_11588/Test11588.py lldb-api :: commands/expression/no-deadlock/TestExprDoesntBlock.py lldb-api :: commands/expression/options/TestExprOptions.py lldb-api :: commands/expression/persist_objc_pointeetype/TestPersistObjCPointeeType.py lldb-api :: commands/expression/persistent_types/TestPersistentTypes.py lldb-api :: commands/expression/persistent_variables/TestPersistentVariables.py lldb-api :: commands/expression/po_verbosity/TestPoVerbosity.py lldb-api :: commands/expression/pr35310/TestExprsBug35310.py lldb-api :: commands/expression/pr52257/TestExprCrash.py lldb-api :: commands/expression/radar_8638051/Test8638051.py lldb-api :: commands/expression/radar_9531204/TestPrintfAfterUp.py lldb-api :: commands/expression/radar_9673664/TestExprHelpExamples.py lldb-api :: commands/expression/rdar42038760/TestScalarURem.py lldb-api :: commands/expression/rdar44436068/Test128BitsInteger.py lldb-api :: commands/expression/regression-access-function-template-in-record/TestRegressionAccessFunctionTemplateInRecord.py lldb-api :: commands/expression/result_numbering/TestResultNumbering.py lldb-api :: commands/expression/save_jit_objects/TestSaveJITObjects.py lldb-api :: commands/expression/scoped_enums/TestScopedEnumType.py lldb-api :: commands/expression/static-initializers/TestStaticInitializers.py lldb-api :: commands/expression/test/TestExprs.py lldb-api :: commands/expression/test/TestExprs2.py lldb-api :: commands/expression/timeout/TestCallWithTimeout.py lldb-api :: commands/expression/top-level/TestTopLevelExprs.py lldb-api :: commands/expression/two-files/TestObjCTypeQueryFromOtherCompileUnit.py lldb-api :: commands/expression/unicode-in-variable/TestUnicodeInVariable.py lldb-api :: commands/expression/unwind_expression/TestUnwindExpression.py lldb-api :: commands/expression/vector_of_enums/TestVectorOfEnums.py lldb-api :: commands/expression/weak_symbols/TestWeakSymbols.py lldb-api :: commands/expression/xvalue/TestXValuePrinting.py lldb-api :: commands/frame/diagnose/array/TestArray.py lldb-api :: commands/frame/diagnose/bad-reference/TestBadReference.py lldb-api :: commands/frame/diagnose/complicated-expression/TestComplicatedExpression.py lldb-api :: commands/frame/diagnose/dereference-argument/TestDiagnoseDereferenceArgument.py lldb-api :: commands/frame/diagnose/dereference-function-return/TestDiagnoseDereferenceFunctionReturn.py lldb-api :: commands/frame/diagnose/dereference-this/TestDiagnoseDereferenceThis.py lldb-api :: commands/frame/diagnose/inheritance/TestDiagnoseInheritance.py lldb-api :: commands/frame/diagnose/local-variable/TestLocalVariable.py lldb-api :: commands/frame/diagnose/virtual-method-call/TestDiagnoseDereferenceVirtualMethodCall.py lldb-api :: commands/frame/language/TestGuessLanguage.py lldb-api :: commands/frame/select/TestFrameSelect.py lldb-api :: commands/frame/var-scope/TestFrameVariableScope.py lldb-api :: commands/frame/var/TestFrameVar.py lldb-api :: commands/memory/read/TestMemoryRead.py lldb-api :: commands/memory/write/TestMemoryWrite.py lldb-api :: commands/process/attach-resume/TestAttachResume.py lldb-api :: commands/process/attach/TestProcessAttach.py lldb-api :: commands/process/continue_to_bkpt/TestContinueToBkpts.py lldb-api :: commands/process/handle/TestProcessHandle.py lldb-api :: commands/process/launch-with-shellexpand/TestLaunchWithShellExpand.py lldb-api :: commands/process/launch/TestProcessLaunch.py lldb-api :: commands/process/signal/TestProcessSignal.py lldb-api :: commands/settings/TestSettings.py lldb-api :: commands/source/info/TestSourceInfo.py lldb-api :: commands/statistics/basic/TestStats.py lldb-api :: commands/target/basic/TestTargetCommand.py lldb-api :: commands/target/dump-pcm-info/TestDumpPCMInfo.py lldb-api :: commands/target/dump/TestTargetDumpTypeSystem.py lldb-api :: commands/target/stop-hooks/TestStopHookScripted.py lldb-api :: commands/target/stop-hooks/TestStopHooks.py lldb-api :: commands/thread/backtrace/TestThreadBacktraceRepeat.py lldb-api :: commands/thread/select/TestThreadSelect.py lldb-api :: functionalities/archives/TestBSDArchives.py lldb-api :: functionalities/avoids-fd-leak/TestFdLeak.py lldb-api :: functionalities/breakpoint/address_breakpoints/TestAddressBreakpoints.py lldb-api :: functionalities/breakpoint/address_breakpoints/TestBadAddressBreakpoints.py lldb-api :: functionalities/breakpoint/auto_continue/TestBreakpointAutoContinue.py lldb-api :: functionalities/breakpoint/break_in_loaded_dylib/TestBreakInLoadedDylib.py lldb-api :: functionalities/breakpoint/breakpoint_by_file_colon_line/TestBreakpointByFileColonLine.py lldb-api :: functionalities/breakpoint/breakpoint_by_line_and_column/TestBreakpointByLineAndColumn.py lldb-api :: functionalities/breakpoint/breakpoint_command/TestBreakpointCommand.py lldb-api :: functionalities/breakpoint/breakpoint_command/TestBreakpointCommandsFromPython.py lldb-api :: functionalities/breakpoint/breakpoint_command/TestRegexpBreakCommand.py lldb-api :: functionalities/breakpoint/breakpoint_conditions/TestBreakpointConditions.py lldb-api :: functionalities/breakpoint/breakpoint_ids/TestBreakpointIDs.py lldb-api :: functionalities/breakpoint/breakpoint_ignore_count/TestBreakpointIgnoreCount.py lldb-api :: functionalities/breakpoint/breakpoint_language/TestBreakpointLanguage.py lldb-api :: functionalities/breakpoint/breakpoint_locations/TestBreakpointLocations.py lldb-api :: functionalities/breakpoint/breakpoint_on_lambda_capture/TestBreakOnLambdaCapture.py lldb-api :: functionalities/breakpoint/breakpoint_on_overload/TestBreakOnOverload.py lldb-api :: functionalities/breakpoint/breakpoint_options/TestBreakpointOptions.py lldb-api :: functionalities/breakpoint/breakpoint_set_restart/TestBreakpointSetRestart.py lldb-api :: functionalities/breakpoint/comp_dir_symlink/TestCompDirSymLink.py lldb-api :: functionalities/breakpoint/consecutive_breakpoints/TestConsecutiveBreakpoints.py lldb-api :: functionalities/breakpoint/cpp/TestCPPBreakpointLocations.py lldb-api :: functionalities/breakpoint/dummy_target_breakpoints/TestBreakpointsWithNoTargets.py lldb-api :: functionalities/breakpoint/global_constructor/TestBreakpointInGlobalConstructor.py lldb-api :: functionalities/breakpoint/inlined_breakpoints/TestInlinedBreakpoints.py lldb-api :: functionalities/breakpoint/move_nearest/TestMoveNearest.py lldb-api :: functionalities/breakpoint/scripted_bkpt/TestScriptedResolver.py lldb-api :: functionalities/breakpoint/source_regexp/TestSourceRegexBreakpoints.py lldb-api :: functionalities/breakpoint/two_hits_one_actual/TestTwoHitsOneActual.py lldb-api :: functionalities/completion/TestCompletion.py lldb-api :: functionalities/conditional_break/TestConditionalBreak.py lldb-api :: functionalities/data-formatter/array_typedef/TestArrayTypedef.py lldb-api :: functionalities/data-formatter/boolreference/TestFormattersBoolRefPtr.py lldb-api :: functionalities/data-formatter/builtin-formats/TestBuiltinFormats.py lldb-api :: functionalities/data-formatter/compactvectors/TestCompactVectors.py lldb-api :: functionalities/data-formatter/cstring-utf8-summary/TestCstringUnicode.py lldb-api :: functionalities/data-formatter/data-formatter-advanced/TestDataFormatterAdv.py lldb-api :: functionalities/data-formatter/data-formatter-caching/TestDataFormatterCaching.py lldb-api :: functionalities/data-formatter/data-formatter-categories/TestDataFormatterCategories.py lldb-api :: functionalities/data-formatter/data-formatter-cpp/TestDataFormatterCpp.py lldb-api :: functionalities/data-formatter/data-formatter-disabling/TestDataFormatterDisabling.py lldb-api :: functionalities/data-formatter/data-formatter-enum-format/TestDataFormatterEnumFormat.py lldb-api :: functionalities/data-formatter/data-formatter-globals/TestDataFormatterGlobals.py lldb-api :: functionalities/data-formatter/data-formatter-named-summaries/TestDataFormatterNamedSummaries.py lldb-api :: functionalities/data-formatter/data-formatter-objc/TestDataFormatterObjCCF.py lldb-api :: functionalities/data-formatter/data-formatter-objc/TestDataFormatterObjCExpr.py lldb-api :: functionalities/data-formatter/data-formatter-objc/TestDataFormatterObjCKVO.py lldb-api :: functionalities/data-formatter/data-formatter-objc/TestDataFormatterObjCNSBundle.py lldb-api :: functionalities/data-formatter/data-formatter-objc/TestDataFormatterObjCNSContainer.py lldb-api :: functionalities/data-formatter/data-formatter-objc/TestDataFormatterObjCNSData.py lldb-api :: functionalities/data-formatter/data-formatter-objc/TestDataFormatterObjCNSDate.py lldb-api :: functionalities/data-formatter/data-formatter-objc/TestDataFormatterObjCNSError.py lldb-api :: functionalities/data-formatter/data-formatter-objc/TestDataFormatterObjCNSNumber.py lldb-api :: functionalities/data-formatter/data-formatter-objc/TestDataFormatterObjCNSURL.py lldb-api :: functionalities/data-formatter/data-formatter-objc/TestDataFormatterObjCPlain.py lldb-api :: functionalities/data-formatter/data-formatter-objc/TestDataFormatterObjNSException.py lldb-api :: functionalities/data-formatter/data-formatter-objc/cmtime/TestDataFormatterCMTime.py lldb-api :: functionalities/data-formatter/data-formatter-objc/nsindexpath/TestDataFormatterNSIndexPath.py lldb-api :: functionalities/data-formatter/data-formatter-objc/nsstring/TestDataFormatterNSString.py lldb-api :: functionalities/data-formatter/data-formatter-proper-plurals/TestFormattersOneIsSingular.py lldb-api :: functionalities/data-formatter/data-formatter-ptr-to-array/TestPtrToArrayFormatting.py lldb-api :: functionalities/data-formatter/data-formatter-python-synth/TestDataFormatterPythonSynth.py lldb-api :: functionalities/data-formatter/data-formatter-script/TestDataFormatterScript.py lldb-api :: functionalities/data-formatter/data-formatter-skip-summary/TestDataFormatterSkipSummary.py lldb-api :: functionalities/data-formatter/data-formatter-smart-array/TestDataFormatterSmartArray.py lldb-api :: functionalities/data-formatter/data-formatter-stl/generic/bitset/TestDataFormatterGenericBitset.py lldb-api :: functionalities/data-formatter/data-formatter-stl/generic/deque/TestDataFormatterGenericDeque.py lldb-api :: functionalities/data-formatter/data-formatter-stl/generic/forward_list/TestDataFormatterGenericForwardList.py lldb-api :: functionalities/data-formatter/data-formatter-stl/generic/list/TestDataFormatterGenericList.py lldb-api :: functionalities/data-formatter/data-formatter-stl/generic/list/loop/TestDataFormatterGenericListLoop.py lldb-api :: functionalities/data-formatter/data-formatter-stl/generic/multimap/TestDataFormatterGenericMultiMap.py lldb-api :: functionalities/data-formatter/data-formatter-stl/generic/multiset/TestDataFormatterGenericMultiSet.py lldb-api :: functionalities/data-formatter/data-formatter-stl/generic/optional/TestDataFormatterGenericOptional.py lldb-api :: functionalities/data-formatter/data-formatter-stl/generic/set/TestDataFormatterGenericSet.py lldb-api :: functionalities/data-formatter/data-formatter-stl/generic/unordered/TestDataFormatterGenericUnordered.py lldb-api :: functionalities/data-formatter/data-formatter-stl/libcxx/atomic/TestLibCxxAtomic.py lldb-api :: functionalities/data-formatter/data-formatter-stl/libcxx/function/TestLibCxxFunction.py lldb-api :: functionalities/data-formatter/data-formatter-stl/libcxx/initializerlist/TestInitializerList.py lldb-api :: functionalities/data-formatter/data-formatter-stl/libcxx/iterator/TestDataFormatterLibccIterator.py lldb-api :: functionalities/data-formatter/data-formatter-stl/libcxx/map/TestDataFormatterLibccMap.py lldb-api :: functionalities/data-formatter/data-formatter-stl/libcxx/queue/TestDataFormatterLibcxxQueue.py lldb-api :: functionalities/data-formatter/data-formatter-stl/libcxx/shared_ptr/TestDataFormatterLibcxxSharedPtr.py lldb-api :: functionalities/data-formatter/data-formatter-stl/libcxx/span/TestDataFormatterLibcxxSpan.py lldb-api :: functionalities/data-formatter/data-formatter-stl/libcxx/string/TestDataFormatterLibcxxString.py lldb-api :: functionalities/data-formatter/data-formatter-stl/libcxx/string/simulator/TestDataFormatterLibcxxStringSimulator.py lldb-api :: functionalities/data-formatter/data-formatter-stl/libcxx/string_view/TestDataFormatterLibcxxStringView.py lldb-api :: functionalities/data-formatter/data-formatter-stl/libcxx/tuple/TestDataFormatterLibcxxTuple.py lldb-api :: functionalities/data-formatter/data-formatter-stl/libcxx/unique_ptr/TestDataFormatterLibcxxUniquePtr.py lldb-api :: functionalities/data-formatter/data-formatter-stl/libcxx/unordered_map/TestDataFormatterLibccUnorderedMap.py lldb-api :: functionalities/data-formatter/data-formatter-stl/libcxx/variant/TestDataFormatterLibcxxVariant.py lldb-api :: functionalities/data-formatter/data-formatter-stl/libcxx/vbool/TestDataFormatterLibcxxVBool.py lldb-api :: functionalities/data-formatter/data-formatter-stl/libcxx/vector/TestDataFormatterLibcxxVector.py lldb-api :: functionalities/data-formatter/data-formatter-stl/libstdcpp/unique_ptr/invalid/TestDataFormatterInvalidStdUniquePtr.py lldb-api :: functionalities/data-formatter/data-formatter-synth/TestDataFormatterSynth.py lldb-api :: functionalities/data-formatter/data-formatter-synthtype/TestDataFormatterSynthType.py lldb-api :: functionalities/data-formatter/data-formatter-synthval/TestDataFormatterSynthVal.py lldb-api :: functionalities/data-formatter/dump_dynamic/TestDumpDynamic.py lldb-api :: functionalities/data-formatter/format-propagation/TestFormatPropagation.py lldb-api :: functionalities/data-formatter/frameformat_smallstruct/TestFrameFormatSmallStruct.py lldb-api :: functionalities/data-formatter/hexcaps/TestDataFormatterHexCaps.py lldb-api :: functionalities/data-formatter/language_category_updates/TestDataFormatterLanguageCategoryUpdates.py lldb-api :: functionalities/data-formatter/nsarraysynth/TestNSArraySynthetic.py lldb-api :: functionalities/data-formatter/nsdictionarysynth/TestNSDictionarySynthetic.py lldb-api :: functionalities/data-formatter/nssetsynth/TestNSSetSynthetic.py lldb-api :: functionalities/data-formatter/ostypeformatting/TestFormattersOsType.py lldb-api :: functionalities/data-formatter/parray/TestPrintArray.py lldb-api :: functionalities/data-formatter/poarray/TestPrintObjectArray.py lldb-api :: functionalities/data-formatter/ptr_ref_typedef/TestPtrRef2Typedef.py lldb-api :: functionalities/data-formatter/pyobjsynthprovider/TestPyObjSynthProvider.py lldb-api :: functionalities/data-formatter/refpointer-recursion/TestDataFormatterRefPtrRecursion.py lldb-api :: functionalities/data-formatter/setvaluefromcstring/TestSetValueFromCString.py lldb-api :: functionalities/data-formatter/stringprinter/TestStringPrinter.py lldb-api :: functionalities/data-formatter/summary-string-onfail/Test-rdar-9974002.py lldb-api :: functionalities/data-formatter/synthcapping/TestSyntheticCapping.py lldb-api :: functionalities/data-formatter/synthupdate/TestSyntheticFilterRecompute.py lldb-api :: functionalities/data-formatter/type_summary_list_script/TestTypeSummaryListScript.py lldb-api :: functionalities/data-formatter/typedef_array/TestTypedefArray.py lldb-api :: functionalities/data-formatter/user-format-vs-summary/TestUserFormatVsSummary.py lldb-api :: functionalities/data-formatter/var-in-aggregate-misuse/TestVarInAggregateMisuse.py lldb-api :: functionalities/data-formatter/varscript_formatting/TestDataFormatterVarScriptFormatting.py lldb-api :: functionalities/data-formatter/vector-types/TestVectorTypesFormatting.py lldb-api :: functionalities/dead-strip/TestDeadStrip.py lldb-api :: functionalities/dlopen_other_executable/TestDlopenOtherExecutable.py lldb-api :: functionalities/dynamic_value_child_count/TestDynamicValueChildCount.py lldb-api :: functionalities/exec/TestExec.py lldb-api :: functionalities/find-line-entry/TestFindLineEntry.py lldb-api :: functionalities/float-display/TestFloatDisplay.py lldb-api :: functionalities/inferior-assert/TestInferiorAssert.py lldb-api :: functionalities/inferior-changed/TestInferiorChanged.py lldb-api :: functionalities/inferior-crashing/TestInferiorCrashing.py lldb-api :: functionalities/inferior-crashing/TestInferiorCrashingStep.py lldb-api :: functionalities/inferior-crashing/recursive-inferior/TestRecursiveInferior.py lldb-api :: functionalities/inferior-crashing/recursive-inferior/TestRecursiveInferiorStep.py lldb-api :: functionalities/inline-stepping/TestInlineStepping.py lldb-api :: functionalities/lazy-loading/TestLazyLoading.py lldb-api :: functionalities/limit-debug-info/TestLimitDebugInfo.py lldb-api :: functionalities/load_after_attach/TestLoadAfterAttach.py lldb-api :: functionalities/load_lazy/TestLoadUsingLazyBind.py lldb-api :: functionalities/load_unload/TestLoadUnload.py lldb-api :: functionalities/load_using_paths/TestLoadUsingPaths.py lldb-api :: functionalities/location-list-lookup/TestLocationListLookup.py lldb-api :: functionalities/memory-region/TestMemoryRegion.py lldb-api :: functionalities/memory/cache/TestMemoryCache.py lldb-api :: functionalities/memory/find/TestMemoryFind.py lldb-api :: functionalities/memory/tag/TestMemoryTag.py lldb-api :: functionalities/non-overlapping-index-variable-i/TestIndexVariable.py lldb-api :: functionalities/optimized_code/TestNoASanExceptionAfterEvalOP_piece.py lldb-api :: functionalities/param_entry_vals/basic_entry_values/TestBasicEntryValues.py lldb-api :: functionalities/plugins/python_os_plugin/TestPythonOSPlugin.py lldb-api :: functionalities/plugins/python_os_plugin/stepping_plugin_threads/TestOSPluginStepping.py lldb-api :: functionalities/pointer_num_children/TestPointerNumChildren.py lldb-api :: functionalities/process_crash_info/TestProcessCrashInfo.py lldb-api :: functionalities/process_group/TestChangeProcessGroup.py lldb-api :: functionalities/progress_reporting/TestProgressReporting.py lldb-api :: functionalities/ptr_refs/TestPtrRefs.py lldb-api :: functionalities/recursion/TestValueObjectRecursion.py lldb-api :: functionalities/rerun/TestRerun.py lldb-api :: functionalities/return-value/TestReturnValue.py lldb-api :: functionalities/scripted_process/TestStackCoreScriptedProcess.py lldb-api :: functionalities/set-data/TestSetData.py lldb-api :: functionalities/signal/TestSendSignal.py lldb-api :: functionalities/signal/handle-abrt/TestHandleAbort.py lldb-api :: functionalities/step-avoids-no-debug/TestStepNoDebug.py lldb-api :: functionalities/step-vrs-interrupt/TestStepVrsInterruptTimeout.py lldb-api :: functionalities/step_scripted/TestStepScripted.py lldb-api :: functionalities/stop-on-sharedlibrary-load/TestStopOnSharedlibraryEvents.py lldb-api :: functionalities/tail_call_frames/ambiguous_tail_call_seq1/TestAmbiguousTailCallSeq1.py lldb-api :: functionalities/tail_call_frames/ambiguous_tail_call_seq2/TestAmbiguousTailCallSeq2.py lldb-api :: functionalities/tail_call_frames/cross_dso/TestCrossDSOTailCalls.py lldb-api :: functionalities/tail_call_frames/cross_object/TestCrossObjectTailCalls.py lldb-api :: functionalities/tail_call_frames/disambiguate_call_site/TestDisambiguateCallSite.py lldb-api :: functionalities/tail_call_frames/disambiguate_paths_to_common_sink/TestDisambiguatePathsToCommonSink.py lldb-api :: functionalities/tail_call_frames/disambiguate_tail_call_seq/TestDisambiguateTailCallSeq.py lldb-api :: functionalities/tail_call_frames/inlining_and_tail_calls/TestInliningAndTailCalls.py lldb-api :: functionalities/tail_call_frames/sbapi_support/TestTailCallFrameSBAPI.py lldb-api :: functionalities/tail_call_frames/thread_step_out_message/TestArtificialFrameStepOutMessage.py lldb-api :: functionalities/tail_call_frames/thread_step_out_or_return/TestSteppingOutWithArtificialFrames.py lldb-api :: functionalities/tail_call_frames/unambiguous_sequence/TestUnambiguousTailCalls.py lldb-api :: functionalities/target_var/TestTargetVar.py lldb-api :: functionalities/thread/backtrace_limit/TestBacktraceLimit.py lldb-api :: functionalities/thread/concurrent_events/TestConcurrentBreakpointDelayBreakpointOneSignal.py lldb-api :: functionalities/thread/concurrent_events/TestConcurrentBreakpointOneDelayBreakpointThreads.py lldb-api :: functionalities/thread/concurrent_events/TestConcurrentCrashWithBreak.py lldb-api :: functionalities/thread/concurrent_events/TestConcurrentCrashWithSignal.py lldb-api :: functionalities/thread/concurrent_events/TestConcurrentDelaySignalBreak.py lldb-api :: functionalities/thread/concurrent_events/TestConcurrentDelayedCrashWithBreakpointSignal.py lldb-api :: functionalities/thread/concurrent_events/TestConcurrentManyBreakpoints.py lldb-api :: functionalities/thread/concurrent_events/TestConcurrentManyCrash.py lldb-api :: functionalities/thread/concurrent_events/TestConcurrentSignalBreak.py lldb-api :: functionalities/thread/concurrent_events/TestConcurrentSignalDelayBreak.py lldb-api :: functionalities/thread/concurrent_events/TestConcurrentTwoBreakpointThreads.py lldb-api :: functionalities/thread/concurrent_events/TestConcurrentTwoBreakpointsOneDelaySignal.py lldb-api :: functionalities/thread/concurrent_events/TestConcurrentTwoBreakpointsOneSignal.py lldb-api :: functionalities/thread/crash_during_step/TestCrashDuringStep.py lldb-api :: functionalities/thread/create_after_attach/TestCreateAfterAttach.py lldb-api :: functionalities/thread/exit_during_break/TestExitDuringBreak.py lldb-api :: functionalities/thread/exit_during_expression/TestExitDuringExpression.py lldb-api :: functionalities/thread/exit_during_step/TestExitDuringStep.py lldb-api :: functionalities/thread/ignore_suspended/TestIgnoreSuspendedThread.py lldb-api :: functionalities/thread/jump/TestThreadJump.py lldb-api :: functionalities/thread/num_threads/TestNumThreads.py lldb-api :: functionalities/thread/state_after_expression/TestStateAfterExpression.py lldb-api :: functionalities/thread/step_out/TestThreadStepOut.py lldb-api :: functionalities/thread/step_until/TestStepUntil.py lldb-api :: functionalities/thread/thread_exit/TestThreadExit.py lldb-api :: functionalities/thread/thread_specific_break/TestThreadSpecificBreakpoint.py lldb-api :: functionalities/thread_plan/TestThreadPlanCommands.py lldb-api :: functionalities/type_get_module/TestTypeGetModule.py lldb-api :: functionalities/type_lookup/TestTypeLookup.py lldb-api :: functionalities/unused-inlined-parameters/TestUnusedInlinedParameters.py lldb-api :: functionalities/unwind/noreturn/TestNoreturnUnwind.py lldb-api :: functionalities/unwind/sigtramp/TestSigtrampUnwind.py lldb-api :: functionalities/unwind/zeroth_frame/TestZerothFrame.py lldb-api :: functionalities/value_md5_crash/TestValueMD5Crash.py lldb-api :: functionalities/var_path/TestVarPath.py lldb-api :: lang/c/anonymous/TestAnonymous.py lldb-api :: lang/c/array_types/TestArrayTypes.py lldb-api :: lang/c/bitfields/TestBitfields.py lldb-api :: lang/c/blocks/TestBlocks.py lldb-api :: lang/c/calling-conventions/TestCCallingConventions.py lldb-api :: lang/c/complex/TestComplexC99.py lldb-api :: lang/c/complex_int/TestComplexInt.py lldb-api :: lang/c/conflicting-symbol/TestConflictingSymbol.py lldb-api :: lang/c/const_variables/TestConstVariables.py lldb-api :: lang/c/cpp_keyword_identifiers/TestCppKeywordsAsCIdentifiers.py lldb-api :: lang/c/enum_types/TestEnumTypes.py lldb-api :: lang/c/flexible-array-members/TestCFlexibleArrayMembers.py lldb-api :: lang/c/forward/TestForwardDeclaration.py lldb-api :: lang/c/function_types/TestFunctionTypes.py lldb-api :: lang/c/global_variables/TestGlobalVariables.py lldb-api :: lang/c/inlines/TestRedefinitionsInInlines.py lldb-api :: lang/c/local_variables/TestLocalVariables.py lldb-api :: lang/c/modules/TestCModules.py lldb-api :: lang/c/offsetof/TestOffsetof.py lldb-api :: lang/c/register_variables/TestRegisterVariables.py lldb-api :: lang/c/set_values/TestSetValues.py lldb-api :: lang/c/shared_lib/TestSharedLib.py lldb-api :: lang/c/shared_lib_stripped_symbols/TestSharedLibStrippedSymbols.py lldb-api :: lang/c/sizeof/TestCSizeof.py lldb-api :: lang/c/step-target/TestStepTarget.py lldb-api :: lang/c/step_over_no_deadlock/TestStepOverDoesntBlock.py lldb-api :: lang/c/stepping/TestStepAndBreakpoints.py lldb-api :: lang/c/stepping/TestThreadStepInAvoidRegexp.py lldb-api :: lang/c/stepping/TestThreadStepping.py lldb-api :: lang/c/strings/TestCStrings.py lldb-api :: lang/c/struct_types/TestStructTypes.py lldb-api :: lang/c/tls_globals/TestTlsGlobals.py lldb-api :: lang/c/unicode/TestUnicodeSymbols.py lldb-api :: lang/c/unions/TestUnionMembers.py lldb-api :: lang/c/vla/TestVLA.py lldb-api :: lang/cpp/accelerator-table/TestCPPAccelerator.py lldb-api :: lang/cpp/alignas_base_class/TestAlignAsBaseClass.py lldb-api :: lang/cpp/auto/TestCPPAuto.py lldb-api :: lang/cpp/bitfields/TestCppBitfields.py lldb-api :: lang/cpp/bool/TestCPPBool.py lldb-api :: lang/cpp/break-on-initializers/TestBreakOnCPP11Initializers.py lldb-api :: lang/cpp/breakpoint-commands/TestCPPBreakpointCommands.py lldb-api :: lang/cpp/call-function/TestCallCPPFunction.py lldb-api :: lang/cpp/chained-calls/TestCppChainedCalls.py lldb-api :: lang/cpp/char8_t/TestCxxChar8_t.py lldb-api :: lang/cpp/class-loading-via-member-typedef/TestClassLoadingViaMemberTypedef.py lldb-api :: lang/cpp/class-template-non-type-parameter-pack/TestClassTemplateNonTypeParameterPack.py lldb-api :: lang/cpp/class-template-parameter-pack/TestClassTemplateParameterPack.py lldb-api :: lang/cpp/class-template-type-parameter-pack/TestClassTemplateTypeParameterPack.py lldb-api :: lang/cpp/class_static/TestStaticVariables.py lldb-api :: lang/cpp/class_types/TestClassTypes.py lldb-api :: lang/cpp/class_types/TestClassTypesDisassembly.py lldb-api :: lang/cpp/complete-type-check/TestCppIsTypeComplete.py lldb-api :: lang/cpp/const_static_integral_member/TestConstStaticIntegralMember.py lldb-api :: lang/cpp/const_static_integral_member_int128/TestConstStaticIntegralMemberInt128.py lldb-api :: lang/cpp/const_this/TestConstThis.py lldb-api :: lang/cpp/constructors/TestCppConstructors.py lldb-api :: lang/cpp/covariant-return-types/TestCovariantReturnTypes.py lldb-api :: lang/cpp/crtp/TestCppCRTP.py lldb-api :: lang/cpp/default-template-args/TestDefaultTemplateArgs.py lldb-api :: lang/cpp/dereferencing_references/TestCPPDereferencingReferences.py lldb-api :: lang/cpp/diamond/TestCppDiamond.py lldb-api :: lang/cpp/dynamic-value-same-basename/TestDynamicValueSameBase.py lldb-api :: lang/cpp/dynamic-value/TestCppValueCast.py lldb-api :: lang/cpp/dynamic-value/TestDynamicValue.py lldb-api :: lang/cpp/enum_types/TestCPP11EnumTypes.py lldb-api :: lang/cpp/exceptions/TestCPPExceptionBreakpoints.py lldb-api :: lang/cpp/extern_c/TestExternCSymbols.py lldb-api :: lang/cpp/forward-declared-template-specialization/TestCppForwardDeclaredTemplateSpecialization.py lldb-api :: lang/cpp/frame-var-anon-unions/TestFrameVariableAnonymousUnions.py lldb-api :: lang/cpp/function-local-class/TestCppFunctionLocalClass.py lldb-api :: lang/cpp/function-qualifiers/TestCppFunctionQualifiers.py lldb-api :: lang/cpp/function_refs/TestFunctionRefs.py lldb-api :: lang/cpp/global_operators/TestCppGlobalOperators.py lldb-api :: lang/cpp/global_variables/TestCPPGlobalVariables.py lldb-api :: lang/cpp/gmodules-templates/TestGModules.py lldb-api :: lang/cpp/incompatible-class-templates/TestCppIncompatibleClassTemplates.py lldb-api :: lang/cpp/incomplete-types/TestCppIncompleteTypes.py lldb-api :: lang/cpp/incomplete-types/members/TestCppIncompleteTypeMembers.py lldb-api :: lang/cpp/inlines/TestInlines.py lldb-api :: lang/cpp/lambdas/TestLambdas.py lldb-api :: lang/cpp/llvm-style/TestLLVMStyle.py lldb-api :: lang/cpp/member-and-local-vars-with-same-name/TestMembersAndLocalsWithSameName.py lldb-api :: lang/cpp/modules-import/TestCXXModulesImport.py lldb-api :: lang/cpp/multiple-inheritance/TestCppMultipleInheritance.py lldb-api :: lang/cpp/namespace/TestNamespace.py lldb-api :: lang/cpp/namespace/TestNamespaceLookup.py lldb-api :: lang/cpp/namespace_conflicts/TestNamespaceConflicts.py lldb-api :: lang/cpp/namespace_definitions/TestNamespaceDefinitions.py lldb-api :: lang/cpp/nested-class-other-compilation-unit/TestNestedClassWithParentInAnotherCU.py lldb-api :: lang/cpp/non-type-template-param/TestCppNonTypeTemplateParam.py lldb-api :: lang/cpp/nsimport/TestCppNsImport.py lldb-api :: lang/cpp/offsetof/TestOffsetofCpp.py lldb-api :: lang/cpp/operator-overload/TestOperatorOverload.py lldb-api :: lang/cpp/operators/TestCppOperators.py lldb-api :: lang/cpp/overloaded-functions/TestOverloadedFunctions.py lldb-api :: lang/cpp/pointer_to_member_type_depending_on_parent_size/TestPointerToMemberTypeDependingOnParentSize.py lldb-api :: lang/cpp/printf/TestPrintf.py lldb-api :: lang/cpp/rvalue-references/TestRvalueReferences.py lldb-api :: lang/cpp/scope/TestCppScope.py lldb-api :: lang/cpp/scratch-context-merging/structs/TestCppScratchContextMergingStructs.py lldb-api :: lang/cpp/signed_types/TestSignedTypes.py lldb-api :: lang/cpp/sizeof/TestCPPSizeof.py lldb-api :: lang/cpp/static_member_type_depending_on_parent_size/TestStaticMemberTypeDependingOnParentSize.py lldb-api :: lang/cpp/static_members/TestCPPStaticMembers.py lldb-api :: lang/cpp/static_methods/TestCPPStaticMethods.py lldb-api :: lang/cpp/std-function-step-into-callable/TestStdFunctionStepIntoCallable.py lldb-api :: lang/cpp/step-through-trampoline/TestStepThroughTrampoline.py lldb-api :: lang/cpp/stl/TestSTL.py lldb-api :: lang/cpp/stl/TestStdCXXDisassembly.py lldb-api :: lang/cpp/struct_with_keyword_name/TestStructWithKeywordName.py lldb-api :: lang/cpp/structured-binding/TestStructuredBinding.py lldb-api :: lang/cpp/symbols/TestSymbols.py lldb-api :: lang/cpp/template-arguments/TestCppTemplateArguments.py lldb-api :: lang/cpp/template-function/TestTemplateFunctions.py lldb-api :: lang/cpp/template-specialization-type/TestTemplateSpecializationType.py lldb-api :: lang/cpp/template/TestTemplateArgs.py lldb-api :: lang/cpp/this/TestCPPThis.py lldb-api :: lang/cpp/this_class_type_mixing/TestThisClassTypeMixing.py lldb-api :: lang/cpp/thread_local/TestThreadLocal.py lldb-api :: lang/cpp/trivial_abi/TestTrivialABI.py lldb-api :: lang/cpp/type_lookup/TestCppTypeLookup.py lldb-api :: lang/cpp/typedef/TestCppTypedef.py lldb-api :: lang/cpp/unique-types/TestUniqueTypes.py lldb-api :: lang/cpp/unsigned_types/TestUnsignedTypes.py lldb-api :: lang/cpp/virtual-functions/TestCppVirtualFunctions.py lldb-api :: lang/cpp/virtual-overload/TestVirtualOverload.py lldb-api :: lang/mixed/TestMixedLanguages.py lldb-api :: lang/objc/bitfield_ivars/TestBitfieldIvars.py lldb-api :: lang/objc/blocks/TestObjCIvarsInBlocks.py lldb-api :: lang/objc/complete-type-check/TestObjCIsTypeComplete.py lldb-api :: lang/objc/conflicting-definition/TestConflictingDefinition.py lldb-api :: lang/objc/cpp_keyword_identifiers/TestCppKeywordsAsObjCIdentifiers.py lldb-api :: lang/objc/direct-dispatch-step/TestObjCDirectDispatchStepping.py lldb-api :: lang/objc/exceptions/TestObjCExceptions.py lldb-api :: lang/objc/forward-decl/TestForwardDecl.py lldb-api :: lang/objc/foundation/TestConstStrings.py lldb-api :: lang/objc/foundation/TestObjCMethods.py lldb-api :: lang/objc/foundation/TestObjCMethods2.py lldb-api :: lang/objc/foundation/TestObjCMethodsNSArray.py lldb-api :: lang/objc/foundation/TestObjCMethodsNSError.py lldb-api :: lang/objc/foundation/TestObjCMethodsString.py lldb-api :: lang/objc/foundation/TestObjectDescriptionAPI.py lldb-api :: lang/objc/foundation/TestRuntimeTypes.py lldb-api :: lang/objc/global_ptrs/TestGlobalObjects.py lldb-api :: lang/objc/hidden-ivars/TestHiddenIvars.py lldb-api :: lang/objc/ivar-IMP/TestObjCiVarIMP.py lldb-api :: lang/objc/modules-auto-import/TestModulesAutoImport.py lldb-api :: lang/objc/modules-cache/TestClangModulesCache.py lldb-api :: lang/objc/modules-compile-error/TestModulesCompileError.py lldb-api :: lang/objc/modules-inline-functions/TestModulesInlineFunctions.py lldb-api :: lang/objc/modules-non-objc-target/TestObjCModulesNonObjCTarget.py lldb-api :: lang/objc/modules-objc-property/TestModulesObjCProperty.py lldb-api :: lang/objc/modules/TestObjCModules.py lldb-api :: lang/objc/objc++/TestObjCXX.py lldb-api :: lang/objc/objc-baseclass-sbtype/TestObjCBaseClassSBType.py lldb-api :: lang/objc/objc-checker/TestObjCCheckers.py lldb-api :: lang/objc/objc-class-method/TestObjCClassMethod.py lldb-api :: lang/objc/objc-dyn-sbtype/TestObjCDynamicSBType.py lldb-api :: lang/objc/objc-foundation-dictionary-empty/TestNSDictionary0.py lldb-api :: lang/objc/objc-ivar-offsets/TestObjCIvarOffsets.py lldb-api :: lang/objc/objc-ivar-protocols/TestIvarProtocols.py lldb-api :: lang/objc/objc-ivar-stripped/TestObjCIvarStripped.py lldb-api :: lang/objc/objc-new-syntax/TestObjCNewSyntaxArray.py lldb-api :: lang/objc/objc-new-syntax/TestObjCNewSyntaxDictionary.py lldb-api :: lang/objc/objc-new-syntax/TestObjCNewSyntaxLiteral.py lldb-api :: lang/objc/objc-optimized/TestObjcOptimized.py lldb-api :: lang/objc/objc-property/TestObjCProperty.py lldb-api :: lang/objc/objc-runtime-ivars/TestRuntimeIvars.py lldb-api :: lang/objc/objc-static-method-stripped/TestObjCStaticMethodStripped.py lldb-api :: lang/objc/objc-static-method/TestObjCStaticMethod.py lldb-api :: lang/objc/objc-stepping/TestObjCStepping.py lldb-api :: lang/objc/objc-struct-argument/TestObjCStructArgument.py lldb-api :: lang/objc/objc-struct-return/TestObjCStructReturn.py lldb-api :: lang/objc/objc-super/TestObjCSuper.py lldb-api :: lang/objc/objc_direct-methods/TestObjCDirectMethods.py lldb-api :: lang/objc/orderedset/TestOrderedSet.py lldb-api :: lang/objc/print-obj/TestPrintObj.py lldb-api :: lang/objc/ptr_refs/TestPtrRefsObjC.py lldb-api :: lang/objc/radar-9691614/TestObjCMethodReturningBOOL.py lldb-api :: lang/objc/rdar-10967107/TestRdar10967107.py lldb-api :: lang/objc/rdar-11355592/TestRdar11355592.py lldb-api :: lang/objc/real-definition/TestRealDefinition.py lldb-api :: lang/objc/self/TestObjCSelf.py lldb-api :: lang/objc/single-entry-dictionary/TestObjCSingleEntryDictionary.py lldb-api :: lang/objc/tagged-pointer/TestTaggedPointerCmd.py lldb-api :: lang/objc/unicode-string/TestUnicodeString.py lldb-api :: lang/objc/variadic_methods/TestVariadicMethods.py lldb-api :: lang/objc/warnings-in-expr-parser/TestObjCWarningsInExprParser.py lldb-api :: lang/objcxx/class-name-clash/TestNameClash.py lldb-api :: lang/objcxx/conflicting-names-class-update-utility-expr/TestObjCConflictingNamesForClassUpdateExpr.py lldb-api :: lang/objcxx/hide-runtime-values/TestObjCXXHideRuntimeValues.py lldb-api :: lang/objcxx/objc-builtin-types/TestObjCBuiltinTypes.py lldb-api :: lang/objcxx/objcxx-ivar-vector/TestIvarVector.py lldb-api :: linux/builtin_trap/TestBuiltinTrap.py lldb-api :: lldbutil-tests/failed-to-hit-breakpoint/TestLLDBUtilFailedToHitBreakpoint.py lldb-api :: macosx/DBGSourcePathRemapping/TestDSYMSourcePathRemapping.py lldb-api :: macosx/add-dsym/TestAddDsymDownload.py lldb-api :: macosx/add-dsym/TestAddDsymMidExecutionCommand.py lldb-api :: macosx/builtin-debugtrap/TestBuiltinDebugTrap.py lldb-api :: macosx/duplicate-archive-members/TestDuplicateMembers.py lldb-api :: macosx/find-app-in-bundle/TestFindAppInBundle.py lldb-api :: macosx/find-dsym/bundle-with-dot-in-filename/TestBundleWithDotInFilename.py lldb-api :: macosx/find-dsym/deep-bundle/TestDeepBundle.py lldb-api :: macosx/ignore_exceptions/TestIgnoredExceptions.py lldb-api :: macosx/indirect_symbol/TestIndirectSymbols.py lldb-api :: macosx/macCatalyst/TestMacCatalyst.py lldb-api :: macosx/profile_vrs_detach/TestDetachVrsProfile.py lldb-api :: macosx/save_crashlog/TestSaveCrashlog.py lldb-api :: macosx/skinny-corefile/TestSkinnyCorefile.py lldb-api :: macosx/stack-corefile/TestStackCorefile.py lldb-api :: macosx/thread_suspend/TestInternalThreadSuspension.py lldb-api :: macosx/unregistered-macho/TestUnregisteredMacho.py lldb-api :: python_api/class_members/TestSBTypeClassMembers.py lldb-api :: python_api/compile_unit/TestCompileUnitAPI.py lldb-api :: python_api/exprpath_synthetic/TestExprPathSynthetic.py lldb-api :: python_api/findvalue_duplist/TestSBFrameFindValue.py lldb-api :: python_api/formatters/TestFormattersSBAPI.py lldb-api :: python_api/frame/TestFrames.py lldb-api :: python_api/frame/get-variables/TestGetVariables.py lldb-api :: python_api/frame/inlines/TestInlinedFrame.py lldb-api :: python_api/function_symbol/TestDisasmAPI.py lldb-api :: python_api/function_symbol/TestSymbolAPI.py lldb-api :: python_api/get-value-32bit-int/TestGetValue32BitInt.py lldb-api :: python_api/hello_world/TestHelloWorld.py lldb-api :: python_api/interpreter/TestCommandInterpreterAPI.py lldb-api :: python_api/lldbutil/frame/TestFrameUtils.py lldb-api :: python_api/lldbutil/process/TestPrintStackTraces.py lldb-api :: python_api/name_lookup/TestNameLookup.py lldb-api :: python_api/process/TestProcessAPI.py lldb-api :: python_api/process/io/TestProcessIO.py lldb-api :: python_api/process/read-mem-cstring/TestReadMemCString.py lldb-api :: python_api/sbdata/TestSBData.py lldb-api :: python_api/sbmodule/TestSBModule.py lldb-api :: python_api/sbtype_typeclass/TestSBTypeTypeClass.py lldb-api :: python_api/sbvalue_const_addrof/TestSBValueConstAddrOf.py lldb-api :: python_api/sbvalue_persist/TestSBValuePersist.py lldb-api :: python_api/symbol-context/TestSymbolContext.py lldb-api :: python_api/symbol-context/two-files/TestSymbolContextTwoFiles.py lldb-api :: python_api/target/TestTargetAPI.py lldb-api :: python_api/thread/TestThreadAPI.py lldb-api :: python_api/type/TestTypeList.py lldb-api :: python_api/value/TestValueAPI.py lldb-api :: python_api/value/change_values/TestChangeValueAPI.py lldb-api :: python_api/value/empty_class/TestValueAPIEmptyClass.py lldb-api :: python_api/value/linked_list/TestValueAPILinkedList.py lldb-api :: python_api/value_var_update/TestValueVarUpdate.py lldb-api :: sample_test/TestSampleInlineTest.py lldb-api :: sample_test/TestSampleTest.py lldb-api :: source-manager/TestSourceManager.py lldb-api :: symbol_ondemand/breakpoint_language/TestBreakpointLanguageOnDemand.py lldb-api :: symbol_ondemand/breakpoint_source_regex/TestSourceTextRegexBreakpoint.py lldb-api :: symbol_ondemand/shared_library/TestSharedLibOnDemand.py lldb-api :: tools/lldb-vscode/attach/TestVSCode_attach.py lldb-api :: tools/lldb-vscode/breakpoint-events/TestVSCode_breakpointEvents.py lldb-api :: tools/lldb-vscode/breakpoint/TestVSCode_logpoints.py lldb-api :: tools/lldb-vscode/breakpoint/TestVSCode_setBreakpoints.py lldb-api :: tools/lldb-vscode/console/TestVSCode_console.py lldb-api :: tools/lldb-vscode/console/TestVSCode_redirection_to_console.py lldb-api :: tools/lldb-vscode/correct-thread/TestVSCode_correct_thread.py lldb-api :: tools/lldb-vscode/launch/TestVSCode_launch.py lldb-api :: tools/lldb-vscode/module/TestVSCode_module.py lldb-api :: tools/lldb-vscode/optimized/TestVSCode_optimized.py lldb-api :: tools/lldb-vscode/stackTrace/TestVSCode_stackTrace.py lldb-api :: tools/lldb-vscode/step/TestVSCode_step.py lldb-api :: tools/lldb-vscode/variables/TestVSCode_variables.py lldb-api :: types/TestCharType.py lldb-api :: types/TestCharTypeExpr.py lldb-api :: types/TestDoubleTypes.py lldb-api :: types/TestDoubleTypesExpr.py lldb-api :: types/TestFloatTypes.py lldb-api :: types/TestFloatTypesExpr.py lldb-api :: types/TestIntegerType.py lldb-api :: types/TestIntegerTypeExpr.py lldb-api :: types/TestLongTypes.py lldb-api :: types/TestLongTypesExpr.py lldb-api :: types/TestRecursiveTypes.py lldb-api :: types/TestShortType.py lldb-api :: types/TestShortTypeExpr.py

Hide Details

Hide Details

Testing Time: 973.58s Unsupported : 362 Passed : 1603 Expectedly Failed: 10 Unresolved : 12 Timed Out : 3 Failed : 622 FAILED: tools/lldb/test/CMakeFiles/check-lldb /Users/buildslave/jenkins/workspace/lldb-cmake-matrix/lldb-build/tools/lldb/test/CMakeFiles/check-lldb cd /Users/buildslave/jenkins/workspace/lldb-cmake-matrix/lldb-build/tools/lldb/test && /Applications/Xcode.app/Contents/Developer/Library/Frameworks/Python3.framework/Versions/3.8/bin/python3.8 /Users/buildslave/jenkins/workspace/lldb-cmake-matrix/lldb-build/./bin/llvm-lit -v --time-tests --shuffle --xunit-xml-output=/Users/buildslave/jenkins/workspace/lldb-cmake-matrix/test/results.xml -v /Users/buildslave/jenkins/workspace/lldb-cmake-matrix/lldb-build/tools/lldb/test ninja: build stopped: subcommand failed. Command failed: Command '['/usr/bin/env', 'TERM=vt100', '/usr/local/bin/ninja', '-v', 'check-lldb']' returned non-zero exit status 1. Command: ['/usr/bin/env', 'TERM=vt100', '/usr/local/bin/ninja', '-v', 'check-lldb'] + set -e [Pipeline] } [Pipeline] // timeout [Pipeline] } [Pipeline] // stage [Pipeline] stage [Pipeline] { (Build Clang 5.0.2) [Pipeline] timeout Timeout set to expire in 30 min [Pipeline] { [Pipeline] dir Running in /Users/buildslave/jenkins/workspace/lldb-cmake-matrix/clang_502 [Pipeline] { [Pipeline] checkout The recommended git tool is: NONE No credentials specified Fetching changes from the remote Git repository > git rev-parse --resolve-git-dir /Users/buildslave/jenkins/workspace/lldb-cmake-matrix/clang_502/.git # timeout=10 > git config remote.origin.url http://labmaster3.local/git/llvm-project.git # timeout=10 Fetching upstream changes from http://labmaster3.local/git/llvm-project.git > git --version # timeout=10 > git --version # 'git version 2.24.3 (Apple Git-128)' > git fetch --tags --force --progress -- http://labmaster3.local/git/llvm-project.git +refs/heads/*:refs/remotes/origin/* # timeout=10 ERROR: Error fetching remote repo 'origin' hudson.plugins.git.GitException: Failed to fetch from http://labmaster3.local/git/llvm-project.git at hudson.plugins.git.GitSCM.fetchFrom(GitSCM.java:1004) at hudson.plugins.git.GitSCM.retrieveChanges(GitSCM.java:1245) at hudson.plugins.git.GitSCM.checkout(GitSCM.java:1305) at org.jenkinsci.plugins.workflow.steps.scm.SCMStep.checkout(SCMStep.java:129) at org.jenkinsci.plugins.workflow.steps.scm.SCMStep$StepExecutionImpl.run(SCMStep.java:97) at org.jenkinsci.plugins.workflow.steps.scm.SCMStep$StepExecutionImpl.run(SCMStep.java:84) at org.jenkinsci.plugins.workflow.steps.SynchronousNonBlockingStepExecution.lambda$start$0(SynchronousNonBlockingStepExecution.java:47) at java.util.concurrent.Executors$RunnableAdapter.call(Executors.java:511) at java.util.concurrent.FutureTask.run(FutureTask.java:266) at java.util.concurrent.ThreadPoolExecutor.runWorker(ThreadPoolExecutor.java:1149) at java.util.concurrent.ThreadPoolExecutor$Worker.run(ThreadPoolExecutor.java:624) at java.lang.Thread.run(Thread.java:748) Caused by: hudson.plugins.git.GitException: Command "git fetch --tags --force --progress -- http://labmaster3.local/git/llvm-project.git +refs/heads/*:refs/remotes/origin/*" returned status code 143: stdout: stderr: remote: Enumerating objects: 1 remote: Enumerating objects: 1711222 remote: Enumerating objects: 4184591 remote: Enumerating objects: 4515873 remote: Enumerating objects: 4530553 remote: Enumerating objects: 4554575 remote: Enumerating objects: 4583479 remote: Enumerating objects: 4604437 remote: Enumerating objects: 4624105 remote: Enumerating objects: 4644101 remote: Enumerating objects: 4673207 remote: Enumerating objects: 4693619 remote: Enumerating objects: 4711877 remote: Enumerating objects: 4731247 remote: Enumerating objects: 4750342 remote: Enumerating objects: 4768802 remote: Enumerating objects: 4789290 remote: Enumerating objects: 4809691 remote: Enumerating objects: 4829638 remote: Enumerating objects: 4851557 remote: Enumerating objects: 4870780 remote: Enumerating objects: 4889280 remote: Enumerating objects: 4908101 remote: Enumerating objects: 4926961 remote: Enumerating objects: 4946678 remote: Enumerating objects: 4975970, done. remote: Counting objects: 0% (1/4975970) remote: Counting objects: 0% (758/4975970) remote: Counting objects: 0% (3191/4975970) remote: Counting objects: 0% (5920/4975970) remote: Counting objects: 0% (8811/4975970) remote: Counting objects: 0% (11727/4975970) remote: Counting objects: 0% (14806/4975970) remote: Counting objects: 0% (17892/4975970) remote: Counting objects: 0% (21002/4975970) remote: Counting objects: 0% (24110/4975970) remote: Counting objects: 0% (27328/4975970) remote: Counting objects: 0% (30451/4975970) remote: Counting objects: 0% (33683/4975970) remote: Counting objects: 0% (36816/4975970) remote: Counting objects: 0% (40121/4975970) remote: Counting objects: 0% (43157/4975970) remote: Counting objects: 0% (45839/4975970) remote: Counting objects: 0% (46166/4975970) remote: Counting objects: 0% (47238/4975970) remote: Counting objects: 0% (48876/4975970) remote: Counting objects: 1% (49760/4975970) remote: Counting objects: 1% (51549/4975970) remote: Counting objects: 1% (54282/4975970) remote: Counting objects: 1% (57022/4975970) remote: Counting objects: 1% (59814/4975970) remote: Counting objects: 1% (62629/4975970) remote: Counting objects: 1% (65554/4975970) remote: Counting objects: 1% (68190/4975970) remote: Counting objects: 1% (70826/4975970) remote: Counting objects: 1% (73425/4975970) remote: Counting objects: 1% (76167/4975970) remote: Counting objects: 1% (78967/4975970) remote: Counting objects: 1% (81489/4975970) remote: Counting objects: 1% (83931/4975970) remote: Counting objects: 1% (86217/4975970) remote: Counting objects: 1% (88297/4975970) remote: Counting objects: 1% (90771/4975970) remote: Counting objects: 1% (92777/4975970) remote: Counting objects: 1% (94748/4975970) remote: Counting objects: 1% (95945/4975970) remote: Counting objects: 1% (98030/4975970) remote: Counting objects: 2% (99520/4975970) remote: Counting objects: 2% (100311/4975970) remote: Counting objects: 2% (102647/4975970) remote: Counting objects: 2% (104964/4975970) remote: Counting objects: 2% (107463/4975970) remote: Counting objects: 2% (109893/4975970) remote: Counting objects: 2% (112357/4975970) remote: Counting objects: 2% (114349/4975970) remote: Counting objects: 2% (116810/4975970) remote: Counting objects: 2% (119292/4975970) remote: Counting objects: 2% (121888/4975970) remote: Counting objects: 2% (124453/4975970) remote: Counting objects: 2% (126769/4975970) remote: Counting objects: 2% (129228/4975970) remote: Counting objects: 2% (131701/4975970) remote: Counting objects: 2% (134089/4975970) remote: Counting objects: 2% (136544/4975970) remote: Counting objects: 2% (139014/4975970) remote: Counting objects: 2% (141604/4975970) remote: Counting objects: 2% (144189/4975970) remote: Counting objects: 2% (146456/4975970) remote: Counting objects: 2% (148714/4975970) remote: Counting objects: 3% (149280/4975970) remote: Counting objects: 3% (150928/4975970) remote: Counting objects: 3% (153323/4975970) remote: Counting objects: 3% (154906/4975970) remote: Counting objects: 3% (156443/4975970) remote: Counting objects: 3% (157076/4975970) remote: Counting objects: 3% (158980/4975970) remote: Counting objects: 3% (161088/4975970) remote: Counting objects: 3% (163287/4975970) remote: Counting objects: 3% (165086/4975970) remote: Counting objects: 3% (166987/4975970) remote: Counting objects: 3% (168819/4975970) remote: Counting objects: 3% (170717/4975970) remote: Counting objects: 3% (172423/4975970) remote: Counting objects: 3% (174217/4975970) remote: Counting objects: 3% (176158/4975970) remote: Counting objects: 3% (177488/4975970) remote: Counting objects: 3% (179298/4975970) remote: Counting objects: 3% (180959/4975970) remote: Counting objects: 3% (182665/4975970) remote: Counting objects: 3% (184402/4975970) remote: Counting objects: 3% (186152/4975970) remote: Counting objects: 3% (189660/4975970) remote: Counting objects: 3% (193083/4975970) remote: Counting objects: 3% (196609/4975970) remote: Counting objects: 4% (199039/4975970) remote: Counting objects: 4% (199586/4975970) remote: Counting objects: 4% (201873/4975970) remote: Counting objects: 4% (203601/4975970) remote: Counting objects: 4% (204992/4975970) remote: Counting objects: 4% (206276/4975970) remote: Counting objects: 4% (207569/4975970) remote: Counting objects: 4% (208651/4975970) remote: Counting objects: 4% (208835/4975970) remote: Counting objects: 4% (210179/4975970) remote: Counting objects: 4% (211586/4975970) remote: Counting objects: 4% (213001/4975970) remote: Counting objects: 4% (214634/4975970) remote: Counting objects: 4% (216311/4975970) remote: Counting objects: 4% (217795/4975970) remote: Counting objects: 4% (219349/4975970) remote: Counting objects: 4% (220727/4975970) remote: Counting objects: 4% (221492/4975970) remote: Counting objects: 4% (222849/4975970) remote: Counting objects: 4% (224224/4975970) remote: Counting objects: 4% (225543/4975970) remote: Counting objects: 4% (226952/4975970) remote: Counting objects: 4% (228214/4975970) remote: Counting objects: 4% (229828/4975970) remote: Counting objects: 4% (231522/4975970) remote: Counting objects: 4% (233177/4975970) remote: Counting objects: 4% (234592/4975970) remote: Counting objects: 4% (236013/4975970) remote: Counting objects: 4% (237481/4975970) remote: Counting objects: 4% (238947/4975970) remote: Counting objects: 4% (241031/4975970) remote: Counting objects: 4% (244140/4975970) remote: Counting objects: 4% (247041/4975970) remote: Counting objects: 5% (248799/4975970) remote: Counting objects: 5% (249895/4975970) remote: Counting objects: 5% (252670/4975970) remote: Counting objects: 5% (255392/4975970) remote: Counting objects: 5% (258180/4975970) remote: Counting objects: 5% (260806/4975970) remote: Counting objects: 5% (263235/4975970) remote: Counting objects: 5% (264991/4975970) remote: Counting objects: 5% (265106/4975970) remote: Counting objects: 5% (265446/4975970) remote: Counting objects: 5% (266681/4975970) remote: Counting objects: 5% (268066/4975970) remote: Counting objects: 5% (269590/4975970) remote: Counting objects: 5% (271138/4975970) remote: Counting objects: 5% (272695/4975970) remote: Counting objects: 5% (274249/4975970) remote: Counting objects: 5% (275723/4975970) remote: Counting objects: 5% (277243/4975970) remote: Counting objects: 5% (278563/4975970) remote: Counting objects: 5% (279930/4975970) remote: Counting objects: 5% (281057/4975970) remote: Counting objects: 5% (282404/4975970) remote: Counting objects: 5% (283730/4975970) remote: Counting objects: 5% (285211/4975970) remote: Counting objects: 5% (286742/4975970) remote: Counting objects: 5% (288284/4975970) remote: Counting objects: 5% (289762/4975970) remote: Counting objects: 5% (291267/4975970) remote: Counting objects: 5% (292874/4975970) remote: Counting objects: 5% (295074/4975970) remote: Counting objects: 5% (297193/4975970) remote: Counting objects: 6% (298559/4975970) remote: Counting objects: 6% (299504/4975970) remote: Counting objects: 6% (301694/4975970) remote: Counting objects: 6% (303955/4975970) remote: Counting objects: 6% (306174/4975970) remote: Counting objects: 6% (308337/4975970) remote: Counting objects: 6% (310327/4975970) remote: Counting objects: 6% (312626/4975970) remote: Counting objects: 6% (315303/4975970) remote: Counting objects: 6% (317909/4975970) remote: Counting objects: 6% (320349/4975970) remote: Counting objects: 6% (347141/4975970) remote: Counting objects: 7% (348318/4975970) remote: Counting objects: 8% (398078/4975970) remote: Counting objects: 9% (447838/4975970) remote: Counting objects: 10% (497597/4975970) remote: Counting objects: 11% (547357/4975970) remote: Counting objects: 12% (597117/4975970) remote: Counting objects: 13% (646877/4975970) remote: Counting objects: 14% (696636/4975970) remote: Counting objects: 15% (746396/4975970) remote: Counting objects: 16% (796156/4975970) remote: Counting objects: 17% (845915/4975970) remote: Counting objects: 18% (895675/4975970) remote: Counting objects: 19% (945435/4975970) remote: Counting objects: 20% (995194/4975970) remote: Counting objects: 21% (1044954/4975970) remote: Counting objects: 22% (1094714/4975970) remote: Counting objects: 23% (1144474/4975970) remote: Counting objects: 24% (1194233/4975970) remote: Counting objects: 25% (1243993/4975970) remote: Counting objects: 26% (1293753/4975970) remote: Counting objects: 27% (1343512/4975970) remote: Counting objects: 28% (1393272/4975970) remote: Counting objects: 29% (1443032/4975970) remote: Counting objects: 30% (1492791/4975970) remote: Counting objects: 31% (1542551/4975970) remote: Counting objects: 32% (1592311/4975970) remote: Counting objects: 33% (1642071/4975970) remote: Counting objects: 34% (1691830/4975970) remote: Counting objects: 35% (1741590/4975970) remote: Counting objects: 36% (1791350/4975970) remote: Counting objects: 37% (1841109/4975970) remote: Counting objects: 38% (1890869/4975970) remote: Counting objects: 39% (1940629/4975970) remote: Counting objects: 40% (1990388/4975970) remote: Counting objects: 41% (2040148/4975970) remote: Counting objects: 42% (2089908/4975970) remote: Counting objects: 43% (2139668/4975970) remote: Counting objects: 44% (2189427/4975970) remote: Counting objects: 44% (2189697/4975970) remote: Counting objects: 45% (2239187/4975970) remote: Counting objects: 46% (2288947/4975970) remote: Counting objects: 47% (2338706/4975970) remote: Counting objects: 48% (2388466/4975970) remote: Counting objects: 49% (2438226/4975970) remote: Counting objects: 50% (2487985/4975970) remote: Counting objects: 51% (2537745/4975970) remote: Counting objects: 52% (2587505/4975970) remote: Counting objects: 53% (2637265/4975970) remote: Counting objects: 54% (2687024/4975970) remote: Counting objects: 55% (2736784/4975970) remote: Counting objects: 56% (2786544/4975970) remote: Counting objects: 57% (2836303/4975970) remote: Counting objects: 58% (2886063/4975970) remote: Counting objects: 59% (2935823/4975970) remote: Counting objects: 60% (2985582/4975970) remote: Counting objects: 61% (3035342/4975970) remote: Counting objects: 62% (3085102/4975970) remote: Counting objects: 63% (3134862/4975970) remote: Counting objects: 64% (3184621/4975970) remote: Counting objects: 65% (3234381/4975970) remote: Counting objects: 66% (3284141/4975970) remote: Counting objects: 67% (3333900/4975970) remote: Counting objects: 68% (3383660/4975970) remote: Counting objects: 69% (3433420/4975970) remote: Counting objects: 70% (3483179/4975970) remote: Counting objects: 71% (3532939/4975970) remote: Counting objects: 72% (3582699/4975970) remote: Counting objects: 73% (3632459/4975970) remote: Counting objects: 74% (3682218/4975970) remote: Counting objects: 75% (3731978/4975970) remote: Counting objects: 76% (3781738/4975970) remote: Counting objects: 77% (3831497/4975970) remote: Counting objects: 78% (3881257/4975970) remote: Counting objects: 79% (3931017/4975970) remote: Counting objects: 80% (3980776/4975970) remote: Counting objects: 81% (4030536/4975970) remote: Counting objects: 82% (4080296/4975970) remote: Counting objects: 83% (4130056/4975970) remote: Counting objects: 84% (4179815/4975970) remote: Counting objects: 85% (4229575/4975970) remote: Counting objects: 86% (4279335/4975970) remote: Counting objects: 87% (4329094/4975970) remote: Counting objects: 88% (4378854/4975970) remote: Counting objects: 89% (4428614/4975970) remote: Counting objects: 90% (4478373/4975970) remote: Counting objects: 91% (4528133/4975970) remote: Counting objects: 92% (4577893/4975970) remote: Counting objects: 93% (4627653/4975970) remote: Counting objects: 94% (4677412/4975970) remote: Counting objects: 95% (4727172/4975970) remote: Counting objects: 96% (4776932/4975970) remote: Counting objects: 97% (4826691/4975970) remote: Counting objects: 98% (4876451/4975970) remote: Counting objects: 99% (4926211/4975970) remote: Counting objects: 99% (4933954/4975970) remote: Counting objects: 100% (4975970/4975970) remote: Counting objects: 100% (4975970/4975970), done. remote: Compressing objects: 0% (1/1118698) remote: Compressing objects: 1% (11187/1118698) remote: Compressing objects: 2% (22374/1118698) remote: Compressing objects: 3% (33561/1118698) remote: Compressing objects: 3% (42941/1118698) remote: Compressing objects: 4% (44748/1118698) remote: Compressing objects: 5% (55935/1118698) remote: Compressing objects: 5% (58334/1118698) remote: Compressing objects: 6% (67122/1118698) remote: Compressing objects: 6% (76196/1118698) remote: Compressing objects: 7% (78309/1118698) remote: Compressing objects: 8% (89496/1118698) remote: Compressing objects: 8% (94575/1118698) remote: Compressing objects: 9% (100683/1118698) remote: Compressing objects: 9% (105711/1118698) remote: Compressing objects: 10% (111870/1118698) remote: Compressing objects: 10% (113358/1118698) remote: Compressing objects: 10% (113391/1118698) remote: Compressing objects: 10% (121922/1118698) remote: Compressing objects: 11% (123057/1118698) remote: Compressing objects: 12% (134244/1118698) remote: Compressing objects: 12% (135150/1118698) remote: Compressing objects: 13% (145431/1118698) remote: Compressing objects: 13% (152302/1118698) remote: Compressing objects: 14% (156618/1118698) remote: Compressing objects: 15% (167805/1118698) remote: Compressing objects: 15% (174673/1118698) remote: Compressing objects: 16% (178992/1118698) remote: Compressing objects: 17% (190179/1118698) remote: Compressing objects: 17% (193311/1118698) remote: Compressing objects: 18% (201366/1118698) remote: Compressing objects: 19% (212553/1118698) remote: Compressing objects: 19% (213081/1118698) remote: Compressing objects: 20% (223740/1118698) remote: Compressing objects: 20% (231565/1118698) remote: Compressing objects: 21% (234927/1118698) remote: Compressing objects: 22% (246114/1118698) remote: Compressing objects: 22% (248183/1118698) remote: Compressing objects: 23% (257301/1118698) remote: Compressing objects: 24% (268488/1118698) remote: Compressing objects: 25% (279675/1118698) remote: Compressing objects: 26% (290862/1118698) remote: Compressing objects: 27% (302049/1118698) remote: Compressing objects: 27% (308617/1118698) remote: Compressing objects: 28% (313236/1118698) remote: Compressing objects: 29% (324423/1118698) remote: Compressing objects: 29% (326906/1118698) remote: Compressing objects: 30% (335610/1118698) remote: Compressing objects: 30% (341992/1118698) remote: Compressing objects: 31% (346797/1118698) remote: Compressing objects: 31% (356243/1118698) remote: Compressing objects: 32% (357984/1118698) remote: Compressing objects: 33% (369171/1118698) remote: Compressing objects: 33% (369695/1118698) remote: Compressing objects: 34% (380358/1118698) remote: Compressing objects: 34% (388482/1118698) remote: Compressing objects: 35% (391545/1118698) remote: Compressing objects: 35% (400128/1118698) remote: Compressing objects: 36% (402732/1118698) remote: Compressing objects: 36% (409703/1118698) remote: Compressing objects: 37% (413919/1118698) remote: Compressing objects: 37% (416975/1118698) remote: Compressing objects: 37% (423416/1118698) remote: Compressing objects: 38% (425106/1118698) remote: Compressing objects: 38% (430690/1118698) remote: Compressing objects: 39% (436293/1118698) remote: Compressing objects: 39% (439900/1118698) remote: Compressing objects: 40% (447480/1118698) remote: Compressing objects: 40% (447622/1118698) remote: Compressing objects: 40% (455825/1118698) remote: Compressing objects: 41% (458667/1118698) remote: Compressing objects: 41% (464617/1118698) remote: Compressing objects: 42% (469854/1118698) remote: Compressing objects: 42% (474232/1118698) remote: Compressing objects: 43% (481041/1118698) remote: Compressing objects: 43% (482853/1118698) remote: Compressing objects: 43% (489662/1118698) remote: Compressing objects: 44% (492228/1118698) remote: Compressing objects: 44% (497559/1118698) remote: Compressing objects: 44% (503360/1118698) remote: Compressing objects: 45% (503415/1118698) remote: Compressing objects: 45% (506958/1118698) remote: Compressing objects: 45% (512886/1118698) remote: Compressing objects: 46% (514602/1118698) remote: Compressing objects: 46% (520733/1118698) remote: Compressing objects: 47% (525789/1118698) remote: Compressing objects: 47% (528888/1118698) remote: Compressing objects: 47% (535618/1118698) remote: Compressing objects: 48% (536976/1118698) remote: Compressing objects: 48% (541791/1118698) remote: Compressing objects: 48% (547243/1118698) remote: Compressing objects: 49% (548163/1118698) remote: Compressing objects: 49% (556135/1118698) remote: Compressing objects: 50% (559349/1118698) remote: Compressing objects: 50% (565572/1118698) remote: Compressing objects: 51% (570536/1118698) remote: Compressing objects: 51% (574400/1118698) remote: Compressing objects: 52% (581723/1118698) remote: Compressing objects: 52% (582840/1118698) remote: Compressing objects: 52% (589689/1118698) remote: Compressing objects: 53% (592910/1118698) remote: Compressing objects: 53% (595545/1118698) remote: Compressing objects: 53% (600090/1118698) remote: Compressing objects: 54% (604097/1118698) remote: Compressing objects: 54% (604325/1118698) remote: Compressing objects: 54% (607086/1118698) remote: Compressing objects: 54% (611124/1118698) remote: Compressing objects: 55% (615284/1118698) remote: Compressing objects: 55% (615537/1118698) remote: Compressing objects: 55% (620241/1118698) remote: Compressing objects: 55% (625552/1118698) remote: Compressing objects: 56% (626471/1118698) remote: Compressing objects: 56% (628969/1118698) remote: Compressing objects: 56% (631716/1118698) remote: Compressing objects: 56% (635334/1118698) remote: Compressing objects: 57% (637658/1118698) remote: Compressing objects: 57% (638427/1118698) remote: Compressing objects: 57% (641559/1118698) remote: Compressing objects: 57% (644801/1118698) remote: Compressing objects: 57% (647911/1118698) remote: Compressing objects: 58% (648845/1118698) remote: Compressing objects: 58% (652177/1118698) remote: Compressing objects: 58% (656894/1118698) remote: Compressing objects: 58% (658820/1118698) remote: Compressing objects: 59% (660032/1118698) remote: Compressing objects: 59% (662989/1118698) remote: Compressing objects: 59% (668150/1118698) remote: Compressing objects: 60% (671219/1118698) remote: Compressing objects: 60% (672993/1118698) remote: Compressing objects: 60% (677525/1118698) remote: Compressing objects: 60% (682178/1118698) remote: Compressing objects: 61% (682406/1118698) remote: Compressing objects: 61% (685927/1118698) remote: Compressing objects: 61% (690171/1118698) remote: Compressing objects: 62% (693593/1118698) remote: Compressing objects: 62% (694925/1118698) remote: Compressing objects: 62% (700286/1118698) remote: Compressing objects: 63% (704780/1118698) remote: Compressing objects: 63% (705596/1118698) remote: Compressing objects: 63% (708509/1118698) remote: Compressing objects: 63% (711357/1118698) remote: Compressing objects: 63% (714511/1118698) remote: Compressing objects: 64% (715967/1118698) remote: Compressing objects: 64% (717748/1118698) remote: Compressing objects: 64% (721190/1118698) remote: Compressing objects: 64% (724883/1118698) remote: Compressing objects: 65% (727154/1118698) remote: Compressing objects: 65% (729236/1118698) remote: Compressing objects: 65% (733701/1118698) remote: Compressing objects: 65% (737607/1118698) remote: Compressing objects: 66% (738341/1118698) remote: Compressing objects: 66% (741292/1118698) remote: Compressing objects: 66% (744120/1118698) remote: Compressing objects: 66% (747333/1118698) remote: Compressing objects: 67% (749528/1118698) remote: Compressing objects: 67% (750547/1118698) remote: Compressing objects: 67% (753809/1118698) remote: Compressing objects: 67% (756805/1118698) remote: Compressing objects: 67% (760005/1118698) remote: Compressing objects: 68% (760715/1118698) remote: Compressing objects: 68% (763818/1118698) remote: Compressing objects: 68% (767305/1118698) remote: Compressing objects: 68% (771181/1118698) remote: Compressing objects: 69% (771902/1118698) remote: Compressing objects: 69% (772101/1118698) remote: Compressing objects: 69% (772348/1118698) remote: Compressing objects: 69% (774902/1118698) remote: Compressing objects: 69% (778436/1118698) remote: Compressing objects: 69% (782143/1118698) remote: Compressing objects: 70% (783089/1118698) remote: Compressing objects: 70% (784763/1118698) remote: Compressing objects: 70% (787387/1118698) remote: Compressing objects: 70% (790208/1118698) remote: Compressing objects: 70% (793148/1118698) remote: Compressing objects: 71% (794276/1118698) remote: Compressing objects: 71% (795414/1118698) remote: Compressing objects: 71% (798399/1118698) remote: Compressing objects: 71% (802562/1118698) remote: Compressing objects: 72% (805463/1118698) remote: Compressing objects: 72% (807304/1118698) remote: Compressing objects: 72% (810325/1118698) remote: Compressing objects: 72% (813225/1118698) remote: Compressing objects: 73% (816650/1118698) remote: Compressing objects: 73% (816764/1118698) remote: Compressing objects: 73% (819372/1118698) remote: Compressing objects: 73% (822686/1118698) remote: Compressing objects: 73% (825774/1118698) remote: Compressing objects: 74% (827837/1118698) remote: Compressing objects: 74% (828897/1118698) remote: Compressing objects: 74% (831406/1118698) remote: Compressing objects: 74% (833954/1118698) remote: Compressing objects: 74% (836578/1118698) remote: Compressing objects: 74% (838902/1118698) remote: Compressing objects: 75% (839024/1118698) remote: Compressing objects: 75% (841172/1118698) remote: Compressing objects: 75% (843703/1118698) remote: Compressing objects: 75% (845633/1118698) remote: Compressing objects: 75% (847759/1118698) remote: Compressing objects: 75% (849736/1118698) remote: Compressing objects: 76% (850211/1118698) remote: Compressing objects: 76% (851676/1118698) remote: Compressing objects: 76% (852457/1118698) remote: Compressing objects: 76% (852836/1118698) remote: Compressing objects: 76% (853947/1118698) remote: Compressing objects: 76% (855935/1118698) remote: Compressing objects: 76% (858060/1118698) remote: Compressing objects: 76% (860204/1118698) remote: Compressing objects: 77% (861398/1118698) remote: Compressing objects: 77% (862398/1118698) remote: Compressing objects: 77% (864871/1118698) remote: Compressing objects: 77% (867278/1118698) remote: Compressing objects: 77% (869927/1118698) remote: Compressing objects: 77% (872142/1118698) remote: Compressing objects: 78% (872585/1118698) remote: Compressing objects: 78% (873908/1118698) remote: Compressing objects: 78% (875885/1118698) remote: Compressing objects: 78% (877691/1118698) remote: Compressing objects: 78% (879619/1118698) remote: Compressing objects: 78% (881391/1118698) remote: Compressing objects: 78% (883142/1118698) remote: Compressing objects: 79% (883772/1118698) remote: Compressing objects: 79% (885187/1118698) remote: Compressing objects: 79% (887062/1118698) remote: Compressing objects: 79% (888613/1118698) remote: Compressing objects: 79% (890262/1118698) remote: Compressing objects: 79% (891933/1118698) remote: Compressing objects: 79% (894231/1118698) remote: Compressing objects: 80% (894959/1118698) remote: Compressing objects: 80% (896696/1118698) remote: Compressing objects: 80% (898220/1118698) remote: Compressing objects: 80% (899834/1118698) remote: Compressing objects: 80% (901227/1118698) remote: Compressing objects: 80% (902285/1118698) remote: Compressing objects: 80% (903145/1118698) remote: Compressing objects: 80% (903853/1118698) remote: Compressing objects: 80% (905426/1118698) remote: Compressing objects: 81% (906146/1118698) remote: Compressing objects: 81% (907146/1118698) remote: Compressing objects: 81% (908609/1118698) remote: Compressing objects: 81% (910344/1118698) remote: Compressing objects: 81% (911809/1118698) remote: Compressing objects: 81% (913464/1118698) remote: Compressing objects: 81% (914827/1118698) remote: Compressing objects: 81% (916345/1118698) remote: Compressing objects: 82% (917333/1118698) remote: Compressing objects: 82% (918300/1118698) remote: Compressing objects: 82% (919655/1118698) remote: Compressing objects: 82% (920894/1118698) remote: Compressing objects: 82% (922065/1118698) remote: Compressing objects: 82% (923500/1118698) remote: Compressing objects: 82% (924592/1118698) remote: Compressing objects: 82% (925794/1118698) remote: Compressing objects: 82% (927164/1118698) remote: Compressing objects: 83% (928520/1118698) remote: Compressing objects: 83% (928542/1118698) remote: Compressing objects: 83% (930143/1118698) remote: Compressing objects: 83% (931818/1118698) remote: Compressing objects: 83% (933880/1118698) remote: Compressing objects: 83% (935926/1118698) remote: Compressing objects: 83% (938007/1118698) remote: Compressing objects: 83% (939509/1118698) remote: Compressing objects: 84% (939707/1118698) remote: Compressing objects: 84% (941156/1118698) remote: Compressing objects: 84% (942750/1118698) remote: Compressing objects: 84% (944621/1118698) remote: Compressing objects: 84% (946568/1118698) remote: Compressing objects: 84% (948202/1118698) remote: Compressing objects: 84% (949744/1118698) remote: Compressing objects: 84% (950162/1118698) remote: Compressing objects: 84% (950447/1118698) remote: Compressing objects: 85% (950894/1118698) remote: Compressing objects: 85% (952277/1118698) remote: Compressing objects: 85% (954362/1118698) remote: Compressing objects: 85% (956551/1118698) remote: Compressing objects: 85% (958695/1118698) remote: Compressing objects: 85% (961173/1118698) remote: Compressing objects: 86% (962081/1118698) remote: Compressing objects: 86% (963600/1118698) remote: Compressing objects: 86% (965719/1118698) remote: Compressing objects: 86% (969071/1118698) remote: Compressing objects: 86% (971470/1118698) remote: Compressing objects: 87% (973268/1118698) remote: Compressing objects: 87% (973801/1118698) remote: Compressing objects: 87% (976676/1118698) remote: Compressing objects: 87% (979358/1118698) remote: Compressing objects: 87% (981724/1118698) remote: Compressing objects: 88% (984455/1118698) remote: Compressing objects: 89% (995642/1118698) remote: Compressing objects: 89% (996338/1118698) remote: Compressing objects: 89% (998246/1118698) remote: Compressing objects: 89% (1000357/1118698) remote: Compressing objects: 89% (1002377/1118698) remote: Compressing objects: 89% (1004097/1118698) remote: Compressing objects: 89% (1006392/1118698) remote: Compressing objects: 90% (1006829/1118698) remote: Compressing objects: 90% (1009361/1118698) remote: Compressing objects: 90% (1011119/1118698) remote: Compressing objects: 90% (1013300/1118698) remote: Compressing objects: 90% (1016517/1118698) remote: Compressing objects: 91% (1018016/1118698) remote: Compressing objects: 91% (1019865/1118698) remote: Compressing objects: 91% (1021439/1118698) remote: Compressing objects: 91% (1022276/1118698) remote: Compressing objects: 91% (1024069/1118698) remote: Compressing objects: 91% (1026061/1118698) remote: Compressing objects: 91% (1027317/1118698) remote: Compressing objects: 92% (1029203/1118698) remote: Compressing objects: 92% (1029286/1118698) remote: Compressing objects: 92% (1031115/1118698) remote: Compressing objects: 92% (1033187/1118698) remote: Compressing objects: 92% (1035229/1118698) remote: Compressing objects: 92% (1037328/1118698) remote: Compressing objects: 92% (1039319/1118698) remote: Compressing objects: 93% (1040390/1118698) remote: Compressing objects: 93% (1041246/1118698) remote: Compressing objects: 93% (1043603/1118698) remote: Compressing objects: 93% (1045262/1118698) remote: Compressing objects: 93% (1047191/1118698) remote: Compressing objects: 93% (1049054/1118698) remote: Compressing objects: 93% (1050936/1118698) remote: Compressing objects: 94% (1051577/1118698) remote: Compressing objects: 94% (1053084/1118698) remote: Compressing objects: 94% (1054840/1118698) remote: Compressing objects: 94% (1056564/1118698) remote: Compressing objects: 94% (1058263/1118698) remote: Compressing objects: 94% (1059889/1118698) remote: Compressing objects: 94% (1061330/1118698) remote: Compressing objects: 95% (1062764/1118698) remote: Compressing objects: 95% (1062913/1118698) remote: Compressing objects: 95% (1064914/1118698) remote: Compressing objects: 95% (1070569/1118698) remote: Compressing objects: 95% (1072159/1118698) remote: Compressing objects: 95% (1073464/1118698) remote: Compressing objects: 96% (1073951/1118698) remote: Compressing objects: 96% (1075001/1118698) remote: Compressing objects: 96% (1076346/1118698) remote: Compressing objects: 96% (1077909/1118698) remote: Compressing objects: 96% (1078457/1118698) remote: Compressing objects: 96% (1079992/1118698) remote: Compressing objects: 96% (1081447/1118698) remote: Compressing objects: 96% (1082433/1118698) remote: Compressing objects: 96% (1083525/1118698) remote: Compressing objects: 97% (1085138/1118698) remote: Compressing objects: 97% (1085490/1118698) remote: Compressing objects: 97% (1087365/1118698) remote: Compressing objects: 97% (1089172/1118698) remote: Compressing objects: 97% (1091704/1118698) remote: Compressing objects: 97% (1093920/1118698) remote: Compressing objects: 97% (1096035/1118698) remote: Compressing objects: 98% (1096325/1118698) remote: Compressing objects: 98% (1098089/1118698) remote: Compressing objects: 98% (1100178/1118698) remote: Compressing objects: 98% (1102302/1118698) remote: Compressing objects: 98% (1104080/1118698) remote: Compressing objects: 98% (1106031/1118698) remote: Compressing objects: 98% (1107482/1118698) remote: Compressing objects: 99% (1107512/1118698) remote: Compressing objects: 99% (1109052/1118698) remote: Compressing objects: 99% (1111021/1118698) remote: Compressing objects: 99% (1112755/1118698) remote: Compressing objects: 99% (1114136/1118698) remote: Compressing objects: 99% (1115788/1118698) remote: Compressing objects: 99% (1117408/1118698) remote: Compressing objects: 100% (1118698/1118698) remote: Compressing objects: 100% (1118698/1118698), done. Receiving objects: 0% (1/4975970) Receiving objects: 1% (49760/4975970), 14.68 MiB | 29.36 MiB/s Receiving objects: 1% (80985/4975970), 14.68 MiB | 29.36 MiB/s Receiving objects: 2% (99520/4975970), 29.14 MiB | 29.14 MiB/s Receiving objects: 3% (149280/4975970), 44.48 MiB | 29.65 MiB/s Receiving objects: 3% (175968/4975970), 44.48 MiB | 29.65 MiB/s Receiving objects: 4% (199039/4975970), 59.30 MiB | 29.65 MiB/s Receiving objects: 5% (248799/4975970), 73.87 MiB | 29.55 MiB/s Receiving objects: 5% (279349/4975970), 73.87 MiB | 29.55 MiB/s Receiving objects: 6% (298559/4975970), 87.70 MiB | 29.23 MiB/s Receiving objects: 7% (348318/4975970), 100.83 MiB | 28.81 MiB/s Receiving objects: 7% (394513/4975970), 100.83 MiB | 28.81 MiB/s Receiving objects: 8% (398078/4975970), 113.48 MiB | 28.37 MiB/s Receiving objects: 8% (403708/4975970), 115.20 MiB | 25.56 MiB/s Receiving objects: 8% (406647/4975970), 116.36 MiB | 19.18 MiB/s Receiving objects: 8% (409966/4975970), 117.58 MiB | 12.77 MiB/s Receiving objects: 8% (413088/4975970), 118.63 MiB | 6.78 MiB/s Receiving objects: 8% (415382/4975970), 119.73 MiB | 1.36 MiB/s Receiving objects: 8% (415879/4975970), 120.21 MiB | 755.00 KiB/s Receiving objects: 8% (415928/4975970), 120.21 MiB | 755.00 KiB/s Receiving objects: 8% (416365/4975970), 120.38 MiB | 592.00 KiB/s Receiving objects: 8% (417816/4975970), 120.90 MiB | 479.00 KiB/s Receiving objects: 8% (419119/4975970), 121.38 MiB | 366.00 KiB/s Receiving objects: 8% (420330/4975970), 121.58 MiB | 320.00 KiB/s Receiving objects: 8% (421649/4975970), 122.07 MiB | 418.00 KiB/s Receiving objects: 8% (422804/4975970), 122.47 MiB | 469.00 KiB/s Receiving objects: 8% (424116/4975970), 122.91 MiB | 452.00 KiB/s Receiving objects: 8% (425356/4975970), 123.33 MiB | 439.00 KiB/s Receiving objects: 8% (426645/4975970), 123.79 MiB | 440.00 KiB/s Receiving objects: 8% (428053/4975970), 124.35 MiB | 461.00 KiB/s Receiving objects: 8% (429482/4975970), 124.86 MiB | 481.00 KiB/s Receiving objects: 8% (430916/4975970), 125.43 MiB | 515.00 KiB/s Receiving objects: 8% (432296/4975970), 125.97 MiB | 539.00 KiB/s Receiving objects: 8% (447777/4975970), 127.84 MiB | 848.00 KiB/s Receiving objects: 9% (447838/4975970), 127.84 MiB | 848.00 KiB/s Receiving objects: 10% (497597/4975970), 138.32 MiB | 3.07 MiB/s Receiving objects: 11% (547357/4975970), 138.32 MiB | 3.07 MiB/s Receiving objects: 12% (597117/4975970), 157.59 MiB | 7.26 MiB/s Receiving objects: 13% (646877/4975970), 157.59 MiB | 7.26 MiB/s Receiving objects: 13% (679617/4975970), 157.59 MiB | 7.26 MiB/s Receiving objects: 14% (696636/4975970), 157.59 MiB | 7.26 MiB/s Receiving objects: 14% (719336/4975970), 173.02 MiB | 10.55 MiB/s at org.jenkinsci.plugins.gitclient.CliGitAPIImpl.launchCommandIn(CliGitAPIImpl.java:2681) at org.jenkinsci.plugins.gitclient.CliGitAPIImpl.launchCommandWithCredentials(CliGitAPIImpl.java:2102) at org.jenkinsci.plugins.gitclient.CliGitAPIImpl.access$500(CliGitAPIImpl.java:86) at org.jenkinsci.plugins.gitclient.CliGitAPIImpl$1.execute(CliGitAPIImpl.java:624) at org.jenkinsci.plugins.gitclient.RemoteGitImpl$CommandInvocationHandler$GitCommandMasterToSlaveCallable.call(RemoteGitImpl.java:160) at org.jenkinsci.plugins.gitclient.RemoteGitImpl$CommandInvocationHandler$GitCommandMasterToSlaveCallable.call(RemoteGitImpl.java:153) at hudson.remoting.UserRequest.perform(UserRequest.java:211) at hudson.remoting.UserRequest.perform(UserRequest.java:54) at hudson.remoting.Request$2.run(Request.java:376) at hudson.remoting.InterceptingExecutorService.lambda$wrap$0(InterceptingExecutorService.java:78) ... 4 more Suppressed: hudson.remoting.Channel$CallSiteStackTrace: Remote call to green-dragon-23 at hudson.remoting.Channel.attachCallSiteStackTrace(Channel.java:1800) at hudson.remoting.UserRequest$ExceptionResponse.retrieve(UserRequest.java:356) at hudson.remoting.Channel.call(Channel.java:1001) at org.jenkinsci.plugins.gitclient.RemoteGitImpl$CommandInvocationHandler.execute(RemoteGitImpl.java:145) at sun.reflect.GeneratedMethodAccessor659.invoke(Unknown Source) at sun.reflect.DelegatingMethodAccessorImpl.invoke(DelegatingMethodAccessorImpl.java:43) at java.lang.reflect.Method.invoke(Method.java:498) at org.jenkinsci.plugins.gitclient.RemoteGitImpl$CommandInvocationHandler.invoke(RemoteGitImpl.java:131) at com.sun.proxy.$Proxy86.execute(Unknown Source) at hudson.plugins.git.GitSCM.fetchFrom(GitSCM.java:1002) at hudson.plugins.git.GitSCM.retrieveChanges(GitSCM.java:1245) at hudson.plugins.git.GitSCM.checkout(GitSCM.java:1305) at org.jenkinsci.plugins.workflow.steps.scm.SCMStep.checkout(SCMStep.java:129) at org.jenkinsci.plugins.workflow.steps.scm.SCMStep$StepExecutionImpl.run(SCMStep.java:97) at org.jenkinsci.plugins.workflow.steps.scm.SCMStep$StepExecutionImpl.run(SCMStep.java:84) at org.jenkinsci.plugins.workflow.steps.SynchronousNonBlockingStepExecution.lambda$start$0(SynchronousNonBlockingStepExecution.java:47) at java.util.concurrent.Executors$RunnableAdapter.call(Executors.java:511) ... 4 more [Pipeline] } [Pipeline] // dir [Pipeline] } [Pipeline] // timeout [Pipeline] } [Pipeline] // stage [Pipeline] stage [Pipeline] { (Test Clang 5.0.2) Stage "Test Clang 5.0.2" skipped due to earlier failure(s) [Pipeline] } [Pipeline] // stage [Pipeline] stage [Pipeline] { (Build Clang 7.0.1) Stage "Build Clang 7.0.1" skipped due to earlier failure(s) [Pipeline] } [Pipeline] // stage [Pipeline] stage [Pipeline] { (Test Clang 7.0.1) Stage "Test Clang 7.0.1" skipped due to earlier failure(s) [Pipeline] } [Pipeline] // stage [Pipeline] stage [Pipeline] { (Build Clang 9.0.0) Stage "Build Clang 9.0.0" skipped due to earlier failure(s) [Pipeline] } [Pipeline] // stage [Pipeline] stage [Pipeline] { (Test Clang 9.0.0) Stage "Test Clang 9.0.0" skipped due to earlier failure(s) [Pipeline] } [Pipeline] // stage [Pipeline] stage [Pipeline] { (Build Clang 11.0.1) Stage "Build Clang 11.0.1" skipped due to earlier failure(s) [Pipeline] } [Pipeline] // stage [Pipeline] stage [Pipeline] { (Test Clang 11.0.1) Stage "Test Clang 11.0.1" skipped due to earlier failure(s) [Pipeline] } [Pipeline] // stage [Pipeline] stage [Pipeline] { (Build Clang 13.0.0) Stage "Build Clang 13.0.0" skipped due to earlier failure(s) [Pipeline] } [Pipeline] // stage [Pipeline] stage [Pipeline] { (Test Clang 13.0.0) Stage "Test Clang 13.0.0" skipped due to earlier failure(s) [Pipeline] } [Pipeline] // stage [Pipeline] } [Pipeline] // withEnv [Pipeline] } [Pipeline] // node [Pipeline] End of Pipeline ERROR: Error fetching remote repo 'origin' ERROR: Timeout after 10 minutes Finished: FAILURE