Console Output

Skipping 63,582 KB.. Full Log
    return func(*args, **kwargs)
  File "/Users/buildslave/jenkins/workspace/lldb-cmake-matrix/llvm-project/lldb/packages/Python/lldbsuite/test/decorators.py", line 157, in wrapper
    return func(*args, **kwargs)
  File "/Users/buildslave/jenkins/workspace/lldb-cmake-matrix/llvm-project/lldb/packages/Python/lldbsuite/test/decorators.py", line 157, in wrapper
    return func(*args, **kwargs)
  [Previous line repeated 1 more time]
  File "/Users/buildslave/jenkins/workspace/lldb-cmake-matrix/llvm-project/lldb/packages/Python/lldbsuite/test/lldbinline.py", line 124, in _test
    self.do_test()
  File "/Users/buildslave/jenkins/workspace/lldb-cmake-matrix/llvm-project/lldb/packages/Python/lldbsuite/test/lldbinline.py", line 159, in do_test
    self.assertTrue(hit_breakpoints > 0,
AssertionError: False is not True : inline test did not hit a single breakpoint
Config=x86_64-/Users/buildslave/jenkins/workspace/lldb-cmake-matrix/lldb-build/bin/clang
======================================================================
FAIL: test_dsym (lldbsuite.test.lldbtest.DisambiguatePathsToCommonSink_V5)
----------------------------------------------------------------------
Traceback (most recent call last):
  File "/Users/buildslave/jenkins/workspace/lldb-cmake-matrix/llvm-project/lldb/packages/Python/lldbsuite/test/lldbtest.py", line 1673, in test_method
    return attrvalue(self)
  File "/Users/buildslave/jenkins/workspace/lldb-cmake-matrix/llvm-project/lldb/packages/Python/lldbsuite/test/decorators.py", line 157, in wrapper
    return func(*args, **kwargs)
  File "/Users/buildslave/jenkins/workspace/lldb-cmake-matrix/llvm-project/lldb/packages/Python/lldbsuite/test/decorators.py", line 157, in wrapper
    return func(*args, **kwargs)
  File "/Users/buildslave/jenkins/workspace/lldb-cmake-matrix/llvm-project/lldb/packages/Python/lldbsuite/test/decorators.py", line 157, in wrapper
    return func(*args, **kwargs)
  File "/Users/buildslave/jenkins/workspace/lldb-cmake-matrix/llvm-project/lldb/packages/Python/lldbsuite/test/lldbinline.py", line 124, in _test
    self.do_test()
  File "/Users/buildslave/jenkins/workspace/lldb-cmake-matrix/llvm-project/lldb/packages/Python/lldbsuite/test/lldbinline.py", line 159, in do_test
    self.assertTrue(hit_breakpoints > 0,
AssertionError: False is not True : inline test did not hit a single breakpoint
Config=x86_64-/Users/buildslave/jenkins/workspace/lldb-cmake-matrix/lldb-build/bin/clang
======================================================================
FAIL: test_dwarf (lldbsuite.test.lldbtest.DisambiguatePathsToCommonSink_V5)
----------------------------------------------------------------------
Traceback (most recent call last):
  File "/Users/buildslave/jenkins/workspace/lldb-cmake-matrix/llvm-project/lldb/packages/Python/lldbsuite/test/lldbtest.py", line 1673, in test_method
    return attrvalue(self)
  File "/Users/buildslave/jenkins/workspace/lldb-cmake-matrix/llvm-project/lldb/packages/Python/lldbsuite/test/decorators.py", line 157, in wrapper
    return func(*args, **kwargs)
  File "/Users/buildslave/jenkins/workspace/lldb-cmake-matrix/llvm-project/lldb/packages/Python/lldbsuite/test/decorators.py", line 157, in wrapper
    return func(*args, **kwargs)
  File "/Users/buildslave/jenkins/workspace/lldb-cmake-matrix/llvm-project/lldb/packages/Python/lldbsuite/test/decorators.py", line 157, in wrapper
    return func(*args, **kwargs)
  File "/Users/buildslave/jenkins/workspace/lldb-cmake-matrix/llvm-project/lldb/packages/Python/lldbsuite/test/lldbinline.py", line 124, in _test
    self.do_test()
  File "/Users/buildslave/jenkins/workspace/lldb-cmake-matrix/llvm-project/lldb/packages/Python/lldbsuite/test/lldbinline.py", line 159, in do_test
    self.assertTrue(hit_breakpoints > 0,
AssertionError: False is not True : inline test did not hit a single breakpoint
Config=x86_64-/Users/buildslave/jenkins/workspace/lldb-cmake-matrix/lldb-build/bin/clang
----------------------------------------------------------------------
Ran 8 tests in 2.271s

Hide Details

RESULT: FAILED (0 passes, 3 failures, 0 errors, 5 skipped, 0 expected failures, 0 unexpected successes)

Hide Details

--

Hide Details

******************** PASS: lldb-api :: functionalities/multiword-commands/TestMultiWordCommands.py (1914 of 1923) PASS: lldb-api :: qemu/TestQemuLaunch.py (1915 of 1923) PASS: lldb-api :: python_api/sbplatform/TestSBPlatform.py (1916 of 1923) PASS: lldb-api :: iohandler/sigint/TestIOHandlerPythonREPLSigint.py (1917 of 1923) PASS: lldb-api :: functionalities/gdb_remote_client/TestPlatformClient.py (1918 of 1923) PASS: lldb-api :: api/multithreaded/TestMultithreaded.py (1919 of 1923) UNRESOLVED: lldb-api :: commands/gui/basic/TestGuiBasic.py (1920 of 1923) ******************** TEST 'lldb-api :: commands/gui/basic/TestGuiBasic.py' FAILED ******************** Script: -- /Applications/Xcode.app/Contents/Developer/Library/Frameworks/Python3.framework/Versions/3.8/bin/python3.8 /Users/buildslave/jenkins/workspace/lldb-cmake-matrix/llvm-project/lldb/test/API/dotest.py -u CXXFLAGS -u CFLAGS --codesign-identity lldb_codesign --arch x86_64 --build-dir /Users/buildslave/jenkins/workspace/lldb-cmake-matrix/lldb-build/lldb-test-build.noindex -t --env TERM=vt100 --skip-category gmodules --skip-category watchpoint --skip-category llgs --skip-category debugserver --arch=x86_64 --dwarf-version=5 --env LLVM_LIBS_DIR=/Users/buildslave/jenkins/workspace/lldb-cmake-matrix/lldb-build/./lib --env LLVM_INCLUDE_DIR=/Users/buildslave/jenkins/workspace/lldb-cmake-matrix/lldb-build/include --env LLVM_TOOLS_DIR=/Users/buildslave/jenkins/workspace/lldb-cmake-matrix/lldb-build/./bin --hermetic-libcxx --arch x86_64 --build-dir /Users/buildslave/jenkins/workspace/lldb-cmake-matrix/lldb-build/lldb-test-build.noindex --lldb-module-cache-dir /Users/buildslave/jenkins/workspace/lldb-cmake-matrix/lldb-build/lldb-test-build.noindex/module-cache-lldb/lldb-api --clang-module-cache-dir /Users/buildslave/jenkins/workspace/lldb-cmake-matrix/lldb-build/lldb-test-build.noindex/module-cache-clang/lldb-api --executable /Users/buildslave/jenkins/workspace/lldb-cmake-matrix/lldb-build/./bin/lldb --compiler /Users/buildslave/jenkins/workspace/lldb-cmake-matrix/lldb-build/./bin/clang --dsymutil /Users/buildslave/jenkins/workspace/lldb-cmake-matrix/lldb-build/./bin/dsymutil --llvm-tools-dir /Users/buildslave/jenkins/workspace/lldb-cmake-matrix/lldb-build/./bin --lldb-libs-dir /Users/buildslave/jenkins/workspace/lldb-cmake-matrix/lldb-build/./lib /Users/buildslave/jenkins/workspace/lldb-cmake-matrix/llvm-project/lldb/test/API/commands/gui/basic -p TestGuiBasic.py -- Exit Code: 1

Hide Details

Command Output (stdout): -- lldb version 16.0.99git (http://labmaster3.local/git/llvm-project.git revision 1f7544a6797a55a230b836141feb7e610f3535d9) clang revision 1f7544a6797a55a230b836141feb7e610f3535d9 llvm revision 1f7544a6797a55a230b836141feb7e610f3535d9 (lldb) settings clear -all (lldb) settings set symbols.enable-external-lookup false (lldb) settings set target.inherit-tcc true (lldb) settings set target.detach-on-error false (lldb) settings set target.auto-apply-fixits false (lldb) settings set plugin.process.gdb-remote.packet-timeout 60 (lldb) settings set symbols.clang-modules-cache-path "/Users/buildslave/jenkins/workspace/lldb-cmake-matrix/lldb-build/lldb-test-build.noindex/module-cache-lldb/lldb-api" (lldb) settings set use-color false (lldb) setting set target.prefer-dynamic-value no-dynamic-values (lldb) target create "/Users/buildslave/jenkins/workspace/lldb-cmake-matrix/lldb-build/lldb-test-build.noindex/commands/gui/basic/TestGuiBasic.test_gui/a.out" Locating external symbol file for a.out...  Loading Apple DWARF index for a.out...  Locating external symbol file for dyld...  Parsing symbol table for dyld...  Locating external symbol file for libc++.1.dylib...  Parsing symbol table for libc++.1.dylib...  Locating external symbol file for libSystem.B.dylib...  Parsing symbol table for libSystem.B.dylib...  Locating external symbol file for libc++abi.dylib...  Parsing symbol table for libc++abi.dylib...  Locating external symbol file for libcache.dylib...  Parsing symbol table for libcache.dylib...  Locating external symbol file for libcommonCrypto.dylib...  Parsing symbol table for libcommonCrypto.dylib...  Locating external symbol file for libcompiler_rt.dylib...  Parsing symbol table for libcompiler_rt.dylib...  Locating external symbol file for libcopyfile.dylib...  Parsing symbol table for libcopyfile.dylib...  Locating external symbol file for libcorecrypto.dylib...  Parsing symbol table for libcorecrypto.dylib...  Locating external symbol file for libdispatch.dylib...  Parsing symbol table for libdispatch.dylib...  Locating external symbol file for libdyld.dylib...  Parsing symbol table for libdyld.dylib...  Locating external symbol file for libkeymgr.dylib...  Parsing symbol table for libkeymgr.dylib...  Locating external symbol file for liblaunch.dylib...  Parsing symbol table for liblaunch.dylib...  Locating external symbol file for libmacho.dylib...  Parsing symbol table for libmacho.dylib...  Locating external symbol file for libquarantine.dylib...  Parsing symbol table for libquarantine.dylib...  Locating external symbol file for libremovefile.dylib...  Parsing symbol table for libremovefile.dylib...  Locating external symbol file for libsystem_asl.dylib...  Parsing symbol table for libsystem_asl.dylib...  Locating external symbol file for libsystem_blocks.dylib...  Parsing symbol table for libsystem_blocks.dylib...  Locating external symbol file for libsystem_c.dylib...  Parsing symbol table for libsystem_c.dylib...  Locating external symbol file for libsystem_configuration.dylib...  Parsing symbol table for libsystem_configuration.dylib...  Locating external symbol file for libsystem_coreservices.dylib...  Parsing symbol table for libsystem_coreservices.dylib...  Locating external symbol file for libsystem_darwin.dylib...  Parsing symbol table for libsystem_darwin.dylib...  Locating external symbol file for libsystem_dnssd.dylib...  Parsing symbol table for libsystem_dnssd.dylib...  Locating external symbol file for libsystem_featureflags.dylib...  Parsing symbol table for libsystem_featureflags.dylib...  Locating external symbol file for libsystem_info.dylib...  Parsing symbol table for libsystem_info.dylib...  Locating external symbol file for libsystem_m.dylib...  Parsing symbol table for libsystem_m.dylib...  Locating external symbol file for libsystem_malloc.dylib...  Parsing symbol table for libsystem_malloc.dylib...  Locating external symbol file for libsystem_networkextension.dylib...  Parsing symbol table for libsystem_networkextension.dylib...  Locating external symbol file for libsystem_notify.dylib...  Parsing symbol table for libsystem_notify.dylib...  Locating external symbol file for libsystem_sandbox.dylib...  Parsing symbol table for libsystem_sandbox.dylib...  Locating external symbol file for libsystem_secinit.dylib...  Parsing symbol table for libsystem_secinit.dylib...  Locating external symbol file for libsystem_kernel.dylib...  Parsing symbol table for libsystem_kernel.dylib...  Locating external symbol file for libsystem_platform.dylib...  Parsing symbol table for libsystem_platform.dylib...  Locating external symbol file for libsystem_pthread.dylib...  Parsing symbol table for libsystem_pthread.dylib...  Locating external symbol file for libsystem_symptoms.dylib...  Parsing symbol table for libsystem_symptoms.dylib...  Locating external symbol file for libsystem_trace.dylib...  Parsing symbol table for libsystem_trace.dylib...  Locating external symbol file for libunwind.dylib...  Parsing symbol table for libunwind.dylib...  Locating external symbol file for libxpc.dylib...  Parsing symbol table for libxpc.dylib...  Locating external symbol file for libobjc.A.dylib...  Parsing symbol table for libobjc.A.dylib...  Parsing symbol table for a.out... Current executable set to '/Users/buildslave/jenkins/workspace/lldb-cmake-matrix/lldb-build/lldb-test-build.noindex/commands/gui/basic/TestGuiBasic.test_gui/a.out' (x86_64). (lldb) br set -f main.c -p "// Break here" br set -f main.c -p "// Break here" Breakpoint 1: no locations (pending). WARNING: Unable to resolve breakpoint to any actual locations. (lldb) settings set interpreter.prompt-on-quit false quit settings set interpreter.prompt-on-quit false (lldb) quit Skipping the following test categories: ['gmodules', 'watchpoint', 'llgs', 'debugserver', 'libstdcxx', 'dwo', 'llgs', 'fork']

Hide Details

-- Command Output (stderr): -- Change dir to: /Users/buildslave/jenkins/workspace/lldb-cmake-matrix/llvm-project/lldb/test/API/commands/gui/basic runCmd: settings clear -all output:

Hide Details

runCmd: settings set symbols.enable-external-lookup false output:

Hide Details

runCmd: settings set target.inherit-tcc true output:

Hide Details

runCmd: settings set target.detach-on-error false output:

Hide Details

runCmd: settings set target.auto-apply-fixits false output:

Hide Details

runCmd: settings set plugin.process.gdb-remote.packet-timeout 60 output:

Hide Details

runCmd: settings set symbols.clang-modules-cache-path "/Users/buildslave/jenkins/workspace/lldb-cmake-matrix/lldb-build/lldb-test-build.noindex/module-cache-lldb/lldb-api" output:

Hide Details

runCmd: settings set use-color false output:

Hide Details

runCmd: setting set target.prefer-dynamic-value no-dynamic-values output:

Hide Details

make VPATH=/Users/buildslave/jenkins/workspace/lldb-cmake-matrix/llvm-project/lldb/test/API/commands/gui/basic -C /Users/buildslave/jenkins/workspace/lldb-cmake-matrix/lldb-build/lldb-test-build.noindex/commands/gui/basic/TestGuiBasic.test_gui -I /Users/buildslave/jenkins/workspace/lldb-cmake-matrix/llvm-project/lldb/test/API/commands/gui/basic -I /Users/buildslave/jenkins/workspace/lldb-cmake-matrix/llvm-project/lldb/packages/Python/lldbsuite/test/make -f /Users/buildslave/jenkins/workspace/lldb-cmake-matrix/llvm-project/lldb/test/API/commands/gui/basic/Makefile all ARCH=x86_64 'CC="/Users/buildslave/jenkins/workspace/lldb-cmake-matrix/lldb-build/bin/clang"' DSYMUTIL=/Users/buildslave/jenkins/workspace/lldb-cmake-matrix/lldb-build/./bin/dsymutil CODESIGN=codesign CLANG_MODULE_CACHE_DIR=/Users/buildslave/jenkins/workspace/lldb-cmake-matrix/lldb-build/lldb-test-build.noindex/module-cache-clang/lldb-api USE_HERMETIC_LIBCPP=1

Hide Details

"/Users/buildslave/jenkins/workspace/lldb-cmake-matrix/lldb-build/bin/clang" -gdwarf-5 -isysroot "/Applications/Xcode.app/Contents/Developer/Platforms/MacOSX.platform/Developer/SDKs/MacOSX11.1.sdk" -arch x86_64 -I/Users/buildslave/jenkins/workspace/lldb-cmake-matrix/llvm-project/lldb/packages/Python/lldbsuite/test/make/../../../../../include -I/Users/buildslave/jenkins/workspace/lldb-cmake-matrix/llvm-project/lldb/test/API/commands/gui/basic -I/Users/buildslave/jenkins/workspace/lldb-cmake-matrix/llvm-project/lldb/packages/Python/lldbsuite/test/make -include /Users/buildslave/jenkins/workspace/lldb-cmake-matrix/llvm-project/lldb/packages/Python/lldbsuite/test/make/test_common.h -fno-limit-debug-info -MT main.o -MD -MP -MF main.d -c -o main.o /Users/buildslave/jenkins/workspace/lldb-cmake-matrix/llvm-project/lldb/test/API/commands/gui/basic/main.c "/Users/buildslave/jenkins/workspace/lldb-cmake-matrix/lldb-build/bin/clang" main.o -gdwarf-5 -isysroot "/Applications/Xcode.app/Contents/Developer/Platforms/MacOSX.platform/Developer/SDKs/MacOSX11.1.sdk" -arch x86_64 -I/Users/buildslave/jenkins/workspace/lldb-cmake-matrix/llvm-project/lldb/packages/Python/lldbsuite/test/make/../../../../../include -I/Users/buildslave/jenkins/workspace/lldb-cmake-matrix/llvm-project/lldb/test/API/commands/gui/basic -I/Users/buildslave/jenkins/workspace/lldb-cmake-matrix/llvm-project/lldb/packages/Python/lldbsuite/test/make -include /Users/buildslave/jenkins/workspace/lldb-cmake-matrix/llvm-project/lldb/packages/Python/lldbsuite/test/make/test_common.h -fno-limit-debug-info --driver-mode=g++ -o "a.out" codesign -s - "a.out" "/Users/buildslave/jenkins/workspace/lldb-cmake-matrix/lldb-build/./bin/dsymutil" -o "a.out.dSYM" "a.out"

Hide Details

Hide Details

FAIL: LLDB (/Users/buildslave/jenkins/workspace/lldb-cmake-matrix/lldb-build/bin/clang-x86_64) :: test_gui (TestGuiBasic.BasicGuiCommandTest) tearing down the child process....

Hide Details

Restore dir to: /Users/buildslave/jenkins/workspace/lldb-cmake-matrix/lldb-build/tools/lldb/test ====================================================================== ERROR: test_gui (TestGuiBasic.BasicGuiCommandTest) ---------------------------------------------------------------------- Traceback (most recent call last): File "/Users/buildslave/jenkins/workspace/lldb-cmake-matrix/llvm-project/lldb/third_party/Python/module/pexpect-4.6/pexpect/expect.py", line 111, in expect_loop incoming = spawn.read_nonblocking(spawn.maxread, timeout) File "/Users/buildslave/jenkins/workspace/lldb-cmake-matrix/llvm-project/lldb/third_party/Python/module/pexpect-4.6/pexpect/pty_spawn.py", line 482, in read_nonblocking raise TIMEOUT('Timeout exceeded.') pexpect.exceptions.TIMEOUT: Timeout exceeded.

Hide Details

During handling of the above exception, another exception occurred:

Hide Details

Traceback (most recent call last): File "/Users/buildslave/jenkins/workspace/lldb-cmake-matrix/llvm-project/lldb/packages/Python/lldbsuite/test/decorators.py", line 157, in wrapper return func(*args, **kwargs) File "/Users/buildslave/jenkins/workspace/lldb-cmake-matrix/llvm-project/lldb/packages/Python/lldbsuite/test/decorators.py", line 157, in wrapper return func(*args, **kwargs) File "/Users/buildslave/jenkins/workspace/lldb-cmake-matrix/llvm-project/lldb/test/API/commands/gui/basic/TestGuiBasic.py", line 21, in test_gui self.expect('br set -f main.c -p "// Break here"', substrs=["Breakpoint 1", "address ="]) File "/Users/buildslave/jenkins/workspace/lldb-cmake-matrix/llvm-project/lldb/packages/Python/lldbsuite/test/lldbpexpect.py", line 81, in expect self.child.expect_exact(s) File "/Users/buildslave/jenkins/workspace/lldb-cmake-matrix/llvm-project/lldb/third_party/Python/module/pexpect-4.6/pexpect/spawnbase.py", line 418, in expect_exact return exp.expect_loop(timeout) File "/Users/buildslave/jenkins/workspace/lldb-cmake-matrix/llvm-project/lldb/third_party/Python/module/pexpect-4.6/pexpect/expect.py", line 119, in expect_loop return self.timeout(e) File "/Users/buildslave/jenkins/workspace/lldb-cmake-matrix/llvm-project/lldb/third_party/Python/module/pexpect-4.6/pexpect/expect.py", line 82, in timeout raise TIMEOUT(msg) pexpect.exceptions.TIMEOUT: Timeout exceeded. <pexpect.pty_spawn.spawn object at 0x10175fbb0> command: /Users/buildslave/jenkins/workspace/lldb-cmake-matrix/lldb-build/bin/lldb args: ['/Users/buildslave/jenkins/workspace/lldb-cmake-matrix/lldb-build/bin/lldb', '--no-lldbinit', '--no-use-colors', '-O', 'settings clear -all', '-O', 'settings set symbols.enable-external-lookup false', '-O', 'settings set target.inherit-tcc true', '-O', 'settings set target.detach-on-error false', '-O', 'settings set target.auto-apply-fixits false', '-O', 'settings set plugin.process.gdb-remote.packet-timeout 60', '-O', 'settings set symbols.clang-modules-cache-path "/Users/buildslave/jenkins/workspace/lldb-cmake-matrix/lldb-build/lldb-test-build.noindex/module-cache-lldb/lldb-api"', '-O', 'settings set use-color false', '-O', 'setting set target.prefer-dynamic-value no-dynamic-values', '--file', '/Users/buildslave/jenkins/workspace/lldb-cmake-matrix/lldb-build/lldb-test-build.noindex/commands/gui/basic/TestGuiBasic.test_gui/a.out'] buffer (last 100 chars): b': no locations (pending).\r\nWARNING: Unable to resolve breakpoint to any actual locations.\r\n(lldb) ' before (last 100 chars): b': no locations (pending).\r\nWARNING: Unable to resolve breakpoint to any actual locations.\r\n(lldb) ' after: <class 'pexpect.exceptions.TIMEOUT'> match: None match_index: None exitstatus: None flag_eof: False pid: 23519 child_fd: 8 closed: False timeout: 60 delimiter: <class 'pexpect.exceptions.EOF'> logfile: <_io.BufferedWriter name='<stdout>'> logfile_read: None logfile_send: None maxread: 2000 ignorecase: False searchwindowsize: None delaybeforesend: 0.05 delayafterclose: 0.1 delayafterterminate: 0.1 searcher: searcher_string: 0: b'address =' Config=x86_64-/Users/buildslave/jenkins/workspace/lldb-cmake-matrix/lldb-build/bin/clang ---------------------------------------------------------------------- Ran 1 test in 67.193s

Hide Details

RESULT: FAILED (0 passes, 0 failures, 1 errors, 0 skipped, 0 expected failures, 0 unexpected successes)

Hide Details

--

Hide Details

******************** TIMEOUT: lldb-api :: python_api/lldbutil/iter/TestRegistersIterator.py (1921 of 1923) ******************** TEST 'lldb-api :: python_api/lldbutil/iter/TestRegistersIterator.py' FAILED ******************** Script: -- /Applications/Xcode.app/Contents/Developer/Library/Frameworks/Python3.framework/Versions/3.8/bin/python3.8 /Users/buildslave/jenkins/workspace/lldb-cmake-matrix/llvm-project/lldb/test/API/dotest.py -u CXXFLAGS -u CFLAGS --codesign-identity lldb_codesign --arch x86_64 --build-dir /Users/buildslave/jenkins/workspace/lldb-cmake-matrix/lldb-build/lldb-test-build.noindex -t --env TERM=vt100 --skip-category gmodules --skip-category watchpoint --skip-category llgs --skip-category debugserver --arch=x86_64 --dwarf-version=5 --env LLVM_LIBS_DIR=/Users/buildslave/jenkins/workspace/lldb-cmake-matrix/lldb-build/./lib --env LLVM_INCLUDE_DIR=/Users/buildslave/jenkins/workspace/lldb-cmake-matrix/lldb-build/include --env LLVM_TOOLS_DIR=/Users/buildslave/jenkins/workspace/lldb-cmake-matrix/lldb-build/./bin --hermetic-libcxx --arch x86_64 --build-dir /Users/buildslave/jenkins/workspace/lldb-cmake-matrix/lldb-build/lldb-test-build.noindex --lldb-module-cache-dir /Users/buildslave/jenkins/workspace/lldb-cmake-matrix/lldb-build/lldb-test-build.noindex/module-cache-lldb/lldb-api --clang-module-cache-dir /Users/buildslave/jenkins/workspace/lldb-cmake-matrix/lldb-build/lldb-test-build.noindex/module-cache-clang/lldb-api --executable /Users/buildslave/jenkins/workspace/lldb-cmake-matrix/lldb-build/./bin/lldb --compiler /Users/buildslave/jenkins/workspace/lldb-cmake-matrix/lldb-build/./bin/clang --dsymutil /Users/buildslave/jenkins/workspace/lldb-cmake-matrix/lldb-build/./bin/dsymutil --llvm-tools-dir /Users/buildslave/jenkins/workspace/lldb-cmake-matrix/lldb-build/./bin --lldb-libs-dir /Users/buildslave/jenkins/workspace/lldb-cmake-matrix/lldb-build/./lib /Users/buildslave/jenkins/workspace/lldb-cmake-matrix/llvm-project/lldb/test/API/python_api/lldbutil/iter -p TestRegistersIterator.py -- Exit Code: -9 Timeout: Reached timeout of 600 seconds

Hide Details

Command Output (stdout): -- lldb version 16.0.99git (http://labmaster3.local/git/llvm-project.git revision 1f7544a6797a55a230b836141feb7e610f3535d9) clang revision 1f7544a6797a55a230b836141feb7e610f3535d9 llvm revision 1f7544a6797a55a230b836141feb7e610f3535d9

Hide Details

-- Command Output (stderr): -- warning: (x86_64) /Users/buildslave/jenkins/workspace/lldb-cmake-matrix/lldb-build/lldb-test-build.noindex/python_api/lldbutil/iter/TestRegistersIterator.test_iter_registers_dsym/a.out empty dSYM file detected, dSYM was created with an executable with no debug info.

Hide Details

--

Hide Details

******************** TIMEOUT: lldb-api :: python_api/lldbutil/iter/TestLLDBIterator.py (1922 of 1923) ******************** TEST 'lldb-api :: python_api/lldbutil/iter/TestLLDBIterator.py' FAILED ******************** Script: -- /Applications/Xcode.app/Contents/Developer/Library/Frameworks/Python3.framework/Versions/3.8/bin/python3.8 /Users/buildslave/jenkins/workspace/lldb-cmake-matrix/llvm-project/lldb/test/API/dotest.py -u CXXFLAGS -u CFLAGS --codesign-identity lldb_codesign --arch x86_64 --build-dir /Users/buildslave/jenkins/workspace/lldb-cmake-matrix/lldb-build/lldb-test-build.noindex -t --env TERM=vt100 --skip-category gmodules --skip-category watchpoint --skip-category llgs --skip-category debugserver --arch=x86_64 --dwarf-version=5 --env LLVM_LIBS_DIR=/Users/buildslave/jenkins/workspace/lldb-cmake-matrix/lldb-build/./lib --env LLVM_INCLUDE_DIR=/Users/buildslave/jenkins/workspace/lldb-cmake-matrix/lldb-build/include --env LLVM_TOOLS_DIR=/Users/buildslave/jenkins/workspace/lldb-cmake-matrix/lldb-build/./bin --hermetic-libcxx --arch x86_64 --build-dir /Users/buildslave/jenkins/workspace/lldb-cmake-matrix/lldb-build/lldb-test-build.noindex --lldb-module-cache-dir /Users/buildslave/jenkins/workspace/lldb-cmake-matrix/lldb-build/lldb-test-build.noindex/module-cache-lldb/lldb-api --clang-module-cache-dir /Users/buildslave/jenkins/workspace/lldb-cmake-matrix/lldb-build/lldb-test-build.noindex/module-cache-clang/lldb-api --executable /Users/buildslave/jenkins/workspace/lldb-cmake-matrix/lldb-build/./bin/lldb --compiler /Users/buildslave/jenkins/workspace/lldb-cmake-matrix/lldb-build/./bin/clang --dsymutil /Users/buildslave/jenkins/workspace/lldb-cmake-matrix/lldb-build/./bin/dsymutil --llvm-tools-dir /Users/buildslave/jenkins/workspace/lldb-cmake-matrix/lldb-build/./bin --lldb-libs-dir /Users/buildslave/jenkins/workspace/lldb-cmake-matrix/lldb-build/./lib /Users/buildslave/jenkins/workspace/lldb-cmake-matrix/llvm-project/lldb/test/API/python_api/lldbutil/iter -p TestLLDBIterator.py -- Exit Code: -9 Timeout: Reached timeout of 600 seconds

Hide Details

Command Output (stdout): -- lldb version 16.0.99git (http://labmaster3.local/git/llvm-project.git revision 1f7544a6797a55a230b836141feb7e610f3535d9) clang revision 1f7544a6797a55a230b836141feb7e610f3535d9 llvm revision 1f7544a6797a55a230b836141feb7e610f3535d9

Hide Details

-- Command Output (stderr): -- warning: (x86_64) /Users/buildslave/jenkins/workspace/lldb-cmake-matrix/lldb-build/lldb-test-build.noindex/python_api/lldbutil/iter/TestLLDBIterator.test_lldb_iter_breakpoint_dsym/a.out empty dSYM file detected, dSYM was created with an executable with no debug info. warning: (x86_64) /Users/buildslave/jenkins/workspace/lldb-cmake-matrix/lldb-build/lldb-test-build.noindex/python_api/lldbutil/iter/TestLLDBIterator.test_lldb_iter_frame_dsym/a.out empty dSYM file detected, dSYM was created with an executable with no debug info.

Hide Details

--

Hide Details

******************** TIMEOUT: lldb-api :: commands/expression/persistent_ptr_update/TestPersistentPtrUpdate.py (1923 of 1923) ******************** TEST 'lldb-api :: commands/expression/persistent_ptr_update/TestPersistentPtrUpdate.py' FAILED ******************** Script: -- /Applications/Xcode.app/Contents/Developer/Library/Frameworks/Python3.framework/Versions/3.8/bin/python3.8 /Users/buildslave/jenkins/workspace/lldb-cmake-matrix/llvm-project/lldb/test/API/dotest.py -u CXXFLAGS -u CFLAGS --codesign-identity lldb_codesign --arch x86_64 --build-dir /Users/buildslave/jenkins/workspace/lldb-cmake-matrix/lldb-build/lldb-test-build.noindex -t --env TERM=vt100 --skip-category gmodules --skip-category watchpoint --skip-category llgs --skip-category debugserver --arch=x86_64 --dwarf-version=5 --env LLVM_LIBS_DIR=/Users/buildslave/jenkins/workspace/lldb-cmake-matrix/lldb-build/./lib --env LLVM_INCLUDE_DIR=/Users/buildslave/jenkins/workspace/lldb-cmake-matrix/lldb-build/include --env LLVM_TOOLS_DIR=/Users/buildslave/jenkins/workspace/lldb-cmake-matrix/lldb-build/./bin --hermetic-libcxx --arch x86_64 --build-dir /Users/buildslave/jenkins/workspace/lldb-cmake-matrix/lldb-build/lldb-test-build.noindex --lldb-module-cache-dir /Users/buildslave/jenkins/workspace/lldb-cmake-matrix/lldb-build/lldb-test-build.noindex/module-cache-lldb/lldb-api --clang-module-cache-dir /Users/buildslave/jenkins/workspace/lldb-cmake-matrix/lldb-build/lldb-test-build.noindex/module-cache-clang/lldb-api --executable /Users/buildslave/jenkins/workspace/lldb-cmake-matrix/lldb-build/./bin/lldb --compiler /Users/buildslave/jenkins/workspace/lldb-cmake-matrix/lldb-build/./bin/clang --dsymutil /Users/buildslave/jenkins/workspace/lldb-cmake-matrix/lldb-build/./bin/dsymutil --llvm-tools-dir /Users/buildslave/jenkins/workspace/lldb-cmake-matrix/lldb-build/./bin --lldb-libs-dir /Users/buildslave/jenkins/workspace/lldb-cmake-matrix/lldb-build/./lib /Users/buildslave/jenkins/workspace/lldb-cmake-matrix/llvm-project/lldb/test/API/commands/expression/persistent_ptr_update -p TestPersistentPtrUpdate.py -- Exit Code: -9 Timeout: Reached timeout of 600 seconds

Hide Details

Command Output (stdout): -- lldb version 16.0.99git (http://labmaster3.local/git/llvm-project.git revision 1f7544a6797a55a230b836141feb7e610f3535d9) clang revision 1f7544a6797a55a230b836141feb7e610f3535d9 llvm revision 1f7544a6797a55a230b836141feb7e610f3535d9

Hide Details

--

Hide Details

******************** Slowest Tests: -------------------------------------------------------------------------- 600.00s: lldb-api :: python_api/lldbutil/iter/TestRegistersIterator.py 600.00s: lldb-api :: python_api/lldbutil/iter/TestLLDBIterator.py 600.00s: lldb-api :: commands/expression/persistent_ptr_update/TestPersistentPtrUpdate.py 203.23s: lldb-api :: driver/batch_mode/TestBatchMode.py 77.59s: lldb-api :: api/multithreaded/TestMultithreaded.py 74.98s: lldb-api :: commands/process/attach/TestProcessAttach.py 70.96s: lldb-api :: macosx/nslog/TestDarwinNSLogOutput.py 70.21s: lldb-api :: commands/expression/multiline-completion/TestMultilineCompletion.py 69.64s: lldb-api :: commands/gui/breakpoints/TestGuiBreakpoints.py 69.40s: lldb-api :: commands/gui/viewlarge/TestGuiViewLarge.py 69.19s: lldb-api :: commands/gui/basic/TestGuiBasic.py 60.27s: lldb-api :: lang/objc/foundation/TestFoundationDisassembly.py 51.94s: lldb-api :: functionalities/completion/TestCompletion.py 38.07s: lldb-api :: python_api/target/TestTargetAPI.py 35.10s: lldb-api :: commands/process/attach-resume/TestAttachResume.py 33.49s: lldb-api :: lang/objc/hidden-ivars/TestHiddenIvars.py 32.02s: lldb-api :: functionalities/gdb_remote_client/TestPlatformMacOSX.py 31.45s: lldb-api :: commands/settings/TestSettings.py 27.25s: lldb-api :: lang/objc/exceptions/TestObjCExceptions.py 27.09s: lldb-api :: lang/objc/foundation/TestObjCMethods.py

Hide Details

Tests Times: -------------------------------------------------------------------------- [ Range ] :: [ Percentage ] :: [ Count ] -------------------------------------------------------------------------- [600s,650s) :: [ ] :: [ 3/1812] [550s,600s) :: [ ] :: [ 0/1812] [500s,550s) :: [ ] :: [ 0/1812] [450s,500s) :: [ ] :: [ 0/1812] [400s,450s) :: [ ] :: [ 0/1812] [350s,400s) :: [ ] :: [ 0/1812] [300s,350s) :: [ ] :: [ 0/1812] [250s,300s) :: [ ] :: [ 0/1812] [200s,250s) :: [ ] :: [ 1/1812] [150s,200s) :: [ ] :: [ 0/1812] [100s,150s) :: [ ] :: [ 0/1812] [ 50s,100s) :: [ ] :: [ 9/1812] [ 0s, 50s) :: [*************************************** ] :: [1799/1812] -------------------------------------------------------------------------- ******************** Unresolved Tests (12): lldb-api :: commands/expression/multiline-completion/TestMultilineCompletion.py lldb-api :: commands/gui/basic/TestGuiBasic.py lldb-api :: commands/gui/breakpoints/TestGuiBreakpoints.py lldb-api :: commands/gui/viewlarge/TestGuiViewLarge.py lldb-api :: driver/batch_mode/TestBatchMode.py lldb-api :: functionalities/breakpoint/step_over_breakpoint/TestStepOverBreakpoint.py lldb-api :: macosx/nslog/TestDarwinNSLogOutput.py lldb-api :: python_api/objc_type/TestObjCType.py lldb-api :: python_api/signals/TestSignalsAPI.py lldb-api :: tools/lldb-vscode/breakpoint/TestVSCode_setFunctionBreakpoints.py lldb-api :: tools/lldb-vscode/evaluate/TestVSCode_evaluate.py lldb-api :: tools/lldb-vscode/runInTerminal/TestVSCode_runInTerminal.py

Hide Details

******************** Timed Out Tests (3): lldb-api :: commands/expression/persistent_ptr_update/TestPersistentPtrUpdate.py lldb-api :: python_api/lldbutil/iter/TestLLDBIterator.py lldb-api :: python_api/lldbutil/iter/TestRegistersIterator.py

Hide Details

******************** Failed Tests (622): lldb-api :: api/check_public_api_headers/TestPublicAPIHeaders.py lldb-api :: commands/apropos/with-process/TestAproposWithProcess.py lldb-api :: commands/command/nested_alias/TestNestedAlias.py lldb-api :: commands/command/script/TestCommandScript.py lldb-api :: commands/disassemble/basic/TestDisassembleBreakpoint.py lldb-api :: commands/disassemble/basic/TestFrameDisassemble.py lldb-api :: commands/expression/anonymous-struct/TestCallUserAnonTypedef.py lldb-api :: commands/expression/argument_passing_restrictions/TestArgumentPassingRestrictions.py lldb-api :: commands/expression/call-function/TestCallStdStringFunction.py lldb-api :: commands/expression/call-function/TestCallStopAndContinue.py lldb-api :: commands/expression/call-function/TestCallUserDefinedFunction.py lldb-api :: commands/expression/call-throws/TestCallThatThrows.py lldb-api :: commands/expression/cast_int_to_anonymous_enum/TestCastIntToAnonymousEnum.py lldb-api :: commands/expression/char/TestExprsChar.py lldb-api :: commands/expression/class_template_specialization_empty_pack/TestClassTemplateSpecializationParametersHandling.py lldb-api :: commands/expression/codegen-crash-import-def-arraytype-element/TestImportDefinitionArrayType.py lldb-api :: commands/expression/codegen-crash-typedefdecl-not-in_declcontext/TestCodegenCrashTypedefDeclNotInDeclContext.py lldb-api :: commands/expression/completion-crash-incomplete-record/TestCompletionCrashIncompleteRecord.py lldb-api :: commands/expression/completion-in-lambda-and-unnamed-class/TestCompletionInLambdaAndUnnamedClass.py lldb-api :: commands/expression/completion/TestExprCompletion.py lldb-api :: commands/expression/context-object-objc/TestContextObjectObjc.py lldb-api :: commands/expression/context-object/TestContextObject.py lldb-api :: commands/expression/deleting-implicit-copy-constructor/TestDeletingImplicitCopyConstructor.py lldb-api :: commands/expression/diagnostics/TestExprDiagnostics.py lldb-api :: commands/expression/dollar-in-variable/TestDollarInVariable.py lldb-api :: commands/expression/dont_allow_jit/TestAllowJIT.py lldb-api :: commands/expression/entry-bp/TestExprEntryBP.py lldb-api :: commands/expression/expr-in-syscall/TestExpressionInSyscall.py lldb-api :: commands/expression/expr_inside_lambda/TestExprInsideLambdas.py lldb-api :: commands/expression/fixits/TestFixIts.py lldb-api :: commands/expression/formatters/TestFormatters.py lldb-api :: commands/expression/function_template_specialization_temp_args/TestFunctionTemplateSpecializationTempArgs.py lldb-api :: commands/expression/ignore-artificial-constructors/TestIgnoreArtificialConstructors.py lldb-api :: commands/expression/import-std-module/array/TestArrayFromStdModule.py lldb-api :: commands/expression/import-std-module/basic/TestImportStdModule.py lldb-api :: commands/expression/import-std-module/conflicts/TestStdModuleWithConflicts.py lldb-api :: commands/expression/import-std-module/deque-basic/TestDequeFromStdModule.py lldb-api :: commands/expression/import-std-module/deque-dbg-info-content/TestDbgInfoContentDequeFromStdModule.py lldb-api :: commands/expression/import-std-module/empty-module/TestEmptyStdModule.py lldb-api :: commands/expression/import-std-module/forward_decl_from_module/TestForwardDeclFromStdModule.py lldb-api :: commands/expression/import-std-module/forward_list-dbg-info-content/TestDbgInfoContentForwardListFromStdModule.py lldb-api :: commands/expression/import-std-module/forward_list/TestForwardListFromStdModule.py lldb-api :: commands/expression/import-std-module/iterator/TestIteratorFromStdModule.py lldb-api :: commands/expression/import-std-module/list-dbg-info-content/TestDbgInfoContentListFromStdModule.py lldb-api :: commands/expression/import-std-module/list/TestListFromStdModule.py lldb-api :: commands/expression/import-std-module/missing-module-sources/TestStdModuleSourcesMissing.py lldb-api :: commands/expression/import-std-module/module-build-errors/TestStdModuleBuildErrors.py lldb-api :: commands/expression/import-std-module/no-std-module/TestMissingStdModule.py lldb-api :: commands/expression/import-std-module/non-module-type-separation/TestNonModuleTypeSeparation.py lldb-api :: commands/expression/import-std-module/queue/TestQueueFromStdModule.py lldb-api :: commands/expression/import-std-module/retry-with-std-module/TestRetryWithStdModule.py lldb-api :: commands/expression/import-std-module/shared_ptr-dbg-info-content/TestSharedPtrDbgInfoContentFromStdModule.py lldb-api :: commands/expression/import-std-module/shared_ptr/TestSharedPtrFromStdModule.py lldb-api :: commands/expression/import-std-module/sysroot/TestStdModuleSysroot.py lldb-api :: commands/expression/import-std-module/unique_ptr-dbg-info-content/TestUniquePtrDbgInfoContent.py lldb-api :: commands/expression/import-std-module/unique_ptr/TestUniquePtrFromStdModule.py lldb-api :: commands/expression/import-std-module/vector-bool/TestVectorBoolFromStdModule.py lldb-api :: commands/expression/import-std-module/vector-dbg-info-content/TestDbgInfoContentVectorFromStdModule.py lldb-api :: commands/expression/import-std-module/vector-of-vectors/TestVectorOfVectorsFromStdModule.py lldb-api :: commands/expression/import-std-module/vector/TestVectorFromStdModule.py lldb-api :: commands/expression/import-std-module/weak_ptr-dbg-info-content/TestDbgInfoContentWeakPtrFromStdModule.py lldb-api :: commands/expression/import-std-module/weak_ptr/TestWeakPtrFromStdModule.py lldb-api :: commands/expression/import_base_class_when_class_has_derived_member/TestImportBaseClassWhenClassHasDerivedMember.py lldb-api :: commands/expression/inline-namespace/TestInlineNamespace.py lldb-api :: commands/expression/ir-interpreter-phi-nodes/TestIRInterpreterPHINodes.py lldb-api :: commands/expression/ir-interpreter/TestIRInterpreter.py lldb-api :: commands/expression/issue_11588/Test11588.py lldb-api :: commands/expression/no-deadlock/TestExprDoesntBlock.py lldb-api :: commands/expression/options/TestExprOptions.py lldb-api :: commands/expression/persist_objc_pointeetype/TestPersistObjCPointeeType.py lldb-api :: commands/expression/persistent_types/TestPersistentTypes.py lldb-api :: commands/expression/persistent_variables/TestPersistentVariables.py lldb-api :: commands/expression/po_verbosity/TestPoVerbosity.py lldb-api :: commands/expression/pr35310/TestExprsBug35310.py lldb-api :: commands/expression/pr52257/TestExprCrash.py lldb-api :: commands/expression/radar_8638051/Test8638051.py lldb-api :: commands/expression/radar_9531204/TestPrintfAfterUp.py lldb-api :: commands/expression/radar_9673664/TestExprHelpExamples.py lldb-api :: commands/expression/rdar42038760/TestScalarURem.py lldb-api :: commands/expression/rdar44436068/Test128BitsInteger.py lldb-api :: commands/expression/regression-access-function-template-in-record/TestRegressionAccessFunctionTemplateInRecord.py lldb-api :: commands/expression/result_numbering/TestResultNumbering.py lldb-api :: commands/expression/save_jit_objects/TestSaveJITObjects.py lldb-api :: commands/expression/scoped_enums/TestScopedEnumType.py lldb-api :: commands/expression/static-initializers/TestStaticInitializers.py lldb-api :: commands/expression/test/TestExprs.py lldb-api :: commands/expression/test/TestExprs2.py lldb-api :: commands/expression/timeout/TestCallWithTimeout.py lldb-api :: commands/expression/top-level/TestTopLevelExprs.py lldb-api :: commands/expression/two-files/TestObjCTypeQueryFromOtherCompileUnit.py lldb-api :: commands/expression/unicode-in-variable/TestUnicodeInVariable.py lldb-api :: commands/expression/unwind_expression/TestUnwindExpression.py lldb-api :: commands/expression/vector_of_enums/TestVectorOfEnums.py lldb-api :: commands/expression/weak_symbols/TestWeakSymbols.py lldb-api :: commands/expression/xvalue/TestXValuePrinting.py lldb-api :: commands/frame/diagnose/array/TestArray.py lldb-api :: commands/frame/diagnose/bad-reference/TestBadReference.py lldb-api :: commands/frame/diagnose/complicated-expression/TestComplicatedExpression.py lldb-api :: commands/frame/diagnose/dereference-argument/TestDiagnoseDereferenceArgument.py lldb-api :: commands/frame/diagnose/dereference-function-return/TestDiagnoseDereferenceFunctionReturn.py lldb-api :: commands/frame/diagnose/dereference-this/TestDiagnoseDereferenceThis.py lldb-api :: commands/frame/diagnose/inheritance/TestDiagnoseInheritance.py lldb-api :: commands/frame/diagnose/local-variable/TestLocalVariable.py lldb-api :: commands/frame/diagnose/virtual-method-call/TestDiagnoseDereferenceVirtualMethodCall.py lldb-api :: commands/frame/language/TestGuessLanguage.py lldb-api :: commands/frame/select/TestFrameSelect.py lldb-api :: commands/frame/var-scope/TestFrameVariableScope.py lldb-api :: commands/frame/var/TestFrameVar.py lldb-api :: commands/memory/read/TestMemoryRead.py lldb-api :: commands/memory/write/TestMemoryWrite.py lldb-api :: commands/process/attach-resume/TestAttachResume.py lldb-api :: commands/process/attach/TestProcessAttach.py lldb-api :: commands/process/continue_to_bkpt/TestContinueToBkpts.py lldb-api :: commands/process/handle/TestProcessHandle.py lldb-api :: commands/process/launch-with-shellexpand/TestLaunchWithShellExpand.py lldb-api :: commands/process/launch/TestProcessLaunch.py lldb-api :: commands/process/signal/TestProcessSignal.py lldb-api :: commands/settings/TestSettings.py lldb-api :: commands/source/info/TestSourceInfo.py lldb-api :: commands/statistics/basic/TestStats.py lldb-api :: commands/target/basic/TestTargetCommand.py lldb-api :: commands/target/dump-pcm-info/TestDumpPCMInfo.py lldb-api :: commands/target/dump/TestTargetDumpTypeSystem.py lldb-api :: commands/target/stop-hooks/TestStopHookScripted.py lldb-api :: commands/target/stop-hooks/TestStopHooks.py lldb-api :: commands/thread/backtrace/TestThreadBacktraceRepeat.py lldb-api :: commands/thread/select/TestThreadSelect.py lldb-api :: functionalities/archives/TestBSDArchives.py lldb-api :: functionalities/avoids-fd-leak/TestFdLeak.py lldb-api :: functionalities/breakpoint/address_breakpoints/TestAddressBreakpoints.py lldb-api :: functionalities/breakpoint/address_breakpoints/TestBadAddressBreakpoints.py lldb-api :: functionalities/breakpoint/auto_continue/TestBreakpointAutoContinue.py lldb-api :: functionalities/breakpoint/break_in_loaded_dylib/TestBreakInLoadedDylib.py lldb-api :: functionalities/breakpoint/breakpoint_by_file_colon_line/TestBreakpointByFileColonLine.py lldb-api :: functionalities/breakpoint/breakpoint_by_line_and_column/TestBreakpointByLineAndColumn.py lldb-api :: functionalities/breakpoint/breakpoint_command/TestBreakpointCommand.py lldb-api :: functionalities/breakpoint/breakpoint_command/TestBreakpointCommandsFromPython.py lldb-api :: functionalities/breakpoint/breakpoint_command/TestRegexpBreakCommand.py lldb-api :: functionalities/breakpoint/breakpoint_conditions/TestBreakpointConditions.py lldb-api :: functionalities/breakpoint/breakpoint_ids/TestBreakpointIDs.py lldb-api :: functionalities/breakpoint/breakpoint_ignore_count/TestBreakpointIgnoreCount.py lldb-api :: functionalities/breakpoint/breakpoint_language/TestBreakpointLanguage.py lldb-api :: functionalities/breakpoint/breakpoint_locations/TestBreakpointLocations.py lldb-api :: functionalities/breakpoint/breakpoint_on_lambda_capture/TestBreakOnLambdaCapture.py lldb-api :: functionalities/breakpoint/breakpoint_on_overload/TestBreakOnOverload.py lldb-api :: functionalities/breakpoint/breakpoint_options/TestBreakpointOptions.py lldb-api :: functionalities/breakpoint/breakpoint_set_restart/TestBreakpointSetRestart.py lldb-api :: functionalities/breakpoint/comp_dir_symlink/TestCompDirSymLink.py lldb-api :: functionalities/breakpoint/consecutive_breakpoints/TestConsecutiveBreakpoints.py lldb-api :: functionalities/breakpoint/cpp/TestCPPBreakpointLocations.py lldb-api :: functionalities/breakpoint/dummy_target_breakpoints/TestBreakpointsWithNoTargets.py lldb-api :: functionalities/breakpoint/global_constructor/TestBreakpointInGlobalConstructor.py lldb-api :: functionalities/breakpoint/inlined_breakpoints/TestInlinedBreakpoints.py lldb-api :: functionalities/breakpoint/move_nearest/TestMoveNearest.py lldb-api :: functionalities/breakpoint/scripted_bkpt/TestScriptedResolver.py lldb-api :: functionalities/breakpoint/source_regexp/TestSourceRegexBreakpoints.py lldb-api :: functionalities/breakpoint/two_hits_one_actual/TestTwoHitsOneActual.py lldb-api :: functionalities/completion/TestCompletion.py lldb-api :: functionalities/conditional_break/TestConditionalBreak.py lldb-api :: functionalities/data-formatter/array_typedef/TestArrayTypedef.py lldb-api :: functionalities/data-formatter/boolreference/TestFormattersBoolRefPtr.py lldb-api :: functionalities/data-formatter/builtin-formats/TestBuiltinFormats.py lldb-api :: functionalities/data-formatter/compactvectors/TestCompactVectors.py lldb-api :: functionalities/data-formatter/cstring-utf8-summary/TestCstringUnicode.py lldb-api :: functionalities/data-formatter/data-formatter-advanced/TestDataFormatterAdv.py lldb-api :: functionalities/data-formatter/data-formatter-caching/TestDataFormatterCaching.py lldb-api :: functionalities/data-formatter/data-formatter-categories/TestDataFormatterCategories.py lldb-api :: functionalities/data-formatter/data-formatter-cpp/TestDataFormatterCpp.py lldb-api :: functionalities/data-formatter/data-formatter-disabling/TestDataFormatterDisabling.py lldb-api :: functionalities/data-formatter/data-formatter-enum-format/TestDataFormatterEnumFormat.py lldb-api :: functionalities/data-formatter/data-formatter-globals/TestDataFormatterGlobals.py lldb-api :: functionalities/data-formatter/data-formatter-named-summaries/TestDataFormatterNamedSummaries.py lldb-api :: functionalities/data-formatter/data-formatter-objc/TestDataFormatterObjCCF.py lldb-api :: functionalities/data-formatter/data-formatter-objc/TestDataFormatterObjCExpr.py lldb-api :: functionalities/data-formatter/data-formatter-objc/TestDataFormatterObjCKVO.py lldb-api :: functionalities/data-formatter/data-formatter-objc/TestDataFormatterObjCNSBundle.py lldb-api :: functionalities/data-formatter/data-formatter-objc/TestDataFormatterObjCNSContainer.py lldb-api :: functionalities/data-formatter/data-formatter-objc/TestDataFormatterObjCNSData.py lldb-api :: functionalities/data-formatter/data-formatter-objc/TestDataFormatterObjCNSDate.py lldb-api :: functionalities/data-formatter/data-formatter-objc/TestDataFormatterObjCNSError.py lldb-api :: functionalities/data-formatter/data-formatter-objc/TestDataFormatterObjCNSNumber.py lldb-api :: functionalities/data-formatter/data-formatter-objc/TestDataFormatterObjCNSURL.py lldb-api :: functionalities/data-formatter/data-formatter-objc/TestDataFormatterObjCPlain.py lldb-api :: functionalities/data-formatter/data-formatter-objc/TestDataFormatterObjNSException.py lldb-api :: functionalities/data-formatter/data-formatter-objc/cmtime/TestDataFormatterCMTime.py lldb-api :: functionalities/data-formatter/data-formatter-objc/nsindexpath/TestDataFormatterNSIndexPath.py lldb-api :: functionalities/data-formatter/data-formatter-objc/nsstring/TestDataFormatterNSString.py lldb-api :: functionalities/data-formatter/data-formatter-proper-plurals/TestFormattersOneIsSingular.py lldb-api :: functionalities/data-formatter/data-formatter-ptr-to-array/TestPtrToArrayFormatting.py lldb-api :: functionalities/data-formatter/data-formatter-python-synth/TestDataFormatterPythonSynth.py lldb-api :: functionalities/data-formatter/data-formatter-script/TestDataFormatterScript.py lldb-api :: functionalities/data-formatter/data-formatter-skip-summary/TestDataFormatterSkipSummary.py lldb-api :: functionalities/data-formatter/data-formatter-smart-array/TestDataFormatterSmartArray.py lldb-api :: functionalities/data-formatter/data-formatter-stl/generic/bitset/TestDataFormatterGenericBitset.py lldb-api :: functionalities/data-formatter/data-formatter-stl/generic/deque/TestDataFormatterGenericDeque.py lldb-api :: functionalities/data-formatter/data-formatter-stl/generic/forward_list/TestDataFormatterGenericForwardList.py lldb-api :: functionalities/data-formatter/data-formatter-stl/generic/list/TestDataFormatterGenericList.py lldb-api :: functionalities/data-formatter/data-formatter-stl/generic/list/loop/TestDataFormatterGenericListLoop.py lldb-api :: functionalities/data-formatter/data-formatter-stl/generic/multimap/TestDataFormatterGenericMultiMap.py lldb-api :: functionalities/data-formatter/data-formatter-stl/generic/multiset/TestDataFormatterGenericMultiSet.py lldb-api :: functionalities/data-formatter/data-formatter-stl/generic/optional/TestDataFormatterGenericOptional.py lldb-api :: functionalities/data-formatter/data-formatter-stl/generic/set/TestDataFormatterGenericSet.py lldb-api :: functionalities/data-formatter/data-formatter-stl/generic/unordered/TestDataFormatterGenericUnordered.py lldb-api :: functionalities/data-formatter/data-formatter-stl/libcxx/atomic/TestLibCxxAtomic.py lldb-api :: functionalities/data-formatter/data-formatter-stl/libcxx/function/TestLibCxxFunction.py lldb-api :: functionalities/data-formatter/data-formatter-stl/libcxx/initializerlist/TestInitializerList.py lldb-api :: functionalities/data-formatter/data-formatter-stl/libcxx/iterator/TestDataFormatterLibccIterator.py lldb-api :: functionalities/data-formatter/data-formatter-stl/libcxx/map/TestDataFormatterLibccMap.py lldb-api :: functionalities/data-formatter/data-formatter-stl/libcxx/queue/TestDataFormatterLibcxxQueue.py lldb-api :: functionalities/data-formatter/data-formatter-stl/libcxx/shared_ptr/TestDataFormatterLibcxxSharedPtr.py lldb-api :: functionalities/data-formatter/data-formatter-stl/libcxx/span/TestDataFormatterLibcxxSpan.py lldb-api :: functionalities/data-formatter/data-formatter-stl/libcxx/string/TestDataFormatterLibcxxString.py lldb-api :: functionalities/data-formatter/data-formatter-stl/libcxx/string/simulator/TestDataFormatterLibcxxStringSimulator.py lldb-api :: functionalities/data-formatter/data-formatter-stl/libcxx/string_view/TestDataFormatterLibcxxStringView.py lldb-api :: functionalities/data-formatter/data-formatter-stl/libcxx/tuple/TestDataFormatterLibcxxTuple.py lldb-api :: functionalities/data-formatter/data-formatter-stl/libcxx/unique_ptr/TestDataFormatterLibcxxUniquePtr.py lldb-api :: functionalities/data-formatter/data-formatter-stl/libcxx/unordered_map/TestDataFormatterLibccUnorderedMap.py lldb-api :: functionalities/data-formatter/data-formatter-stl/libcxx/variant/TestDataFormatterLibcxxVariant.py lldb-api :: functionalities/data-formatter/data-formatter-stl/libcxx/vbool/TestDataFormatterLibcxxVBool.py lldb-api :: functionalities/data-formatter/data-formatter-stl/libcxx/vector/TestDataFormatterLibcxxVector.py lldb-api :: functionalities/data-formatter/data-formatter-stl/libstdcpp/unique_ptr/invalid/TestDataFormatterInvalidStdUniquePtr.py lldb-api :: functionalities/data-formatter/data-formatter-synth/TestDataFormatterSynth.py lldb-api :: functionalities/data-formatter/data-formatter-synthtype/TestDataFormatterSynthType.py lldb-api :: functionalities/data-formatter/data-formatter-synthval/TestDataFormatterSynthVal.py lldb-api :: functionalities/data-formatter/dump_dynamic/TestDumpDynamic.py lldb-api :: functionalities/data-formatter/format-propagation/TestFormatPropagation.py lldb-api :: functionalities/data-formatter/frameformat_smallstruct/TestFrameFormatSmallStruct.py lldb-api :: functionalities/data-formatter/hexcaps/TestDataFormatterHexCaps.py lldb-api :: functionalities/data-formatter/language_category_updates/TestDataFormatterLanguageCategoryUpdates.py lldb-api :: functionalities/data-formatter/nsarraysynth/TestNSArraySynthetic.py lldb-api :: functionalities/data-formatter/nsdictionarysynth/TestNSDictionarySynthetic.py lldb-api :: functionalities/data-formatter/nssetsynth/TestNSSetSynthetic.py lldb-api :: functionalities/data-formatter/ostypeformatting/TestFormattersOsType.py lldb-api :: functionalities/data-formatter/parray/TestPrintArray.py lldb-api :: functionalities/data-formatter/poarray/TestPrintObjectArray.py lldb-api :: functionalities/data-formatter/ptr_ref_typedef/TestPtrRef2Typedef.py lldb-api :: functionalities/data-formatter/pyobjsynthprovider/TestPyObjSynthProvider.py lldb-api :: functionalities/data-formatter/refpointer-recursion/TestDataFormatterRefPtrRecursion.py lldb-api :: functionalities/data-formatter/setvaluefromcstring/TestSetValueFromCString.py lldb-api :: functionalities/data-formatter/stringprinter/TestStringPrinter.py lldb-api :: functionalities/data-formatter/summary-string-onfail/Test-rdar-9974002.py lldb-api :: functionalities/data-formatter/synthcapping/TestSyntheticCapping.py lldb-api :: functionalities/data-formatter/synthupdate/TestSyntheticFilterRecompute.py lldb-api :: functionalities/data-formatter/type_summary_list_script/TestTypeSummaryListScript.py lldb-api :: functionalities/data-formatter/typedef_array/TestTypedefArray.py lldb-api :: functionalities/data-formatter/user-format-vs-summary/TestUserFormatVsSummary.py lldb-api :: functionalities/data-formatter/var-in-aggregate-misuse/TestVarInAggregateMisuse.py lldb-api :: functionalities/data-formatter/varscript_formatting/TestDataFormatterVarScriptFormatting.py lldb-api :: functionalities/data-formatter/vector-types/TestVectorTypesFormatting.py lldb-api :: functionalities/dead-strip/TestDeadStrip.py lldb-api :: functionalities/dlopen_other_executable/TestDlopenOtherExecutable.py lldb-api :: functionalities/dynamic_value_child_count/TestDynamicValueChildCount.py lldb-api :: functionalities/exec/TestExec.py lldb-api :: functionalities/find-line-entry/TestFindLineEntry.py lldb-api :: functionalities/float-display/TestFloatDisplay.py lldb-api :: functionalities/inferior-assert/TestInferiorAssert.py lldb-api :: functionalities/inferior-changed/TestInferiorChanged.py lldb-api :: functionalities/inferior-crashing/TestInferiorCrashing.py lldb-api :: functionalities/inferior-crashing/TestInferiorCrashingStep.py lldb-api :: functionalities/inferior-crashing/recursive-inferior/TestRecursiveInferior.py lldb-api :: functionalities/inferior-crashing/recursive-inferior/TestRecursiveInferiorStep.py lldb-api :: functionalities/inline-stepping/TestInlineStepping.py lldb-api :: functionalities/lazy-loading/TestLazyLoading.py lldb-api :: functionalities/limit-debug-info/TestLimitDebugInfo.py lldb-api :: functionalities/load_after_attach/TestLoadAfterAttach.py lldb-api :: functionalities/load_lazy/TestLoadUsingLazyBind.py lldb-api :: functionalities/load_unload/TestLoadUnload.py lldb-api :: functionalities/load_using_paths/TestLoadUsingPaths.py lldb-api :: functionalities/location-list-lookup/TestLocationListLookup.py lldb-api :: functionalities/memory-region/TestMemoryRegion.py lldb-api :: functionalities/memory/cache/TestMemoryCache.py lldb-api :: functionalities/memory/find/TestMemoryFind.py lldb-api :: functionalities/memory/tag/TestMemoryTag.py lldb-api :: functionalities/non-overlapping-index-variable-i/TestIndexVariable.py lldb-api :: functionalities/optimized_code/TestNoASanExceptionAfterEvalOP_piece.py lldb-api :: functionalities/param_entry_vals/basic_entry_values/TestBasicEntryValues.py lldb-api :: functionalities/plugins/python_os_plugin/TestPythonOSPlugin.py lldb-api :: functionalities/plugins/python_os_plugin/stepping_plugin_threads/TestOSPluginStepping.py lldb-api :: functionalities/pointer_num_children/TestPointerNumChildren.py lldb-api :: functionalities/process_crash_info/TestProcessCrashInfo.py lldb-api :: functionalities/process_group/TestChangeProcessGroup.py lldb-api :: functionalities/progress_reporting/TestProgressReporting.py lldb-api :: functionalities/ptr_refs/TestPtrRefs.py lldb-api :: functionalities/recursion/TestValueObjectRecursion.py lldb-api :: functionalities/rerun/TestRerun.py lldb-api :: functionalities/return-value/TestReturnValue.py lldb-api :: functionalities/scripted_process/TestStackCoreScriptedProcess.py lldb-api :: functionalities/set-data/TestSetData.py lldb-api :: functionalities/signal/TestSendSignal.py lldb-api :: functionalities/signal/handle-abrt/TestHandleAbort.py lldb-api :: functionalities/step-avoids-no-debug/TestStepNoDebug.py lldb-api :: functionalities/step-vrs-interrupt/TestStepVrsInterruptTimeout.py lldb-api :: functionalities/step_scripted/TestStepScripted.py lldb-api :: functionalities/stop-on-sharedlibrary-load/TestStopOnSharedlibraryEvents.py lldb-api :: functionalities/tail_call_frames/ambiguous_tail_call_seq1/TestAmbiguousTailCallSeq1.py lldb-api :: functionalities/tail_call_frames/ambiguous_tail_call_seq2/TestAmbiguousTailCallSeq2.py lldb-api :: functionalities/tail_call_frames/cross_dso/TestCrossDSOTailCalls.py lldb-api :: functionalities/tail_call_frames/cross_object/TestCrossObjectTailCalls.py lldb-api :: functionalities/tail_call_frames/disambiguate_call_site/TestDisambiguateCallSite.py lldb-api :: functionalities/tail_call_frames/disambiguate_paths_to_common_sink/TestDisambiguatePathsToCommonSink.py lldb-api :: functionalities/tail_call_frames/disambiguate_tail_call_seq/TestDisambiguateTailCallSeq.py lldb-api :: functionalities/tail_call_frames/inlining_and_tail_calls/TestInliningAndTailCalls.py lldb-api :: functionalities/tail_call_frames/sbapi_support/TestTailCallFrameSBAPI.py lldb-api :: functionalities/tail_call_frames/thread_step_out_message/TestArtificialFrameStepOutMessage.py lldb-api :: functionalities/tail_call_frames/thread_step_out_or_return/TestSteppingOutWithArtificialFrames.py lldb-api :: functionalities/tail_call_frames/unambiguous_sequence/TestUnambiguousTailCalls.py lldb-api :: functionalities/target_var/TestTargetVar.py lldb-api :: functionalities/thread/backtrace_limit/TestBacktraceLimit.py lldb-api :: functionalities/thread/concurrent_events/TestConcurrentBreakpointDelayBreakpointOneSignal.py lldb-api :: functionalities/thread/concurrent_events/TestConcurrentBreakpointOneDelayBreakpointThreads.py lldb-api :: functionalities/thread/concurrent_events/TestConcurrentCrashWithBreak.py lldb-api :: functionalities/thread/concurrent_events/TestConcurrentCrashWithSignal.py lldb-api :: functionalities/thread/concurrent_events/TestConcurrentDelaySignalBreak.py lldb-api :: functionalities/thread/concurrent_events/TestConcurrentDelayedCrashWithBreakpointSignal.py lldb-api :: functionalities/thread/concurrent_events/TestConcurrentManyBreakpoints.py lldb-api :: functionalities/thread/concurrent_events/TestConcurrentManyCrash.py lldb-api :: functionalities/thread/concurrent_events/TestConcurrentSignalBreak.py lldb-api :: functionalities/thread/concurrent_events/TestConcurrentSignalDelayBreak.py lldb-api :: functionalities/thread/concurrent_events/TestConcurrentTwoBreakpointThreads.py lldb-api :: functionalities/thread/concurrent_events/TestConcurrentTwoBreakpointsOneDelaySignal.py lldb-api :: functionalities/thread/concurrent_events/TestConcurrentTwoBreakpointsOneSignal.py lldb-api :: functionalities/thread/crash_during_step/TestCrashDuringStep.py lldb-api :: functionalities/thread/create_after_attach/TestCreateAfterAttach.py lldb-api :: functionalities/thread/exit_during_break/TestExitDuringBreak.py lldb-api :: functionalities/thread/exit_during_expression/TestExitDuringExpression.py lldb-api :: functionalities/thread/exit_during_step/TestExitDuringStep.py lldb-api :: functionalities/thread/ignore_suspended/TestIgnoreSuspendedThread.py lldb-api :: functionalities/thread/jump/TestThreadJump.py lldb-api :: functionalities/thread/num_threads/TestNumThreads.py lldb-api :: functionalities/thread/state_after_expression/TestStateAfterExpression.py lldb-api :: functionalities/thread/step_out/TestThreadStepOut.py lldb-api :: functionalities/thread/step_until/TestStepUntil.py lldb-api :: functionalities/thread/thread_exit/TestThreadExit.py lldb-api :: functionalities/thread/thread_specific_break/TestThreadSpecificBreakpoint.py lldb-api :: functionalities/thread_plan/TestThreadPlanCommands.py lldb-api :: functionalities/type_get_module/TestTypeGetModule.py lldb-api :: functionalities/type_lookup/TestTypeLookup.py lldb-api :: functionalities/unused-inlined-parameters/TestUnusedInlinedParameters.py lldb-api :: functionalities/unwind/noreturn/TestNoreturnUnwind.py lldb-api :: functionalities/unwind/sigtramp/TestSigtrampUnwind.py lldb-api :: functionalities/unwind/zeroth_frame/TestZerothFrame.py lldb-api :: functionalities/value_md5_crash/TestValueMD5Crash.py lldb-api :: functionalities/var_path/TestVarPath.py lldb-api :: lang/c/anonymous/TestAnonymous.py lldb-api :: lang/c/array_types/TestArrayTypes.py lldb-api :: lang/c/bitfields/TestBitfields.py lldb-api :: lang/c/blocks/TestBlocks.py lldb-api :: lang/c/calling-conventions/TestCCallingConventions.py lldb-api :: lang/c/complex/TestComplexC99.py lldb-api :: lang/c/complex_int/TestComplexInt.py lldb-api :: lang/c/conflicting-symbol/TestConflictingSymbol.py lldb-api :: lang/c/const_variables/TestConstVariables.py lldb-api :: lang/c/cpp_keyword_identifiers/TestCppKeywordsAsCIdentifiers.py lldb-api :: lang/c/enum_types/TestEnumTypes.py lldb-api :: lang/c/flexible-array-members/TestCFlexibleArrayMembers.py lldb-api :: lang/c/forward/TestForwardDeclaration.py lldb-api :: lang/c/function_types/TestFunctionTypes.py lldb-api :: lang/c/global_variables/TestGlobalVariables.py lldb-api :: lang/c/inlines/TestRedefinitionsInInlines.py lldb-api :: lang/c/local_variables/TestLocalVariables.py lldb-api :: lang/c/modules/TestCModules.py lldb-api :: lang/c/offsetof/TestOffsetof.py lldb-api :: lang/c/register_variables/TestRegisterVariables.py lldb-api :: lang/c/set_values/TestSetValues.py lldb-api :: lang/c/shared_lib/TestSharedLib.py lldb-api :: lang/c/shared_lib_stripped_symbols/TestSharedLibStrippedSymbols.py lldb-api :: lang/c/sizeof/TestCSizeof.py lldb-api :: lang/c/step-target/TestStepTarget.py lldb-api :: lang/c/step_over_no_deadlock/TestStepOverDoesntBlock.py lldb-api :: lang/c/stepping/TestStepAndBreakpoints.py lldb-api :: lang/c/stepping/TestThreadStepInAvoidRegexp.py lldb-api :: lang/c/stepping/TestThreadStepping.py lldb-api :: lang/c/strings/TestCStrings.py lldb-api :: lang/c/struct_types/TestStructTypes.py lldb-api :: lang/c/tls_globals/TestTlsGlobals.py lldb-api :: lang/c/unicode/TestUnicodeSymbols.py lldb-api :: lang/c/unions/TestUnionMembers.py lldb-api :: lang/c/vla/TestVLA.py lldb-api :: lang/cpp/accelerator-table/TestCPPAccelerator.py lldb-api :: lang/cpp/alignas_base_class/TestAlignAsBaseClass.py lldb-api :: lang/cpp/auto/TestCPPAuto.py lldb-api :: lang/cpp/bitfields/TestCppBitfields.py lldb-api :: lang/cpp/bool/TestCPPBool.py lldb-api :: lang/cpp/break-on-initializers/TestBreakOnCPP11Initializers.py lldb-api :: lang/cpp/breakpoint-commands/TestCPPBreakpointCommands.py lldb-api :: lang/cpp/call-function/TestCallCPPFunction.py lldb-api :: lang/cpp/chained-calls/TestCppChainedCalls.py lldb-api :: lang/cpp/char8_t/TestCxxChar8_t.py lldb-api :: lang/cpp/class-loading-via-member-typedef/TestClassLoadingViaMemberTypedef.py lldb-api :: lang/cpp/class-template-non-type-parameter-pack/TestClassTemplateNonTypeParameterPack.py lldb-api :: lang/cpp/class-template-parameter-pack/TestClassTemplateParameterPack.py lldb-api :: lang/cpp/class-template-type-parameter-pack/TestClassTemplateTypeParameterPack.py lldb-api :: lang/cpp/class_static/TestStaticVariables.py lldb-api :: lang/cpp/class_types/TestClassTypes.py lldb-api :: lang/cpp/class_types/TestClassTypesDisassembly.py lldb-api :: lang/cpp/complete-type-check/TestCppIsTypeComplete.py lldb-api :: lang/cpp/const_static_integral_member/TestConstStaticIntegralMember.py lldb-api :: lang/cpp/const_static_integral_member_int128/TestConstStaticIntegralMemberInt128.py lldb-api :: lang/cpp/const_this/TestConstThis.py lldb-api :: lang/cpp/constructors/TestCppConstructors.py lldb-api :: lang/cpp/covariant-return-types/TestCovariantReturnTypes.py lldb-api :: lang/cpp/crtp/TestCppCRTP.py lldb-api :: lang/cpp/default-template-args/TestDefaultTemplateArgs.py lldb-api :: lang/cpp/dereferencing_references/TestCPPDereferencingReferences.py lldb-api :: lang/cpp/diamond/TestCppDiamond.py lldb-api :: lang/cpp/dynamic-value-same-basename/TestDynamicValueSameBase.py lldb-api :: lang/cpp/dynamic-value/TestCppValueCast.py lldb-api :: lang/cpp/dynamic-value/TestDynamicValue.py lldb-api :: lang/cpp/enum_types/TestCPP11EnumTypes.py lldb-api :: lang/cpp/exceptions/TestCPPExceptionBreakpoints.py lldb-api :: lang/cpp/extern_c/TestExternCSymbols.py lldb-api :: lang/cpp/forward-declared-template-specialization/TestCppForwardDeclaredTemplateSpecialization.py lldb-api :: lang/cpp/frame-var-anon-unions/TestFrameVariableAnonymousUnions.py lldb-api :: lang/cpp/function-local-class/TestCppFunctionLocalClass.py lldb-api :: lang/cpp/function-qualifiers/TestCppFunctionQualifiers.py lldb-api :: lang/cpp/function_refs/TestFunctionRefs.py lldb-api :: lang/cpp/global_operators/TestCppGlobalOperators.py lldb-api :: lang/cpp/global_variables/TestCPPGlobalVariables.py lldb-api :: lang/cpp/gmodules-templates/TestGModules.py lldb-api :: lang/cpp/incompatible-class-templates/TestCppIncompatibleClassTemplates.py lldb-api :: lang/cpp/incomplete-types/TestCppIncompleteTypes.py lldb-api :: lang/cpp/incomplete-types/members/TestCppIncompleteTypeMembers.py lldb-api :: lang/cpp/inlines/TestInlines.py lldb-api :: lang/cpp/lambdas/TestLambdas.py lldb-api :: lang/cpp/llvm-style/TestLLVMStyle.py lldb-api :: lang/cpp/member-and-local-vars-with-same-name/TestMembersAndLocalsWithSameName.py lldb-api :: lang/cpp/modules-import/TestCXXModulesImport.py lldb-api :: lang/cpp/multiple-inheritance/TestCppMultipleInheritance.py lldb-api :: lang/cpp/namespace/TestNamespace.py lldb-api :: lang/cpp/namespace/TestNamespaceLookup.py lldb-api :: lang/cpp/namespace_conflicts/TestNamespaceConflicts.py lldb-api :: lang/cpp/namespace_definitions/TestNamespaceDefinitions.py lldb-api :: lang/cpp/nested-class-other-compilation-unit/TestNestedClassWithParentInAnotherCU.py lldb-api :: lang/cpp/non-type-template-param/TestCppNonTypeTemplateParam.py lldb-api :: lang/cpp/nsimport/TestCppNsImport.py lldb-api :: lang/cpp/offsetof/TestOffsetofCpp.py lldb-api :: lang/cpp/operator-overload/TestOperatorOverload.py lldb-api :: lang/cpp/operators/TestCppOperators.py lldb-api :: lang/cpp/overloaded-functions/TestOverloadedFunctions.py lldb-api :: lang/cpp/pointer_to_member_type_depending_on_parent_size/TestPointerToMemberTypeDependingOnParentSize.py lldb-api :: lang/cpp/printf/TestPrintf.py lldb-api :: lang/cpp/rvalue-references/TestRvalueReferences.py lldb-api :: lang/cpp/scope/TestCppScope.py lldb-api :: lang/cpp/scratch-context-merging/structs/TestCppScratchContextMergingStructs.py lldb-api :: lang/cpp/signed_types/TestSignedTypes.py lldb-api :: lang/cpp/sizeof/TestCPPSizeof.py lldb-api :: lang/cpp/static_member_type_depending_on_parent_size/TestStaticMemberTypeDependingOnParentSize.py lldb-api :: lang/cpp/static_members/TestCPPStaticMembers.py lldb-api :: lang/cpp/static_methods/TestCPPStaticMethods.py lldb-api :: lang/cpp/std-function-step-into-callable/TestStdFunctionStepIntoCallable.py lldb-api :: lang/cpp/step-through-trampoline/TestStepThroughTrampoline.py lldb-api :: lang/cpp/stl/TestSTL.py lldb-api :: lang/cpp/stl/TestStdCXXDisassembly.py lldb-api :: lang/cpp/struct_with_keyword_name/TestStructWithKeywordName.py lldb-api :: lang/cpp/structured-binding/TestStructuredBinding.py lldb-api :: lang/cpp/symbols/TestSymbols.py lldb-api :: lang/cpp/template-arguments/TestCppTemplateArguments.py lldb-api :: lang/cpp/template-function/TestTemplateFunctions.py lldb-api :: lang/cpp/template-specialization-type/TestTemplateSpecializationType.py lldb-api :: lang/cpp/template/TestTemplateArgs.py lldb-api :: lang/cpp/this/TestCPPThis.py lldb-api :: lang/cpp/this_class_type_mixing/TestThisClassTypeMixing.py lldb-api :: lang/cpp/thread_local/TestThreadLocal.py lldb-api :: lang/cpp/trivial_abi/TestTrivialABI.py lldb-api :: lang/cpp/type_lookup/TestCppTypeLookup.py lldb-api :: lang/cpp/typedef/TestCppTypedef.py lldb-api :: lang/cpp/unique-types/TestUniqueTypes.py lldb-api :: lang/cpp/unsigned_types/TestUnsignedTypes.py lldb-api :: lang/cpp/virtual-functions/TestCppVirtualFunctions.py lldb-api :: lang/cpp/virtual-overload/TestVirtualOverload.py lldb-api :: lang/mixed/TestMixedLanguages.py lldb-api :: lang/objc/bitfield_ivars/TestBitfieldIvars.py lldb-api :: lang/objc/blocks/TestObjCIvarsInBlocks.py lldb-api :: lang/objc/complete-type-check/TestObjCIsTypeComplete.py lldb-api :: lang/objc/conflicting-definition/TestConflictingDefinition.py lldb-api :: lang/objc/cpp_keyword_identifiers/TestCppKeywordsAsObjCIdentifiers.py lldb-api :: lang/objc/direct-dispatch-step/TestObjCDirectDispatchStepping.py lldb-api :: lang/objc/exceptions/TestObjCExceptions.py lldb-api :: lang/objc/forward-decl/TestForwardDecl.py lldb-api :: lang/objc/foundation/TestConstStrings.py lldb-api :: lang/objc/foundation/TestObjCMethods.py lldb-api :: lang/objc/foundation/TestObjCMethods2.py lldb-api :: lang/objc/foundation/TestObjCMethodsNSArray.py lldb-api :: lang/objc/foundation/TestObjCMethodsNSError.py lldb-api :: lang/objc/foundation/TestObjCMethodsString.py lldb-api :: lang/objc/foundation/TestObjectDescriptionAPI.py lldb-api :: lang/objc/foundation/TestRuntimeTypes.py lldb-api :: lang/objc/global_ptrs/TestGlobalObjects.py lldb-api :: lang/objc/hidden-ivars/TestHiddenIvars.py lldb-api :: lang/objc/ivar-IMP/TestObjCiVarIMP.py lldb-api :: lang/objc/modules-auto-import/TestModulesAutoImport.py lldb-api :: lang/objc/modules-cache/TestClangModulesCache.py lldb-api :: lang/objc/modules-compile-error/TestModulesCompileError.py lldb-api :: lang/objc/modules-inline-functions/TestModulesInlineFunctions.py lldb-api :: lang/objc/modules-non-objc-target/TestObjCModulesNonObjCTarget.py lldb-api :: lang/objc/modules-objc-property/TestModulesObjCProperty.py lldb-api :: lang/objc/modules/TestObjCModules.py lldb-api :: lang/objc/objc++/TestObjCXX.py lldb-api :: lang/objc/objc-baseclass-sbtype/TestObjCBaseClassSBType.py lldb-api :: lang/objc/objc-checker/TestObjCCheckers.py lldb-api :: lang/objc/objc-class-method/TestObjCClassMethod.py lldb-api :: lang/objc/objc-dyn-sbtype/TestObjCDynamicSBType.py lldb-api :: lang/objc/objc-foundation-dictionary-empty/TestNSDictionary0.py lldb-api :: lang/objc/objc-ivar-offsets/TestObjCIvarOffsets.py lldb-api :: lang/objc/objc-ivar-protocols/TestIvarProtocols.py lldb-api :: lang/objc/objc-ivar-stripped/TestObjCIvarStripped.py lldb-api :: lang/objc/objc-new-syntax/TestObjCNewSyntaxArray.py lldb-api :: lang/objc/objc-new-syntax/TestObjCNewSyntaxDictionary.py lldb-api :: lang/objc/objc-new-syntax/TestObjCNewSyntaxLiteral.py lldb-api :: lang/objc/objc-optimized/TestObjcOptimized.py lldb-api :: lang/objc/objc-property/TestObjCProperty.py lldb-api :: lang/objc/objc-runtime-ivars/TestRuntimeIvars.py lldb-api :: lang/objc/objc-static-method-stripped/TestObjCStaticMethodStripped.py lldb-api :: lang/objc/objc-static-method/TestObjCStaticMethod.py lldb-api :: lang/objc/objc-stepping/TestObjCStepping.py lldb-api :: lang/objc/objc-struct-argument/TestObjCStructArgument.py lldb-api :: lang/objc/objc-struct-return/TestObjCStructReturn.py lldb-api :: lang/objc/objc-super/TestObjCSuper.py lldb-api :: lang/objc/objc_direct-methods/TestObjCDirectMethods.py lldb-api :: lang/objc/orderedset/TestOrderedSet.py lldb-api :: lang/objc/print-obj/TestPrintObj.py lldb-api :: lang/objc/ptr_refs/TestPtrRefsObjC.py lldb-api :: lang/objc/radar-9691614/TestObjCMethodReturningBOOL.py lldb-api :: lang/objc/rdar-10967107/TestRdar10967107.py lldb-api :: lang/objc/rdar-11355592/TestRdar11355592.py lldb-api :: lang/objc/real-definition/TestRealDefinition.py lldb-api :: lang/objc/self/TestObjCSelf.py lldb-api :: lang/objc/single-entry-dictionary/TestObjCSingleEntryDictionary.py lldb-api :: lang/objc/tagged-pointer/TestTaggedPointerCmd.py lldb-api :: lang/objc/unicode-string/TestUnicodeString.py lldb-api :: lang/objc/variadic_methods/TestVariadicMethods.py lldb-api :: lang/objc/warnings-in-expr-parser/TestObjCWarningsInExprParser.py lldb-api :: lang/objcxx/class-name-clash/TestNameClash.py lldb-api :: lang/objcxx/conflicting-names-class-update-utility-expr/TestObjCConflictingNamesForClassUpdateExpr.py lldb-api :: lang/objcxx/hide-runtime-values/TestObjCXXHideRuntimeValues.py lldb-api :: lang/objcxx/objc-builtin-types/TestObjCBuiltinTypes.py lldb-api :: lang/objcxx/objcxx-ivar-vector/TestIvarVector.py lldb-api :: linux/builtin_trap/TestBuiltinTrap.py lldb-api :: lldbutil-tests/failed-to-hit-breakpoint/TestLLDBUtilFailedToHitBreakpoint.py lldb-api :: macosx/DBGSourcePathRemapping/TestDSYMSourcePathRemapping.py lldb-api :: macosx/add-dsym/TestAddDsymDownload.py lldb-api :: macosx/add-dsym/TestAddDsymMidExecutionCommand.py lldb-api :: macosx/builtin-debugtrap/TestBuiltinDebugTrap.py lldb-api :: macosx/duplicate-archive-members/TestDuplicateMembers.py lldb-api :: macosx/find-app-in-bundle/TestFindAppInBundle.py lldb-api :: macosx/find-dsym/bundle-with-dot-in-filename/TestBundleWithDotInFilename.py lldb-api :: macosx/find-dsym/deep-bundle/TestDeepBundle.py lldb-api :: macosx/ignore_exceptions/TestIgnoredExceptions.py lldb-api :: macosx/indirect_symbol/TestIndirectSymbols.py lldb-api :: macosx/macCatalyst/TestMacCatalyst.py lldb-api :: macosx/profile_vrs_detach/TestDetachVrsProfile.py lldb-api :: macosx/save_crashlog/TestSaveCrashlog.py lldb-api :: macosx/skinny-corefile/TestSkinnyCorefile.py lldb-api :: macosx/stack-corefile/TestStackCorefile.py lldb-api :: macosx/thread_suspend/TestInternalThreadSuspension.py lldb-api :: macosx/unregistered-macho/TestUnregisteredMacho.py lldb-api :: python_api/class_members/TestSBTypeClassMembers.py lldb-api :: python_api/compile_unit/TestCompileUnitAPI.py lldb-api :: python_api/exprpath_synthetic/TestExprPathSynthetic.py lldb-api :: python_api/findvalue_duplist/TestSBFrameFindValue.py lldb-api :: python_api/formatters/TestFormattersSBAPI.py lldb-api :: python_api/frame/TestFrames.py lldb-api :: python_api/frame/get-variables/TestGetVariables.py lldb-api :: python_api/frame/inlines/TestInlinedFrame.py lldb-api :: python_api/function_symbol/TestDisasmAPI.py lldb-api :: python_api/function_symbol/TestSymbolAPI.py lldb-api :: python_api/get-value-32bit-int/TestGetValue32BitInt.py lldb-api :: python_api/hello_world/TestHelloWorld.py lldb-api :: python_api/interpreter/TestCommandInterpreterAPI.py lldb-api :: python_api/lldbutil/frame/TestFrameUtils.py lldb-api :: python_api/lldbutil/process/TestPrintStackTraces.py lldb-api :: python_api/name_lookup/TestNameLookup.py lldb-api :: python_api/process/TestProcessAPI.py lldb-api :: python_api/process/io/TestProcessIO.py lldb-api :: python_api/process/read-mem-cstring/TestReadMemCString.py lldb-api :: python_api/sbdata/TestSBData.py lldb-api :: python_api/sbmodule/TestSBModule.py lldb-api :: python_api/sbtype_typeclass/TestSBTypeTypeClass.py lldb-api :: python_api/sbvalue_const_addrof/TestSBValueConstAddrOf.py lldb-api :: python_api/sbvalue_persist/TestSBValuePersist.py lldb-api :: python_api/symbol-context/TestSymbolContext.py lldb-api :: python_api/symbol-context/two-files/TestSymbolContextTwoFiles.py lldb-api :: python_api/target/TestTargetAPI.py lldb-api :: python_api/thread/TestThreadAPI.py lldb-api :: python_api/type/TestTypeList.py lldb-api :: python_api/value/TestValueAPI.py lldb-api :: python_api/value/change_values/TestChangeValueAPI.py lldb-api :: python_api/value/empty_class/TestValueAPIEmptyClass.py lldb-api :: python_api/value/linked_list/TestValueAPILinkedList.py lldb-api :: python_api/value_var_update/TestValueVarUpdate.py lldb-api :: sample_test/TestSampleInlineTest.py lldb-api :: sample_test/TestSampleTest.py lldb-api :: source-manager/TestSourceManager.py lldb-api :: symbol_ondemand/breakpoint_language/TestBreakpointLanguageOnDemand.py lldb-api :: symbol_ondemand/breakpoint_source_regex/TestSourceTextRegexBreakpoint.py lldb-api :: symbol_ondemand/shared_library/TestSharedLibOnDemand.py lldb-api :: tools/lldb-vscode/attach/TestVSCode_attach.py lldb-api :: tools/lldb-vscode/breakpoint-events/TestVSCode_breakpointEvents.py lldb-api :: tools/lldb-vscode/breakpoint/TestVSCode_logpoints.py lldb-api :: tools/lldb-vscode/breakpoint/TestVSCode_setBreakpoints.py lldb-api :: tools/lldb-vscode/console/TestVSCode_console.py lldb-api :: tools/lldb-vscode/console/TestVSCode_redirection_to_console.py lldb-api :: tools/lldb-vscode/correct-thread/TestVSCode_correct_thread.py lldb-api :: tools/lldb-vscode/launch/TestVSCode_launch.py lldb-api :: tools/lldb-vscode/module/TestVSCode_module.py lldb-api :: tools/lldb-vscode/optimized/TestVSCode_optimized.py lldb-api :: tools/lldb-vscode/stackTrace/TestVSCode_stackTrace.py lldb-api :: tools/lldb-vscode/step/TestVSCode_step.py lldb-api :: tools/lldb-vscode/variables/TestVSCode_variables.py lldb-api :: types/TestCharType.py lldb-api :: types/TestCharTypeExpr.py lldb-api :: types/TestDoubleTypes.py lldb-api :: types/TestDoubleTypesExpr.py lldb-api :: types/TestFloatTypes.py lldb-api :: types/TestFloatTypesExpr.py lldb-api :: types/TestIntegerType.py lldb-api :: types/TestIntegerTypeExpr.py lldb-api :: types/TestLongTypes.py lldb-api :: types/TestLongTypesExpr.py lldb-api :: types/TestRecursiveTypes.py lldb-api :: types/TestShortType.py lldb-api :: types/TestShortTypeExpr.py

Hide Details

Hide Details

Testing Time: 949.23s Unsupported : 362 Passed : 1603 Expectedly Failed: 10 Unresolved : 12 Timed Out : 3 Failed : 622 FAILED: tools/lldb/test/CMakeFiles/check-lldb /Users/buildslave/jenkins/workspace/lldb-cmake-matrix/lldb-build/tools/lldb/test/CMakeFiles/check-lldb cd /Users/buildslave/jenkins/workspace/lldb-cmake-matrix/lldb-build/tools/lldb/test && /Applications/Xcode.app/Contents/Developer/Library/Frameworks/Python3.framework/Versions/3.8/bin/python3.8 /Users/buildslave/jenkins/workspace/lldb-cmake-matrix/lldb-build/./bin/llvm-lit -v --time-tests --shuffle --xunit-xml-output=/Users/buildslave/jenkins/workspace/lldb-cmake-matrix/test/results.xml -v /Users/buildslave/jenkins/workspace/lldb-cmake-matrix/lldb-build/tools/lldb/test ninja: build stopped: subcommand failed. Command failed: Command '['/usr/bin/env', 'TERM=vt100', '/usr/local/bin/ninja', '-v', 'check-lldb']' returned non-zero exit status 1. Command: ['/usr/bin/env', 'TERM=vt100', '/usr/local/bin/ninja', '-v', 'check-lldb'] + set -e [Pipeline] } [Pipeline] // timeout [Pipeline] } [Pipeline] // stage [Pipeline] stage [Pipeline] { (Build Clang 5.0.2) [Pipeline] timeout Timeout set to expire in 30 min [Pipeline] { [Pipeline] dir Running in /Users/buildslave/jenkins/workspace/lldb-cmake-matrix/clang_502 [Pipeline] { [Pipeline] checkout The recommended git tool is: NONE No credentials specified Fetching changes from the remote Git repository > git rev-parse --resolve-git-dir /Users/buildslave/jenkins/workspace/lldb-cmake-matrix/clang_502/.git # timeout=10 > git config remote.origin.url http://labmaster3.local/git/llvm-project.git # timeout=10 Fetching upstream changes from http://labmaster3.local/git/llvm-project.git > git --version # timeout=10 > git --version # 'git version 2.24.3 (Apple Git-128)' > git fetch --tags --force --progress -- http://labmaster3.local/git/llvm-project.git +refs/heads/*:refs/remotes/origin/* # timeout=10 ERROR: Error fetching remote repo 'origin' hudson.plugins.git.GitException: Failed to fetch from http://labmaster3.local/git/llvm-project.git at hudson.plugins.git.GitSCM.fetchFrom(GitSCM.java:1004) at hudson.plugins.git.GitSCM.retrieveChanges(GitSCM.java:1245) at hudson.plugins.git.GitSCM.checkout(GitSCM.java:1305) at org.jenkinsci.plugins.workflow.steps.scm.SCMStep.checkout(SCMStep.java:129) at org.jenkinsci.plugins.workflow.steps.scm.SCMStep$StepExecutionImpl.run(SCMStep.java:97) at org.jenkinsci.plugins.workflow.steps.scm.SCMStep$StepExecutionImpl.run(SCMStep.java:84) at org.jenkinsci.plugins.workflow.steps.SynchronousNonBlockingStepExecution.lambda$start$0(SynchronousNonBlockingStepExecution.java:47) at java.util.concurrent.Executors$RunnableAdapter.call(Executors.java:511) at java.util.concurrent.FutureTask.run(FutureTask.java:266) at java.util.concurrent.ThreadPoolExecutor.runWorker(ThreadPoolExecutor.java:1149) at java.util.concurrent.ThreadPoolExecutor$Worker.run(ThreadPoolExecutor.java:624) at java.lang.Thread.run(Thread.java:748) Caused by: hudson.plugins.git.GitException: Command "git fetch --tags --force --progress -- http://labmaster3.local/git/llvm-project.git +refs/heads/*:refs/remotes/origin/*" returned status code 143: stdout: stderr: remote: Enumerating objects: 1 remote: Enumerating objects: 1792768 remote: Enumerating objects: 4014019 remote: Enumerating objects: 4513561 remote: Enumerating objects: 4526833 remote: Enumerating objects: 4548061 remote: Enumerating objects: 4570369 remote: Enumerating objects: 4593301 remote: Enumerating objects: 4611127 remote: Enumerating objects: 4628462 remote: Enumerating objects: 4645696 remote: Enumerating objects: 4673338 remote: Enumerating objects: 4693207 remote: Enumerating objects: 4710795 remote: Enumerating objects: 4729988 remote: Enumerating objects: 4748015 remote: Enumerating objects: 4765478 remote: Enumerating objects: 4784267 remote: Enumerating objects: 4802787 remote: Enumerating objects: 4820120 remote: Enumerating objects: 4839634 remote: Enumerating objects: 4858062 remote: Enumerating objects: 4875536 remote: Enumerating objects: 4892460 remote: Enumerating objects: 4911041 remote: Enumerating objects: 4928777 remote: Enumerating objects: 4947005 remote: Enumerating objects: 4976311, done. remote: Counting objects: 0% (1/4976311) remote: Counting objects: 0% (1420/4976311) remote: Counting objects: 0% (4952/4976311) remote: Counting objects: 0% (9050/4976311) remote: Counting objects: 0% (13206/4976311) remote: Counting objects: 0% (17285/4976311) remote: Counting objects: 0% (21304/4976311) remote: Counting objects: 0% (25143/4976311) remote: Counting objects: 0% (29098/4976311) remote: Counting objects: 0% (33151/4976311) remote: Counting objects: 0% (37429/4976311) remote: Counting objects: 0% (39067/4976311) remote: Counting objects: 0% (40744/4976311) remote: Counting objects: 0% (44890/4976311) remote: Counting objects: 0% (48979/4976311) remote: Counting objects: 1% (49764/4976311) remote: Counting objects: 1% (52593/4976311) remote: Counting objects: 1% (56282/4976311) remote: Counting objects: 1% (59954/4976311) remote: Counting objects: 1% (63757/4976311) remote: Counting objects: 1% (67585/4976311) remote: Counting objects: 1% (71304/4976311) remote: Counting objects: 1% (74963/4976311) remote: Counting objects: 1% (78615/4976311) remote: Counting objects: 1% (82274/4976311) remote: Counting objects: 1% (85671/4976311) remote: Counting objects: 1% (88941/4976311) remote: Counting objects: 1% (91911/4976311) remote: Counting objects: 1% (94596/4976311) remote: Counting objects: 1% (97216/4976311) remote: Counting objects: 2% (99527/4976311) remote: Counting objects: 2% (99989/4976311) remote: Counting objects: 2% (102625/4976311) remote: Counting objects: 2% (104586/4976311) remote: Counting objects: 2% (106366/4976311) remote: Counting objects: 2% (108762/4976311) remote: Counting objects: 2% (111477/4976311) remote: Counting objects: 2% (114035/4976311) remote: Counting objects: 2% (116650/4976311) remote: Counting objects: 2% (119205/4976311) remote: Counting objects: 2% (121832/4976311) remote: Counting objects: 2% (124514/4976311) remote: Counting objects: 2% (126971/4976311) remote: Counting objects: 2% (128845/4976311) remote: Counting objects: 2% (131374/4976311) remote: Counting objects: 2% (133950/4976311) remote: Counting objects: 2% (136522/4976311) remote: Counting objects: 2% (139011/4976311) remote: Counting objects: 2% (141584/4976311) remote: Counting objects: 2% (144037/4976311) remote: Counting objects: 2% (146419/4976311) remote: Counting objects: 2% (148838/4976311) remote: Counting objects: 3% (149290/4976311) remote: Counting objects: 3% (151081/4976311) remote: Counting objects: 3% (153608/4976311) remote: Counting objects: 3% (156083/4976311) remote: Counting objects: 3% (158429/4976311) remote: Counting objects: 3% (160570/4976311) remote: Counting objects: 3% (162575/4976311) remote: Counting objects: 3% (164568/4976311) remote: Counting objects: 3% (166284/4976311) remote: Counting objects: 3% (167767/4976311) remote: Counting objects: 3% (169594/4976311) remote: Counting objects: 3% (171621/4976311) remote: Counting objects: 3% (173569/4976311) remote: Counting objects: 3% (175340/4976311) remote: Counting objects: 3% (176540/4976311) remote: Counting objects: 3% (178421/4976311) remote: Counting objects: 3% (180372/4976311) remote: Counting objects: 3% (182451/4976311) remote: Counting objects: 3% (184456/4976311) remote: Counting objects: 3% (186653/4976311) remote: Counting objects: 3% (188799/4976311) remote: Counting objects: 3% (190747/4976311) remote: Counting objects: 3% (191776/4976311) remote: Counting objects: 3% (192609/4976311) remote: Counting objects: 3% (194669/4976311) remote: Counting objects: 3% (196685/4976311) remote: Counting objects: 3% (198668/4976311) remote: Counting objects: 4% (199053/4976311) remote: Counting objects: 4% (200578/4976311) remote: Counting objects: 4% (202390/4976311) remote: Counting objects: 4% (204157/4976311) remote: Counting objects: 4% (206026/4976311) remote: Counting objects: 4% (207872/4976311) remote: Counting objects: 4% (209613/4976311) remote: Counting objects: 4% (211265/4976311) remote: Counting objects: 4% (212868/4976311) remote: Counting objects: 4% (214402/4976311) remote: Counting objects: 4% (215810/4976311) remote: Counting objects: 4% (217285/4976311) remote: Counting objects: 4% (218611/4976311) remote: Counting objects: 4% (219856/4976311) remote: Counting objects: 4% (220407/4976311) remote: Counting objects: 4% (221320/4976311) remote: Counting objects: 4% (222784/4976311) remote: Counting objects: 4% (224091/4976311) remote: Counting objects: 4% (224629/4976311) remote: Counting objects: 4% (226053/4976311) remote: Counting objects: 4% (227585/4976311) remote: Counting objects: 4% (229173/4976311) remote: Counting objects: 4% (230992/4976311) remote: Counting objects: 4% (232644/4976311) remote: Counting objects: 4% (234230/4976311) remote: Counting objects: 4% (235910/4976311) remote: Counting objects: 4% (237218/4976311) remote: Counting objects: 4% (238964/4976311) remote: Counting objects: 4% (240689/4976311) remote: Counting objects: 4% (242285/4976311) remote: Counting objects: 4% (243718/4976311) remote: Counting objects: 4% (245203/4976311) remote: Counting objects: 4% (246642/4976311) remote: Counting objects: 4% (248079/4976311) remote: Counting objects: 5% (248816/4976311) remote: Counting objects: 5% (249389/4976311) remote: Counting objects: 5% (250881/4976311) remote: Counting objects: 5% (252988/4976311) remote: Counting objects: 5% (254881/4976311) remote: Counting objects: 5% (256716/4976311) remote: Counting objects: 5% (258410/4976311) remote: Counting objects: 5% (260200/4976311) remote: Counting objects: 5% (261888/4976311) remote: Counting objects: 5% (263565/4976311) remote: Counting objects: 5% (265171/4976311) remote: Counting objects: 5% (266735/4976311) remote: Counting objects: 5% (268213/4976311) remote: Counting objects: 5% (269804/4976311) remote: Counting objects: 5% (271197/4976311) remote: Counting objects: 5% (272382/4976311) remote: Counting objects: 5% (273585/4976311) remote: Counting objects: 5% (274413/4976311) remote: Counting objects: 5% (275049/4976311) remote: Counting objects: 5% (276316/4976311) remote: Counting objects: 5% (277730/4976311) remote: Counting objects: 5% (279143/4976311) remote: Counting objects: 5% (280432/4976311) remote: Counting objects: 5% (281452/4976311) remote: Counting objects: 5% (282742/4976311) remote: Counting objects: 5% (284070/4976311) remote: Counting objects: 5% (285375/4976311) remote: Counting objects: 5% (286694/4976311) remote: Counting objects: 5% (288062/4976311) remote: Counting objects: 5% (289450/4976311) remote: Counting objects: 5% (290785/4976311) remote: Counting objects: 5% (292121/4976311) remote: Counting objects: 5% (293481/4976311) remote: Counting objects: 5% (294790/4976311) remote: Counting objects: 5% (296140/4976311) remote: Counting objects: 5% (297372/4976311) remote: Counting objects: 6% (298579/4976311) remote: Counting objects: 6% (298602/4976311) remote: Counting objects: 6% (299842/4976311) remote: Counting objects: 6% (301098/4976311) remote: Counting objects: 6% (302129/4976311) remote: Counting objects: 6% (302529/4976311) remote: Counting objects: 6% (303476/4976311) remote: Counting objects: 6% (304661/4976311) remote: Counting objects: 6% (305849/4976311) remote: Counting objects: 6% (307012/4976311) remote: Counting objects: 6% (308166/4976311) remote: Counting objects: 6% (309399/4976311) remote: Counting objects: 6% (310711/4976311) remote: Counting objects: 6% (312005/4976311) remote: Counting objects: 6% (313290/4976311) remote: Counting objects: 6% (314568/4976311) remote: Counting objects: 6% (315823/4976311) remote: Counting objects: 6% (317006/4976311) remote: Counting objects: 6% (317912/4976311) remote: Counting objects: 6% (319189/4976311) remote: Counting objects: 6% (320461/4976311) remote: Counting objects: 6% (321751/4976311) remote: Counting objects: 7% (348342/4976311) remote: Counting objects: 7% (362379/4976311) remote: Counting objects: 8% (398105/4976311) remote: Counting objects: 9% (447868/4976311) remote: Counting objects: 10% (497632/4976311) remote: Counting objects: 11% (547395/4976311) remote: Counting objects: 12% (597158/4976311) remote: Counting objects: 13% (646921/4976311) remote: Counting objects: 14% (696684/4976311) remote: Counting objects: 15% (746447/4976311) remote: Counting objects: 16% (796210/4976311) remote: Counting objects: 17% (845973/4976311) remote: Counting objects: 18% (895736/4976311) remote: Counting objects: 19% (945500/4976311) remote: Counting objects: 20% (995263/4976311) remote: Counting objects: 21% (1045026/4976311) remote: Counting objects: 22% (1094789/4976311) remote: Counting objects: 23% (1144552/4976311) remote: Counting objects: 24% (1194315/4976311) remote: Counting objects: 25% (1244078/4976311) remote: Counting objects: 26% (1293841/4976311) remote: Counting objects: 27% (1343604/4976311) remote: Counting objects: 28% (1393368/4976311) remote: Counting objects: 29% (1443131/4976311) remote: Counting objects: 30% (1492894/4976311) remote: Counting objects: 31% (1542657/4976311) remote: Counting objects: 32% (1592420/4976311) remote: Counting objects: 33% (1642183/4976311) remote: Counting objects: 34% (1691946/4976311) remote: Counting objects: 35% (1741709/4976311) remote: Counting objects: 36% (1791472/4976311) remote: Counting objects: 37% (1841236/4976311) remote: Counting objects: 38% (1890999/4976311) remote: Counting objects: 39% (1940762/4976311) remote: Counting objects: 40% (1990525/4976311) remote: Counting objects: 41% (2040288/4976311) remote: Counting objects: 42% (2090051/4976311) remote: Counting objects: 43% (2139814/4976311) remote: Counting objects: 44% (2189577/4976311) remote: Counting objects: 45% (2239340/4976311) remote: Counting objects: 46% (2289104/4976311) remote: Counting objects: 47% (2338867/4976311) remote: Counting objects: 48% (2388630/4976311) remote: Counting objects: 48% (2410440/4976311) remote: Counting objects: 49% (2438393/4976311) remote: Counting objects: 50% (2488156/4976311) remote: Counting objects: 51% (2537919/4976311) remote: Counting objects: 52% (2587682/4976311) remote: Counting objects: 53% (2637445/4976311) remote: Counting objects: 54% (2687208/4976311) remote: Counting objects: 55% (2736972/4976311) remote: Counting objects: 56% (2786735/4976311) remote: Counting objects: 57% (2836498/4976311) remote: Counting objects: 58% (2886261/4976311) remote: Counting objects: 59% (2936024/4976311) remote: Counting objects: 60% (2985787/4976311) remote: Counting objects: 61% (3035550/4976311) remote: Counting objects: 62% (3085313/4976311) remote: Counting objects: 63% (3135076/4976311) remote: Counting objects: 64% (3184840/4976311) remote: Counting objects: 65% (3234603/4976311) remote: Counting objects: 66% (3284366/4976311) remote: Counting objects: 67% (3334129/4976311) remote: Counting objects: 68% (3383892/4976311) remote: Counting objects: 69% (3433655/4976311) remote: Counting objects: 70% (3483418/4976311) remote: Counting objects: 71% (3533181/4976311) remote: Counting objects: 72% (3582944/4976311) remote: Counting objects: 73% (3632708/4976311) remote: Counting objects: 74% (3682471/4976311) remote: Counting objects: 75% (3732234/4976311) remote: Counting objects: 76% (3781997/4976311) remote: Counting objects: 77% (3831760/4976311) remote: Counting objects: 78% (3881523/4976311) remote: Counting objects: 79% (3931286/4976311) remote: Counting objects: 80% (3981049/4976311) remote: Counting objects: 81% (4030812/4976311) remote: Counting objects: 82% (4080576/4976311) remote: Counting objects: 83% (4130339/4976311) remote: Counting objects: 84% (4180102/4976311) remote: Counting objects: 85% (4229865/4976311) remote: Counting objects: 86% (4279628/4976311) remote: Counting objects: 87% (4329391/4976311) remote: Counting objects: 88% (4379154/4976311) remote: Counting objects: 89% (4428917/4976311) remote: Counting objects: 90% (4478680/4976311) remote: Counting objects: 91% (4528444/4976311) remote: Counting objects: 92% (4578207/4976311) remote: Counting objects: 93% (4627970/4976311) remote: Counting objects: 94% (4677733/4976311) remote: Counting objects: 95% (4727496/4976311) remote: Counting objects: 96% (4777259/4976311) remote: Counting objects: 97% (4827022/4976311) remote: Counting objects: 98% (4876785/4976311) remote: Counting objects: 99% (4926548/4976311) remote: Counting objects: 99% (4935539/4976311) remote: Counting objects: 100% (4976311/4976311) remote: Counting objects: 100% (4976311/4976311), done. remote: Compressing objects: 0% (1/1119036) remote: Compressing objects: 1% (11191/1119036) remote: Compressing objects: 2% (22381/1119036) remote: Compressing objects: 3% (33572/1119036) remote: Compressing objects: 3% (42172/1119036) remote: Compressing objects: 4% (44762/1119036) remote: Compressing objects: 4% (54415/1119036) remote: Compressing objects: 5% (55952/1119036) remote: Compressing objects: 6% (67143/1119036) remote: Compressing objects: 6% (73908/1119036) remote: Compressing objects: 7% (78333/1119036) remote: Compressing objects: 8% (89523/1119036) remote: Compressing objects: 8% (91641/1119036) remote: Compressing objects: 9% (100714/1119036) remote: Compressing objects: 9% (104722/1119036) remote: Compressing objects: 10% (111904/1119036) remote: Compressing objects: 10% (114877/1119036) remote: Compressing objects: 11% (123094/1119036) remote: Compressing objects: 11% (127897/1119036) remote: Compressing objects: 12% (134285/1119036) remote: Compressing objects: 13% (145475/1119036) remote: Compressing objects: 13% (146759/1119036) remote: Compressing objects: 14% (156666/1119036) remote: Compressing objects: 15% (167856/1119036) remote: Compressing objects: 15% (170149/1119036) remote: Compressing objects: 16% (179046/1119036) remote: Compressing objects: 17% (190237/1119036) remote: Compressing objects: 17% (192106/1119036) remote: Compressing objects: 18% (201427/1119036) remote: Compressing objects: 19% (212617/1119036) remote: Compressing objects: 19% (215905/1119036) remote: Compressing objects: 20% (223808/1119036) remote: Compressing objects: 21% (234998/1119036) remote: Compressing objects: 21% (238148/1119036) remote: Compressing objects: 22% (246188/1119036) remote: Compressing objects: 23% (257379/1119036) remote: Compressing objects: 23% (262065/1119036) remote: Compressing objects: 24% (268569/1119036) remote: Compressing objects: 25% (279759/1119036) remote: Compressing objects: 26% (290950/1119036) remote: Compressing objects: 27% (302140/1119036) remote: Compressing objects: 28% (313331/1119036) remote: Compressing objects: 29% (324521/1119036) remote: Compressing objects: 29% (325818/1119036) remote: Compressing objects: 30% (335711/1119036) remote: Compressing objects: 30% (340291/1119036) remote: Compressing objects: 31% (346902/1119036) remote: Compressing objects: 31% (352701/1119036) remote: Compressing objects: 32% (358092/1119036) remote: Compressing objects: 32% (367977/1119036) remote: Compressing objects: 33% (369282/1119036) remote: Compressing objects: 34% (380473/1119036) remote: Compressing objects: 34% (384700/1119036) remote: Compressing objects: 35% (391663/1119036) remote: Compressing objects: 35% (397002/1119036) remote: Compressing objects: 36% (402853/1119036) remote: Compressing objects: 36% (407959/1119036) remote: Compressing objects: 37% (414044/1119036) remote: Compressing objects: 37% (417149/1119036) remote: Compressing objects: 37% (423850/1119036) remote: Compressing objects: 38% (425234/1119036) remote: Compressing objects: 38% (430400/1119036) remote: Compressing objects: 38% (430436/1119036) remote: Compressing objects: 38% (432355/1119036) remote: Compressing objects: 39% (436425/1119036) remote: Compressing objects: 39% (438347/1119036) remote: Compressing objects: 39% (445379/1119036) remote: Compressing objects: 40% (447615/1119036) remote: Compressing objects: 40% (451709/1119036) remote: Compressing objects: 41% (458805/1119036) remote: Compressing objects: 41% (462946/1119036) remote: Compressing objects: 42% (469996/1119036) remote: Compressing objects: 42% (475155/1119036) remote: Compressing objects: 43% (481186/1119036) remote: Compressing objects: 43% (483283/1119036) remote: Compressing objects: 43% (490838/1119036) remote: Compressing objects: 44% (492376/1119036) remote: Compressing objects: 44% (498264/1119036) remote: Compressing objects: 45% (503567/1119036) remote: Compressing objects: 45% (504801/1119036) remote: Compressing objects: 45% (512026/1119036) remote: Compressing objects: 46% (514757/1119036) remote: Compressing objects: 46% (521174/1119036) remote: Compressing objects: 47% (525947/1119036) remote: Compressing objects: 47% (529583/1119036) remote: Compressing objects: 47% (536447/1119036) remote: Compressing objects: 48% (537138/1119036) remote: Compressing objects: 48% (541771/1119036) remote: Compressing objects: 48% (547713/1119036) remote: Compressing objects: 49% (548328/1119036) remote: Compressing objects: 49% (558327/1119036) remote: Compressing objects: 50% (559518/1119036) remote: Compressing objects: 50% (565440/1119036) remote: Compressing objects: 51% (570709/1119036) remote: Compressing objects: 51% (573325/1119036) remote: Compressing objects: 51% (580059/1119036) remote: Compressing objects: 52% (581899/1119036) remote: Compressing objects: 52% (586721/1119036) remote: Compressing objects: 52% (592979/1119036) remote: Compressing objects: 53% (593090/1119036) remote: Compressing objects: 53% (596627/1119036) remote: Compressing objects: 53% (600274/1119036) remote: Compressing objects: 53% (603988/1119036) remote: Compressing objects: 54% (604280/1119036) remote: Compressing objects: 54% (607104/1119036) remote: Compressing objects: 54% (610290/1119036) remote: Compressing objects: 54% (612973/1119036) remote: Compressing objects: 54% (613510/1119036) remote: Compressing objects: 55% (615470/1119036) remote: Compressing objects: 55% (617986/1119036) remote: Compressing objects: 55% (621258/1119036) remote: Compressing objects: 55% (624730/1119036) remote: Compressing objects: 56% (626661/1119036) remote: Compressing objects: 56% (628619/1119036) remote: Compressing objects: 56% (631418/1119036) remote: Compressing objects: 56% (633933/1119036) remote: Compressing objects: 56% (636672/1119036) remote: Compressing objects: 57% (637851/1119036) remote: Compressing objects: 57% (639281/1119036) remote: Compressing objects: 57% (642086/1119036) remote: Compressing objects: 57% (644509/1119036) remote: Compressing objects: 57% (647260/1119036) remote: Compressing objects: 58% (649041/1119036) remote: Compressing objects: 58% (651405/1119036) remote: Compressing objects: 58% (654720/1119036) remote: Compressing objects: 58% (658134/1119036) remote: Compressing objects: 59% (660232/1119036) remote: Compressing objects: 59% (661288/1119036) remote: Compressing objects: 59% (665570/1119036) remote: Compressing objects: 59% (670160/1119036) remote: Compressing objects: 60% (671422/1119036) remote: Compressing objects: 60% (674868/1119036) remote: Compressing objects: 60% (679691/1119036) remote: Compressing objects: 61% (682612/1119036) remote: Compressing objects: 61% (684451/1119036) remote: Compressing objects: 61% (687755/1119036) remote: Compressing objects: 61% (692460/1119036) remote: Compressing objects: 62% (693803/1119036) remote: Compressing objects: 62% (696693/1119036) remote: Compressing objects: 62% (701716/1119036) remote: Compressing objects: 63% (704993/1119036) remote: Compressing objects: 63% (706255/1119036) remote: Compressing objects: 63% (708899/1119036) remote: Compressing objects: 63% (711017/1119036) remote: Compressing objects: 63% (712902/1119036) remote: Compressing objects: 63% (713461/1119036) remote: Compressing objects: 64% (716184/1119036) remote: Compressing objects: 64% (716578/1119036) remote: Compressing objects: 64% (719279/1119036) remote: Compressing objects: 64% (722262/1119036) remote: Compressing objects: 64% (725130/1119036) remote: Compressing objects: 65% (727374/1119036) remote: Compressing objects: 65% (728711/1119036) remote: Compressing objects: 65% (732246/1119036) remote: Compressing objects: 65% (735761/1119036) remote: Compressing objects: 66% (738564/1119036) remote: Compressing objects: 66% (738667/1119036) remote: Compressing objects: 66% (741213/1119036) remote: Compressing objects: 66% (744321/1119036) remote: Compressing objects: 66% (747883/1119036) remote: Compressing objects: 67% (749755/1119036) remote: Compressing objects: 67% (750601/1119036) remote: Compressing objects: 67% (753660/1119036) remote: Compressing objects: 67% (756299/1119036) remote: Compressing objects: 67% (758885/1119036) remote: Compressing objects: 68% (760945/1119036) remote: Compressing objects: 68% (761836/1119036) remote: Compressing objects: 68% (765014/1119036) remote: Compressing objects: 68% (767929/1119036) remote: Compressing objects: 68% (770549/1119036) remote: Compressing objects: 69% (772135/1119036) remote: Compressing objects: 69% (773744/1119036) remote: Compressing objects: 69% (776357/1119036) remote: Compressing objects: 69% (779935/1119036) remote: Compressing objects: 69% (783193/1119036) remote: Compressing objects: 70% (783326/1119036) remote: Compressing objects: 70% (785264/1119036) remote: Compressing objects: 70% (786971/1119036) remote: Compressing objects: 70% (789112/1119036) remote: Compressing objects: 70% (791276/1119036) remote: Compressing objects: 70% (791739/1119036) remote: Compressing objects: 70% (792872/1119036) remote: Compressing objects: 71% (794516/1119036) remote: Compressing objects: 71% (795233/1119036) remote: Compressing objects: 71% (797689/1119036) remote: Compressing objects: 71% (800736/1119036) remote: Compressing objects: 71% (803052/1119036) remote: Compressing objects: 72% (805706/1119036) remote: Compressing objects: 72% (806821/1119036) remote: Compressing objects: 72% (810512/1119036) remote: Compressing objects: 72% (813668/1119036) remote: Compressing objects: 72% (816212/1119036) remote: Compressing objects: 73% (816897/1119036) remote: Compressing objects: 73% (818957/1119036) remote: Compressing objects: 73% (821090/1119036) remote: Compressing objects: 73% (823741/1119036) remote: Compressing objects: 73% (825999/1119036) remote: Compressing objects: 73% (828007/1119036) remote: Compressing objects: 74% (828087/1119036) remote: Compressing objects: 74% (830218/1119036) remote: Compressing objects: 74% (832157/1119036) remote: Compressing objects: 74% (834565/1119036) remote: Compressing objects: 74% (836403/1119036) remote: Compressing objects: 74% (838230/1119036) remote: Compressing objects: 75% (839277/1119036) remote: Compressing objects: 75% (840151/1119036) remote: Compressing objects: 75% (842251/1119036) remote: Compressing objects: 75% (844167/1119036) remote: Compressing objects: 75% (846081/1119036) remote: Compressing objects: 75% (848146/1119036) remote: Compressing objects: 75% (850082/1119036) remote: Compressing objects: 76% (850468/1119036) remote: Compressing objects: 76% (852540/1119036) remote: Compressing objects: 76% (855492/1119036) remote: Compressing objects: 76% (858646/1119036) remote: Compressing objects: 76% (860756/1119036) remote: Compressing objects: 77% (861658/1119036) remote: Compressing objects: 77% (862445/1119036) remote: Compressing objects: 77% (863620/1119036) remote: Compressing objects: 77% (866219/1119036) remote: Compressing objects: 77% (869901/1119036) remote: Compressing objects: 77% (872451/1119036) remote: Compressing objects: 78% (872849/1119036) remote: Compressing objects: 78% (875563/1119036) remote: Compressing objects: 78% (878497/1119036) remote: Compressing objects: 78% (881095/1119036) remote: Compressing objects: 78% (883737/1119036) remote: Compressing objects: 79% (884039/1119036) remote: Compressing objects: 79% (886135/1119036) remote: Compressing objects: 79% (889485/1119036) remote: Compressing objects: 79% (891787/1119036) remote: Compressing objects: 79% (894015/1119036) remote: Compressing objects: 80% (895229/1119036) remote: Compressing objects: 80% (897457/1119036) remote: Compressing objects: 80% (900132/1119036) remote: Compressing objects: 80% (902729/1119036) remote: Compressing objects: 80% (904562/1119036) remote: Compressing objects: 81% (906420/1119036) remote: Compressing objects: 81% (906817/1119036) remote: Compressing objects: 81% (908624/1119036) remote: Compressing objects: 81% (910272/1119036) remote: Compressing objects: 81% (911980/1119036) remote: Compressing objects: 81% (913507/1119036) remote: Compressing objects: 81% (915169/1119036) remote: Compressing objects: 81% (916913/1119036) remote: Compressing objects: 82% (917610/1119036) remote: Compressing objects: 82% (918988/1119036) remote: Compressing objects: 82% (921177/1119036) remote: Compressing objects: 82% (922688/1119036) remote: Compressing objects: 82% (924202/1119036) remote: Compressing objects: 82% (926022/1119036) remote: Compressing objects: 82% (928014/1119036) remote: Compressing objects: 83% (928800/1119036) remote: Compressing objects: 83% (929616/1119036) remote: Compressing objects: 83% (929776/1119036) remote: Compressing objects: 83% (930165/1119036) remote: Compressing objects: 83% (932323/1119036) remote: Compressing objects: 83% (934156/1119036) remote: Compressing objects: 83% (936725/1119036) remote: Compressing objects: 83% (939301/1119036) remote: Compressing objects: 84% (939991/1119036) remote: Compressing objects: 84% (941475/1119036) remote: Compressing objects: 84% (943781/1119036) remote: Compressing objects: 84% (946679/1119036) remote: Compressing objects: 84% (949330/1119036) remote: Compressing objects: 85% (951181/1119036) remote: Compressing objects: 85% (952454/1119036) remote: Compressing objects: 85% (955600/1119036) remote: Compressing objects: 85% (958465/1119036) remote: Compressing objects: 85% (960790/1119036) remote: Compressing objects: 86% (962371/1119036) remote: Compressing objects: 86% (963191/1119036) remote: Compressing objects: 86% (965970/1119036) remote: Compressing objects: 86% (969478/1119036) remote: Compressing objects: 86% (972662/1119036) remote: Compressing objects: 87% (973562/1119036) remote: Compressing objects: 87% (975764/1119036) remote: Compressing objects: 87% (978555/1119036) remote: Compressing objects: 88% (984752/1119036) remote: Compressing objects: 88% (993640/1119036) remote: Compressing objects: 88% (995793/1119036) remote: Compressing objects: 89% (995943/1119036) remote: Compressing objects: 89% (998115/1119036) remote: Compressing objects: 89% (1000157/1119036) remote: Compressing objects: 89% (1002324/1119036) remote: Compressing objects: 89% (1004455/1119036) remote: Compressing objects: 89% (1006952/1119036) remote: Compressing objects: 90% (1007133/1119036) remote: Compressing objects: 90% (1014316/1119036) remote: Compressing objects: 90% (1016136/1119036) remote: Compressing objects: 90% (1016679/1119036) remote: Compressing objects: 91% (1018323/1119036) remote: Compressing objects: 91% (1018931/1119036) remote: Compressing objects: 91% (1023682/1119036) remote: Compressing objects: 91% (1026119/1119036) remote: Compressing objects: 91% (1028149/1119036) remote: Compressing objects: 92% (1029514/1119036) remote: Compressing objects: 92% (1030821/1119036) remote: Compressing objects: 92% (1033037/1119036) remote: Compressing objects: 92% (1035509/1119036) remote: Compressing objects: 92% (1038037/1119036) remote: Compressing objects: 92% (1040414/1119036) remote: Compressing objects: 93% (1040704/1119036) remote: Compressing objects: 93% (1042483/1119036) remote: Compressing objects: 93% (1044647/1119036) remote: Compressing objects: 93% (1047327/1119036) remote: Compressing objects: 93% (1049774/1119036) remote: Compressing objects: 93% (1051758/1119036) remote: Compressing objects: 94% (1051894/1119036) remote: Compressing objects: 94% (1053856/1119036) remote: Compressing objects: 94% (1055836/1119036) remote: Compressing objects: 94% (1058031/1119036) remote: Compressing objects: 94% (1060121/1119036) remote: Compressing objects: 94% (1061875/1119036) remote: Compressing objects: 95% (1063085/1119036) remote: Compressing objects: 95% (1063890/1119036) remote: Compressing objects: 95% (1065824/1119036) remote: Compressing objects: 95% (1067512/1119036) remote: Compressing objects: 95% (1069095/1119036) remote: Compressing objects: 95% (1071124/1119036) remote: Compressing objects: 95% (1073144/1119036) remote: Compressing objects: 96% (1074275/1119036) remote: Compressing objects: 96% (1075165/1119036) remote: Compressing objects: 96% (1076817/1119036) remote: Compressing objects: 96% (1077082/1119036) remote: Compressing objects: 96% (1077882/1119036) remote: Compressing objects: 96% (1080024/1119036) remote: Compressing objects: 96% (1081983/1119036) remote: Compressing objects: 96% (1084252/1119036) remote: Compressing objects: 97% (1085465/1119036) remote: Compressing objects: 97% (1086208/1119036) remote: Compressing objects: 97% (1088272/1119036) remote: Compressing objects: 97% (1090419/1119036) remote: Compressing objects: 97% (1093455/1119036) remote: Compressing objects: 97% (1096506/1119036) remote: Compressing objects: 98% (1096656/1119036) remote: Compressing objects: 98% (1098459/1119036) remote: Compressing objects: 98% (1100614/1119036) remote: Compressing objects: 98% (1102688/1119036) remote: Compressing objects: 98% (1104630/1119036) remote: Compressing objects: 98% (1106760/1119036) remote: Compressing objects: 99% (1107846/1119036) remote: Compressing objects: 99% (1108405/1119036) remote: Compressing objects: 99% (1109969/1119036) remote: Compressing objects: 99% (1111761/1119036) remote: Compressing objects: 99% (1113165/1119036) remote: Compressing objects: 99% (1114647/1119036) remote: Compressing objects: 99% (1116221/1119036) remote: Compressing objects: 99% (1117831/1119036) remote: Compressing objects: 100% (1119036/1119036) remote: Compressing objects: 100% (1119036/1119036), done. Receiving objects: 0% (1/4976311) Receiving objects: 1% (49764/4976311), 14.56 MiB | 29.12 MiB/s Receiving objects: 1% (80165/4976311), 14.56 MiB | 29.12 MiB/s Receiving objects: 2% (99527/4976311), 28.87 MiB | 28.87 MiB/s Receiving objects: 3% (149290/4976311), 43.86 MiB | 29.23 MiB/s Receiving objects: 3% (172803/4976311), 43.86 MiB | 29.23 MiB/s Receiving objects: 4% (199053/4976311), 58.36 MiB | 29.18 MiB/s Receiving objects: 5% (248816/4976311), 72.78 MiB | 29.11 MiB/s Receiving objects: 5% (274804/4976311), 72.78 MiB | 29.11 MiB/s Receiving objects: 6% (298579/4976311), 86.56 MiB | 28.85 MiB/s Receiving objects: 7% (348342/4976311), 99.69 MiB | 28.48 MiB/s Receiving objects: 7% (388906/4976311), 99.69 MiB | 28.48 MiB/s Receiving objects: 8% (398105/4976311), 112.32 MiB | 28.09 MiB/s Receiving objects: 8% (402187/4976311), 115.27 MiB | 22.29 MiB/s Receiving objects: 8% (403317/4976311), 115.47 MiB | 19.12 MiB/s Receiving objects: 8% (405128/4976311), 116.33 MiB | 9.58 MiB/s Receiving objects: 8% (405960/4976311), 116.64 MiB | 2.75 MiB/s Receiving objects: 8% (406145/4976311), 116.64 MiB | 2.75 MiB/s Receiving objects: 8% (407217/4976311), 116.93 MiB | 336.00 KiB/s Receiving objects: 8% (408597/4976311), 117.44 MiB | 327.00 KiB/s Receiving objects: 8% (409965/4976311), 117.92 MiB | 320.00 KiB/s Receiving objects: 8% (411298/4976311), 118.41 MiB | 305.00 KiB/s Receiving objects: 8% (412579/4976311), 118.86 MiB | 470.00 KiB/s Receiving objects: 8% (414046/4976311), 119.39 MiB | 496.00 KiB/s Receiving objects: 8% (415179/4976311), 119.85 MiB | 486.00 KiB/s Receiving objects: 8% (416381/4976311), 120.30 MiB | 482.00 KiB/s Receiving objects: 8% (417705/4976311), 120.77 MiB | 483.00 KiB/s Receiving objects: 8% (419182/4976311), 121.30 MiB | 486.00 KiB/s Receiving objects: 8% (420527/4976311), 121.83 MiB | 487.00 KiB/s Receiving objects: 8% (422035/4976311), 122.36 MiB | 510.00 KiB/s Receiving objects: 8% (423293/4976311), 122.79 MiB | 506.00 KiB/s Receiving objects: 8% (424641/4976311), 123.23 MiB | 485.00 KiB/s Receiving objects: 8% (425937/4976311), 123.71 MiB | 477.00 KiB/s Receiving objects: 8% (427222/4976311), 124.20 MiB | 464.00 KiB/s Receiving objects: 8% (428514/4976311), 124.70 MiB | 478.00 KiB/s Receiving objects: 8% (429936/4976311), 124.95 MiB | 480.00 KiB/s Receiving objects: 8% (431307/4976311), 125.52 MiB | 508.00 KiB/s Receiving objects: 9% (447868/4976311), 126.43 MiB | 611.00 KiB/s Receiving objects: 9% (481944/4976311), 126.43 MiB | 611.00 KiB/s Receiving objects: 10% (497632/4976311), 140.84 MiB | 3.70 MiB/s Receiving objects: 11% (547395/4976311), 140.84 MiB | 3.70 MiB/s Receiving objects: 12% (597158/4976311), 140.84 MiB | 3.70 MiB/s Receiving objects: 13% (646921/4976311), 159.32 MiB | 7.73 MiB/s Receiving objects: 14% (696684/4976311), 159.32 MiB | 7.73 MiB/s Receiving objects: 14% (714687/4976311), 159.32 MiB | 7.73 MiB/s Receiving objects: 14% (721155/4976311), 173.25 MiB | 10.72 MiB/s Receiving objects: 14% (739524/4976311), 175.19 MiB | 11.05 MiB/s Receiving objects: 15% (746447/4976311), 176.04 MiB | 11.19 MiB/s Receiving objects: 15% (758606/4976311), 176.78 MiB | 11.31 MiB/s Receiving objects: 15% (775548/4976311), 179.10 MiB | 8.48 MiB/s Receiving objects: 16% (796210/4976311), 180.75 MiB | 2.02 MiB/s Receiving objects: 16% (797570/4976311), 180.75 MiB | 2.02 MiB/s Receiving objects: 16% (818500/4976311), 182.69 MiB | 1.83 MiB/s Receiving objects: 16% (830064/4976311), 184.43 MiB | 1.44 MiB/s Receiving objects: 16% (831615/4976311), 184.43 MiB | 1.44 MiB/s Receiving objects: 16% (841876/4976311), 185.28 MiB | 1.16 MiB/s Receiving objects: 17% (845973/4976311), 185.71 MiB | 1.08 MiB/s Receiving objects: 17% (855684/4976311), 186.34 MiB | 1.05 MiB/s Receiving objects: 17% (871173/4976311), 187.67 MiB | 956.00 KiB/s Receiving objects: 17% (887579/4976311), 189.20 MiB | 917.00 KiB/s Receiving objects: 18% (895736/4976311), 189.84 MiB | 1.19 MiB/s Receiving objects: 18% (902349/4976311), 190.44 MiB | 1.23 MiB/s Receiving objects: 18% (919988/4976311), 191.98 MiB | 1.38 MiB/s Receiving objects: 18% (935974/4976311), 193.25 MiB | 1.36 MiB/s Receiving objects: 19% (945500/4976311), 193.82 MiB | 1.36 MiB/s Receiving objects: 19% (953473/4976311), 194.50 MiB | 1.34 MiB/s Receiving objects: 20% (995263/4976311), 194.50 MiB | 1.34 MiB/s Receiving objects: 21% (1045026/4976311), 194.50 MiB | 1.34 MiB/s Receiving objects: 22% (1094789/4976311), 194.50 MiB | 1.34 MiB/s Receiving objects: 23% (1144552/4976311), 194.50 MiB | 1.34 MiB/s Receiving objects: 24% (1194315/4976311), 217.64 MiB | 6.27 MiB/s Receiving objects: 25% (1244078/4976311), 217.64 MiB | 6.27 MiB/s Receiving objects: 26% (1293841/4976311), 217.64 MiB | 6.27 MiB/s Receiving objects: 27% (1343604/4976311), 217.64 MiB | 6.27 MiB/s Receiving objects: 28% (1393368/4976311), 217.64 MiB | 6.27 MiB/s Receiving objects: 29% (1443131/4976311), 217.64 MiB | 6.27 MiB/s Receiving objects: 30% (1492894/4976311), 247.94 MiB | 12.83 MiB/s Receiving objects: 30% (1509318/4976311), 247.94 MiB | 12.83 MiB/s Receiving objects: 31% (1542657/4976311), 247.94 MiB | 12.83 MiB/s Receiving objects: 32% (1592420/4976311), 247.94 MiB | 12.83 MiB/s Receiving objects: 33% (1642183/4976311), 247.94 MiB | 12.83 MiB/s Receiving objects: 34% (1691946/4976311), 247.94 MiB | 12.83 MiB/s Receiving objects: 35% (1741709/4976311), 247.94 MiB | 12.83 MiB/s Receiving objects: 36% (1791472/4976311), 247.94 MiB | 12.83 MiB/s Receiving objects: 37% (1841236/4976311), 276.51 MiB | 19.07 MiB/s Receiving objects: 38% (1890999/4976311), 276.51 MiB | 19.07 MiB/s Receiving objects: 39% (1940762/4976311), 276.51 MiB | 19.07 MiB/s Receiving objects: 40% (1990525/4976311), 276.51 MiB | 19.07 MiB/s Receiving objects: 41% (2040288/4976311), 276.51 MiB | 19.07 MiB/s Receiving objects: 42% (2090051/4976311), 276.51 MiB | 19.07 MiB/s Receiving objects: 43% (2139814/4976311), 276.51 MiB | 19.07 MiB/s Receiving objects: 44% (2189577/4976311), 276.51 MiB | 19.07 MiB/s Receiving objects: 45% (2239340/4976311), 300.94 MiB | 24.31 MiB/s Receiving objects: 45% (2269162/4976311), 300.94 MiB | 24.31 MiB/s Receiving objects: 46% (2289104/4976311), 300.94 MiB | 24.31 MiB/s Receiving objects: 47% (2338867/4976311), 300.94 MiB | 24.31 MiB/s Receiving objects: 48% (2388630/4976311), 300.94 MiB | 24.31 MiB/s Receiving objects: 49% (2438393/4976311), 300.94 MiB | 24.31 MiB/s Receiving objects: 50% (2488156/4976311), 300.94 MiB | 24.31 MiB/s Receiving objects: 51% (2537919/4976311), 300.94 MiB | 24.31 MiB/s Receiving objects: 52% (2587682/4976311), 300.94 MiB | 24.31 MiB/s Receiving objects: 53% (2637445/4976311), 325.11 MiB | 29.54 MiB/s Receiving objects: 54% (2687208/4976311), 325.11 MiB | 29.54 MiB/s Receiving objects: 55% (2736972/4976311), 325.11 MiB | 29.54 MiB/s Receiving objects: 56% (2786735/4976311), 325.11 MiB | 29.54 MiB/s Receiving objects: 57% (2836498/4976311), 325.11 MiB | 29.54 MiB/s Receiving objects: 58% (2886261/4976311), 325.11 MiB | 29.54 MiB/s Receiving objects: 59% (2936024/4976311), 325.11 MiB | 29.54 MiB/s Receiving objects: 60% (2985787/4976311), 325.11 MiB | 29.54 MiB/s Receiving objects: 61% (3035550/4976311), 325.11 MiB | 29.54 MiB/s Receiving objects: 62% (3085313/4976311), 348.91 MiB | 34.70 MiB/s Receiving objects: 62% (3105080/4976311), 348.91 MiB | 34.70 MiB/s Receiving objects: 63% (3135076/4976311), 348.91 MiB | 34.70 MiB/s Receiving objects: 64% (3184840/4976311), 348.91 MiB | 34.70 MiB/s Receiving objects: 65% (3234603/4976311), 348.91 MiB | 34.70 MiB/s Receiving objects: 66% (3284366/4976311), 348.91 MiB | 34.70 MiB/s Receiving objects: 67% (3334129/4976311), 348.91 MiB | 34.70 MiB/s Receiving objects: 67% (3372399/4976311), 378.99 MiB | 41.09 MiB/s Receiving objects: 68% (3383892/4976311), 378.99 MiB | 41.09 MiB/s Receiving objects: 68% (3424076/4976311), 396.75 MiB | 39.75 MiB/s Receiving objects: 69% (3433655/4976311), 396.75 MiB | 39.75 MiB/s Receiving objects: 69% (3453915/4976311), 412.82 MiB | 30.21 MiB/s Receiving objects: 70% (3483418/4976311), 419.30 MiB | 26.17 MiB/s Receiving objects: 70% (3485336/4976311), 429.32 MiB | 23.04 MiB/s Receiving objects: 70% (3519999/4976311), 455.98 MiB | 19.54 MiB/s Receiving objects: 70% (3522840/4976311), 464.39 MiB | 16.60 MiB/s Receiving objects: 71% (3533181/4976311), 472.39 MiB | 16.72 MiB/s Receiving objects: 71% (3548503/4976311), 479.20 MiB | 16.52 MiB/s Receiving objects: 72% (3582944/4976311), 489.32 MiB | 16.93 MiB/s Receiving objects: 72% (3600131/4976311), 496.10 MiB | 17.03 MiB/s Receiving objects: 73% (3632708/4976311), 500.72 MiB | 15.83 MiB/s Receiving objects: 73% (3654163/4976311), 509.05 MiB | 16.12 MiB/s Receiving objects: 74% (3682471/4976311), 515.07 MiB | 13.10 MiB/s Receiving objects: 74% (3703062/4976311), 521.83 MiB | 13.42 MiB/s Receiving objects: 75% (3732234/4976311), 521.83 MiB | 13.42 MiB/s Receiving objects: 75% (3772399/4976311), 551.41 MiB | 17.55 MiB/s Receiving objects: 76% (3781997/4976311), 551.41 MiB | 17.55 MiB/s Receiving objects: 77% (3831760/4976311), 570.00 MiB | 20.17 MiB/s Receiving objects: 77% (3843111/4976311), 581.34 MiB | 20.44 MiB/s Receiving objects: 78% (3881523/4976311), 593.37 MiB | 21.61 MiB/s Receiving objects: 78% (3917578/4976311), 607.69 MiB | 23.77 MiB/s Receiving objects: 79% (3931286/4976311), 607.69 MiB | 23.77 MiB/s Receiving objects: 79% (3973190/4976311), 628.39 MiB | 25.09 MiB/s Receiving objects: 80% (3981049/4976311), 628.39 MiB | 25.09 MiB/s Receiving objects: 80% (4026234/4976311), 651.93 MiB | 26.34 MiB/s Receiving objects: 81% (4030812/4976311), 651.93 MiB | 26.34 MiB/s Receiving objects: 81% (4075861/4976311), 676.82 MiB | 23.65 MiB/s Receiving objects: 82% (4080576/4976311), 676.82 MiB | 23.65 MiB/s Receiving objects: 82% (4092512/4976311), 690.15 MiB | 21.43 MiB/s Receiving objects: 82% (4102477/4976311), 695.00 MiB | 14.10 MiB/s Receiving objects: 82% (4102605/4976311), 695.00 MiB | 14.10 MiB/s Receiving objects: 83% (4130339/4976311), 703.14 MiB | 11.53 MiB/s Receiving objects: 83% (4130688/4976311), 703.14 MiB | 11.53 MiB/s Receiving objects: 83% (4142221/4976311), 710.37 MiB | 7.68 MiB/s Receiving objects: 83% (4154200/4976311), 726.46 MiB | 7.99 MiB/s Receiving objects: 84% (4180102/4976311), 739.55 MiB | 9.14 MiB/s Receiving objects: 84% (4193972/4976311), 753.75 MiB | 10.94 MiB/s Receiving objects: 84% (4225337/4976311), 766.67 MiB | 15.25 MiB/s Receiving objects: 85% (4229865/4976311), 766.67 MiB | 15.25 MiB/s Receiving objects: 85% (4268416/4976311), 788.07 MiB | 18.02 MiB/s Receiving objects: 86% (4279628/4976311), 792.80 MiB | 18.18 MiB/s Receiving objects: 86% (4293731/4976311), 798.21 MiB | 17.17 MiB/s Receiving objects: 87% (4329391/4976311), 811.76 MiB | 18.83 MiB/s Receiving objects: 87% (4340038/4976311), 818.29 MiB | 17.38 MiB/s Receiving objects: 87% (4365314/4976311), 829.48 MiB | 14.56 MiB/s Receiving objects: 88% (4379154/4976311), 829.48 MiB | 14.56 MiB/s Receiving objects: 88% (4402255/4976311), 847.18 MiB | 14.36 MiB/s Receiving objects: 89% (4428917/4976311), 866.58 MiB | 17.43 MiB/s Receiving objects: 89% (4445519/4976311), 881.82 MiB | 19.73 MiB/s Receiving objects: 90% (4478680/4976311), 881.82 MiB | 19.73 MiB/s Receiving objects: 91% (4528444/4976311), 904.95 MiB | 23.66 MiB/s Receiving objects: 91% (4542830/4976311), 928.82 MiB | 25.95 MiB/s Receiving objects: 92% (4578207/4976311), 928.82 MiB | 25.95 MiB/s Receiving objects: 93% (4627970/4976311), 953.27 MiB | 29.92 MiB/s Receiving objects: 93% (4646288/4976311), 981.43 MiB | 34.92 MiB/s Receiving objects: 94% (4677733/4976311), 1011.15 MiB | 40.29 MiB/s Receiving objects: 94% (4688130/4976311), 1.01 GiB | 44.31 MiB/s Receiving objects: 95% (4727496/4976311), 1.01 GiB | 44.31 MiB/s Receiving objects: 96% (4777259/4976311), 1.03 GiB | 46.29 MiB/s Receiving objects: 96% (4806788/4976311), 1.05 GiB | 47.62 MiB/s Receiving objects: 97% (4827022/4976311), 1.05 GiB | 47.62 MiB/s Receiving objects: 98% (4876785/4976311), 1.07 GiB | 49.14 MiB/s Receiving objects: 98% (4912477/4976311), 1.09 GiB | 48.04 MiB/s Receiving objects: 98% (4915742/4976311), 1.09 GiB | 37.89 MiB/s Receiving objects: 98% (4919045/4976311), 1.09 GiB | 25.49 MiB/s Receiving objects: 98% (4923159/4976311), 1.10 GiB | 16.00 MiB/s Receiving objects: 99% (4926548/4976311), 1.10 GiB | 10.64 MiB/s Receiving objects: 99% (4927583/4976311), 1.10 GiB | 6.26 MiB/s Receiving objects: 99% (4930395/4976311), 1.10 GiB | 2.69 MiB/s Receiving objects: 99% (4931903/4976311), 1.11 GiB | 2.65 MiB/s Receiving objects: 99% (4933318/4976311), 1.11 GiB | 2.47 MiB/s Receiving objects: 99% (4933935/4976311), 1.11 GiB | 2.27 MiB/s Receiving objects: 99% (4936111/4976311), 1.11 GiB | 2.00 MiB/s Receiving objects: 99% (4938563/4976311), 1.11 GiB | 1.70 MiB/s Receiving objects: 99% (4940958/4976311), 1.11 GiB | 1.43 MiB/s at org.jenkinsci.plugins.gitclient.CliGitAPIImpl.launchCommandIn(CliGitAPIImpl.java:2681) at org.jenkinsci.plugins.gitclient.CliGitAPIImpl.launchCommandWithCredentials(CliGitAPIImpl.java:2102) at org.jenkinsci.plugins.gitclient.CliGitAPIImpl.access$500(CliGitAPIImpl.java:86) at org.jenkinsci.plugins.gitclient.CliGitAPIImpl$1.execute(CliGitAPIImpl.java:624) at org.jenkinsci.plugins.gitclient.RemoteGitImpl$CommandInvocationHandler$GitCommandMasterToSlaveCallable.call(RemoteGitImpl.java:160) at org.jenkinsci.plugins.gitclient.RemoteGitImpl$CommandInvocationHandler$GitCommandMasterToSlaveCallable.call(RemoteGitImpl.java:153) at hudson.remoting.UserRequest.perform(UserRequest.java:211) at hudson.remoting.UserRequest.perform(UserRequest.java:54) at hudson.remoting.Request$2.run(Request.java:376) at hudson.remoting.InterceptingExecutorService.lambda$wrap$0(InterceptingExecutorService.java:78) ... 4 more Suppressed: hudson.remoting.Channel$CallSiteStackTrace: Remote call to green-dragon-23 at hudson.remoting.Channel.attachCallSiteStackTrace(Channel.java:1800) at hudson.remoting.UserRequest$ExceptionResponse.retrieve(UserRequest.java:356) at hudson.remoting.Channel.call(Channel.java:1001) at org.jenkinsci.plugins.gitclient.RemoteGitImpl$CommandInvocationHandler.execute(RemoteGitImpl.java:145) at sun.reflect.GeneratedMethodAccessor659.invoke(Unknown Source) at sun.reflect.DelegatingMethodAccessorImpl.invoke(DelegatingMethodAccessorImpl.java:43) at java.lang.reflect.Method.invoke(Method.java:498) at org.jenkinsci.plugins.gitclient.RemoteGitImpl$CommandInvocationHandler.invoke(RemoteGitImpl.java:131) at com.sun.proxy.$Proxy86.execute(Unknown Source) at hudson.plugins.git.GitSCM.fetchFrom(GitSCM.java:1002) at hudson.plugins.git.GitSCM.retrieveChanges(GitSCM.java:1245) at hudson.plugins.git.GitSCM.checkout(GitSCM.java:1305) at org.jenkinsci.plugins.workflow.steps.scm.SCMStep.checkout(SCMStep.java:129) at org.jenkinsci.plugins.workflow.steps.scm.SCMStep$StepExecutionImpl.run(SCMStep.java:97) at org.jenkinsci.plugins.workflow.steps.scm.SCMStep$StepExecutionImpl.run(SCMStep.java:84) at org.jenkinsci.plugins.workflow.steps.SynchronousNonBlockingStepExecution.lambda$start$0(SynchronousNonBlockingStepExecution.java:47) at java.util.concurrent.Executors$RunnableAdapter.call(Executors.java:511) ... 4 more [Pipeline] } [Pipeline] // dir [Pipeline] } [Pipeline] // timeout [Pipeline] } [Pipeline] // stage [Pipeline] stage [Pipeline] { (Test Clang 5.0.2) Stage "Test Clang 5.0.2" skipped due to earlier failure(s) [Pipeline] } [Pipeline] // stage [Pipeline] stage [Pipeline] { (Build Clang 7.0.1) Stage "Build Clang 7.0.1" skipped due to earlier failure(s) [Pipeline] } [Pipeline] // stage [Pipeline] stage [Pipeline] { (Test Clang 7.0.1) Stage "Test Clang 7.0.1" skipped due to earlier failure(s) [Pipeline] } [Pipeline] // stage [Pipeline] stage [Pipeline] { (Build Clang 9.0.0) Stage "Build Clang 9.0.0" skipped due to earlier failure(s) [Pipeline] } [Pipeline] // stage [Pipeline] stage [Pipeline] { (Test Clang 9.0.0) Stage "Test Clang 9.0.0" skipped due to earlier failure(s) [Pipeline] } [Pipeline] // stage [Pipeline] stage [Pipeline] { (Build Clang 11.0.1) Stage "Build Clang 11.0.1" skipped due to earlier failure(s) [Pipeline] } [Pipeline] // stage [Pipeline] stage [Pipeline] { (Test Clang 11.0.1) Stage "Test Clang 11.0.1" skipped due to earlier failure(s) [Pipeline] } [Pipeline] // stage [Pipeline] stage [Pipeline] { (Build Clang 13.0.0) Stage "Build Clang 13.0.0" skipped due to earlier failure(s) [Pipeline] } [Pipeline] // stage [Pipeline] stage [Pipeline] { (Test Clang 13.0.0) Stage "Test Clang 13.0.0" skipped due to earlier failure(s) [Pipeline] } [Pipeline] // stage [Pipeline] } [Pipeline] // withEnv [Pipeline] } [Pipeline] // node [Pipeline] End of Pipeline ERROR: Error fetching remote repo 'origin' ERROR: Timeout after 10 minutes Finished: FAILURE