Console Output

Skipping 163,627 KB.. Full Log
PASS: lldb-api :: functionalities/breakpoint/breakpoint_set_restart/TestBreakpointSetRestart.py (450 of 1923)
PASS: lldb-shell :: Register/Core/x86-32-freebsd-gp.test (451 of 1923)
PASS: lldb-api :: lang/c/step_over_no_deadlock/TestStepOverDoesntBlock.py (452 of 1923)
PASS: lldb-unit :: Process/Utility/./ProcessUtilityTests/10/16 (453 of 1923)
PASS: lldb-shell :: SymbolFile/symbol-binding.test (454 of 1923)
PASS: lldb-unit :: Language/Highlighting/./HighlighterTests/18/29 (455 of 1923)
UNSUPPORTED: lldb-shell :: ScriptInterpreter/Lua/nested_sessions.test (456 of 1923)
UNSUPPORTED: lldb-api :: functionalities/tsan/cpp_global_location/TestTsanCPPGlobalLocation.py (457 of 1923)
UNSUPPORTED: lldb-api :: functionalities/ubsan/basic/TestUbsanBasic.py (458 of 1923)
PASS: lldb-api :: lang/cpp/chained-calls/TestCppChainedCalls.py (459 of 1923)
PASS: lldb-api :: functionalities/breakpoint/breakpoint_command/TestBreakpointCommand.py (460 of 1923)
PASS: lldb-api :: commands/expression/rdar42038760/TestScalarURem.py (461 of 1923)
PASS: lldb-api :: python_api/exprpath_synthetic/TestExprPathSynthetic.py (462 of 1923)
PASS: lldb-api :: lang/cpp/llvm-style/TestLLVMStyle.py (463 of 1923)
PASS: lldb-shell :: ScriptInterpreter/Python/Crashlog/no_threadState.test (464 of 1923)
UNSUPPORTED: lldb-api :: tools/lldb-server/TestLldbGdbServer.py (465 of 1923)
PASS: lldb-api :: commands/platform/process/list/TestProcessList.py (466 of 1923)
PASS: lldb-unit :: Host/./HostTests/9/19 (467 of 1923)
PASS: lldb-api :: lang/objc/modules-compile-error/TestModulesCompileError.py (468 of 1923)
PASS: lldb-api :: lang/cpp/call-function/TestCallCPPFunction.py (469 of 1923)
PASS: lldb-unit :: Language/Highlighting/./HighlighterTests/24/29 (470 of 1923)
PASS: lldb-api :: functionalities/dynamic_value_child_count/TestDynamicValueChildCount.py (471 of 1923)
PASS: lldb-api :: commands/platform/basic/TestPlatformPython.py (472 of 1923)
PASS: lldb-unit :: DataFormatter/./LLDBFormatterTests/5/11 (473 of 1923)
PASS: lldb-api :: functionalities/data-formatter/synthupdate/TestSyntheticFilterRecompute.py (474 of 1923)
UNSUPPORTED: lldb-shell :: Register/x86-64-zmm-write.test (475 of 1923)
PASS: lldb-unit :: Platform/./LLDBPlatformTests/3/16 (476 of 1923)
UNSUPPORTED: lldb-shell :: Process/Windows/exception_access_violation.cpp (477 of 1923)
PASS: lldb-api :: commands/expression/import-std-module/vector/TestVectorFromStdModule.py (478 of 1923)
PASS: lldb-unit :: ObjectFile/Breakpad/./ObjectFileBreakpadTests/5/11 (479 of 1923)
PASS: lldb-api :: functionalities/archives/TestBSDArchives.py (480 of 1923)
PASS: lldb-unit :: SymbolFile/NativePDB/./SymbolFileNativePDBTests/11/15 (481 of 1923)
PASS: lldb-unit :: ObjectFile/Breakpad/./ObjectFileBreakpadTests/9/11 (482 of 1923)
PASS: lldb-api :: types/TestFloatTypes.py (483 of 1923)
PASS: lldb-shell :: ScriptInterpreter/Python/python.test (484 of 1923)
UNSUPPORTED: lldb-shell :: ScriptInterpreter/Lua/persistent_state.test (485 of 1923)
PASS: lldb-unit :: UnwindAssembly/x86/./UnwindAssemblyx86Tests/7/27 (486 of 1923)
PASS: lldb-api :: functionalities/data-formatter/data-formatter-objc/nsstring/TestDataFormatterNSString.py (487 of 1923)
PASS: lldb-unit :: SymbolFile/NativePDB/./SymbolFileNativePDBTests/13/15 (488 of 1923)
PASS: lldb-shell :: Breakpoint/jit-loader_jitlink_elf.test (489 of 1923)
PASS: lldb-unit :: debugserver/./debugserverTests/4/6 (490 of 1923)
PASS: lldb-unit :: Core/./LLDBCoreTests/12/22 (491 of 1923)
UNSUPPORTED: lldb-shell :: Breakpoint/case-insensitive.test (492 of 1923)
PASS: lldb-api :: python_api/disassemble-raw-data/TestDisassemble_VST1_64.py (493 of 1923)
UNSUPPORTED: lldb-api :: tools/lldb-server/memory-allocation/TestGdbRemoteMemoryAllocation.py (494 of 1923)
PASS: lldb-unit :: Interpreter/./InterpreterTests/5/14 (495 of 1923)
PASS: lldb-shell :: Register/x86-64-read.test (496 of 1923)
PASS: lldb-api :: functionalities/thread/concurrent_events/TestConcurrentTwoBreakpointThreads.py (497 of 1923)
PASS: lldb-api :: functionalities/memory/tag/TestMemoryTag.py (498 of 1923)
PASS: lldb-shell :: ScriptInterpreter/Python/command_import.test (499 of 1923)
PASS: lldb-api :: functionalities/breakpoint/scripted_bkpt/TestScriptedResolver.py (500 of 1923)
PASS: lldb-unit :: Host/./HostTests/11/19 (501 of 1923)
PASS: lldb-shell :: ObjectFile/ELF/minidebuginfo-corrupt-xz.yaml (502 of 1923)
PASS: lldb-unit :: UnwindAssembly/x86/./UnwindAssemblyx86Tests/13/27 (503 of 1923)
PASS: lldb-api :: python_api/lldbutil/frame/TestFrameUtils.py (504 of 1923)
UNSUPPORTED: lldb-api :: functionalities/thread/concurrent_events/TestConcurrentTwoBreakpointsOneWatchpoint.py (505 of 1923)
PASS: lldb-api :: lang/cpp/extern_c/TestExternCSymbols.py (506 of 1923)
PASS: lldb-api :: functionalities/inferior-changed/TestInferiorChanged.py (507 of 1923)
UNSUPPORTED: lldb-shell :: SymbolFile/DWARF/x86/dwarf5-line-strp.s (508 of 1923)
PASS: lldb-api :: macosx/nslog/TestDarwinNSLogOutput.py (509 of 1923)
PASS: lldb-api :: functionalities/postmortem/netbsd-core/TestNetBSDCore.py (510 of 1923)
PASS: lldb-unit :: SymbolFile/DWARF/./SymbolFileDWARFTests/20/29 (511 of 1923)
PASS: lldb-api :: commands/thread/backtrace/TestThreadBacktraceRepeat.py (512 of 1923)
PASS: lldb-unit :: ScriptInterpreter/Python/./ScriptInterpreterPythonTests/16/19 (513 of 1923)
PASS: lldb-api :: commands/frame/diagnose/bad-reference/TestBadReference.py (514 of 1923)
PASS: lldb-api :: commands/expression/completion/TestExprCompletion.py (515 of 1923)
PASS: lldb-unit :: SymbolFile/DWARF/./SymbolFileDWARFTests/0/29 (516 of 1923)
PASS: lldb-api :: functionalities/gdb_remote_client/TestGdbClientModuleLoad.py (517 of 1923)
UNSUPPORTED: lldb-api :: tools/lldb-server/vCont-threads/TestPartialResume.py (518 of 1923)
PASS: lldb-unit :: debugserver/./debugserverTests/1/6 (519 of 1923)
UNSUPPORTED: lldb-api :: functionalities/dyld-exec-linux/TestDyldExecLinux.py (520 of 1923)
UNSUPPORTED: lldb-api :: tools/lldb-server/inferior-crash/TestGdbRemoteSegFault.py (521 of 1923)
PASS: lldb-shell :: ObjectFile/PECOFF/dwarf-gnu-debuglink.yaml (522 of 1923)
PASS: lldb-api :: commands/target/dump-pcm-info/TestDumpPCMInfo.py (523 of 1923)
PASS: lldb-api :: functionalities/data-formatter/data-formatter-stl/libcxx/string_view/TestDataFormatterLibcxxStringView.py (524 of 1923)
PASS: lldb-unit :: SymbolFile/DWARF/./SymbolFileDWARFTests/28/29 (525 of 1923)
PASS: lldb-shell :: SymbolFile/Breakpad/inline-record.test (526 of 1923)
PASS: lldb-api :: commands/expression/ir-interpreter-phi-nodes/TestIRInterpreterPHINodes.py (527 of 1923)
PASS: lldb-api :: lang/objc/foundation/TestObjCMethodsString.py (528 of 1923)
PASS: lldb-api :: lang/c/const_variables/TestConstVariables.py (529 of 1923)
PASS: lldb-api :: python_api/function_symbol/TestSymbolAPI.py (530 of 1923)
PASS: lldb-unit :: DataFormatter/./LLDBFormatterTests/7/11 (531 of 1923)
PASS: lldb-api :: commands/expression/vector_of_enums/TestVectorOfEnums.py (532 of 1923)
PASS: lldb-api :: functionalities/unused-inlined-parameters/TestUnusedInlinedParameters.py (533 of 1923)
PASS: lldb-unit :: Language/Highlighting/./HighlighterTests/9/29 (534 of 1923)
PASS: lldb-unit :: DataFormatter/./LLDBFormatterTests/9/11 (535 of 1923)
UNSUPPORTED: lldb-shell :: SymbolFile/PDB/function-nested-block.test (536 of 1923)
PASS: lldb-shell :: Quit/TestQuitExitCode30.test (537 of 1923)
PASS: lldb-unit :: DataFormatter/./LLDBFormatterTests/10/11 (538 of 1923)
PASS: lldb-unit :: Process/minidump/./LLDBMinidumpTests/10/17 (539 of 1923)
PASS: lldb-unit :: Utility/./UtilityTests/14/30 (540 of 1923)
PASS: lldb-api :: commands/expression/ir-interpreter/TestIRInterpreter.py (541 of 1923)
UNSUPPORTED: lldb-api :: lang/cpp/modules-import/TestCXXModulesImport.py (542 of 1923)
PASS: lldb-shell :: Register/Core/x86-64-freebsd-multithread.test (543 of 1923)
UNSUPPORTED: lldb-api :: tools/lldb-server/TestGdbRemoteProcessInfo.py (544 of 1923)
PASS: lldb-api :: lang/objc/modules-inline-functions/TestModulesInlineFunctions.py (545 of 1923)
PASS: lldb-api :: lang/cpp/rvalue-references/TestRvalueReferences.py (546 of 1923)
PASS: lldb-api :: commands/disassemble/basic/TestDisassembleBreakpoint.py (547 of 1923)
PASS: lldb-api :: functionalities/thread/concurrent_events/TestConcurrentBreakpointOneDelayBreakpointThreads.py (548 of 1923)
UNSUPPORTED: lldb-api :: lang/c/typedef/Testtypedef.py (549 of 1923)
PASS: lldb-api :: commands/expression/import-std-module/weak_ptr/TestWeakPtrFromStdModule.py (550 of 1923)
PASS: lldb-api :: functionalities/thread/jump/TestThreadJump.py (551 of 1923)
PASS: lldb-shell :: SymbolFile/DWARF/x86/debug_rnglists-dwo.s (552 of 1923)
PASS: lldb-api :: functionalities/data-formatter/synthcapping/TestSyntheticCapping.py (553 of 1923)
UNSUPPORTED: lldb-shell :: SymbolFile/dissassemble-entry-point.s (554 of 1923)
PASS: lldb-unit :: Interpreter/./InterpreterTests/7/14 (555 of 1923)
UNSUPPORTED: lldb-api :: macosx/corefile-exception-reason/TestCorefileExceptionReason.py (556 of 1923)
UNSUPPORTED: lldb-shell :: SymbolFile/DWARF/x86/dwarf5-index-is-used.cpp (557 of 1923)
PASS: lldb-api :: lang/objc/objc-new-syntax/TestObjCNewSyntaxDictionary.py (558 of 1923)
UNSUPPORTED: lldb-api :: functionalities/ptrauth_diagnostics/BRAA_error/TestPtrauthBRAADiagnostic.py (559 of 1923)
PASS: lldb-unit :: Host/./HostTests/18/19 (560 of 1923)
PASS: lldb-api :: functionalities/gdb_remote_client/TestWasm.py (561 of 1923)
PASS: lldb-unit :: Symbol/./SymbolTests/3/16 (562 of 1923)
UNSUPPORTED: lldb-api :: functionalities/thread/concurrent_events/TestConcurrentCrashWithWatchpointBreakpointSignal.py (563 of 1923)
PASS: lldb-shell :: Register/x86-64-write.test (564 of 1923)
PASS: lldb-shell :: ObjectFile/ELF/PT_LOAD-overlap-PT_INTERP.yaml (565 of 1923)
UNSUPPORTED: lldb-api :: commands/trace/TestTraceStartStop.py (566 of 1923)
PASS: lldb-unit :: Process/minidump/./LLDBMinidumpTests/2/17 (567 of 1923)
PASS: lldb-shell :: SymbolFile/DWARF/x86/DW_TAG_variable-invalid_location.s (568 of 1923)
PASS: lldb-unit :: debugserver/./debugserverTests/2/6 (569 of 1923)
PASS: lldb-unit :: Symbol/./SymbolTests/15/16 (570 of 1923)
PASS: lldb-api :: commands/expression/dollar-in-variable/TestDollarInVariable.py (571 of 1923)
PASS: lldb-api :: functionalities/data-formatter/data-formatter-stl/generic/forward_list/TestDataFormatterGenericForwardList.py (572 of 1923)
UNSUPPORTED: lldb-shell :: SymbolFile/PDB/calling-conventions-x86.test (573 of 1923)
PASS: lldb-api :: lang/objc/objc-foundation-dictionary-empty/TestNSDictionary0.py (574 of 1923)
PASS: lldb-shell :: Watchpoint/SetErrorCases.test (575 of 1923)
PASS: lldb-api :: python_api/thread/TestThreadAPI.py (576 of 1923)
PASS: lldb-unit :: UnwindAssembly/x86/./UnwindAssemblyx86Tests/15/27 (577 of 1923)
PASS: lldb-api :: commands/frame/diagnose/array/TestArray.py (578 of 1923)
PASS: lldb-api :: lang/cpp/keywords_enabled/TestCppKeywordsEnabled.py (579 of 1923)
PASS: lldb-unit :: Symbol/./SymbolTests/11/16 (580 of 1923)
PASS: lldb-unit :: Expression/./ExpressionTests/3/22 (581 of 1923)
UNSUPPORTED: lldb-shell :: SymbolFile/NativePDB/function-types-classes.cpp (582 of 1923)
UNSUPPORTED: lldb-shell :: SymbolFile/PDB/compilands.test (583 of 1923)
PASS: lldb-unit :: Platform/./LLDBPlatformTests/14/16 (584 of 1923)
PASS: lldb-unit :: UnwindAssembly/x86/./UnwindAssemblyx86Tests/19/27 (585 of 1923)
PASS: lldb-api :: functionalities/gdb_remote_client/TestMultiprocess.py (586 of 1923)
PASS: lldb-unit :: SymbolFile/NativePDB/./SymbolFileNativePDBTests/12/15 (587 of 1923)
PASS: lldb-unit :: ScriptInterpreter/Python/./ScriptInterpreterPythonTests/6/19 (588 of 1923)
UNSUPPORTED: lldb-shell :: Subprocess/clone-follow-parent.test (589 of 1923)
UNSUPPORTED: lldb-shell :: Subprocess/vfork-follow-child-softbp.test (590 of 1923)
PASS: lldb-unit :: SymbolFile/DWARF/./SymbolFileDWARFTests/27/29 (591 of 1923)
PASS: lldb-shell :: Expr/TestIRMemoryMap.test (592 of 1923)
PASS: lldb-api :: functionalities/data-formatter/stringprinter/TestStringPrinter.py (593 of 1923)
PASS: lldb-api :: lang/cpp/global_operators/TestCppGlobalOperators.py (594 of 1923)
PASS: lldb-api :: api/command-return-object/TestSBCommandReturnObject.py (595 of 1923)
PASS: lldb-api :: lang/cpp/this/TestCPPThis.py (596 of 1923)
PASS: lldb-api :: functionalities/breakpoint/breakpoint_conditions/TestBreakpointConditions.py (597 of 1923)
PASS: lldb-unit :: Host/./HostTests/16/19 (598 of 1923)
UNSUPPORTED: lldb-api :: functionalities/postmortem/FreeBSDKernel/TestFreeBSDKernelLive.py (599 of 1923)
PASS: lldb-unit :: SymbolFile/DWARF/./SymbolFileDWARFTests/25/29 (600 of 1923)
PASS: lldb-shell :: SymbolFile/DWARF/x86/dwarf5-atomic.s (601 of 1923)
PASS: lldb-unit :: Host/./HostTests/1/19 (602 of 1923)
PASS: lldb-api :: functionalities/thread_plan/TestThreadPlanCommands.py (603 of 1923)
UNSUPPORTED: lldb-api :: functionalities/data-formatter/data-formatter-stl/libstdcpp/smart_ptr/TestDataFormatterStdSmartPtr.py (604 of 1923)
PASS: lldb-api :: lang/objc/modules/TestObjCModules.py (605 of 1923)
PASS: lldb-shell :: Driver/TestCommands.test (606 of 1923)
PASS: lldb-api :: python_api/sbmodule/TestSBModule.py (607 of 1923)
UNSUPPORTED: lldb-shell :: SymbolFile/DWARF/x86/find-variable-dwo.cpp (608 of 1923)
PASS: lldb-unit :: Platform/Android/./AdbClientTests/0/2 (609 of 1923)
PASS: lldb-api :: lang/objc/foundation/TestFoundationDisassembly.py (610 of 1923)
PASS: lldb-unit :: ScriptInterpreter/Python/./ScriptInterpreterPythonTests/8/19 (611 of 1923)
PASS: lldb-api :: commands/expression/multiline-navigation/TestMultilineNavigation.py (612 of 1923)
PASS: lldb-api :: commands/frame/diagnose/virtual-method-call/TestDiagnoseDereferenceVirtualMethodCall.py (613 of 1923)
PASS: lldb-api :: functionalities/gdb_remote_client/TestPty.py (614 of 1923)
PASS: lldb-api :: functionalities/thread/concurrent_events/TestConcurrentManyBreakpoints.py (615 of 1923)
UNSUPPORTED: lldb-shell :: ScriptInterpreter/Lua/watchpoint_callback.test (616 of 1923)
PASS: lldb-shell :: ObjectFile/PECOFF/section-types.yaml (617 of 1923)
PASS: lldb-unit :: SymbolFile/DWARF/./SymbolFileDWARFTests/11/29 (618 of 1923)
PASS: lldb-api :: commands/expression/function_template_specialization_temp_args/TestFunctionTemplateSpecializationTempArgs.py (619 of 1923)
PASS: lldb-shell :: ObjectFile/PECOFF/basic-info-arm.yaml (620 of 1923)
PASS: lldb-api :: functionalities/unwind/sigtramp/TestSigtrampUnwind.py (621 of 1923)
PASS: lldb-shell :: ObjectFile/ELF/section-overlap.yaml (622 of 1923)
PASS: lldb-unit :: Process/gdb-remote/./ProcessGdbRemoteTests/17/19 (623 of 1923)
PASS: lldb-unit :: Expression/./ExpressionTests/13/22 (624 of 1923)
PASS: lldb-api :: functionalities/deleted-executable/TestDeletedExecutable.py (625 of 1923)
PASS: lldb-unit :: SymbolFile/DWARF/./SymbolFileDWARFTests/18/29 (626 of 1923)
PASS: lldb-api :: tools/lldb-vscode/evaluate/TestVSCode_evaluate.py (627 of 1923)
PASS: lldb-shell :: Register/Core/x86-32-freebsd-fp.test (628 of 1923)
PASS: lldb-api :: commands/command/script_alias/TestCommandScriptAlias.py (629 of 1923)
PASS: lldb-shell :: Quit/TestQuitExitCodeNonInt.test (630 of 1923)
PASS: lldb-shell :: ObjectFile/PECOFF/basic-info.yaml (631 of 1923)
PASS: lldb-shell :: Commands/command-stop-hook-output.test (632 of 1923)
UNSUPPORTED: lldb-api :: functionalities/thread/concurrent_events/TestConcurrentSignalNWatchNBreak.py (633 of 1923)
PASS: lldb-api :: macosx/find-app-in-bundle/TestFindAppInBundle.py (634 of 1923)
PASS: lldb-api :: tools/lldb-vscode/launch/TestVSCode_launch.py (635 of 1923)
PASS: lldb-api :: commands/command/regex/TestRegexCommand.py (636 of 1923)
PASS: lldb-unit :: SymbolFile/DWARF/./SymbolFileDWARFTests/10/29 (637 of 1923)
UNSUPPORTED: lldb-shell :: SymbolFile/target-symbols-add-unwind.test (638 of 1923)
PASS: lldb-unit :: Language/Highlighting/./HighlighterTests/13/29 (639 of 1923)
PASS: lldb-unit :: Expression/./ExpressionTests/10/22 (640 of 1923)
PASS: lldb-api :: commands/expression/dont_allow_jit/TestAllowJIT.py (641 of 1923)
UNSUPPORTED: lldb-shell :: SymbolFile/DWARF/x86/debug_ranges_and_rnglists.test (642 of 1923)
UNSUPPORTED: lldb-shell :: SymbolFile/DWARF/x86/find-variable-file.cpp (643 of 1923)
UNSUPPORTED: lldb-api :: macosx/simulator/TestSimulatorPlatform.py (644 of 1923)
PASS: lldb-unit :: Symbol/./SymbolTests/8/16 (645 of 1923)
PASS: lldb-api :: commands/process/attach/TestProcessAttach.py (646 of 1923)
PASS: lldb-api :: lang/c/complex_int/TestComplexInt.py (647 of 1923)
PASS: lldb-unit :: Core/./LLDBCoreTests/4/22 (648 of 1923)
PASS: lldb-api :: commands/frame/diagnose/dereference-function-return/TestDiagnoseDereferenceFunctionReturn.py (649 of 1923)
PASS: lldb-api :: lang/cpp/std-function-step-into-callable/TestStdFunctionStepIntoCallable.py (650 of 1923)
PASS: lldb-api :: lang/objc/rdar-11355592/TestRdar11355592.py (651 of 1923)
UNSUPPORTED: lldb-api :: tools/lldb-server/TestGdbRemotePlatformFile.py (652 of 1923)
PASS: lldb-unit :: Expression/./ExpressionTests/18/22 (653 of 1923)
PASS: lldb-api :: lang/objc/modules-auto-import/TestModulesAutoImport.py (654 of 1923)
PASS: lldb-shell :: Minidump/memory-region-from-module.yaml (655 of 1923)
PASS: lldb-unit :: SymbolFile/NativePDB/./SymbolFileNativePDBTests/4/15 (656 of 1923)
PASS: lldb-api :: functionalities/module_cache/debug_index/TestDebugIndexCache.py (657 of 1923)
PASS: lldb-api :: python_api/disassemble-raw-data/TestDisassembleRawData.py (658 of 1923)
PASS: lldb-unit :: Utility/./UtilityTests/27/30 (659 of 1923)
PASS: lldb-shell :: Reproducer/TestDSYM.test (660 of 1923)
PASS: lldb-api :: macosx/save_crashlog/TestSaveCrashlog.py (661 of 1923)
PASS: lldb-unit :: Process/minidump/./LLDBMinidumpTests/13/17 (662 of 1923)
PASS: lldb-api :: commands/process/continue_to_bkpt/TestContinueToBkpts.py (663 of 1923)
PASS: lldb-shell :: Commands/command-disassemble.s (664 of 1923)
PASS: lldb-shell :: SymbolFile/DWARF/x86/debug_static-member-anonymous-namespace.s (665 of 1923)
PASS: lldb-api :: macosx/profile_vrs_detach/TestDetachVrsProfile.py (666 of 1923)
PASS: lldb-api :: lang/c/enum_types/TestEnumTypes.py (667 of 1923)
UNSUPPORTED: lldb-api :: functionalities/thread/concurrent_events/TestConcurrentManyWatchpoints.py (668 of 1923)
UNSUPPORTED: lldb-api :: python_api/watchpoint/TestWatchpointIgnoreCount.py (669 of 1923)
PASS: lldb-shell :: Minidump/Windows/arm-fp-unwind.test (670 of 1923)
PASS: lldb-shell :: ObjectFile/PECOFF/symbol.yaml (671 of 1923)
PASS: lldb-shell :: ObjectFile/PECOFF/dwarf-gnu-debuglink-pdb-buildid.yaml (672 of 1923)
UNSUPPORTED: lldb-api :: tools/lldb-server/TestGdbRemoteCompletion.py (673 of 1923)
PASS: lldb-unit :: SymbolFile/DWARF/./SymbolFileDWARFTests/1/29 (674 of 1923)
PASS: lldb-api :: macosx/DBGSourcePathRemapping/TestDSYMSourcePathRemapping.py (675 of 1923)
PASS: lldb-unit :: Utility/./UtilityTests/0/30 (676 of 1923)
PASS: lldb-api :: lang/objc/objc-struct-return/TestObjCStructReturn.py (677 of 1923)
PASS: lldb-api :: functionalities/data-formatter/data-formatter-stl/libstdcpp/unique_ptr/invalid/TestDataFormatterInvalidStdUniquePtr.py (678 of 1923)
UNSUPPORTED: lldb-api :: commands/watchpoints/watchpoint_commands/command/TestWatchpointCommandLLDB.py (679 of 1923)
PASS: lldb-api :: commands/quit/TestQuit.py (680 of 1923)
PASS: lldb-api :: functionalities/data-formatter/data-formatter-python-synth/TestDataFormatterPythonSynth.py (681 of 1923)
PASS: lldb-unit :: Process/Utility/./ProcessUtilityTests/6/16 (682 of 1923)
PASS: lldb-api :: functionalities/tail_call_frames/disambiguate_call_site/TestDisambiguateCallSite.py (683 of 1923)
PASS: lldb-api :: lang/c/unicode/TestUnicodeSymbols.py (684 of 1923)
PASS: lldb-api :: sample_test/TestSampleTest.py (685 of 1923)
PASS: lldb-api :: lang/objc/foundation/TestConstStrings.py (686 of 1923)
PASS: lldb-api :: functionalities/launch_stop_at_entry/TestStopAtEntry.py (687 of 1923)
PASS: lldb-api :: types/TestShortType.py (688 of 1923)
PASS: lldb-api :: functionalities/gdb_remote_client/TestGDBRemotePlatformFile.py (689 of 1923)
PASS: lldb-api :: lang/cpp/gmodules-templates/TestGModules.py (690 of 1923)
PASS: lldb-api :: lang/objc/bitfield_ivars/TestBitfieldIvars.py (691 of 1923)
PASS: lldb-api :: commands/target/stop-hooks/TestStopHooks.py (692 of 1923)
UNSUPPORTED: lldb-shell :: Commands/command-target-create-resolve-exe.test (693 of 1923)
PASS: lldb-api :: commands/target/create-no-such-arch/TestNoSuchArch.py (694 of 1923)
PASS: lldb-api :: commands/expression/import-std-module/weak_ptr-dbg-info-content/TestDbgInfoContentWeakPtrFromStdModule.py (695 of 1923)
PASS: lldb-unit :: SymbolFile/NativePDB/./SymbolFileNativePDBTests/9/15 (696 of 1923)
UNSUPPORTED: lldb-shell :: SymbolFile/NativePDB/inline_sites.test (697 of 1923)
UNSUPPORTED: lldb-shell :: SymbolFile/DWARF/x86/inline-function-address-shared.test (698 of 1923)
PASS: lldb-api :: commands/frame/var-scope/TestFrameVariableScope.py (699 of 1923)
PASS: lldb-shell :: Settings/TestFrameFormatNoColor.test (700 of 1923)
UNSUPPORTED: lldb-shell :: SymbolFile/DWARF/x86/dir-separator-windows.s (701 of 1923)
UNSUPPORTED: lldb-api :: commands/expression/import_builtin_fileid/TestImportBuiltinFileID.py (702 of 1923)
PASS: lldb-api :: functionalities/stats_api/TestStatisticsAPI.py (703 of 1923)
PASS: lldb-api :: functionalities/recursion/TestValueObjectRecursion.py (704 of 1923)
PASS: lldb-unit :: Host/./HostTests/8/19 (705 of 1923)
PASS: lldb-unit :: SymbolFile/DWARF/./SymbolFileDWARFTests/17/29 (706 of 1923)
PASS: lldb-shell :: Driver/TestError.test (707 of 1923)
PASS: lldb-shell :: Register/Core/x86-32-netbsd-addr.test (708 of 1923)
PASS: lldb-unit :: Target/./TargetTests/12/19 (709 of 1923)
PASS: lldb-api :: functionalities/paths/TestPaths.py (710 of 1923)
PASS: lldb-api :: functionalities/memory/cache/TestMemoryCache.py (711 of 1923)
PASS: lldb-api :: commands/target/basic/TestTargetCommand.py (712 of 1923)
PASS: lldb-api :: lang/cpp/step-through-trampoline/TestStepThroughTrampoline.py (713 of 1923)
PASS: lldb-unit :: Language/Highlighting/./HighlighterTests/4/29 (714 of 1923)
UNSUPPORTED: lldb-shell :: SymbolFile/DWARF/x86/debug-names-compressed.cpp (715 of 1923)
PASS: lldb-api :: lang/cpp/dereferencing_references/TestCPPDereferencingReferences.py (716 of 1923)
PASS: lldb-unit :: Target/./TargetTests/3/19 (717 of 1923)
PASS: lldb-api :: functionalities/data-formatter/data-formatter-enum-format/TestDataFormatterEnumFormat.py (718 of 1923)
PASS: lldb-api :: functionalities/pre_run_dylibs/TestPreRunDylibs.py (719 of 1923)
PASS: lldb-shell :: ObjectFile/ELF/null-jmprel.yaml (720 of 1923)
PASS: lldb-api :: functionalities/data-formatter/data-formatter-ptr-to-array/TestPtrToArrayFormatting.py (721 of 1923)
PASS: lldb-shell :: BuildScript/toolchain-clang.test (722 of 1923)
PASS: lldb-shell :: Minidump/dump-all.test (723 of 1923)
UNSUPPORTED: lldb-api :: python_api/watchpoint/watchlocation/TestSetWatchlocation.py (724 of 1923)
PASS: lldb-api :: commands/command/nested_alias/TestNestedAlias.py (725 of 1923)
UNSUPPORTED: lldb-api :: functionalities/tsan/thread_numbers/TestTsanThreadNumbers.py (726 of 1923)
PASS: lldb-api :: commands/expression/radar_8638051/Test8638051.py (727 of 1923)
PASS: lldb-api :: commands/process/attach/attach_denied/TestAttachDenied.py (728 of 1923)
PASS: lldb-unit :: Core/./LLDBCoreTests/0/22 (729 of 1923)
PASS: lldb-api :: lang/c/builtin-types/TestCBuiltinTypes.py (730 of 1923)
PASS: lldb-api :: lang/c/struct_types/TestStructTypes.py (731 of 1923)
PASS: lldb-unit :: ScriptInterpreter/Python/./ScriptInterpreterPythonTests/9/19 (732 of 1923)
UNSUPPORTED: lldb-api :: commands/trace/multiple-threads/TestTraceStartStopMultipleThreads.py (733 of 1923)
PASS: lldb-api :: lang/cpp/complete-type-check/TestCppIsTypeComplete.py (734 of 1923)
PASS: lldb-unit :: Symbol/./SymbolTests/5/16 (735 of 1923)
PASS: lldb-api :: lang/objcxx/hide-runtime-values/TestObjCXXHideRuntimeValues.py (736 of 1923)
PASS: lldb-unit :: Language/Highlighting/./HighlighterTests/5/29 (737 of 1923)
PASS: lldb-unit :: Process/gdb-remote/./ProcessGdbRemoteTests/8/19 (738 of 1923)
PASS: lldb-unit :: tools/lldb-server/tests/./LLDBServerTests/1/2 (739 of 1923)
PASS: lldb-api :: functionalities/breakpoint/dummy_target_breakpoints/TestBreakpointsWithNoTargets.py (740 of 1923)
UNSUPPORTED: lldb-api :: benchmarks/continue/TestBenchmarkContinue.py (741 of 1923)
PASS: lldb-shell :: ObjectFile/MachO/lc_build_version_notools.yaml (742 of 1923)
FAIL: lldb-api :: lang/cpp/const_static_integral_member/TestConstStaticIntegralMember.py (743 of 1923)
******************** TEST 'lldb-api :: lang/cpp/const_static_integral_member/TestConstStaticIntegralMember.py' FAILED ********************
Script:
--
/Applications/Xcode.app/Contents/Developer/Library/Frameworks/Python3.framework/Versions/3.8/bin/python3.8 /Users/buildslave/jenkins/workspace/lldb-cmake-matrix/llvm-project/lldb/test/API/dotest.py -u CXXFLAGS -u CFLAGS --codesign-identity lldb_codesign --arch x86_64 --build-dir /Users/buildslave/jenkins/workspace/lldb-cmake-matrix/lldb-build/lldb-test-build.noindex -t --env TERM=vt100 --skip-category gmodules --skip-category watchpoint --skip-category llgs --skip-category debugserver --arch=x86_64 --env LLVM_LIBS_DIR=/Users/buildslave/jenkins/workspace/lldb-cmake-matrix/lldb-build/./lib --env LLVM_INCLUDE_DIR=/Users/buildslave/jenkins/workspace/lldb-cmake-matrix/lldb-build/include --env LLVM_TOOLS_DIR=/Users/buildslave/jenkins/workspace/lldb-cmake-matrix/lldb-build/./bin --hermetic-libcxx --arch x86_64 --build-dir /Users/buildslave/jenkins/workspace/lldb-cmake-matrix/lldb-build/lldb-test-build.noindex --lldb-module-cache-dir /Users/buildslave/jenkins/workspace/lldb-cmake-matrix/lldb-build/lldb-test-build.noindex/module-cache-lldb/lldb-api --clang-module-cache-dir /Users/buildslave/jenkins/workspace/lldb-cmake-matrix/lldb-build/lldb-test-build.noindex/module-cache-clang/lldb-api --executable /Users/buildslave/jenkins/workspace/lldb-cmake-matrix/lldb-build/./bin/lldb --compiler /Users/buildslave/jenkins/workspace/lldb-cmake-matrix/clang_1300_build/bin/clang --dsymutil /Users/buildslave/jenkins/workspace/lldb-cmake-matrix/lldb-build/./bin/dsymutil --llvm-tools-dir /Users/buildslave/jenkins/workspace/lldb-cmake-matrix/lldb-build/./bin --lldb-libs-dir /Users/buildslave/jenkins/workspace/lldb-cmake-matrix/lldb-build/./lib /Users/buildslave/jenkins/workspace/lldb-cmake-matrix/llvm-project/lldb/test/API/lang/cpp/const_static_integral_member -p TestConstStaticIntegralMember.py
--
Exit Code: 1

Hide Details

Command Output (stdout): -- lldb version 16.0.99git (http://labmaster3.local/git/llvm-project.git revision 9c81b743e31a7dca288b37b6cf6cca3213bfd923) clang revision 9c81b743e31a7dca288b37b6cf6cca3213bfd923 llvm revision 9c81b743e31a7dca288b37b6cf6cca3213bfd923 Skipping the following test categories: ['gmodules', 'watchpoint', 'llgs', 'debugserver', 'libstdcxx', 'dwo', 'llgs', 'fork']

Hide Details

-- Command Output (stderr): -- Change dir to: /Users/buildslave/jenkins/workspace/lldb-cmake-matrix/llvm-project/lldb/test/API/lang/cpp/const_static_integral_member runCmd: settings clear -all output:

Hide Details

runCmd: settings set symbols.enable-external-lookup false output:

Hide Details

runCmd: settings set target.inherit-tcc true output:

Hide Details

runCmd: settings set target.detach-on-error false output:

Hide Details

runCmd: settings set target.auto-apply-fixits false output:

Hide Details

runCmd: settings set plugin.process.gdb-remote.packet-timeout 60 output:

Hide Details

runCmd: settings set symbols.clang-modules-cache-path "/Users/buildslave/jenkins/workspace/lldb-cmake-matrix/lldb-build/lldb-test-build.noindex/module-cache-lldb/lldb-api" output:

Hide Details

runCmd: settings set use-color false output:

Hide Details

runCmd: setting set target.prefer-dynamic-value no-dynamic-values output:

Hide Details

make VPATH=/Users/buildslave/jenkins/workspace/lldb-cmake-matrix/llvm-project/lldb/test/API/lang/cpp/const_static_integral_member -C /Users/buildslave/jenkins/workspace/lldb-cmake-matrix/lldb-build/lldb-test-build.noindex/lang/cpp/const_static_integral_member/TestConstStaticIntegralMember.test_class_with_only_const_static_dsym -I /Users/buildslave/jenkins/workspace/lldb-cmake-matrix/llvm-project/lldb/test/API/lang/cpp/const_static_integral_member -I /Users/buildslave/jenkins/workspace/lldb-cmake-matrix/llvm-project/lldb/packages/Python/lldbsuite/test/make -f /Users/buildslave/jenkins/workspace/lldb-cmake-matrix/llvm-project/lldb/test/API/lang/cpp/const_static_integral_member/Makefile MAKE_DSYM=YES all ARCH=x86_64 'CC="/Users/buildslave/jenkins/workspace/lldb-cmake-matrix/clang_1300_build/bin/clang"' DSYMUTIL=/Users/buildslave/jenkins/workspace/lldb-cmake-matrix/lldb-build/./bin/dsymutil CODESIGN=codesign CLANG_MODULE_CACHE_DIR=/Users/buildslave/jenkins/workspace/lldb-cmake-matrix/lldb-build/lldb-test-build.noindex/module-cache-clang/lldb-api USE_HERMETIC_LIBCPP=1

Hide Details

"/Users/buildslave/jenkins/workspace/lldb-cmake-matrix/clang_1300_build/bin/clang" -std=c++11 -g -O0 -isysroot "/Applications/Xcode.app/Contents/Developer/Platforms/MacOSX.platform/Developer/SDKs/MacOSX11.1.sdk" -arch x86_64 -I/Users/buildslave/jenkins/workspace/lldb-cmake-matrix/llvm-project/lldb/packages/Python/lldbsuite/test/make/../../../../../include -I/Users/buildslave/jenkins/workspace/lldb-cmake-matrix/llvm-project/lldb/test/API/lang/cpp/const_static_integral_member -I/Users/buildslave/jenkins/workspace/lldb-cmake-matrix/llvm-project/lldb/packages/Python/lldbsuite/test/make -include /Users/buildslave/jenkins/workspace/lldb-cmake-matrix/llvm-project/lldb/packages/Python/lldbsuite/test/make/test_common.h -fno-limit-debug-info --driver-mode=g++ -MT main.o -MD -MP -MF main.d -c -o main.o /Users/buildslave/jenkins/workspace/lldb-cmake-matrix/llvm-project/lldb/test/API/lang/cpp/const_static_integral_member/main.cpp "/Users/buildslave/jenkins/workspace/lldb-cmake-matrix/clang_1300_build/bin/clang" main.o -g -O0 -isysroot "/Applications/Xcode.app/Contents/Developer/Platforms/MacOSX.platform/Developer/SDKs/MacOSX11.1.sdk" -arch x86_64 -I/Users/buildslave/jenkins/workspace/lldb-cmake-matrix/llvm-project/lldb/packages/Python/lldbsuite/test/make/../../../../../include -I/Users/buildslave/jenkins/workspace/lldb-cmake-matrix/llvm-project/lldb/test/API/lang/cpp/const_static_integral_member -I/Users/buildslave/jenkins/workspace/lldb-cmake-matrix/llvm-project/lldb/packages/Python/lldbsuite/test/make -include /Users/buildslave/jenkins/workspace/lldb-cmake-matrix/llvm-project/lldb/packages/Python/lldbsuite/test/make/test_common.h -fno-limit-debug-info --driver-mode=g++ -o "a.out" codesign -s - "a.out" "/Users/buildslave/jenkins/workspace/lldb-cmake-matrix/lldb-build/./bin/dsymutil" -o "a.out.dSYM" "a.out"

Hide Details

Hide Details

XFAIL: LLDB (/Users/buildslave/jenkins/workspace/lldb-cmake-matrix/clang_1300_build/bin/clang-x86_64) :: test_class_with_only_const_static_dsym (TestConstStaticIntegralMember.TestCase) <bound method SBProcess.Kill of SBProcess: pid = 7482, state = stopped, threads = 1, executable = a.out>: success

Hide Details

runCmd: settings clear -all output:

Hide Details

runCmd: settings set symbols.enable-external-lookup false output:

Hide Details

runCmd: settings set target.inherit-tcc true output:

Hide Details

runCmd: settings set target.detach-on-error false output:

Hide Details

runCmd: settings set target.auto-apply-fixits false output:

Hide Details

runCmd: settings set plugin.process.gdb-remote.packet-timeout 60 output:

Hide Details

runCmd: settings set symbols.clang-modules-cache-path "/Users/buildslave/jenkins/workspace/lldb-cmake-matrix/lldb-build/lldb-test-build.noindex/module-cache-lldb/lldb-api" output:

Hide Details

runCmd: settings set use-color false output:

Hide Details

runCmd: setting set target.prefer-dynamic-value no-dynamic-values output:

Hide Details

make VPATH=/Users/buildslave/jenkins/workspace/lldb-cmake-matrix/llvm-project/lldb/test/API/lang/cpp/const_static_integral_member -C /Users/buildslave/jenkins/workspace/lldb-cmake-matrix/lldb-build/lldb-test-build.noindex/lang/cpp/const_static_integral_member/TestConstStaticIntegralMember.test_class_with_only_const_static_dwarf -I /Users/buildslave/jenkins/workspace/lldb-cmake-matrix/llvm-project/lldb/test/API/lang/cpp/const_static_integral_member -I /Users/buildslave/jenkins/workspace/lldb-cmake-matrix/llvm-project/lldb/packages/Python/lldbsuite/test/make -f /Users/buildslave/jenkins/workspace/lldb-cmake-matrix/llvm-project/lldb/test/API/lang/cpp/const_static_integral_member/Makefile MAKE_DSYM=NO all ARCH=x86_64 'CC="/Users/buildslave/jenkins/workspace/lldb-cmake-matrix/clang_1300_build/bin/clang"' DSYMUTIL=/Users/buildslave/jenkins/workspace/lldb-cmake-matrix/lldb-build/./bin/dsymutil CODESIGN=codesign CLANG_MODULE_CACHE_DIR=/Users/buildslave/jenkins/workspace/lldb-cmake-matrix/lldb-build/lldb-test-build.noindex/module-cache-clang/lldb-api USE_HERMETIC_LIBCPP=1

Hide Details

"/Users/buildslave/jenkins/workspace/lldb-cmake-matrix/clang_1300_build/bin/clang" -std=c++11 -g -O0 -isysroot "/Applications/Xcode.app/Contents/Developer/Platforms/MacOSX.platform/Developer/SDKs/MacOSX11.1.sdk" -arch x86_64 -I/Users/buildslave/jenkins/workspace/lldb-cmake-matrix/llvm-project/lldb/packages/Python/lldbsuite/test/make/../../../../../include -I/Users/buildslave/jenkins/workspace/lldb-cmake-matrix/llvm-project/lldb/test/API/lang/cpp/const_static_integral_member -I/Users/buildslave/jenkins/workspace/lldb-cmake-matrix/llvm-project/lldb/packages/Python/lldbsuite/test/make -include /Users/buildslave/jenkins/workspace/lldb-cmake-matrix/llvm-project/lldb/packages/Python/lldbsuite/test/make/test_common.h -fno-limit-debug-info --driver-mode=g++ -MT main.o -MD -MP -MF main.d -c -o main.o /Users/buildslave/jenkins/workspace/lldb-cmake-matrix/llvm-project/lldb/test/API/lang/cpp/const_static_integral_member/main.cpp "/Users/buildslave/jenkins/workspace/lldb-cmake-matrix/clang_1300_build/bin/clang" main.o -g -O0 -isysroot "/Applications/Xcode.app/Contents/Developer/Platforms/MacOSX.platform/Developer/SDKs/MacOSX11.1.sdk" -arch x86_64 -I/Users/buildslave/jenkins/workspace/lldb-cmake-matrix/llvm-project/lldb/packages/Python/lldbsuite/test/make/../../../../../include -I/Users/buildslave/jenkins/workspace/lldb-cmake-matrix/llvm-project/lldb/test/API/lang/cpp/const_static_integral_member -I/Users/buildslave/jenkins/workspace/lldb-cmake-matrix/llvm-project/lldb/packages/Python/lldbsuite/test/make -include /Users/buildslave/jenkins/workspace/lldb-cmake-matrix/llvm-project/lldb/packages/Python/lldbsuite/test/make/test_common.h -fno-limit-debug-info --driver-mode=g++ -o "a.out" codesign -s - "a.out"

Hide Details

Hide Details

<bound method SBProcess.Kill of SBProcess: pid = 7672, state = stopped, threads = 1, executable = a.out>: success

Hide Details

PASS: LLDB (/Users/buildslave/jenkins/workspace/lldb-cmake-matrix/clang_1300_build/bin/clang-x86_64) :: test_class_with_only_const_static_dwarf (TestConstStaticIntegralMember.TestCase) UNSUPPORTED: LLDB (/Users/buildslave/jenkins/workspace/lldb-cmake-matrix/clang_1300_build/bin/clang-x86_64) :: test_class_with_only_const_static_dwo (TestConstStaticIntegralMember.TestCase) (test case does not fall in any category of interest for this run) UNSUPPORTED: LLDB (/Users/buildslave/jenkins/workspace/lldb-cmake-matrix/clang_1300_build/bin/clang-x86_64) :: test_class_with_only_const_static_gmodules (TestConstStaticIntegralMember.TestCase) (test case does not fall in any category of interest for this run) runCmd: settings clear -all output:

Hide Details

runCmd: settings set symbols.enable-external-lookup false output:

Hide Details

runCmd: settings set target.inherit-tcc true output:

Hide Details

runCmd: settings set target.detach-on-error false output:

Hide Details

runCmd: settings set target.auto-apply-fixits false output:

Hide Details

runCmd: settings set plugin.process.gdb-remote.packet-timeout 60 output:

Hide Details

runCmd: settings set symbols.clang-modules-cache-path "/Users/buildslave/jenkins/workspace/lldb-cmake-matrix/lldb-build/lldb-test-build.noindex/module-cache-lldb/lldb-api" output:

Hide Details

runCmd: settings set use-color false output:

Hide Details

runCmd: setting set target.prefer-dynamic-value no-dynamic-values output:

Hide Details

make VPATH=/Users/buildslave/jenkins/workspace/lldb-cmake-matrix/llvm-project/lldb/test/API/lang/cpp/const_static_integral_member -C /Users/buildslave/jenkins/workspace/lldb-cmake-matrix/lldb-build/lldb-test-build.noindex/lang/cpp/const_static_integral_member/TestConstStaticIntegralMember.test_dsym -I /Users/buildslave/jenkins/workspace/lldb-cmake-matrix/llvm-project/lldb/test/API/lang/cpp/const_static_integral_member -I /Users/buildslave/jenkins/workspace/lldb-cmake-matrix/llvm-project/lldb/packages/Python/lldbsuite/test/make -f /Users/buildslave/jenkins/workspace/lldb-cmake-matrix/llvm-project/lldb/test/API/lang/cpp/const_static_integral_member/Makefile MAKE_DSYM=YES all ARCH=x86_64 'CC="/Users/buildslave/jenkins/workspace/lldb-cmake-matrix/clang_1300_build/bin/clang"' DSYMUTIL=/Users/buildslave/jenkins/workspace/lldb-cmake-matrix/lldb-build/./bin/dsymutil CODESIGN=codesign CLANG_MODULE_CACHE_DIR=/Users/buildslave/jenkins/workspace/lldb-cmake-matrix/lldb-build/lldb-test-build.noindex/module-cache-clang/lldb-api USE_HERMETIC_LIBCPP=1

Hide Details

"/Users/buildslave/jenkins/workspace/lldb-cmake-matrix/clang_1300_build/bin/clang" -std=c++11 -g -O0 -isysroot "/Applications/Xcode.app/Contents/Developer/Platforms/MacOSX.platform/Developer/SDKs/MacOSX11.1.sdk" -arch x86_64 -I/Users/buildslave/jenkins/workspace/lldb-cmake-matrix/llvm-project/lldb/packages/Python/lldbsuite/test/make/../../../../../include -I/Users/buildslave/jenkins/workspace/lldb-cmake-matrix/llvm-project/lldb/test/API/lang/cpp/const_static_integral_member -I/Users/buildslave/jenkins/workspace/lldb-cmake-matrix/llvm-project/lldb/packages/Python/lldbsuite/test/make -include /Users/buildslave/jenkins/workspace/lldb-cmake-matrix/llvm-project/lldb/packages/Python/lldbsuite/test/make/test_common.h -fno-limit-debug-info --driver-mode=g++ -MT main.o -MD -MP -MF main.d -c -o main.o /Users/buildslave/jenkins/workspace/lldb-cmake-matrix/llvm-project/lldb/test/API/lang/cpp/const_static_integral_member/main.cpp "/Users/buildslave/jenkins/workspace/lldb-cmake-matrix/clang_1300_build/bin/clang" main.o -g -O0 -isysroot "/Applications/Xcode.app/Contents/Developer/Platforms/MacOSX.platform/Developer/SDKs/MacOSX11.1.sdk" -arch x86_64 -I/Users/buildslave/jenkins/workspace/lldb-cmake-matrix/llvm-project/lldb/packages/Python/lldbsuite/test/make/../../../../../include -I/Users/buildslave/jenkins/workspace/lldb-cmake-matrix/llvm-project/lldb/test/API/lang/cpp/const_static_integral_member -I/Users/buildslave/jenkins/workspace/lldb-cmake-matrix/llvm-project/lldb/packages/Python/lldbsuite/test/make -include /Users/buildslave/jenkins/workspace/lldb-cmake-matrix/llvm-project/lldb/packages/Python/lldbsuite/test/make/test_common.h -fno-limit-debug-info --driver-mode=g++ -o "a.out" codesign -s - "a.out" "/Users/buildslave/jenkins/workspace/lldb-cmake-matrix/lldb-build/./bin/dsymutil" -o "a.out.dSYM" "a.out"

Hide Details

Hide Details

FAIL: LLDB (/Users/buildslave/jenkins/workspace/lldb-cmake-matrix/clang_1300_build/bin/clang-x86_64) :: test_dsym (TestConstStaticIntegralMember.TestCase) <bound method SBProcess.Kill of SBProcess: pid = 7767, state = stopped, threads = 1, executable = a.out>: success

Hide Details

runCmd: settings clear -all output:

Hide Details

runCmd: settings set symbols.enable-external-lookup false output:

Hide Details

runCmd: settings set target.inherit-tcc true output:

Hide Details

runCmd: settings set target.detach-on-error false output:

Hide Details

runCmd: settings set target.auto-apply-fixits false output:

Hide Details

runCmd: settings set plugin.process.gdb-remote.packet-timeout 60 output:

Hide Details

runCmd: settings set symbols.clang-modules-cache-path "/Users/buildslave/jenkins/workspace/lldb-cmake-matrix/lldb-build/lldb-test-build.noindex/module-cache-lldb/lldb-api" output:

Hide Details

runCmd: settings set use-color false output:

Hide Details

runCmd: setting set target.prefer-dynamic-value no-dynamic-values output:

Hide Details

make VPATH=/Users/buildslave/jenkins/workspace/lldb-cmake-matrix/llvm-project/lldb/test/API/lang/cpp/const_static_integral_member -C /Users/buildslave/jenkins/workspace/lldb-cmake-matrix/lldb-build/lldb-test-build.noindex/lang/cpp/const_static_integral_member/TestConstStaticIntegralMember.test_dwarf -I /Users/buildslave/jenkins/workspace/lldb-cmake-matrix/llvm-project/lldb/test/API/lang/cpp/const_static_integral_member -I /Users/buildslave/jenkins/workspace/lldb-cmake-matrix/llvm-project/lldb/packages/Python/lldbsuite/test/make -f /Users/buildslave/jenkins/workspace/lldb-cmake-matrix/llvm-project/lldb/test/API/lang/cpp/const_static_integral_member/Makefile MAKE_DSYM=NO all ARCH=x86_64 'CC="/Users/buildslave/jenkins/workspace/lldb-cmake-matrix/clang_1300_build/bin/clang"' DSYMUTIL=/Users/buildslave/jenkins/workspace/lldb-cmake-matrix/lldb-build/./bin/dsymutil CODESIGN=codesign CLANG_MODULE_CACHE_DIR=/Users/buildslave/jenkins/workspace/lldb-cmake-matrix/lldb-build/lldb-test-build.noindex/module-cache-clang/lldb-api USE_HERMETIC_LIBCPP=1

Hide Details

"/Users/buildslave/jenkins/workspace/lldb-cmake-matrix/clang_1300_build/bin/clang" -std=c++11 -g -O0 -isysroot "/Applications/Xcode.app/Contents/Developer/Platforms/MacOSX.platform/Developer/SDKs/MacOSX11.1.sdk" -arch x86_64 -I/Users/buildslave/jenkins/workspace/lldb-cmake-matrix/llvm-project/lldb/packages/Python/lldbsuite/test/make/../../../../../include -I/Users/buildslave/jenkins/workspace/lldb-cmake-matrix/llvm-project/lldb/test/API/lang/cpp/const_static_integral_member -I/Users/buildslave/jenkins/workspace/lldb-cmake-matrix/llvm-project/lldb/packages/Python/lldbsuite/test/make -include /Users/buildslave/jenkins/workspace/lldb-cmake-matrix/llvm-project/lldb/packages/Python/lldbsuite/test/make/test_common.h -fno-limit-debug-info --driver-mode=g++ -MT main.o -MD -MP -MF main.d -c -o main.o /Users/buildslave/jenkins/workspace/lldb-cmake-matrix/llvm-project/lldb/test/API/lang/cpp/const_static_integral_member/main.cpp "/Users/buildslave/jenkins/workspace/lldb-cmake-matrix/clang_1300_build/bin/clang" main.o -g -O0 -isysroot "/Applications/Xcode.app/Contents/Developer/Platforms/MacOSX.platform/Developer/SDKs/MacOSX11.1.sdk" -arch x86_64 -I/Users/buildslave/jenkins/workspace/lldb-cmake-matrix/llvm-project/lldb/packages/Python/lldbsuite/test/make/../../../../../include -I/Users/buildslave/jenkins/workspace/lldb-cmake-matrix/llvm-project/lldb/test/API/lang/cpp/const_static_integral_member -I/Users/buildslave/jenkins/workspace/lldb-cmake-matrix/llvm-project/lldb/packages/Python/lldbsuite/test/make -include /Users/buildslave/jenkins/workspace/lldb-cmake-matrix/llvm-project/lldb/packages/Python/lldbsuite/test/make/test_common.h -fno-limit-debug-info --driver-mode=g++ -o "a.out" codesign -s - "a.out"

Hide Details

Hide Details

runCmd: expr const int *i = &A::int_val; *i check of return status not required runCmd failed! error: expression failed to parse: error: Couldn't lookup symbols: __ZN1A7int_valE

Hide Details

Hide Details

Ran command: "expr const int *i = &A::int_val; *i"

Hide Details

Got output: error: expression failed to parse: error: Couldn't lookup symbols: __ZN1A7int_valE

Hide Details

Expecting sub string: "Couldn't lookup symbols:" (was found)

Hide Details

<bound method SBProcess.Kill of SBProcess: pid = 7934, state = stopped, threads = 1, executable = a.out>: success

Hide Details

PASS: LLDB (/Users/buildslave/jenkins/workspace/lldb-cmake-matrix/clang_1300_build/bin/clang-x86_64) :: test_dwarf (TestConstStaticIntegralMember.TestCase) UNSUPPORTED: LLDB (/Users/buildslave/jenkins/workspace/lldb-cmake-matrix/clang_1300_build/bin/clang-x86_64) :: test_dwo (TestConstStaticIntegralMember.TestCase) (test case does not fall in any category of interest for this run) UNSUPPORTED: LLDB (/Users/buildslave/jenkins/workspace/lldb-cmake-matrix/clang_1300_build/bin/clang-x86_64) :: test_gmodules (TestConstStaticIntegralMember.TestCase) (test case does not fall in any category of interest for this run) Restore dir to: /Users/buildslave/jenkins/workspace/lldb-cmake-matrix/lldb-build/tools/lldb/test ====================================================================== FAIL: test_dsym (TestConstStaticIntegralMember.TestCase) ---------------------------------------------------------------------- Traceback (most recent call last): File "/Users/buildslave/jenkins/workspace/lldb-cmake-matrix/llvm-project/lldb/packages/Python/lldbsuite/test/lldbtest.py", line 1673, in test_method return attrvalue(self) File "/Users/buildslave/jenkins/workspace/lldb-cmake-matrix/llvm-project/lldb/test/API/lang/cpp/const_static_integral_member/TestConstStaticIntegralMember.py", line 70, in test self.expect_expr("ClassWithEnumAlias::enum_alias", File "/Users/buildslave/jenkins/workspace/lldb-cmake-matrix/llvm-project/lldb/packages/Python/lldbsuite/test/lldbtest.py", line 2430, in expect_expr value_check.check_value(self, eval_result, str(eval_result)) File "/Users/buildslave/jenkins/workspace/lldb-cmake-matrix/llvm-project/lldb/packages/Python/lldbsuite/test/lldbtest.py", line 286, in check_value test_base.assertSuccess(val.GetError()) File "/Users/buildslave/jenkins/workspace/lldb-cmake-matrix/llvm-project/lldb/packages/Python/lldbsuite/test/lldbtest.py", line 2466, in assertSuccess self.fail(self._formatMessage(msg, AssertionError: 'expression failed to parse: error: <user expression 31>:1:1: use of undeclared identifier 'ClassWithEnumAlias' ClassWithEnumAlias::enum_alias ^ ' is not success Config=x86_64-/Users/buildslave/jenkins/workspace/lldb-cmake-matrix/clang_1300_build/bin/clang ---------------------------------------------------------------------- Ran 8 tests in 6.494s

Hide Details

RESULT: FAILED (2 passes, 1 failures, 0 errors, 4 skipped, 1 expected failures, 0 unexpected successes)

Hide Details

--

Hide Details

******************** UNSUPPORTED: lldb-api :: tools/lldb-server/TestGdbRemoteModuleInfo.py (744 of 1923) PASS: lldb-shell :: SymbolFile/DWARF/x86/debug-types-missing-signature.test (745 of 1923) PASS: lldb-unit :: Language/Highlighting/./HighlighterTests/19/29 (746 of 1923) PASS: lldb-unit :: Language/Highlighting/./HighlighterTests/11/29 (747 of 1923) PASS: lldb-api :: commands/apropos/with-process/TestAproposWithProcess.py (748 of 1923) PASS: lldb-api :: lang/cpp/struct_with_keyword_name/TestStructWithKeywordName.py (749 of 1923) PASS: lldb-api :: commands/settings/TestSettings.py (750 of 1923) UNSUPPORTED: lldb-api :: commands/watchpoints/watchpoint_commands/command/TestWatchpointCommandPython.py (751 of 1923) PASS: lldb-shell :: SymbolFile/DWARF/clang-ast-from-dwarf-objc-property.m (752 of 1923) PASS: lldb-shell :: Register/Core/x86-32-netbsd-multithread.test (753 of 1923) UNSUPPORTED: lldb-api :: commands/register/register/aarch64_sve_registers/rw_access_static_config/TestSVERegisters.py (754 of 1923) PASS: lldb-api :: functionalities/gdb_remote_client/TestRemoteRegNums.py (755 of 1923) PASS: lldb-shell :: Commands/command-regex-unalias.test (756 of 1923) PASS: lldb-shell :: SymbolFile/Breakpad/unwind-via-raSearch.test (757 of 1923) PASS: lldb-shell :: Breakpoint/split-dwarf-5-addrbase.test (758 of 1923) UNSUPPORTED: lldb-shell :: SymbolFile/DWARF/x86/dwarf5_locations.s (759 of 1923) UNSUPPORTED: lldb-shell :: SymbolFile/PDB/udt-layout.test (760 of 1923) PASS: lldb-api :: python_api/process/io/TestProcessIO.py (761 of 1923) PASS: lldb-unit :: Core/./LLDBCoreTests/19/22 (762 of 1923) PASS: lldb-api :: lang/objc/objc-checker/TestObjCCheckers.py (763 of 1923) PASS: lldb-api :: functionalities/abbreviation/TestCommonShortSpellings.py (764 of 1923) PASS: lldb-api :: commands/expression/call-throws/TestCallThatThrows.py (765 of 1923) UNSUPPORTED: lldb-shell :: SymbolFile/PDB/typedefs.test (766 of 1923) PASS: lldb-api :: lang/cpp/static_member_type_depending_on_parent_size/TestStaticMemberTypeDependingOnParentSize.py (767 of 1923) PASS: lldb-shell :: SymbolFile/DWARF/x86/dwp.s (768 of 1923) PASS: lldb-api :: commands/expression/call-function/TestCallUserDefinedFunction.py (769 of 1923) PASS: lldb-unit :: Core/./LLDBCoreTests/5/22 (770 of 1923) PASS: lldb-unit :: Language/CPlusPlus/./LanguageCPlusPlusTests/2/5 (771 of 1923) PASS: lldb-unit :: Host/./HostTests/5/19 (772 of 1923) PASS: lldb-api :: lang/cpp/function-qualifiers/TestCppFunctionQualifiers.py (773 of 1923) PASS: lldb-api :: functionalities/thread/ignore_suspended/TestIgnoreSuspendedThread.py (774 of 1923) PASS: lldb-api :: lang/objc/objc-super/TestObjCSuper.py (775 of 1923) PASS: lldb-api :: functionalities/signal/TestSendSignal.py (776 of 1923) PASS: lldb-unit :: Editline/./EditlineTests/0/2 (777 of 1923) PASS: lldb-api :: api/check_public_api_headers/TestPublicAPIHeaders.py (778 of 1923) PASS: lldb-api :: functionalities/gdb_remote_client/TestNoGPacketSupported.py (779 of 1923) PASS: lldb-api :: functionalities/breakpoint/address_breakpoints/TestBadAddressBreakpoints.py (780 of 1923) UNSUPPORTED: lldb-api :: commands/watchpoints/hello_watchpoint/TestMyFirstWatchpoint.py (781 of 1923) PASS: lldb-api :: commands/log/invalid-args/TestInvalidArgsLog.py (782 of 1923) UNSUPPORTED: lldb-api :: tools/lldb-server/commandline/TestStubSetSID.py (783 of 1923) UNSUPPORTED: lldb-api :: functionalities/ptrauth_diagnostics/LDRAA_error/TestPtrauthLDRAADiagnostic.py (784 of 1923) PASS: lldb-api :: functionalities/data-formatter/data-formatter-objc/TestDataFormatterObjCPlain.py (785 of 1923) UNSUPPORTED: lldb-shell :: Subprocess/vfork-follow-parent-wp.test (786 of 1923) PASS: lldb-api :: functionalities/disassemble/aarch64-adrp-add/TestAArch64AdrpAdd.py (787 of 1923) PASS: lldb-unit :: Process/./ProcessEventDataTests/1/2 (788 of 1923) PASS: lldb-shell :: ObjectFile/ELF/PT_LOAD-overlap.yaml (789 of 1923) PASS: lldb-api :: lang/c/forward/TestForwardDeclaration.py (790 of 1923) PASS: lldb-unit :: ScriptInterpreter/Python/./ScriptInterpreterPythonTests/5/19 (791 of 1923) PASS: lldb-unit :: UnwindAssembly/x86/./UnwindAssemblyx86Tests/26/27 (792 of 1923) PASS: lldb-shell :: SymbolFile/absolute-symbol.test (793 of 1923) PASS: lldb-unit :: SymbolFile/DWARF/./SymbolFileDWARFTests/14/29 (794 of 1923) PASS: lldb-api :: lang/c/record_decl_in_expr/TestRecordDeclInExpr.py (795 of 1923) UNSUPPORTED: lldb-shell :: SymbolFile/DWARF/x86/dwp-separate-debug-file.cpp (796 of 1923) PASS: lldb-unit :: UnwindAssembly/x86/./UnwindAssemblyx86Tests/1/27 (797 of 1923) UNSUPPORTED: lldb-shell :: Register/aarch64-fp-read.test (798 of 1923) PASS: lldb-api :: commands/expression/pr35310/TestExprsBug35310.py (799 of 1923) PASS: lldb-api :: lang/cpp/bool/TestCPPBool.py (800 of 1923) PASS: lldb-shell :: SymbolFile/Breakpad/symtab.test (801 of 1923) PASS: lldb-api :: commands/expression/error-limit/TestExprErrorLimit.py (802 of 1923) PASS: lldb-unit :: UnwindAssembly/x86/./UnwindAssemblyx86Tests/11/27 (803 of 1923) UNSUPPORTED: lldb-api :: functionalities/longjmp/TestLongjmp.py (804 of 1923) PASS: lldb-unit :: Process/Utility/./ProcessUtilityTests/5/16 (805 of 1923) PASS: lldb-api :: functionalities/thread/thread_specific_break/TestThreadSpecificBreakpoint.py (806 of 1923) PASS: lldb-api :: functionalities/data-formatter/data-formatter-advanced/TestDataFormatterAdv.py (807 of 1923) PASS: lldb-api :: commands/platform/basic/TestPlatformCommand.py (808 of 1923) PASS: lldb-shell :: Settings/TestDisableColor.test (809 of 1923) PASS: lldb-api :: lang/objc/objc_direct-methods/TestObjCDirectMethods.py (810 of 1923) PASS: lldb-unit :: Expression/./ExpressionTests/7/22 (811 of 1923) PASS: lldb-api :: functionalities/plugins/python_os_plugin/stepping_plugin_threads/TestOSPluginStepping.py (812 of 1923) PASS: lldb-shell :: SymbolFile/DWARF/x86/dwo-type-in-main-file.s (813 of 1923) PASS: lldb-api :: functionalities/tail_call_frames/disambiguate_tail_call_seq/TestDisambiguateTailCallSeq.py (814 of 1923) PASS: lldb-api :: arm/emulation/TestEmulations.py (815 of 1923) UNSUPPORTED: lldb-shell :: Register/x86-64-gp-write.test (816 of 1923) PASS: lldb-api :: commands/expression/import-std-module/list-dbg-info-content/TestDbgInfoContentListFromStdModule.py (817 of 1923) PASS: lldb-unit :: Language/Highlighting/./HighlighterTests/12/29 (818 of 1923) PASS: lldb-api :: functionalities/breakpoint/cpp/TestCPPBreakpointLocations.py (819 of 1923) PASS: lldb-api :: lang/cpp/bitfields/TestCppBitfields.py (820 of 1923) UNSUPPORTED: lldb-api :: functionalities/thread/concurrent_events/TestConcurrentTwoWatchpointsOneSignal.py (821 of 1923) PASS: lldb-unit :: debugserver/./debugserverTests/3/6 (822 of 1923) UNSUPPORTED: lldb-api :: commands/trace/TestTraceExport.py (823 of 1923) UNSUPPORTED: lldb-shell :: SymbolFile/PDB/type-quals.test (824 of 1923) PASS: lldb-api :: functionalities/breakpoint/comp_dir_symlink/TestCompDirSymLink.py (825 of 1923) PASS: lldb-unit :: Utility/./UtilityTests/8/30 (826 of 1923) PASS: lldb-api :: functionalities/breakpoint/breakpoint_language/TestBreakpointLanguage.py (827 of 1923) PASS: lldb-api :: functionalities/gdb_remote_client/TestNestedRegDefinitions.py (828 of 1923) UNSUPPORTED: lldb-shell :: SymbolFile/NativePDB/break-by-function.cpp (829 of 1923) PASS: lldb-unit :: Process/gdb-remote/./ProcessGdbRemoteTests/18/19 (830 of 1923) PASS: lldb-api :: functionalities/data-formatter/data-formatter-script/TestDataFormatterScript.py (831 of 1923) PASS: lldb-api :: functionalities/source-map/TestTargetSourceMap.py (832 of 1923) PASS: lldb-api :: functionalities/data-formatter/summary-string-onfail/Test-rdar-9974002.py (833 of 1923) PASS: lldb-unit :: Process/minidump/./LLDBMinidumpTests/7/17 (834 of 1923) PASS: lldb-unit :: Utility/./UtilityTests/28/30 (835 of 1923) UNSUPPORTED: lldb-api :: functionalities/process_save_core_minidump/TestProcessSaveCoreMinidump.py (836 of 1923) UNSUPPORTED: lldb-api :: benchmarks/expression/TestRepeatedExprs.py (837 of 1923) PASS: lldb-shell :: SymbolFile/NativePDB/lookup-by-types.cpp (838 of 1923) PASS: lldb-api :: lang/cpp/stl/TestStdCXXDisassembly.py (839 of 1923) UNSUPPORTED: lldb-shell :: SymbolFile/NativePDB/function-types-builtins.cpp (840 of 1923) PASS: lldb-shell :: Register/Core/x86-32-linux-gp.test (841 of 1923) UNSUPPORTED: lldb-shell :: ScriptInterpreter/Lua/io.test (842 of 1923) UNSUPPORTED: lldb-api :: linux/add-symbols/TestTargetSymbolsAddCommand.py (843 of 1923) PASS: lldb-api :: linux/builtin_trap/TestBuiltinTrap.py (844 of 1923) PASS: lldb-api :: functionalities/multidebugger_commands/TestMultipleDebuggersCommands.py (845 of 1923) PASS: lldb-api :: commands/expression/import-std-module/deque-basic/TestDequeFromStdModule.py (846 of 1923) PASS: lldb-api :: lang/cpp/signed_types/TestSignedTypes.py (847 of 1923) PASS: lldb-unit :: Utility/./UtilityTests/21/30 (848 of 1923) PASS: lldb-api :: functionalities/data-formatter/data-formatter-objc/TestDataFormatterObjCNSContainer.py (849 of 1923) UNSUPPORTED: lldb-api :: tools/lldb-server/TestGdbRemoteExpeditedRegisters.py (850 of 1923) UNSUPPORTED: lldb-api :: lang/objc/rdar-12408181/TestRdar12408181.py (851 of 1923) PASS: lldb-shell :: ObjectFile/ELF/many-sections.s (852 of 1923) PASS: lldb-api :: lang/objc/objc-new-syntax/TestObjCNewSyntaxLiteral.py (853 of 1923) PASS: lldb-api :: commands/breakpoint/set/func-regex/TestBreakpointRegexError.py (854 of 1923) PASS: lldb-unit :: API/./APITests/0/3 (855 of 1923) PASS: lldb-api :: lang/cpp/thread_local/TestThreadLocal.py (856 of 1923) PASS: lldb-shell :: ObjectFile/ELF/PT_LOAD-overlap-PT_TLS.yaml (857 of 1923) PASS: lldb-api :: commands/frame/diagnose/inheritance/TestDiagnoseInheritance.py (858 of 1923) PASS: lldb-api :: lang/cpp/class-loading-via-member-typedef/TestClassLoadingViaMemberTypedef.py (859 of 1923) UNSUPPORTED: lldb-shell :: Subprocess/fork-follow-child.test (860 of 1923) PASS: lldb-shell :: ObjectFile/wasm/basic.yaml (861 of 1923) UNSUPPORTED: lldb-api :: commands/trace/TestTraceEvents.py (862 of 1923) UNSUPPORTED: lldb-api :: benchmarks/stepping/TestSteppingSpeed.py (863 of 1923) UNSUPPORTED: lldb-shell :: Subprocess/clone-follow-child-wp.test (864 of 1923) PASS: lldb-api :: functionalities/data-formatter/data-formatter-stl/generic/multiset/TestDataFormatterGenericMultiSet.py (865 of 1923) PASS: lldb-api :: macosx/ignore_exceptions/TestIgnoredExceptions.py (866 of 1923) PASS: lldb-api :: python_api/objc_type/TestObjCType.py (867 of 1923) PASS: lldb-unit :: Process/minidump/./LLDBMinidumpTests/8/17 (868 of 1923) PASS: lldb-unit :: Signals/./SignalsTests/2/5 (869 of 1923) PASS: lldb-api :: functionalities/thread/concurrent_events/TestConcurrentSignalBreak.py (870 of 1923) PASS: lldb-unit :: Utility/./UtilityTests/15/30 (871 of 1923) PASS: lldb-shell :: ObjectFile/PECOFF/default-triple-windows-msvc.yaml (872 of 1923) PASS: lldb-api :: lang/cpp/pointer_to_member_type_depending_on_parent_size/TestPointerToMemberTypeDependingOnParentSize.py (873 of 1923) PASS: lldb-api :: commands/expression/context-object/TestContextObject.py (874 of 1923) PASS: lldb-api :: functionalities/breakpoint/debugbreak/TestDebugBreak.py (875 of 1923) PASS: lldb-shell :: Settings/TestLineMarkerColor.test (876 of 1923) UNSUPPORTED: lldb-shell :: SymbolFile/NativePDB/globals-bss.cpp (877 of 1923) PASS: lldb-shell :: Commands/command-thread-select.test (878 of 1923) PASS: lldb-unit :: Process/gdb-remote/./ProcessGdbRemoteTests/16/19 (879 of 1923) PASS: lldb-unit :: Signals/./SignalsTests/3/5 (880 of 1923) PASS: lldb-shell :: Reproducer/Modules/TestModuleCXX.test (881 of 1923) PASS: lldb-unit :: Host/./HostTests/13/19 (882 of 1923) PASS: lldb-shell :: Breakpoint/debug_rnglist_rlestartend.test (883 of 1923) UNSUPPORTED: lldb-api :: commands/gui/expand-threads-tree/TestGuiExpandThreadsTree.py (884 of 1923) PASS: lldb-shell :: ObjectFile/ELF/gnu-debuglink.yaml (885 of 1923) PASS: lldb-api :: lang/objc/objc-new-syntax/TestObjCNewSyntaxArray.py (886 of 1923) XFAIL: lldb-shell :: Register/x86-mm-xmm-write.test (887 of 1923) PASS: lldb-shell :: Settings/TestDefaultModuleCachePath.test (888 of 1923) PASS: lldb-shell :: ObjectFile/ELF/riscv-arch.yaml (889 of 1923) UNSUPPORTED: lldb-api :: commands/watchpoints/watchpoint_disable/TestWatchpointDisable.py (890 of 1923) PASS: lldb-api :: functionalities/gdb_remote_client/TestNoLocalFile.py (891 of 1923) UNSUPPORTED: lldb-shell :: SymbolFile/NativePDB/lookup-by-address.cpp (892 of 1923) UNSUPPORTED: lldb-api :: functionalities/ptrauth_diagnostics/brkC47x_code/TestPtrauthBRKc47xDiagnostic.py (893 of 1923) PASS: lldb-api :: commands/reproducer/invalid-args/TestInvalidArgsReproducer.py (894 of 1923) PASS: lldb-shell :: SymbolFile/DWARF/x86/dwarf5-debug_line-file-index.s (895 of 1923) UNSUPPORTED: lldb-api :: lang/objc/modules-hash-mismatch/TestClangModulesHashMismatch.py (896 of 1923) PASS: lldb-api :: commands/expression/radar_9531204/TestPrintfAfterUp.py (897 of 1923) UNSUPPORTED: lldb-api :: functionalities/dyld-launch-linux/TestDyldLaunchLinux.py (898 of 1923) PASS: lldb-api :: tools/lldb-vscode/optimized/TestVSCode_optimized.py (899 of 1923) PASS: lldb-api :: lang/cpp/exceptions/TestCPPExceptionBreakpoints.py (900 of 1923) UNSUPPORTED: lldb-shell :: SymbolFile/NativePDB/local-variables-registers.s (901 of 1923) UNSUPPORTED: lldb-api :: functionalities/ptrauth_diagnostics/brkC47x_x16_invalid/TestPtrauthBRKc47xX16Invalid.py (902 of 1923) PASS: lldb-shell :: Breakpoint/single-file-split-dwarf.test (903 of 1923) PASS: lldb-api :: functionalities/data-formatter/data-formatter-stl/generic/bitset/TestDataFormatterGenericBitset.py (904 of 1923) UNSUPPORTED: lldb-api :: macosx/lc-note/addrable-bits/TestAddrableBitsCorefile.py (905 of 1923) UNSUPPORTED: lldb-api :: python_api/watchpoint/watchlocation/TestTargetWatchAddress.py (906 of 1923) PASS: lldb-api :: python_api/debugger/TestDebuggerAPI.py (907 of 1923) UNSUPPORTED: lldb-shell :: Subprocess/vfork-follow-child-wp.test (908 of 1923) UNSUPPORTED: lldb-shell :: Register/x86-db-read.test (909 of 1923) PASS: lldb-unit :: Language/Highlighting/./HighlighterTests/27/29 (910 of 1923) PASS: lldb-api :: python_api/sblaunchinfo/TestSBLaunchInfo.py (911 of 1923) PASS: lldb-api :: functionalities/set-data/TestSetData.py (912 of 1923) PASS: lldb-api :: python_api/breakpoint/TestBreakpointAPI.py (913 of 1923) PASS: lldb-unit :: Expression/./ExpressionTests/0/22 (914 of 1923) PASS: lldb-api :: python_api/interpreter/TestCommandInterpreterAPI.py (915 of 1923) PASS: lldb-unit :: SymbolFile/DWARF/./SymbolFileDWARFTests/13/29 (916 of 1923) PASS: lldb-api :: functionalities/completion/TestCompletion.py (917 of 1923) PASS: lldb-shell :: SymbolFile/DWARF/x86/DW_TAG_basic_type_DW_ATE_UTF_nonC.ll (918 of 1923) PASS: lldb-shell :: Unwind/eh-frame-dwarf-unwind.test (919 of 1923) PASS: lldb-shell :: Quit/TestQuitExitCodeImplicit0.test (920 of 1923) PASS: lldb-api :: lang/c/modules/TestCModules.py (921 of 1923) PASS: lldb-shell :: SymbolFile/DWARF/x86/apple-index-is-used.cpp (922 of 1923) PASS: lldb-api :: lang/cpp/class-template-parameter-pack/TestClassTemplateParameterPack.py (923 of 1923) PASS: lldb-unit :: Language/Highlighting/./HighlighterTests/7/29 (924 of 1923) PASS: lldb-unit :: Signals/./SignalsTests/1/5 (925 of 1923) PASS: lldb-shell :: Reproducer/TestFileRepro.test (926 of 1923) UNSUPPORTED: lldb-shell :: SymbolFile/PDB/pointers.test (927 of 1923) PASS: lldb-api :: commands/platform/sdk/TestPlatformSDK.py (928 of 1923) UNSUPPORTED: lldb-api :: commands/expression/completion-crash-invalid-iterator/TestInvalidIteratorCompletionCrash.py (929 of 1923) PASS: lldb-unit :: ObjectFile/Breakpad/./ObjectFileBreakpadTests/0/11 (930 of 1923) PASS: lldb-unit :: DataFormatter/./LLDBFormatterTests/2/11 (931 of 1923) UNSUPPORTED: lldb-shell :: Subprocess/fork-follow-child-softbp.test (932 of 1923) PASS: lldb-api :: functionalities/thread/concurrent_events/TestConcurrentManyCrash.py (933 of 1923) PASS: lldb-api :: functionalities/thread/concurrent_events/TestConcurrentDelaySignalBreak.py (934 of 1923) PASS: lldb-api :: test_utils/TestDecorators.py (935 of 1923) PASS: lldb-api :: macosx/order/TestOrderFile.py (936 of 1923) UNSUPPORTED: lldb-api :: commands/watchpoints/watchpoint_commands/TestWatchpointCommands.py (937 of 1923) PASS: lldb-api :: commands/command/script/import/TestImport.py (938 of 1923) PASS: lldb-api :: commands/expression/calculator_mode/TestCalculatorMode.py (939 of 1923) UNSUPPORTED: lldb-shell :: ObjectFile/ELF/basic-info.yaml (940 of 1923) PASS: lldb-api :: functionalities/data-formatter/var-in-aggregate-misuse/TestVarInAggregateMisuse.py (941 of 1923) PASS: lldb-unit :: Process/Utility/./ProcessUtilityTests/1/16 (942 of 1923) PASS: lldb-shell :: Quit/TestQuitExitCodeTooManyArgs.test (943 of 1923) PASS: lldb-api :: functionalities/gdb_remote_client/TestRecognizeBreakpoint.py (944 of 1923) PASS: lldb-unit :: Language/Highlighting/./HighlighterTests/8/29 (945 of 1923) PASS: lldb-shell :: Driver/TestRepl.test (946 of 1923) PASS: lldb-api :: commands/expression/rdar44436068/Test128BitsInteger.py (947 of 1923) UNSUPPORTED: lldb-api :: lang/objc/conflicting-class-list-function-from-user/TestObjCClassListFunctionFromUser.py (948 of 1923) PASS: lldb-api :: functionalities/gdb_remote_client/TestGDBServerTargetXML.py (949 of 1923) UNSUPPORTED: lldb-shell :: SymbolFile/DWARF/x86/find-function-regex.cpp (950 of 1923) PASS: lldb-shell :: SymbolFile/DWARF/x86/dwo-not-found-warning.cpp (951 of 1923) XFAIL: lldb-shell :: Register/x86-64-fp-read.test (952 of 1923) UNSUPPORTED: lldb-api :: tools/lldb-server/TestGdbRemoteForkNonStop.py (953 of 1923) UNSUPPORTED: lldb-shell :: Register/x86-fp-read.test (954 of 1923) PASS: lldb-shell :: Register/Core/x86-64-linux-addr.test (955 of 1923) PASS: lldb-unit :: Expression/./ExpressionTests/20/22 (956 of 1923) UNSUPPORTED: lldb-shell :: SymbolFile/NativePDB/stack_unwinding01.cpp (957 of 1923) PASS: lldb-api :: functionalities/data-formatter/data-formatter-stl/generic/list/TestDataFormatterGenericList.py (958 of 1923) PASS: lldb-api :: lang/cpp/class-template-non-type-parameter-pack/TestClassTemplateNonTypeParameterPack.py (959 of 1923) PASS: lldb-shell :: SymbolFile/DWARF/x86/debug_aranges-empty-section.s (960 of 1923) PASS: lldb-unit :: Platform/./LLDBPlatformTests/6/16 (961 of 1923) PASS: lldb-api :: functionalities/plugins/python_os_plugin/TestPythonOSPlugin.py (962 of 1923) PASS: lldb-api :: functionalities/object-file/TestImageListMultiArchitecture.py (963 of 1923) PASS: lldb-shell :: Symtab/symtab-regex-mangled.test (964 of 1923) UNSUPPORTED: lldb-api :: commands/watchpoints/watchpoint_size/TestWatchpointSizes.py (965 of 1923) PASS: lldb-api :: symbol_ondemand/shared_library/TestSharedLibOnDemand.py (966 of 1923) UNSUPPORTED: lldb-shell :: Process/Windows/process_load.cpp (967 of 1923) PASS: lldb-shell :: Settings/TestSettingsSet.test (968 of 1923) PASS: lldb-unit :: Target/./TargetTests/0/19 (969 of 1923) PASS: lldb-api :: commands/expression/timeout/TestCallWithTimeout.py (970 of 1923) PASS: lldb-api :: functionalities/data-formatter/data-formatter-stl/libcxx/string/simulator/TestDataFormatterLibcxxStringSimulator.py (971 of 1923) UNSUPPORTED: lldb-shell :: ScriptInterpreter/Lua/convenience_variables.test (972 of 1923) PASS: lldb-unit :: UnwindAssembly/x86/./UnwindAssemblyx86Tests/0/27 (973 of 1923) PASS: lldb-shell :: ScriptInterpreter/Python/Crashlog/text.test (974 of 1923) PASS: lldb-shell :: SymbolFile/Breakpad/line-table-missing-file.test (975 of 1923) PASS: lldb-unit :: Interpreter/./InterpreterTests/12/14 (976 of 1923) PASS: lldb-unit :: Expression/./ExpressionTests/21/22 (977 of 1923) XFAIL: lldb-shell :: Unwind/prefer-debug-over-eh-frame.test (978 of 1923) PASS: lldb-shell :: Quit/TestQuitExitCodeHex0.test (979 of 1923) PASS: lldb-api :: functionalities/gdb_remote_client/TestGDBRemoteDiskFileCompletion.py (980 of 1923) PASS: lldb-api :: functionalities/data-formatter/data-formatter-named-summaries/TestDataFormatterNamedSummaries.py (981 of 1923) UNSUPPORTED: lldb-api :: functionalities/process_save_core/TestProcessSaveCore.py (982 of 1923) PASS: lldb-unit :: ObjectFile/Breakpad/./ObjectFileBreakpadTests/1/11 (983 of 1923) PASS: lldb-api :: lang/objc/forward-decl/TestForwardDecl.py (984 of 1923) PASS: lldb-api :: functionalities/breakpoint/auto_continue/TestBreakpointAutoContinue.py (985 of 1923) PASS: lldb-api :: commands/frame/diagnose/local-variable/TestLocalVariable.py (986 of 1923) PASS: lldb-api :: commands/expression/import-std-module/forward_list/TestForwardListFromStdModule.py (987 of 1923) PASS: lldb-api :: lang/cpp/class_types/TestClassTypes.py (988 of 1923) PASS: lldb-api :: functionalities/conditional_break/TestConditionalBreak.py (989 of 1923) UNSUPPORTED: lldb-api :: functionalities/tsan/global_location/TestTsanGlobalLocation.py (990 of 1923) PASS: lldb-api :: lang/objc/foundation/TestObjCMethodsNSError.py (991 of 1923) UNSUPPORTED: lldb-shell :: Subprocess/clone-follow-parent-wp.test (992 of 1923) XFAIL: lldb-api :: lang/c/local_types/TestUseClosestType.py (993 of 1923) PASS: lldb-api :: functionalities/wrong_commands/TestWrongCommands.py (994 of 1923) UNSUPPORTED: lldb-shell :: SymbolFile/DWARF/dwo-relative-path.s (995 of 1923) PASS: lldb-api :: commands/command/invalid-args/TestInvalidArgsCommand.py (996 of 1923) PASS: lldb-api :: functionalities/inferior-crashing/recursive-inferior/TestRecursiveInferior.py (997 of 1923) PASS: lldb-unit :: DataFormatter/./LLDBFormatterTests/4/11 (998 of 1923) PASS: lldb-api :: functionalities/inferior-assert/TestInferiorAssert.py (999 of 1923) PASS: lldb-shell :: ScriptInterpreter/Python/Crashlog/parser_text.test (1000 of 1923) PASS: lldb-api :: functionalities/breakpoint/serialize/TestBreakpointSerialization.py (1001 of 1923) PASS: lldb-api :: lang/cpp/constructors/TestCppConstructors.py (1002 of 1923) PASS: lldb-api :: lang/objc/objc-optimized/TestObjcOptimized.py (1003 of 1923) PASS: lldb-api :: python_api/value/empty_class/TestValueAPIEmptyClass.py (1004 of 1923) UNSUPPORTED: lldb-api :: commands/register/register/aarch64_sve_registers/rw_access_dynamic_resize/TestSVEThreadedDynamic.py (1005 of 1923) PASS: lldb-api :: lang/cpp/dynamic-value-same-basename/TestDynamicValueSameBase.py (1006 of 1923) PASS: lldb-shell :: Register/x86-64-ymm-read.test (1007 of 1923) PASS: lldb-shell :: Settings/TestDisassemblyFormat.test (1008 of 1923) PASS: lldb-api :: functionalities/dlopen_other_executable/TestDlopenOtherExecutable.py (1009 of 1923) PASS: lldb-api :: functionalities/data-formatter/data-formatter-objc/TestDataFormatterObjNSException.py (1010 of 1923) PASS: lldb-unit :: DataFormatter/./LLDBFormatterTests/6/11 (1011 of 1923) UNSUPPORTED: lldb-api :: commands/watchpoints/watchpoint_events/TestWatchpointEvents.py (1012 of 1923) UNSUPPORTED: lldb-api :: lang/objcxx/cxx-bridged-po/TestObjCXXBridgedPO.py (1013 of 1923) PASS: lldb-shell :: Recognizer/assert.test (1014 of 1923) PASS: lldb-api :: commands/expression/invalid-args/TestInvalidArgsExpression.py (1015 of 1923) UNSUPPORTED: lldb-shell :: ObjectFile/ELF/minidebuginfo-set-and-hit-breakpoint.test (1016 of 1923) PASS: lldb-api :: commands/frame/recognizer/TestFrameRecognizer.py (1017 of 1923) PASS: lldb-shell :: Driver/TestPageZeroRead.test (1018 of 1923) PASS: lldb-api :: functionalities/data-formatter/parray/TestPrintArray.py (1019 of 1923) PASS: lldb-api :: python_api/symbol-context/two-files/TestSymbolContextTwoFiles.py (1020 of 1923) UNSUPPORTED: lldb-shell :: SymbolFile/DWARF/x86/array-sizes.s (1021 of 1923) UNSUPPORTED: lldb-api :: functionalities/thread/concurrent_events/TestConcurrentBreakpointsDelayedBreakpointOneWatchpoint.py (1022 of 1923) PASS: lldb-api :: types/TestFloatTypesExpr.py (1023 of 1923) UNSUPPORTED: lldb-shell :: SymbolFile/DWARF/debug-types-expressions.test (1024 of 1923) PASS: lldb-api :: source-manager/TestSourceManager.py (1025 of 1923) PASS: lldb-api :: functionalities/data-formatter/data-formatter-stl/libcxx/variant/TestDataFormatterLibcxxVariant.py (1026 of 1923) PASS: lldb-api :: commands/register/register/register_command/TestRegisters.py (1027 of 1923) PASS: lldb-unit :: DataFormatter/./LLDBFormatterTests/1/11 (1028 of 1923) PASS: lldb-api :: functionalities/stop-on-sharedlibrary-load/TestStopOnSharedlibraryEvents.py (1029 of 1923) PASS: lldb-api :: lang/c/sizeof/TestCSizeof.py (1030 of 1923) PASS: lldb-api :: lang/cpp/class_static/TestStaticVariables.py (1031 of 1923) PASS: lldb-shell :: ScriptInterpreter/Python/scripted_breakpoint_lua.test (1032 of 1923) PASS: lldb-api :: commands/expression/import-std-module/vector-dbg-info-content/TestDbgInfoContentVectorFromStdModule.py (1033 of 1923) PASS: lldb-unit :: Disassembler/ARM/./DisassemblerTests/1/2 (1034 of 1923) PASS: lldb-api :: macosx/version_zero/TestGetVersionZeroVersion.py (1035 of 1923) PASS: lldb-api :: commands/expression/completion-crash-incomplete-record/TestCompletionCrashIncompleteRecord.py (1036 of 1923) UNSUPPORTED: lldb-shell :: SymbolFile/PDB/function-level-linking.test (1037 of 1923) PASS: lldb-shell :: Register/Core/x86-64-linux-gp.test (1038 of 1923) PASS: lldb-api :: types/TestCharTypeExpr.py (1039 of 1923) PASS: lldb-api :: commands/process/signal/TestProcessSignal.py (1040 of 1923) PASS: lldb-api :: python_api/frame/get-variables/TestGetVariables.py (1041 of 1923) PASS: lldb-api :: functionalities/limit-debug-info/TestLimitDebugInfo.py (1042 of 1923) PASS: lldb-api :: macosx/dyld-trie-symbols/TestDyldTrieSymbols.py (1043 of 1923) PASS: lldb-api :: terminal/TestSTTYBeforeAndAfter.py (1044 of 1923) PASS: lldb-unit :: UnwindAssembly/x86/./UnwindAssemblyx86Tests/17/27 (1045 of 1923) UNSUPPORTED: lldb-api :: commands/watchpoints/multiple_hits/TestMultipleHits.py (1046 of 1923) PASS: lldb-api :: functionalities/postmortem/minidump-new/TestMiniDumpNew.py (1047 of 1923) UNSUPPORTED: lldb-api :: tools/lldb-server/TestNonStop.py (1048 of 1923) PASS: lldb-api :: lang/objcxx/cpp_keywords_enabled/TestObjCppKeywordsEnabled.py (1049 of 1923) PASS: lldb-api :: lang/objc/print-obj/TestPrintObj.py (1050 of 1923) PASS: lldb-unit :: Expression/./ExpressionTests/9/22 (1051 of 1923) PASS: lldb-api :: functionalities/data-formatter/data-formatter-objc/TestDataFormatterObjCExpr.py (1052 of 1923) PASS: lldb-unit :: Process/minidump/./LLDBMinidumpTests/3/17 (1053 of 1923) PASS: lldb-unit :: Process/minidump/./LLDBMinidumpTests/12/17 (1054 of 1923) UNSUPPORTED: lldb-shell :: SymbolFile/DWARF/x86/debug-types-address-ranges.s (1055 of 1923) PASS: lldb-unit :: Language/Highlighting/./HighlighterTests/26/29 (1056 of 1923) PASS: lldb-unit :: Utility/./UtilityTests/10/30 (1057 of 1923) PASS: lldb-api :: commands/frame/diagnose/complicated-expression/TestComplicatedExpression.py (1058 of 1923) PASS: lldb-api :: macosx/find-dsym/bundle-with-dot-in-filename/TestBundleWithDotInFilename.py (1059 of 1923) PASS: lldb-shell :: SymbolFile/DWARF/clang-ast-from-dwarf-unamed-and-anon-structs.cpp (1060 of 1923) PASS: lldb-unit :: Host/./HostTests/15/19 (1061 of 1923) PASS: lldb-api :: lang/cpp/accelerator-table/TestCPPAccelerator.py (1062 of 1923) PASS: lldb-unit :: Core/./LLDBCoreTests/10/22 (1063 of 1923) PASS: lldb-api :: lang/cpp/non-type-template-param/TestCppNonTypeTemplateParam.py (1064 of 1923) PASS: lldb-api :: functionalities/breakpoint/breakpoint_on_overload/TestBreakOnOverload.py (1065 of 1923) UNSUPPORTED: lldb-api :: python_api/watchpoint/TestSetWatchpoint.py (1066 of 1923) UNSUPPORTED: lldb-shell :: Register/x86-gp-write.test (1067 of 1923) PASS: lldb-unit :: UnwindAssembly/ARM64/./Arm64InstEmulationTests/4/7 (1068 of 1923) PASS: lldb-api :: functionalities/gdb_remote_client/TestTargetXMLArch.py (1069 of 1923) PASS: lldb-unit :: SymbolFile/DWARF/./SymbolFileDWARFTests/24/29 (1070 of 1923) PASS: lldb-unit :: Symbol/./SymbolTests/2/16 (1071 of 1923) PASS: lldb-unit :: Core/./LLDBCoreTests/18/22 (1072 of 1923) PASS: lldb-shell :: ObjectFile/ELF/PT_LOAD.yaml (1073 of 1923) PASS: lldb-api :: functionalities/tail_call_frames/ambiguous_tail_call_seq2/TestAmbiguousTailCallSeq2.py (1074 of 1923) PASS: lldb-shell :: Register/Core/x86-64-linux-fp.test (1075 of 1923) UNSUPPORTED: lldb-api :: commands/watchpoints/multiple_threads/TestWatchpointMultipleThreads.py (1076 of 1923) PASS: lldb-shell :: SymbolFile/DWARF/DW_AT_range-DW_FORM_sec_offset.s (1077 of 1923) PASS: lldb-unit :: Expression/./ExpressionTests/1/22 (1078 of 1923) PASS: lldb-api :: types/TestDoubleTypesExpr.py (1079 of 1923) PASS: lldb-api :: functionalities/breakpoint/breakpoint_hit_count/TestBreakpointHitCount.py (1080 of 1923) PASS: lldb-shell :: ScriptInterpreter/Python/scripted_breakpoint.test (1081 of 1923) PASS: lldb-api :: lang/objcxx/conflicting-names-class-update-utility-expr/TestObjCConflictingNamesForClassUpdateExpr.py (1082 of 1923) PASS: lldb-shell :: Driver/TestProcessAttach.test (1083 of 1923) PASS: lldb-api :: commands/expression/import-std-module/empty-module/TestEmptyStdModule.py (1084 of 1923) PASS: lldb-api :: commands/target/create-deps/TestTargetCreateDeps.py (1085 of 1923) PASS: lldb-api :: commands/settings/use_source_cache/TestUseSourceCache.py (1086 of 1923) PASS: lldb-shell :: Register/Core/x86-32-freebsd-multithread.test (1087 of 1923) PASS: lldb-api :: commands/expression/two-files/TestObjCTypeQueryFromOtherCompileUnit.py (1088 of 1923) PASS: lldb-api :: python_api/sbenvironment/TestSBEnvironment.py (1089 of 1923) PASS: lldb-api :: commands/target/modules/search-paths/insert/TestTargetModulesSearchpathsInsert.py (1090 of 1923) UNSUPPORTED: lldb-api :: tools/lldb-server/vCont-threads/TestSignal.py (1091 of 1923) PASS: lldb-api :: tools/lldb-vscode/step/TestVSCode_step.py (1092 of 1923) PASS: lldb-api :: python_api/get-value-32bit-int/TestGetValue32BitInt.py (1093 of 1923) PASS: lldb-unit :: SymbolFile/DWARF/./SymbolFileDWARFTests/6/29 (1094 of 1923) PASS: lldb-api :: lang/cpp/template-function/TestTemplateFunctions.py (1095 of 1923) PASS: lldb-api :: commands/command/source/TestCommandSource.py (1096 of 1923) UNSUPPORTED: lldb-api :: functionalities/postmortem/FreeBSDKernel/TestFreeBSDKernelVMCore.py (1097 of 1923) PASS: lldb-shell :: ObjectFile/ELF/section-types.yaml (1098 of 1923) PASS: lldb-shell :: SymbolFile/add-dsym.test (1099 of 1923) PASS: lldb-api :: lang/cpp/trivial_abi/TestTrivialABI.py (1100 of 1923) PASS: lldb-unit :: Interpreter/./InterpreterTests/2/14 (1101 of 1923) PASS: lldb-shell :: Unwind/thread-step-out-ret-addr-check.test (1102 of 1923) PASS: lldb-unit :: Interpreter/./InterpreterTests/11/14 (1103 of 1923) PASS: lldb-api :: lang/c/offsetof/TestOffsetof.py (1104 of 1923) PASS: lldb-api :: macosx/add-dsym/TestAddDsymDownload.py (1105 of 1923) PASS: lldb-api :: tools/lldb-vscode/console/TestVSCode_console.py (1106 of 1923) PASS: lldb-unit :: ObjectFile/MachO/./ObjectFileMachOTests/0/2 (1107 of 1923) PASS: lldb-api :: commands/command/script/TestCommandScript.py (1108 of 1923) PASS: lldb-unit :: Process/Utility/./ProcessUtilityTests/11/16 (1109 of 1923) PASS: lldb-shell :: Symtab/symtab-regex-demangled.test (1110 of 1923) UNSUPPORTED: lldb-api :: functionalities/asan/TestMemoryHistory.py (1111 of 1923) PASS: lldb-api :: iohandler/resize/TestIOHandlerResizeNoEditline.py (1112 of 1923) PASS: lldb-unit :: Symbol/./SymbolTests/6/16 (1113 of 1923) UNSUPPORTED: lldb-api :: linux/aarch64/mte_tag_faults/TestAArch64LinuxMTEMemoryTagFaults.py (1114 of 1923) PASS: lldb-unit :: Process/gdb-remote/./ProcessGdbRemoteTests/2/19 (1115 of 1923) PASS: lldb-shell :: SymbolFile/DWARF/x86/dead-code-filtering.yaml (1116 of 1923) PASS: lldb-api :: lang/objcxx/objc-builtin-types/TestObjCBuiltinTypes.py (1117 of 1923) PASS: lldb-shell :: Register/Core/aarch64-freebsd-multithread.test (1118 of 1923) PASS: lldb-shell :: ObjectFile/ELF/compressed-sections.yaml (1119 of 1923) PASS: lldb-api :: symbol_ondemand/breakpoint_source_regex/TestSourceTextRegexBreakpoint.py (1120 of 1923) PASS: lldb-api :: lang/c/array_types/TestArrayTypes.py (1121 of 1923) PASS: lldb-api :: lang/objc/foundation/TestRuntimeTypes.py (1122 of 1923) UNSUPPORTED: lldb-api :: commands/trace/TestTraceSchema.py (1123 of 1923) UNSUPPORTED: lldb-api :: commands/watchpoints/watchpoint_count/TestWatchpointCount.py (1124 of 1923) PASS: lldb-api :: functionalities/breakpoint/address_breakpoints/TestAddressBreakpoints.py (1125 of 1923) UNSUPPORTED: lldb-shell :: SymbolFile/PDB/enums-layout.test (1126 of 1923) UNSUPPORTED: lldb-shell :: SymbolFile/DWARF/x86/DW_TAG_variable-DW_AT_decl_file-DW_AT_abstract_origin-crosscu1.s (1127 of 1923) UNSUPPORTED: lldb-shell :: SymbolFile/DWARF/x86/dir-separator-posix.s (1128 of 1923) PASS: lldb-api :: functionalities/data-formatter/varscript_formatting/TestDataFormatterVarScriptFormatting.py (1129 of 1923) PASS: lldb-unit :: Host/./HostTests/14/19 (1130 of 1923) UNSUPPORTED: lldb-shell :: SymbolFile/NativePDB/ast-functions.cpp (1131 of 1923) PASS: lldb-unit :: Language/CPlusPlus/./LanguageCPlusPlusTests/1/5 (1132 of 1923) UNSUPPORTED: lldb-shell :: SymbolFile/NativePDB/global-classes.cpp (1133 of 1923) UNSUPPORTED: lldb-api :: tools/lldb-server/libraries-svr4/TestGdbRemoteLibrariesSvr4Support.py (1134 of 1923) PASS: lldb-api :: functionalities/show_location/TestShowLocationDwarf5.py (1135 of 1923) PASS: lldb-shell :: Reproducer/TestHomeDir.test (1136 of 1923) PASS: lldb-shell :: Commands/CommandScriptImmediateOutput/CommandScriptImmediateOutputFile.test (1137 of 1923) UNSUPPORTED: lldb-shell :: SymbolFile/PDB/func-symbols.test (1138 of 1923) PASS: lldb-shell :: Subprocess/fork-follow-parent.test (1139 of 1923) PASS: lldb-api :: functionalities/data-formatter/data-formatter-stl/libcxx/initializerlist/TestInitializerList.py (1140 of 1923) UNSUPPORTED: lldb-api :: python_api/watchpoint/condition/TestWatchpointConditionAPI.py (1141 of 1923) PASS: lldb-api :: macosx/lc-note/kern-ver-str/TestKernVerStrLCNOTE.py (1142 of 1923) PASS: lldb-api :: functionalities/module_cache/bsd/TestModuleCacheBSD.py (1143 of 1923) PASS: lldb-api :: functionalities/data-formatter/ostypeformatting/TestFormattersOsType.py (1144 of 1923) PASS: lldb-api :: python_api/frame/TestFrames.py (1145 of 1923) PASS: lldb-api :: lang/cpp/wchar_t/TestCxxWCharT.py (1146 of 1923) PASS: lldb-api :: sanity/TestSettingSkipping.py (1147 of 1923) PASS: lldb-unit :: Process/Utility/./ProcessUtilityTests/2/16 (1148 of 1923) PASS: lldb-unit :: Utility/./UtilityTests/17/30 (1149 of 1923) PASS: lldb-api :: functionalities/breakpoint/breakpoint_callback_command_source/TestBreakpointCallbackCommandSource.py (1150 of 1923) PASS: lldb-unit :: Platform/./LLDBPlatformTests/5/16 (1151 of 1923) PASS: lldb-api :: lang/objc/modules-objc-property/TestModulesObjCProperty.py (1152 of 1923) UNSUPPORTED: lldb-shell :: Unwind/split-machine-functions.test (1153 of 1923) PASS: lldb-unit :: Utility/./UtilityTests/23/30 (1154 of 1923) PASS: lldb-api :: lang/cpp/unique-types/TestUniqueTypes.py (1155 of 1923) UNSUPPORTED: lldb-api :: lang/cpp/reference-to-outer-type/TestCppReferenceToOuterClass.py (1156 of 1923) UNSUPPORTED: lldb-shell :: BuildScript/toolchain-clang-cl.test (1157 of 1923) PASS: lldb-shell :: ScriptInterpreter/Python/Crashlog/json.test (1158 of 1923) PASS: lldb-unit :: SymbolFile/DWARF/./SymbolFileDWARFTests/23/29 (1159 of 1923) PASS: lldb-api :: python_api/sbvalue_persist/TestSBValuePersist.py (1160 of 1923) UNSUPPORTED: lldb-api :: commands/watchpoints/watchpoint_set_command/TestWatchLocationWithWatchSet.py (1161 of 1923) UNSUPPORTED: lldb-api :: functionalities/thread/concurrent_events/TestConcurrentDelayedCrashWithBreakpointWatchpoint.py (1162 of 1923) PASS: lldb-unit :: Process/Utility/./ProcessUtilityTests/8/16 (1163 of 1923) PASS: lldb-shell :: ObjectFile/ELF/minidebuginfo-find-symbols.yaml (1164 of 1923) PASS: lldb-api :: lang/cpp/nsimport/TestCppNsImport.py (1165 of 1923) PASS: lldb-shell :: SymbolFile/Breakpad/unwind-via-stack-cfi.test (1166 of 1923) PASS: lldb-api :: python_api/name_lookup/TestNameLookup.py (1167 of 1923) PASS: lldb-api :: macosx/builtin-debugtrap/TestBuiltinDebugTrap.py (1168 of 1923) PASS: lldb-unit :: Utility/./UtilityTests/29/30 (1169 of 1923) PASS: lldb-api :: functionalities/data-formatter/data-formatter-stl/libcxx/queue/TestDataFormatterLibcxxQueue.py (1170 of 1923) PASS: lldb-shell :: Register/Core/x86-64-freebsd-addr.test (1171 of 1923) PASS: lldb-unit :: Platform/./LLDBPlatformTests/1/16 (1172 of 1923) PASS: lldb-api :: commands/session/save/TestSessionSave.py (1173 of 1923) PASS: lldb-api :: lang/cpp/typedef/TestCppTypedef.py (1174 of 1923) PASS: lldb-api :: lang/cpp/elaborated-types/TestElaboratedTypes.py (1175 of 1923) PASS: lldb-api :: types/TestCharType.py (1176 of 1923) PASS: lldb-shell :: SymbolFile/DWARF/x86/DW_OP_deref_size_static_var.s (1177 of 1923) PASS: lldb-api :: functionalities/data-formatter/data-formatter-stl/libcxx/unique_ptr/TestDataFormatterLibcxxUniquePtr.py (1178 of 1923) PASS: lldb-unit :: Utility/./UtilityTests/5/30 (1179 of 1923) PASS: lldb-unit :: Process/gdb-remote/./ProcessGdbRemoteTests/4/19 (1180 of 1923) PASS: lldb-api :: lang/cpp/multiple-inheritance/TestCppMultipleInheritance.py (1181 of 1923) PASS: lldb-api :: commands/expression/call-function/TestCallStdStringFunction.py (1182 of 1923) PASS: lldb-unit :: Language/Highlighting/./HighlighterTests/3/29 (1183 of 1923) PASS: lldb-api :: lang/objc/objc-ivar-offsets/TestObjCIvarOffsets.py (1184 of 1923) PASS: lldb-api :: functionalities/inferior-crashing/recursive-inferior/TestRecursiveInferiorStep.py (1185 of 1923) PASS: lldb-api :: functionalities/data-formatter/data-formatter-objc/TestDataFormatterObjCKVO.py (1186 of 1923) PASS: lldb-api :: macosx/skinny-corefile/TestSkinnyCorefile.py (1187 of 1923) PASS: lldb-api :: lang/objc/variadic_methods/TestVariadicMethods.py (1188 of 1923) PASS: lldb-api :: functionalities/data-formatter/ptr_ref_typedef/TestPtrRef2Typedef.py (1189 of 1923) PASS: lldb-api :: lang/c/tls_globals/TestTlsGlobals.py (1190 of 1923) PASS: lldb-unit :: UnwindAssembly/x86/./UnwindAssemblyx86Tests/23/27 (1191 of 1923) UNSUPPORTED: lldb-shell :: SymbolFile/DWARF/x86/dir-separator-no-comp-dir.s (1192 of 1923) PASS: lldb-api :: tools/lldb-vscode/stop-hooks/TestVSCode_stop_hooks.py (1193 of 1923) PASS: lldb-unit :: Target/./TargetTests/9/19 (1194 of 1923) PASS: lldb-shell :: Breakpoint/breakpoint-command.test (1195 of 1923) UNSUPPORTED: lldb-api :: lua_api/TestLuaAPI.py (1196 of 1923) PASS: lldb-api :: functionalities/data-formatter/hexcaps/TestDataFormatterHexCaps.py (1197 of 1923) PASS: lldb-api :: functionalities/thread/concurrent_events/TestConcurrentSignalDelayBreak.py (1198 of 1923) PASS: lldb-api :: tools/lldb-vscode/breakpoint-events/TestVSCode_breakpointEvents.py (1199 of 1923) PASS: lldb-api :: lang/objc/complete-type-check/TestObjCIsTypeComplete.py (1200 of 1923) PASS: lldb-api :: functionalities/memory/find/TestMemoryFind.py (1201 of 1923) PASS: lldb-api :: linux/aarch64/mte_core_file/TestAArch64LinuxMTEMemoryTagCoreFile.py (1202 of 1923) PASS: lldb-api :: iohandler/resize/TestIOHandlerResize.py (1203 of 1923) PASS: lldb-api :: functionalities/target_var/no_vars/TestTargetVarNoVars.py (1204 of 1923) PASS: lldb-api :: tools/lldb-vscode/console/TestVSCode_redirection_to_console.py (1205 of 1923) UNSUPPORTED: lldb-shell :: SymbolFile/PDB/ast-restore.test (1206 of 1923) PASS: lldb-unit :: debugserver/./debugserverTests/5/6 (1207 of 1923) UNSUPPORTED: lldb-api :: macosx/macCatalystAppMacOSFramework/TestMacCatalystAppWithMacOSFramework.py (1208 of 1923) PASS: lldb-unit :: SymbolFile/NativePDB/./SymbolFileNativePDBTests/0/15 (1209 of 1923) UNSUPPORTED: lldb-shell :: SymbolFile/DWARF/split-optimized.c (1210 of 1923) UNSUPPORTED: lldb-shell :: Breakpoint/ppc64le-localentry.test (1211 of 1923) PASS: lldb-unit :: Core/./LLDBCoreTests/21/22 (1212 of 1923) UNSUPPORTED: lldb-shell :: ScriptInterpreter/Lua/lua.test (1213 of 1923) PASS: lldb-api :: lang/objc/modules-cache/TestClangModulesCache.py (1214 of 1923) PASS: lldb-unit :: Target/./TargetTests/16/19 (1215 of 1923) PASS: lldb-api :: lang/objc/orderedset/TestOrderedSet.py (1216 of 1923) PASS: lldb-unit :: Expression/./ExpressionTests/4/22 (1217 of 1923) UNSUPPORTED: lldb-api :: functionalities/thread/multi_break/TestMultipleBreakpoints.py (1218 of 1923) PASS: lldb-api :: functionalities/thread/step_out/TestThreadStepOut.py (1219 of 1923) PASS: lldb-shell :: BuildScript/modes.test (1220 of 1923) PASS: lldb-api :: commands/target/stop-hook/disable/TestTargetStopHookDisable.py (1221 of 1923) PASS: lldb-api :: commands/expression/xvalue/TestXValuePrinting.py (1222 of 1923) PASS: lldb-api :: functionalities/breakpoint/breakpoint_by_line_and_column/TestBreakpointByLineAndColumn.py (1223 of 1923) UNSUPPORTED: lldb-shell :: ScriptInterpreter/Lua/partial_statements.test (1224 of 1923) PASS: lldb-api :: lang/cpp/function-local-class/TestCppFunctionLocalClass.py (1225 of 1923) PASS: lldb-unit :: Process/gdb-remote/./ProcessGdbRemoteTests/11/19 (1226 of 1923) PASS: lldb-api :: functionalities/data-formatter/data-formatter-objc/TestDataFormatterObjCNSError.py (1227 of 1923) PASS: lldb-api :: commands/expression/argument_passing_restrictions/TestArgumentPassingRestrictions.py (1228 of 1923) UNSUPPORTED: lldb-shell :: Register/x86-64-zmm-read.test (1229 of 1923) PASS: lldb-api :: lang/c/vla/TestVLA.py (1230 of 1923) PASS: lldb-unit :: Target/./TargetTests/17/19 (1231 of 1923) PASS: lldb-api :: functionalities/load_after_attach/TestLoadAfterAttach.py (1232 of 1923) PASS: lldb-shell :: Breakpoint/debug_rnglist_basic.test (1233 of 1923) PASS: lldb-unit :: DataFormatter/./LLDBFormatterTests/8/11 (1234 of 1923) PASS: lldb-api :: functionalities/non-overlapping-index-variable-i/TestIndexVariable.py (1235 of 1923) PASS: lldb-api :: macosx/indirect_symbol/TestIndirectSymbols.py (1236 of 1923) PASS: lldb-unit :: Utility/./UtilityTests/1/30 (1237 of 1923) UNSUPPORTED: lldb-shell :: SymbolFile/DWARF/x86/find-basic-function.cpp (1238 of 1923) PASS: lldb-unit :: ScriptInterpreter/Python/./ScriptInterpreterPythonTests/4/19 (1239 of 1923) PASS: lldb-api :: commands/target/stop-hook/enable/TestTargetStopHookEnable.py (1240 of 1923) UNSUPPORTED: lldb-shell :: ObjectFile/PECOFF/uuid.yaml (1241 of 1923) PASS: lldb-api :: python_api/sberror/TestSBError.py (1242 of 1923) PASS: lldb-api :: tools/lldb-vscode/runInTerminal/TestVSCode_runInTerminal.py (1243 of 1923) PASS: lldb-api :: lang/objc/blocks/TestObjCIvarsInBlocks.py (1244 of 1923) PASS: lldb-unit :: SymbolFile/DWARF/./SymbolFileDWARFTests/26/29 (1245 of 1923) PASS: lldb-api :: lang/objc/unicode-string/TestUnicodeString.py (1246 of 1923) PASS: lldb-shell :: Register/Core/x86-64-netbsd-gp.test (1247 of 1923) UNSUPPORTED: lldb-shell :: ScriptInterpreter/Lua/lua-python.test (1248 of 1923) PASS: lldb-api :: functionalities/data-formatter/data-formatter-objc/TestDataFormatterObjCNSData.py (1249 of 1923) PASS: lldb-api :: python_api/lldbutil/TestSwigVersion.py (1250 of 1923) PASS: lldb-shell :: Reproducer/TestDump.test (1251 of 1923) UNSUPPORTED: lldb-shell :: ScriptInterpreter/Lua/breakpoint_callback.test (1252 of 1923) UNSUPPORTED: lldb-shell :: Register/x86-64-ymm16-write.test (1253 of 1923) PASS: lldb-api :: lang/cpp/static_methods/TestCPPStaticMethods.py (1254 of 1923) PASS: lldb-unit :: Process/Utility/./ProcessUtilityTests/12/16 (1255 of 1923) PASS: lldb-shell :: Commands/command-regex-delete.test (1256 of 1923) PASS: lldb-api :: functionalities/gdb_remote_client/TestRegDefinitionInParts.py (1257 of 1923) PASS: lldb-unit :: Breakpoint/./LLDBBreakpointTests/0/1 (1258 of 1923) PASS: lldb-api :: python_api/signals/TestSignalsAPI.py (1259 of 1923) PASS: lldb-api :: functionalities/data-formatter/data-formatter-stl/libcxx/unordered_map/TestDataFormatterLibccUnorderedMap.py (1260 of 1923) PASS: lldb-api :: lang/c/unions/TestUnionMembers.py (1261 of 1923) PASS: lldb-api :: lang/c/cpp_keyword_identifiers/TestCppKeywordsAsCIdentifiers.py (1262 of 1923) UNSUPPORTED: lldb-shell :: Register/x86-ymm-write.test (1263 of 1923) PASS: lldb-api :: functionalities/data-formatter/format-propagation/TestFormatPropagation.py (1264 of 1923) PASS: lldb-shell :: SymbolFile/Breakpad/line-table-discontinuous-file-ids.test (1265 of 1923) PASS: lldb-api :: lang/cpp/namespace_conflicts/TestNamespaceConflicts.py (1266 of 1923) PASS: lldb-shell :: ObjectFile/Breakpad/breakpad-identification.test (1267 of 1923) PASS: lldb-unit :: SymbolFile/NativePDB/./SymbolFileNativePDBTests/7/15 (1268 of 1923) UNSUPPORTED: lldb-api :: benchmarks/frame_variable/TestFrameVariableResponse.py (1269 of 1923) PASS: lldb-api :: lang/cpp/covariant-return-types/TestCovariantReturnTypes.py (1270 of 1923) PASS: lldb-shell :: Register/Core/x86-32-netbsd-gp.test (1271 of 1923) PASS: lldb-api :: lang/objc/foundation/TestObjectDescriptionAPI.py (1272 of 1923) PASS: lldb-api :: lang/objc/objc++/TestObjCXX.py (1273 of 1923) UNSUPPORTED: lldb-api :: lang/objc/objc-dynamic-value/TestObjCDynamicValue.py (1274 of 1923) PASS: lldb-api :: commands/expression/import-std-module/shared_ptr/TestSharedPtrFromStdModule.py (1275 of 1923) PASS: lldb-api :: lang/cpp/dynamic-value/TestCppValueCast.py (1276 of 1923) UNSUPPORTED: lldb-shell :: SymbolFile/DWARF/x86/win-i386-line-table.s (1277 of 1923) PASS: lldb-shell :: Minidump/breakpad-symbols.test (1278 of 1923) PASS: lldb-api :: functionalities/tail_call_frames/sbapi_support/TestTailCallFrameSBAPI.py (1279 of 1923) PASS: lldb-api :: functionalities/thread/exit_during_expression/TestExitDuringExpression.py (1280 of 1923) PASS: lldb-api :: functionalities/target-new-solib-notifications/TestModuleLoadedNotifys.py (1281 of 1923) PASS: lldb-api :: commands/expression/call-function/TestCallStopAndContinue.py (1282 of 1923) PASS: lldb-unit :: Core/./LLDBCoreTests/14/22 (1283 of 1923) PASS: lldb-shell :: Commands/command-script-import.test (1284 of 1923) UNSUPPORTED: lldb-api :: commands/trace/TestTraceDumpInstructions.py (1285 of 1923) XFAIL: lldb-shell :: Register/x86-mm-xmm-read.test (1286 of 1923) PASS: lldb-api :: commands/expression/expr-in-syscall/TestExpressionInSyscall.py (1287 of 1923) PASS: lldb-unit :: Process/gdb-remote/./ProcessGdbRemoteTests/15/19 (1288 of 1923) PASS: lldb-unit :: UnwindAssembly/x86/./UnwindAssemblyx86Tests/22/27 (1289 of 1923) PASS: lldb-api :: python_api/frame/inlines/TestInlinedFrame.py (1290 of 1923) PASS: lldb-unit :: UnwindAssembly/x86/./UnwindAssemblyx86Tests/12/27 (1291 of 1923) PASS: lldb-api :: commands/target/select/TestTargetSelect.py (1292 of 1923) PASS: lldb-api :: lang/c/shared_lib_stripped_symbols/TestSharedLibStrippedSymbols.py (1293 of 1923) PASS: lldb-api :: iohandler/autosuggestion/TestAutosuggestion.py (1294 of 1923) PASS: lldb-unit :: UnwindAssembly/x86/./UnwindAssemblyx86Tests/2/27 (1295 of 1923) PASS: lldb-unit :: Utility/./UtilityTests/11/30 (1296 of 1923) PASS: lldb-unit :: tools/lldb-server/tests/./LLDBServerTests/0/2 (1297 of 1923) PASS: lldb-api :: lang/objc/objc-dyn-sbtype/TestObjCDynamicSBType.py (1298 of 1923) PASS: lldb-unit :: Process/minidump/./LLDBMinidumpTests/5/17 (1299 of 1923) PASS: lldb-api :: python_api/value/linked_list/TestValueAPILinkedList.py (1300 of 1923) PASS: lldb-unit :: Process/minidump/./LLDBMinidumpTests/14/17 (1301 of 1923) PASS: lldb-shell :: Driver/TestNoUseColor.test (1302 of 1923) UNSUPPORTED: lldb-api :: tools/lldb-server/TestAppleSimulatorOSType.py (1303 of 1923) UNSUPPORTED: lldb-api :: tools/lldb-server/thread-name/TestGdbRemoteThreadName.py (1304 of 1923) PASS: lldb-api :: macosx/safe-to-func-call/TestSafeFuncCalls.py (1305 of 1923) UNSUPPORTED: lldb-shell :: SymbolFile/DWARF/x86/subprogram_ranges.test (1306 of 1923) PASS: lldb-api :: python_api/sbdata/TestSBData.py (1307 of 1923) PASS: lldb-unit :: UnwindAssembly/x86/./UnwindAssemblyx86Tests/16/27 (1308 of 1923) PASS: lldb-api :: tools/lldb-vscode/variables/TestVSCode_variables.py (1309 of 1923) UNSUPPORTED: lldb-shell :: ScriptInterpreter/Lua/independent_state.test (1310 of 1923) PASS: lldb-unit :: Editline/./EditlineTests/1/2 (1311 of 1923) PASS: lldb-api :: python_api/sbplatform/TestSBPlatform.py (1312 of 1923) PASS: lldb-unit :: Platform/./LLDBPlatformTests/9/16 (1313 of 1923) PASS: lldb-api :: lang/c/register_variables/TestRegisterVariables.py (1314 of 1923) PASS: lldb-api :: qemu/TestQemuAPI.py (1315 of 1923) PASS: lldb-api :: functionalities/data-formatter/data-formatter-caching/TestDataFormatterCaching.py (1316 of 1923) PASS: lldb-unit :: Interpreter/./InterpreterTests/0/14 (1317 of 1923) PASS: lldb-shell :: Reproducer/TestDiscard.test (1318 of 1923) PASS: lldb-api :: functionalities/data-formatter/data-formatter-stl/libcxx/span/TestDataFormatterLibcxxSpan.py (1319 of 1923) PASS: lldb-unit :: Symbol/./SymbolTests/0/16 (1320 of 1923) PASS: lldb-unit :: Utility/./UtilityTests/12/30 (1321 of 1923) PASS: lldb-unit :: API/./APITests/2/3 (1322 of 1923) PASS: lldb-api :: commands/target/dump/TestTargetDumpTypeSystem.py (1323 of 1923) PASS: lldb-api :: functionalities/target_var/TestTargetVar.py (1324 of 1923) PASS: lldb-api :: lang/cpp/char1632_t/TestChar1632T.py (1325 of 1923) UNSUPPORTED: lldb-api :: functionalities/data-formatter/data-formatter-stl/libstdcpp/iterator/TestDataFormatterStdIterator.py (1326 of 1923) PASS: lldb-api :: python_api/section/TestSectionAPI.py (1327 of 1923) PASS: lldb-shell :: Register/Core/x86-32-freebsd-addr.test (1328 of 1923) PASS: lldb-api :: functionalities/float-display/TestFloatDisplay.py (1329 of 1923) PASS: lldb-unit :: UnwindAssembly/ARM64/./Arm64InstEmulationTests/2/7 (1330 of 1923) PASS: lldb-shell :: SymbolFile/DWARF/x86/DW_AT_location-DW_AT_const_value.s (1331 of 1923) PASS: lldb-api :: functionalities/data-formatter/builtin-formats/TestBuiltinFormats.py (1332 of 1923) PASS: lldb-shell :: SymbolFile/DWARF/x86/childless-compile-unit.s (1333 of 1923) PASS: lldb-api :: functionalities/optimized_code/TestNoASanExceptionAfterEvalOP_piece.py (1334 of 1923) UNSUPPORTED: lldb-shell :: Reproducer/TestLuaImport.test (1335 of 1923) PASS: lldb-shell :: REPL/Basic.test (1336 of 1923) PASS: lldb-api :: lang/objc/real-definition/TestRealDefinition.py (1337 of 1923) PASS: lldb-api :: lang/objc/modules-non-objc-target/TestObjCModulesNonObjCTarget.py (1338 of 1923) PASS: lldb-api :: functionalities/signal/handle-abrt/TestHandleAbort.py (1339 of 1923) PASS: lldb-unit :: UnwindAssembly/x86/./UnwindAssemblyx86Tests/3/27 (1340 of 1923) XFAIL: lldb-shell :: Register/x86-fp-write.test (1341 of 1923) PASS: lldb-api :: functionalities/data-formatter/array_typedef/TestArrayTypedef.py (1342 of 1923) PASS: lldb-api :: functionalities/thread/concurrent_events/TestConcurrentBreakpointDelayBreakpointOneSignal.py (1343 of 1923) PASS: lldb-api :: functionalities/data-formatter/typedef_array/TestTypedefArray.py (1344 of 1923) PASS: lldb-shell :: ObjectFile/MachO/subsections.yaml (1345 of 1923) XFAIL: lldb-shell :: Register/x86-64-fp-write.test (1346 of 1923) PASS: lldb-api :: functionalities/data-formatter/data-formatter-stl/generic/multimap/TestDataFormatterGenericMultiMap.py (1347 of 1923) PASS: lldb-shell :: SymbolFile/DWARF/x86/dwarf5-split.s (1348 of 1923) UNSUPPORTED: lldb-shell :: ObjectFile/PECOFF/export-dllfunc.yaml (1349 of 1923) UNSUPPORTED: lldb-api :: macosx/rosetta/TestRosetta.py (1350 of 1923) UNSUPPORTED: lldb-api :: tools/lldb-server/commandline/TestGdbRemoteConnection.py (1351 of 1923) PASS: lldb-unit :: Expression/./ExpressionTests/6/22 (1352 of 1923) PASS: lldb-unit :: Core/./LLDBCoreTests/13/22 (1353 of 1923) PASS: lldb-shell :: SymbolFile/DWARF/x86/DW_OP_piece-struct.s (1354 of 1923) UNSUPPORTED: lldb-shell :: Unwind/unwind-plan-dwarf-dump.test (1355 of 1923) PASS: lldb-api :: functionalities/gdb_remote_client/TestIOSSimulator.py (1356 of 1923) PASS: lldb-api :: commands/expression/import-std-module/retry-with-std-module/TestRetryWithStdModule.py (1357 of 1923) PASS: lldb-shell :: ObjectFile/ELF/duplicate-section.yaml (1358 of 1923) PASS: lldb-api :: lang/objc/objc-stepping/TestObjCStepping.py (1359 of 1923) PASS: lldb-api :: lang/objcxx/class-name-clash/TestNameClash.py (1360 of 1923) PASS: lldb-api :: functionalities/data-formatter/data-formatter-stl/libcxx/shared_ptr/TestDataFormatterLibcxxSharedPtr.py (1361 of 1923) PASS: lldb-api :: functionalities/postmortem/wow64_minidump/TestWow64MiniDump.py (1362 of 1923) PASS: lldb-unit :: Symbol/./SymbolTests/14/16 (1363 of 1923) PASS: lldb-api :: lang/c/stepping/TestThreadStepping.py (1364 of 1923) PASS: lldb-api :: iohandler/completion/TestIOHandlerCompletion.py (1365 of 1923) UNSUPPORTED: lldb-shell :: SymbolFile/NativePDB/disassembly.cpp (1366 of 1923) PASS: lldb-api :: functionalities/data-formatter/data-formatter-stl/libcxx/map/TestDataFormatterLibccMap.py (1367 of 1923) PASS: lldb-unit :: Process/gdb-remote/./ProcessGdbRemoteTests/5/19 (1368 of 1923) PASS: lldb-shell :: Commands/command-stop-hook-no-target.test (1369 of 1923) PASS: lldb-api :: functionalities/data-formatter/data-formatter-stl/libcxx/atomic/TestLibCxxAtomic.py (1370 of 1923) PASS: lldb-api :: functionalities/data-formatter/data-formatter-stl/libcxx/function/TestLibCxxFunction.py (1371 of 1923) PASS: lldb-unit :: Language/CPlusPlus/./LanguageCPlusPlusTests/0/5 (1372 of 1923) PASS: lldb-shell :: SymbolFile/Breakpad/stack-cfi-parsing.test (1373 of 1923) PASS: lldb-unit :: Target/./TargetTests/10/19 (1374 of 1923) UNSUPPORTED: lldb-api :: commands/watchpoints/watchpoint_commands/condition/TestWatchpointConditionCmd.py (1375 of 1923) PASS: lldb-unit :: SymbolFile/DWARF/./SymbolFileDWARFTests/5/29 (1376 of 1923) PASS: lldb-shell :: Commands/command-image-lookup.yaml (1377 of 1923) PASS: lldb-unit :: Language/Highlighting/./HighlighterTests/1/29 (1378 of 1923) PASS: lldb-unit :: Process/./ProcessEventDataTests/0/2 (1379 of 1923) UNSUPPORTED: lldb-shell :: SymbolFile/NativePDB/break-by-line.cpp (1380 of 1923) PASS: lldb-api :: commands/expression/persist_objc_pointeetype/TestPersistObjCPointeeType.py (1381 of 1923) PASS: lldb-unit :: Process/Utility/./ProcessUtilityTests/14/16 (1382 of 1923) UNSUPPORTED: lldb-api :: functionalities/thread/break_after_join/TestBreakAfterJoin.py (1383 of 1923) UNSUPPORTED: lldb-api :: commands/expression/import-std-module/pair/TestPairFromStdModule.py (1384 of 1923) PASS: lldb-unit :: SymbolFile/DWARF/./SymbolFileDWARFTests/2/29 (1385 of 1923) PASS: lldb-unit :: Process/gdb-remote/./ProcessGdbRemoteTests/13/19 (1386 of 1923) UNSUPPORTED: lldb-shell :: ObjectFile/PECOFF/dep-modules.yaml (1387 of 1923) UNSUPPORTED: lldb-api :: commands/trace/TestTraceTSC.py (1388 of 1923) PASS: lldb-unit :: Language/Highlighting/./HighlighterTests/28/29 (1389 of 1923) PASS: lldb-unit :: ObjectFile/PECOFF/./ObjectFilePECOFFTests/2/3 (1390 of 1923) PASS: lldb-api :: python_api/lldbutil/iter/TestLLDBIterator.py (1391 of 1923) PASS: lldb-shell :: Register/Core/x86-32-linux-multithread.test (1392 of 1923) PASS: lldb-shell :: Quit/TestQuitExitCodeHexA.test (1393 of 1923) PASS: lldb-unit :: Target/./TargetTests/4/19 (1394 of 1923) UNSUPPORTED: lldb-api :: commands/platform/connect/TestPlatformConnect.py (1395 of 1923) PASS: lldb-api :: python_api/event/TestEvents.py (1396 of 1923) PASS: lldb-api :: python_api/file_handle/TestFileHandle.py (1397 of 1923) PASS: lldb-shell :: ObjectFile/ELF/eh_frame-symbols.yaml (1398 of 1923) PASS: lldb-unit :: UnwindAssembly/ARM64/./Arm64InstEmulationTests/0/7 (1399 of 1923) PASS: lldb-shell :: BuildScript/compiler-full-path.test (1400 of 1923) PASS: lldb-unit :: ObjectFile/Breakpad/./ObjectFileBreakpadTests/6/11 (1401 of 1923) PASS: lldb-api :: commands/gui/basic/TestGuiBasic.py (1402 of 1923) PASS: lldb-api :: lang/objc/foundation/TestObjCMethodsNSArray.py (1403 of 1923) PASS: lldb-shell :: ExecControl/StopHook/stop-hook.test (1404 of 1923) UNSUPPORTED: lldb-shell :: Subprocess/fork-follow-parent-softbp.test (1405 of 1923) PASS: lldb-api :: commands/expression/import-std-module/deque-dbg-info-content/TestDbgInfoContentDequeFromStdModule.py (1406 of 1923) PASS: lldb-unit :: ObjectFile/ELF/./ObjectFileELFTests/0/4 (1407 of 1923) UNSUPPORTED: lldb-api :: benchmarks/turnaround/TestCompileRunToBreakpointTurnaround.py (1408 of 1923) PASS: lldb-api :: lang/c/complex/TestComplexC99.py (1409 of 1923) UNSUPPORTED: lldb-api :: functionalities/data-formatter/data-formatter-stl/libstdcpp/vector/TestDataFormatterStdVector.py (1410 of 1923) PASS: lldb-api :: assert_messages_test/TestAssertMessages.py (1411 of 1923) PASS: lldb-unit :: Language/Highlighting/./HighlighterTests/21/29 (1412 of 1923) PASS: lldb-shell :: Register/x86-multithread-read.test (1413 of 1923) PASS: lldb-api :: functionalities/gdb_remote_client/TestPlatformClient.py (1414 of 1923) PASS: lldb-api :: commands/expression/anonymous-struct/TestCallUserAnonTypedef.py (1415 of 1923) PASS: lldb-api :: functionalities/load_unload/TestLoadUnload.py (1416 of 1923) PASS: lldb-unit :: ScriptInterpreter/Python/./ScriptInterpreterPythonTests/3/19 (1417 of 1923) PASS: lldb-unit :: ObjectFile/MachO/./ObjectFileMachOTests/1/2 (1418 of 1923) PASS: lldb-api :: functionalities/fat_archives/TestFatArchives.py (1419 of 1923) PASS: lldb-shell :: ObjectFile/PECOFF/dwarf-gnu-debuglink-i686.yaml (1420 of 1923) PASS: lldb-api :: functionalities/tail_call_frames/cross_object/TestCrossObjectTailCalls.py (1421 of 1923) PASS: lldb-api :: commands/expression/import-std-module/queue/TestQueueFromStdModule.py (1422 of 1923) PASS: lldb-api :: commands/expression/static-initializers/TestStaticInitializers.py (1423 of 1923) PASS: lldb-unit :: ObjectFile/ELF/./ObjectFileELFTests/1/4 (1424 of 1923) PASS: lldb-api :: commands/version/TestVersion.py (1425 of 1923) PASS: lldb-unit :: SymbolFile/DWARF/./SymbolFileDWARFTests/7/29 (1426 of 1923) PASS: lldb-unit :: SymbolFile/DWARF/./SymbolFileDWARFTests/8/29 (1427 of 1923) PASS: lldb-api :: functionalities/postmortem/minidump-new/TestMiniDumpUUID.py (1428 of 1923) PASS: lldb-unit :: Process/gdb-remote/./ProcessGdbRemoteTests/3/19 (1429 of 1923) UNSUPPORTED: lldb-api :: functionalities/thread/concurrent_events/TestConcurrentDelaySignalWatch.py (1430 of 1923) PASS: lldb-unit :: Process/Utility/./ProcessUtilityTests/9/16 (1431 of 1923) UNSUPPORTED: lldb-api :: functionalities/ptrauth_diagnostics/BLRAA_error/TestPtrauthBLRAADiagnostic.py (1432 of 1923) PASS: lldb-shell :: Register/Core/x86-32-linux-fp.test (1433 of 1923) PASS: lldb-api :: commands/expression/expr_inside_lambda/TestExprInsideLambdas.py (1434 of 1923) PASS: lldb-api :: tools/lldb-vscode/breakpoint/TestVSCode_setBreakpoints.py (1435 of 1923) PASS: lldb-api :: functionalities/data-formatter/data-formatter-stl/generic/list/loop/TestDataFormatterGenericListLoop.py (1436 of 1923) PASS: lldb-api :: functionalities/data-formatter/vector-types/TestVectorTypesFormatting.py (1437 of 1923) PASS: lldb-api :: functionalities/unwind/noreturn/module-end/TestNoReturnModuleEnd.py (1438 of 1923) PASS: lldb-shell :: ObjectFile/ELF/base-address.yaml (1439 of 1923) UNSUPPORTED: lldb-api :: functionalities/thread/thread_specific_break_plus_condition/TestThreadSpecificBpPlusCondition.py (1440 of 1923) PASS: lldb-api :: commands/expression/import_base_class_when_class_has_derived_member/TestImportBaseClassWhenClassHasDerivedMember.py (1441 of 1923) UNSUPPORTED: lldb-shell :: Subprocess/clone-follow-parent-softbp.test (1442 of 1923) PASS: lldb-api :: commands/expression/radar_9673664/TestExprHelpExamples.py (1443 of 1923) UNSUPPORTED: lldb-shell :: SymbolFile/NativePDB/tag-types.cpp (1444 of 1923) PASS: lldb-api :: lang/objc/objc-baseclass-sbtype/TestObjCBaseClassSBType.py (1445 of 1923) PASS: lldb-api :: macosx/thread-names/TestInterruptThreadNames.py (1446 of 1923) UNSUPPORTED: lldb-api :: linux/aarch64/tagged_memory_access/TestAArch64LinuxTaggedMemoryAccess.py (1447 of 1923) UNSUPPORTED: lldb-api :: arm/breakpoint-it/TestBreakpointIt.py (1448 of 1923) PASS: lldb-api :: python_api/default-constructor/TestDefaultConstructorForAPIObjects.py (1449 of 1923) PASS: lldb-api :: functionalities/dead-strip/TestDeadStrip.py (1450 of 1923) PASS: lldb-shell :: ObjectFile/Breakpad/sections.test (1451 of 1923) PASS: lldb-shell :: ScriptInterpreter/Python/sb_address_exception.test (1452 of 1923) PASS: lldb-shell :: SymbolFile/Breakpad/unwind-via-stack-win.test (1453 of 1923) UNSUPPORTED: lldb-api :: functionalities/unwind/aarch64_unwind_pac/TestAArch64UnwindPAC.py (1454 of 1923) UNSUPPORTED: lldb-api :: functionalities/asan/TestReportData.py (1455 of 1923) PASS: lldb-api :: functionalities/postmortem/elf-core/gcore/TestGCore.py (1456 of 1923) PASS: lldb-shell :: SymbolFile/DWARF/anon_class_w_and_wo_export_symbols.ll (1457 of 1923) UNSUPPORTED: lldb-api :: functionalities/thread/main_thread_exit/TestMainThreadExit.py (1458 of 1923) UNSUPPORTED: lldb-api :: functionalities/thread/concurrent_events/TestConcurrentWatchpointDelayWatchpointOneBreakpoint.py (1459 of 1923) UNSUPPORTED: lldb-api :: functionalities/data-formatter/data-formatter-stl/libstdcpp/tuple/TestDataFormatterStdTuple.py (1460 of 1923) UNSUPPORTED: lldb-shell :: ExecControl/StopHook/stop-hook-threads.test (1461 of 1923) PASS: lldb-api :: commands/log/basic/TestLogHandlers.py (1462 of 1923) PASS: lldb-unit :: Process/minidump/./LLDBMinidumpTests/1/17 (1463 of 1923) PASS: lldb-unit :: Platform/./LLDBPlatformTests/8/16 (1464 of 1923) PASS: lldb-shell :: Settings/TestModuleCacheSanity.test (1465 of 1923) PASS: lldb-api :: api/multithreaded/TestMultithreaded.py (1466 of 1923) PASS: lldb-api :: functionalities/data-formatter/setvaluefromcstring/TestSetValueFromCString.py (1467 of 1923) PASS: lldb-api :: lang/c/flexible-array-members/TestCFlexibleArrayMembers.py (1468 of 1923) UNSUPPORTED: lldb-api :: macosx/corefile-default-ptrauth/TestCorefileDefaultPtrauth.py (1469 of 1923) PASS: lldb-api :: commands/expression/import-std-module/unique_ptr-dbg-info-content/TestUniquePtrDbgInfoContent.py (1470 of 1923) PASS: lldb-unit :: DataFormatter/./LLDBFormatterTests/3/11 (1471 of 1923) PASS: lldb-api :: functionalities/gdb_remote_client/TestQemuAArch64TargetXml.py (1472 of 1923) PASS: lldb-shell :: Expr/TestStringLiteralExpr.test (1473 of 1923) PASS: lldb-unit :: Language/Highlighting/./HighlighterTests/2/29 (1474 of 1923) UNSUPPORTED: lldb-api :: lang/cpp/limit-debug-info/TestWithLimitDebugInfo.py (1475 of 1923) PASS: lldb-api :: python_api/class_members/TestSBTypeClassMembers.py (1476 of 1923) UNSUPPORTED: lldb-api :: tools/lldb-server/TestGdbRemote_vCont.py (1477 of 1923) PASS: lldb-api :: lang/objc/objc-runtime-ivars/TestRuntimeIvars.py (1478 of 1923) PASS: lldb-unit :: Expression/./ExpressionTests/5/22 (1479 of 1923) PASS: lldb-unit :: Thread/./ThreadTests/1/2 (1480 of 1923) PASS: lldb-unit :: SymbolFile/NativePDB/./SymbolFileNativePDBTests/3/15 (1481 of 1923) UNSUPPORTED: lldb-shell :: SymbolFile/DWARF/x86/debug-types-dwo-cross-reference.cpp (1482 of 1923) UNSUPPORTED: lldb-api :: python_api/watchpoint/TestWatchpointIter.py (1483 of 1923) PASS: lldb-shell :: SymbolFile/OnDemand/source-breakpoint.test (1484 of 1923) PASS: lldb-api :: functionalities/tail_call_frames/disambiguate_paths_to_common_sink/TestDisambiguatePathsToCommonSink.py (1485 of 1923) PASS: lldb-unit :: Symbol/./SymbolTests/1/16 (1486 of 1923) PASS: lldb-shell :: SymbolFile/DWARF/x86/module-ownership.mm (1487 of 1923) PASS: lldb-api :: commands/statistics/basic/TestStats.py (1488 of 1923) PASS: lldb-api :: python_api/process/read-mem-cstring/TestReadMemCString.py (1489 of 1923) PASS: lldb-shell :: Commands/command-backtrace-parser-1.test (1490 of 1923) PASS: lldb-api :: functionalities/gdb_remote_client/TestStopPCs.py (1491 of 1923) PASS: lldb-unit :: UnwindAssembly/x86/./UnwindAssemblyx86Tests/6/27 (1492 of 1923) PASS: lldb-unit :: Process/gdb-remote/./ProcessGdbRemoteTests/0/19 (1493 of 1923) PASS: lldb-unit :: Target/./TargetTests/7/19 (1494 of 1923) PASS: lldb-api :: tools/lldb-vscode/attach/TestVSCode_attach.py (1495 of 1923) PASS: lldb-api :: iohandler/sigint/TestProcessIOHandlerInterrupt.py (1496 of 1923) PASS: lldb-api :: lang/c/strings/TestCStrings.py (1497 of 1923) PASS: lldb-api :: functionalities/diagnostic_reporting/TestDiagnosticReporting.py (1498 of 1923) PASS: lldb-unit :: ObjectFile/Breakpad/./ObjectFileBreakpadTests/10/11 (1499 of 1923) PASS: lldb-api :: lang/objc/tagged-pointer/TestTaggedPointerCmd.py (1500 of 1923) UNSUPPORTED: lldb-shell :: ScriptInterpreter/Lua/command_script_import.test (1501 of 1923) PASS: lldb-api :: functionalities/thread/state_after_expression/TestStateAfterExpression.py (1502 of 1923) PASS: lldb-api :: functionalities/breakpoint/breakpoint_command/TestRegexpBreakCommand.py (1503 of 1923) PASS: lldb-api :: functionalities/unwind/noreturn/TestNoreturnUnwind.py (1504 of 1923) PASS: lldb-api :: lang/cpp/template-arguments/TestCppTemplateArguments.py (1505 of 1923) PASS: lldb-api :: lang/cpp/forward-declared-template-specialization/TestCppForwardDeclaredTemplateSpecialization.py (1506 of 1923) UNSUPPORTED: lldb-shell :: SymbolFile/DWARF/x86/find-inline-method.s (1507 of 1923) UNSUPPORTED: lldb-api :: functionalities/thread/concurrent_events/TestConcurrentTwoWatchpointThreads.py (1508 of 1923) PASS: lldb-shell :: Breakpoint/debug_rnglist_offset_pair.test (1509 of 1923) PASS: lldb-api :: functionalities/thread/backtrace_limit/TestBacktraceLimit.py (1510 of 1923) PASS: lldb-api :: driver/job_control/TestJobControl.py (1511 of 1923) PASS: lldb-api :: functionalities/breakpoint/consecutive_breakpoints/TestConsecutiveBreakpoints.py (1512 of 1923) PASS: lldb-api :: commands/expression/scoped_enums/TestScopedEnumType.py (1513 of 1923) UNSUPPORTED: lldb-api :: functionalities/thread/concurrent_events/TestConcurrentSignalDelayWatch.py (1514 of 1923) PASS: lldb-shell :: ScriptInterpreter/None/none.test (1515 of 1923) PASS: lldb-shell :: SymbolFile/DWARF/x86/debug_rnglists.s (1516 of 1923) PASS: lldb-api :: functionalities/load_using_paths/TestLoadUsingPaths.py (1517 of 1923) UNSUPPORTED: lldb-api :: linux/aarch64/tagged_memory_region/TestAArch64LinuxTaggedMemoryRegion.py (1518 of 1923) PASS: lldb-shell :: SymbolFile/DWARF/x86/compilercontext.ll (1519 of 1923) UNSUPPORTED: lldb-api :: linux/sepdebugsymlink/TestTargetSymbolsSepDebugSymlink.py (1520 of 1923) PASS: lldb-unit :: UnwindAssembly/ARM64/./Arm64InstEmulationTests/3/7 (1521 of 1923) UNSUPPORTED: lldb-shell :: SymbolFile/PDB/vbases.test (1522 of 1923) PASS: lldb-api :: macosx/duplicate-archive-members/TestDuplicateMembers.py (1523 of 1923) PASS: lldb-unit :: SymbolFile/DWARF/./SymbolFileDWARFTests/21/29 (1524 of 1923) PASS: lldb-api :: functionalities/data-formatter/data-formatter-objc/TestDataFormatterObjCNSNumber.py (1525 of 1923) PASS: lldb-unit :: Expression/./ExpressionTests/14/22 (1526 of 1923) PASS: lldb-api :: commands/expression/test/TestExprs2.py (1527 of 1923) PASS: lldb-api :: commands/platform/file/read/TestPlatformFileRead.py (1528 of 1923) PASS: lldb-api :: python_api/value_var_update/TestValueVarUpdate.py (1529 of 1923) PASS: lldb-api :: functionalities/gdb_remote_client/TestGDBRemoteClient.py (1530 of 1923) PASS: lldb-unit :: Utility/./UtilityTests/24/30 (1531 of 1923) PASS: lldb-unit :: Language/Highlighting/./HighlighterTests/20/29 (1532 of 1923) PASS: lldb-unit :: UnwindAssembly/ARM64/./Arm64InstEmulationTests/5/7 (1533 of 1923) UNSUPPORTED: lldb-api :: functionalities/data-formatter/data-formatter-stl/libstdcpp/unique_ptr/TestDataFormatterStdUniquePtr.py (1534 of 1923) PASS: lldb-api :: lang/cpp/break-on-initializers/TestBreakOnCPP11Initializers.py (1535 of 1923) PASS: lldb-api :: api/log/TestAPILog.py (1536 of 1923) PASS: lldb-shell :: Commands/command-breakpoint-col.test (1537 of 1923) PASS: lldb-api :: functionalities/process_crash_info/TestProcessCrashInfo.py (1538 of 1923) PASS: lldb-shell :: Breakpoint/invalid-condition.test (1539 of 1923) PASS: lldb-api :: lang/objc/rdar-10967107/TestRdar10967107.py (1540 of 1923) PASS: lldb-unit :: Interpreter/./InterpreterTests/8/14 (1541 of 1923) PASS: lldb-api :: types/TestRecursiveTypes.py (1542 of 1923) UNSUPPORTED: lldb-api :: lang/objc/modules-app-update/TestClangModulesAppUpdate.py (1543 of 1923) PASS: lldb-unit :: Process/minidump/./LLDBMinidumpTests/11/17 (1544 of 1923) UNSUPPORTED: lldb-shell :: Unwind/basic-block-sections.test (1545 of 1923) PASS: lldb-shell :: Driver/TestQuiet.test (1546 of 1923) PASS: lldb-unit :: ScriptInterpreter/Python/./ScriptInterpreterPythonTests/14/19 (1547 of 1923) UNSUPPORTED: lldb-shell :: SymbolFile/DWARF/x86/find-basic-type.cpp (1548 of 1923) PASS: lldb-unit :: Process/Utility/./ProcessUtilityTests/13/16 (1549 of 1923) PASS: lldb-api :: lang/objc/objc-struct-argument/TestObjCStructArgument.py (1550 of 1923) PASS: lldb-shell :: Reproducer/TestWorkingDir.test (1551 of 1923) PASS: lldb-api :: lang/cpp/crtp/TestCppCRTP.py (1552 of 1923) PASS: lldb-api :: functionalities/data-formatter/nsdictionarysynth/TestNSDictionarySynthetic.py (1553 of 1923) PASS: lldb-api :: macosx/unregistered-macho/TestUnregisteredMacho.py (1554 of 1923) PASS: lldb-api :: lang/objc/single-entry-dictionary/TestObjCSingleEntryDictionary.py (1555 of 1923) PASS: lldb-shell :: Process/UnsupportedLanguage.test (1556 of 1923) PASS: lldb-api :: commands/expression/import-std-module/list/TestListFromStdModule.py (1557 of 1923) UNSUPPORTED: lldb-api :: functionalities/thread/concurrent_events/TestConcurrentSignalWatchBreak.py (1558 of 1923) PASS: lldb-api :: lang/cpp/sizeof/TestCPPSizeof.py (1559 of 1923) PASS: lldb-api :: commands/expression/codegen-crash-typedefdecl-not-in_declcontext/TestCodegenCrashTypedefDeclNotInDeclContext.py (1560 of 1923) UNSUPPORTED: lldb-shell :: Register/x86-64-xmm16-write.test (1561 of 1923) PASS: lldb-unit :: ObjectFile/Breakpad/./ObjectFileBreakpadTests/3/11 (1562 of 1923) UNSUPPORTED: lldb-shell :: SymbolFile/PDB/variables-locations.test (1563 of 1923) PASS: lldb-api :: functionalities/data-formatter/pyobjsynthprovider/TestPyObjSynthProvider.py (1564 of 1923) PASS: lldb-unit :: SymbolFile/DWARF/./SymbolFileDWARFTests/4/29 (1565 of 1923) PASS: lldb-shell :: ObjectFile/ELF/section-types-edgecases.yaml (1566 of 1923) PASS: lldb-api :: commands/expression/regression-access-function-template-in-record/TestRegressionAccessFunctionTemplateInRecord.py (1567 of 1923) PASS: lldb-api :: commands/expression/context-object-objc/TestContextObjectObjc.py (1568 of 1923) PASS: lldb-api :: lang/cpp/namespace_definitions/TestNamespaceDefinitions.py (1569 of 1923) PASS: lldb-unit :: Process/gdb-remote/./ProcessGdbRemoteTests/6/19 (1570 of 1923) PASS: lldb-unit :: Core/./LLDBCoreTests/15/22 (1571 of 1923) PASS: lldb-unit :: ObjectFile/PECOFF/./ObjectFilePECOFFTests/0/3 (1572 of 1923) PASS: lldb-shell :: Minidump/Windows/broken-unwind.test (1573 of 1923) PASS: lldb-shell :: Driver/TestFile.test (1574 of 1923) PASS: lldb-api :: commands/expression/ignore-artificial-constructors/TestIgnoreArtificialConstructors.py (1575 of 1923) UNSUPPORTED: lldb-shell :: SymbolFile/NativePDB/globals-fundamental.cpp (1576 of 1923) PASS: lldb-api :: lang/objc/objc-ivar-protocols/TestIvarProtocols.py (1577 of 1923) PASS: lldb-api :: commands/expression/import-std-module/module-build-errors/TestStdModuleBuildErrors.py (1578 of 1923) PASS: lldb-api :: commands/expression/codegen-crash-import-def-arraytype-element/TestImportDefinitionArrayType.py (1579 of 1923) PASS: lldb-api :: functionalities/process_group/TestChangeProcessGroup.py (1580 of 1923) PASS: lldb-api :: commands/expression/test/TestExprs.py (1581 of 1923) UNSUPPORTED: lldb-api :: functionalities/thread/concurrent_events/TestConcurrentWatchpointWithDelayWatchpointThreads.py (1582 of 1923) PASS: lldb-api :: lang/cpp/class_types/TestClassTypesDisassembly.py (1583 of 1923) PASS: lldb-api :: lang/cpp/template-specialization-type/TestTemplateSpecializationType.py (1584 of 1923) UNSUPPORTED: lldb-shell :: Register/x86-64-ymm16-read.test (1585 of 1923) PASS: lldb-unit :: Process/minidump/./LLDBMinidumpTests/4/17 (1586 of 1923) PASS: lldb-api :: commands/expression/class_template_specialization_empty_pack/TestClassTemplateSpecializationParametersHandling.py (1587 of 1923) UNSUPPORTED: lldb-api :: linux/aarch64/mte_memory_region/TestAArch64LinuxMTEMemoryRegion.py (1588 of 1923) PASS: lldb-shell :: BuildScript/script-args.test (1589 of 1923) PASS: lldb-api :: macosx/lc-note/multiple-binary-corefile/TestMultipleBinaryCorefile.py (1590 of 1923) PASS: lldb-api :: lang/mixed/TestMixedLanguages.py (1591 of 1923) PASS: lldb-api :: macosx/queues/TestQueues.py (1592 of 1923) PASS: lldb-unit :: Utility/./UtilityTests/26/30 (1593 of 1923) UNSUPPORTED: lldb-shell :: SymbolFile/DWARF/x86/dwarf5-partial-index.cpp (1594 of 1923) PASS: lldb-shell :: Process/Optimization.test (1595 of 1923) PASS: lldb-api :: functionalities/signal/raise/TestRaise.py (1596 of 1923) PASS: lldb-api :: lang/objc/hidden-ivars/TestHiddenIvars.py (1597 of 1923) UNSUPPORTED: lldb-shell :: SymbolFile/NativePDB/ast-methods.cpp (1598 of 1923) PASS: lldb-shell :: SymbolFile/DWARF/x86/debug_ranges-missing-section.s (1599 of 1923) PASS: lldb-api :: functionalities/breakpoint/move_nearest/TestMoveNearest.py (1600 of 1923) UNSUPPORTED: lldb-api :: tools/lldb-server/registers-target-xml-reading/TestGdbRemoteTargetXmlPacket.py (1601 of 1923) UNSUPPORTED: lldb-api :: lang/cpp/structured-binding/TestStructuredBinding.py (1602 of 1923) UNSUPPORTED: lldb-api :: macosx/posix_spawn/TestLaunchProcessPosixSpawn.py (1603 of 1923) PASS: lldb-unit :: Utility/./UtilityTests/13/30 (1604 of 1923) UNSUPPORTED: lldb-shell :: SymbolFile/PDB/class-layout.test (1605 of 1923) PASS: lldb-api :: functionalities/inferior-crashing/TestInferiorCrashingStep.py (1606 of 1923) UNSUPPORTED: lldb-shell :: SymbolFile/DWARF/x86/debug-types-signature-loop.s (1607 of 1923) PASS: lldb-api :: functionalities/lazy-loading/TestLazyLoading.py (1608 of 1923) PASS: lldb-api :: lang/cpp/typeof/TestTypeOfDeclTypeExpr.py (1609 of 1923) PASS: lldb-api :: lang/c/find_struct_type/TestFindStructTypes.py (1610 of 1923) UNSUPPORTED: lldb-api :: commands/watchpoints/watch_tagged_addr/TestWatchTaggedAddress.py (1611 of 1923) PASS: lldb-api :: functionalities/exec/TestExec.py (1612 of 1923) PASS: lldb-shell :: Quit/TestQuitExitCode-30.test (1613 of 1923) PASS: lldb-api :: lang/cpp/const_static_integral_member_int128/TestConstStaticIntegralMemberInt128.py (1614 of 1923) PASS: lldb-shell :: SymbolFile/DWARF/x86/split-dwarf-inlining.cpp (1615 of 1923) PASS: lldb-api :: functionalities/data-formatter/data-formatter-stl/libcxx/vector/TestDataFormatterLibcxxVector.py (1616 of 1923) PASS: lldb-api :: functionalities/pointer_num_children/TestPointerNumChildren.py (1617 of 1923) PASS: lldb-api :: commands/expression/import-std-module/shared_ptr-dbg-info-content/TestSharedPtrDbgInfoContentFromStdModule.py (1618 of 1923) PASS: lldb-api :: functionalities/breakpoint/two_hits_one_actual/TestTwoHitsOneActual.py (1619 of 1923) PASS: lldb-api :: commands/expression/import-std-module/sysroot/TestStdModuleSysroot.py (1620 of 1923) PASS: lldb-api :: commands/target/auto-install-main-executable/TestAutoInstallMainExecutable.py (1621 of 1923) PASS: lldb-api :: functionalities/data-formatter/dump_dynamic/TestDumpDynamic.py (1622 of 1923) PASS: lldb-api :: functionalities/reproducers/attach/TestReproducerAttach.py (1623 of 1923) PASS: lldb-api :: python_api/compile_unit/TestCompileUnitAPI.py (1624 of 1923) UNSUPPORTED: lldb-shell :: SymbolFile/NativePDB/typedefs.cpp (1625 of 1923) PASS: lldb-api :: python_api/sbvalue_const_addrof/TestSBValueConstAddrOf.py (1626 of 1923) UNSUPPORTED: lldb-shell :: Register/x86-zmm-write.test (1627 of 1923) UNSUPPORTED: lldb-api :: linux/thread/create_during_instruction_step/TestCreateDuringInstructionStep.py (1628 of 1923) PASS: lldb-shell :: SymbolFile/DWARF/deterministic-build.cpp (1629 of 1923) PASS: lldb-api :: commands/settings/quoting/TestQuoting.py (1630 of 1923) PASS: lldb-api :: functionalities/find-line-entry/TestFindLineEntry.py (1631 of 1923) PASS: lldb-shell :: Register/Core/x86-64-netbsd-multithread.test (1632 of 1923) PASS: lldb-api :: commands/frame/select/TestFrameSelect.py (1633 of 1923) UNSUPPORTED: lldb-api :: tools/lldb-server/inferior-crash/TestGdbRemoteAbort.py (1634 of 1923) PASS: lldb-api :: functionalities/rerun/TestRerun.py (1635 of 1923) PASS: lldb-api :: python_api/sbtype_typeclass/TestSBTypeTypeClass.py (1636 of 1923) PASS: lldb-shell :: ObjectFile/PECOFF/sections.yaml (1637 of 1923) UNSUPPORTED: lldb-shell :: Register/x86-zmm-read.test (1638 of 1923) UNSUPPORTED: lldb-api :: commands/trace/TestTraceDumpInfo.py (1639 of 1923) PASS: lldb-api :: functionalities/data-formatter/data-formatter-synth/TestDataFormatterSynth.py (1640 of 1923) PASS: lldb-api :: functionalities/thread/create_after_attach/TestCreateAfterAttach.py (1641 of 1923) PASS: lldb-shell :: SymbolFile/Breakpad/line-table.test (1642 of 1923) PASS: lldb-api :: lang/cpp/subst_template_type_param/TestSubstTemplateTypeParam.py (1643 of 1923) UNSUPPORTED: lldb-shell :: Subprocess/fork-follow-child-wp.test (1644 of 1923) PASS: lldb-unit :: UnwindAssembly/x86/./UnwindAssemblyx86Tests/5/27 (1645 of 1923) PASS: lldb-api :: commands/expression/completion-in-lambda-and-unnamed-class/TestCompletionInLambdaAndUnnamedClass.py (1646 of 1923) PASS: lldb-api :: lang/c/stepping/TestThreadStepInAvoidRegexp.py (1647 of 1923) PASS: lldb-shell :: ObjectFile/PECOFF/basic-info-arm64.yaml (1648 of 1923) PASS: lldb-unit :: SymbolFile/DWARF/./SymbolFileDWARFTests/9/29 (1649 of 1923) PASS: lldb-api :: functionalities/data-formatter/data-formatter-proper-plurals/TestFormattersOneIsSingular.py (1650 of 1923) PASS: lldb-shell :: VSCode/TestOptions.test (1651 of 1923) PASS: lldb-shell :: ObjectFile/PECOFF/sections-names.yaml (1652 of 1923) PASS: lldb-api :: lang/cpp/static_members/TestCPPStaticMembers.py (1653 of 1923) UNSUPPORTED: lldb-shell :: SymbolFile/NativePDB/find-functions.cpp (1654 of 1923) PASS: lldb-api :: functionalities/data-formatter/data-formatter-stl/libcxx/vbool/TestDataFormatterLibcxxVBool.py (1655 of 1923) PASS: lldb-shell :: ScriptInterpreter/None/import_module.test (1656 of 1923) PASS: lldb-unit :: Language/CLanguages/./LanguageCLanguagesTests/0/1 (1657 of 1923) PASS: lldb-api :: lang/cpp/breakpoint-commands/TestCPPBreakpointCommands.py (1658 of 1923) PASS: lldb-api :: lang/objc/foundation/TestObjCMethods.py (1659 of 1923) PASS: lldb-unit :: Language/Highlighting/./HighlighterTests/6/29 (1660 of 1923) PASS: lldb-api :: functionalities/memory-region/TestMemoryRegion.py (1661 of 1923) PASS: lldb-unit :: Target/./TargetTests/11/19 (1662 of 1923) UNSUPPORTED: lldb-shell :: Subprocess/vfork-follow-child.test (1663 of 1923) UNSUPPORTED: lldb-api :: functionalities/thread/concurrent_events/TestConcurrentTwoWatchpointsOneDelayBreakpoint.py (1664 of 1923) PASS: lldb-api :: lang/c/global_variables/TestGlobalVariables.py (1665 of 1923) PASS: lldb-unit :: SymbolFile/NativePDB/./SymbolFileNativePDBTests/14/15 (1666 of 1923) UNSUPPORTED: lldb-shell :: ScriptInterpreter/Lua/print.test (1667 of 1923) UNSUPPORTED: lldb-api :: tools/lldb-server/attach-wait/TestGdbRemoteAttachWait.py (1668 of 1923) UNSUPPORTED: lldb-api :: functionalities/tty/TestTerminal.py (1669 of 1923) PASS: lldb-api :: linux/aarch64/non_address_bit_memory_access/TestAArch64LinuxNonAddressBitMemoryAccess.py (1670 of 1923) PASS: lldb-unit :: Core/./LLDBCoreTests/2/22 (1671 of 1923) PASS: lldb-shell :: Breakpoint/dummy-target.test (1672 of 1923) PASS: lldb-shell :: SymbolFile/DWARF/x86/static_scope.s (1673 of 1923) PASS: lldb-unit :: Language/Highlighting/./HighlighterTests/23/29 (1674 of 1923) PASS: lldb-unit :: UnwindAssembly/ARM64/./Arm64InstEmulationTests/1/7 (1675 of 1923) UNSUPPORTED: lldb-shell :: BuildScript/toolchain-msvc.test (1676 of 1923) PASS: lldb-api :: functionalities/progress_reporting/TestTrimmedProgressReporting.py (1677 of 1923) PASS: lldb-api :: functionalities/testid/TestTestId.py (1678 of 1923) PASS: lldb-api :: commands/expression/import-std-module/vector-bool/TestVectorBoolFromStdModule.py (1679 of 1923) PASS: lldb-api :: lang/objc/exceptions/TestObjCExceptions.py (1680 of 1923) PASS: lldb-unit :: SymbolFile/NativePDB/./SymbolFileNativePDBTests/10/15 (1681 of 1923) PASS: lldb-unit :: ScriptInterpreter/Python/./ScriptInterpreterPythonTests/12/19 (1682 of 1923) UNSUPPORTED: lldb-api :: functionalities/unwind/ehframe/TestEhFrameUnwind.py (1683 of 1923) PASS: lldb-api :: commands/process/launch/TestProcessLaunch.py (1684 of 1923) UNSUPPORTED: lldb-api :: functionalities/tsan/multiple/TestTsanMultiple.py (1685 of 1923) PASS: lldb-api :: lang/cpp/scratch-context-merging/structs/TestCppScratchContextMergingStructs.py (1686 of 1923) PASS: lldb-shell :: ObjectFile/PECOFF/invalid-export-table.yaml (1687 of 1923) XFAIL: lldb-shell :: ObjectFile/PECOFF/default-triple-windows-gnu.yaml (1688 of 1923) PASS: lldb-unit :: Core/./LLDBCoreTests/17/22 (1689 of 1923) PASS: lldb-api :: commands/expression/import-std-module/basic/TestImportStdModule.py (1690 of 1923) UNSUPPORTED: lldb-shell :: SymbolFile/NativePDB/source-list.cpp (1691 of 1923) PASS: lldb-api :: lang/cpp/this_class_type_mixing/TestThisClassTypeMixing.py (1692 of 1923) PASS: lldb-api :: functionalities/ptr_refs/TestPtrRefs.py (1693 of 1923) UNSUPPORTED: lldb-shell :: Subprocess/clone-follow-child.test (1694 of 1923) PASS: lldb-unit :: Process/minidump/./LLDBMinidumpTests/0/17 (1695 of 1923) PASS: lldb-api :: python_api/target/TestTargetAPI.py (1696 of 1923) UNSUPPORTED: lldb-api :: linux/aarch64/mte_tag_access/TestAArch64LinuxMTEMemoryTagAccess.py (1697 of 1923) PASS: lldb-unit :: Utility/./UtilityTests/9/30 (1698 of 1923) PASS: lldb-api :: functionalities/data-formatter/user-format-vs-summary/TestUserFormatVsSummary.py (1699 of 1923) PASS: lldb-api :: functionalities/gdb_remote_client/TestProcessConnect.py (1700 of 1923) PASS: lldb-shell :: Breakpoint/debug_rnglistx_rlex.test (1701 of 1923) UNSUPPORTED: lldb-api :: tools/lldb-server/TestGdbRemoteSaveCore.py (1702 of 1923) PASS: lldb-shell :: ScriptInterpreter/Python/fail_breakpoint_oneline.test (1703 of 1923) PASS: lldb-unit :: Process/minidump/./LLDBMinidumpTests/9/17 (1704 of 1923) PASS: lldb-unit :: Process/minidump/./LLDBMinidumpTests/16/17 (1705 of 1923) PASS: lldb-unit :: Process/gdb-remote/./ProcessGdbRemoteTests/12/19 (1706 of 1923) PASS: lldb-unit :: ScriptInterpreter/Python/./ScriptInterpreterPythonTests/15/19 (1707 of 1923) PASS: lldb-unit :: Process/minidump/./LLDBMinidumpTests/6/17 (1708 of 1923) PASS: lldb-unit :: UnwindAssembly/x86/./UnwindAssemblyx86Tests/21/27 (1709 of 1923) UNSUPPORTED: lldb-shell :: SymbolFile/DWARF/x86/find-basic-variable.cpp (1710 of 1923) PASS: lldb-api :: python_api/type/TestTypeList.py (1711 of 1923) PASS: lldb-api :: python_api/lldbutil/process/TestPrintStackTraces.py (1712 of 1923) PASS: lldb-shell :: SymbolFile/DWARF/x86/DW_AT_decl_file-DW_AT_specification-crosscu.s (1713 of 1923) UNSUPPORTED: lldb-api :: android/platform/TestDefaultCacheLineSize.py (1714 of 1923) PASS: lldb-shell :: Reproducer/TestDriverOptions.test (1715 of 1923) PASS: lldb-api :: commands/expression/call-function/TestCallBuiltinFunction.py (1716 of 1923) PASS: lldb-unit :: Target/./TargetTests/13/19 (1717 of 1923) PASS: lldb-shell :: SymbolFile/DWARF/x86/debug_loc-aslr.s (1718 of 1923) PASS: lldb-unit :: SymbolFile/NativePDB/./SymbolFileNativePDBTests/2/15 (1719 of 1923) PASS: lldb-api :: lang/cpp/global_variables/TestCPPGlobalVariables.py (1720 of 1923) PASS: lldb-unit :: Platform/./LLDBPlatformTests/4/16 (1721 of 1923) PASS: lldb-api :: python_api/value/change_values/TestChangeValueAPI.py (1722 of 1923) PASS: lldb-unit :: Platform/./LLDBPlatformTests/10/16 (1723 of 1923) UNSUPPORTED: lldb-api :: lang/objc/modules-incomplete/TestIncompleteModules.py (1724 of 1923) PASS: lldb-api :: functionalities/scripted_process/TestStackCoreScriptedProcess.py (1725 of 1923) PASS: lldb-shell :: ObjectFile/ELF/short-build-id.yaml (1726 of 1923) PASS: lldb-api :: commands/platform/file/close/TestPlatformFileClose.py (1727 of 1923) PASS: lldb-shell :: SymbolFile/DWARF/x86/DW_AT_const_value-bitfields.s (1728 of 1923) PASS: lldb-shell :: ObjectFile/MachO/lc_version_min.yaml (1729 of 1923) PASS: lldb-shell :: Heap/heap-cstr.test (1730 of 1923) PASS: lldb-shell :: Settings/TestEchoCommands.test (1731 of 1923) PASS: lldb-api :: functionalities/multiword-commands/TestMultiWordCommands.py (1732 of 1923) PASS: lldb-api :: commands/process/attach-resume/TestAttachResume.py (1733 of 1923) PASS: lldb-api :: functionalities/breakpoint/breakpoint_names/TestBreakpointNames.py (1734 of 1923) PASS: lldb-api :: commands/expression/no-deadlock/TestExprDoesntBlock.py (1735 of 1923) PASS: lldb-shell :: Commands/command-disassemble-process.yaml (1736 of 1923) PASS: lldb-unit :: Target/./TargetTests/5/19 (1737 of 1923) UNSUPPORTED: lldb-api :: benchmarks/startup/TestStartupDelays.py (1738 of 1923) PASS: lldb-unit :: Process/minidump/./LLDBMinidumpTests/15/17 (1739 of 1923) PASS: lldb-api :: types/TestLongTypesExpr.py (1740 of 1923) PASS: lldb-api :: macosx/thread_suspend/TestInternalThreadSuspension.py (1741 of 1923) PASS: lldb-api :: functionalities/thread/num_threads/TestNumThreads.py (1742 of 1923) UNSUPPORTED: lldb-shell :: SymbolFile/PDB/calling-conventions-arm.test (1743 of 1923) PASS: lldb-api :: functionalities/thread/exit_during_break/TestExitDuringBreak.py (1744 of 1923) PASS: lldb-api :: functionalities/breakpoint/breakpoint_on_lambda_capture/TestBreakOnLambdaCapture.py (1745 of 1923) UNSUPPORTED: lldb-shell :: Subprocess/clone-follow-child-softbp.test (1746 of 1923) PASS: lldb-api :: functionalities/gdb_remote_client/TestThreadSelectionBug.py (1747 of 1923) PASS: lldb-api :: sample_test/TestSampleInlineTest.py (1748 of 1923) PASS: lldb-api :: lang/cpp/virtual-functions/TestCppVirtualFunctions.py (1749 of 1923) PASS: lldb-shell :: SymbolFile/DWARF/x86/debug_line-tombstone.s (1750 of 1923) PASS: lldb-unit :: Utility/./UtilityTests/4/30 (1751 of 1923) PASS: lldb-shell :: ObjectFile/PECOFF/settings-abi.yaml (1752 of 1923) PASS: lldb-api :: lang/cpp/default-template-args/TestDefaultTemplateArgs.py (1753 of 1923) PASS: lldb-api :: functionalities/type_lookup/TestTypeLookup.py (1754 of 1923) PASS: lldb-unit :: Core/./LLDBCoreTests/20/22 (1755 of 1923) PASS: lldb-api :: functionalities/data-formatter/data-formatter-stl/libcxx/tuple/TestDataFormatterLibcxxTuple.py (1756 of 1923) UNSUPPORTED: lldb-shell :: SymbolFile/DWARF/x86/find-method.cpp (1757 of 1923) PASS: lldb-shell :: SymbolFile/DWARF/x86/debug-types-dwarf5.s (1758 of 1923) PASS: lldb-api :: commands/expression/result_numbering/TestResultNumbering.py (1759 of 1923) PASS: lldb-shell :: Commands/command-target-modules-dump-sections.yaml (1760 of 1923) PASS: lldb-unit :: debugserver/./debugserverTests/0/6 (1761 of 1923) PASS: lldb-api :: functionalities/scripted_process/TestScriptedProcess.py (1762 of 1923) PASS: lldb-api :: functionalities/data-formatter/data-formatter-stl/libcxx/string/TestDataFormatterLibcxxString.py (1763 of 1923) UNSUPPORTED: lldb-api :: tools/lldb-server/TestGdbRemoteThreadsInStopReply.py (1764 of 1923) PASS: lldb-shell :: ObjectFile/PECOFF/disassemble-thumb.yaml (1765 of 1923) PASS: lldb-shell :: SymbolFile/DWARF/x86/parallel-indexing-stress.s (1766 of 1923) PASS: lldb-api :: lang/cpp/operators/TestCppOperators.py (1767 of 1923) UNSUPPORTED: lldb-shell :: SymbolFile/DWARF/x86/debug-line-basic.s (1768 of 1923) PASS: lldb-api :: lang/objc/objc-static-method/TestObjCStaticMethod.py (1769 of 1923) UNSUPPORTED: lldb-shell :: ObjectFile/ELF/minidebuginfo-no-lzma.yaml (1770 of 1923) PASS: lldb-unit :: Platform/./LLDBPlatformTests/13/16 (1771 of 1923) PASS: lldb-api :: commands/expression/import-std-module/forward_list-dbg-info-content/TestDbgInfoContentForwardListFromStdModule.py (1772 of 1923) UNSUPPORTED: lldb-api :: tools/lldb-server/TestGdbRemoteRegisterState.py (1773 of 1923) UNSUPPORTED: lldb-api :: commands/trace/TestTraceLoad.py (1774 of 1923) PASS: lldb-unit :: Process/Utility/./ProcessUtilityTests/7/16 (1775 of 1923) PASS: lldb-unit :: Expression/./ExpressionTests/12/22 (1776 of 1923) PASS: lldb-shell :: ScriptInterpreter/Python/Crashlog/no-args.test (1777 of 1923) UNSUPPORTED: lldb-api :: commands/register/register/aarch64_dynamic_regset/TestArm64DynamicRegsets.py (1778 of 1923) PASS: lldb-api :: functionalities/gdb_remote_client/TestPlatformMacOSX.py (1779 of 1923) PASS: lldb-api :: functionalities/gdb_remote_client/TestWriteMemory.py (1780 of 1923) UNSUPPORTED: lldb-shell :: SymbolFile/DWARF/x86/find-basic-namespace.cpp (1781 of 1923) PASS: lldb-shell :: Breakpoint/debug_addrx.test (1782 of 1923) PASS: lldb-api :: macosx/load-kext/TestLoadKext.py (1783 of 1923) PASS: lldb-api :: lang/c/calling-conventions/TestCCallingConventions.py (1784 of 1923) PASS: lldb-api :: lang/c/stepping/TestStepAndBreakpoints.py (1785 of 1923) PASS: lldb-shell :: SymbolFile/DWARF/x86/dwarf5-debug_line.s (1786 of 1923) PASS: lldb-unit :: Interpreter/./InterpreterTests/13/14 (1787 of 1923) PASS: lldb-api :: functionalities/thread/concurrent_events/TestConcurrentTwoBreakpointsOneSignal.py (1788 of 1923) UNSUPPORTED: lldb-shell :: Register/x86-ymm-read.test (1789 of 1923) PASS: lldb-api :: functionalities/data-formatter/data-formatter-categories/TestDataFormatterCategories.py (1790 of 1923) PASS: lldb-api :: functionalities/data-formatter/data-formatter-stl/generic/optional/TestDataFormatterGenericOptional.py (1791 of 1923) UNSUPPORTED: lldb-api :: functionalities/breakpoint/breakpoint_in_delayslot/TestAvoidBreakpointInDelaySlot.py (1792 of 1923) PASS: lldb-api :: functionalities/data-formatter/data-formatter-synthtype/TestDataFormatterSynthType.py (1793 of 1923) PASS: lldb-shell :: Error/assert.test (1794 of 1923) UNSUPPORTED: lldb-shell :: Watchpoint/netbsd-nouserdbregs.test (1795 of 1923) PASS: lldb-api :: functionalities/gdb_remote_client/TestJLink6Armv7RegisterDefinition.py (1796 of 1923) PASS: lldb-shell :: Driver/TestSingleQuote.test (1797 of 1923) PASS: lldb-api :: tools/lldb-vscode/breakpoint/TestVSCode_setExceptionBreakpoints.py (1798 of 1923) UNSUPPORTED: lldb-api :: commands/watchpoints/step_over_watchpoint/TestStepOverWatchpoint.py (1799 of 1923) PASS: lldb-api :: lang/objc/cpp_keyword_identifiers/TestCppKeywordsAsObjCIdentifiers.py (1800 of 1923) PASS: lldb-api :: functionalities/postmortem/mach-core/TestMachCore.py (1801 of 1923) PASS: lldb-api :: commands/memory/write/TestMemoryWrite.py (1802 of 1923) PASS: lldb-api :: python_api/function_symbol/TestDisasmAPI.py (1803 of 1923) PASS: lldb-api :: functionalities/value_md5_crash/TestValueMD5Crash.py (1804 of 1923) UNSUPPORTED: lldb-shell :: SymbolFile/DWARF/dwarf5-lazy-dwo.c (1805 of 1923) PASS: lldb-api :: symbol_ondemand/breakpoint_language/TestBreakpointLanguageOnDemand.py (1806 of 1923) PASS: lldb-unit :: Core/./LLDBCoreTests/3/22 (1807 of 1923) PASS: lldb-unit :: Host/./HostTests/7/19 (1808 of 1923) UNSUPPORTED: lldb-shell :: ScriptInterpreter/Lua/bindings.test (1809 of 1923) PASS: lldb-unit :: SymbolFile/DWARF/./SymbolFileDWARFTests/22/29 (1810 of 1923) PASS: lldb-shell :: Expr/TestMultilineExpr.test (1811 of 1923) PASS: lldb-api :: commands/expression/import-std-module/iterator/TestIteratorFromStdModule.py (1812 of 1923) PASS: lldb-unit :: Language/Highlighting/./HighlighterTests/22/29 (1813 of 1923) PASS: lldb-shell :: Minidump/no-process-id.yaml (1814 of 1923) PASS: lldb-unit :: Host/./HostTests/0/19 (1815 of 1923) PASS: lldb-shell :: Process/TestEnvironment.test (1816 of 1923) PASS: lldb-shell :: Settings/TestFrameFormatColor.test (1817 of 1923) PASS: lldb-unit :: DataFormatter/./LLDBFormatterTests/0/11 (1818 of 1923) UNSUPPORTED: lldb-api :: commands/expression/macros/TestMacros.py (1819 of 1923) PASS: lldb-api :: functionalities/data-formatter/data-formatter-stl/generic/deque/TestDataFormatterGenericDeque.py (1820 of 1923) PASS: lldb-api :: commands/expression/import-std-module/missing-module-sources/TestStdModuleSourcesMissing.py (1821 of 1923) PASS: lldb-shell :: SymbolFile/DWARF/x86/find-qualified-variable.cpp (1822 of 1923) PASS: lldb-unit :: Language/Highlighting/./HighlighterTests/15/29 (1823 of 1923) PASS: lldb-shell :: ScriptInterpreter/Python/silent_command_script_import.test (1824 of 1923) UNSUPPORTED: lldb-api :: benchmarks/libcxxmap/TestBenchmarkLibcxxMap.py (1825 of 1923) PASS: lldb-api :: functionalities/breakpoint/objc/TestObjCBreakpoints.py (1826 of 1923) UNSUPPORTED: lldb-shell :: SymbolFile/NativePDB/ast-functions-msvc.cpp (1827 of 1923) PASS: lldb-api :: api/multiple-debuggers/TestMultipleDebuggers.py (1828 of 1923) PASS: lldb-api :: commands/expression/persistent_types/TestPersistentTypes.py (1829 of 1923) PASS: lldb-api :: terminal/TestEditline.py (1830 of 1923) PASS: lldb-shell :: Commands/CommandScriptImmediateOutput/CommandScriptImmediateOutputConsole.test (1831 of 1923) PASS: lldb-shell :: Driver/TestConvenienceVariables.test (1832 of 1923) PASS: lldb-api :: lang/c/step-target/TestStepTarget.py (1833 of 1923) PASS: lldb-unit :: Core/./LLDBCoreTests/8/22 (1834 of 1923) PASS: lldb-shell :: ObjectFile/ELF/PT_LOAD-empty.yaml (1835 of 1923) PASS: lldb-unit :: Interpreter/./InterpreterTests/6/14 (1836 of 1923) UNSUPPORTED: lldb-api :: functionalities/breakpoint/hardware_breakpoints/write_memory_with_hw_breakpoint/TestWriteMemoryWithHWBreakpoint.py (1837 of 1923) UNSUPPORTED: lldb-api :: tools/lldb-server/TestGdbRemoteKill.py (1838 of 1923) PASS: lldb-api :: test_utils/base/TestBaseTest.py (1839 of 1923) UNSUPPORTED: lldb-api :: tools/lldb-server/TestGdbRemoteFork.py (1840 of 1923) PASS: lldb-shell :: Minidump/disassemble-no-module.yaml (1841 of 1923) PASS: lldb-shell :: Subprocess/fork-follow-parent-wp.test (1842 of 1923) PASS: lldb-api :: lang/c/conflicting-symbol/TestConflictingSymbol.py (1843 of 1923) PASS: lldb-api :: functionalities/tail_call_frames/ambiguous_tail_call_seq1/TestAmbiguousTailCallSeq1.py (1844 of 1923) PASS: lldb-api :: lang/cpp/const_this/TestConstThis.py (1845 of 1923) PASS: lldb-api :: macosx/function-starts/TestFunctionStarts.py (1846 of 1923) UNSUPPORTED: lldb-api :: commands/expression/call-restarts/TestCallThatRestarts.py (1847 of 1923) PASS: lldb-unit :: SymbolFile/DWARF/./SymbolFileDWARFTests/3/29 (1848 of 1923) PASS: lldb-shell :: Driver/TestTarget.test (1849 of 1923) UNSUPPORTED: lldb-shell :: Register/x86-gp-read.test (1850 of 1923) UNSUPPORTED: lldb-shell :: SymbolFile/NativePDB/load-pdb.cpp (1851 of 1923) PASS: lldb-unit :: Target/./TargetTests/2/19 (1852 of 1923) PASS: lldb-unit :: Process/Utility/./ProcessUtilityTests/3/16 (1853 of 1923) PASS: lldb-api :: commands/expression/po_verbosity/TestPoVerbosity.py (1854 of 1923) PASS: lldb-unit :: UnwindAssembly/x86/./UnwindAssemblyx86Tests/20/27 (1855 of 1923) UNSUPPORTED: lldb-api :: lang/cpp/function-template-parameter-pack/TestFunctionTemplateParameterPack.py (1856 of 1923) PASS: lldb-unit :: Instruction/./EmulatorTests/0/1 (1857 of 1923) PASS: lldb-unit :: API/./APITests/1/3 (1858 of 1923) PASS: lldb-api :: functionalities/data-formatter/data-formatter-skip-summary/TestDataFormatterSkipSummary.py (1859 of 1923) PASS: lldb-unit :: Expression/./ExpressionTests/15/22 (1860 of 1923) PASS: lldb-unit :: ScriptInterpreter/Python/./ScriptInterpreterPythonTests/7/19 (1861 of 1923) PASS: lldb-api :: lang/objc/foundation/TestObjCMethods2.py (1862 of 1923) UNSUPPORTED: lldb-api :: commands/watchpoints/hello_watchlocation/TestWatchLocation.py (1863 of 1923) UNSUPPORTED: lldb-shell :: SymbolFile/NativePDB/inline_sites_live.cpp (1864 of 1923) PASS: lldb-api :: commands/command/delete/TestCommandDelete.py (1865 of 1923) PASS: lldb-shell :: Settings/TestStopCommandSourceOnError.test (1866 of 1923) UNSUPPORTED: lldb-api :: functionalities/thread/concurrent_events/TestConcurrentWatchBreak.py (1867 of 1923) UNSUPPORTED: lldb-api :: tools/lldb-server/signal-filtering/TestGdbRemote_QPassSignals.py (1868 of 1923) UNSUPPORTED: lldb-api :: commands/expression/namespace_local_var_same_name_cpp_and_c/TestNamespaceLocalVarSameNameCppAndC.py (1869 of 1923) UNSUPPORTED: lldb-shell :: SymbolFile/DWARF/split-dwarf-expression-eval-bug.cpp (1870 of 1923) PASS: lldb-api :: lang/cpp/lambdas/TestLambdas.py (1871 of 1923) UNSUPPORTED: lldb-api :: commands/expression/namespace_local_var_same_name_obj_c/TestNamespaceLocalVarSameNameObjC.py (1872 of 1923) PASS: lldb-api :: lang/c/blocks/TestBlocks.py (1873 of 1923) UNSUPPORTED: lldb-api :: functionalities/thread/concurrent_events/TestConcurrentCrashWithWatchpoint.py (1874 of 1923) UNSUPPORTED: lldb-api :: functionalities/thread/create_during_step/TestCreateDuringStep.py (1875 of 1923) PASS: lldb-shell :: SymbolFile/DWARF/x86/dwarf5-implicit-const.s (1876 of 1923) PASS: lldb-api :: functionalities/thread/exit_during_step/TestExitDuringStep.py (1877 of 1923) UNSUPPORTED: lldb-api :: tools/lldb-server/register-reading/TestGdbRemoteGPacket.py (1878 of 1923) PASS: lldb-unit :: Interpreter/./InterpreterTests/4/14 (1879 of 1923) PASS: lldb-api :: functionalities/data-formatter/type_summary_list_arg/TestTypeSummaryListArg.py (1880 of 1923) PASS: lldb-api :: functionalities/unwind/zeroth_frame/TestZerothFrame.py (1881 of 1923) PASS: lldb-api :: types/TestLongTypes.py (1882 of 1923) PASS: lldb-api :: lang/cpp/auto/TestCPPAuto.py (1883 of 1923) PASS: lldb-api :: functionalities/thread/step_until/TestStepUntil.py (1884 of 1923) PASS: lldb-api :: commands/expression/entry-bp/TestExprEntryBP.py (1885 of 1923) PASS: lldb-api :: lang/cpp/incomplete-types/members/TestCppIncompleteTypeMembers.py (1886 of 1923) PASS: lldb-api :: driver/batch_mode/TestBatchMode.py (1887 of 1923) PASS: lldb-unit :: Utility/./UtilityTests/2/30 (1888 of 1923) PASS: lldb-api :: macosx/lc-note/firmware-corefile/TestFirmwareCorefiles.py (1889 of 1923) PASS: lldb-api :: lang/c/local_variables/TestLocalVariables.py (1890 of 1923) PASS: lldb-unit :: Process/gdb-remote/./ProcessGdbRemoteTests/7/19 (1891 of 1923) PASS: lldb-unit :: Core/./LLDBCoreTests/6/22 (1892 of 1923) PASS: lldb-shell :: lldb-server/TestErrorMessages.test (1893 of 1923) UNSUPPORTED: lldb-api :: benchmarks/expression/TestExpressionCmd.py (1894 of 1923) UNSUPPORTED: lldb-api :: linux/aarch64/unwind_signal/TestUnwindSignal.py (1895 of 1923) UNSUPPORTED: lldb-shell :: SymbolFile/NativePDB/nested-types.cpp (1896 of 1923) PASS: lldb-shell :: ObjectFile/MachO/lc_build_version.yaml (1897 of 1923) PASS: lldb-api :: tools/lldb-vscode/correct-thread/TestVSCode_correct_thread.py (1898 of 1923) PASS: lldb-api :: tools/lldb-vscode/breakpoint/TestVSCode_setFunctionBreakpoints.py (1899 of 1923) PASS: lldb-api :: python_api/module_section/TestModuleAndSection.py (1900 of 1923) PASS: lldb-unit :: UnwindAssembly/x86/./UnwindAssemblyx86Tests/25/27 (1901 of 1923) UNSUPPORTED: lldb-shell :: Register/arm-fp-read.test (1902 of 1923) PASS: lldb-api :: functionalities/history/TestHistoryRecall.py (1903 of 1923) UNSUPPORTED: lldb-api :: tools/lldb-server/TestGdbRemoteExitCode.py (1904 of 1923) UNSUPPORTED: lldb-api :: api/multiple-targets/TestMultipleTargets.py (1905 of 1923) PASS: lldb-unit :: Utility/./UtilityTests/18/30 (1906 of 1923) UNSUPPORTED: lldb-api :: functionalities/thread/concurrent_events/TestConcurrentWatchBreakDelay.py (1907 of 1923) UNSUPPORTED: lldb-shell :: ScriptInterpreter/Lua/breakpoint_oneline_callback.test (1908 of 1923) PASS: lldb-api :: functionalities/inline-stepping/TestInlineStepping.py (1909 of 1923) PASS: lldb-api :: lang/cpp/diamond/TestCppDiamond.py (1910 of 1923) PASS: lldb-api :: python_api/findvalue_duplist/TestSBFrameFindValue.py (1911 of 1923) PASS: lldb-api :: commands/target/stop-hooks/TestStopHookScripted.py (1912 of 1923) PASS: lldb-shell :: Minidump/fb-dump.test (1913 of 1923) PASS: lldb-api :: commands/log/basic/TestLogging.py (1914 of 1923) PASS: lldb-api :: functionalities/breakpoint/breakpoint_locations/TestBreakpointLocations.py (1915 of 1923) PASS: lldb-api :: lang/cpp/incompatible-class-templates/TestCppIncompatibleClassTemplates.py (1916 of 1923) PASS: lldb-api :: types/TestDoubleTypes.py (1917 of 1923) PASS: lldb-api :: functionalities/breakpoint/breakpoint_ignore_count/TestBreakpointIgnoreCount.py (1918 of 1923) PASS: lldb-api :: commands/expression/import-std-module/array/TestArrayFromStdModule.py (1919 of 1923) PASS: lldb-api :: functionalities/data-formatter/boolreference/TestFormattersBoolRefPtr.py (1920 of 1923) PASS: lldb-api :: functionalities/data-formatter/nsarraysynth/TestNSArraySynthetic.py (1921 of 1923) PASS: lldb-api :: lang/c/shared_lib/TestSharedLib.py (1922 of 1923) PASS: lldb-api :: lang/cpp/namespace/TestNamespaceLookup.py (1923 of 1923) Slowest Tests: -------------------------------------------------------------------------- 94.91s: lldb-api :: api/multithreaded/TestMultithreaded.py 73.60s: lldb-api :: commands/process/attach/TestProcessAttach.py 63.79s: lldb-api :: lang/objc/foundation/TestFoundationDisassembly.py 47.86s: lldb-api :: functionalities/completion/TestCompletion.py 45.99s: lldb-api :: lang/objc/hidden-ivars/TestHiddenIvars.py 43.66s: lldb-api :: lang/objc/exceptions/TestObjCExceptions.py 38.88s: lldb-api :: python_api/target/TestTargetAPI.py 36.81s: lldb-api :: functionalities/load_unload/TestLoadUnload.py 35.71s: lldb-api :: types/TestLongTypesExpr.py 33.75s: lldb-api :: lang/objc/objc-new-syntax/TestObjCNewSyntaxLiteral.py 32.07s: lldb-api :: functionalities/gdb_remote_client/TestPlatformMacOSX.py 31.94s: lldb-api :: functionalities/limit-debug-info/TestLimitDebugInfo.py 31.40s: lldb-api :: lang/cpp/namespace/TestNamespaceLookup.py 31.15s: lldb-api :: lang/objc/foundation/TestObjCMethods.py 29.90s: lldb-api :: lang/objc/real-definition/TestRealDefinition.py 29.09s: lldb-api :: commands/settings/TestSettings.py 27.93s: lldb-api :: types/TestLongTypes.py 27.20s: lldb-api :: lang/objc/objc-new-syntax/TestObjCNewSyntaxArray.py 26.13s: lldb-api :: functionalities/inferior-crashing/TestInferiorCrashingStep.py 26.07s: lldb-api :: tools/lldb-vscode/launch/TestVSCode_launch.py

Hide Details

Tests Times: -------------------------------------------------------------------------- [ Range ] :: [ Percentage ] :: [ Count ] -------------------------------------------------------------------------- [90.0s,95.0s) :: [ ] :: [ 1/1833] [85.0s,90.0s) :: [ ] :: [ 0/1833] [80.0s,85.0s) :: [ ] :: [ 0/1833] [75.0s,80.0s) :: [ ] :: [ 0/1833] [70.0s,75.0s) :: [ ] :: [ 1/1833] [65.0s,70.0s) :: [ ] :: [ 0/1833] [60.0s,65.0s) :: [ ] :: [ 1/1833] [55.0s,60.0s) :: [ ] :: [ 0/1833] [50.0s,55.0s) :: [ ] :: [ 0/1833] [45.0s,50.0s) :: [ ] :: [ 2/1833] [40.0s,45.0s) :: [ ] :: [ 1/1833] [35.0s,40.0s) :: [ ] :: [ 3/1833] [30.0s,35.0s) :: [ ] :: [ 5/1833] [25.0s,30.0s) :: [ ] :: [ 7/1833] [20.0s,25.0s) :: [ ] :: [ 15/1833] [15.0s,20.0s) :: [ ] :: [ 42/1833] [10.0s,15.0s) :: [** ] :: [ 101/1833] [ 5.0s,10.0s) :: [******* ] :: [ 328/1833] [ 0.0s, 5.0s) :: [**************************** ] :: [1326/1833] -------------------------------------------------------------------------- ******************** Failed Tests (1): lldb-api :: lang/cpp/const_static_integral_member/TestConstStaticIntegralMember.py

Hide Details

Hide Details

Testing Time: 455.54s Unsupported : 364 Passed : 2237 Expectedly Failed: 10 Failed : 1 FAILED: tools/lldb/test/CMakeFiles/check-lldb /Users/buildslave/jenkins/workspace/lldb-cmake-matrix/lldb-build/tools/lldb/test/CMakeFiles/check-lldb cd /Users/buildslave/jenkins/workspace/lldb-cmake-matrix/lldb-build/tools/lldb/test && /Applications/Xcode.app/Contents/Developer/Library/Frameworks/Python3.framework/Versions/3.8/bin/python3.8 /Users/buildslave/jenkins/workspace/lldb-cmake-matrix/lldb-build/./bin/llvm-lit -v --time-tests --shuffle --xunit-xml-output=/Users/buildslave/jenkins/workspace/lldb-cmake-matrix/test/results.xml -v /Users/buildslave/jenkins/workspace/lldb-cmake-matrix/lldb-build/tools/lldb/test ninja: build stopped: subcommand failed. Command failed: Command '['/usr/bin/env', 'TERM=vt100', '/usr/local/bin/ninja', '-v', 'check-lldb']' returned non-zero exit status 1. Command: ['/usr/bin/env', 'TERM=vt100', '/usr/local/bin/ninja', '-v', 'check-lldb'] + set -e [Pipeline] } [Pipeline] // timeout [Pipeline] junit Recording test results [Checks API] No suitable checks publisher found. [Pipeline] } [Pipeline] // stage [Pipeline] } [Pipeline] // withEnv [Pipeline] } [Pipeline] // node [Pipeline] End of Pipeline Finished: UNSTABLE