Console Output

Skipping 164,680 KB.. Full Log
PASS: lldb-shell :: Breakpoint/debug_addrx.test (447 of 1923)
PASS: lldb-unit :: Host/./HostTests/8/19 (448 of 1923)
UNSUPPORTED: lldb-shell :: SymbolFile/PDB/function-nested-block.test (449 of 1923)
PASS: lldb-api :: lang/c/modules/TestCModules.py (450 of 1923)
PASS: lldb-unit :: ScriptInterpreter/Python/./ScriptInterpreterPythonTests/5/19 (451 of 1923)
PASS: lldb-shell :: Commands/command-backtrace-parser-1.test (452 of 1923)
PASS: lldb-api :: python_api/interpreter/TestCommandInterpreterAPI.py (453 of 1923)
PASS: lldb-shell :: Commands/CommandScriptImmediateOutput/CommandScriptImmediateOutputConsole.test (454 of 1923)
PASS: lldb-shell :: Register/x86-64-write.test (455 of 1923)
PASS: lldb-api :: lang/cpp/symbols/TestSymbols.py (456 of 1923)
PASS: lldb-unit :: Expression/./ExpressionTests/1/22 (457 of 1923)
PASS: lldb-api :: commands/platform/process/list/TestProcessList.py (458 of 1923)
UNSUPPORTED: lldb-shell :: SymbolFile/NativePDB/lookup-by-address.cpp (459 of 1923)
UNSUPPORTED: lldb-shell :: SymbolFile/DWARF/dwo-relative-path.s (460 of 1923)
UNSUPPORTED: lldb-shell :: SymbolFile/DWARF/x86/find-inline-method.s (461 of 1923)
PASS: lldb-api :: functionalities/breakpoint/cpp/TestCPPBreakpointLocations.py (462 of 1923)
PASS: lldb-api :: python_api/compile_unit/TestCompileUnitAPI.py (463 of 1923)
PASS: lldb-unit :: UnwindAssembly/ARM64/./Arm64InstEmulationTests/6/7 (464 of 1923)
PASS: lldb-api :: commands/help/TestHelp.py (465 of 1923)
PASS: lldb-shell :: ObjectFile/ELF/section-types-edgecases.yaml (466 of 1923)
PASS: lldb-api :: functionalities/data-formatter/ostypeformatting/TestFormattersOsType.py (467 of 1923)
PASS: lldb-unit :: API/./APITests/2/3 (468 of 1923)
PASS: lldb-shell :: SymbolFile/DWARF/x86/debug-types-line-tables.s (469 of 1923)
UNSUPPORTED: lldb-api :: functionalities/ubsan/user-expression/TestUbsanUserExpression.py (470 of 1923)
PASS: lldb-api :: functionalities/gdb_remote_client/TestGDBRemotePlatformFile.py (471 of 1923)
PASS: lldb-shell :: Driver/TestCommands.test (472 of 1923)
PASS: lldb-api :: functionalities/data-formatter/data-formatter-categories/TestDataFormatterCategories.py (473 of 1923)
PASS: lldb-unit :: Platform/Android/./AdbClientTests/1/2 (474 of 1923)
PASS: lldb-api :: python_api/breakpoint/TestBreakpointAPI.py (475 of 1923)
PASS: lldb-api :: tools/lldb-vscode/breakpoint-events/TestVSCode_breakpointEvents.py (476 of 1923)
UNSUPPORTED: lldb-api :: commands/trace/TestTraceTSC.py (477 of 1923)
PASS: lldb-api :: functionalities/signal/handle-abrt/TestHandleAbort.py (478 of 1923)
PASS: lldb-unit :: Signals/./SignalsTests/3/5 (479 of 1923)
PASS: lldb-api :: lang/cpp/keywords_enabled/TestCppKeywordsEnabled.py (480 of 1923)
PASS: lldb-shell :: SymbolFile/DWARF/x86/DW_TAG_variable-DW_AT_const_value.s (481 of 1923)
PASS: lldb-unit :: Host/./HostTests/11/19 (482 of 1923)
PASS: lldb-api :: lang/cpp/rvalue-references/TestRvalueReferences.py (483 of 1923)
PASS: lldb-unit :: UnwindAssembly/ARM64/./Arm64InstEmulationTests/4/7 (484 of 1923)
PASS: lldb-api :: types/TestShortType.py (485 of 1923)
PASS: lldb-unit :: SymbolFile/DWARF/./SymbolFileDWARFTests/22/29 (486 of 1923)
UNSUPPORTED: lldb-api :: commands/watchpoints/watch_tagged_addr/TestWatchTaggedAddress.py (487 of 1923)
UNSUPPORTED: lldb-api :: functionalities/tsan/multiple/TestTsanMultiple.py (488 of 1923)
PASS: lldb-unit :: Core/./LLDBCoreTests/12/22 (489 of 1923)
PASS: lldb-unit :: Utility/./UtilityTests/7/30 (490 of 1923)
UNSUPPORTED: lldb-api :: tools/lldb-server/TestGdbRemoteFork.py (491 of 1923)
PASS: lldb-unit :: UnwindAssembly/ARM64/./Arm64InstEmulationTests/5/7 (492 of 1923)
PASS: lldb-api :: commands/version/TestVersion.py (493 of 1923)
PASS: lldb-unit :: Host/./HostTests/13/19 (494 of 1923)
PASS: lldb-shell :: ObjectFile/ELF/PT_LOAD-empty.yaml (495 of 1923)
PASS: lldb-api :: functionalities/data-formatter/builtin-formats/TestBuiltinFormats.py (496 of 1923)
UNSUPPORTED: lldb-shell :: Subprocess/vfork-follow-child.test (497 of 1923)
PASS: lldb-unit :: Target/./TargetTests/15/19 (498 of 1923)
PASS: lldb-unit :: UnwindAssembly/x86/./UnwindAssemblyx86Tests/15/27 (499 of 1923)
UNSUPPORTED: lldb-shell :: ObjectFile/ELF/minidebuginfo-no-lzma.yaml (500 of 1923)
PASS: lldb-api :: lang/objc/orderedset/TestOrderedSet.py (501 of 1923)
UNSUPPORTED: lldb-api :: functionalities/ptrauth_diagnostics/BRAA_error/TestPtrauthBRAADiagnostic.py (502 of 1923)
UNSUPPORTED: lldb-shell :: SymbolFile/PDB/function-level-linking.test (503 of 1923)
PASS: lldb-unit :: Core/./LLDBCoreTests/7/22 (504 of 1923)
PASS: lldb-api :: commands/frame/select/TestFrameSelect.py (505 of 1923)
PASS: lldb-api :: commands/expression/import-std-module/iterator/TestIteratorFromStdModule.py (506 of 1923)
PASS: lldb-unit :: ScriptInterpreter/Python/./ScriptInterpreterPythonTests/1/19 (507 of 1923)
PASS: lldb-api :: lang/cpp/llvm-style/TestLLVMStyle.py (508 of 1923)
PASS: lldb-api :: lang/c/sizeof/TestCSizeof.py (509 of 1923)
PASS: lldb-shell :: ObjectFile/Breakpad/sections.test (510 of 1923)
PASS: lldb-api :: commands/frame/diagnose/dereference-function-return/TestDiagnoseDereferenceFunctionReturn.py (511 of 1923)
PASS: lldb-unit :: Target/./TargetTests/10/19 (512 of 1923)
UNSUPPORTED: lldb-api :: arm/breakpoint-thumb-codesection/TestBreakpointThumbCodesection.py (513 of 1923)
PASS: lldb-unit :: Target/./TargetTests/8/19 (514 of 1923)
PASS: lldb-unit :: Process/minidump/./LLDBMinidumpTests/6/17 (515 of 1923)
UNSUPPORTED: lldb-shell :: ScriptInterpreter/Lua/watchpoint_callback.test (516 of 1923)
XFAIL: lldb-api :: functionalities/gdb_remote_client/TestRestartBug.py (517 of 1923)
PASS: lldb-api :: functionalities/tail_call_frames/disambiguate_tail_call_seq/TestDisambiguateTailCallSeq.py (518 of 1923)
PASS: lldb-api :: functionalities/gdb_remote_client/TestGDBRemoteDiskFileCompletion.py (519 of 1923)
PASS: lldb-shell :: Driver/TestQuiet.test (520 of 1923)
UNSUPPORTED: lldb-api :: tools/lldb-server/TestNonStop.py (521 of 1923)
PASS: lldb-shell :: ScriptInterpreter/Python/silent_command_script_import.test (522 of 1923)
PASS: lldb-api :: lang/cpp/overloaded-functions/TestOverloadedFunctions.py (523 of 1923)
PASS: lldb-shell :: ScriptInterpreter/Python/exit.test (524 of 1923)
PASS: lldb-unit :: SymbolFile/NativePDB/./SymbolFileNativePDBTests/0/15 (525 of 1923)
PASS: lldb-api :: python_api/target/TestTargetAPI.py (526 of 1923)
PASS: lldb-api :: functionalities/data-formatter/data-formatter-objc/TestDataFormatterObjCNSData.py (527 of 1923)
PASS: lldb-unit :: Expression/./ExpressionTests/20/22 (528 of 1923)
PASS: lldb-api :: lang/cpp/diamond/TestCppDiamond.py (529 of 1923)
PASS: lldb-api :: lang/c/flexible-array-members/TestCFlexibleArrayMembers.py (530 of 1923)
PASS: lldb-api :: commands/gui/viewlarge/TestGuiViewLarge.py (531 of 1923)
PASS: lldb-shell :: Register/Core/x86-32-netbsd-multithread.test (532 of 1923)
PASS: lldb-shell :: Register/Core/x86-64-netbsd-addr.test (533 of 1923)
PASS: lldb-unit :: Process/minidump/./LLDBMinidumpTests/7/17 (534 of 1923)
PASS: lldb-shell :: Quit/TestQuitExitCodeTooManyArgs.test (535 of 1923)
PASS: lldb-api :: commands/expression/xvalue/TestXValuePrinting.py (536 of 1923)
PASS: lldb-shell :: Register/x86-64-read.test (537 of 1923)
UNSUPPORTED: lldb-api :: lang/objc/modules-incomplete/TestIncompleteModules.py (538 of 1923)
PASS: lldb-shell :: ObjectFile/ELF/netbsd-exec-8.99.30-amd64.yaml (539 of 1923)
PASS: lldb-unit :: Process/./ProcessEventDataTests/1/2 (540 of 1923)
PASS: lldb-unit :: Language/Highlighting/./HighlighterTests/5/29 (541 of 1923)
PASS: lldb-api :: commands/expression/ir-interpreter/TestIRInterpreter.py (542 of 1923)
PASS: lldb-api :: commands/process/signal/TestProcessSignal.py (543 of 1923)
PASS: lldb-api :: api/multiple-debuggers/TestMultipleDebuggers.py (544 of 1923)
PASS: lldb-api :: commands/expression/regression-access-function-template-in-record/TestRegressionAccessFunctionTemplateInRecord.py (545 of 1923)
PASS: lldb-shell :: Register/Core/x86-32-freebsd-gp.test (546 of 1923)
UNSUPPORTED: lldb-api :: python_api/watchpoint/TestSetWatchpoint.py (547 of 1923)
UNSUPPORTED: lldb-shell :: SymbolFile/DWARF/x86/inline-function-address.ll (548 of 1923)
PASS: lldb-api :: functionalities/data-formatter/data-formatter-stl/libcxx/map/TestDataFormatterLibccMap.py (549 of 1923)
UNSUPPORTED: lldb-shell :: SymbolFile/NativePDB/missing-type.s (550 of 1923)
UNSUPPORTED: lldb-shell :: ScriptInterpreter/Lua/quit.test (551 of 1923)
PASS: lldb-shell :: Commands/command-image-lookup.yaml (552 of 1923)
PASS: lldb-shell :: Reproducer/TestDiscard.test (553 of 1923)
PASS: lldb-api :: commands/expression/context-object/TestContextObject.py (554 of 1923)
PASS: lldb-api :: lang/cpp/function_refs/TestFunctionRefs.py (555 of 1923)
UNSUPPORTED: lldb-shell :: ScriptInterpreter/Lua/independent_state.test (556 of 1923)
UNSUPPORTED: lldb-shell :: SymbolFile/DWARF/x86/debug-types-signature-loop.s (557 of 1923)
XFAIL: lldb-shell :: ObjectFile/PECOFF/default-triple-windows-gnu.yaml (558 of 1923)
PASS: lldb-api :: functionalities/show_location/TestShowLocationDwarf5.py (559 of 1923)
UNSUPPORTED: lldb-api :: commands/trace/TestTraceDumpInfo.py (560 of 1923)
PASS: lldb-api :: functionalities/plugins/python_os_plugin/stepping_plugin_threads/TestOSPluginStepping.py (561 of 1923)
PASS: lldb-api :: functionalities/value_md5_crash/TestValueMD5Crash.py (562 of 1923)
PASS: lldb-unit :: SymbolFile/NativePDB/./SymbolFileNativePDBTests/9/15 (563 of 1923)
PASS: lldb-api :: lang/objc/foundation/TestFoundationDisassembly.py (564 of 1923)
PASS: lldb-shell :: SymbolFile/DWARF/x86/DW_TAG_variable-invalid_location.s (565 of 1923)
PASS: lldb-shell :: Symtab/symtab-regex-demangled.test (566 of 1923)
PASS: lldb-api :: lang/cpp/scope/TestCppScope.py (567 of 1923)
PASS: lldb-api :: functionalities/postmortem/minidump-new/TestMiniDumpUUID.py (568 of 1923)
PASS: lldb-unit :: Process/Utility/./ProcessUtilityTests/1/16 (569 of 1923)
PASS: lldb-shell :: Minidump/Windows/broken-unwind.test (570 of 1923)
PASS: lldb-api :: lang/c/set_values/TestSetValues.py (571 of 1923)
PASS: lldb-api :: functionalities/module_cache/debug_index/TestDebugIndexCache.py (572 of 1923)
PASS: lldb-shell :: SymbolFile/DWARF/x86/unused-inlined-params.test (573 of 1923)
PASS: lldb-api :: lang/objcxx/objc-builtin-types/TestObjCBuiltinTypes.py (574 of 1923)
PASS: lldb-shell :: ObjectFile/PECOFF/default-triple-windows-msvc.yaml (575 of 1923)
PASS: lldb-unit :: SymbolFile/DWARF/./SymbolFileDWARFTests/7/29 (576 of 1923)
UNSUPPORTED: lldb-api :: tools/lldb-server/TestLldbGdbServer.py (577 of 1923)
PASS: lldb-api :: functionalities/fat_archives/TestFatArchives.py (578 of 1923)
PASS: lldb-api :: functionalities/postmortem/minidump/TestMiniDump.py (579 of 1923)
PASS: lldb-api :: functionalities/multiword-commands/TestMultiWordCommands.py (580 of 1923)
PASS: lldb-api :: commands/expression/options/TestExprOptions.py (581 of 1923)
UNSUPPORTED: lldb-api :: functionalities/ptrauth_diagnostics/brkC47x_x16_invalid/TestPtrauthBRKc47xX16Invalid.py (582 of 1923)
UNSUPPORTED: lldb-api :: arm/breakpoint-it/TestBreakpointIt.py (583 of 1923)
PASS: lldb-unit :: Process/minidump/./LLDBMinidumpTests/4/17 (584 of 1923)
PASS: lldb-api :: commands/expression/import-std-module/weak_ptr/TestWeakPtrFromStdModule.py (585 of 1923)
UNSUPPORTED: lldb-shell :: Breakpoint/ppc64-localentry.test (586 of 1923)
PASS: lldb-api :: functionalities/data-formatter/synthupdate/TestSyntheticFilterRecompute.py (587 of 1923)
PASS: lldb-api :: lang/objc/objc-struct-argument/TestObjCStructArgument.py (588 of 1923)
PASS: lldb-shell :: SymbolFile/DWARF/x86/split-dwarf-inlining.cpp (589 of 1923)
PASS: lldb-api :: functionalities/data-formatter/frameformat_smallstruct/TestFrameFormatSmallStruct.py (590 of 1923)
PASS: lldb-unit :: Utility/./UtilityTests/23/30 (591 of 1923)
PASS: lldb-shell :: SymbolFile/OnDemand/symbolic-breakpoint.test (592 of 1923)
PASS: lldb-unit :: Interpreter/./InterpreterTests/9/14 (593 of 1923)
PASS: lldb-api :: macosx/ignore_exceptions/TestIgnoredExceptions.py (594 of 1923)
UNSUPPORTED: lldb-shell :: ScriptInterpreter/Lua/convenience_variables.test (595 of 1923)
UNSUPPORTED: lldb-shell :: SymbolFile/target-symbols-add-unwind.test (596 of 1923)
UNSUPPORTED: lldb-shell :: Subprocess/vfork-follow-child-wp.test (597 of 1923)
PASS: lldb-api :: functionalities/disassemble/aarch64-adrp-add/TestAArch64AdrpAdd.py (598 of 1923)
PASS: lldb-api :: lang/cpp/char8_t/TestCxxChar8_t.py (599 of 1923)
PASS: lldb-unit :: Symbol/./SymbolTests/14/16 (600 of 1923)
PASS: lldb-api :: macosx/lc-note/multiple-binary-corefile/TestMultipleBinaryCorefile.py (601 of 1923)
PASS: lldb-api :: functionalities/breakpoint/breakpoint_set_restart/TestBreakpointSetRestart.py (602 of 1923)
UNSUPPORTED: lldb-api :: commands/watchpoints/watchpoint_commands/command/TestWatchpointCommandPython.py (603 of 1923)
PASS: lldb-shell :: ObjectFile/Breakpad/uuid-matching-mac.test (604 of 1923)
UNSUPPORTED: lldb-api :: functionalities/dyld-launch-linux/TestDyldLaunchLinux.py (605 of 1923)
PASS: lldb-unit :: Process/gdb-remote/./ProcessGdbRemoteTests/17/19 (606 of 1923)
PASS: lldb-unit :: Utility/./UtilityTests/20/30 (607 of 1923)
UNSUPPORTED: lldb-api :: functionalities/thread/concurrent_events/TestConcurrentTwoWatchpointsOneBreakpoint.py (608 of 1923)
UNSUPPORTED: lldb-api :: functionalities/ptrauth_diagnostics/BLRAA_error/TestPtrauthBLRAADiagnostic.py (609 of 1923)
PASS: lldb-api :: python_api/sberror/TestSBError.py (610 of 1923)
PASS: lldb-shell :: ObjectFile/ELF/many-sections.s (611 of 1923)
PASS: lldb-api :: python_api/default-constructor/TestDefaultConstructorForAPIObjects.py (612 of 1923)
PASS: lldb-shell :: BuildScript/compiler-full-path.test (613 of 1923)
PASS: lldb-unit :: UnwindAssembly/x86/./UnwindAssemblyx86Tests/2/27 (614 of 1923)
PASS: lldb-unit :: Symbol/./SymbolTests/4/16 (615 of 1923)
UNSUPPORTED: lldb-api :: lang/cpp/modules-import/TestCXXModulesImport.py (616 of 1923)
PASS: lldb-api :: python_api/event/TestEvents.py (617 of 1923)
PASS: lldb-api :: lang/cpp/unicode-literals/TestUnicodeLiterals.py (618 of 1923)
PASS: lldb-api :: commands/expression/deleting-implicit-copy-constructor/TestDeletingImplicitCopyConstructor.py (619 of 1923)
PASS: lldb-api :: functionalities/gdb_remote_client/TestThreadSelectionBug.py (620 of 1923)
PASS: lldb-api :: lang/cpp/breakpoint-commands/TestCPPBreakpointCommands.py (621 of 1923)
PASS: lldb-api :: commands/expression/import-std-module/module-build-errors/TestStdModuleBuildErrors.py (622 of 1923)
PASS: lldb-unit :: Host/./HostTests/1/19 (623 of 1923)
UNSUPPORTED: lldb-api :: android/platform/TestDefaultCacheLineSize.py (624 of 1923)
PASS: lldb-api :: lang/cpp/const_this/TestConstThis.py (625 of 1923)
PASS: lldb-unit :: Host/./HostTests/3/19 (626 of 1923)
PASS: lldb-unit :: Core/./LLDBCoreTests/19/22 (627 of 1923)
PASS: lldb-api :: commands/breakpoint/set/func-regex/TestBreakpointRegexError.py (628 of 1923)
PASS: lldb-unit :: SymbolFile/NativePDB/./SymbolFileNativePDBTests/14/15 (629 of 1923)
PASS: lldb-unit :: Interpreter/./InterpreterTests/8/14 (630 of 1923)
UNSUPPORTED: lldb-shell :: SymbolFile/NativePDB/local-variables.cpp (631 of 1923)
PASS: lldb-api :: tools/lldb-vscode/breakpoint/TestVSCode_logpoints.py (632 of 1923)
PASS: lldb-shell :: Commands/command-disassemble-aarch64-extensions.s (633 of 1923)
PASS: lldb-api :: functionalities/thread/concurrent_events/TestConcurrentCrashWithSignal.py (634 of 1923)
PASS: lldb-api :: commands/expression/import-std-module/vector-bool/TestVectorBoolFromStdModule.py (635 of 1923)
PASS: lldb-unit :: ScriptInterpreter/Python/./ScriptInterpreterPythonTests/2/19 (636 of 1923)
UNSUPPORTED: lldb-api :: functionalities/thread/concurrent_events/TestConcurrentSignalWatch.py (637 of 1923)
PASS: lldb-unit :: Utility/./UtilityTests/9/30 (638 of 1923)
PASS: lldb-api :: iohandler/autosuggestion/TestAutosuggestion.py (639 of 1923)
PASS: lldb-unit :: Language/Highlighting/./HighlighterTests/0/29 (640 of 1923)
PASS: lldb-unit :: Expression/./ExpressionTests/11/22 (641 of 1923)
UNSUPPORTED: lldb-shell :: SymbolFile/DWARF/x86/dwarf5-line-strp.s (642 of 1923)
PASS: lldb-shell :: ObjectFile/MachO/symtab.yaml (643 of 1923)
PASS: lldb-api :: commands/expression/radar_8638051/Test8638051.py (644 of 1923)
PASS: lldb-unit :: Symbol/./SymbolTests/13/16 (645 of 1923)
PASS: lldb-api :: functionalities/data-formatter/data-formatter-python-synth/TestDataFormatterPythonSynth.py (646 of 1923)
PASS: lldb-api :: macosx/lc-note/kern-ver-str/TestKernVerStrLCNOTE.py (647 of 1923)
PASS: lldb-shell :: SymbolFile/DWARF/deterministic-build.cpp (648 of 1923)
UNSUPPORTED: lldb-api :: commands/watchpoints/hello_watchpoint/TestMyFirstWatchpoint.py (649 of 1923)
UNSUPPORTED: lldb-api :: commands/trace/TestTraceLoad.py (650 of 1923)
PASS: lldb-api :: functionalities/breakpoint/source_regexp/TestSourceRegexBreakpoints.py (651 of 1923)
PASS: lldb-shell :: ObjectFile/ELF/section-overlap.yaml (652 of 1923)
UNSUPPORTED: lldb-shell :: BuildScript/toolchain-msvc.test (653 of 1923)
UNSUPPORTED: lldb-api :: functionalities/data-formatter/data-formatter-stl/libstdcpp/unique_ptr/TestDataFormatterStdUniquePtr.py (654 of 1923)
PASS: lldb-api :: lang/objc/foundation/TestObjCMethodsString.py (655 of 1923)
PASS: lldb-api :: lang/cpp/dereferencing_references/TestCPPDereferencingReferences.py (656 of 1923)
PASS: lldb-api :: commands/platform/file/close/TestPlatformFileClose.py (657 of 1923)
UNSUPPORTED: lldb-shell :: SymbolFile/DWARF/x86/find-basic-type.cpp (658 of 1923)
PASS: lldb-unit :: Symbol/./SymbolTests/6/16 (659 of 1923)
UNSUPPORTED: lldb-api :: lang/objcxx/cxx-bridged-po/TestObjCXXBridgedPO.py (660 of 1923)
UNSUPPORTED: lldb-api :: tools/lldb-server/signal-filtering/TestGdbRemote_QPassSignals.py (661 of 1923)
PASS: lldb-shell :: Register/Core/x86-64-linux-addr.test (662 of 1923)
PASS: lldb-api :: functionalities/data-formatter/format-propagation/TestFormatPropagation.py (663 of 1923)
PASS: lldb-api :: commands/platform/file/read/TestPlatformFileRead.py (664 of 1923)
PASS: lldb-api :: python_api/lldbutil/iter/TestRegistersIterator.py (665 of 1923)
UNSUPPORTED: lldb-api :: functionalities/thread/concurrent_events/TestConcurrentTwoWatchpointsOneSignal.py (666 of 1923)
UNSUPPORTED: lldb-shell :: SymbolFile/PDB/udt-layout.test (667 of 1923)
PASS: lldb-shell :: Register/Core/x86-32-linux-fp.test (668 of 1923)
PASS: lldb-api :: functionalities/breakpoint/breakpoint_on_lambda_capture/TestBreakOnLambdaCapture.py (669 of 1923)
PASS: lldb-unit :: Utility/./UtilityTests/1/30 (670 of 1923)
PASS: lldb-api :: sanity/TestSettingSkipping.py (671 of 1923)
PASS: lldb-api :: functionalities/inferior-crashing/TestInferiorCrashingStep.py (672 of 1923)
PASS: lldb-shell :: Error/assert.test (673 of 1923)
PASS: lldb-api :: functionalities/thread/step_out/TestThreadStepOut.py (674 of 1923)
PASS: lldb-unit :: Breakpoint/./LLDBBreakpointTests/0/1 (675 of 1923)
PASS: lldb-api :: functionalities/data-formatter/data-formatter-objc/TestDataFormatterObjCCF.py (676 of 1923)
PASS: lldb-api :: commands/target/create-no-such-arch/TestNoSuchArch.py (677 of 1923)
PASS: lldb-shell :: Subprocess/vfork-follow-parent.test (678 of 1923)
PASS: lldb-api :: lang/cpp/namespace/TestNamespaceLookup.py (679 of 1923)
PASS: lldb-api :: functionalities/multidebugger_commands/TestMultipleDebuggersCommands.py (680 of 1923)
PASS: lldb-unit :: Core/./LLDBCoreTests/18/22 (681 of 1923)
PASS: lldb-api :: functionalities/abbreviation/TestCommonShortSpellings.py (682 of 1923)
UNSUPPORTED: lldb-shell :: Register/x86-64-zmm-write.test (683 of 1923)
PASS: lldb-shell :: ObjectFile/ELF/section-addresses.yaml (684 of 1923)
PASS: lldb-shell :: ObjectFile/MachO/lc_build_version_notools.yaml (685 of 1923)
PASS: lldb-unit :: Symbol/./SymbolTests/15/16 (686 of 1923)
PASS: lldb-api :: lang/cpp/call-function/TestCallCPPFunction.py (687 of 1923)
PASS: lldb-api :: lang/objc/objc-new-syntax/TestObjCNewSyntaxDictionary.py (688 of 1923)
PASS: lldb-api :: functionalities/data-formatter/type_summary_list_script/TestTypeSummaryListScript.py (689 of 1923)
UNSUPPORTED: lldb-api :: linux/aarch64/unwind_signal/TestUnwindSignal.py (690 of 1923)
PASS: lldb-unit :: Interpreter/./InterpreterTests/4/14 (691 of 1923)
PASS: lldb-api :: commands/expression/call-throws/TestCallThatThrows.py (692 of 1923)
UNSUPPORTED: lldb-shell :: Subprocess/fork-follow-child-wp.test (693 of 1923)
PASS: lldb-api :: lang/cpp/function-local-class/TestCppFunctionLocalClass.py (694 of 1923)
PASS: lldb-unit :: Host/./HostTests/12/19 (695 of 1923)
PASS: lldb-shell :: Minidump/no-process-id.yaml (696 of 1923)
PASS: lldb-api :: python_api/value/TestValueAPI.py (697 of 1923)
PASS: lldb-api :: lang/objc/rdar-10967107/TestRdar10967107.py (698 of 1923)
PASS: lldb-api :: macosx/skinny-corefile/TestSkinnyCorefile.py (699 of 1923)
UNSUPPORTED: lldb-api :: commands/trace/TestTraceSchema.py (700 of 1923)
UNSUPPORTED: lldb-api :: macosx/corefile-default-ptrauth/TestCorefileDefaultPtrauth.py (701 of 1923)
UNSUPPORTED: lldb-shell :: Process/Windows/process_load.cpp (702 of 1923)
UNSUPPORTED: lldb-api :: functionalities/data-formatter/data-formatter-stl/libstdcpp/smart_ptr/TestDataFormatterStdSmartPtr.py (703 of 1923)
PASS: lldb-shell :: ObjectFile/ELF/build-id-case.yaml (704 of 1923)
PASS: lldb-api :: functionalities/param_entry_vals/basic_entry_values/TestBasicEntryValues.py (705 of 1923)
PASS: lldb-api :: functionalities/inferior-changed/TestInferiorChanged.py (706 of 1923)
PASS: lldb-api :: lang/objc/blocks/TestObjCIvarsInBlocks.py (707 of 1923)
PASS: lldb-shell :: Breakpoint/jit-loader_jitlink_elf.test (708 of 1923)
PASS: lldb-unit :: Expression/./ExpressionTests/13/22 (709 of 1923)
PASS: lldb-shell :: ObjectFile/PECOFF/dwarf-gnu-debuglink-i686.yaml (710 of 1923)
UNSUPPORTED: lldb-shell :: SymbolFile/DWARF/x86/dwarf5-partial-index.cpp (711 of 1923)
PASS: lldb-api :: types/TestCharTypeExpr.py (712 of 1923)
PASS: lldb-unit :: Language/Highlighting/./HighlighterTests/19/29 (713 of 1923)
PASS: lldb-unit :: Process/minidump/./LLDBMinidumpTests/5/17 (714 of 1923)
UNSUPPORTED: lldb-shell :: Subprocess/clone-follow-parent-softbp.test (715 of 1923)
PASS: lldb-api :: lang/cpp/bool/TestCPPBool.py (716 of 1923)
PASS: lldb-api :: functionalities/thread/exit_during_break/TestExitDuringBreak.py (717 of 1923)
PASS: lldb-unit :: Core/./LLDBCoreTests/17/22 (718 of 1923)
UNSUPPORTED: lldb-shell :: SymbolFile/DWARF/x86/inline-function-address-shared.test (719 of 1923)
PASS: lldb-unit :: Utility/./UtilityTests/10/30 (720 of 1923)
PASS: lldb-api :: functionalities/data-formatter/data-formatter-objc/TestDataFormatterObjCKVO.py (721 of 1923)
PASS: lldb-api :: lang/objc/modules-cache/TestClangModulesCache.py (722 of 1923)
PASS: lldb-api :: python_api/objc_type/TestObjCType.py (723 of 1923)
PASS: lldb-api :: functionalities/thread/create_after_attach/TestCreateAfterAttach.py (724 of 1923)
PASS: lldb-api :: python_api/sbdata/TestSBData.py (725 of 1923)
PASS: lldb-shell :: Driver/TestPositionalArgs.test (726 of 1923)
PASS: lldb-api :: api/listeners/TestListener.py (727 of 1923)
PASS: lldb-unit :: Language/Highlighting/./HighlighterTests/24/29 (728 of 1923)
PASS: lldb-api :: commands/expression/import-std-module/shared_ptr-dbg-info-content/TestSharedPtrDbgInfoContentFromStdModule.py (729 of 1923)
PASS: lldb-unit :: UnwindAssembly/ARM64/./Arm64InstEmulationTests/0/7 (730 of 1923)
PASS: lldb-api :: lang/cpp/chained-calls/TestCppChainedCalls.py (731 of 1923)
PASS: lldb-unit :: Editline/./EditlineTests/1/2 (732 of 1923)
PASS: lldb-api :: commands/expression/test/TestExprs2.py (733 of 1923)
PASS: lldb-unit :: Process/gdb-remote/./ProcessGdbRemoteTests/0/19 (734 of 1923)
UNSUPPORTED: lldb-api :: commands/watchpoints/watchpoint_events/TestWatchpointEvents.py (735 of 1923)
UNSUPPORTED: lldb-api :: commands/gui/expand-threads-tree/TestGuiExpandThreadsTree.py (736 of 1923)
PASS: lldb-shell :: Minidump/Windows/arm-fp-unwind.test (737 of 1923)
PASS: lldb-unit :: Utility/./UtilityTests/17/30 (738 of 1923)
PASS: lldb-unit :: Symbol/./SymbolTests/0/16 (739 of 1923)
PASS: lldb-api :: lang/objc/forward-decl/TestForwardDecl.py (740 of 1923)
PASS: lldb-api :: commands/target/stop-hook/delete/TestTargetStopHookDelete.py (741 of 1923)
PASS: lldb-api :: lang/cpp/covariant-return-types/TestCovariantReturnTypes.py (742 of 1923)
PASS: lldb-api :: lang/objc/foundation/TestObjCMethods.py (743 of 1923)
PASS: lldb-shell :: SymbolFile/DWARF/x86/debug_loc.s (744 of 1923)
PASS: lldb-api :: commands/expression/timeout/TestCallWithTimeout.py (745 of 1923)
PASS: lldb-shell :: ObjectFile/PECOFF/symbol.yaml (746 of 1923)
PASS: lldb-api :: lang/objc/self/TestObjCSelf.py (747 of 1923)
PASS: lldb-api :: linux/builtin_trap/TestBuiltinTrap.py (748 of 1923)
PASS: lldb-api :: commands/expression/po_verbosity/TestPoVerbosity.py (749 of 1923)
PASS: lldb-api :: lang/objc/objc-new-syntax/TestObjCNewSyntaxLiteral.py (750 of 1923)
PASS: lldb-unit :: Expression/./ExpressionTests/4/22 (751 of 1923)
PASS: lldb-unit :: Host/./HostTests/5/19 (752 of 1923)
PASS: lldb-api :: commands/target/stop-hooks/TestStopHooks.py (753 of 1923)
PASS: lldb-api :: functionalities/unwind/noreturn/module-end/TestNoReturnModuleEnd.py (754 of 1923)
PASS: lldb-shell :: ObjectFile/PECOFF/section-types.yaml (755 of 1923)
PASS: lldb-unit :: Language/Highlighting/./HighlighterTests/7/29 (756 of 1923)
PASS: lldb-shell :: SymbolFile/DWARF/x86/DW_OP_piece-smaller-than-struct.s (757 of 1923)
UNSUPPORTED: lldb-shell :: SymbolFile/NativePDB/break-by-line.cpp (758 of 1923)
PASS: lldb-api :: functionalities/exec/TestExec.py (759 of 1923)
PASS: lldb-unit :: Language/CPlusPlus/./LanguageCPlusPlusTests/1/5 (760 of 1923)
PASS: lldb-api :: lang/objc/ivar-IMP/TestObjCiVarIMP.py (761 of 1923)
PASS: lldb-api :: commands/expression/multiline-navigation/TestMultilineNavigation.py (762 of 1923)
UNSUPPORTED: lldb-api :: lang/objc/conflicting-class-list-function-from-user/TestObjCClassListFunctionFromUser.py (763 of 1923)
PASS: lldb-shell :: Driver/TestTarget.test (764 of 1923)
PASS: lldb-shell :: ObjectFile/ELF/base-address.yaml (765 of 1923)
PASS: lldb-api :: functionalities/gdb_remote_client/TestIOSSimulator.py (766 of 1923)
PASS: lldb-api :: types/TestShortTypeExpr.py (767 of 1923)
PASS: lldb-api :: functionalities/thread/exit_during_step/TestExitDuringStep.py (768 of 1923)
PASS: lldb-api :: functionalities/thread/num_threads/TestNumThreads.py (769 of 1923)
PASS: lldb-api :: functionalities/reproducers/fs-case-sensitivity/TestReproducerFSCaseSensitivity.py (770 of 1923)
PASS: lldb-unit :: Target/./TargetTests/4/19 (771 of 1923)
PASS: lldb-api :: lang/objc/modules-inline-functions/TestModulesInlineFunctions.py (772 of 1923)
PASS: lldb-unit :: UnwindAssembly/x86/./UnwindAssemblyx86Tests/24/27 (773 of 1923)
PASS: lldb-shell :: Reproducer/TestDSYM.test (774 of 1923)
PASS: lldb-unit :: UnwindAssembly/ARM64/./Arm64InstEmulationTests/3/7 (775 of 1923)
PASS: lldb-shell :: Settings/TestModuleCacheSanity.test (776 of 1923)
PASS: lldb-shell :: Reproducer/TestVersionCheck.test (777 of 1923)
PASS: lldb-shell :: Driver/TestHelp.test (778 of 1923)
PASS: lldb-shell :: lldb-server/TestErrorMessages.test (779 of 1923)
PASS: lldb-shell :: SymbolFile/DWARF/x86/DW_TAG_basic_type_DW_ATE_UTF_nonC.ll (780 of 1923)
PASS: lldb-shell :: Register/Core/x86-32-linux-gp.test (781 of 1923)
PASS: lldb-api :: functionalities/find-line-entry/TestFindLineEntry.py (782 of 1923)
UNSUPPORTED: lldb-shell :: SymbolFile/DWARF/x86/debug-types-basic.test (783 of 1923)
PASS: lldb-api :: functionalities/thread/thread_exit/TestThreadExit.py (784 of 1923)
PASS: lldb-api :: iohandler/resize/TestIOHandlerResize.py (785 of 1923)
PASS: lldb-api :: commands/gui/breakpoints/TestGuiBreakpoints.py (786 of 1923)
PASS: lldb-api :: commands/expression/radar_9531204/TestPrintfAfterUp.py (787 of 1923)
PASS: lldb-shell :: SymbolFile/Breakpad/stack-cfi-parsing.test (788 of 1923)
PASS: lldb-api :: lang/cpp/const_static_integral_member_int128/TestConstStaticIntegralMemberInt128.py (789 of 1923)
PASS: lldb-api :: functionalities/breakpoint/breakpoint_hit_count/TestBreakpointHitCount.py (790 of 1923)
PASS: lldb-api :: functionalities/dlopen_other_executable/TestDlopenOtherExecutable.py (791 of 1923)
PASS: lldb-api :: macosx/queues/TestQueues.py (792 of 1923)
PASS: lldb-api :: lang/objc/unicode-string/TestUnicodeString.py (793 of 1923)
PASS: lldb-api :: functionalities/gdb_remote_client/TestGDBServerNoTargetXML.py (794 of 1923)
UNSUPPORTED: lldb-api :: linux/thread/create_during_instruction_step/TestCreateDuringInstructionStep.py (795 of 1923)
PASS: lldb-unit :: ObjectFile/Breakpad/./ObjectFileBreakpadTests/6/11 (796 of 1923)
UNSUPPORTED: lldb-shell :: ObjectFile/ELF/basic-info.yaml (797 of 1923)
PASS: lldb-api :: functionalities/tail_call_frames/ambiguous_tail_call_seq1/TestAmbiguousTailCallSeq1.py (798 of 1923)
PASS: lldb-shell :: Quit/TestQuitExitCodeImplicit0.test (799 of 1923)
UNSUPPORTED: lldb-shell :: SymbolFile/PDB/ast-restore.test (800 of 1923)
XFAIL: lldb-api :: lang/c/local_types/TestUseClosestType.py (801 of 1923)
PASS: lldb-api :: functionalities/thread/concurrent_events/TestConcurrentBreakpointDelayBreakpointOneSignal.py (802 of 1923)
PASS: lldb-unit :: Process/Utility/./ProcessUtilityTests/13/16 (803 of 1923)
PASS: lldb-api :: commands/expression/calculator_mode/TestCalculatorMode.py (804 of 1923)
PASS: lldb-unit :: Expression/./ExpressionTests/16/22 (805 of 1923)
PASS: lldb-api :: commands/expression/import-std-module/deque-dbg-info-content/TestDbgInfoContentDequeFromStdModule.py (806 of 1923)
PASS: lldb-unit :: ObjectFile/Breakpad/./ObjectFileBreakpadTests/5/11 (807 of 1923)
PASS: lldb-shell :: SymbolFile/Breakpad/stack-cfi-arm.yaml (808 of 1923)
PASS: lldb-api :: lang/objc/warnings-in-expr-parser/TestObjCWarningsInExprParser.py (809 of 1923)
PASS: lldb-shell :: Commands/command-stop-hook-no-target.test (810 of 1923)
PASS: lldb-shell :: SymbolFile/DWARF/x86/debug_static-member-anonymous-namespace.s (811 of 1923)
PASS: lldb-api :: functionalities/location-list-lookup/TestLocationListLookup.py (812 of 1923)
PASS: lldb-unit :: SymbolFile/NativePDB/./SymbolFileNativePDBTests/7/15 (813 of 1923)
PASS: lldb-unit :: Expression/./ExpressionTests/17/22 (814 of 1923)
UNSUPPORTED: lldb-api :: functionalities/asan/TestReportData.py (815 of 1923)
PASS: lldb-api :: functionalities/step-vrs-interrupt/TestStepVrsInterruptTimeout.py (816 of 1923)
UNSUPPORTED: lldb-api :: macosx/rosetta/TestRosetta.py (817 of 1923)
PASS: lldb-shell :: SymbolFile/DWARF/x86/debug_rnglists-dwp.s (818 of 1923)
PASS: lldb-api :: arm/emulation/TestEmulations.py (819 of 1923)
PASS: lldb-unit :: UnwindAssembly/x86/./UnwindAssemblyx86Tests/23/27 (820 of 1923)
PASS: lldb-unit :: Core/./LLDBCoreTests/13/22 (821 of 1923)
PASS: lldb-api :: functionalities/optimized_code/TestNoASanExceptionAfterEvalOP_piece.py (822 of 1923)
PASS: lldb-api :: functionalities/gdb_remote_client/TestProcessConnect.py (823 of 1923)
PASS: lldb-api :: qemu/TestQemuLaunch.py (824 of 1923)
PASS: lldb-shell :: SymbolFile/DWARF/x86/debug_loclists-dwo.s (825 of 1923)
PASS: lldb-unit :: Process/minidump/./LLDBMinidumpTests/14/17 (826 of 1923)
UNSUPPORTED: lldb-api :: python_api/watchpoint/watchlocation/TestSetWatchlocation.py (827 of 1923)
PASS: lldb-shell :: ObjectFile/ELF/PT_LOAD.yaml (828 of 1923)
UNSUPPORTED: lldb-api :: linux/aarch64/mte_memory_region/TestAArch64LinuxMTEMemoryRegion.py (829 of 1923)
PASS: lldb-unit :: UnwindAssembly/x86/./UnwindAssemblyx86Tests/9/27 (830 of 1923)
PASS: lldb-api :: tools/lldb-vscode/launch/TestVSCode_launch.py (831 of 1923)
PASS: lldb-unit :: SymbolFile/DWARF/./SymbolFileDWARFTests/3/29 (832 of 1923)
UNSUPPORTED: lldb-api :: functionalities/data-formatter/data-formatter-stl/libstdcpp/vector/TestDataFormatterStdVector.py (833 of 1923)
UNSUPPORTED: lldb-api :: functionalities/tsan/basic/TestTsanBasic.py (834 of 1923)
UNSUPPORTED: lldb-api :: functionalities/thread/concurrent_events/TestConcurrentWatchpointWithDelayWatchpointThreads.py (835 of 1923)
PASS: lldb-api :: lang/cpp/static_methods/TestCPPStaticMethods.py (836 of 1923)
PASS: lldb-api :: python_api/class_members/TestSBTypeClassMembers.py (837 of 1923)
PASS: lldb-shell :: SymbolFile/DWARF/x86/DW_AT_decl_file-DW_AT_specification-crosscu.s (838 of 1923)
UNSUPPORTED: lldb-api :: python_api/watchpoint/TestWatchpointIgnoreCount.py (839 of 1923)
PASS: lldb-unit :: Expression/./ExpressionTests/2/22 (840 of 1923)
PASS: lldb-api :: commands/expression/import-std-module/deque-basic/TestDequeFromStdModule.py (841 of 1923)
PASS: lldb-api :: functionalities/data-formatter/summary-string-onfail/Test-rdar-9974002.py (842 of 1923)
PASS: lldb-api :: iohandler/sigint/TestProcessIOHandlerInterrupt.py (843 of 1923)
UNSUPPORTED: lldb-api :: commands/watchpoints/watchpoint_commands/condition/TestWatchpointConditionCmd.py (844 of 1923)
PASS: lldb-unit :: Process/gdb-remote/./ProcessGdbRemoteTests/3/19 (845 of 1923)
PASS: lldb-shell :: Settings/TestDefaultModuleCachePath.test (846 of 1923)
PASS: lldb-shell :: Driver/TestCore.test (847 of 1923)
UNSUPPORTED: lldb-api :: tools/lldb-server/inferior-crash/TestGdbRemoteAbort.py (848 of 1923)
PASS: lldb-api :: lang/objc/objc-property/TestObjCProperty.py (849 of 1923)
PASS: lldb-api :: functionalities/gdb_remote_client/TestPlatformKill.py (850 of 1923)
PASS: lldb-unit :: UnwindAssembly/x86/./UnwindAssemblyx86Tests/18/27 (851 of 1923)
UNSUPPORTED: lldb-api :: functionalities/process_save_core_minidump/TestProcessSaveCoreMinidump.py (852 of 1923)
PASS: lldb-api :: lang/cpp/class-loading-via-member-typedef/TestClassLoadingViaMemberTypedef.py (853 of 1923)
UNSUPPORTED: lldb-shell :: Commands/command-thread-siginfo.test (854 of 1923)
PASS: lldb-unit :: Signals/./SignalsTests/4/5 (855 of 1923)
PASS: lldb-unit :: Process/minidump/./LLDBMinidumpTests/11/17 (856 of 1923)
UNSUPPORTED: lldb-api :: tools/lldb-server/TestGdbRemoteKill.py (857 of 1923)
UNSUPPORTED: lldb-shell :: SymbolFile/DWARF/x86/find-basic-variable.cpp (858 of 1923)
UNSUPPORTED: lldb-api :: commands/register/register/aarch64_dynamic_regset/TestArm64DynamicRegsets.py (859 of 1923)
PASS: lldb-api :: functionalities/data-formatter/data-formatter-skip-summary/TestDataFormatterSkipSummary.py (860 of 1923)
PASS: lldb-unit :: Target/./TargetTests/12/19 (861 of 1923)
UNSUPPORTED: lldb-shell :: Subprocess/clone-follow-child-softbp.test (862 of 1923)
UNSUPPORTED: lldb-shell :: SymbolFile/DWARF/x86/array-sizes.s (863 of 1923)
PASS: lldb-api :: lang/objc/objc-struct-return/TestObjCStructReturn.py (864 of 1923)
PASS: lldb-shell :: ScriptInterpreter/Python/scripted_breakpoint_lua.test (865 of 1923)
PASS: lldb-shell :: SymbolFile/DWARF/x86/DW_OP_deref_size_static_var.s (866 of 1923)
PASS: lldb-unit :: Platform/./LLDBPlatformTests/14/16 (867 of 1923)
PASS: lldb-api :: commands/expression/completion-crash-incomplete-record/TestCompletionCrashIncompleteRecord.py (868 of 1923)
UNSUPPORTED: lldb-shell :: SymbolFile/NativePDB/subfield_register_simple_type.s (869 of 1923)
PASS: lldb-unit :: Process/gdb-remote/./ProcessGdbRemoteTests/13/19 (870 of 1923)
PASS: lldb-shell :: Reproducer/TestPythonImport.test (871 of 1923)
PASS: lldb-api :: tools/lldb-vscode/runInTerminal/TestVSCode_runInTerminal.py (872 of 1923)
PASS: lldb-shell :: Expr/TestIRMemoryMap.test (873 of 1923)
PASS: lldb-api :: functionalities/breakpoint/break_in_loaded_dylib/TestBreakInLoadedDylib.py (874 of 1923)
PASS: lldb-api :: functionalities/module_cache/simple_exe/TestModuleCacheSimple.py (875 of 1923)
PASS: lldb-api :: commands/target/create-deps/TestTargetCreateDeps.py (876 of 1923)
PASS: lldb-unit :: UnwindAssembly/x86/./UnwindAssemblyx86Tests/25/27 (877 of 1923)
PASS: lldb-api :: commands/expression/import-std-module/conflicts/TestStdModuleWithConflicts.py (878 of 1923)
PASS: lldb-shell :: SymbolFile/DWARF/x86/DW_OP_piece-struct.s (879 of 1923)
PASS: lldb-shell :: ObjectFile/ELF/duplicate-section.yaml (880 of 1923)
PASS: lldb-api :: lang/cpp/stl/TestSTL.py (881 of 1923)
PASS: lldb-api :: macosx/version_zero/TestGetVersionZeroVersion.py (882 of 1923)
PASS: lldb-shell :: Quit/TestQuitExitCodeHex0.test (883 of 1923)
UNSUPPORTED: lldb-api :: functionalities/process_save_core/TestProcessSaveCore.py (884 of 1923)
PASS: lldb-api :: python_api/sbplatform/TestSBPlatform.py (885 of 1923)
PASS: lldb-shell :: Settings/TestEchoCommands.test (886 of 1923)
PASS: lldb-unit :: Disassembler/ARM/./DisassemblerTests/1/2 (887 of 1923)
UNSUPPORTED: lldb-shell :: Subprocess/fork-follow-parent-softbp.test (888 of 1923)
PASS: lldb-shell :: Breakpoint/breakpoint-command.test (889 of 1923)
PASS: lldb-api :: macosx/duplicate-archive-members/TestDuplicateMembers.py (890 of 1923)
PASS: lldb-api :: lang/cpp/thread_local/TestThreadLocal.py (891 of 1923)
PASS: lldb-unit :: Platform/./LLDBPlatformTests/15/16 (892 of 1923)
PASS: lldb-unit :: Process/minidump/./LLDBMinidumpTests/3/17 (893 of 1923)
PASS: lldb-api :: lang/objc/foundation/TestObjectDescriptionAPI.py (894 of 1923)
PASS: lldb-unit :: SymbolFile/DWARF/./SymbolFileDWARFTests/24/29 (895 of 1923)
PASS: lldb-api :: python_api/frame/inlines/TestInlinedFrame.py (896 of 1923)
PASS: lldb-unit :: SymbolFile/NativePDB/./SymbolFileNativePDBTests/4/15 (897 of 1923)
PASS: lldb-shell :: REPL/Basic.test (898 of 1923)
PASS: lldb-shell :: SymbolFile/Breakpad/line-table-missing-file.test (899 of 1923)
PASS: lldb-unit :: Target/./TargetTests/18/19 (900 of 1923)
PASS: lldb-api :: functionalities/data-formatter/data-formatter-stl/libcxx/function/TestLibCxxFunction.py (901 of 1923)
PASS: lldb-unit :: Core/./LLDBCoreTests/16/22 (902 of 1923)
PASS: lldb-api :: functionalities/tail_call_frames/ambiguous_tail_call_seq2/TestAmbiguousTailCallSeq2.py (903 of 1923)
PASS: lldb-unit :: SymbolFile/DWARF/./SymbolFileDWARFTests/16/29 (904 of 1923)
PASS: lldb-api :: functionalities/object-file/TestImageListMultiArchitecture.py (905 of 1923)
PASS: lldb-unit :: Expression/./ExpressionTests/0/22 (906 of 1923)
PASS: lldb-unit :: ScriptInterpreter/Python/./ScriptInterpreterPythonTests/7/19 (907 of 1923)
PASS: lldb-shell :: ScriptInterpreter/Python/command_import.test (908 of 1923)
PASS: lldb-api :: commands/command/delete/TestCommandDelete.py (909 of 1923)
PASS: lldb-api :: commands/frame/var/TestFrameVar.py (910 of 1923)
PASS: lldb-unit :: Core/./LLDBCoreTests/14/22 (911 of 1923)
PASS: lldb-unit :: Process/gdb-remote/./ProcessGdbRemoteTests/16/19 (912 of 1923)
PASS: lldb-api :: lang/objc/objc-ivar-stripped/TestObjCIvarStripped.py (913 of 1923)
PASS: lldb-api :: functionalities/gdb_remote_client/TestAArch64XMLRegOffsets.py (914 of 1923)
PASS: lldb-api :: sample_test/TestSampleTest.py (915 of 1923)
PASS: lldb-unit :: Language/Highlighting/./HighlighterTests/8/29 (916 of 1923)
PASS: lldb-unit :: Process/gdb-remote/./ProcessGdbRemoteTests/8/19 (917 of 1923)
PASS: lldb-api :: python_api/process/io/TestProcessIO.py (918 of 1923)
PASS: lldb-shell :: ObjectFile/PECOFF/disassemble-thumb.yaml (919 of 1923)
UNSUPPORTED: lldb-shell :: ScriptInterpreter/Lua/breakpoint_oneline_callback.test (920 of 1923)
PASS: lldb-api :: lang/cpp/exceptions/TestCPPExceptionBreakpoints.py (921 of 1923)
UNSUPPORTED: lldb-shell :: Register/x86-db-read.test (922 of 1923)
PASS: lldb-api :: lang/objc/foundation/TestObjCMethodsNSError.py (923 of 1923)
PASS: lldb-api :: lang/objcxx/cpp_keywords_enabled/TestObjCppKeywordsEnabled.py (924 of 1923)
UNSUPPORTED: lldb-shell :: SymbolFile/DWARF/x86/DW_TAG_variable-DW_AT_decl_file-DW_AT_abstract_origin-crosscu1.s (925 of 1923)
PASS: lldb-shell :: SymbolFile/DWARF/x86/childless-compile-unit.s (926 of 1923)
PASS: lldb-api :: functionalities/data-formatter/data-formatter-stl/libcxx/string_view/TestDataFormatterLibcxxStringView.py (927 of 1923)
PASS: lldb-api :: lang/objc/foundation/TestObjCMethods2.py (928 of 1923)
PASS: lldb-api :: commands/expression/completion/TestExprCompletion.py (929 of 1923)
PASS: lldb-api :: python_api/sbvalue_const_addrof/TestSBValueConstAddrOf.py (930 of 1923)
PASS: lldb-api :: iohandler/sigint/TestIOHandlerPythonREPLSigint.py (931 of 1923)
PASS: lldb-api :: functionalities/gdb_remote_client/TestRegDefinitionInParts.py (932 of 1923)
PASS: lldb-api :: lang/cpp/template-specialization-type/TestTemplateSpecializationType.py (933 of 1923)
PASS: lldb-api :: python_api/function_symbol/TestSymbolAPI.py (934 of 1923)
PASS: lldb-shell :: SymbolFile/add-dsym.test (935 of 1923)
PASS: lldb-api :: functionalities/step_scripted/TestStepScripted.py (936 of 1923)
PASS: lldb-api :: commands/command/source/TestCommandSource.py (937 of 1923)
PASS: lldb-api :: functionalities/data-formatter/data-formatter-objc/nsindexpath/TestDataFormatterNSIndexPath.py (938 of 1923)
UNSUPPORTED: lldb-shell :: SymbolFile/NativePDB/load-pdb.cpp (939 of 1923)
PASS: lldb-shell :: Breakpoint/single-file-split-dwarf.test (940 of 1923)
PASS: lldb-unit :: SymbolFile/DWARF/./SymbolFileDWARFTests/6/29 (941 of 1923)
PASS: lldb-unit :: Language/CPlusPlus/./LanguageCPlusPlusTests/4/5 (942 of 1923)
UNSUPPORTED: lldb-api :: benchmarks/frame_variable/TestFrameVariableResponse.py (943 of 1923)
PASS: lldb-api :: functionalities/data-formatter/data-formatter-objc/TestDataFormatterObjCPlain.py (944 of 1923)
PASS: lldb-api :: functionalities/data-formatter/language_category_updates/TestDataFormatterLanguageCategoryUpdates.py (945 of 1923)
PASS: lldb-api :: functionalities/data-formatter/data-formatter-stl/generic/optional/TestDataFormatterGenericOptional.py (946 of 1923)
PASS: lldb-shell :: Unwind/thread-step-out-ret-addr-check.test (947 of 1923)
PASS: lldb-api :: commands/expression/unwind_expression/TestUnwindExpression.py (948 of 1923)
PASS: lldb-shell :: SymbolFile/DWARF/x86/debug_line-tombstone.s (949 of 1923)
PASS: lldb-shell :: Driver/TestUseColor.test (950 of 1923)
PASS: lldb-unit :: Expression/./ExpressionTests/5/22 (951 of 1923)
PASS: lldb-unit :: SymbolFile/DWARF/./SymbolFileDWARFTests/11/29 (952 of 1923)
PASS: lldb-api :: lang/objc/global_ptrs/TestGlobalObjects.py (953 of 1923)
PASS: lldb-unit :: Language/Highlighting/./HighlighterTests/3/29 (954 of 1923)
UNSUPPORTED: lldb-api :: functionalities/ptrauth_diagnostics/LDRAA_error/TestPtrauthLDRAADiagnostic.py (955 of 1923)
PASS: lldb-shell :: ObjectFile/ELF/PT_LOAD-overlap.yaml (956 of 1923)
PASS: lldb-unit :: debugserver/./debugserverTests/0/6 (957 of 1923)
PASS: lldb-shell :: SymbolFile/Breakpad/unwind-via-stack-win-no-memory-info.yaml (958 of 1923)
PASS: lldb-unit :: Process/minidump/./LLDBMinidumpTests/2/17 (959 of 1923)
PASS: lldb-api :: commands/expression/issue_11588/Test11588.py (960 of 1923)
PASS: lldb-api :: commands/expression/import-std-module/unique_ptr/TestUniquePtrFromStdModule.py (961 of 1923)
PASS: lldb-api :: functionalities/data-formatter/data-formatter-smart-array/TestDataFormatterSmartArray.py (962 of 1923)
PASS: lldb-unit :: Symbol/./SymbolTests/12/16 (963 of 1923)
PASS: lldb-unit :: UnwindAssembly/x86/./UnwindAssemblyx86Tests/0/27 (964 of 1923)
PASS: lldb-api :: functionalities/plugins/command_plugin/TestPluginCommands.py (965 of 1923)
PASS: lldb-shell :: Driver/TestError.test (966 of 1923)
PASS: lldb-api :: functionalities/data-formatter/varscript_formatting/TestDataFormatterVarScriptFormatting.py (967 of 1923)
PASS: lldb-unit :: DataFormatter/./LLDBFormatterTests/1/11 (968 of 1923)
PASS: lldb-shell :: Minidump/dump-all.test (969 of 1923)
PASS: lldb-api :: functionalities/gdb_remote_client/TestTargetXMLArch.py (970 of 1923)
PASS: lldb-unit :: Language/Highlighting/./HighlighterTests/23/29 (971 of 1923)
PASS: lldb-shell :: SymbolFile/DWARF/anon_class_w_and_wo_export_symbols.ll (972 of 1923)
PASS: lldb-api :: functionalities/data-formatter/nsdictionarysynth/TestNSDictionarySynthetic.py (973 of 1923)
PASS: lldb-api :: lang/c/strings/TestCStrings.py (974 of 1923)
PASS: lldb-unit :: Expression/./ExpressionTests/15/22 (975 of 1923)
PASS: lldb-unit :: Process/gdb-remote/./ProcessGdbRemoteTests/18/19 (976 of 1923)
PASS: lldb-api :: lang/objc/conflicting-definition/TestConflictingDefinition.py (977 of 1923)
PASS: lldb-api :: lang/cpp/crtp/TestCppCRTP.py (978 of 1923)
PASS: lldb-shell :: SymbolFile/DWARF/x86/debug_rnglists.s (979 of 1923)
PASS: lldb-unit :: UnwindAssembly/x86/./UnwindAssemblyx86Tests/16/27 (980 of 1923)
PASS: lldb-unit :: Editline/./EditlineTests/0/2 (981 of 1923)
XFAIL: lldb-shell :: Register/x86-64-fp-write.test (982 of 1923)
PASS: lldb-shell :: Register/Core/x86-64-linux-gp.test (983 of 1923)
PASS: lldb-unit :: Platform/./LLDBPlatformTests/13/16 (984 of 1923)
PASS: lldb-api :: functionalities/data-formatter/data-formatter-objc/TestDataFormatterObjCNSBundle.py (985 of 1923)
PASS: lldb-shell :: Register/Core/x86-32-linux-addr.test (986 of 1923)
PASS: lldb-api :: functionalities/breakpoint/address_breakpoints/TestAddressBreakpoints.py (987 of 1923)
PASS: lldb-api :: lang/cpp/gmodules-templates/TestGModules.py (988 of 1923)
PASS: lldb-api :: functionalities/data-formatter/data-formatter-stl/libcxx/unique_ptr/TestDataFormatterLibcxxUniquePtr.py (989 of 1923)
PASS: lldb-api :: lang/objc/objc-dyn-sbtype/TestObjCDynamicSBType.py (990 of 1923)
PASS: lldb-unit :: Core/./LLDBCoreTests/20/22 (991 of 1923)
UNSUPPORTED: lldb-shell :: SymbolFile/DWARF/x86/win-i386-line-table.s (992 of 1923)
PASS: lldb-shell :: Driver/TestNoUseColor.test (993 of 1923)
PASS: lldb-unit :: Core/./LLDBCoreTests/8/22 (994 of 1923)
PASS: lldb-unit :: SymbolFile/DWARF/./SymbolFileDWARFTests/27/29 (995 of 1923)
UNSUPPORTED: lldb-api :: commands/trace/TestTraceEvents.py (996 of 1923)
PASS: lldb-unit :: Utility/./UtilityTests/25/30 (997 of 1923)
PASS: lldb-unit :: ScriptInterpreter/Python/./ScriptInterpreterPythonTests/9/19 (998 of 1923)
PASS: lldb-unit :: ScriptInterpreter/Python/./ScriptInterpreterPythonTests/3/19 (999 of 1923)
PASS: lldb-api :: lang/cpp/bitfields/TestCppBitfields.py (1000 of 1923)
PASS: lldb-api :: macosx/builtin-debugtrap/TestBuiltinDebugTrap.py (1001 of 1923)
PASS: lldb-api :: lang/objc/radar-9691614/TestObjCMethodReturningBOOL.py (1002 of 1923)
PASS: lldb-api :: macosx/unregistered-macho/TestUnregisteredMacho.py (1003 of 1923)
PASS: lldb-api :: functionalities/float-display/TestFloatDisplay.py (1004 of 1923)
PASS: lldb-api :: lang/cpp/accelerator-table/TestCPPAccelerator.py (1005 of 1923)
PASS: lldb-api :: lang/cpp/member-and-local-vars-with-same-name/TestMembersAndLocalsWithSameName.py (1006 of 1923)
PASS: lldb-api :: commands/expression/class_template_specialization_empty_pack/TestClassTemplateSpecializationParametersHandling.py (1007 of 1923)
UNSUPPORTED: lldb-shell :: Unwind/eh-frame-augment-noop.test (1008 of 1923)
PASS: lldb-shell :: Reproducer/Modules/TestModuleCXX.test (1009 of 1923)
PASS: lldb-api :: tools/lldb-vscode/breakpoint/TestVSCode_setFunctionBreakpoints.py (1010 of 1923)
UNSUPPORTED: lldb-shell :: SymbolFile/DWARF/x86/find-basic-function.cpp (1011 of 1923)
PASS: lldb-api :: commands/breakpoint/command/list/TestBreakpointCommandList.py (1012 of 1923)
UNSUPPORTED: lldb-api :: macosx/lc-note/addrable-bits/TestAddrableBitsCorefile.py (1013 of 1923)
PASS: lldb-api :: commands/command/script/TestCommandScript.py (1014 of 1923)
PASS: lldb-shell :: SymbolFile/Breakpad/unwind-via-stack-win.test (1015 of 1923)
UNSUPPORTED: lldb-api :: functionalities/thread/concurrent_events/TestConcurrentDelayedCrashWithBreakpointWatchpoint.py (1016 of 1923)
PASS: lldb-shell :: SymbolFile/DWARF/x86/debug_loc_and_loclists.s (1017 of 1923)
PASS: lldb-shell :: Breakpoint/invalid-condition.test (1018 of 1923)
PASS: lldb-unit :: Target/./TargetTests/14/19 (1019 of 1923)
PASS: lldb-api :: functionalities/thread/concurrent_events/TestConcurrentManyCrash.py (1020 of 1923)
PASS: lldb-api :: functionalities/breakpoint/address_breakpoints/TestBadAddressBreakpoints.py (1021 of 1923)
PASS: lldb-unit :: ScriptInterpreter/Python/./ScriptInterpreterPythonTests/18/19 (1022 of 1923)
PASS: lldb-api :: lang/cpp/global_variables/TestCPPGlobalVariables.py (1023 of 1923)
PASS: lldb-shell :: Subprocess/fork-follow-parent-wp.test (1024 of 1923)
UNSUPPORTED: lldb-shell :: ScriptInterpreter/Lua/fail_breakpoint_oneline.test (1025 of 1923)
UNSUPPORTED: lldb-api :: functionalities/tsan/thread_numbers/TestTsanThreadNumbers.py (1026 of 1923)
PASS: lldb-api :: tools/lldb-vscode/console/TestVSCode_console.py (1027 of 1923)
PASS: lldb-unit :: Utility/./UtilityTests/12/30 (1028 of 1923)
PASS: lldb-api :: macosx/DBGSourcePathRemapping/TestDSYMSourcePathRemapping.py (1029 of 1923)
PASS: lldb-api :: functionalities/data-formatter/dump_dynamic/TestDumpDynamic.py (1030 of 1923)
PASS: lldb-api :: functionalities/gdb_remote_client/TestWasm.py (1031 of 1923)
PASS: lldb-api :: functionalities/data-formatter/data-formatter-proper-plurals/TestFormattersOneIsSingular.py (1032 of 1923)
PASS: lldb-unit :: Expression/./ExpressionTests/10/22 (1033 of 1923)
UNSUPPORTED: lldb-api :: functionalities/thread/concurrent_events/TestConcurrentSignalNWatchNBreak.py (1034 of 1923)
PASS: lldb-api :: commands/statistics/basic/TestStats.py (1035 of 1923)
UNSUPPORTED: lldb-shell :: Register/x86-ymm-write.test (1036 of 1923)
UNSUPPORTED: lldb-shell :: SymbolFile/PDB/pointers.test (1037 of 1923)
UNSUPPORTED: lldb-api :: functionalities/thread/concurrent_events/TestConcurrentWatchBreakDelay.py (1038 of 1923)
UNSUPPORTED: lldb-api :: lang/cpp/gmodules/TestWithModuleDebugging.py (1039 of 1923)
PASS: lldb-api :: commands/target/auto-install-main-executable/TestAutoInstallMainExecutable.py (1040 of 1923)
PASS: lldb-unit :: UnwindAssembly/x86/./UnwindAssemblyx86Tests/17/27 (1041 of 1923)
PASS: lldb-api :: lang/objc/objc-optimized/TestObjcOptimized.py (1042 of 1923)
PASS: lldb-api :: commands/expression/dont_allow_jit/TestAllowJIT.py (1043 of 1923)
PASS: lldb-api :: macosx/universal/TestUniversal.py (1044 of 1923)
PASS: lldb-api :: commands/expression/import-std-module/shared_ptr/TestSharedPtrFromStdModule.py (1045 of 1923)
UNSUPPORTED: lldb-api :: commands/expression/completion-crash-invalid-iterator/TestInvalidIteratorCompletionCrash.py (1046 of 1923)
PASS: lldb-api :: python_api/sbenvironment/TestSBEnvironment.py (1047 of 1923)
PASS: lldb-shell :: SymbolFile/DWARF/x86/dwarf5-implicit-const.s (1048 of 1923)
PASS: lldb-api :: lang/cpp/enum_types/TestCPP11EnumTypes.py (1049 of 1923)
PASS: lldb-api :: macosx/debugserver-exit-code/TestDebugServerExitCode.py (1050 of 1923)
PASS: lldb-unit :: SymbolFile/DWARF/./SymbolFileDWARFTests/0/29 (1051 of 1923)
PASS: lldb-api :: sanity/TestModuleCacheSanity.py (1052 of 1923)
UNSUPPORTED: lldb-api :: lang/cpp/breakpoint_in_member_func_w_non_primitive_params/TestBreakpointInMemberFuncWNonPrimitiveParams.py (1053 of 1923)
PASS: lldb-api :: commands/expression/import_base_class_when_class_has_derived_member/TestImportBaseClassWhenClassHasDerivedMember.py (1054 of 1923)
PASS: lldb-unit :: Process/minidump/./LLDBMinidumpTests/15/17 (1055 of 1923)
PASS: lldb-api :: functionalities/progress_reporting/TestTrimmedProgressReporting.py (1056 of 1923)
PASS: lldb-unit :: Platform/./LLDBPlatformTests/11/16 (1057 of 1923)
PASS: lldb-api :: commands/frame/diagnose/dereference-this/TestDiagnoseDereferenceThis.py (1058 of 1923)
PASS: lldb-unit :: Process/Utility/./ProcessUtilityTests/6/16 (1059 of 1923)
PASS: lldb-api :: functionalities/tail_call_frames/cross_dso/TestCrossDSOTailCalls.py (1060 of 1923)
PASS: lldb-shell :: BuildScript/script-args.test (1061 of 1923)
UNSUPPORTED: lldb-api :: tools/lldb-server/memory-tagging/TestGdbRemoteMemoryTagging.py (1062 of 1923)
PASS: lldb-shell :: SymbolFile/Breakpad/line-table.test (1063 of 1923)
PASS: lldb-unit :: Interpreter/./InterpreterTests/11/14 (1064 of 1923)
PASS: lldb-shell :: SymbolFile/DWARF/x86/DW_AT_const_value-bitfields.s (1065 of 1923)
UNSUPPORTED: lldb-api :: lang/objc/modules-update/TestClangModulesUpdate.py (1066 of 1923)
PASS: lldb-unit :: Expression/./ExpressionTests/18/22 (1067 of 1923)
PASS: lldb-api :: functionalities/data-formatter/data-formatter-objc/TestDataFormatterObjCNSDate.py (1068 of 1923)
PASS: lldb-unit :: Interpreter/./InterpreterTests/12/14 (1069 of 1923)
PASS: lldb-api :: commands/gui/invalid-args/TestInvalidArgsGui.py (1070 of 1923)
PASS: lldb-unit :: Platform/./LLDBPlatformTests/12/16 (1071 of 1923)
PASS: lldb-api :: functionalities/gdb_remote_client/TestStopPCs.py (1072 of 1923)
PASS: lldb-unit :: Signals/./SignalsTests/2/5 (1073 of 1923)
UNSUPPORTED: lldb-shell :: ObjectFile/PECOFF/dep-modules.yaml (1074 of 1923)
PASS: lldb-api :: functionalities/data-formatter/stringprinter/TestStringPrinter.py (1075 of 1923)
PASS: lldb-unit :: Process/gdb-remote/./ProcessGdbRemoteTests/6/19 (1076 of 1923)
UNSUPPORTED: lldb-api :: functionalities/breakpoint/hardware_breakpoints/hardware_breakpoint_on_multiple_threads/TestHWBreakMultiThread.py (1077 of 1923)
PASS: lldb-api :: functionalities/process_group/TestChangeProcessGroup.py (1078 of 1923)
UNSUPPORTED: lldb-shell :: SymbolFile/NativePDB/ast-methods.cpp (1079 of 1923)
UNSUPPORTED: lldb-api :: functionalities/data-formatter/data-formatter-stl/libstdcpp/iterator/TestDataFormatterStdIterator.py (1080 of 1923)
PASS: lldb-shell :: Quit/TestQuitExitCodeHexA.test (1081 of 1923)
PASS: lldb-api :: commands/expression/import-std-module/unique_ptr-dbg-info-content/TestUniquePtrDbgInfoContent.py (1082 of 1923)
PASS: lldb-unit :: DataFormatter/./LLDBFormatterTests/8/11 (1083 of 1923)
UNSUPPORTED: lldb-shell :: SymbolFile/NativePDB/bitfields.cpp (1084 of 1923)
PASS: lldb-api :: functionalities/breakpoint/scripted_bkpt/TestScriptedResolver.py (1085 of 1923)
PASS: lldb-unit :: SymbolFile/DWARF/./SymbolFileDWARFTests/28/29 (1086 of 1923)
PASS: lldb-unit :: Interpreter/./InterpreterTests/5/14 (1087 of 1923)
PASS: lldb-api :: types/TestIntegerType.py (1088 of 1923)
UNSUPPORTED: lldb-shell :: SymbolFile/DWARF/x86/debug-line-basic.s (1089 of 1923)
PASS: lldb-unit :: ScriptInterpreter/Python/./ScriptInterpreterPythonTests/15/19 (1090 of 1923)
PASS: lldb-unit :: Language/CPlusPlus/./LanguageCPlusPlusTests/0/5 (1091 of 1923)
PASS: lldb-api :: commands/expression/diagnostics/TestExprDiagnostics.py (1092 of 1923)
UNSUPPORTED: lldb-api :: commands/expression/import-std-module/pair/TestPairFromStdModule.py (1093 of 1923)
UNSUPPORTED: lldb-api :: commands/watchpoints/watchpoint_count/TestWatchpointCount.py (1094 of 1923)
PASS: lldb-api :: functionalities/data-formatter/data-formatter-stl/libstdcpp/unique_ptr/invalid/TestDataFormatterInvalidStdUniquePtr.py (1095 of 1923)
PASS: lldb-unit :: SymbolFile/NativePDB/./SymbolFileNativePDBTests/8/15 (1096 of 1923)
PASS: lldb-api :: tools/lldb-vscode/breakpoint/TestVSCode_setExceptionBreakpoints.py (1097 of 1923)
PASS: lldb-api :: tools/lldb-vscode/coreFile/TestVSCode_coreFile.py (1098 of 1923)
PASS: lldb-unit :: UnwindAssembly/x86/./UnwindAssemblyx86Tests/12/27 (1099 of 1923)
PASS: lldb-shell :: SymbolFile/DWARF/x86/DW_AT_const_value.s (1100 of 1923)
PASS: lldb-api :: functionalities/breakpoint/breakpoint_options/TestBreakpointOptions.py (1101 of 1923)
UNSUPPORTED: lldb-api :: functionalities/ubsan/basic/TestUbsanBasic.py (1102 of 1923)
PASS: lldb-api :: functionalities/reproducers/attach/TestReproducerAttach.py (1103 of 1923)
PASS: lldb-shell :: Reproducer/TestFileRepro.test (1104 of 1923)
PASS: lldb-api :: commands/command/nested_alias/TestNestedAlias.py (1105 of 1923)
PASS: lldb-api :: lang/cpp/class_types/TestClassTypes.py (1106 of 1923)
PASS: lldb-api :: functionalities/paths/TestPaths.py (1107 of 1923)
UNSUPPORTED: lldb-api :: commands/trace/TestTraceDumpInstructions.py (1108 of 1923)
PASS: lldb-api :: functionalities/target_var/no_vars/TestTargetVarNoVars.py (1109 of 1923)
PASS: lldb-api :: lang/c/conflicting-symbol/TestConflictingSymbol.py (1110 of 1923)
PASS: lldb-shell :: SymbolFile/DWARF/x86/split-dwarf-multiple-cu.ll (1111 of 1923)
UNSUPPORTED: lldb-api :: functionalities/ptrauth_diagnostics/brkC47x_code/TestPtrauthBRKc47xDiagnostic.py (1112 of 1923)
PASS: lldb-unit :: Process/Utility/./ProcessUtilityTests/9/16 (1113 of 1923)
PASS: lldb-api :: python_api/debugger/TestDebuggerAPI.py (1114 of 1923)
PASS: lldb-api :: commands/frame/diagnose/complicated-expression/TestComplicatedExpression.py (1115 of 1923)
PASS: lldb-unit :: Core/./LLDBCoreTests/21/22 (1116 of 1923)
PASS: lldb-api :: functionalities/breakpoint/cpp_exception/TestCPPExceptionBreakpoint.py (1117 of 1923)
PASS: lldb-shell :: Host/TestCustomShell.test (1118 of 1923)
PASS: lldb-api :: commands/expression/weak_symbols/TestWeakSymbols.py (1119 of 1923)
UNSUPPORTED: lldb-shell :: SymbolFile/DWARF/x86/debug-names-compressed.cpp (1120 of 1923)
PASS: lldb-shell :: ObjectFile/PECOFF/basic-info-arm64.yaml (1121 of 1923)
PASS: lldb-api :: commands/settings/use_source_cache/TestUseSourceCache.py (1122 of 1923)
UNSUPPORTED: lldb-api :: commands/expression/macros/TestMacros.py (1123 of 1923)
PASS: lldb-unit :: SymbolFile/NativePDB/./SymbolFileNativePDBTests/6/15 (1124 of 1923)
PASS: lldb-shell :: Driver/TestFile.test (1125 of 1923)
PASS: lldb-api :: lang/c/step-target/TestStepTarget.py (1126 of 1923)
UNSUPPORTED: lldb-api :: tools/lldb-server/vCont-threads/TestPartialResume.py (1127 of 1923)
PASS: lldb-api :: lang/cpp/template/TestTemplateArgs.py (1128 of 1923)
UNSUPPORTED: lldb-api :: commands/trace/TestTraceStartStop.py (1129 of 1923)
PASS: lldb-api :: commands/expression/fixits/TestFixIts.py (1130 of 1923)
PASS: lldb-unit :: Target/./TargetTests/1/19 (1131 of 1923)
PASS: lldb-shell :: Commands/command-source.test (1132 of 1923)
UNSUPPORTED: lldb-shell :: SymbolFile/DWARF/x86/find-method.cpp (1133 of 1923)
UNSUPPORTED: lldb-api :: functionalities/breakpoint/breakpoint_in_delayslot/TestAvoidBreakpointInDelaySlot.py (1134 of 1923)
PASS: lldb-shell :: ScriptInterpreter/Python/Crashlog/parser_json.test (1135 of 1923)
PASS: lldb-unit :: Interpreter/./InterpreterTests/3/14 (1136 of 1923)
PASS: lldb-unit :: SymbolFile/DWARF/./SymbolFileDWARFTests/10/29 (1137 of 1923)
PASS: lldb-shell :: Register/Core/x86-64-netbsd-multithread.test (1138 of 1923)
PASS: lldb-unit :: Utility/./UtilityTests/21/30 (1139 of 1923)
PASS: lldb-api :: types/TestFloatTypesExpr.py (1140 of 1923)
PASS: lldb-api :: linux/aarch64/mte_core_file/TestAArch64LinuxMTEMemoryTagCoreFile.py (1141 of 1923)
PASS: lldb-api :: python_api/process/TestProcessAPI.py (1142 of 1923)
PASS: lldb-api :: functionalities/rerun/TestRerun.py (1143 of 1923)
PASS: lldb-api :: python_api/lldbutil/TestSwigVersion.py (1144 of 1923)
PASS: lldb-api :: functionalities/tail_call_frames/inlining_and_tail_calls/TestInliningAndTailCalls.py (1145 of 1923)
PASS: lldb-unit :: ScriptInterpreter/Python/./ScriptInterpreterPythonTests/10/19 (1146 of 1923)
UNSUPPORTED: lldb-api :: tools/lldb-server/TestGdbRemoteAuxvSupport.py (1147 of 1923)
PASS: lldb-api :: functionalities/thread/concurrent_events/TestConcurrentTwoBreakpointsOneSignal.py (1148 of 1923)
PASS: lldb-unit :: Expression/./ExpressionTests/12/22 (1149 of 1923)
PASS: lldb-api :: functionalities/breakpoint/global_constructor/TestBreakpointInGlobalConstructor.py (1150 of 1923)
PASS: lldb-api :: functionalities/data-formatter/nsarraysynth/TestNSArraySynthetic.py (1151 of 1923)
PASS: lldb-unit :: ObjectFile/Breakpad/./ObjectFileBreakpadTests/8/11 (1152 of 1923)
PASS: lldb-api :: functionalities/wrong_commands/TestWrongCommands.py (1153 of 1923)
UNSUPPORTED: lldb-api :: lang/cpp/structured-binding/TestStructuredBinding.py (1154 of 1923)
PASS: lldb-unit :: Utility/./UtilityTests/19/30 (1155 of 1923)
PASS: lldb-api :: functionalities/gdb_remote_client/TestArmRegisterDefinition.py (1156 of 1923)
PASS: lldb-api :: lang/cpp/namespace_definitions/TestNamespaceDefinitions.py (1157 of 1923)
PASS: lldb-unit :: Instruction/./EmulatorTests/0/1 (1158 of 1923)
PASS: lldb-api :: functionalities/gdb_remote_client/TestQemuAArch64TargetXml.py (1159 of 1923)
PASS: lldb-shell :: Minidump/memory-region-from-module.yaml (1160 of 1923)
PASS: lldb-api :: commands/expression/codegen-crash-import-def-arraytype-element/TestImportDefinitionArrayType.py (1161 of 1923)
PASS: lldb-api :: iohandler/stdio/TestIOHandlerProcessSTDIO.py (1162 of 1923)
PASS: lldb-unit :: Process/Utility/./ProcessUtilityTests/10/16 (1163 of 1923)
PASS: lldb-unit :: SymbolFile/DWARF/./SymbolFileDWARFTests/23/29 (1164 of 1923)
PASS: lldb-unit :: UnwindAssembly/x86/./UnwindAssemblyx86Tests/5/27 (1165 of 1923)
PASS: lldb-api :: functionalities/thread/concurrent_events/TestConcurrentBreakpointOneDelayBreakpointThreads.py (1166 of 1923)
UNSUPPORTED: lldb-shell :: SymbolFile/PDB/compilands.test (1167 of 1923)
PASS: lldb-api :: commands/memory/write/TestMemoryWrite.py (1168 of 1923)
PASS: lldb-api :: tools/lldb-vscode/correct-thread/TestVSCode_correct_thread.py (1169 of 1923)
PASS: lldb-api :: functionalities/stats_api/TestStatisticsAPI.py (1170 of 1923)
PASS: lldb-unit :: API/./APITests/1/3 (1171 of 1923)
PASS: lldb-api :: functionalities/inferior-crashing/recursive-inferior/TestRecursiveInferior.py (1172 of 1923)
PASS: lldb-shell :: Heap/heap-cstr.test (1173 of 1923)
PASS: lldb-api :: commands/frame/diagnose/dereference-argument/TestDiagnoseDereferenceArgument.py (1174 of 1923)
PASS: lldb-api :: lang/objc/objc-baseclass-sbtype/TestObjCBaseClassSBType.py (1175 of 1923)
PASS: lldb-unit :: Signals/./SignalsTests/1/5 (1176 of 1923)
PASS: lldb-api :: functionalities/signal/raise/TestRaise.py (1177 of 1923)
PASS: lldb-unit :: Language/Highlighting/./HighlighterTests/20/29 (1178 of 1923)
UNSUPPORTED: lldb-api :: tools/lldb-server/TestGdbRemoteAttach.py (1179 of 1923)
PASS: lldb-unit :: SymbolFile/DWARF/./SymbolFileDWARFTests/20/29 (1180 of 1923)
PASS: lldb-api :: functionalities/thread/backtrace_limit/TestBacktraceLimit.py (1181 of 1923)
UNSUPPORTED: lldb-shell :: SymbolFile/NativePDB/break-by-function.cpp (1182 of 1923)
UNSUPPORTED: lldb-shell :: Register/arm-gp-read.test (1183 of 1923)
PASS: lldb-unit :: DataFormatter/./LLDBFormatterTests/9/11 (1184 of 1923)
PASS: lldb-unit :: Platform/./LLDBPlatformTests/6/16 (1185 of 1923)
UNSUPPORTED: lldb-api :: functionalities/thread/create_during_step/TestCreateDuringStep.py (1186 of 1923)
UNSUPPORTED: lldb-shell :: ScriptInterpreter/Lua/print.test (1187 of 1923)
PASS: lldb-shell :: Settings/TestLineMarkerColor.test (1188 of 1923)
UNSUPPORTED: lldb-api :: functionalities/thread/concurrent_events/TestConcurrentWatchpointDelayWatchpointOneBreakpoint.py (1189 of 1923)
UNSUPPORTED: lldb-shell :: SymbolFile/DWARF/x86/debug_ranges_and_rnglists.test (1190 of 1923)
PASS: lldb-api :: functionalities/data-formatter/array_typedef/TestArrayTypedef.py (1191 of 1923)
PASS: lldb-api :: functionalities/postmortem/mach-core/TestMachCore.py (1192 of 1923)
PASS: lldb-shell :: SymbolFile/Breakpad/symtab-macho.test (1193 of 1923)
UNSUPPORTED: lldb-shell :: SymbolFile/DWARF/dwarf5-lazy-dwo.c (1194 of 1923)
PASS: lldb-api :: lang/c/complex/TestComplexC99.py (1195 of 1923)
PASS: lldb-shell :: Commands/CommandScriptImmediateOutput/CommandScriptImmediateOutputFile.test (1196 of 1923)
PASS: lldb-api :: commands/expression/call-function/TestCallStdStringFunction.py (1197 of 1923)
PASS: lldb-unit :: ObjectFile/Breakpad/./ObjectFileBreakpadTests/9/11 (1198 of 1923)
UNSUPPORTED: lldb-api :: commands/trace/multiple-threads/TestTraceStartStopMultipleThreads.py (1199 of 1923)
PASS: lldb-api :: commands/expression/persistent_variables/TestPersistentVariables.py (1200 of 1923)
PASS: lldb-api :: types/TestCharType.py (1201 of 1923)
PASS: lldb-api :: functionalities/tail_call_frames/unambiguous_sequence/TestUnambiguousTailCalls.py (1202 of 1923)
PASS: lldb-shell :: SymbolFile/Breakpad/line-table-mixed-path-styles.test (1203 of 1923)
PASS: lldb-api :: repl/clang/TestClangREPL.py (1204 of 1923)
PASS: lldb-shell :: ObjectFile/ELF/aarch64-relocations.yaml (1205 of 1923)
PASS: lldb-unit :: Host/./HostTests/7/19 (1206 of 1923)
PASS: lldb-api :: functionalities/load_lazy/TestLoadUsingLazyBind.py (1207 of 1923)
UNSUPPORTED: lldb-shell :: ScriptInterpreter/Lua/bindings.test (1208 of 1923)
PASS: lldb-api :: functionalities/scripted_process/TestStackCoreScriptedProcess.py (1209 of 1923)
PASS: lldb-unit :: ObjectFile/Breakpad/./ObjectFileBreakpadTests/1/11 (1210 of 1923)
PASS: lldb-api :: commands/expression/entry-bp/TestExprEntryBP.py (1211 of 1923)
PASS: lldb-api :: functionalities/memory/tag/TestMemoryTag.py (1212 of 1923)
PASS: lldb-unit :: Process/gdb-remote/./ProcessGdbRemoteTests/14/19 (1213 of 1923)
PASS: lldb-api :: functionalities/data-formatter/data-formatter-synthval/TestDataFormatterSynthVal.py (1214 of 1923)
PASS: lldb-api :: commands/process/attach/TestProcessAttach.py (1215 of 1923)
PASS: lldb-api :: functionalities/data-formatter/data-formatter-stl/generic/multiset/TestDataFormatterGenericMultiSet.py (1216 of 1923)
PASS: lldb-api :: python_api/interpreter/TestRunCommandInterpreterAPI.py (1217 of 1923)
PASS: lldb-api :: lang/objc/modules-objc-property/TestModulesObjCProperty.py (1218 of 1923)
PASS: lldb-api :: commands/expression/ir-interpreter-phi-nodes/TestIRInterpreterPHINodes.py (1219 of 1923)
PASS: lldb-api :: macosx/nslog/TestDarwinNSLogOutput.py (1220 of 1923)
UNSUPPORTED: lldb-api :: commands/expression/import_builtin_fileid/TestImportBuiltinFileID.py (1221 of 1923)
PASS: lldb-unit :: SymbolFile/NativePDB/./SymbolFileNativePDBTests/12/15 (1222 of 1923)
PASS: lldb-api :: commands/expression/function_template_specialization_temp_args/TestFunctionTemplateSpecializationTempArgs.py (1223 of 1923)
PASS: lldb-api :: lang/c/builtin-types/TestCBuiltinTypes.py (1224 of 1923)
UNSUPPORTED: lldb-api :: functionalities/breakpoint/hardware_breakpoints/write_memory_with_hw_breakpoint/TestWriteMemoryWithHWBreakpoint.py (1225 of 1923)
PASS: lldb-api :: commands/register/register/register_command/TestRegisters.py (1226 of 1923)
PASS: lldb-api :: types/TestIntegerTypeExpr.py (1227 of 1923)
PASS: lldb-api :: commands/process/handle/TestProcessHandle.py (1228 of 1923)
PASS: lldb-shell :: ScriptInterpreter/Python/Crashlog/no-args.test (1229 of 1923)
UNSUPPORTED: lldb-api :: commands/watchpoints/watchpoint_size/TestWatchpointSizes.py (1230 of 1923)
PASS: lldb-api :: functionalities/data-formatter/parray/TestPrintArray.py (1231 of 1923)
UNSUPPORTED: lldb-api :: linux/add-symbols/TestTargetSymbolsAddCommand.py (1232 of 1923)
UNSUPPORTED: lldb-api :: tools/lldb-vscode/disconnect/TestVSCode_disconnect.py (1233 of 1923)
PASS: lldb-api :: functionalities/memory-region/TestMemoryRegion.py (1234 of 1923)
PASS: lldb-api :: lang/cpp/incomplete-types/members/TestCppIncompleteTypeMembers.py (1235 of 1923)
PASS: lldb-api :: tools/lldb-vscode/module/TestVSCode_module.py (1236 of 1923)
PASS: lldb-shell :: Settings/TestFrameFormatColor.test (1237 of 1923)
PASS: lldb-unit :: SymbolFile/NativePDB/./SymbolFileNativePDBTests/1/15 (1238 of 1923)
PASS: lldb-api :: commands/expression/inline-namespace/TestInlineNamespace.py (1239 of 1923)
PASS: lldb-shell :: SymbolFile/DWARF/x86/debug_loc-aslr.s (1240 of 1923)
PASS: lldb-api :: lang/objc/bitfield_ivars/TestBitfieldIvars.py (1241 of 1923)
PASS: lldb-api :: api/check_public_api_headers/TestPublicAPIHeaders.py (1242 of 1923)
PASS: lldb-api :: lang/cpp/lambdas/TestLambdas.py (1243 of 1923)
PASS: lldb-api :: functionalities/thread/jump/TestThreadJump.py (1244 of 1923)
UNSUPPORTED: lldb-api :: benchmarks/continue/TestBenchmarkContinue.py (1245 of 1923)
PASS: lldb-api :: python_api/formatters/TestFormattersSBAPI.py (1246 of 1923)
PASS: lldb-unit :: Language/Highlighting/./HighlighterTests/11/29 (1247 of 1923)
PASS: lldb-shell :: SymbolFile/DWARF/x86/debug_line-relative_path.s (1248 of 1923)
PASS: lldb-shell :: Register/Core/x86-32-netbsd-gp.test (1249 of 1923)
UNSUPPORTED: lldb-api :: tools/lldb-server/registers-target-xml-reading/TestGdbRemoteTargetXmlPacket.py (1250 of 1923)
PASS: lldb-api :: lang/cpp/alignas_base_class/TestAlignAsBaseClass.py (1251 of 1923)
PASS: lldb-api :: functionalities/data-formatter/data-formatter-objc/TestDataFormatterObjCNSContainer.py (1252 of 1923)
PASS: lldb-api :: lang/cpp/this/TestCPPThis.py (1253 of 1923)
PASS: lldb-api :: lang/c/unions/TestUnionMembers.py (1254 of 1923)
UNSUPPORTED: lldb-api :: functionalities/thread/main_thread_exit/TestMainThreadExit.py (1255 of 1923)
PASS: lldb-api :: commands/expression/import-std-module/non-module-type-separation/TestNonModuleTypeSeparation.py (1256 of 1923)
UNSUPPORTED: lldb-api :: commands/watchpoints/step_over_watchpoint/TestStepOverWatchpoint.py (1257 of 1923)
UNSUPPORTED: lldb-shell :: ScriptInterpreter/Lua/breakpoint_callback.test (1258 of 1923)
PASS: lldb-unit :: Language/CLanguages/./LanguageCLanguagesTests/0/1 (1259 of 1923)
PASS: lldb-shell :: SymbolFile/absolute-symbol.test (1260 of 1923)
PASS: lldb-api :: commands/frame/diagnose/local-variable/TestLocalVariable.py (1261 of 1923)
PASS: lldb-unit :: Utility/./UtilityTests/6/30 (1262 of 1923)
UNSUPPORTED: lldb-api :: lang/c/typedef/Testtypedef.py (1263 of 1923)
PASS: lldb-api :: commands/frame/language/TestGuessLanguage.py (1264 of 1923)
UNSUPPORTED: lldb-api :: commands/platform/connect/TestPlatformConnect.py (1265 of 1923)
PASS: lldb-api :: commands/target/basic/TestTargetCommand.py (1266 of 1923)
PASS: lldb-api :: python_api/lldbutil/frame/TestFrameUtils.py (1267 of 1923)
UNSUPPORTED: lldb-api :: commands/watchpoints/variable_out_of_scope/TestWatchedVarHitWhenInScope.py (1268 of 1923)
PASS: lldb-api :: functionalities/data-formatter/data-formatter-objc/TestDataFormatterObjCNSError.py (1269 of 1923)
PASS: lldb-api :: commands/expression/cast_int_to_anonymous_enum/TestCastIntToAnonymousEnum.py (1270 of 1923)
UNSUPPORTED: lldb-api :: functionalities/data-formatter/data-formatter-stl/libstdcpp/tuple/TestDataFormatterStdTuple.py (1271 of 1923)
PASS: lldb-api :: functionalities/tail_call_frames/disambiguate_call_site/TestDisambiguateCallSite.py (1272 of 1923)
PASS: lldb-api :: lang/c/shared_lib_stripped_symbols/TestSharedLibStrippedSymbols.py (1273 of 1923)
UNSUPPORTED: lldb-api :: linux/sepdebugsymlink/TestTargetSymbolsSepDebugSymlink.py (1274 of 1923)
PASS: lldb-api :: commands/memory/read/TestMemoryRead.py (1275 of 1923)
PASS: lldb-unit :: Process/minidump/./LLDBMinidumpTests/10/17 (1276 of 1923)
UNSUPPORTED: lldb-api :: tools/lldb-server/TestGdbRemoteExitCode.py (1277 of 1923)
UNSUPPORTED: lldb-api :: tools/lldb-server/TestGdbRemotePlatformFile.py (1278 of 1923)
PASS: lldb-unit :: Platform/./LLDBPlatformTests/5/16 (1279 of 1923)
UNSUPPORTED: lldb-api :: tools/lldb-server/TestGdbRemoteForkNonStop.py (1280 of 1923)
PASS: lldb-unit :: SymbolFile/NativePDB/./SymbolFileNativePDBTests/10/15 (1281 of 1923)
PASS: lldb-unit :: Expression/./ExpressionTests/19/22 (1282 of 1923)
PASS: lldb-unit :: Utility/./UtilityTests/8/30 (1283 of 1923)
PASS: lldb-api :: test_utils/TestInlineTest.py (1284 of 1923)
PASS: lldb-api :: functionalities/breakpoint/breakpoint_ignore_count/TestBreakpointIgnoreCount.py (1285 of 1923)
PASS: lldb-shell :: SymbolFile/DWARF/x86/parallel-indexing-stress.s (1286 of 1923)
PASS: lldb-api :: symbol_ondemand/breakpoint_language/TestBreakpointLanguageOnDemand.py (1287 of 1923)
PASS: lldb-api :: lang/cpp/pointer_to_member_type_depending_on_parent_size/TestPointerToMemberTypeDependingOnParentSize.py (1288 of 1923)
PASS: lldb-unit :: Host/./HostTests/16/19 (1289 of 1923)
PASS: lldb-unit :: Symbol/./SymbolTests/8/16 (1290 of 1923)
PASS: lldb-api :: functionalities/data-formatter/data-formatter-stl/generic/unordered/TestDataFormatterGenericUnordered.py (1291 of 1923)
PASS: lldb-api :: functionalities/breakpoint/breakpoint_conditions/TestBreakpointConditions.py (1292 of 1923)
UNSUPPORTED: lldb-api :: functionalities/thread/concurrent_events/TestConcurrentWatchBreak.py (1293 of 1923)
PASS: lldb-shell :: ObjectFile/ELF/PT_LOAD-overlap-section.yaml (1294 of 1923)
PASS: lldb-api :: functionalities/data-formatter/nssetsynth/TestNSSetSynthetic.py (1295 of 1923)
PASS: lldb-api :: commands/expression/import-std-module/weak_ptr-dbg-info-content/TestDbgInfoContentWeakPtrFromStdModule.py (1296 of 1923)
UNSUPPORTED: lldb-api :: functionalities/thread/concurrent_events/TestConcurrentBreakpointsDelayedBreakpointOneWatchpoint.py (1297 of 1923)
PASS: lldb-api :: lang/objc/objc-foundation-dictionary-empty/TestNSDictionary0.py (1298 of 1923)
PASS: lldb-api :: functionalities/launch_stop_at_entry/TestStopAtEntry.py (1299 of 1923)
PASS: lldb-unit :: debugserver/./debugserverTests/1/6 (1300 of 1923)
XFAIL: lldb-shell :: Register/x86-fp-write.test (1301 of 1923)
PASS: lldb-unit :: Language/Highlighting/./HighlighterTests/21/29 (1302 of 1923)
PASS: lldb-shell :: Settings/TestDisableColor.test (1303 of 1923)
PASS: lldb-unit :: DataFormatter/./LLDBFormatterTests/6/11 (1304 of 1923)
UNSUPPORTED: lldb-shell :: Breakpoint/ppc64le-localentry.test (1305 of 1923)
PASS: lldb-unit :: SymbolFile/DWARF/./SymbolFileDWARFTests/17/29 (1306 of 1923)
PASS: lldb-api :: functionalities/plugins/python_os_plugin/TestPythonOSPlugin.py (1307 of 1923)
UNSUPPORTED: lldb-shell :: ScriptInterpreter/Lua/partial_statements.test (1308 of 1923)
UNSUPPORTED: lldb-api :: tools/lldb-server/TestGdbRemoteSaveCore.py (1309 of 1923)
PASS: lldb-unit :: Symbol/./SymbolTests/7/16 (1310 of 1923)
PASS: lldb-api :: terminal/TestEditline.py (1311 of 1923)
UNSUPPORTED: lldb-shell :: SymbolFile/NativePDB/disassembly.cpp (1312 of 1923)
PASS: lldb-shell :: ObjectFile/PECOFF/dwarf-gnu-debuglink-mismatched-crc.yaml (1313 of 1923)
PASS: lldb-unit :: ObjectFile/Breakpad/./ObjectFileBreakpadTests/7/11 (1314 of 1923)
PASS: lldb-unit :: Utility/./UtilityTests/27/30 (1315 of 1923)
UNSUPPORTED: lldb-api :: benchmarks/startup/TestStartupDelays.py (1316 of 1923)
UNSUPPORTED: lldb-shell :: Register/x86-64-gp-write.test (1317 of 1923)
PASS: lldb-api :: lang/objc/tagged-pointer/TestTaggedPointerCmd.py (1318 of 1923)
UNSUPPORTED: lldb-api :: commands/expression/namespace_local_var_same_name_obj_c/TestNamespaceLocalVarSameNameObjC.py (1319 of 1923)
PASS: lldb-shell :: Driver/TestProcessAttach.test (1320 of 1923)
PASS: lldb-api :: lang/c/cpp_keyword_identifiers/TestCppKeywordsAsCIdentifiers.py (1321 of 1923)
PASS: lldb-api :: functionalities/data-formatter/poarray/TestPrintObjectArray.py (1322 of 1923)
PASS: lldb-api :: lang/cpp/printf/TestPrintf.py (1323 of 1923)
PASS: lldb-api :: lang/objc/objc++/TestObjCXX.py (1324 of 1923)
PASS: lldb-api :: functionalities/thread/exit_during_expression/TestExitDuringExpression.py (1325 of 1923)
UNSUPPORTED: lldb-shell :: Unwind/windows-unaligned-x86_64.test (1326 of 1923)
PASS: lldb-api :: lang/c/const_variables/TestConstVariables.py (1327 of 1923)
PASS: lldb-api :: lang/objc/single-entry-dictionary/TestObjCSingleEntryDictionary.py (1328 of 1923)
PASS: lldb-api :: python_api/signals/TestSignalsAPI.py (1329 of 1923)
PASS: lldb-api :: lang/cpp/char1632_t/TestChar1632T.py (1330 of 1923)
PASS: lldb-shell :: Process/TestEnvironment.test (1331 of 1923)
UNSUPPORTED: lldb-api :: functionalities/asan/TestMemoryHistory.py (1332 of 1923)
PASS: lldb-api :: commands/frame/diagnose/array/TestArray.py (1333 of 1923)
PASS: lldb-unit :: Host/./HostTests/4/19 (1334 of 1923)
PASS: lldb-shell :: Process/UnsupportedLanguage.test (1335 of 1923)
UNSUPPORTED: lldb-shell :: SymbolFile/PDB/vbases.test (1336 of 1923)
UNSUPPORTED: lldb-api :: tools/lldb-server/memory-allocation/TestGdbRemoteMemoryAllocation.py (1337 of 1923)
PASS: lldb-api :: python_api/frame/TestFrames.py (1338 of 1923)
PASS: lldb-shell :: ObjectFile/PECOFF/dwarf-gnu-debuglink-pdb-buildid.yaml (1339 of 1923)
PASS: lldb-unit :: ObjectFile/Breakpad/./ObjectFileBreakpadTests/0/11 (1340 of 1923)
PASS: lldb-api :: lang/cpp/complete-type-check/TestCppIsTypeComplete.py (1341 of 1923)
PASS: lldb-unit :: UnwindAssembly/ARM64/./Arm64InstEmulationTests/1/7 (1342 of 1923)
PASS: lldb-unit :: SymbolFile/NativePDB/./SymbolFileNativePDBTests/2/15 (1343 of 1923)
PASS: lldb-unit :: Language/Highlighting/./HighlighterTests/12/29 (1344 of 1923)
PASS: lldb-api :: functionalities/postmortem/elf-core/thread_crash/TestLinuxCoreThreads.py (1345 of 1923)
PASS: lldb-shell :: ObjectFile/PECOFF/basic-info.yaml (1346 of 1923)
PASS: lldb-shell :: ObjectFile/ELF/compressed-sections.yaml (1347 of 1923)
PASS: lldb-shell :: SymbolFile/DWARF/x86/dwp-debug-types.s (1348 of 1923)
PASS: lldb-shell :: SymbolFile/DWARF/x86/debug_ranges.s (1349 of 1923)
PASS: lldb-unit :: Interpreter/./InterpreterTests/13/14 (1350 of 1923)
UNSUPPORTED: lldb-api :: api/multiple-targets/TestMultipleTargets.py (1351 of 1923)
UNSUPPORTED: lldb-shell :: SymbolFile/NativePDB/global-classes.cpp (1352 of 1923)
PASS: lldb-api :: macosx/find-app-in-bundle/TestFindAppInBundle.py (1353 of 1923)
PASS: lldb-shell :: Register/Core/x86-32-freebsd-fp.test (1354 of 1923)
PASS: lldb-shell :: Reproducer/TestDriverOptions.test (1355 of 1923)
PASS: lldb-api :: functionalities/thread/concurrent_events/TestConcurrentTwoBreakpointsOneDelaySignal.py (1356 of 1923)
PASS: lldb-shell :: ScriptInterpreter/Python/scripted_breakpoint.test (1357 of 1923)
UNSUPPORTED: lldb-shell :: Register/x86-ymm-read.test (1358 of 1923)
UNSUPPORTED: lldb-api :: tools/lldb-server/TestGdbRemoteExpeditedRegisters.py (1359 of 1923)
UNSUPPORTED: lldb-shell :: Process/Windows/exception_access_violation.cpp (1360 of 1923)
PASS: lldb-api :: lang/cpp/operator-overload/TestOperatorOverload.py (1361 of 1923)
PASS: lldb-api :: commands/frame/diagnose/inheritance/TestDiagnoseInheritance.py (1362 of 1923)
PASS: lldb-unit :: Language/Highlighting/./HighlighterTests/27/29 (1363 of 1923)
PASS: lldb-api :: functionalities/breakpoint/breakpoint_ids/TestBreakpointIDs.py (1364 of 1923)
PASS: lldb-api :: python_api/disassemble-raw-data/TestDisassemble_VST1_64.py (1365 of 1923)
UNSUPPORTED: lldb-api :: functionalities/thread/concurrent_events/TestConcurrentSignalDelayWatch.py (1366 of 1923)
PASS: lldb-api :: functionalities/breakpoint/step_over_breakpoint/TestStepOverBreakpoint.py (1367 of 1923)
PASS: lldb-api :: functionalities/data-formatter/data-formatter-objc/TestDataFormatterObjCNSURL.py (1368 of 1923)
PASS: lldb-api :: lang/cpp/offsetof/TestOffsetofCpp.py (1369 of 1923)
UNSUPPORTED: lldb-api :: functionalities/thread/concurrent_events/TestConcurrentDelaySignalWatch.py (1370 of 1923)
PASS: lldb-unit :: Language/Highlighting/./HighlighterTests/17/29 (1371 of 1923)
PASS: lldb-unit :: ObjectFile/ELF/./ObjectFileELFTests/3/4 (1372 of 1923)
UNSUPPORTED: lldb-api :: functionalities/tsan/global_location/TestTsanGlobalLocation.py (1373 of 1923)
PASS: lldb-shell :: Quit/TestQuitExitCodeNonInt.test (1374 of 1923)
PASS: lldb-api :: functionalities/pointer_num_children/TestPointerNumChildren.py (1375 of 1923)
PASS: lldb-api :: functionalities/return-value/TestReturnValue.py (1376 of 1923)
UNSUPPORTED: lldb-shell :: Register/x86-fp-read.test (1377 of 1923)
PASS: lldb-api :: lang/objc/ptr_refs/TestPtrRefsObjC.py (1378 of 1923)
PASS: lldb-api :: commands/expression/import-std-module/list/TestListFromStdModule.py (1379 of 1923)
PASS: lldb-unit :: Language/Highlighting/./HighlighterTests/28/29 (1380 of 1923)
PASS: lldb-unit :: Core/./LLDBCoreTests/10/22 (1381 of 1923)
UNSUPPORTED: lldb-shell :: SymbolFile/DWARF/x86/dir-separator-no-comp-dir-relative-name.s (1382 of 1923)
UNSUPPORTED: lldb-api :: tools/lldb-server/TestGdbRemoteCompletion.py (1383 of 1923)
PASS: lldb-unit :: SymbolFile/DWARF/./SymbolFileDWARFTests/8/29 (1384 of 1923)
PASS: lldb-api :: functionalities/abbreviation/TestAbbreviations.py (1385 of 1923)
PASS: lldb-api :: commands/expression/context-object-objc/TestContextObjectObjc.py (1386 of 1923)
UNSUPPORTED: lldb-api :: benchmarks/libcxxlist/TestBenchmarkLibcxxList.py (1387 of 1923)
PASS: lldb-api :: functionalities/memory/cache/TestMemoryCache.py (1388 of 1923)
PASS: lldb-api :: commands/expression/pr35310/TestExprsBug35310.py (1389 of 1923)
PASS: lldb-unit :: DataFormatter/./LLDBFormatterTests/3/11 (1390 of 1923)
PASS: lldb-unit :: Process/gdb-remote/./ProcessGdbRemoteTests/1/19 (1391 of 1923)
PASS: lldb-api :: lang/c/record_decl_in_expr/TestRecordDeclInExpr.py (1392 of 1923)
PASS: lldb-api :: functionalities/data-formatter/data-formatter-stl/libcxx/vector/TestDataFormatterLibcxxVector.py (1393 of 1923)
PASS: lldb-api :: python_api/symbol-context/two-files/TestSymbolContextTwoFiles.py (1394 of 1923)
UNSUPPORTED: lldb-shell :: SymbolFile/DWARF/debug-types-expressions.test (1395 of 1923)
UNSUPPORTED: lldb-api :: tools/lldb-server/vCont-threads/TestSignal.py (1396 of 1923)
PASS: lldb-api :: symbol_ondemand/shared_library/TestSharedLibOnDemand.py (1397 of 1923)
PASS: lldb-shell :: Register/Core/x86-64-freebsd-multithread.test (1398 of 1923)
PASS: lldb-api :: functionalities/thread_plan/TestThreadPlanCommands.py (1399 of 1923)
PASS: lldb-api :: commands/expression/rdar44436068/Test128BitsInteger.py (1400 of 1923)
PASS: lldb-api :: commands/expression/persistent_types/TestPersistentTypes.py (1401 of 1923)
PASS: lldb-api :: functionalities/gdb_remote_client/TestGDBRemoteClient.py (1402 of 1923)
UNSUPPORTED: lldb-api :: commands/register/register/aarch64_sve_registers/rw_access_dynamic_resize/TestSVEThreadedDynamic.py (1403 of 1923)
PASS: lldb-api :: python_api/value/empty_class/TestValueAPIEmptyClass.py (1404 of 1923)
PASS: lldb-unit :: Process/Utility/./ProcessUtilityTests/15/16 (1405 of 1923)
UNSUPPORTED: lldb-shell :: Register/x86-64-xmm16-read.test (1406 of 1923)
UNSUPPORTED: lldb-shell :: Reproducer/TestLuaImport.test (1407 of 1923)
PASS: lldb-unit :: ScriptInterpreter/Python/./ScriptInterpreterPythonTests/12/19 (1408 of 1923)
UNSUPPORTED: lldb-api :: functionalities/postmortem/FreeBSDKernel/TestFreeBSDKernelLive.py (1409 of 1923)
PASS: lldb-api :: types/TestFloatTypes.py (1410 of 1923)
PASS: lldb-unit :: Target/./TargetTests/0/19 (1411 of 1923)
PASS: lldb-api :: lang/c/step_over_no_deadlock/TestStepOverDoesntBlock.py (1412 of 1923)
PASS: lldb-api :: lang/objc/cpp_keyword_identifiers/TestCppKeywordsAsObjCIdentifiers.py (1413 of 1923)
PASS: lldb-unit :: Process/Utility/./ProcessUtilityTests/7/16 (1414 of 1923)
PASS: lldb-shell :: Settings/TestSettingsWrite.test (1415 of 1923)
PASS: lldb-shell :: ObjectFile/MachO/lc_version_min.yaml (1416 of 1923)
PASS: lldb-api :: functionalities/tail_call_frames/thread_step_out_or_return/TestSteppingOutWithArtificialFrames.py (1417 of 1923)
PASS: lldb-api :: commands/expression/test/TestExprs.py (1418 of 1923)
PASS: lldb-unit :: Target/./TargetTests/3/19 (1419 of 1923)
PASS: lldb-unit :: Expression/./ExpressionTests/21/22 (1420 of 1923)
PASS: lldb-api :: macosx/add-dsym/TestAddDsymDownload.py (1421 of 1923)
PASS: lldb-api :: python_api/exprpath_synthetic/TestExprPathSynthetic.py (1422 of 1923)
PASS: lldb-shell :: ObjectFile/wasm/basic.yaml (1423 of 1923)
PASS: lldb-api :: python_api/sbvalue_persist/TestSBValuePersist.py (1424 of 1923)
PASS: lldb-api :: functionalities/inline-stepping/TestInlineStepping.py (1425 of 1923)
PASS: lldb-api :: functionalities/type_lookup/TestTypeLookup.py (1426 of 1923)
PASS: lldb-unit :: ObjectFile/ELF/./ObjectFileELFTests/0/4 (1427 of 1923)
PASS: lldb-api :: iohandler/unicode/TestUnicode.py (1428 of 1923)
PASS: lldb-api :: functionalities/data-formatter/synthcapping/TestSyntheticCapping.py (1429 of 1923)
PASS: lldb-api :: lang/objc/exceptions/TestObjCExceptions.py (1430 of 1923)
PASS: lldb-api :: functionalities/signal/TestSendSignal.py (1431 of 1923)
UNSUPPORTED: lldb-shell :: Breakpoint/case-insensitive.test (1432 of 1923)
UNSUPPORTED: lldb-api :: tools/lldb-server/libraries-svr4/TestGdbRemoteLibrariesSvr4Support.py (1433 of 1923)
PASS: lldb-api :: functionalities/data-formatter/var-in-aggregate-misuse/TestVarInAggregateMisuse.py (1434 of 1923)
UNSUPPORTED: lldb-shell :: SymbolFile/DWARF/x86/limit-debug-info.s (1435 of 1923)
PASS: lldb-shell :: SymbolFile/DWARF/x86/debug-types-dwarf5.s (1436 of 1923)
UNSUPPORTED: lldb-api :: commands/trace/TestTraceSave.py (1437 of 1923)
PASS: lldb-api :: lang/objc/objc-checker/TestObjCCheckers.py (1438 of 1923)
UNSUPPORTED: lldb-api :: functionalities/thread/concurrent_events/TestConcurrentManyWatchpoints.py (1439 of 1923)
PASS: lldb-unit :: Process/Utility/./ProcessUtilityTests/12/16 (1440 of 1923)
PASS: lldb-api :: functionalities/data-formatter/data-formatter-stl/generic/list/TestDataFormatterGenericList.py (1441 of 1923)
PASS: lldb-api :: commands/expression/import-std-module/empty-module/TestEmptyStdModule.py (1442 of 1923)
PASS: lldb-api :: commands/settings/quoting/TestQuoting.py (1443 of 1923)
PASS: lldb-api :: lang/cpp/non-type-template-param/TestCppNonTypeTemplateParam.py (1444 of 1923)
PASS: lldb-api :: commands/target/dump-symtab-demangle/TestDumpSymtabDemangle.py (1445 of 1923)
PASS: lldb-unit :: Host/./HostTests/2/19 (1446 of 1923)
PASS: lldb-api :: tools/lldb-vscode/variables/TestVSCode_variables.py (1447 of 1923)
PASS: lldb-api :: driver/job_control/TestJobControl.py (1448 of 1923)
PASS: lldb-shell :: Driver/TestRepl.test (1449 of 1923)
PASS: lldb-unit :: DataFormatter/./LLDBFormatterTests/7/11 (1450 of 1923)
UNSUPPORTED: lldb-api :: functionalities/tty/TestTerminal.py (1451 of 1923)
PASS: lldb-shell :: SymbolFile/DWARF/x86/dwp.s (1452 of 1923)
PASS: lldb-shell :: SymbolFile/NativePDB/lookup-by-types.cpp (1453 of 1923)
UNSUPPORTED: lldb-shell :: SymbolFile/NativePDB/inline_sites.test (1454 of 1923)
PASS: lldb-unit :: SymbolFile/DWARF/./SymbolFileDWARFTests/18/29 (1455 of 1923)
PASS: lldb-unit :: Host/./HostTests/10/19 (1456 of 1923)
UNSUPPORTED: lldb-api :: functionalities/thread/concurrent_events/TestConcurrentDelayWatchBreak.py (1457 of 1923)
PASS: lldb-shell :: SymbolFile/DWARF/x86/DW_AT_declaration-with-children.s (1458 of 1923)
PASS: lldb-api :: functionalities/breakpoint/dummy_target_breakpoints/TestBreakpointsWithNoTargets.py (1459 of 1923)
PASS: lldb-api :: lang/cpp/sizeof/TestCPPSizeof.py (1460 of 1923)
PASS: lldb-unit :: UnwindAssembly/x86/./UnwindAssemblyx86Tests/20/27 (1461 of 1923)
PASS: lldb-api :: functionalities/target_var/TestTargetVar.py (1462 of 1923)
UNSUPPORTED: lldb-shell :: SymbolFile/PDB/calling-conventions-x86.test (1463 of 1923)
PASS: lldb-api :: types/TestLongTypesExpr.py (1464 of 1923)
PASS: lldb-api :: test_utils/base/TestBaseTest.py (1465 of 1923)
PASS: lldb-unit :: Interpreter/./InterpreterTests/2/14 (1466 of 1923)
UNSUPPORTED: lldb-api :: functionalities/thread/concurrent_events/TestConcurrentManySignals.py (1467 of 1923)
PASS: lldb-unit :: ScriptInterpreter/Python/./ScriptInterpreterPythonTests/13/19 (1468 of 1923)
PASS: lldb-api :: functionalities/breakpoint/objc/TestObjCBreakpoints.py (1469 of 1923)
UNSUPPORTED: lldb-shell :: ScriptInterpreter/Lua/command_script_import.test (1470 of 1923)
PASS: lldb-api :: functionalities/thread/concurrent_events/TestConcurrentCrashWithBreak.py (1471 of 1923)
PASS: lldb-api :: commands/platform/basic/TestPlatformCommand.py (1472 of 1923)
PASS: lldb-api :: macosx/macCatalyst/TestMacCatalyst.py (1473 of 1923)
PASS: lldb-unit :: Language/Highlighting/./HighlighterTests/16/29 (1474 of 1923)
UNSUPPORTED: lldb-shell :: Unwind/eh-frame-small-fde.test (1475 of 1923)
PASS: lldb-unit :: UnwindAssembly/x86/./UnwindAssemblyx86Tests/11/27 (1476 of 1923)
UNSUPPORTED: lldb-shell :: ObjectFile/PECOFF/uuid.yaml (1477 of 1923)
UNSUPPORTED: lldb-shell :: SymbolFile/DWARF/x86/DW_TAG_GNU_call_site-DW_AT_low_pc.s (1478 of 1923)
PASS: lldb-shell :: ScriptInterpreter/Python/Crashlog/text.test (1479 of 1923)
PASS: lldb-unit :: Interpreter/./InterpreterTests/7/14 (1480 of 1923)
UNSUPPORTED: lldb-shell :: SymbolFile/NativePDB/s_constant.cpp (1481 of 1923)
UNSUPPORTED: lldb-api :: functionalities/thread/concurrent_events/TestConcurrentTwoBreakpointsOneWatchpoint.py (1482 of 1923)
PASS: lldb-api :: types/TestLongTypes.py (1483 of 1923)
PASS: lldb-shell :: SymbolFile/DWARF/x86/apple-index-is-used.cpp (1484 of 1923)
UNSUPPORTED: lldb-api :: functionalities/data-formatter/data-formatter-stl/libstdcpp/vbool/TestDataFormatterStdVBool.py (1485 of 1923)
PASS: lldb-api :: functionalities/stop-on-sharedlibrary-load/TestStopOnSharedlibraryEvents.py (1486 of 1923)
PASS: lldb-api :: lang/c/local_variables/TestLocalVariables.py (1487 of 1923)
PASS: lldb-unit :: debugserver/./debugserverTests/3/6 (1488 of 1923)
PASS: lldb-unit :: Process/Utility/./ProcessUtilityTests/4/16 (1489 of 1923)
UNSUPPORTED: lldb-api :: linux/mix-dwo-and-regular-objects/TestMixedDwarfBinary.py (1490 of 1923)
PASS: lldb-api :: lang/c/array_types/TestArrayTypes.py (1491 of 1923)
PASS: lldb-unit :: Host/./HostTests/15/19 (1492 of 1923)
PASS: lldb-api :: macosx/load-kext/TestLoadKext.py (1493 of 1923)
PASS: lldb-api :: functionalities/thread/concurrent_events/TestConcurrentSignalDelayBreak.py (1494 of 1923)
PASS: lldb-unit :: Utility/./UtilityTests/13/30 (1495 of 1923)
PASS: lldb-shell :: Subprocess/fork-follow-parent.test (1496 of 1923)
UNSUPPORTED: lldb-api :: tools/lldb-server/TestGdbRemote_vCont.py (1497 of 1923)
UNSUPPORTED: lldb-api :: lang/objc/modules-app-update/TestClangModulesAppUpdate.py (1498 of 1923)
PASS: lldb-api :: python_api/sblaunchinfo/TestSBLaunchInfo.py (1499 of 1923)
PASS: lldb-api :: commands/expression/import-std-module/vector-dbg-info-content/TestDbgInfoContentVectorFromStdModule.py (1500 of 1923)
UNSUPPORTED: lldb-api :: functionalities/longjmp/TestLongjmp.py (1501 of 1923)
PASS: lldb-api :: functionalities/gdb_remote_client/TestPlatformMacOSX.py (1502 of 1923)
PASS: lldb-api :: lang/objc/modules/TestObjCModules.py (1503 of 1923)
PASS: lldb-api :: functionalities/data-formatter/data-formatter-script/TestDataFormatterScript.py (1504 of 1923)
PASS: lldb-api :: commands/expression/persistent_ptr_update/TestPersistentPtrUpdate.py (1505 of 1923)
PASS: lldb-api :: lang/cpp/template-arguments/TestCppTemplateArguments.py (1506 of 1923)
PASS: lldb-api :: functionalities/data-formatter/data-formatter-stl/libcxx/string/TestDataFormatterLibcxxString.py (1507 of 1923)
PASS: lldb-api :: lang/cpp/subst_template_type_param/TestSubstTemplateTypeParam.py (1508 of 1923)
PASS: lldb-unit :: SymbolFile/NativePDB/./SymbolFileNativePDBTests/3/15 (1509 of 1923)
PASS: lldb-unit :: Interpreter/./InterpreterTests/1/14 (1510 of 1923)
PASS: lldb-unit :: Core/./LLDBCoreTests/9/22 (1511 of 1923)
PASS: lldb-api :: lang/cpp/step-through-trampoline/TestStepThroughTrampoline.py (1512 of 1923)
PASS: lldb-api :: functionalities/process_crash_info/TestProcessCrashInfo.py (1513 of 1923)
PASS: lldb-shell :: ObjectFile/ELF/PT_LOAD-overlap-PT_TLS.yaml (1514 of 1923)
PASS: lldb-api :: commands/target/dump-pcm-info/TestDumpPCMInfo.py (1515 of 1923)
PASS: lldb-api :: functionalities/unused-inlined-parameters/TestUnusedInlinedParameters.py (1516 of 1923)
UNSUPPORTED: lldb-api :: tools/lldb-server/TestGdbRemoteProcessInfo.py (1517 of 1923)
UNSUPPORTED: lldb-api :: linux/aarch64/mte_tag_faults/TestAArch64LinuxMTEMemoryTagFaults.py (1518 of 1923)
PASS: lldb-shell :: ObjectFile/ELF/eh_frame-symbols.yaml (1519 of 1923)
PASS: lldb-unit :: Platform/./LLDBPlatformTests/9/16 (1520 of 1923)
PASS: lldb-api :: commands/expression/codegen-crash-typedefdecl-not-in_declcontext/TestCodegenCrashTypedefDeclNotInDeclContext.py (1521 of 1923)
PASS: lldb-shell :: Quit/TestQuitExitCode-30.test (1522 of 1923)
PASS: lldb-api :: functionalities/lazy-loading/TestLazyLoading.py (1523 of 1923)
PASS: lldb-api :: functionalities/mtc/simple/TestMTCSimple.py (1524 of 1923)
PASS: lldb-api :: commands/apropos/basic/TestApropos.py (1525 of 1923)
PASS: lldb-api :: commands/expression/import-std-module/missing-module-sources/TestStdModuleSourcesMissing.py (1526 of 1923)
PASS: lldb-api :: functionalities/data-formatter/typedef_array/TestTypedefArray.py (1527 of 1923)
UNSUPPORTED: lldb-api :: commands/watchpoints/watchpoint_on_vectors/TestValueOfVectorVariable.py (1528 of 1923)
PASS: lldb-unit :: Target/./TargetTests/13/19 (1529 of 1923)
PASS: lldb-unit :: Language/Highlighting/./HighlighterTests/6/29 (1530 of 1923)
PASS: lldb-shell :: Commands/command-breakpoint-col.test (1531 of 1923)
UNSUPPORTED: lldb-api :: commands/watchpoints/multiple_threads/TestWatchpointMultipleThreads.py (1532 of 1923)
UNSUPPORTED: lldb-api :: benchmarks/expression/TestRepeatedExprs.py (1533 of 1923)
PASS: lldb-shell :: Breakpoint/debug_rnglist_basic.test (1534 of 1923)
UNSUPPORTED: lldb-shell :: Register/aarch64-gp-read.test (1535 of 1923)
PASS: lldb-unit :: Language/Highlighting/./HighlighterTests/10/29 (1536 of 1923)
PASS: lldb-api :: commands/disassemble/basic/TestFrameDisassemble.py (1537 of 1923)
PASS: lldb-api :: lang/objc/objc-class-method/TestObjCClassMethod.py (1538 of 1923)
PASS: lldb-shell :: Settings/TestStopCommandSourceOnError.test (1539 of 1923)
PASS: lldb-api :: functionalities/breakpoint/breakpoint_on_overload/TestBreakOnOverload.py (1540 of 1923)
PASS: lldb-api :: commands/expression/error-limit/TestExprErrorLimit.py (1541 of 1923)
PASS: lldb-api :: lang/objc/objc-stepping/TestObjCStepping.py (1542 of 1923)
PASS: lldb-shell :: SymbolFile/DWARF/x86/static_scope.s (1543 of 1923)
PASS: lldb-unit :: Utility/./UtilityTests/2/30 (1544 of 1923)
PASS: lldb-api :: functionalities/data-formatter/data-formatter-named-summaries/TestDataFormatterNamedSummaries.py (1545 of 1923)
PASS: lldb-shell :: Commands/command-thread-select.test (1546 of 1923)
PASS: lldb-api :: functionalities/postmortem/netbsd-core/TestNetBSDCore.py (1547 of 1923)
PASS: lldb-api :: functionalities/data-formatter/data-formatter-stl/generic/set/TestDataFormatterGenericSet.py (1548 of 1923)
PASS: lldb-api :: python_api/lldbutil/process/TestPrintStackTraces.py (1549 of 1923)
UNSUPPORTED: lldb-shell :: Subprocess/clone-follow-parent.test (1550 of 1923)
PASS: lldb-unit :: Expression/./ExpressionTests/8/22 (1551 of 1923)
UNSUPPORTED: lldb-shell :: SymbolFile/NativePDB/ast-types.cpp (1552 of 1923)
PASS: lldb-api :: functionalities/load_after_attach/TestLoadAfterAttach.py (1553 of 1923)
PASS: lldb-api :: functionalities/progress_reporting/TestProgressReporting.py (1554 of 1923)
PASS: lldb-shell :: SymbolFile/DWARF/x86/dwo-type-in-main-file.s (1555 of 1923)
PASS: lldb-api :: functionalities/gdb_remote_client/TestFork.py (1556 of 1923)
PASS: lldb-api :: lang/cpp/unique-types/TestUniqueTypes.py (1557 of 1923)
PASS: lldb-api :: commands/gui/basic/TestGuiBasic.py (1558 of 1923)
PASS: lldb-api :: types/TestDoubleTypes.py (1559 of 1923)
PASS: lldb-shell :: ObjectFile/ELF/PT_LOAD-overlap-PT_INTERP.yaml (1560 of 1923)
PASS: lldb-api :: functionalities/thread/concurrent_events/TestConcurrentManyBreakpoints.py (1561 of 1923)
UNSUPPORTED: lldb-shell :: ScriptInterpreter/Lua/breakpoint_function_callback.test (1562 of 1923)
PASS: lldb-api :: macosx/stack-corefile/TestStackCorefile.py (1563 of 1923)
UNSUPPORTED: lldb-shell :: Register/x86-zmm-write.test (1564 of 1923)
PASS: lldb-shell :: SymbolFile/DWARF/x86/dwarf5-atomic.s (1565 of 1923)
PASS: lldb-api :: commands/command/invalid-args/TestInvalidArgsCommand.py (1566 of 1923)
PASS: lldb-unit :: Utility/./UtilityTests/11/30 (1567 of 1923)
PASS: lldb-api :: commands/expression/import-std-module/sysroot/TestStdModuleSysroot.py (1568 of 1923)
PASS: lldb-api :: python_api/value/linked_list/TestValueAPILinkedList.py (1569 of 1923)
UNSUPPORTED: lldb-shell :: Subprocess/clone-follow-child.test (1570 of 1923)
UNSUPPORTED: lldb-api :: tools/lldb-server/attach-wait/TestGdbRemoteAttachWait.py (1571 of 1923)
UNSUPPORTED: lldb-shell :: SymbolFile/DWARF/x86/find-function-regex.cpp (1572 of 1923)
PASS: lldb-api :: lang/cpp/extern_c/TestExternCSymbols.py (1573 of 1923)
PASS: lldb-api :: functionalities/gdb_remote_client/TestJLink6Armv7RegisterDefinition.py (1574 of 1923)
PASS: lldb-api :: macosx/indirect_symbol/TestIndirectSymbols.py (1575 of 1923)
PASS: lldb-unit :: Host/./HostTests/14/19 (1576 of 1923)
PASS: lldb-api :: macosx/add-dsym/TestAddDsymMidExecutionCommand.py (1577 of 1923)
UNSUPPORTED: lldb-shell :: SymbolFile/NativePDB/inline_sites_live.cpp (1578 of 1923)
PASS: lldb-api :: python_api/get-value-32bit-int/TestGetValue32BitInt.py (1579 of 1923)
PASS: lldb-api :: functionalities/thread/crash_during_step/TestCrashDuringStep.py (1580 of 1923)
UNSUPPORTED: lldb-api :: benchmarks/expression/TestExpressionCmd.py (1581 of 1923)
PASS: lldb-api :: tools/lldb-vscode/stackTrace/TestVSCode_stackTrace.py (1582 of 1923)
PASS: lldb-shell :: ObjectFile/Breakpad/discontiguous-sections.test (1583 of 1923)
PASS: lldb-shell :: Reproducer/TestHomeDir.test (1584 of 1923)
FAIL: lldb-api :: lang/cpp/const_static_integral_member/TestConstStaticIntegralMember.py (1585 of 1923)
******************** TEST 'lldb-api :: lang/cpp/const_static_integral_member/TestConstStaticIntegralMember.py' FAILED ********************
Script:
--
/Applications/Xcode.app/Contents/Developer/Library/Frameworks/Python3.framework/Versions/3.8/bin/python3.8 /Users/buildslave/jenkins/workspace/lldb-cmake-matrix/llvm-project/lldb/test/API/dotest.py -u CXXFLAGS -u CFLAGS --codesign-identity lldb_codesign --arch x86_64 --build-dir /Users/buildslave/jenkins/workspace/lldb-cmake-matrix/lldb-build/lldb-test-build.noindex -t --env TERM=vt100 --skip-category gmodules --skip-category watchpoint --skip-category llgs --skip-category debugserver --arch=x86_64 --env LLVM_LIBS_DIR=/Users/buildslave/jenkins/workspace/lldb-cmake-matrix/lldb-build/./lib --env LLVM_INCLUDE_DIR=/Users/buildslave/jenkins/workspace/lldb-cmake-matrix/lldb-build/include --env LLVM_TOOLS_DIR=/Users/buildslave/jenkins/workspace/lldb-cmake-matrix/lldb-build/./bin --hermetic-libcxx --arch x86_64 --build-dir /Users/buildslave/jenkins/workspace/lldb-cmake-matrix/lldb-build/lldb-test-build.noindex --lldb-module-cache-dir /Users/buildslave/jenkins/workspace/lldb-cmake-matrix/lldb-build/lldb-test-build.noindex/module-cache-lldb/lldb-api --clang-module-cache-dir /Users/buildslave/jenkins/workspace/lldb-cmake-matrix/lldb-build/lldb-test-build.noindex/module-cache-clang/lldb-api --executable /Users/buildslave/jenkins/workspace/lldb-cmake-matrix/lldb-build/./bin/lldb --compiler /Users/buildslave/jenkins/workspace/lldb-cmake-matrix/clang_1300_build/bin/clang --dsymutil /Users/buildslave/jenkins/workspace/lldb-cmake-matrix/lldb-build/./bin/dsymutil --llvm-tools-dir /Users/buildslave/jenkins/workspace/lldb-cmake-matrix/lldb-build/./bin --lldb-libs-dir /Users/buildslave/jenkins/workspace/lldb-cmake-matrix/lldb-build/./lib /Users/buildslave/jenkins/workspace/lldb-cmake-matrix/llvm-project/lldb/test/API/lang/cpp/const_static_integral_member -p TestConstStaticIntegralMember.py
--
Exit Code: 1

Hide Details

Command Output (stdout): -- lldb version 16.0.99git (http://labmaster3.local/git/llvm-project.git revision db008af501534d4590542253ae3acf783986f5f7) clang revision db008af501534d4590542253ae3acf783986f5f7 llvm revision db008af501534d4590542253ae3acf783986f5f7 Skipping the following test categories: ['gmodules', 'watchpoint', 'llgs', 'debugserver', 'libstdcxx', 'dwo', 'llgs', 'fork']

Hide Details

-- Command Output (stderr): -- Change dir to: /Users/buildslave/jenkins/workspace/lldb-cmake-matrix/llvm-project/lldb/test/API/lang/cpp/const_static_integral_member runCmd: settings clear -all output:

Hide Details

runCmd: settings set symbols.enable-external-lookup false output:

Hide Details

runCmd: settings set target.inherit-tcc true output:

Hide Details

runCmd: settings set target.detach-on-error false output:

Hide Details

runCmd: settings set target.auto-apply-fixits false output:

Hide Details

runCmd: settings set plugin.process.gdb-remote.packet-timeout 60 output:

Hide Details

runCmd: settings set symbols.clang-modules-cache-path "/Users/buildslave/jenkins/workspace/lldb-cmake-matrix/lldb-build/lldb-test-build.noindex/module-cache-lldb/lldb-api" output:

Hide Details

runCmd: settings set use-color false output:

Hide Details

runCmd: setting set target.prefer-dynamic-value no-dynamic-values output:

Hide Details

make VPATH=/Users/buildslave/jenkins/workspace/lldb-cmake-matrix/llvm-project/lldb/test/API/lang/cpp/const_static_integral_member -C /Users/buildslave/jenkins/workspace/lldb-cmake-matrix/lldb-build/lldb-test-build.noindex/lang/cpp/const_static_integral_member/TestConstStaticIntegralMember.test_class_with_only_const_static_dsym -I /Users/buildslave/jenkins/workspace/lldb-cmake-matrix/llvm-project/lldb/test/API/lang/cpp/const_static_integral_member -I /Users/buildslave/jenkins/workspace/lldb-cmake-matrix/llvm-project/lldb/packages/Python/lldbsuite/test/make -f /Users/buildslave/jenkins/workspace/lldb-cmake-matrix/llvm-project/lldb/test/API/lang/cpp/const_static_integral_member/Makefile MAKE_DSYM=YES all ARCH=x86_64 'CC="/Users/buildslave/jenkins/workspace/lldb-cmake-matrix/clang_1300_build/bin/clang"' DSYMUTIL=/Users/buildslave/jenkins/workspace/lldb-cmake-matrix/lldb-build/./bin/dsymutil CODESIGN=codesign CLANG_MODULE_CACHE_DIR=/Users/buildslave/jenkins/workspace/lldb-cmake-matrix/lldb-build/lldb-test-build.noindex/module-cache-clang/lldb-api USE_HERMETIC_LIBCPP=1

Hide Details

"/Users/buildslave/jenkins/workspace/lldb-cmake-matrix/clang_1300_build/bin/clang" -std=c++11 -g -O0 -isysroot "/Applications/Xcode.app/Contents/Developer/Platforms/MacOSX.platform/Developer/SDKs/MacOSX11.1.sdk" -arch x86_64 -I/Users/buildslave/jenkins/workspace/lldb-cmake-matrix/llvm-project/lldb/packages/Python/lldbsuite/test/make/../../../../../include -I/Users/buildslave/jenkins/workspace/lldb-cmake-matrix/llvm-project/lldb/test/API/lang/cpp/const_static_integral_member -I/Users/buildslave/jenkins/workspace/lldb-cmake-matrix/llvm-project/lldb/packages/Python/lldbsuite/test/make -include /Users/buildslave/jenkins/workspace/lldb-cmake-matrix/llvm-project/lldb/packages/Python/lldbsuite/test/make/test_common.h -fno-limit-debug-info --driver-mode=g++ -MT main.o -MD -MP -MF main.d -c -o main.o /Users/buildslave/jenkins/workspace/lldb-cmake-matrix/llvm-project/lldb/test/API/lang/cpp/const_static_integral_member/main.cpp "/Users/buildslave/jenkins/workspace/lldb-cmake-matrix/clang_1300_build/bin/clang" main.o -g -O0 -isysroot "/Applications/Xcode.app/Contents/Developer/Platforms/MacOSX.platform/Developer/SDKs/MacOSX11.1.sdk" -arch x86_64 -I/Users/buildslave/jenkins/workspace/lldb-cmake-matrix/llvm-project/lldb/packages/Python/lldbsuite/test/make/../../../../../include -I/Users/buildslave/jenkins/workspace/lldb-cmake-matrix/llvm-project/lldb/test/API/lang/cpp/const_static_integral_member -I/Users/buildslave/jenkins/workspace/lldb-cmake-matrix/llvm-project/lldb/packages/Python/lldbsuite/test/make -include /Users/buildslave/jenkins/workspace/lldb-cmake-matrix/llvm-project/lldb/packages/Python/lldbsuite/test/make/test_common.h -fno-limit-debug-info --driver-mode=g++ -o "a.out" codesign -s - "a.out" "/Users/buildslave/jenkins/workspace/lldb-cmake-matrix/lldb-build/./bin/dsymutil" -o "a.out.dSYM" "a.out"

Hide Details

Hide Details

XFAIL: LLDB (/Users/buildslave/jenkins/workspace/lldb-cmake-matrix/clang_1300_build/bin/clang-x86_64) :: test_class_with_only_const_static_dsym (TestConstStaticIntegralMember.TestCase) <bound method SBProcess.Kill of SBProcess: pid = 5566, state = stopped, threads = 1, executable = a.out>: success

Hide Details

runCmd: settings clear -all output:

Hide Details

runCmd: settings set symbols.enable-external-lookup false output:

Hide Details

runCmd: settings set target.inherit-tcc true output:

Hide Details

runCmd: settings set target.detach-on-error false output:

Hide Details

runCmd: settings set target.auto-apply-fixits false output:

Hide Details

runCmd: settings set plugin.process.gdb-remote.packet-timeout 60 output:

Hide Details

runCmd: settings set symbols.clang-modules-cache-path "/Users/buildslave/jenkins/workspace/lldb-cmake-matrix/lldb-build/lldb-test-build.noindex/module-cache-lldb/lldb-api" output:

Hide Details

runCmd: settings set use-color false output:

Hide Details

runCmd: setting set target.prefer-dynamic-value no-dynamic-values output:

Hide Details

make VPATH=/Users/buildslave/jenkins/workspace/lldb-cmake-matrix/llvm-project/lldb/test/API/lang/cpp/const_static_integral_member -C /Users/buildslave/jenkins/workspace/lldb-cmake-matrix/lldb-build/lldb-test-build.noindex/lang/cpp/const_static_integral_member/TestConstStaticIntegralMember.test_class_with_only_const_static_dwarf -I /Users/buildslave/jenkins/workspace/lldb-cmake-matrix/llvm-project/lldb/test/API/lang/cpp/const_static_integral_member -I /Users/buildslave/jenkins/workspace/lldb-cmake-matrix/llvm-project/lldb/packages/Python/lldbsuite/test/make -f /Users/buildslave/jenkins/workspace/lldb-cmake-matrix/llvm-project/lldb/test/API/lang/cpp/const_static_integral_member/Makefile MAKE_DSYM=NO all ARCH=x86_64 'CC="/Users/buildslave/jenkins/workspace/lldb-cmake-matrix/clang_1300_build/bin/clang"' DSYMUTIL=/Users/buildslave/jenkins/workspace/lldb-cmake-matrix/lldb-build/./bin/dsymutil CODESIGN=codesign CLANG_MODULE_CACHE_DIR=/Users/buildslave/jenkins/workspace/lldb-cmake-matrix/lldb-build/lldb-test-build.noindex/module-cache-clang/lldb-api USE_HERMETIC_LIBCPP=1

Hide Details

"/Users/buildslave/jenkins/workspace/lldb-cmake-matrix/clang_1300_build/bin/clang" -std=c++11 -g -O0 -isysroot "/Applications/Xcode.app/Contents/Developer/Platforms/MacOSX.platform/Developer/SDKs/MacOSX11.1.sdk" -arch x86_64 -I/Users/buildslave/jenkins/workspace/lldb-cmake-matrix/llvm-project/lldb/packages/Python/lldbsuite/test/make/../../../../../include -I/Users/buildslave/jenkins/workspace/lldb-cmake-matrix/llvm-project/lldb/test/API/lang/cpp/const_static_integral_member -I/Users/buildslave/jenkins/workspace/lldb-cmake-matrix/llvm-project/lldb/packages/Python/lldbsuite/test/make -include /Users/buildslave/jenkins/workspace/lldb-cmake-matrix/llvm-project/lldb/packages/Python/lldbsuite/test/make/test_common.h -fno-limit-debug-info --driver-mode=g++ -MT main.o -MD -MP -MF main.d -c -o main.o /Users/buildslave/jenkins/workspace/lldb-cmake-matrix/llvm-project/lldb/test/API/lang/cpp/const_static_integral_member/main.cpp "/Users/buildslave/jenkins/workspace/lldb-cmake-matrix/clang_1300_build/bin/clang" main.o -g -O0 -isysroot "/Applications/Xcode.app/Contents/Developer/Platforms/MacOSX.platform/Developer/SDKs/MacOSX11.1.sdk" -arch x86_64 -I/Users/buildslave/jenkins/workspace/lldb-cmake-matrix/llvm-project/lldb/packages/Python/lldbsuite/test/make/../../../../../include -I/Users/buildslave/jenkins/workspace/lldb-cmake-matrix/llvm-project/lldb/test/API/lang/cpp/const_static_integral_member -I/Users/buildslave/jenkins/workspace/lldb-cmake-matrix/llvm-project/lldb/packages/Python/lldbsuite/test/make -include /Users/buildslave/jenkins/workspace/lldb-cmake-matrix/llvm-project/lldb/packages/Python/lldbsuite/test/make/test_common.h -fno-limit-debug-info --driver-mode=g++ -o "a.out" codesign -s - "a.out"

Hide Details

Hide Details

<bound method SBProcess.Kill of SBProcess: pid = 5774, state = stopped, threads = 1, executable = a.out>: success

Hide Details

PASS: LLDB (/Users/buildslave/jenkins/workspace/lldb-cmake-matrix/clang_1300_build/bin/clang-x86_64) :: test_class_with_only_const_static_dwarf (TestConstStaticIntegralMember.TestCase) UNSUPPORTED: LLDB (/Users/buildslave/jenkins/workspace/lldb-cmake-matrix/clang_1300_build/bin/clang-x86_64) :: test_class_with_only_const_static_dwo (TestConstStaticIntegralMember.TestCase) (test case does not fall in any category of interest for this run) UNSUPPORTED: LLDB (/Users/buildslave/jenkins/workspace/lldb-cmake-matrix/clang_1300_build/bin/clang-x86_64) :: test_class_with_only_const_static_gmodules (TestConstStaticIntegralMember.TestCase) (test case does not fall in any category of interest for this run) runCmd: settings clear -all output:

Hide Details

runCmd: settings set symbols.enable-external-lookup false output:

Hide Details

runCmd: settings set target.inherit-tcc true output:

Hide Details

runCmd: settings set target.detach-on-error false output:

Hide Details

runCmd: settings set target.auto-apply-fixits false output:

Hide Details

runCmd: settings set plugin.process.gdb-remote.packet-timeout 60 output:

Hide Details

runCmd: settings set symbols.clang-modules-cache-path "/Users/buildslave/jenkins/workspace/lldb-cmake-matrix/lldb-build/lldb-test-build.noindex/module-cache-lldb/lldb-api" output:

Hide Details

runCmd: settings set use-color false output:

Hide Details

runCmd: setting set target.prefer-dynamic-value no-dynamic-values output:

Hide Details

make VPATH=/Users/buildslave/jenkins/workspace/lldb-cmake-matrix/llvm-project/lldb/test/API/lang/cpp/const_static_integral_member -C /Users/buildslave/jenkins/workspace/lldb-cmake-matrix/lldb-build/lldb-test-build.noindex/lang/cpp/const_static_integral_member/TestConstStaticIntegralMember.test_dsym -I /Users/buildslave/jenkins/workspace/lldb-cmake-matrix/llvm-project/lldb/test/API/lang/cpp/const_static_integral_member -I /Users/buildslave/jenkins/workspace/lldb-cmake-matrix/llvm-project/lldb/packages/Python/lldbsuite/test/make -f /Users/buildslave/jenkins/workspace/lldb-cmake-matrix/llvm-project/lldb/test/API/lang/cpp/const_static_integral_member/Makefile MAKE_DSYM=YES all ARCH=x86_64 'CC="/Users/buildslave/jenkins/workspace/lldb-cmake-matrix/clang_1300_build/bin/clang"' DSYMUTIL=/Users/buildslave/jenkins/workspace/lldb-cmake-matrix/lldb-build/./bin/dsymutil CODESIGN=codesign CLANG_MODULE_CACHE_DIR=/Users/buildslave/jenkins/workspace/lldb-cmake-matrix/lldb-build/lldb-test-build.noindex/module-cache-clang/lldb-api USE_HERMETIC_LIBCPP=1

Hide Details

"/Users/buildslave/jenkins/workspace/lldb-cmake-matrix/clang_1300_build/bin/clang" -std=c++11 -g -O0 -isysroot "/Applications/Xcode.app/Contents/Developer/Platforms/MacOSX.platform/Developer/SDKs/MacOSX11.1.sdk" -arch x86_64 -I/Users/buildslave/jenkins/workspace/lldb-cmake-matrix/llvm-project/lldb/packages/Python/lldbsuite/test/make/../../../../../include -I/Users/buildslave/jenkins/workspace/lldb-cmake-matrix/llvm-project/lldb/test/API/lang/cpp/const_static_integral_member -I/Users/buildslave/jenkins/workspace/lldb-cmake-matrix/llvm-project/lldb/packages/Python/lldbsuite/test/make -include /Users/buildslave/jenkins/workspace/lldb-cmake-matrix/llvm-project/lldb/packages/Python/lldbsuite/test/make/test_common.h -fno-limit-debug-info --driver-mode=g++ -MT main.o -MD -MP -MF main.d -c -o main.o /Users/buildslave/jenkins/workspace/lldb-cmake-matrix/llvm-project/lldb/test/API/lang/cpp/const_static_integral_member/main.cpp "/Users/buildslave/jenkins/workspace/lldb-cmake-matrix/clang_1300_build/bin/clang" main.o -g -O0 -isysroot "/Applications/Xcode.app/Contents/Developer/Platforms/MacOSX.platform/Developer/SDKs/MacOSX11.1.sdk" -arch x86_64 -I/Users/buildslave/jenkins/workspace/lldb-cmake-matrix/llvm-project/lldb/packages/Python/lldbsuite/test/make/../../../../../include -I/Users/buildslave/jenkins/workspace/lldb-cmake-matrix/llvm-project/lldb/test/API/lang/cpp/const_static_integral_member -I/Users/buildslave/jenkins/workspace/lldb-cmake-matrix/llvm-project/lldb/packages/Python/lldbsuite/test/make -include /Users/buildslave/jenkins/workspace/lldb-cmake-matrix/llvm-project/lldb/packages/Python/lldbsuite/test/make/test_common.h -fno-limit-debug-info --driver-mode=g++ -o "a.out" codesign -s - "a.out" "/Users/buildslave/jenkins/workspace/lldb-cmake-matrix/lldb-build/./bin/dsymutil" -o "a.out.dSYM" "a.out"

Hide Details

Hide Details

FAIL: LLDB (/Users/buildslave/jenkins/workspace/lldb-cmake-matrix/clang_1300_build/bin/clang-x86_64) :: test_dsym (TestConstStaticIntegralMember.TestCase) <bound method SBProcess.Kill of SBProcess: pid = 5890, state = stopped, threads = 1, executable = a.out>: success

Hide Details

runCmd: settings clear -all output:

Hide Details

runCmd: settings set symbols.enable-external-lookup false output:

Hide Details

runCmd: settings set target.inherit-tcc true output:

Hide Details

runCmd: settings set target.detach-on-error false output:

Hide Details

runCmd: settings set target.auto-apply-fixits false output:

Hide Details

runCmd: settings set plugin.process.gdb-remote.packet-timeout 60 output:

Hide Details

runCmd: settings set symbols.clang-modules-cache-path "/Users/buildslave/jenkins/workspace/lldb-cmake-matrix/lldb-build/lldb-test-build.noindex/module-cache-lldb/lldb-api" output:

Hide Details

runCmd: settings set use-color false output:

Hide Details

runCmd: setting set target.prefer-dynamic-value no-dynamic-values output:

Hide Details

make VPATH=/Users/buildslave/jenkins/workspace/lldb-cmake-matrix/llvm-project/lldb/test/API/lang/cpp/const_static_integral_member -C /Users/buildslave/jenkins/workspace/lldb-cmake-matrix/lldb-build/lldb-test-build.noindex/lang/cpp/const_static_integral_member/TestConstStaticIntegralMember.test_dwarf -I /Users/buildslave/jenkins/workspace/lldb-cmake-matrix/llvm-project/lldb/test/API/lang/cpp/const_static_integral_member -I /Users/buildslave/jenkins/workspace/lldb-cmake-matrix/llvm-project/lldb/packages/Python/lldbsuite/test/make -f /Users/buildslave/jenkins/workspace/lldb-cmake-matrix/llvm-project/lldb/test/API/lang/cpp/const_static_integral_member/Makefile MAKE_DSYM=NO all ARCH=x86_64 'CC="/Users/buildslave/jenkins/workspace/lldb-cmake-matrix/clang_1300_build/bin/clang"' DSYMUTIL=/Users/buildslave/jenkins/workspace/lldb-cmake-matrix/lldb-build/./bin/dsymutil CODESIGN=codesign CLANG_MODULE_CACHE_DIR=/Users/buildslave/jenkins/workspace/lldb-cmake-matrix/lldb-build/lldb-test-build.noindex/module-cache-clang/lldb-api USE_HERMETIC_LIBCPP=1

Hide Details

"/Users/buildslave/jenkins/workspace/lldb-cmake-matrix/clang_1300_build/bin/clang" -std=c++11 -g -O0 -isysroot "/Applications/Xcode.app/Contents/Developer/Platforms/MacOSX.platform/Developer/SDKs/MacOSX11.1.sdk" -arch x86_64 -I/Users/buildslave/jenkins/workspace/lldb-cmake-matrix/llvm-project/lldb/packages/Python/lldbsuite/test/make/../../../../../include -I/Users/buildslave/jenkins/workspace/lldb-cmake-matrix/llvm-project/lldb/test/API/lang/cpp/const_static_integral_member -I/Users/buildslave/jenkins/workspace/lldb-cmake-matrix/llvm-project/lldb/packages/Python/lldbsuite/test/make -include /Users/buildslave/jenkins/workspace/lldb-cmake-matrix/llvm-project/lldb/packages/Python/lldbsuite/test/make/test_common.h -fno-limit-debug-info --driver-mode=g++ -MT main.o -MD -MP -MF main.d -c -o main.o /Users/buildslave/jenkins/workspace/lldb-cmake-matrix/llvm-project/lldb/test/API/lang/cpp/const_static_integral_member/main.cpp "/Users/buildslave/jenkins/workspace/lldb-cmake-matrix/clang_1300_build/bin/clang" main.o -g -O0 -isysroot "/Applications/Xcode.app/Contents/Developer/Platforms/MacOSX.platform/Developer/SDKs/MacOSX11.1.sdk" -arch x86_64 -I/Users/buildslave/jenkins/workspace/lldb-cmake-matrix/llvm-project/lldb/packages/Python/lldbsuite/test/make/../../../../../include -I/Users/buildslave/jenkins/workspace/lldb-cmake-matrix/llvm-project/lldb/test/API/lang/cpp/const_static_integral_member -I/Users/buildslave/jenkins/workspace/lldb-cmake-matrix/llvm-project/lldb/packages/Python/lldbsuite/test/make -include /Users/buildslave/jenkins/workspace/lldb-cmake-matrix/llvm-project/lldb/packages/Python/lldbsuite/test/make/test_common.h -fno-limit-debug-info --driver-mode=g++ -o "a.out" codesign -s - "a.out"

Hide Details

Hide Details

runCmd: expr const int *i = &A::int_val; *i check of return status not required runCmd failed! error: expression failed to parse: error: Couldn't lookup symbols: __ZN1A7int_valE

Hide Details

Hide Details

Ran command: "expr const int *i = &A::int_val; *i"

Hide Details

Got output: error: expression failed to parse: error: Couldn't lookup symbols: __ZN1A7int_valE

Hide Details

Expecting sub string: "Couldn't lookup symbols:" (was found)

Hide Details

<bound method SBProcess.Kill of SBProcess: pid = 6062, state = stopped, threads = 1, executable = a.out>: success

Hide Details

PASS: LLDB (/Users/buildslave/jenkins/workspace/lldb-cmake-matrix/clang_1300_build/bin/clang-x86_64) :: test_dwarf (TestConstStaticIntegralMember.TestCase) UNSUPPORTED: LLDB (/Users/buildslave/jenkins/workspace/lldb-cmake-matrix/clang_1300_build/bin/clang-x86_64) :: test_dwo (TestConstStaticIntegralMember.TestCase) (test case does not fall in any category of interest for this run) UNSUPPORTED: LLDB (/Users/buildslave/jenkins/workspace/lldb-cmake-matrix/clang_1300_build/bin/clang-x86_64) :: test_gmodules (TestConstStaticIntegralMember.TestCase) (test case does not fall in any category of interest for this run) Restore dir to: /Users/buildslave/jenkins/workspace/lldb-cmake-matrix/lldb-build/tools/lldb/test ====================================================================== FAIL: test_dsym (TestConstStaticIntegralMember.TestCase) ---------------------------------------------------------------------- Traceback (most recent call last): File "/Users/buildslave/jenkins/workspace/lldb-cmake-matrix/llvm-project/lldb/packages/Python/lldbsuite/test/lldbtest.py", line 1673, in test_method return attrvalue(self) File "/Users/buildslave/jenkins/workspace/lldb-cmake-matrix/llvm-project/lldb/test/API/lang/cpp/const_static_integral_member/TestConstStaticIntegralMember.py", line 70, in test self.expect_expr("ClassWithEnumAlias::enum_alias", File "/Users/buildslave/jenkins/workspace/lldb-cmake-matrix/llvm-project/lldb/packages/Python/lldbsuite/test/lldbtest.py", line 2430, in expect_expr value_check.check_value(self, eval_result, str(eval_result)) File "/Users/buildslave/jenkins/workspace/lldb-cmake-matrix/llvm-project/lldb/packages/Python/lldbsuite/test/lldbtest.py", line 286, in check_value test_base.assertSuccess(val.GetError()) File "/Users/buildslave/jenkins/workspace/lldb-cmake-matrix/llvm-project/lldb/packages/Python/lldbsuite/test/lldbtest.py", line 2466, in assertSuccess self.fail(self._formatMessage(msg, AssertionError: 'expression failed to parse: error: <user expression 31>:1:1: use of undeclared identifier 'ClassWithEnumAlias' ClassWithEnumAlias::enum_alias ^ ' is not success Config=x86_64-/Users/buildslave/jenkins/workspace/lldb-cmake-matrix/clang_1300_build/bin/clang ---------------------------------------------------------------------- Ran 8 tests in 6.908s

Hide Details

RESULT: FAILED (2 passes, 1 failures, 0 errors, 4 skipped, 1 expected failures, 0 unexpected successes)

Hide Details

--

Hide Details

******************** PASS: lldb-api :: lang/cpp/typedef/TestCppTypedef.py (1586 of 1923) PASS: lldb-api :: commands/expression/scoped_enums/TestScopedEnumType.py (1587 of 1923) PASS: lldb-api :: commands/expression/rdar42038760/TestScalarURem.py (1588 of 1923) PASS: lldb-api :: lang/cpp/type_lookup/TestCppTypeLookup.py (1589 of 1923) PASS: lldb-api :: functionalities/data-formatter/pyobjsynthprovider/TestPyObjSynthProvider.py (1590 of 1923) PASS: lldb-api :: commands/process/continue_to_bkpt/TestContinueToBkpts.py (1591 of 1923) PASS: lldb-api :: symbol_ondemand/breakpoint_source_regex/TestSourceTextRegexBreakpoint.py (1592 of 1923) PASS: lldb-api :: functionalities/data-formatter/data-formatter-objc/TestDataFormatterObjNSException.py (1593 of 1923) PASS: lldb-shell :: Watchpoint/SetErrorCases.test (1594 of 1923) PASS: lldb-api :: commands/target/modules/search-paths/insert/TestTargetModulesSearchpathsInsert.py (1595 of 1923) PASS: lldb-shell :: Driver/TestConvenienceVariables.test (1596 of 1923) PASS: lldb-unit :: Disassembler/ARM/./DisassemblerTests/0/2 (1597 of 1923) PASS: lldb-api :: functionalities/data-formatter/data-formatter-stl/libcxx/tuple/TestDataFormatterLibcxxTuple.py (1598 of 1923) PASS: lldb-api :: commands/session/history/TestSessionHistory.py (1599 of 1923) PASS: lldb-api :: commands/expression/multiline-completion/TestMultilineCompletion.py (1600 of 1923) PASS: lldb-unit :: UnwindAssembly/x86/./UnwindAssemblyx86Tests/22/27 (1601 of 1923) PASS: lldb-api :: functionalities/data-formatter/ptr_ref_typedef/TestPtrRef2Typedef.py (1602 of 1923) PASS: lldb-api :: functionalities/data-formatter/data-formatter-synth/TestDataFormatterSynth.py (1603 of 1923) PASS: lldb-api :: commands/expression/no-deadlock/TestExprDoesntBlock.py (1604 of 1923) PASS: lldb-api :: commands/expression/expr_inside_lambda/TestExprInsideLambdas.py (1605 of 1923) PASS: lldb-unit :: ScriptInterpreter/Python/./ScriptInterpreterPythonTests/14/19 (1606 of 1923) PASS: lldb-unit :: SymbolFile/DWARF/./SymbolFileDWARFTests/9/29 (1607 of 1923) PASS: lldb-shell :: Commands/command-script-import.test (1608 of 1923) PASS: lldb-api :: functionalities/unwind/sigtramp/TestSigtrampUnwind.py (1609 of 1923) PASS: lldb-api :: lang/cpp/incompatible-class-templates/TestCppIncompatibleClassTemplates.py (1610 of 1923) PASS: lldb-unit :: ScriptInterpreter/Python/./ScriptInterpreterPythonTests/8/19 (1611 of 1923) PASS: lldb-unit :: Process/minidump/./LLDBMinidumpTests/1/17 (1612 of 1923) PASS: lldb-unit :: SymbolFile/DWARF/./SymbolFileDWARFTests/15/29 (1613 of 1923) PASS: lldb-api :: commands/target/stop-hook/disable/TestTargetStopHookDisable.py (1614 of 1923) PASS: lldb-api :: functionalities/dynamic_value_child_count/TestDynamicValueChildCount.py (1615 of 1923) UNSUPPORTED: lldb-shell :: SymbolFile/NativePDB/function-types-builtins.cpp (1616 of 1923) PASS: lldb-shell :: ObjectFile/wasm/unified-debug-sections.yaml (1617 of 1923) PASS: lldb-unit :: UnwindAssembly/x86/./UnwindAssemblyx86Tests/13/27 (1618 of 1923) PASS: lldb-api :: functionalities/data-formatter/data-formatter-stl/libcxx/variant/TestDataFormatterLibcxxVariant.py (1619 of 1923) PASS: lldb-shell :: Minidump/fb-dump.test (1620 of 1923) PASS: lldb-api :: functionalities/breakpoint/auto_continue/TestBreakpointAutoContinue.py (1621 of 1923) PASS: lldb-shell :: SymbolFile/DWARF/x86/dwarf5-split.s (1622 of 1923) PASS: lldb-shell :: SymbolFile/DWARF/x86/module-ownership.mm (1623 of 1923) PASS: lldb-api :: tools/lldb-vscode/console/TestVSCode_redirection_to_console.py (1624 of 1923) UNSUPPORTED: lldb-api :: commands/watchpoints/watchpoint_commands/TestWatchpointCommands.py (1625 of 1923) PASS: lldb-unit :: UnwindAssembly/x86/./UnwindAssemblyx86Tests/14/27 (1626 of 1923) UNSUPPORTED: lldb-shell :: SymbolFile/DWARF/x86/dwarf5-index-is-used.cpp (1627 of 1923) PASS: lldb-unit :: ObjectFile/MachO/./ObjectFileMachOTests/1/2 (1628 of 1923) PASS: lldb-api :: types/TestDoubleTypesExpr.py (1629 of 1923) PASS: lldb-api :: commands/expression/import-std-module/queue/TestQueueFromStdModule.py (1630 of 1923) PASS: lldb-unit :: Utility/./UtilityTests/4/30 (1631 of 1923) UNSUPPORTED: lldb-api :: lang/cpp/function-template-parameter-pack/TestFunctionTemplateParameterPack.py (1632 of 1923) UNSUPPORTED: lldb-api :: functionalities/tsan/cpp_global_location/TestTsanCPPGlobalLocation.py (1633 of 1923) PASS: lldb-shell :: Reproducer/TestDump.test (1634 of 1923) PASS: lldb-shell :: SymbolFile/DWARF/x86/dwarf5_tu_index_abbrev_offset.s (1635 of 1923) PASS: lldb-api :: lang/cpp/operators/TestCppOperators.py (1636 of 1923) PASS: lldb-api :: functionalities/completion/TestCompletion.py (1637 of 1923) PASS: lldb-api :: macosx/thread_suspend/TestInternalThreadSuspension.py (1638 of 1923) PASS: lldb-shell :: Symtab/symtab-regex-mangled.test (1639 of 1923) PASS: lldb-api :: python_api/symbol-context/TestSymbolContext.py (1640 of 1923) UNSUPPORTED: lldb-api :: benchmarks/stepping/TestSteppingSpeed.py (1641 of 1923) UNSUPPORTED: lldb-api :: commands/watchpoints/watchpoint_disable/TestWatchpointDisable.py (1642 of 1923) PASS: lldb-unit :: UnwindAssembly/x86/./UnwindAssemblyx86Tests/7/27 (1643 of 1923) PASS: lldb-api :: functionalities/recursion/TestValueObjectRecursion.py (1644 of 1923) PASS: lldb-unit :: Process/gdb-remote/./ProcessGdbRemoteTests/9/19 (1645 of 1923) PASS: lldb-unit :: Platform/./LLDBPlatformTests/8/16 (1646 of 1923) PASS: lldb-shell :: ExecControl/StopHook/stop-hook.test (1647 of 1923) UNSUPPORTED: lldb-shell :: SymbolFile/NativePDB/locate-pdb.cpp (1648 of 1923) PASS: lldb-unit :: Process/Utility/./ProcessUtilityTests/2/16 (1649 of 1923) PASS: lldb-api :: functionalities/gdb_remote_client/TestThreadInfoTrailingComma.py (1650 of 1923) PASS: lldb-unit :: ScriptInterpreter/Python/./ScriptInterpreterPythonTests/6/19 (1651 of 1923) PASS: lldb-shell :: Minidump/Windows/find-module.test (1652 of 1923) PASS: lldb-unit :: Process/gdb-remote/./ProcessGdbRemoteTests/11/19 (1653 of 1923) PASS: lldb-api :: commands/expression/ignore-artificial-constructors/TestIgnoreArtificialConstructors.py (1654 of 1923) PASS: lldb-api :: commands/expression/import-std-module/list-dbg-info-content/TestDbgInfoContentListFromStdModule.py (1655 of 1923) UNSUPPORTED: lldb-api :: tools/lldb-vscode/completions/TestVSCode_completions.py (1656 of 1923) UNSUPPORTED: lldb-api :: benchmarks/libcxxmap/TestBenchmarkLibcxxMap.py (1657 of 1923) UNSUPPORTED: lldb-api :: lang/objc/rdar-12408181/TestRdar12408181.py (1658 of 1923) PASS: lldb-shell :: SymbolFile/DWARF/x86/find-method-local-struct.cpp (1659 of 1923) UNSUPPORTED: lldb-api :: functionalities/thread/concurrent_events/TestConcurrentTwoWatchpointsOneDelayBreakpoint.py (1660 of 1923) PASS: lldb-api :: lang/cpp/auto/TestCPPAuto.py (1661 of 1923) PASS: lldb-shell :: ScriptInterpreter/Python/python.test (1662 of 1923) PASS: lldb-unit :: Utility/./UtilityTests/5/30 (1663 of 1923) PASS: lldb-api :: lang/cpp/frame-var-anon-unions/TestFrameVariableAnonymousUnions.py (1664 of 1923) PASS: lldb-api :: commands/add-dsym/uuid/TestAddDsymCommand.py (1665 of 1923) UNSUPPORTED: lldb-shell :: SymbolFile/DWARF/x86/dwarf5_locations.s (1666 of 1923) PASS: lldb-unit :: Expression/./ExpressionTests/14/22 (1667 of 1923) PASS: lldb-api :: commands/thread/backtrace/TestThreadBacktraceRepeat.py (1668 of 1923) UNSUPPORTED: lldb-shell :: SymbolFile/NativePDB/nested-types.cpp (1669 of 1923) PASS: lldb-api :: commands/process/launch-with-shellexpand/TestLaunchWithShellExpand.py (1670 of 1923) PASS: lldb-api :: macosx/lc-note/firmware-corefile/TestFirmwareCorefiles.py (1671 of 1923) PASS: lldb-unit :: debugserver/./debugserverTests/2/6 (1672 of 1923) PASS: lldb-api :: lang/cpp/incomplete-types/TestCppIncompleteTypes.py (1673 of 1923) PASS: lldb-api :: macosx/function-starts/TestFunctionStarts.py (1674 of 1923) UNSUPPORTED: lldb-shell :: SymbolFile/PDB/expressions.test (1675 of 1923) PASS: lldb-shell :: Register/Core/x86-64-linux-fp.test (1676 of 1923) PASS: lldb-api :: commands/expression/argument_passing_restrictions/TestArgumentPassingRestrictions.py (1677 of 1923) PASS: lldb-api :: commands/frame/diagnose/bad-reference/TestBadReference.py (1678 of 1923) PASS: lldb-api :: functionalities/data-formatter/data-formatter-stl/libcxx/string/simulator/TestDataFormatterLibcxxStringSimulator.py (1679 of 1923) PASS: lldb-unit :: ObjectFile/Breakpad/./ObjectFileBreakpadTests/3/11 (1680 of 1923) PASS: lldb-shell :: Register/Core/x86-64-linux-multithread.test (1681 of 1923) PASS: lldb-api :: functionalities/breakpoint/two_hits_one_actual/TestTwoHitsOneActual.py (1682 of 1923) PASS: lldb-shell :: VSCode/TestOptions.test (1683 of 1923) PASS: lldb-unit :: Core/./LLDBCoreTests/15/22 (1684 of 1923) PASS: lldb-api :: functionalities/gdb_remote_client/TestNoWatchpointSupportInfo.py (1685 of 1923) PASS: lldb-api :: functionalities/data-formatter/boolreference/TestFormattersBoolRefPtr.py (1686 of 1923) PASS: lldb-unit :: DataFormatter/./LLDBFormatterTests/0/11 (1687 of 1923) PASS: lldb-api :: lang/cpp/static_member_type_depending_on_parent_size/TestStaticMemberTypeDependingOnParentSize.py (1688 of 1923) PASS: lldb-shell :: Register/Core/x86-32-netbsd-addr.test (1689 of 1923) PASS: lldb-unit :: DataFormatter/./LLDBFormatterTests/2/11 (1690 of 1923) PASS: lldb-api :: commands/expression/import-std-module/forward_list-dbg-info-content/TestDbgInfoContentForwardListFromStdModule.py (1691 of 1923) PASS: lldb-api :: functionalities/data-formatter/data-formatter-stl/generic/multimap/TestDataFormatterGenericMultiMap.py (1692 of 1923) PASS: lldb-api :: functionalities/thread/concurrent_events/TestConcurrentTwoBreakpointThreads.py (1693 of 1923) PASS: lldb-api :: lang/objc/objc-ivar-offsets/TestObjCIvarOffsets.py (1694 of 1923) PASS: lldb-unit :: ObjectFile/ELF/./ObjectFileELFTests/2/4 (1695 of 1923) UNSUPPORTED: lldb-api :: functionalities/thread/concurrent_events/exit/TestConcurrentThreadExit.py (1696 of 1923) PASS: lldb-api :: commands/target/stop-hook/enable/TestTargetStopHookEnable.py (1697 of 1923) PASS: lldb-api :: lang/cpp/trivial_abi/TestTrivialABI.py (1698 of 1923) PASS: lldb-shell :: SymbolFile/DWARF/x86/DW_AT_loclists_base.s (1699 of 1923) PASS: lldb-api :: lang/c/bitfields/TestBitfields.py (1700 of 1923) PASS: lldb-shell :: SymbolFile/Breakpad/line-table-discontinuous-file-ids.test (1701 of 1923) UNSUPPORTED: lldb-api :: functionalities/thread/concurrent_events/TestConcurrentTwoWatchpointThreads.py (1702 of 1923) UNSUPPORTED: lldb-api :: functionalities/thread/thread_specific_break_plus_condition/TestThreadSpecificBpPlusCondition.py (1703 of 1923) PASS: lldb-api :: tools/lldb-vscode/step/TestVSCode_step.py (1704 of 1923) PASS: lldb-shell :: Register/x86-multithread-read.test (1705 of 1923) PASS: lldb-api :: lang/cpp/stl/TestStdCXXDisassembly.py (1706 of 1923) PASS: lldb-shell :: Register/Core/x86-64-freebsd-addr.test (1707 of 1923) PASS: lldb-unit :: Utility/./UtilityTests/18/30 (1708 of 1923) PASS: lldb-api :: functionalities/breakpoint/consecutive_breakpoints/TestConsecutiveBreakpoints.py (1709 of 1923) PASS: lldb-api :: commands/expression/call-function/TestCallUserDefinedFunction.py (1710 of 1923) UNSUPPORTED: lldb-api :: lang/cpp/reference-to-outer-type/TestCppReferenceToOuterClass.py (1711 of 1923) PASS: lldb-api :: commands/log/invalid-args/TestInvalidArgsLog.py (1712 of 1923) PASS: lldb-api :: functionalities/gdb_remote_client/TestNoGPacketSupported.py (1713 of 1923) PASS: lldb-api :: functionalities/unwind/zeroth_frame/TestZerothFrame.py (1714 of 1923) PASS: lldb-api :: functionalities/gdb_remote_client/TestqOffsets.py (1715 of 1923) PASS: lldb-api :: lldbutil-tests/failed-to-hit-breakpoint/TestLLDBUtilFailedToHitBreakpoint.py (1716 of 1923) UNSUPPORTED: lldb-shell :: ObjectFile/ELF/minidebuginfo-set-and-hit-breakpoint.test (1717 of 1923) PASS: lldb-api :: api/log/TestAPILog.py (1718 of 1923) PASS: lldb-api :: lang/cpp/elaborated-types/TestElaboratedTypes.py (1719 of 1923) UNSUPPORTED: lldb-shell :: SymbolFile/NativePDB/source-list.cpp (1720 of 1923) PASS: lldb-api :: lang/c/function_types/TestFunctionTypes.py (1721 of 1923) PASS: lldb-api :: commands/source/info/TestSourceInfo.py (1722 of 1923) PASS: lldb-api :: lang/objc/rdar-11355592/TestRdar11355592.py (1723 of 1923) PASS: lldb-api :: macosx/safe-to-func-call/TestSafeFuncCalls.py (1724 of 1923) PASS: lldb-shell :: Settings/TestFrameFormatNoColor.test (1725 of 1923) PASS: lldb-unit :: Interpreter/./InterpreterTests/10/14 (1726 of 1923) PASS: lldb-api :: lang/c/register_variables/TestRegisterVariables.py (1727 of 1923) PASS: lldb-shell :: ObjectFile/ELF/minidebuginfo-find-symbols.yaml (1728 of 1923) PASS: lldb-shell :: Register/x86-multithread-write.test (1729 of 1923) PASS: lldb-api :: lang/c/vla/TestVLA.py (1730 of 1923) PASS: lldb-unit :: UnwindAssembly/x86/./UnwindAssemblyx86Tests/8/27 (1731 of 1923) UNSUPPORTED: lldb-api :: functionalities/unwind/ehframe/TestEhFrameUnwind.py (1732 of 1923) UNSUPPORTED: lldb-api :: functionalities/signal/handle-segv/TestHandleSegv.py (1733 of 1923) UNSUPPORTED: lldb-api :: commands/expression/call-restarts/TestCallThatRestarts.py (1734 of 1923) PASS: lldb-api :: commands/expression/import-std-module/array/TestArrayFromStdModule.py (1735 of 1923) PASS: lldb-api :: functionalities/load_using_paths/TestLoadUsingPaths.py (1736 of 1923) PASS: lldb-api :: macosx/dyld-trie-symbols/TestDyldTrieSymbols.py (1737 of 1923) PASS: lldb-unit :: Target/./TargetTests/5/19 (1738 of 1923) PASS: lldb-unit :: Process/minidump/./LLDBMinidumpTests/12/17 (1739 of 1923) PASS: lldb-api :: functionalities/set-data/TestSetData.py (1740 of 1923) PASS: lldb-unit :: Language/Highlighting/./HighlighterTests/15/29 (1741 of 1923) UNSUPPORTED: lldb-shell :: ScriptInterpreter/Lua/io.test (1742 of 1923) UNSUPPORTED: lldb-shell :: SymbolFile/DWARF/x86/dwp-separate-debug-file.cpp (1743 of 1923) PASS: lldb-api :: functionalities/gdb_remote_client/TestNestedRegDefinitions.py (1744 of 1923) PASS: lldb-api :: lang/cpp/template-function/TestTemplateFunctions.py (1745 of 1923) UNSUPPORTED: lldb-shell :: SymbolFile/NativePDB/globals-bss.cpp (1746 of 1923) PASS: lldb-unit :: Platform/./LLDBPlatformTests/0/16 (1747 of 1923) UNSUPPORTED: lldb-shell :: SymbolFile/DWARF/split-optimized.c (1748 of 1923) UNSUPPORTED: lldb-shell :: Subprocess/fork-follow-child.test (1749 of 1923) PASS: lldb-unit :: SymbolFile/DWARF/./SymbolFileDWARFTests/19/29 (1750 of 1923) PASS: lldb-api :: lang/cpp/virtual-functions/TestCppVirtualFunctions.py (1751 of 1923) PASS: lldb-api :: functionalities/breakpoint/breakpoint_language/TestBreakpointLanguage.py (1752 of 1923) PASS: lldb-unit :: UnwindAssembly/x86/./UnwindAssemblyx86Tests/4/27 (1753 of 1923) PASS: lldb-api :: lang/cpp/namespace/TestNamespace.py (1754 of 1923) PASS: lldb-unit :: Platform/./LLDBPlatformTests/2/16 (1755 of 1923) PASS: lldb-api :: functionalities/scripted_process/TestScriptedProcess.py (1756 of 1923) PASS: lldb-shell :: SymbolFile/DWARF/x86/debug_aranges-empty-section.s (1757 of 1923) UNSUPPORTED: lldb-api :: commands/watchpoints/watchpoint_commands/command/TestWatchpointCommandLLDB.py (1758 of 1923) UNSUPPORTED: lldb-shell :: Subprocess/clone-follow-child-wp.test (1759 of 1923) UNSUPPORTED: lldb-api :: lang/cpp/limit-debug-info/TestWithLimitDebugInfo.py (1760 of 1923) PASS: lldb-shell :: ScriptInterpreter/None/import_module.test (1761 of 1923) PASS: lldb-api :: commands/expression/expr-in-syscall/TestExpressionInSyscall.py (1762 of 1923) PASS: lldb-api :: functionalities/tail_call_frames/thread_step_out_message/TestArtificialFrameStepOutMessage.py (1763 of 1923) UNSUPPORTED: lldb-api :: tools/lldb-server/thread-name/TestGdbRemoteThreadName.py (1764 of 1923) UNSUPPORTED: lldb-shell :: ScriptInterpreter/Lua/lua.test (1765 of 1923) UNSUPPORTED: lldb-shell :: Register/x86-64-ymm16-write.test (1766 of 1923) UNSUPPORTED: lldb-api :: lua_api/TestLuaAPI.py (1767 of 1923) UNSUPPORTED: lldb-api :: functionalities/thread/concurrent_events/TestConcurrentSignalWatchBreak.py (1768 of 1923) PASS: lldb-shell :: Commands/command-backtrace-parser-2.test (1769 of 1923) PASS: lldb-api :: functionalities/gdb_remote_client/TestMultiprocess.py (1770 of 1923) PASS: lldb-api :: lang/objc/modules-compile-error/TestModulesCompileError.py (1771 of 1923) PASS: lldb-api :: macosx/thread-names/TestInterruptThreadNames.py (1772 of 1923) PASS: lldb-api :: python_api/frame/get-variables/TestGetVariables.py (1773 of 1923) PASS: lldb-api :: lang/c/unicode/TestUnicodeSymbols.py (1774 of 1923) PASS: lldb-api :: functionalities/data-formatter/data-formatter-stl/generic/bitset/TestDataFormatterGenericBitset.py (1775 of 1923) PASS: lldb-api :: lang/cpp/dynamic-value/TestDynamicValue.py (1776 of 1923) PASS: lldb-api :: functionalities/data-formatter/user-format-vs-summary/TestUserFormatVsSummary.py (1777 of 1923) PASS: lldb-api :: functionalities/inferior-assert/TestInferiorAssert.py (1778 of 1923) PASS: lldb-unit :: Host/./HostTests/0/19 (1779 of 1923) UNSUPPORTED: lldb-api :: functionalities/thread/concurrent_events/TestConcurrentNWatchNBreak.py (1780 of 1923) PASS: lldb-unit :: SymbolFile/DWARF/./SymbolFileDWARFTests/21/29 (1781 of 1923) PASS: lldb-api :: functionalities/non-overlapping-index-variable-i/TestIndexVariable.py (1782 of 1923) PASS: lldb-unit :: SymbolFile/DWARF/./SymbolFileDWARFTests/1/29 (1783 of 1923) PASS: lldb-api :: assert_messages_test/TestAssertMessages.py (1784 of 1923) PASS: lldb-api :: functionalities/gdb_remote_client/TestPlatformClient.py (1785 of 1923) PASS: lldb-api :: iohandler/resize/TestIOHandlerResizeNoEditline.py (1786 of 1923) PASS: lldb-api :: linux/aarch64/non_address_bit_memory_access/TestAArch64LinuxNonAddressBitMemoryAccess.py (1787 of 1923) PASS: lldb-api :: functionalities/data-formatter/data-formatter-stl/libcxx/shared_ptr/TestDataFormatterLibcxxSharedPtr.py (1788 of 1923) PASS: lldb-unit :: Expression/./ExpressionTests/7/22 (1789 of 1923) PASS: lldb-unit :: Disassembler/x86/./GetControlFlowKindx86Tests/0/1 (1790 of 1923) PASS: lldb-api :: functionalities/thread/step_until/TestStepUntil.py (1791 of 1923) PASS: lldb-api :: functionalities/postmortem/wow64_minidump/TestWow64MiniDump.py (1792 of 1923) PASS: lldb-api :: lang/objc/objc-ivar-protocols/TestIvarProtocols.py (1793 of 1923) PASS: lldb-shell :: Unwind/trap_frame_sym_ctx.test (1794 of 1923) PASS: lldb-unit :: SymbolFile/DWARF/./SymbolFileDWARFTests/4/29 (1795 of 1923) PASS: lldb-unit :: SymbolFile/DWARF/./SymbolFileDWARFTests/2/29 (1796 of 1923) PASS: lldb-unit :: debugserver/./debugserverTests/5/6 (1797 of 1923) UNSUPPORTED: lldb-shell :: Register/x86-64-xmm16-write.test (1798 of 1923) PASS: lldb-api :: commands/expression/call-function/TestCallBuiltinFunction.py (1799 of 1923) PASS: lldb-api :: lang/c/stepping/TestThreadStepInAvoidRegexp.py (1800 of 1923) PASS: lldb-unit :: Language/Highlighting/./HighlighterTests/14/29 (1801 of 1923) PASS: lldb-api :: commands/expression/formatters/TestFormatters.py (1802 of 1923) PASS: lldb-unit :: Platform/./LLDBPlatformTests/10/16 (1803 of 1923) PASS: lldb-unit :: Target/./TargetTests/11/19 (1804 of 1923) PASS: lldb-shell :: Process/Optimization.test (1805 of 1923) UNSUPPORTED: lldb-shell :: Expr/TestIRMemoryMapWindows.test (1806 of 1923) PASS: lldb-shell :: SymbolFile/Breakpad/line-table-edgecases.test (1807 of 1923) PASS: lldb-api :: lang/objc/foundation/TestRuntimeTypes.py (1808 of 1923) PASS: lldb-api :: lang/objc/variadic_methods/TestVariadicMethods.py (1809 of 1923) UNSUPPORTED: lldb-api :: tools/lldb-server/TestGdbRemoteThreadsInStopReply.py (1810 of 1923) UNSUPPORTED: lldb-shell :: Register/x86-gp-read.test (1811 of 1923) PASS: lldb-api :: commands/expression/import-std-module/vector-of-vectors/TestVectorOfVectorsFromStdModule.py (1812 of 1923) PASS: lldb-shell :: SymbolFile/DWARF/x86/debug_loclists-dwp.s (1813 of 1923) PASS: lldb-api :: macosx/save_crashlog/TestSaveCrashlog.py (1814 of 1923) PASS: lldb-api :: commands/quit/TestQuit.py (1815 of 1923) PASS: lldb-api :: functionalities/breakpoint/breakpoint_command/TestRegexpBreakCommand.py (1816 of 1923) UNSUPPORTED: lldb-shell :: SymbolFile/DWARF/x86/dir-separator-no-comp-dir.s (1817 of 1923) PASS: lldb-unit :: Process/gdb-remote/./ProcessGdbRemoteTests/15/19 (1818 of 1923) PASS: lldb-shell :: Commands/command-stop-hook-output.test (1819 of 1923) PASS: lldb-unit :: Process/gdb-remote/./ProcessGdbRemoteTests/5/19 (1820 of 1923) PASS: lldb-unit :: SymbolFile/DWARF/./SymbolFileDWARFTests/26/29 (1821 of 1923) UNSUPPORTED: lldb-api :: commands/expression/import-std-module/stack/TestStackFromStdModule.py (1822 of 1923) PASS: lldb-shell :: ObjectFile/ELF/null-jmprel.yaml (1823 of 1923) UNSUPPORTED: lldb-shell :: SymbolFile/PDB/enums-layout.test (1824 of 1923) PASS: lldb-unit :: Utility/./UtilityTests/28/30 (1825 of 1923) PASS: lldb-api :: functionalities/data-formatter/data-formatter-objc/TestDataFormatterObjCNSNumber.py (1826 of 1923) PASS: lldb-unit :: ObjectFile/ELF/./ObjectFileELFTests/1/4 (1827 of 1923) PASS: lldb-api :: lang/objc/objc-static-method-stripped/TestObjCStaticMethodStripped.py (1828 of 1923) PASS: lldb-shell :: BuildScript/toolchain-clang.test (1829 of 1923) PASS: lldb-unit :: Symbol/./SymbolTests/5/16 (1830 of 1923) PASS: lldb-api :: functionalities/data-formatter/data-formatter-objc/nsstring/TestDataFormatterNSString.py (1831 of 1923) PASS: lldb-unit :: Language/Highlighting/./HighlighterTests/4/29 (1832 of 1923) PASS: lldb-api :: python_api/module_section/TestModuleAndSection.py (1833 of 1923) PASS: lldb-api :: lang/objc/objc-runtime-ivars/TestRuntimeIvars.py (1834 of 1923) PASS: lldb-api :: lang/c/global_variables/TestGlobalVariables.py (1835 of 1923) PASS: lldb-shell :: ScriptInterpreter/Python/sb_address_exception.test (1836 of 1923) PASS: lldb-api :: lang/c/stepping/TestThreadStepping.py (1837 of 1923) UNSUPPORTED: lldb-shell :: Unwind/unwind-plan-dwarf-dump.test (1838 of 1923) PASS: lldb-api :: functionalities/data-formatter/vector-types/TestVectorTypesFormatting.py (1839 of 1923) PASS: lldb-api :: commands/reproducer/invalid-args/TestInvalidArgsReproducer.py (1840 of 1923) PASS: lldb-api :: lang/c/enum_types/TestEnumTypes.py (1841 of 1923) PASS: lldb-api :: commands/frame/var-scope/TestFrameVariableScope.py (1842 of 1923) UNSUPPORTED: lldb-api :: tools/lldb-server/commandline/TestGdbRemoteConnection.py (1843 of 1923) PASS: lldb-shell :: ObjectFile/PECOFF/sections-names.yaml (1844 of 1923) PASS: lldb-api :: commands/process/attach-resume/TestAttachResume.py (1845 of 1923) PASS: lldb-shell :: ObjectFile/ELF/minidebuginfo-corrupt-xz.yaml (1846 of 1923) PASS: lldb-shell :: Minidump/disassemble-no-module.yaml (1847 of 1923) PASS: lldb-api :: lang/cpp/class_types/TestClassTypesDisassembly.py (1848 of 1923) PASS: lldb-api :: lang/c/tls_globals/TestTlsGlobals.py (1849 of 1923) UNSUPPORTED: lldb-shell :: SymbolFile/PDB/type-quals.test (1850 of 1923) PASS: lldb-api :: functionalities/data-formatter/data-formatter-enum-format/TestDataFormatterEnumFormat.py (1851 of 1923) PASS: lldb-api :: lang/cpp/multiple-inheritance/TestCppMultipleInheritance.py (1852 of 1923) PASS: lldb-api :: functionalities/unwind/noreturn/TestNoreturnUnwind.py (1853 of 1923) PASS: lldb-api :: lang/c/complex_int/TestComplexInt.py (1854 of 1923) UNSUPPORTED: lldb-shell :: SymbolFile/DWARF/x86/find-basic-namespace.cpp (1855 of 1923) PASS: lldb-unit :: Symbol/./SymbolTests/1/16 (1856 of 1923) UNSUPPORTED: lldb-shell :: Unwind/basic-block-sections.test (1857 of 1923) PASS: lldb-unit :: SymbolFile/NativePDB/./SymbolFileNativePDBTests/5/15 (1858 of 1923) PASS: lldb-api :: commands/frame/recognizer/TestFrameRecognizer.py (1859 of 1923) UNSUPPORTED: lldb-shell :: BuildScript/toolchain-clang-cl.test (1860 of 1923) PASS: lldb-unit :: Symbol/./SymbolTests/9/16 (1861 of 1923) PASS: lldb-shell :: Settings/TestSettingsSet.test (1862 of 1923) PASS: lldb-unit :: ObjectFile/PECOFF/./ObjectFilePECOFFTests/0/3 (1863 of 1923) PASS: lldb-unit :: Host/./HostTests/6/19 (1864 of 1923) PASS: lldb-api :: lang/cpp/signed_types/TestSignedTypes.py (1865 of 1923) PASS: lldb-api :: commands/expression/pr52257/TestExprCrash.py (1866 of 1923) PASS: lldb-unit :: Symbol/./SymbolTests/10/16 (1867 of 1923) PASS: lldb-api :: functionalities/module_cache/bsd/TestModuleCacheBSD.py (1868 of 1923) PASS: lldb-shell :: Minidump/Windows/Sigsegv/sigsegv.test (1869 of 1923) PASS: lldb-api :: lang/objc/hidden-ivars/TestHiddenIvars.py (1870 of 1923) PASS: lldb-api :: functionalities/data-formatter/data-formatter-disabling/TestDataFormatterDisabling.py (1871 of 1923) PASS: lldb-unit :: ScriptInterpreter/Python/./ScriptInterpreterPythonTests/0/19 (1872 of 1923) UNSUPPORTED: lldb-api :: commands/expression/namespace_local_var_same_name_cpp_and_c/TestNamespaceLocalVarSameNameCppAndC.py (1873 of 1923) PASS: lldb-api :: qemu/TestQemuAPI.py (1874 of 1923) PASS: lldb-api :: functionalities/data-formatter/cstring-utf8-summary/TestCstringUnicode.py (1875 of 1923) PASS: lldb-unit :: ObjectFile/MachO/./ObjectFileMachOTests/0/2 (1876 of 1923) PASS: lldb-api :: lang/objc/real-definition/TestRealDefinition.py (1877 of 1923) PASS: lldb-shell :: ObjectFile/ELF/short-build-id.yaml (1878 of 1923) PASS: lldb-api :: source-manager/TestSourceManager.py (1879 of 1923) PASS: lldb-api :: functionalities/memory/find/TestMemoryFind.py (1880 of 1923) PASS: lldb-api :: commands/expression/import-std-module/retry-with-std-module/TestRetryWithStdModule.py (1881 of 1923) PASS: lldb-unit :: Process/gdb-remote/./ProcessGdbRemoteTests/12/19 (1882 of 1923) UNSUPPORTED: lldb-api :: tools/lldb-server/register-reading/TestGdbRemoteGPacket.py (1883 of 1923) PASS: lldb-unit :: Utility/./UtilityTests/15/30 (1884 of 1923) PASS: lldb-api :: commands/expression/import-std-module/vector/TestVectorFromStdModule.py (1885 of 1923) PASS: lldb-api :: lang/cpp/wchar_t/TestCxxWCharT.py (1886 of 1923) PASS: lldb-api :: lang/objc/objc_direct-methods/TestObjCDirectMethods.py (1887 of 1923) PASS: lldb-shell :: ObjectFile/wasm/embedded-debug-sections.yaml (1888 of 1923) PASS: lldb-api :: lang/c/forward/TestForwardDeclaration.py (1889 of 1923) PASS: lldb-unit :: Language/Highlighting/./HighlighterTests/1/29 (1890 of 1923) PASS: lldb-unit :: Core/./LLDBCoreTests/0/22 (1891 of 1923) PASS: lldb-api :: commands/expression/dollar-in-variable/TestDollarInVariable.py (1892 of 1923) PASS: lldb-api :: commands/platform/basic/TestPlatformPython.py (1893 of 1923) UNSUPPORTED: lldb-shell :: SymbolFile/PDB/variables-locations.test (1894 of 1923) PASS: lldb-api :: commands/target/dump/TestTargetDumpTypeSystem.py (1895 of 1923) UNSUPPORTED: lldb-shell :: SymbolFile/DWARF/x86/debug-types-address-ranges.s (1896 of 1923) UNSUPPORTED: lldb-shell :: SymbolFile/DWARF/x86/debug-types-dwo-cross-reference.cpp (1897 of 1923) PASS: lldb-shell :: SymbolFile/DWARF/x86/find-qualified-variable.cpp (1898 of 1923) UNSUPPORTED: lldb-shell :: Subprocess/vfork-follow-parent-softbp.test (1899 of 1923) PASS: lldb-api :: lang/cpp/class-template-non-type-parameter-pack/TestClassTemplateNonTypeParameterPack.py (1900 of 1923) PASS: lldb-shell :: Driver/TestPageZeroRead.test (1901 of 1923) PASS: lldb-api :: lang/cpp/break-on-initializers/TestBreakOnCPP11Initializers.py (1902 of 1923) UNSUPPORTED: lldb-api :: macosx/corefile-exception-reason/TestCorefileExceptionReason.py (1903 of 1923) PASS: lldb-unit :: UnwindAssembly/x86/./UnwindAssemblyx86Tests/10/27 (1904 of 1923) PASS: lldb-shell :: Register/Core/x86-64-netbsd-fp.test (1905 of 1923) PASS: lldb-api :: commands/expression/invalid-args/TestInvalidArgsExpression.py (1906 of 1923) PASS: lldb-shell :: ObjectFile/ELF/gnu-debuglink.yaml (1907 of 1923) UNSUPPORTED: lldb-shell :: Register/x86-gp-write.test (1908 of 1923) PASS: lldb-api :: python_api/value/change_values/TestChangeValueAPI.py (1909 of 1923) PASS: lldb-api :: functionalities/gdb_remote_client/TestWriteMemory.py (1910 of 1923) PASS: lldb-api :: lang/objc/objc-static-method/TestObjCStaticMethod.py (1911 of 1923) PASS: lldb-api :: lang/objc/objc-new-syntax/TestObjCNewSyntaxArray.py (1912 of 1923) PASS: lldb-api :: functionalities/load_unload/TestLoadUnload.py (1913 of 1923) PASS: lldb-api :: lang/cpp/scratch-context-merging/structs/TestCppScratchContextMergingStructs.py (1914 of 1923) PASS: lldb-api :: lang/cpp/class-template-parameter-pack/TestClassTemplateParameterPack.py (1915 of 1923) PASS: lldb-api :: functionalities/thread/concurrent_events/TestConcurrentSignalBreak.py (1916 of 1923) PASS: lldb-api :: commands/expression/save_jit_objects/TestSaveJITObjects.py (1917 of 1923) PASS: lldb-api :: commands/target/stop-hooks/TestStopHookScripted.py (1918 of 1923) PASS: lldb-api :: lang/objcxx/objcxx-ivar-vector/TestIvarVector.py (1919 of 1923) PASS: lldb-api :: functionalities/limit-debug-info/TestLimitDebugInfo.py (1920 of 1923) UNSUPPORTED: lldb-api :: lang/objc/objc-dynamic-value/TestObjCDynamicValue.py (1921 of 1923) PASS: lldb-api :: functionalities/data-formatter/data-formatter-stl/generic/deque/TestDataFormatterGenericDeque.py (1922 of 1923) PASS: lldb-api :: api/multithreaded/TestMultithreaded.py (1923 of 1923) Slowest Tests: -------------------------------------------------------------------------- 73.61s: lldb-api :: commands/process/attach/TestProcessAttach.py 69.99s: lldb-api :: api/multithreaded/TestMultithreaded.py 68.08s: lldb-api :: lang/objc/foundation/TestFoundationDisassembly.py 46.47s: lldb-api :: lang/objc/hidden-ivars/TestHiddenIvars.py 45.91s: lldb-api :: functionalities/completion/TestCompletion.py 44.42s: lldb-api :: functionalities/load_unload/TestLoadUnload.py 42.63s: lldb-api :: lang/objc/exceptions/TestObjCExceptions.py 37.84s: lldb-api :: python_api/target/TestTargetAPI.py 37.35s: lldb-api :: types/TestLongTypesExpr.py 33.25s: lldb-api :: lang/objc/objc-new-syntax/TestObjCNewSyntaxLiteral.py 32.73s: lldb-api :: lang/cpp/namespace/TestNamespaceLookup.py 32.60s: lldb-api :: lang/objc/foundation/TestObjCMethods.py 32.30s: lldb-api :: functionalities/gdb_remote_client/TestPlatformMacOSX.py 31.24s: lldb-api :: lang/objc/real-definition/TestRealDefinition.py 28.99s: lldb-api :: commands/settings/TestSettings.py 27.10s: lldb-api :: types/TestLongTypes.py 26.00s: lldb-api :: functionalities/limit-debug-info/TestLimitDebugInfo.py 25.92s: lldb-api :: tools/lldb-vscode/evaluate/TestVSCode_evaluate.py 25.85s: lldb-api :: types/TestIntegerTypeExpr.py 25.81s: lldb-api :: lang/objc/objc-new-syntax/TestObjCNewSyntaxArray.py

Hide Details

Tests Times: -------------------------------------------------------------------------- [ Range ] :: [ Percentage ] :: [ Count ] -------------------------------------------------------------------------- [70.0s,75.0s) :: [ ] :: [ 2/1843] [65.0s,70.0s) :: [ ] :: [ 1/1843] [60.0s,65.0s) :: [ ] :: [ 0/1843] [55.0s,60.0s) :: [ ] :: [ 0/1843] [50.0s,55.0s) :: [ ] :: [ 0/1843] [45.0s,50.0s) :: [ ] :: [ 3/1843] [40.0s,45.0s) :: [ ] :: [ 1/1843] [35.0s,40.0s) :: [ ] :: [ 2/1843] [30.0s,35.0s) :: [ ] :: [ 5/1843] [25.0s,30.0s) :: [ ] :: [ 8/1843] [20.0s,25.0s) :: [ ] :: [ 15/1843] [15.0s,20.0s) :: [ ] :: [ 42/1843] [10.0s,15.0s) :: [** ] :: [ 106/1843] [ 5.0s,10.0s) :: [******* ] :: [ 333/1843] [ 0.0s, 5.0s) :: [**************************** ] :: [1325/1843] -------------------------------------------------------------------------- ******************** Failed Tests (1): lldb-api :: lang/cpp/const_static_integral_member/TestConstStaticIntegralMember.py

Hide Details

Hide Details

Testing Time: 490.79s Unsupported : 364 Passed : 2237 Expectedly Failed: 10 Failed : 1 FAILED: tools/lldb/test/CMakeFiles/check-lldb /Users/buildslave/jenkins/workspace/lldb-cmake-matrix/lldb-build/tools/lldb/test/CMakeFiles/check-lldb cd /Users/buildslave/jenkins/workspace/lldb-cmake-matrix/lldb-build/tools/lldb/test && /Applications/Xcode.app/Contents/Developer/Library/Frameworks/Python3.framework/Versions/3.8/bin/python3.8 /Users/buildslave/jenkins/workspace/lldb-cmake-matrix/lldb-build/./bin/llvm-lit -v --time-tests --shuffle --xunit-xml-output=/Users/buildslave/jenkins/workspace/lldb-cmake-matrix/test/results.xml -v /Users/buildslave/jenkins/workspace/lldb-cmake-matrix/lldb-build/tools/lldb/test ninja: build stopped: subcommand failed. Command failed: Command '['/usr/bin/env', 'TERM=vt100', '/usr/local/bin/ninja', '-v', 'check-lldb']' returned non-zero exit status 1. Command: ['/usr/bin/env', 'TERM=vt100', '/usr/local/bin/ninja', '-v', 'check-lldb'] + set -e [Pipeline] } [Pipeline] // timeout [Pipeline] junit Recording test results [Checks API] No suitable checks publisher found. [Pipeline] } [Pipeline] // stage [Pipeline] } [Pipeline] // withEnv [Pipeline] } [Pipeline] // node [Pipeline] End of Pipeline Finished: UNSTABLE