Regression

Test Clang 7.0.1 / lldb-api.lang/cpp/bitfields.TestCppBitfields.py (from lldb-api)

Failing for the past 1 build (Since #5017 )
Took 2.4 sec.

Stacktrace

Script:
--
/Applications/Xcode.app/Contents/Developer/Library/Frameworks/Python3.framework/Versions/3.8/bin/python3.8 /Users/buildslave/jenkins/workspace/lldb-cmake-matrix/llvm-project/lldb/test/API/dotest.py -u CXXFLAGS -u CFLAGS --codesign-identity lldb_codesign --arch x86_64 --build-dir /Users/buildslave/jenkins/workspace/lldb-cmake-matrix/lldb-build/lldb-test-build.noindex -t --env TERM=vt100 --skip-category gmodules --skip-category watchpoint --skip-category llgs --skip-category debugserver --arch=x86_64 --env LLVM_LIBS_DIR=/Users/buildslave/jenkins/workspace/lldb-cmake-matrix/lldb-build/./lib --env LLVM_INCLUDE_DIR=/Users/buildslave/jenkins/workspace/lldb-cmake-matrix/lldb-build/include --env LLVM_TOOLS_DIR=/Users/buildslave/jenkins/workspace/lldb-cmake-matrix/lldb-build/./bin --hermetic-libcxx --arch x86_64 --build-dir /Users/buildslave/jenkins/workspace/lldb-cmake-matrix/lldb-build/lldb-test-build.noindex --lldb-module-cache-dir /Users/buildslave/jenkins/workspace/lldb-cmake-matrix/lldb-build/lldb-test-build.noindex/module-cache-lldb/lldb-api --clang-module-cache-dir /Users/buildslave/jenkins/workspace/lldb-cmake-matrix/lldb-build/lldb-test-build.noindex/module-cache-clang/lldb-api --executable /Users/buildslave/jenkins/workspace/lldb-cmake-matrix/lldb-build/./bin/lldb --compiler /Users/buildslave/jenkins/workspace/lldb-cmake-matrix/clang_701_build/bin/clang --dsymutil /Users/buildslave/jenkins/workspace/lldb-cmake-matrix/lldb-build/./bin/dsymutil --llvm-tools-dir /Users/buildslave/jenkins/workspace/lldb-cmake-matrix/lldb-build/./bin --lldb-libs-dir /Users/buildslave/jenkins/workspace/lldb-cmake-matrix/lldb-build/./lib /Users/buildslave/jenkins/workspace/lldb-cmake-matrix/llvm-project/lldb/test/API/lang/cpp/bitfields -p TestCppBitfields.py
--
Exit Code: 1

Command Output (stdout):
--
lldb version 16.0.99git (http://labmaster3.local/git/llvm-project.git revision db008af501534d4590542253ae3acf783986f5f7)
  clang revision db008af501534d4590542253ae3acf783986f5f7
  llvm revision db008af501534d4590542253ae3acf783986f5f7
Skipping the following test categories: ['gmodules', 'watchpoint', 'llgs', 'debugserver', 'libstdcxx', 'dwo', 'llgs', 'fork']

--
Command Output (stderr):
--
Change dir to: /Users/buildslave/jenkins/workspace/lldb-cmake-matrix/llvm-project/lldb/test/API/lang/cpp/bitfields
runCmd: settings clear -all
output: 

runCmd: settings set symbols.enable-external-lookup false
output: 

runCmd: settings set target.inherit-tcc true
output: 

runCmd: settings set target.detach-on-error false
output: 

runCmd: settings set target.auto-apply-fixits false
output: 

runCmd: settings set plugin.process.gdb-remote.packet-timeout 60
output: 

runCmd: settings set symbols.clang-modules-cache-path "/Users/buildslave/jenkins/workspace/lldb-cmake-matrix/lldb-build/lldb-test-build.noindex/module-cache-lldb/lldb-api"
output: 

runCmd: settings set use-color false
output: 

runCmd: setting set target.prefer-dynamic-value no-dynamic-values
output: 

make VPATH=/Users/buildslave/jenkins/workspace/lldb-cmake-matrix/llvm-project/lldb/test/API/lang/cpp/bitfields -C /Users/buildslave/jenkins/workspace/lldb-cmake-matrix/lldb-build/lldb-test-build.noindex/lang/cpp/bitfields/TestCppBitfields.test_bitfield_behind_vtable_ptr -I /Users/buildslave/jenkins/workspace/lldb-cmake-matrix/llvm-project/lldb/test/API/lang/cpp/bitfields -I /Users/buildslave/jenkins/workspace/lldb-cmake-matrix/llvm-project/lldb/packages/Python/lldbsuite/test/make -f /Users/buildslave/jenkins/workspace/lldb-cmake-matrix/llvm-project/lldb/test/API/lang/cpp/bitfields/Makefile all ARCH=x86_64 'CC="/Users/buildslave/jenkins/workspace/lldb-cmake-matrix/clang_701_build/bin/clang"' DSYMUTIL=/Users/buildslave/jenkins/workspace/lldb-cmake-matrix/lldb-build/./bin/dsymutil CODESIGN=codesign CLANG_MODULE_CACHE_DIR=/Users/buildslave/jenkins/workspace/lldb-cmake-matrix/lldb-build/lldb-test-build.noindex/module-cache-clang/lldb-api USE_HERMETIC_LIBCPP=1

FAIL: LLDB (/Users/buildslave/jenkins/workspace/lldb-cmake-matrix/clang_701_build/bin/clang-x86_64) :: test_bitfield_behind_vtable_ptr (TestCppBitfields.CppBitfieldsTestCase)
runCmd: settings clear -all
output: 

runCmd: settings set symbols.enable-external-lookup false
output: 

runCmd: settings set target.inherit-tcc true
output: 

runCmd: settings set target.detach-on-error false
output: 

runCmd: settings set target.auto-apply-fixits false
output: 

runCmd: settings set plugin.process.gdb-remote.packet-timeout 60
output: 

runCmd: settings set symbols.clang-modules-cache-path "/Users/buildslave/jenkins/workspace/lldb-cmake-matrix/lldb-build/lldb-test-build.noindex/module-cache-lldb/lldb-api"
output: 

runCmd: settings set use-color false
output: 

runCmd: setting set target.prefer-dynamic-value no-dynamic-values
output: 

make VPATH=/Users/buildslave/jenkins/workspace/lldb-cmake-matrix/llvm-project/lldb/test/API/lang/cpp/bitfields -C /Users/buildslave/jenkins/workspace/lldb-cmake-matrix/lldb-build/lldb-test-build.noindex/lang/cpp/bitfields/TestCppBitfields.test_bitfields -I /Users/buildslave/jenkins/workspace/lldb-cmake-matrix/llvm-project/lldb/test/API/lang/cpp/bitfields -I /Users/buildslave/jenkins/workspace/lldb-cmake-matrix/llvm-project/lldb/packages/Python/lldbsuite/test/make -f /Users/buildslave/jenkins/workspace/lldb-cmake-matrix/llvm-project/lldb/test/API/lang/cpp/bitfields/Makefile all ARCH=x86_64 'CC="/Users/buildslave/jenkins/workspace/lldb-cmake-matrix/clang_701_build/bin/clang"' DSYMUTIL=/Users/buildslave/jenkins/workspace/lldb-cmake-matrix/lldb-build/./bin/dsymutil CODESIGN=codesign CLANG_MODULE_CACHE_DIR=/Users/buildslave/jenkins/workspace/lldb-cmake-matrix/lldb-build/lldb-test-build.noindex/module-cache-clang/lldb-api USE_HERMETIC_LIBCPP=1

FAIL: LLDB (/Users/buildslave/jenkins/workspace/lldb-cmake-matrix/clang_701_build/bin/clang-x86_64) :: test_bitfields (TestCppBitfields.CppBitfieldsTestCase)
Restore dir to: /Users/buildslave/jenkins/workspace/lldb-cmake-matrix/lldb-build/tools/lldb/test
======================================================================
ERROR: test_bitfield_behind_vtable_ptr (TestCppBitfields.CppBitfieldsTestCase)
----------------------------------------------------------------------
Error when building test subject.

Build Command:
make VPATH=/Users/buildslave/jenkins/workspace/lldb-cmake-matrix/llvm-project/lldb/test/API/lang/cpp/bitfields -C /Users/buildslave/jenkins/workspace/lldb-cmake-matrix/lldb-build/lldb-test-build.noindex/lang/cpp/bitfields/TestCppBitfields.test_bitfield_behind_vtable_ptr -I /Users/buildslave/jenkins/workspace/lldb-cmake-matrix/llvm-project/lldb/test/API/lang/cpp/bitfields -I /Users/buildslave/jenkins/workspace/lldb-cmake-matrix/llvm-project/lldb/packages/Python/lldbsuite/test/make -f /Users/buildslave/jenkins/workspace/lldb-cmake-matrix/llvm-project/lldb/test/API/lang/cpp/bitfields/Makefile all ARCH=x86_64 'CC="/Users/buildslave/jenkins/workspace/lldb-cmake-matrix/clang_701_build/bin/clang"' DSYMUTIL=/Users/buildslave/jenkins/workspace/lldb-cmake-matrix/lldb-build/./bin/dsymutil CODESIGN=codesign CLANG_MODULE_CACHE_DIR=/Users/buildslave/jenkins/workspace/lldb-cmake-matrix/lldb-build/lldb-test-build.noindex/module-cache-clang/lldb-api USE_HERMETIC_LIBCPP=1

Build Command Output:
"/Users/buildslave/jenkins/workspace/lldb-cmake-matrix/clang_701_build/bin/clang"  -std=c++11 -g -O0 -isysroot "/Applications/Xcode.app/Contents/Developer/Platforms/MacOSX.platform/Developer/SDKs/MacOSX11.1.sdk" -arch x86_64  -I/Users/buildslave/jenkins/workspace/lldb-cmake-matrix/llvm-project/lldb/packages/Python/lldbsuite/test/make/../../../../../include -I/Users/buildslave/jenkins/workspace/lldb-cmake-matrix/llvm-project/lldb/test/API/lang/cpp/bitfields -I/Users/buildslave/jenkins/workspace/lldb-cmake-matrix/llvm-project/lldb/packages/Python/lldbsuite/test/make -include /Users/buildslave/jenkins/workspace/lldb-cmake-matrix/llvm-project/lldb/packages/Python/lldbsuite/test/make/test_common.h  -fno-limit-debug-info     --driver-mode=g++ -MT main.o -MD -MP -MF main.d -c -o main.o /Users/buildslave/jenkins/workspace/lldb-cmake-matrix/llvm-project/lldb/test/API/lang/cpp/bitfields/main.cpp
/Users/buildslave/jenkins/workspace/lldb-cmake-matrix/llvm-project/lldb/test/API/lang/cpp/bitfields/main.cpp:22:5: error: unknown type name 'uint64_t'
    uint64_t : 13;
    ^
/Users/buildslave/jenkins/workspace/lldb-cmake-matrix/llvm-project/lldb/test/API/lang/cpp/bitfields/main.cpp:23:5: error: unknown type name 'uint64_t'
    uint64_t : 9;
    ^
/Users/buildslave/jenkins/workspace/lldb-cmake-matrix/llvm-project/lldb/test/API/lang/cpp/bitfields/main.cpp:25:5: error: unknown type name 'uint64_t'
    uint64_t a : 1;
    ^
/Users/buildslave/jenkins/workspace/lldb-cmake-matrix/llvm-project/lldb/test/API/lang/cpp/bitfields/main.cpp:26:5: error: unknown type name 'uint64_t'
    uint64_t b : 1;
    ^
/Users/buildslave/jenkins/workspace/lldb-cmake-matrix/llvm-project/lldb/test/API/lang/cpp/bitfields/main.cpp:27:5: error: unknown type name 'uint64_t'
    uint64_t c : 1;
    ^
/Users/buildslave/jenkins/workspace/lldb-cmake-matrix/llvm-project/lldb/test/API/lang/cpp/bitfields/main.cpp:28:5: error: unknown type name 'uint64_t'
    uint64_t d : 1;
    ^
/Users/buildslave/jenkins/workspace/lldb-cmake-matrix/llvm-project/lldb/test/API/lang/cpp/bitfields/main.cpp:29:5: error: unknown type name 'uint64_t'
    uint64_t e : 1;
    ^
/Users/buildslave/jenkins/workspace/lldb-cmake-matrix/llvm-project/lldb/test/API/lang/cpp/bitfields/main.cpp:30:5: error: unknown type name 'uint64_t'
    uint64_t f : 1;
    ^
/Users/buildslave/jenkins/workspace/lldb-cmake-matrix/llvm-project/lldb/test/API/lang/cpp/bitfields/main.cpp:31:5: error: unknown type name 'uint64_t'
    uint64_t g : 1;
    ^
/Users/buildslave/jenkins/workspace/lldb-cmake-matrix/llvm-project/lldb/test/API/lang/cpp/bitfields/main.cpp:32:5: error: unknown type name 'uint64_t'
    uint64_t h : 1;
    ^
/Users/buildslave/jenkins/workspace/lldb-cmake-matrix/llvm-project/lldb/test/API/lang/cpp/bitfields/main.cpp:33:5: error: unknown type name 'uint64_t'
    uint64_t i : 1;
    ^
/Users/buildslave/jenkins/workspace/lldb-cmake-matrix/llvm-project/lldb/test/API/lang/cpp/bitfields/main.cpp:34:5: error: unknown type name 'uint64_t'
    uint64_t j : 1;
    ^
/Users/buildslave/jenkins/workspace/lldb-cmake-matrix/llvm-project/lldb/test/API/lang/cpp/bitfields/main.cpp:35:5: error: unknown type name 'uint64_t'
    uint64_t k : 1;
    ^
/Users/buildslave/jenkins/workspace/lldb-cmake-matrix/llvm-project/lldb/test/API/lang/cpp/bitfields/main.cpp:47:5: error: use of undeclared identifier 'f'
    f.a = 1;
    ^
/Users/buildslave/jenkins/workspace/lldb-cmake-matrix/llvm-project/lldb/test/API/lang/cpp/bitfields/main.cpp:48:5: error: use of undeclared identifier 'f'
    f.b = 0;
    ^
/Users/buildslave/jenkins/workspace/lldb-cmake-matrix/llvm-project/lldb/test/API/lang/cpp/bitfields/main.cpp:49:5: error: use of undeclared identifier 'f'
    f.c = 1;
    ^
/Users/buildslave/jenkins/workspace/lldb-cmake-matrix/llvm-project/lldb/test/API/lang/cpp/bitfields/main.cpp:50:5: error: use of undeclared identifier 'f'
    f.d = 0;
    ^
/Users/buildslave/jenkins/workspace/lldb-cmake-matrix/llvm-project/lldb/test/API/lang/cpp/bitfields/main.cpp:51:5: error: use of undeclared identifier 'f'
    f.e = 1;
    ^
/Users/buildslave/jenkins/workspace/lldb-cmake-matrix/llvm-project/lldb/test/API/lang/cpp/bitfields/main.cpp:52:5: error: use of undeclared identifier 'f'
    f.f = 0;
    ^
fatal error: too many errors emitted, stopping now [-ferror-limit=]
20 errors generated.
make: *** [main.o] Error 1

Test Directory:
/Users/buildslave/jenkins/workspace/lldb-cmake-matrix/llvm-project/lldb/test/API/lang/cpp/bitfields
======================================================================
ERROR: test_bitfields (TestCppBitfields.CppBitfieldsTestCase)
----------------------------------------------------------------------
Error when building test subject.

Build Command:
make VPATH=/Users/buildslave/jenkins/workspace/lldb-cmake-matrix/llvm-project/lldb/test/API/lang/cpp/bitfields -C /Users/buildslave/jenkins/workspace/lldb-cmake-matrix/lldb-build/lldb-test-build.noindex/lang/cpp/bitfields/TestCppBitfields.test_bitfields -I /Users/buildslave/jenkins/workspace/lldb-cmake-matrix/llvm-project/lldb/test/API/lang/cpp/bitfields -I /Users/buildslave/jenkins/workspace/lldb-cmake-matrix/llvm-project/lldb/packages/Python/lldbsuite/test/make -f /Users/buildslave/jenkins/workspace/lldb-cmake-matrix/llvm-project/lldb/test/API/lang/cpp/bitfields/Makefile all ARCH=x86_64 'CC="/Users/buildslave/jenkins/workspace/lldb-cmake-matrix/clang_701_build/bin/clang"' DSYMUTIL=/Users/buildslave/jenkins/workspace/lldb-cmake-matrix/lldb-build/./bin/dsymutil CODESIGN=codesign CLANG_MODULE_CACHE_DIR=/Users/buildslave/jenkins/workspace/lldb-cmake-matrix/lldb-build/lldb-test-build.noindex/module-cache-clang/lldb-api USE_HERMETIC_LIBCPP=1

Build Command Output:
"/Users/buildslave/jenkins/workspace/lldb-cmake-matrix/clang_701_build/bin/clang"  -std=c++11 -g -O0 -isysroot "/Applications/Xcode.app/Contents/Developer/Platforms/MacOSX.platform/Developer/SDKs/MacOSX11.1.sdk" -arch x86_64  -I/Users/buildslave/jenkins/workspace/lldb-cmake-matrix/llvm-project/lldb/packages/Python/lldbsuite/test/make/../../../../../include -I/Users/buildslave/jenkins/workspace/lldb-cmake-matrix/llvm-project/lldb/test/API/lang/cpp/bitfields -I/Users/buildslave/jenkins/workspace/lldb-cmake-matrix/llvm-project/lldb/packages/Python/lldbsuite/test/make -include /Users/buildslave/jenkins/workspace/lldb-cmake-matrix/llvm-project/lldb/packages/Python/lldbsuite/test/make/test_common.h  -fno-limit-debug-info     --driver-mode=g++ -MT main.o -MD -MP -MF main.d -c -o main.o /Users/buildslave/jenkins/workspace/lldb-cmake-matrix/llvm-project/lldb/test/API/lang/cpp/bitfields/main.cpp
/Users/buildslave/jenkins/workspace/lldb-cmake-matrix/llvm-project/lldb/test/API/lang/cpp/bitfields/main.cpp:22:5: error: unknown type name 'uint64_t'
    uint64_t : 13;
    ^
/Users/buildslave/jenkins/workspace/lldb-cmake-matrix/llvm-project/lldb/test/API/lang/cpp/bitfields/main.cpp:23:5: error: unknown type name 'uint64_t'
    uint64_t : 9;
    ^
/Users/buildslave/jenkins/workspace/lldb-cmake-matrix/llvm-project/lldb/test/API/lang/cpp/bitfields/main.cpp:25:5: error: unknown type name 'uint64_t'
    uint64_t a : 1;
    ^
/Users/buildslave/jenkins/workspace/lldb-cmake-matrix/llvm-project/lldb/test/API/lang/cpp/bitfields/main.cpp:26:5: error: unknown type name 'uint64_t'
    uint64_t b : 1;
    ^
/Users/buildslave/jenkins/workspace/lldb-cmake-matrix/llvm-project/lldb/test/API/lang/cpp/bitfields/main.cpp:27:5: error: unknown type name 'uint64_t'
    uint64_t c : 1;
    ^
/Users/buildslave/jenkins/workspace/lldb-cmake-matrix/llvm-project/lldb/test/API/lang/cpp/bitfields/main.cpp:28:5: error: unknown type name 'uint64_t'
    uint64_t d : 1;
    ^
/Users/buildslave/jenkins/workspace/lldb-cmake-matrix/llvm-project/lldb/test/API/lang/cpp/bitfields/main.cpp:29:5: error: unknown type name 'uint64_t'
    uint64_t e : 1;
    ^
/Users/buildslave/jenkins/workspace/lldb-cmake-matrix/llvm-project/lldb/test/API/lang/cpp/bitfields/main.cpp:30:5: error: unknown type name 'uint64_t'
    uint64_t f : 1;
    ^
/Users/buildslave/jenkins/workspace/lldb-cmake-matrix/llvm-project/lldb/test/API/lang/cpp/bitfields/main.cpp:31:5: error: unknown type name 'uint64_t'
    uint64_t g : 1;
    ^
/Users/buildslave/jenkins/workspace/lldb-cmake-matrix/llvm-project/lldb/test/API/lang/cpp/bitfields/main.cpp:32:5: error: unknown type name 'uint64_t'
    uint64_t h : 1;
    ^
/Users/buildslave/jenkins/workspace/lldb-cmake-matrix/llvm-project/lldb/test/API/lang/cpp/bitfields/main.cpp:33:5: error: unknown type name 'uint64_t'
    uint64_t i : 1;
    ^
/Users/buildslave/jenkins/workspace/lldb-cmake-matrix/llvm-project/lldb/test/API/lang/cpp/bitfields/main.cpp:34:5: error: unknown type name 'uint64_t'
    uint64_t j : 1;
    ^
/Users/buildslave/jenkins/workspace/lldb-cmake-matrix/llvm-project/lldb/test/API/lang/cpp/bitfields/main.cpp:35:5: error: unknown type name 'uint64_t'
    uint64_t k : 1;
    ^
/Users/buildslave/jenkins/workspace/lldb-cmake-matrix/llvm-project/lldb/test/API/lang/cpp/bitfields/main.cpp:47:5: error: use of undeclared identifier 'f'
    f.a = 1;
    ^
/Users/buildslave/jenkins/workspace/lldb-cmake-matrix/llvm-project/lldb/test/API/lang/cpp/bitfields/main.cpp:48:5: error: use of undeclared identifier 'f'
    f.b = 0;
    ^
/Users/buildslave/jenkins/workspace/lldb-cmake-matrix/llvm-project/lldb/test/API/lang/cpp/bitfields/main.cpp:49:5: error: use of undeclared identifier 'f'
    f.c = 1;
    ^
/Users/buildslave/jenkins/workspace/lldb-cmake-matrix/llvm-project/lldb/test/API/lang/cpp/bitfields/main.cpp:50:5: error: use of undeclared identifier 'f'
    f.d = 0;
    ^
/Users/buildslave/jenkins/workspace/lldb-cmake-matrix/llvm-project/lldb/test/API/lang/cpp/bitfields/main.cpp:51:5: error: use of undeclared identifier 'f'
    f.e = 1;
    ^
/Users/buildslave/jenkins/workspace/lldb-cmake-matrix/llvm-project/lldb/test/API/lang/cpp/bitfields/main.cpp:52:5: error: use of undeclared identifier 'f'
    f.f = 0;
    ^
fatal error: too many errors emitted, stopping now [-ferror-limit=]
20 errors generated.
make: *** [main.o] Error 1

Test Directory:
/Users/buildslave/jenkins/workspace/lldb-cmake-matrix/llvm-project/lldb/test/API/lang/cpp/bitfields
----------------------------------------------------------------------
Ran 2 tests in 0.247s

RESULT: FAILED (0 passes, 0 failures, 2 errors, 0 skipped, 0 expected failures, 0 unexpected successes)

--