Regression

Test Clang 11.0.1 / lldb-api.lang/cpp/namespace.TestNamespaceLookup.py (from lldb-api)

Failing for the past 1 build (Since #5017 )
Took 4 sec.

Stacktrace

Script:
--
/Applications/Xcode.app/Contents/Developer/Library/Frameworks/Python3.framework/Versions/3.8/bin/python3.8 /Users/buildslave/jenkins/workspace/lldb-cmake-matrix/llvm-project/lldb/test/API/dotest.py -u CXXFLAGS -u CFLAGS --codesign-identity lldb_codesign --arch x86_64 --build-dir /Users/buildslave/jenkins/workspace/lldb-cmake-matrix/lldb-build/lldb-test-build.noindex -t --env TERM=vt100 --skip-category gmodules --skip-category watchpoint --skip-category llgs --skip-category debugserver --arch=x86_64 --env LLVM_LIBS_DIR=/Users/buildslave/jenkins/workspace/lldb-cmake-matrix/lldb-build/./lib --env LLVM_INCLUDE_DIR=/Users/buildslave/jenkins/workspace/lldb-cmake-matrix/lldb-build/include --env LLVM_TOOLS_DIR=/Users/buildslave/jenkins/workspace/lldb-cmake-matrix/lldb-build/./bin --hermetic-libcxx --arch x86_64 --build-dir /Users/buildslave/jenkins/workspace/lldb-cmake-matrix/lldb-build/lldb-test-build.noindex --lldb-module-cache-dir /Users/buildslave/jenkins/workspace/lldb-cmake-matrix/lldb-build/lldb-test-build.noindex/module-cache-lldb/lldb-api --clang-module-cache-dir /Users/buildslave/jenkins/workspace/lldb-cmake-matrix/lldb-build/lldb-test-build.noindex/module-cache-clang/lldb-api --executable /Users/buildslave/jenkins/workspace/lldb-cmake-matrix/lldb-build/./bin/lldb --compiler /Users/buildslave/jenkins/workspace/lldb-cmake-matrix/clang_1101_build/bin/clang --dsymutil /Users/buildslave/jenkins/workspace/lldb-cmake-matrix/lldb-build/./bin/dsymutil --llvm-tools-dir /Users/buildslave/jenkins/workspace/lldb-cmake-matrix/lldb-build/./bin --lldb-libs-dir /Users/buildslave/jenkins/workspace/lldb-cmake-matrix/lldb-build/./lib /Users/buildslave/jenkins/workspace/lldb-cmake-matrix/llvm-project/lldb/test/API/lang/cpp/namespace -p TestNamespaceLookup.py
--
Exit Code: 1

Command Output (stdout):
--
lldb version 16.0.99git (http://labmaster3.local/git/llvm-project.git revision db008af501534d4590542253ae3acf783986f5f7)
  clang revision db008af501534d4590542253ae3acf783986f5f7
  llvm revision db008af501534d4590542253ae3acf783986f5f7
Skipping the following test categories: ['gmodules', 'watchpoint', 'llgs', 'debugserver', 'libstdcxx', 'dwo', 'llgs', 'fork']

--
Command Output (stderr):
--
Change dir to: /Users/buildslave/jenkins/workspace/lldb-cmake-matrix/llvm-project/lldb/test/API/lang/cpp/namespace
runCmd: settings clear -all
output: 

runCmd: settings set symbols.enable-external-lookup false
output: 

runCmd: settings set target.inherit-tcc true
output: 

runCmd: settings set target.detach-on-error false
output: 

runCmd: settings set target.auto-apply-fixits false
output: 

runCmd: settings set plugin.process.gdb-remote.packet-timeout 60
output: 

runCmd: settings set symbols.clang-modules-cache-path "/Users/buildslave/jenkins/workspace/lldb-cmake-matrix/lldb-build/lldb-test-build.noindex/module-cache-lldb/lldb-api"
output: 

runCmd: settings set use-color false
output: 

runCmd: setting set target.prefer-dynamic-value no-dynamic-values
output: 

make VPATH=/Users/buildslave/jenkins/workspace/lldb-cmake-matrix/llvm-project/lldb/test/API/lang/cpp/namespace -C /Users/buildslave/jenkins/workspace/lldb-cmake-matrix/lldb-build/lldb-test-build.noindex/lang/cpp/namespace/TestNamespaceLookup.test_file_scope_lookup_with_run_command_dsym -I /Users/buildslave/jenkins/workspace/lldb-cmake-matrix/llvm-project/lldb/test/API/lang/cpp/namespace -I /Users/buildslave/jenkins/workspace/lldb-cmake-matrix/llvm-project/lldb/packages/Python/lldbsuite/test/make -f /Users/buildslave/jenkins/workspace/lldb-cmake-matrix/llvm-project/lldb/test/API/lang/cpp/namespace/Makefile MAKE_DSYM=YES all ARCH=x86_64 'CC="/Users/buildslave/jenkins/workspace/lldb-cmake-matrix/clang_1101_build/bin/clang"' DSYMUTIL=/Users/buildslave/jenkins/workspace/lldb-cmake-matrix/lldb-build/./bin/dsymutil CODESIGN=codesign CLANG_MODULE_CACHE_DIR=/Users/buildslave/jenkins/workspace/lldb-cmake-matrix/lldb-build/lldb-test-build.noindex/module-cache-clang/lldb-api USE_HERMETIC_LIBCPP=1

XFAIL: LLDB (/Users/buildslave/jenkins/workspace/lldb-cmake-matrix/clang_1101_build/bin/clang-x86_64) :: test_file_scope_lookup_with_run_command_dsym (TestNamespaceLookup.NamespaceLookupTestCase)
runCmd: settings clear -all
output: 

runCmd: settings set symbols.enable-external-lookup false
output: 

runCmd: settings set target.inherit-tcc true
output: 

runCmd: settings set target.detach-on-error false
output: 

runCmd: settings set target.auto-apply-fixits false
output: 

runCmd: settings set plugin.process.gdb-remote.packet-timeout 60
output: 

runCmd: settings set symbols.clang-modules-cache-path "/Users/buildslave/jenkins/workspace/lldb-cmake-matrix/lldb-build/lldb-test-build.noindex/module-cache-lldb/lldb-api"
output: 

runCmd: settings set use-color false
output: 

runCmd: setting set target.prefer-dynamic-value no-dynamic-values
output: 

make VPATH=/Users/buildslave/jenkins/workspace/lldb-cmake-matrix/llvm-project/lldb/test/API/lang/cpp/namespace -C /Users/buildslave/jenkins/workspace/lldb-cmake-matrix/lldb-build/lldb-test-build.noindex/lang/cpp/namespace/TestNamespaceLookup.test_file_scope_lookup_with_run_command_dwarf -I /Users/buildslave/jenkins/workspace/lldb-cmake-matrix/llvm-project/lldb/test/API/lang/cpp/namespace -I /Users/buildslave/jenkins/workspace/lldb-cmake-matrix/llvm-project/lldb/packages/Python/lldbsuite/test/make -f /Users/buildslave/jenkins/workspace/lldb-cmake-matrix/llvm-project/lldb/test/API/lang/cpp/namespace/Makefile MAKE_DSYM=NO all ARCH=x86_64 'CC="/Users/buildslave/jenkins/workspace/lldb-cmake-matrix/clang_1101_build/bin/clang"' DSYMUTIL=/Users/buildslave/jenkins/workspace/lldb-cmake-matrix/lldb-build/./bin/dsymutil CODESIGN=codesign CLANG_MODULE_CACHE_DIR=/Users/buildslave/jenkins/workspace/lldb-cmake-matrix/lldb-build/lldb-test-build.noindex/module-cache-clang/lldb-api USE_HERMETIC_LIBCPP=1

XFAIL: LLDB (/Users/buildslave/jenkins/workspace/lldb-cmake-matrix/clang_1101_build/bin/clang-x86_64) :: test_file_scope_lookup_with_run_command_dwarf (TestNamespaceLookup.NamespaceLookupTestCase)
UNSUPPORTED: LLDB (/Users/buildslave/jenkins/workspace/lldb-cmake-matrix/clang_1101_build/bin/clang-x86_64) :: test_file_scope_lookup_with_run_command_dwo (TestNamespaceLookup.NamespaceLookupTestCase) (test case does not fall in any category of interest for this run) 
UNSUPPORTED: LLDB (/Users/buildslave/jenkins/workspace/lldb-cmake-matrix/clang_1101_build/bin/clang-x86_64) :: test_file_scope_lookup_with_run_command_gmodules (TestNamespaceLookup.NamespaceLookupTestCase) (test case does not fall in any category of interest for this run) 
runCmd: settings clear -all
output: 

runCmd: settings set symbols.enable-external-lookup false
output: 

runCmd: settings set target.inherit-tcc true
output: 

runCmd: settings set target.detach-on-error false
output: 

runCmd: settings set target.auto-apply-fixits false
output: 

runCmd: settings set plugin.process.gdb-remote.packet-timeout 60
output: 

runCmd: settings set symbols.clang-modules-cache-path "/Users/buildslave/jenkins/workspace/lldb-cmake-matrix/lldb-build/lldb-test-build.noindex/module-cache-lldb/lldb-api"
output: 

runCmd: settings set use-color false
output: 

runCmd: setting set target.prefer-dynamic-value no-dynamic-values
output: 

make VPATH=/Users/buildslave/jenkins/workspace/lldb-cmake-matrix/llvm-project/lldb/test/API/lang/cpp/namespace -C /Users/buildslave/jenkins/workspace/lldb-cmake-matrix/lldb-build/lldb-test-build.noindex/lang/cpp/namespace/TestNamespaceLookup.test_function_scope_lookup_with_run_command_dsym -I /Users/buildslave/jenkins/workspace/lldb-cmake-matrix/llvm-project/lldb/test/API/lang/cpp/namespace -I /Users/buildslave/jenkins/workspace/lldb-cmake-matrix/llvm-project/lldb/packages/Python/lldbsuite/test/make -f /Users/buildslave/jenkins/workspace/lldb-cmake-matrix/llvm-project/lldb/test/API/lang/cpp/namespace/Makefile MAKE_DSYM=YES all ARCH=x86_64 'CC="/Users/buildslave/jenkins/workspace/lldb-cmake-matrix/clang_1101_build/bin/clang"' DSYMUTIL=/Users/buildslave/jenkins/workspace/lldb-cmake-matrix/lldb-build/./bin/dsymutil CODESIGN=codesign CLANG_MODULE_CACHE_DIR=/Users/buildslave/jenkins/workspace/lldb-cmake-matrix/lldb-build/lldb-test-build.noindex/module-cache-clang/lldb-api USE_HERMETIC_LIBCPP=1

XFAIL: LLDB (/Users/buildslave/jenkins/workspace/lldb-cmake-matrix/clang_1101_build/bin/clang-x86_64) :: test_function_scope_lookup_with_run_command_dsym (TestNamespaceLookup.NamespaceLookupTestCase)
runCmd: settings clear -all
output: 

runCmd: settings set symbols.enable-external-lookup false
output: 

runCmd: settings set target.inherit-tcc true
output: 

runCmd: settings set target.detach-on-error false
output: 

runCmd: settings set target.auto-apply-fixits false
output: 

runCmd: settings set plugin.process.gdb-remote.packet-timeout 60
output: 

runCmd: settings set symbols.clang-modules-cache-path "/Users/buildslave/jenkins/workspace/lldb-cmake-matrix/lldb-build/lldb-test-build.noindex/module-cache-lldb/lldb-api"
output: 

runCmd: settings set use-color false
output: 

runCmd: setting set target.prefer-dynamic-value no-dynamic-values
output: 

make VPATH=/Users/buildslave/jenkins/workspace/lldb-cmake-matrix/llvm-project/lldb/test/API/lang/cpp/namespace -C /Users/buildslave/jenkins/workspace/lldb-cmake-matrix/lldb-build/lldb-test-build.noindex/lang/cpp/namespace/TestNamespaceLookup.test_function_scope_lookup_with_run_command_dwarf -I /Users/buildslave/jenkins/workspace/lldb-cmake-matrix/llvm-project/lldb/test/API/lang/cpp/namespace -I /Users/buildslave/jenkins/workspace/lldb-cmake-matrix/llvm-project/lldb/packages/Python/lldbsuite/test/make -f /Users/buildslave/jenkins/workspace/lldb-cmake-matrix/llvm-project/lldb/test/API/lang/cpp/namespace/Makefile MAKE_DSYM=NO all ARCH=x86_64 'CC="/Users/buildslave/jenkins/workspace/lldb-cmake-matrix/clang_1101_build/bin/clang"' DSYMUTIL=/Users/buildslave/jenkins/workspace/lldb-cmake-matrix/lldb-build/./bin/dsymutil CODESIGN=codesign CLANG_MODULE_CACHE_DIR=/Users/buildslave/jenkins/workspace/lldb-cmake-matrix/lldb-build/lldb-test-build.noindex/module-cache-clang/lldb-api USE_HERMETIC_LIBCPP=1

XFAIL: LLDB (/Users/buildslave/jenkins/workspace/lldb-cmake-matrix/clang_1101_build/bin/clang-x86_64) :: test_function_scope_lookup_with_run_command_dwarf (TestNamespaceLookup.NamespaceLookupTestCase)
UNSUPPORTED: LLDB (/Users/buildslave/jenkins/workspace/lldb-cmake-matrix/clang_1101_build/bin/clang-x86_64) :: test_function_scope_lookup_with_run_command_dwo (TestNamespaceLookup.NamespaceLookupTestCase) (test case does not fall in any category of interest for this run) 
UNSUPPORTED: LLDB (/Users/buildslave/jenkins/workspace/lldb-cmake-matrix/clang_1101_build/bin/clang-x86_64) :: test_function_scope_lookup_with_run_command_gmodules (TestNamespaceLookup.NamespaceLookupTestCase) (test case does not fall in any category of interest for this run) 
runCmd: settings clear -all
output: 

runCmd: settings set symbols.enable-external-lookup false
output: 

runCmd: settings set target.inherit-tcc true
output: 

runCmd: settings set target.detach-on-error false
output: 

runCmd: settings set target.auto-apply-fixits false
output: 

runCmd: settings set plugin.process.gdb-remote.packet-timeout 60
output: 

runCmd: settings set symbols.clang-modules-cache-path "/Users/buildslave/jenkins/workspace/lldb-cmake-matrix/lldb-build/lldb-test-build.noindex/module-cache-lldb/lldb-api"
output: 

runCmd: settings set use-color false
output: 

runCmd: setting set target.prefer-dynamic-value no-dynamic-values
output: 

make VPATH=/Users/buildslave/jenkins/workspace/lldb-cmake-matrix/llvm-project/lldb/test/API/lang/cpp/namespace -C /Users/buildslave/jenkins/workspace/lldb-cmake-matrix/lldb-build/lldb-test-build.noindex/lang/cpp/namespace/TestNamespaceLookup.test_scope_after_using_declaration_lookup_with_run_command_dsym -I /Users/buildslave/jenkins/workspace/lldb-cmake-matrix/llvm-project/lldb/test/API/lang/cpp/namespace -I /Users/buildslave/jenkins/workspace/lldb-cmake-matrix/llvm-project/lldb/packages/Python/lldbsuite/test/make -f /Users/buildslave/jenkins/workspace/lldb-cmake-matrix/llvm-project/lldb/test/API/lang/cpp/namespace/Makefile MAKE_DSYM=YES all ARCH=x86_64 'CC="/Users/buildslave/jenkins/workspace/lldb-cmake-matrix/clang_1101_build/bin/clang"' DSYMUTIL=/Users/buildslave/jenkins/workspace/lldb-cmake-matrix/lldb-build/./bin/dsymutil CODESIGN=codesign CLANG_MODULE_CACHE_DIR=/Users/buildslave/jenkins/workspace/lldb-cmake-matrix/lldb-build/lldb-test-build.noindex/module-cache-clang/lldb-api USE_HERMETIC_LIBCPP=1

XFAIL: LLDB (/Users/buildslave/jenkins/workspace/lldb-cmake-matrix/clang_1101_build/bin/clang-x86_64) :: test_scope_after_using_declaration_lookup_with_run_command_dsym (TestNamespaceLookup.NamespaceLookupTestCase)
runCmd: settings clear -all
output: 

runCmd: settings set symbols.enable-external-lookup false
output: 

runCmd: settings set target.inherit-tcc true
output: 

runCmd: settings set target.detach-on-error false
output: 

runCmd: settings set target.auto-apply-fixits false
output: 

runCmd: settings set plugin.process.gdb-remote.packet-timeout 60
output: 

runCmd: settings set symbols.clang-modules-cache-path "/Users/buildslave/jenkins/workspace/lldb-cmake-matrix/lldb-build/lldb-test-build.noindex/module-cache-lldb/lldb-api"
output: 

runCmd: settings set use-color false
output: 

runCmd: setting set target.prefer-dynamic-value no-dynamic-values
output: 

make VPATH=/Users/buildslave/jenkins/workspace/lldb-cmake-matrix/llvm-project/lldb/test/API/lang/cpp/namespace -C /Users/buildslave/jenkins/workspace/lldb-cmake-matrix/lldb-build/lldb-test-build.noindex/lang/cpp/namespace/TestNamespaceLookup.test_scope_after_using_declaration_lookup_with_run_command_dwarf -I /Users/buildslave/jenkins/workspace/lldb-cmake-matrix/llvm-project/lldb/test/API/lang/cpp/namespace -I /Users/buildslave/jenkins/workspace/lldb-cmake-matrix/llvm-project/lldb/packages/Python/lldbsuite/test/make -f /Users/buildslave/jenkins/workspace/lldb-cmake-matrix/llvm-project/lldb/test/API/lang/cpp/namespace/Makefile MAKE_DSYM=NO all ARCH=x86_64 'CC="/Users/buildslave/jenkins/workspace/lldb-cmake-matrix/clang_1101_build/bin/clang"' DSYMUTIL=/Users/buildslave/jenkins/workspace/lldb-cmake-matrix/lldb-build/./bin/dsymutil CODESIGN=codesign CLANG_MODULE_CACHE_DIR=/Users/buildslave/jenkins/workspace/lldb-cmake-matrix/lldb-build/lldb-test-build.noindex/module-cache-clang/lldb-api USE_HERMETIC_LIBCPP=1

XFAIL: LLDB (/Users/buildslave/jenkins/workspace/lldb-cmake-matrix/clang_1101_build/bin/clang-x86_64) :: test_scope_after_using_declaration_lookup_with_run_command_dwarf (TestNamespaceLookup.NamespaceLookupTestCase)
UNSUPPORTED: LLDB (/Users/buildslave/jenkins/workspace/lldb-cmake-matrix/clang_1101_build/bin/clang-x86_64) :: test_scope_after_using_declaration_lookup_with_run_command_dwo (TestNamespaceLookup.NamespaceLookupTestCase) (test case does not fall in any category of interest for this run) 
UNSUPPORTED: LLDB (/Users/buildslave/jenkins/workspace/lldb-cmake-matrix/clang_1101_build/bin/clang-x86_64) :: test_scope_after_using_declaration_lookup_with_run_command_gmodules (TestNamespaceLookup.NamespaceLookupTestCase) (test case does not fall in any category of interest for this run) 
runCmd: settings clear -all
output: 

runCmd: settings set symbols.enable-external-lookup false
output: 

runCmd: settings set target.inherit-tcc true
output: 

runCmd: settings set target.detach-on-error false
output: 

runCmd: settings set target.auto-apply-fixits false
output: 

runCmd: settings set plugin.process.gdb-remote.packet-timeout 60
output: 

runCmd: settings set symbols.clang-modules-cache-path "/Users/buildslave/jenkins/workspace/lldb-cmake-matrix/lldb-build/lldb-test-build.noindex/module-cache-lldb/lldb-api"
output: 

runCmd: settings set use-color false
output: 

runCmd: setting set target.prefer-dynamic-value no-dynamic-values
output: 

make VPATH=/Users/buildslave/jenkins/workspace/lldb-cmake-matrix/llvm-project/lldb/test/API/lang/cpp/namespace -C /Users/buildslave/jenkins/workspace/lldb-cmake-matrix/lldb-build/lldb-test-build.noindex/lang/cpp/namespace/TestNamespaceLookup.test_scope_after_using_directive_lookup_with_run_command_dsym -I /Users/buildslave/jenkins/workspace/lldb-cmake-matrix/llvm-project/lldb/test/API/lang/cpp/namespace -I /Users/buildslave/jenkins/workspace/lldb-cmake-matrix/llvm-project/lldb/packages/Python/lldbsuite/test/make -f /Users/buildslave/jenkins/workspace/lldb-cmake-matrix/llvm-project/lldb/test/API/lang/cpp/namespace/Makefile MAKE_DSYM=YES all ARCH=x86_64 'CC="/Users/buildslave/jenkins/workspace/lldb-cmake-matrix/clang_1101_build/bin/clang"' DSYMUTIL=/Users/buildslave/jenkins/workspace/lldb-cmake-matrix/lldb-build/./bin/dsymutil CODESIGN=codesign CLANG_MODULE_CACHE_DIR=/Users/buildslave/jenkins/workspace/lldb-cmake-matrix/lldb-build/lldb-test-build.noindex/module-cache-clang/lldb-api USE_HERMETIC_LIBCPP=1

FAIL: LLDB (/Users/buildslave/jenkins/workspace/lldb-cmake-matrix/clang_1101_build/bin/clang-x86_64) :: test_scope_after_using_directive_lookup_with_run_command_dsym (TestNamespaceLookup.NamespaceLookupTestCase)
runCmd: settings clear -all
output: 

runCmd: settings set symbols.enable-external-lookup false
output: 

runCmd: settings set target.inherit-tcc true
output: 

runCmd: settings set target.detach-on-error false
output: 

runCmd: settings set target.auto-apply-fixits false
output: 

runCmd: settings set plugin.process.gdb-remote.packet-timeout 60
output: 

runCmd: settings set symbols.clang-modules-cache-path "/Users/buildslave/jenkins/workspace/lldb-cmake-matrix/lldb-build/lldb-test-build.noindex/module-cache-lldb/lldb-api"
output: 

runCmd: settings set use-color false
output: 

runCmd: setting set target.prefer-dynamic-value no-dynamic-values
output: 

make VPATH=/Users/buildslave/jenkins/workspace/lldb-cmake-matrix/llvm-project/lldb/test/API/lang/cpp/namespace -C /Users/buildslave/jenkins/workspace/lldb-cmake-matrix/lldb-build/lldb-test-build.noindex/lang/cpp/namespace/TestNamespaceLookup.test_scope_after_using_directive_lookup_with_run_command_dwarf -I /Users/buildslave/jenkins/workspace/lldb-cmake-matrix/llvm-project/lldb/test/API/lang/cpp/namespace -I /Users/buildslave/jenkins/workspace/lldb-cmake-matrix/llvm-project/lldb/packages/Python/lldbsuite/test/make -f /Users/buildslave/jenkins/workspace/lldb-cmake-matrix/llvm-project/lldb/test/API/lang/cpp/namespace/Makefile MAKE_DSYM=NO all ARCH=x86_64 'CC="/Users/buildslave/jenkins/workspace/lldb-cmake-matrix/clang_1101_build/bin/clang"' DSYMUTIL=/Users/buildslave/jenkins/workspace/lldb-cmake-matrix/lldb-build/./bin/dsymutil CODESIGN=codesign CLANG_MODULE_CACHE_DIR=/Users/buildslave/jenkins/workspace/lldb-cmake-matrix/lldb-build/lldb-test-build.noindex/module-cache-clang/lldb-api USE_HERMETIC_LIBCPP=1

FAIL: LLDB (/Users/buildslave/jenkins/workspace/lldb-cmake-matrix/clang_1101_build/bin/clang-x86_64) :: test_scope_after_using_directive_lookup_with_run_command_dwarf (TestNamespaceLookup.NamespaceLookupTestCase)
UNSUPPORTED: LLDB (/Users/buildslave/jenkins/workspace/lldb-cmake-matrix/clang_1101_build/bin/clang-x86_64) :: test_scope_after_using_directive_lookup_with_run_command_dwo (TestNamespaceLookup.NamespaceLookupTestCase) (test case does not fall in any category of interest for this run) 
UNSUPPORTED: LLDB (/Users/buildslave/jenkins/workspace/lldb-cmake-matrix/clang_1101_build/bin/clang-x86_64) :: test_scope_after_using_directive_lookup_with_run_command_gmodules (TestNamespaceLookup.NamespaceLookupTestCase) (test case does not fall in any category of interest for this run) 
runCmd: settings clear -all
output: 

runCmd: settings set symbols.enable-external-lookup false
output: 

runCmd: settings set target.inherit-tcc true
output: 

runCmd: settings set target.detach-on-error false
output: 

runCmd: settings set target.auto-apply-fixits false
output: 

runCmd: settings set plugin.process.gdb-remote.packet-timeout 60
output: 

runCmd: settings set symbols.clang-modules-cache-path "/Users/buildslave/jenkins/workspace/lldb-cmake-matrix/lldb-build/lldb-test-build.noindex/module-cache-lldb/lldb-api"
output: 

runCmd: settings set use-color false
output: 

runCmd: setting set target.prefer-dynamic-value no-dynamic-values
output: 

make VPATH=/Users/buildslave/jenkins/workspace/lldb-cmake-matrix/llvm-project/lldb/test/API/lang/cpp/namespace -C /Users/buildslave/jenkins/workspace/lldb-cmake-matrix/lldb-build/lldb-test-build.noindex/lang/cpp/namespace/TestNamespaceLookup.test_scope_ambiguity_after_using_lookup_with_run_command_dsym -I /Users/buildslave/jenkins/workspace/lldb-cmake-matrix/llvm-project/lldb/test/API/lang/cpp/namespace -I /Users/buildslave/jenkins/workspace/lldb-cmake-matrix/llvm-project/lldb/packages/Python/lldbsuite/test/make -f /Users/buildslave/jenkins/workspace/lldb-cmake-matrix/llvm-project/lldb/test/API/lang/cpp/namespace/Makefile MAKE_DSYM=YES all ARCH=x86_64 'CC="/Users/buildslave/jenkins/workspace/lldb-cmake-matrix/clang_1101_build/bin/clang"' DSYMUTIL=/Users/buildslave/jenkins/workspace/lldb-cmake-matrix/lldb-build/./bin/dsymutil CODESIGN=codesign CLANG_MODULE_CACHE_DIR=/Users/buildslave/jenkins/workspace/lldb-cmake-matrix/lldb-build/lldb-test-build.noindex/module-cache-clang/lldb-api USE_HERMETIC_LIBCPP=1

XFAIL: LLDB (/Users/buildslave/jenkins/workspace/lldb-cmake-matrix/clang_1101_build/bin/clang-x86_64) :: test_scope_ambiguity_after_using_lookup_with_run_command_dsym (TestNamespaceLookup.NamespaceLookupTestCase)
runCmd: settings clear -all
output: 

runCmd: settings set symbols.enable-external-lookup false
output: 

runCmd: settings set target.inherit-tcc true
output: 

runCmd: settings set target.detach-on-error false
output: 

runCmd: settings set target.auto-apply-fixits false
output: 

runCmd: settings set plugin.process.gdb-remote.packet-timeout 60
output: 

runCmd: settings set symbols.clang-modules-cache-path "/Users/buildslave/jenkins/workspace/lldb-cmake-matrix/lldb-build/lldb-test-build.noindex/module-cache-lldb/lldb-api"
output: 

runCmd: settings set use-color false
output: 

runCmd: setting set target.prefer-dynamic-value no-dynamic-values
output: 

make VPATH=/Users/buildslave/jenkins/workspace/lldb-cmake-matrix/llvm-project/lldb/test/API/lang/cpp/namespace -C /Users/buildslave/jenkins/workspace/lldb-cmake-matrix/lldb-build/lldb-test-build.noindex/lang/cpp/namespace/TestNamespaceLookup.test_scope_ambiguity_after_using_lookup_with_run_command_dwarf -I /Users/buildslave/jenkins/workspace/lldb-cmake-matrix/llvm-project/lldb/test/API/lang/cpp/namespace -I /Users/buildslave/jenkins/workspace/lldb-cmake-matrix/llvm-project/lldb/packages/Python/lldbsuite/test/make -f /Users/buildslave/jenkins/workspace/lldb-cmake-matrix/llvm-project/lldb/test/API/lang/cpp/namespace/Makefile MAKE_DSYM=NO all ARCH=x86_64 'CC="/Users/buildslave/jenkins/workspace/lldb-cmake-matrix/clang_1101_build/bin/clang"' DSYMUTIL=/Users/buildslave/jenkins/workspace/lldb-cmake-matrix/lldb-build/./bin/dsymutil CODESIGN=codesign CLANG_MODULE_CACHE_DIR=/Users/buildslave/jenkins/workspace/lldb-cmake-matrix/lldb-build/lldb-test-build.noindex/module-cache-clang/lldb-api USE_HERMETIC_LIBCPP=1

XFAIL: LLDB (/Users/buildslave/jenkins/workspace/lldb-cmake-matrix/clang_1101_build/bin/clang-x86_64) :: test_scope_ambiguity_after_using_lookup_with_run_command_dwarf (TestNamespaceLookup.NamespaceLookupTestCase)
UNSUPPORTED: LLDB (/Users/buildslave/jenkins/workspace/lldb-cmake-matrix/clang_1101_build/bin/clang-x86_64) :: test_scope_ambiguity_after_using_lookup_with_run_command_dwo (TestNamespaceLookup.NamespaceLookupTestCase) (test case does not fall in any category of interest for this run) 
UNSUPPORTED: LLDB (/Users/buildslave/jenkins/workspace/lldb-cmake-matrix/clang_1101_build/bin/clang-x86_64) :: test_scope_ambiguity_after_using_lookup_with_run_command_gmodules (TestNamespaceLookup.NamespaceLookupTestCase) (test case does not fall in any category of interest for this run) 
runCmd: settings clear -all
output: 

runCmd: settings set symbols.enable-external-lookup false
output: 

runCmd: settings set target.inherit-tcc true
output: 

runCmd: settings set target.detach-on-error false
output: 

runCmd: settings set target.auto-apply-fixits false
output: 

runCmd: settings set plugin.process.gdb-remote.packet-timeout 60
output: 

runCmd: settings set symbols.clang-modules-cache-path "/Users/buildslave/jenkins/workspace/lldb-cmake-matrix/lldb-build/lldb-test-build.noindex/module-cache-lldb/lldb-api"
output: 

runCmd: settings set use-color false
output: 

runCmd: setting set target.prefer-dynamic-value no-dynamic-values
output: 

make VPATH=/Users/buildslave/jenkins/workspace/lldb-cmake-matrix/llvm-project/lldb/test/API/lang/cpp/namespace -C /Users/buildslave/jenkins/workspace/lldb-cmake-matrix/lldb-build/lldb-test-build.noindex/lang/cpp/namespace/TestNamespaceLookup.test_scope_lookup_before_using_with_run_command_dsym -I /Users/buildslave/jenkins/workspace/lldb-cmake-matrix/llvm-project/lldb/test/API/lang/cpp/namespace -I /Users/buildslave/jenkins/workspace/lldb-cmake-matrix/llvm-project/lldb/packages/Python/lldbsuite/test/make -f /Users/buildslave/jenkins/workspace/lldb-cmake-matrix/llvm-project/lldb/test/API/lang/cpp/namespace/Makefile MAKE_DSYM=YES all ARCH=x86_64 'CC="/Users/buildslave/jenkins/workspace/lldb-cmake-matrix/clang_1101_build/bin/clang"' DSYMUTIL=/Users/buildslave/jenkins/workspace/lldb-cmake-matrix/lldb-build/./bin/dsymutil CODESIGN=codesign CLANG_MODULE_CACHE_DIR=/Users/buildslave/jenkins/workspace/lldb-cmake-matrix/lldb-build/lldb-test-build.noindex/module-cache-clang/lldb-api USE_HERMETIC_LIBCPP=1

FAIL: LLDB (/Users/buildslave/jenkins/workspace/lldb-cmake-matrix/clang_1101_build/bin/clang-x86_64) :: test_scope_lookup_before_using_with_run_command_dsym (TestNamespaceLookup.NamespaceLookupTestCase)
runCmd: settings clear -all
output: 

runCmd: settings set symbols.enable-external-lookup false
output: 

runCmd: settings set target.inherit-tcc true
output: 

runCmd: settings set target.detach-on-error false
output: 

runCmd: settings set target.auto-apply-fixits false
output: 

runCmd: settings set plugin.process.gdb-remote.packet-timeout 60
output: 

runCmd: settings set symbols.clang-modules-cache-path "/Users/buildslave/jenkins/workspace/lldb-cmake-matrix/lldb-build/lldb-test-build.noindex/module-cache-lldb/lldb-api"
output: 

runCmd: settings set use-color false
output: 

runCmd: setting set target.prefer-dynamic-value no-dynamic-values
output: 

make VPATH=/Users/buildslave/jenkins/workspace/lldb-cmake-matrix/llvm-project/lldb/test/API/lang/cpp/namespace -C /Users/buildslave/jenkins/workspace/lldb-cmake-matrix/lldb-build/lldb-test-build.noindex/lang/cpp/namespace/TestNamespaceLookup.test_scope_lookup_before_using_with_run_command_dwarf -I /Users/buildslave/jenkins/workspace/lldb-cmake-matrix/llvm-project/lldb/test/API/lang/cpp/namespace -I /Users/buildslave/jenkins/workspace/lldb-cmake-matrix/llvm-project/lldb/packages/Python/lldbsuite/test/make -f /Users/buildslave/jenkins/workspace/lldb-cmake-matrix/llvm-project/lldb/test/API/lang/cpp/namespace/Makefile MAKE_DSYM=NO all ARCH=x86_64 'CC="/Users/buildslave/jenkins/workspace/lldb-cmake-matrix/clang_1101_build/bin/clang"' DSYMUTIL=/Users/buildslave/jenkins/workspace/lldb-cmake-matrix/lldb-build/./bin/dsymutil CODESIGN=codesign CLANG_MODULE_CACHE_DIR=/Users/buildslave/jenkins/workspace/lldb-cmake-matrix/lldb-build/lldb-test-build.noindex/module-cache-clang/lldb-api USE_HERMETIC_LIBCPP=1

FAIL: LLDB (/Users/buildslave/jenkins/workspace/lldb-cmake-matrix/clang_1101_build/bin/clang-x86_64) :: test_scope_lookup_before_using_with_run_command_dwarf (TestNamespaceLookup.NamespaceLookupTestCase)
UNSUPPORTED: LLDB (/Users/buildslave/jenkins/workspace/lldb-cmake-matrix/clang_1101_build/bin/clang-x86_64) :: test_scope_lookup_before_using_with_run_command_dwo (TestNamespaceLookup.NamespaceLookupTestCase) (test case does not fall in any category of interest for this run) 
UNSUPPORTED: LLDB (/Users/buildslave/jenkins/workspace/lldb-cmake-matrix/clang_1101_build/bin/clang-x86_64) :: test_scope_lookup_before_using_with_run_command_gmodules (TestNamespaceLookup.NamespaceLookupTestCase) (test case does not fall in any category of interest for this run) 
runCmd: settings clear -all
output: 

runCmd: settings set symbols.enable-external-lookup false
output: 

runCmd: settings set target.inherit-tcc true
output: 

runCmd: settings set target.detach-on-error false
output: 

runCmd: settings set target.auto-apply-fixits false
output: 

runCmd: settings set plugin.process.gdb-remote.packet-timeout 60
output: 

runCmd: settings set symbols.clang-modules-cache-path "/Users/buildslave/jenkins/workspace/lldb-cmake-matrix/lldb-build/lldb-test-build.noindex/module-cache-lldb/lldb-api"
output: 

runCmd: settings set use-color false
output: 

runCmd: setting set target.prefer-dynamic-value no-dynamic-values
output: 

make VPATH=/Users/buildslave/jenkins/workspace/lldb-cmake-matrix/llvm-project/lldb/test/API/lang/cpp/namespace -C /Users/buildslave/jenkins/workspace/lldb-cmake-matrix/lldb-build/lldb-test-build.noindex/lang/cpp/namespace/TestNamespaceLookup.test_scope_lookup_shadowed_by_using_with_run_command_dsym -I /Users/buildslave/jenkins/workspace/lldb-cmake-matrix/llvm-project/lldb/test/API/lang/cpp/namespace -I /Users/buildslave/jenkins/workspace/lldb-cmake-matrix/llvm-project/lldb/packages/Python/lldbsuite/test/make -f /Users/buildslave/jenkins/workspace/lldb-cmake-matrix/llvm-project/lldb/test/API/lang/cpp/namespace/Makefile MAKE_DSYM=YES all ARCH=x86_64 'CC="/Users/buildslave/jenkins/workspace/lldb-cmake-matrix/clang_1101_build/bin/clang"' DSYMUTIL=/Users/buildslave/jenkins/workspace/lldb-cmake-matrix/lldb-build/./bin/dsymutil CODESIGN=codesign CLANG_MODULE_CACHE_DIR=/Users/buildslave/jenkins/workspace/lldb-cmake-matrix/lldb-build/lldb-test-build.noindex/module-cache-clang/lldb-api USE_HERMETIC_LIBCPP=1

FAIL: LLDB (/Users/buildslave/jenkins/workspace/lldb-cmake-matrix/clang_1101_build/bin/clang-x86_64) :: test_scope_lookup_shadowed_by_using_with_run_command_dsym (TestNamespaceLookup.NamespaceLookupTestCase)
runCmd: settings clear -all
output: 

runCmd: settings set symbols.enable-external-lookup false
output: 

runCmd: settings set target.inherit-tcc true
output: 

runCmd: settings set target.detach-on-error false
output: 

runCmd: settings set target.auto-apply-fixits false
output: 

runCmd: settings set plugin.process.gdb-remote.packet-timeout 60
output: 

runCmd: settings set symbols.clang-modules-cache-path "/Users/buildslave/jenkins/workspace/lldb-cmake-matrix/lldb-build/lldb-test-build.noindex/module-cache-lldb/lldb-api"
output: 

runCmd: settings set use-color false
output: 

runCmd: setting set target.prefer-dynamic-value no-dynamic-values
output: 

make VPATH=/Users/buildslave/jenkins/workspace/lldb-cmake-matrix/llvm-project/lldb/test/API/lang/cpp/namespace -C /Users/buildslave/jenkins/workspace/lldb-cmake-matrix/lldb-build/lldb-test-build.noindex/lang/cpp/namespace/TestNamespaceLookup.test_scope_lookup_shadowed_by_using_with_run_command_dwarf -I /Users/buildslave/jenkins/workspace/lldb-cmake-matrix/llvm-project/lldb/test/API/lang/cpp/namespace -I /Users/buildslave/jenkins/workspace/lldb-cmake-matrix/llvm-project/lldb/packages/Python/lldbsuite/test/make -f /Users/buildslave/jenkins/workspace/lldb-cmake-matrix/llvm-project/lldb/test/API/lang/cpp/namespace/Makefile MAKE_DSYM=NO all ARCH=x86_64 'CC="/Users/buildslave/jenkins/workspace/lldb-cmake-matrix/clang_1101_build/bin/clang"' DSYMUTIL=/Users/buildslave/jenkins/workspace/lldb-cmake-matrix/lldb-build/./bin/dsymutil CODESIGN=codesign CLANG_MODULE_CACHE_DIR=/Users/buildslave/jenkins/workspace/lldb-cmake-matrix/lldb-build/lldb-test-build.noindex/module-cache-clang/lldb-api USE_HERMETIC_LIBCPP=1

FAIL: LLDB (/Users/buildslave/jenkins/workspace/lldb-cmake-matrix/clang_1101_build/bin/clang-x86_64) :: test_scope_lookup_shadowed_by_using_with_run_command_dwarf (TestNamespaceLookup.NamespaceLookupTestCase)
UNSUPPORTED: LLDB (/Users/buildslave/jenkins/workspace/lldb-cmake-matrix/clang_1101_build/bin/clang-x86_64) :: test_scope_lookup_shadowed_by_using_with_run_command_dwo (TestNamespaceLookup.NamespaceLookupTestCase) (test case does not fall in any category of interest for this run) 
UNSUPPORTED: LLDB (/Users/buildslave/jenkins/workspace/lldb-cmake-matrix/clang_1101_build/bin/clang-x86_64) :: test_scope_lookup_shadowed_by_using_with_run_command_gmodules (TestNamespaceLookup.NamespaceLookupTestCase) (test case does not fall in any category of interest for this run) 
runCmd: settings clear -all
output: 

runCmd: settings set symbols.enable-external-lookup false
output: 

runCmd: settings set target.inherit-tcc true
output: 

runCmd: settings set target.detach-on-error false
output: 

runCmd: settings set target.auto-apply-fixits false
output: 

runCmd: settings set plugin.process.gdb-remote.packet-timeout 60
output: 

runCmd: settings set symbols.clang-modules-cache-path "/Users/buildslave/jenkins/workspace/lldb-cmake-matrix/lldb-build/lldb-test-build.noindex/module-cache-lldb/lldb-api"
output: 

runCmd: settings set use-color false
output: 

runCmd: setting set target.prefer-dynamic-value no-dynamic-values
output: 

make VPATH=/Users/buildslave/jenkins/workspace/lldb-cmake-matrix/llvm-project/lldb/test/API/lang/cpp/namespace -C /Users/buildslave/jenkins/workspace/lldb-cmake-matrix/lldb-build/lldb-test-build.noindex/lang/cpp/namespace/TestNamespaceLookup.test_scope_lookup_with_run_command_dsym -I /Users/buildslave/jenkins/workspace/lldb-cmake-matrix/llvm-project/lldb/test/API/lang/cpp/namespace -I /Users/buildslave/jenkins/workspace/lldb-cmake-matrix/llvm-project/lldb/packages/Python/lldbsuite/test/make -f /Users/buildslave/jenkins/workspace/lldb-cmake-matrix/llvm-project/lldb/test/API/lang/cpp/namespace/Makefile MAKE_DSYM=YES all ARCH=x86_64 'CC="/Users/buildslave/jenkins/workspace/lldb-cmake-matrix/clang_1101_build/bin/clang"' DSYMUTIL=/Users/buildslave/jenkins/workspace/lldb-cmake-matrix/lldb-build/./bin/dsymutil CODESIGN=codesign CLANG_MODULE_CACHE_DIR=/Users/buildslave/jenkins/workspace/lldb-cmake-matrix/lldb-build/lldb-test-build.noindex/module-cache-clang/lldb-api USE_HERMETIC_LIBCPP=1

FAIL: LLDB (/Users/buildslave/jenkins/workspace/lldb-cmake-matrix/clang_1101_build/bin/clang-x86_64) :: test_scope_lookup_with_run_command_dsym (TestNamespaceLookup.NamespaceLookupTestCase)
runCmd: settings clear -all
output: 

runCmd: settings set symbols.enable-external-lookup false
output: 

runCmd: settings set target.inherit-tcc true
output: 

runCmd: settings set target.detach-on-error false
output: 

runCmd: settings set target.auto-apply-fixits false
output: 

runCmd: settings set plugin.process.gdb-remote.packet-timeout 60
output: 

runCmd: settings set symbols.clang-modules-cache-path "/Users/buildslave/jenkins/workspace/lldb-cmake-matrix/lldb-build/lldb-test-build.noindex/module-cache-lldb/lldb-api"
output: 

runCmd: settings set use-color false
output: 

runCmd: setting set target.prefer-dynamic-value no-dynamic-values
output: 

make VPATH=/Users/buildslave/jenkins/workspace/lldb-cmake-matrix/llvm-project/lldb/test/API/lang/cpp/namespace -C /Users/buildslave/jenkins/workspace/lldb-cmake-matrix/lldb-build/lldb-test-build.noindex/lang/cpp/namespace/TestNamespaceLookup.test_scope_lookup_with_run_command_dwarf -I /Users/buildslave/jenkins/workspace/lldb-cmake-matrix/llvm-project/lldb/test/API/lang/cpp/namespace -I /Users/buildslave/jenkins/workspace/lldb-cmake-matrix/llvm-project/lldb/packages/Python/lldbsuite/test/make -f /Users/buildslave/jenkins/workspace/lldb-cmake-matrix/llvm-project/lldb/test/API/lang/cpp/namespace/Makefile MAKE_DSYM=NO all ARCH=x86_64 'CC="/Users/buildslave/jenkins/workspace/lldb-cmake-matrix/clang_1101_build/bin/clang"' DSYMUTIL=/Users/buildslave/jenkins/workspace/lldb-cmake-matrix/lldb-build/./bin/dsymutil CODESIGN=codesign CLANG_MODULE_CACHE_DIR=/Users/buildslave/jenkins/workspace/lldb-cmake-matrix/lldb-build/lldb-test-build.noindex/module-cache-clang/lldb-api USE_HERMETIC_LIBCPP=1

FAIL: LLDB (/Users/buildslave/jenkins/workspace/lldb-cmake-matrix/clang_1101_build/bin/clang-x86_64) :: test_scope_lookup_with_run_command_dwarf (TestNamespaceLookup.NamespaceLookupTestCase)
UNSUPPORTED: LLDB (/Users/buildslave/jenkins/workspace/lldb-cmake-matrix/clang_1101_build/bin/clang-x86_64) :: test_scope_lookup_with_run_command_dwo (TestNamespaceLookup.NamespaceLookupTestCase) (test case does not fall in any category of interest for this run) 
UNSUPPORTED: LLDB (/Users/buildslave/jenkins/workspace/lldb-cmake-matrix/clang_1101_build/bin/clang-x86_64) :: test_scope_lookup_with_run_command_gmodules (TestNamespaceLookup.NamespaceLookupTestCase) (test case does not fall in any category of interest for this run) 
Restore dir to: /Users/buildslave/jenkins/workspace/lldb-cmake-matrix/lldb-build/tools/lldb/test
======================================================================
ERROR: test_scope_after_using_directive_lookup_with_run_command_dsym (TestNamespaceLookup.NamespaceLookupTestCase)
    Test scope lookup after using directive in lldb.
----------------------------------------------------------------------
Error when building test subject.

Build Command:
make VPATH=/Users/buildslave/jenkins/workspace/lldb-cmake-matrix/llvm-project/lldb/test/API/lang/cpp/namespace -C /Users/buildslave/jenkins/workspace/lldb-cmake-matrix/lldb-build/lldb-test-build.noindex/lang/cpp/namespace/TestNamespaceLookup.test_scope_after_using_directive_lookup_with_run_command_dsym -I /Users/buildslave/jenkins/workspace/lldb-cmake-matrix/llvm-project/lldb/test/API/lang/cpp/namespace -I /Users/buildslave/jenkins/workspace/lldb-cmake-matrix/llvm-project/lldb/packages/Python/lldbsuite/test/make -f /Users/buildslave/jenkins/workspace/lldb-cmake-matrix/llvm-project/lldb/test/API/lang/cpp/namespace/Makefile MAKE_DSYM=YES all ARCH=x86_64 'CC="/Users/buildslave/jenkins/workspace/lldb-cmake-matrix/clang_1101_build/bin/clang"' DSYMUTIL=/Users/buildslave/jenkins/workspace/lldb-cmake-matrix/lldb-build/./bin/dsymutil CODESIGN=codesign CLANG_MODULE_CACHE_DIR=/Users/buildslave/jenkins/workspace/lldb-cmake-matrix/lldb-build/lldb-test-build.noindex/module-cache-clang/lldb-api USE_HERMETIC_LIBCPP=1

Build Command Output:
"/Users/buildslave/jenkins/workspace/lldb-cmake-matrix/clang_1101_build/bin/clang"  -std=c++11 -g -O0 -isysroot "/Applications/Xcode.app/Contents/Developer/Platforms/MacOSX.platform/Developer/SDKs/MacOSX11.1.sdk" -arch x86_64  -I/Users/buildslave/jenkins/workspace/lldb-cmake-matrix/llvm-project/lldb/packages/Python/lldbsuite/test/make/../../../../../include -I/Users/buildslave/jenkins/workspace/lldb-cmake-matrix/llvm-project/lldb/test/API/lang/cpp/namespace -I/Users/buildslave/jenkins/workspace/lldb-cmake-matrix/llvm-project/lldb/packages/Python/lldbsuite/test/make -include /Users/buildslave/jenkins/workspace/lldb-cmake-matrix/llvm-project/lldb/packages/Python/lldbsuite/test/make/test_common.h  -fno-limit-debug-info     --driver-mode=g++ -MT main.o -MD -MP -MF main.d -c -o main.o /Users/buildslave/jenkins/workspace/lldb-cmake-matrix/llvm-project/lldb/test/API/lang/cpp/namespace/main.cpp
In file included from /Users/buildslave/jenkins/workspace/lldb-cmake-matrix/llvm-project/lldb/test/API/lang/cpp/namespace/main.cpp:2:
In file included from /Users/buildslave/jenkins/workspace/lldb-cmake-matrix/clang_1101_build/bin/../include/c++/v1/cstdlib:85:
/Users/buildslave/jenkins/workspace/lldb-cmake-matrix/clang_1101_build/bin/../include/c++/v1/stdlib.h:142:34: error: unknown type name 'ldiv_t'
inline _LIBCPP_INLINE_VISIBILITY ldiv_t div(long __x, long __y) _NOEXCEPT {
                                 ^
/Users/buildslave/jenkins/workspace/lldb-cmake-matrix/clang_1101_build/bin/../include/c++/v1/stdlib.h:143:12: error: no member named 'ldiv' in the global namespace
  return ::ldiv(__x, __y);
         ~~^
/Users/buildslave/jenkins/workspace/lldb-cmake-matrix/clang_1101_build/bin/../include/c++/v1/stdlib.h:146:34: error: unknown type name 'lldiv_t'
inline _LIBCPP_INLINE_VISIBILITY lldiv_t div(long long __x,
                                 ^
/Users/buildslave/jenkins/workspace/lldb-cmake-matrix/clang_1101_build/bin/../include/c++/v1/stdlib.h:148:12: error: no member named 'lldiv' in the global namespace
  return ::lldiv(__x, __y);
         ~~^
In file included from /Users/buildslave/jenkins/workspace/lldb-cmake-matrix/llvm-project/lldb/test/API/lang/cpp/namespace/main.cpp:2:
/Users/buildslave/jenkins/workspace/lldb-cmake-matrix/clang_1101_build/bin/../include/c++/v1/cstdlib:99:9: error: no member named 'size_t' in the global namespace
using ::size_t;
      ~~^
/Users/buildslave/jenkins/workspace/lldb-cmake-matrix/clang_1101_build/bin/../include/c++/v1/cstdlib:100:9: error: no member named 'div_t' in the global namespace
using ::div_t;
      ~~^
/Users/buildslave/jenkins/workspace/lldb-cmake-matrix/clang_1101_build/bin/../include/c++/v1/cstdlib:101:9: error: no member named 'ldiv_t' in the global namespace
using ::ldiv_t;
      ~~^
/Users/buildslave/jenkins/workspace/lldb-cmake-matrix/clang_1101_build/bin/../include/c++/v1/cstdlib:103:9: error: no member named 'lldiv_t' in the global namespace
using ::lldiv_t;
      ~~^
/Users/buildslave/jenkins/workspace/lldb-cmake-matrix/clang_1101_build/bin/../include/c++/v1/cstdlib:105:9: error: no member named 'atof' in the global namespace
using ::atof;
      ~~^
/Users/buildslave/jenkins/workspace/lldb-cmake-matrix/clang_1101_build/bin/../include/c++/v1/cstdlib:106:9: error: no member named 'atoi' in the global namespace
using ::atoi;
      ~~^
/Users/buildslave/jenkins/workspace/lldb-cmake-matrix/clang_1101_build/bin/../include/c++/v1/cstdlib:107:9: error: no member named 'atol' in the global namespace
using ::atol;
      ~~^
/Users/buildslave/jenkins/workspace/lldb-cmake-matrix/clang_1101_build/bin/../include/c++/v1/cstdlib:109:9: error: no member named 'atoll' in the global namespace
using ::atoll;
      ~~^
/Users/buildslave/jenkins/workspace/lldb-cmake-matrix/clang_1101_build/bin/../include/c++/v1/cstdlib:111:9: error: no member named 'strtod' in the global namespace
using ::strtod;
      ~~^
/Users/buildslave/jenkins/workspace/lldb-cmake-matrix/clang_1101_build/bin/../include/c++/v1/cstdlib:112:9: error: no member named 'strtof' in the global namespace
using ::strtof;
      ~~^
/Users/buildslave/jenkins/workspace/lldb-cmake-matrix/clang_1101_build/bin/../include/c++/v1/cstdlib:113:9: error: no member named 'strtold' in the global namespace
using ::strtold;
      ~~^
/Users/buildslave/jenkins/workspace/lldb-cmake-matrix/clang_1101_build/bin/../include/c++/v1/cstdlib:114:9: error: no member named 'strtol' in the global namespace
using ::strtol;
      ~~^
/Users/buildslave/jenkins/workspace/lldb-cmake-matrix/clang_1101_build/bin/../include/c++/v1/cstdlib:116:9: error: no member named 'strtoll' in the global namespace
using ::strtoll;
      ~~^
/Users/buildslave/jenkins/workspace/lldb-cmake-matrix/clang_1101_build/bin/../include/c++/v1/cstdlib:118:9: error: no member named 'strtoul' in the global namespace
using ::strtoul;
      ~~^
/Users/buildslave/jenkins/workspace/lldb-cmake-matrix/clang_1101_build/bin/../include/c++/v1/cstdlib:120:9: error: no member named 'strtoull' in the global namespace
using ::strtoull;
      ~~^
fatal error: too many errors emitted, stopping now [-ferror-limit=]
20 errors generated.
make: *** [main.o] Error 1

Test Directory:
/Users/buildslave/jenkins/workspace/lldb-cmake-matrix/llvm-project/lldb/test/API/lang/cpp/namespace
======================================================================
ERROR: test_scope_after_using_directive_lookup_with_run_command_dwarf (TestNamespaceLookup.NamespaceLookupTestCase)
    Test scope lookup after using directive in lldb.
----------------------------------------------------------------------
Error when building test subject.

Build Command:
make VPATH=/Users/buildslave/jenkins/workspace/lldb-cmake-matrix/llvm-project/lldb/test/API/lang/cpp/namespace -C /Users/buildslave/jenkins/workspace/lldb-cmake-matrix/lldb-build/lldb-test-build.noindex/lang/cpp/namespace/TestNamespaceLookup.test_scope_after_using_directive_lookup_with_run_command_dwarf -I /Users/buildslave/jenkins/workspace/lldb-cmake-matrix/llvm-project/lldb/test/API/lang/cpp/namespace -I /Users/buildslave/jenkins/workspace/lldb-cmake-matrix/llvm-project/lldb/packages/Python/lldbsuite/test/make -f /Users/buildslave/jenkins/workspace/lldb-cmake-matrix/llvm-project/lldb/test/API/lang/cpp/namespace/Makefile MAKE_DSYM=NO all ARCH=x86_64 'CC="/Users/buildslave/jenkins/workspace/lldb-cmake-matrix/clang_1101_build/bin/clang"' DSYMUTIL=/Users/buildslave/jenkins/workspace/lldb-cmake-matrix/lldb-build/./bin/dsymutil CODESIGN=codesign CLANG_MODULE_CACHE_DIR=/Users/buildslave/jenkins/workspace/lldb-cmake-matrix/lldb-build/lldb-test-build.noindex/module-cache-clang/lldb-api USE_HERMETIC_LIBCPP=1

Build Command Output:
"/Users/buildslave/jenkins/workspace/lldb-cmake-matrix/clang_1101_build/bin/clang"  -std=c++11 -g -O0 -isysroot "/Applications/Xcode.app/Contents/Developer/Platforms/MacOSX.platform/Developer/SDKs/MacOSX11.1.sdk" -arch x86_64  -I/Users/buildslave/jenkins/workspace/lldb-cmake-matrix/llvm-project/lldb/packages/Python/lldbsuite/test/make/../../../../../include -I/Users/buildslave/jenkins/workspace/lldb-cmake-matrix/llvm-project/lldb/test/API/lang/cpp/namespace -I/Users/buildslave/jenkins/workspace/lldb-cmake-matrix/llvm-project/lldb/packages/Python/lldbsuite/test/make -include /Users/buildslave/jenkins/workspace/lldb-cmake-matrix/llvm-project/lldb/packages/Python/lldbsuite/test/make/test_common.h  -fno-limit-debug-info     --driver-mode=g++ -MT main.o -MD -MP -MF main.d -c -o main.o /Users/buildslave/jenkins/workspace/lldb-cmake-matrix/llvm-project/lldb/test/API/lang/cpp/namespace/main.cpp
In file included from /Users/buildslave/jenkins/workspace/lldb-cmake-matrix/llvm-project/lldb/test/API/lang/cpp/namespace/main.cpp:2:
In file included from /Users/buildslave/jenkins/workspace/lldb-cmake-matrix/clang_1101_build/bin/../include/c++/v1/cstdlib:85:
/Users/buildslave/jenkins/workspace/lldb-cmake-matrix/clang_1101_build/bin/../include/c++/v1/stdlib.h:142:34: error: unknown type name 'ldiv_t'
inline _LIBCPP_INLINE_VISIBILITY ldiv_t div(long __x, long __y) _NOEXCEPT {
                                 ^
/Users/buildslave/jenkins/workspace/lldb-cmake-matrix/clang_1101_build/bin/../include/c++/v1/stdlib.h:143:12: error: no member named 'ldiv' in the global namespace
  return ::ldiv(__x, __y);
         ~~^
/Users/buildslave/jenkins/workspace/lldb-cmake-matrix/clang_1101_build/bin/../include/c++/v1/stdlib.h:146:34: error: unknown type name 'lldiv_t'
inline _LIBCPP_INLINE_VISIBILITY lldiv_t div(long long __x,
                                 ^
/Users/buildslave/jenkins/workspace/lldb-cmake-matrix/clang_1101_build/bin/../include/c++/v1/stdlib.h:148:12: error: no member named 'lldiv' in the global namespace
  return ::lldiv(__x, __y);
         ~~^
In file included from /Users/buildslave/jenkins/workspace/lldb-cmake-matrix/llvm-project/lldb/test/API/lang/cpp/namespace/main.cpp:2:
/Users/buildslave/jenkins/workspace/lldb-cmake-matrix/clang_1101_build/bin/../include/c++/v1/cstdlib:99:9: error: no member named 'size_t' in the global namespace
using ::size_t;
      ~~^
/Users/buildslave/jenkins/workspace/lldb-cmake-matrix/clang_1101_build/bin/../include/c++/v1/cstdlib:100:9: error: no member named 'div_t' in the global namespace
using ::div_t;
      ~~^
/Users/buildslave/jenkins/workspace/lldb-cmake-matrix/clang_1101_build/bin/../include/c++/v1/cstdlib:101:9: error: no member named 'ldiv_t' in the global namespace
using ::ldiv_t;
      ~~^
/Users/buildslave/jenkins/workspace/lldb-cmake-matrix/clang_1101_build/bin/../include/c++/v1/cstdlib:103:9: error: no member named 'lldiv_t' in the global namespace
using ::lldiv_t;
      ~~^
/Users/buildslave/jenkins/workspace/lldb-cmake-matrix/clang_1101_build/bin/../include/c++/v1/cstdlib:105:9: error: no member named 'atof' in the global namespace
using ::atof;
      ~~^
/Users/buildslave/jenkins/workspace/lldb-cmake-matrix/clang_1101_build/bin/../include/c++/v1/cstdlib:106:9: error: no member named 'atoi' in the global namespace
using ::atoi;
      ~~^
/Users/buildslave/jenkins/workspace/lldb-cmake-matrix/clang_1101_build/bin/../include/c++/v1/cstdlib:107:9: error: no member named 'atol' in the global namespace
using ::atol;
      ~~^
/Users/buildslave/jenkins/workspace/lldb-cmake-matrix/clang_1101_build/bin/../include/c++/v1/cstdlib:109:9: error: no member named 'atoll' in the global namespace
using ::atoll;
      ~~^
/Users/buildslave/jenkins/workspace/lldb-cmake-matrix/clang_1101_build/bin/../include/c++/v1/cstdlib:111:9: error: no member named 'strtod' in the global namespace
using ::strtod;
      ~~^
/Users/buildslave/jenkins/workspace/lldb-cmake-matrix/clang_1101_build/bin/../include/c++/v1/cstdlib:112:9: error: no member named 'strtof' in the global namespace
using ::strtof;
      ~~^
/Users/buildslave/jenkins/workspace/lldb-cmake-matrix/clang_1101_build/bin/../include/c++/v1/cstdlib:113:9: error: no member named 'strtold' in the global namespace
using ::strtold;
      ~~^
/Users/buildslave/jenkins/workspace/lldb-cmake-matrix/clang_1101_build/bin/../include/c++/v1/cstdlib:114:9: error: no member named 'strtol' in the global namespace
using ::strtol;
      ~~^
/Users/buildslave/jenkins/workspace/lldb-cmake-matrix/clang_1101_build/bin/../include/c++/v1/cstdlib:116:9: error: no member named 'strtoll' in the global namespace
using ::strtoll;
      ~~^
/Users/buildslave/jenkins/workspace/lldb-cmake-matrix/clang_1101_build/bin/../include/c++/v1/cstdlib:118:9: error: no member named 'strtoul' in the global namespace
using ::strtoul;
      ~~^
/Users/buildslave/jenkins/workspace/lldb-cmake-matrix/clang_1101_build/bin/../include/c++/v1/cstdlib:120:9: error: no member named 'strtoull' in the global namespace
using ::strtoull;
      ~~^
fatal error: too many errors emitted, stopping now [-ferror-limit=]
20 errors generated.
make: *** [main.o] Error 1

Test Directory:
/Users/buildslave/jenkins/workspace/lldb-cmake-matrix/llvm-project/lldb/test/API/lang/cpp/namespace
======================================================================
ERROR: test_scope_lookup_before_using_with_run_command_dsym (TestNamespaceLookup.NamespaceLookupTestCase)
    Test scope lookup before using in lldb.
----------------------------------------------------------------------
Error when building test subject.

Build Command:
make VPATH=/Users/buildslave/jenkins/workspace/lldb-cmake-matrix/llvm-project/lldb/test/API/lang/cpp/namespace -C /Users/buildslave/jenkins/workspace/lldb-cmake-matrix/lldb-build/lldb-test-build.noindex/lang/cpp/namespace/TestNamespaceLookup.test_scope_lookup_before_using_with_run_command_dsym -I /Users/buildslave/jenkins/workspace/lldb-cmake-matrix/llvm-project/lldb/test/API/lang/cpp/namespace -I /Users/buildslave/jenkins/workspace/lldb-cmake-matrix/llvm-project/lldb/packages/Python/lldbsuite/test/make -f /Users/buildslave/jenkins/workspace/lldb-cmake-matrix/llvm-project/lldb/test/API/lang/cpp/namespace/Makefile MAKE_DSYM=YES all ARCH=x86_64 'CC="/Users/buildslave/jenkins/workspace/lldb-cmake-matrix/clang_1101_build/bin/clang"' DSYMUTIL=/Users/buildslave/jenkins/workspace/lldb-cmake-matrix/lldb-build/./bin/dsymutil CODESIGN=codesign CLANG_MODULE_CACHE_DIR=/Users/buildslave/jenkins/workspace/lldb-cmake-matrix/lldb-build/lldb-test-build.noindex/module-cache-clang/lldb-api USE_HERMETIC_LIBCPP=1

Build Command Output:
"/Users/buildslave/jenkins/workspace/lldb-cmake-matrix/clang_1101_build/bin/clang"  -std=c++11 -g -O0 -isysroot "/Applications/Xcode.app/Contents/Developer/Platforms/MacOSX.platform/Developer/SDKs/MacOSX11.1.sdk" -arch x86_64  -I/Users/buildslave/jenkins/workspace/lldb-cmake-matrix/llvm-project/lldb/packages/Python/lldbsuite/test/make/../../../../../include -I/Users/buildslave/jenkins/workspace/lldb-cmake-matrix/llvm-project/lldb/test/API/lang/cpp/namespace -I/Users/buildslave/jenkins/workspace/lldb-cmake-matrix/llvm-project/lldb/packages/Python/lldbsuite/test/make -include /Users/buildslave/jenkins/workspace/lldb-cmake-matrix/llvm-project/lldb/packages/Python/lldbsuite/test/make/test_common.h  -fno-limit-debug-info     --driver-mode=g++ -MT main.o -MD -MP -MF main.d -c -o main.o /Users/buildslave/jenkins/workspace/lldb-cmake-matrix/llvm-project/lldb/test/API/lang/cpp/namespace/main.cpp
In file included from /Users/buildslave/jenkins/workspace/lldb-cmake-matrix/llvm-project/lldb/test/API/lang/cpp/namespace/main.cpp:2:
In file included from /Users/buildslave/jenkins/workspace/lldb-cmake-matrix/clang_1101_build/bin/../include/c++/v1/cstdlib:85:
/Users/buildslave/jenkins/workspace/lldb-cmake-matrix/clang_1101_build/bin/../include/c++/v1/stdlib.h:142:34: error: unknown type name 'ldiv_t'
inline _LIBCPP_INLINE_VISIBILITY ldiv_t div(long __x, long __y) _NOEXCEPT {
                                 ^
/Users/buildslave/jenkins/workspace/lldb-cmake-matrix/clang_1101_build/bin/../include/c++/v1/stdlib.h:143:12: error: no member named 'ldiv' in the global namespace
  return ::ldiv(__x, __y);
         ~~^
/Users/buildslave/jenkins/workspace/lldb-cmake-matrix/clang_1101_build/bin/../include/c++/v1/stdlib.h:146:34: error: unknown type name 'lldiv_t'
inline _LIBCPP_INLINE_VISIBILITY lldiv_t div(long long __x,
                                 ^
/Users/buildslave/jenkins/workspace/lldb-cmake-matrix/clang_1101_build/bin/../include/c++/v1/stdlib.h:148:12: error: no member named 'lldiv' in the global namespace
  return ::lldiv(__x, __y);
         ~~^
In file included from /Users/buildslave/jenkins/workspace/lldb-cmake-matrix/llvm-project/lldb/test/API/lang/cpp/namespace/main.cpp:2:
/Users/buildslave/jenkins/workspace/lldb-cmake-matrix/clang_1101_build/bin/../include/c++/v1/cstdlib:99:9: error: no member named 'size_t' in the global namespace
using ::size_t;
      ~~^
/Users/buildslave/jenkins/workspace/lldb-cmake-matrix/clang_1101_build/bin/../include/c++/v1/cstdlib:100:9: error: no member named 'div_t' in the global namespace
using ::div_t;
      ~~^
/Users/buildslave/jenkins/workspace/lldb-cmake-matrix/clang_1101_build/bin/../include/c++/v1/cstdlib:101:9: error: no member named 'ldiv_t' in the global namespace
using ::ldiv_t;
      ~~^
/Users/buildslave/jenkins/workspace/lldb-cmake-matrix/clang_1101_build/bin/../include/c++/v1/cstdlib:103:9: error: no member named 'lldiv_t' in the global namespace
using ::lldiv_t;
      ~~^
/Users/buildslave/jenkins/workspace/lldb-cmake-matrix/clang_1101_build/bin/../include/c++/v1/cstdlib:105:9: error: no member named 'atof' in the global namespace
using ::atof;
      ~~^
/Users/buildslave/jenkins/workspace/lldb-cmake-matrix/clang_1101_build/bin/../include/c++/v1/cstdlib:106:9: error: no member named 'atoi' in the global namespace
using ::atoi;
      ~~^
/Users/buildslave/jenkins/workspace/lldb-cmake-matrix/clang_1101_build/bin/../include/c++/v1/cstdlib:107:9: error: no member named 'atol' in the global namespace
using ::atol;
      ~~^
/Users/buildslave/jenkins/workspace/lldb-cmake-matrix/clang_1101_build/bin/../include/c++/v1/cstdlib:109:9: error: no member named 'atoll' in the global namespace
using ::atoll;
      ~~^
/Users/buildslave/jenkins/workspace/lldb-cmake-matrix/clang_1101_build/bin/../include/c++/v1/cstdlib:111:9: error: no member named 'strtod' in the global namespace
using ::strtod;
      ~~^
/Users/buildslave/jenkins/workspace/lldb-cmake-matrix/clang_1101_build/bin/../include/c++/v1/cstdlib:112:9: error: no member named 'strtof' in the global namespace
using ::strtof;
      ~~^
/Users/buildslave/jenkins/workspace/lldb-cmake-matrix/clang_1101_build/bin/../include/c++/v1/cstdlib:113:9: error: no member named 'strtold' in the global namespace
using ::strtold;
      ~~^
/Users/buildslave/jenkins/workspace/lldb-cmake-matrix/clang_1101_build/bin/../include/c++/v1/cstdlib:114:9: error: no member named 'strtol' in the global namespace
using ::strtol;
      ~~^
/Users/buildslave/jenkins/workspace/lldb-cmake-matrix/clang_1101_build/bin/../include/c++/v1/cstdlib:116:9: error: no member named 'strtoll' in the global namespace
using ::strtoll;
      ~~^
/Users/buildslave/jenkins/workspace/lldb-cmake-matrix/clang_1101_build/bin/../include/c++/v1/cstdlib:118:9: error: no member named 'strtoul' in the global namespace
using ::strtoul;
      ~~^
/Users/buildslave/jenkins/workspace/lldb-cmake-matrix/clang_1101_build/bin/../include/c++/v1/cstdlib:120:9: error: no member named 'strtoull' in the global namespace
using ::strtoull;
      ~~^
fatal error: too many errors emitted, stopping now [-ferror-limit=]
20 errors generated.
make: *** [main.o] Error 1

Test Directory:
/Users/buildslave/jenkins/workspace/lldb-cmake-matrix/llvm-project/lldb/test/API/lang/cpp/namespace
======================================================================
ERROR: test_scope_lookup_before_using_with_run_command_dwarf (TestNamespaceLookup.NamespaceLookupTestCase)
    Test scope lookup before using in lldb.
----------------------------------------------------------------------
Error when building test subject.

Build Command:
make VPATH=/Users/buildslave/jenkins/workspace/lldb-cmake-matrix/llvm-project/lldb/test/API/lang/cpp/namespace -C /Users/buildslave/jenkins/workspace/lldb-cmake-matrix/lldb-build/lldb-test-build.noindex/lang/cpp/namespace/TestNamespaceLookup.test_scope_lookup_before_using_with_run_command_dwarf -I /Users/buildslave/jenkins/workspace/lldb-cmake-matrix/llvm-project/lldb/test/API/lang/cpp/namespace -I /Users/buildslave/jenkins/workspace/lldb-cmake-matrix/llvm-project/lldb/packages/Python/lldbsuite/test/make -f /Users/buildslave/jenkins/workspace/lldb-cmake-matrix/llvm-project/lldb/test/API/lang/cpp/namespace/Makefile MAKE_DSYM=NO all ARCH=x86_64 'CC="/Users/buildslave/jenkins/workspace/lldb-cmake-matrix/clang_1101_build/bin/clang"' DSYMUTIL=/Users/buildslave/jenkins/workspace/lldb-cmake-matrix/lldb-build/./bin/dsymutil CODESIGN=codesign CLANG_MODULE_CACHE_DIR=/Users/buildslave/jenkins/workspace/lldb-cmake-matrix/lldb-build/lldb-test-build.noindex/module-cache-clang/lldb-api USE_HERMETIC_LIBCPP=1

Build Command Output:
"/Users/buildslave/jenkins/workspace/lldb-cmake-matrix/clang_1101_build/bin/clang"  -std=c++11 -g -O0 -isysroot "/Applications/Xcode.app/Contents/Developer/Platforms/MacOSX.platform/Developer/SDKs/MacOSX11.1.sdk" -arch x86_64  -I/Users/buildslave/jenkins/workspace/lldb-cmake-matrix/llvm-project/lldb/packages/Python/lldbsuite/test/make/../../../../../include -I/Users/buildslave/jenkins/workspace/lldb-cmake-matrix/llvm-project/lldb/test/API/lang/cpp/namespace -I/Users/buildslave/jenkins/workspace/lldb-cmake-matrix/llvm-project/lldb/packages/Python/lldbsuite/test/make -include /Users/buildslave/jenkins/workspace/lldb-cmake-matrix/llvm-project/lldb/packages/Python/lldbsuite/test/make/test_common.h  -fno-limit-debug-info     --driver-mode=g++ -MT main.o -MD -MP -MF main.d -c -o main.o /Users/buildslave/jenkins/workspace/lldb-cmake-matrix/llvm-project/lldb/test/API/lang/cpp/namespace/main.cpp
In file included from /Users/buildslave/jenkins/workspace/lldb-cmake-matrix/llvm-project/lldb/test/API/lang/cpp/namespace/main.cpp:2:
In file included from /Users/buildslave/jenkins/workspace/lldb-cmake-matrix/clang_1101_build/bin/../include/c++/v1/cstdlib:85:
/Users/buildslave/jenkins/workspace/lldb-cmake-matrix/clang_1101_build/bin/../include/c++/v1/stdlib.h:142:34: error: unknown type name 'ldiv_t'
inline _LIBCPP_INLINE_VISIBILITY ldiv_t div(long __x, long __y) _NOEXCEPT {
                                 ^
/Users/buildslave/jenkins/workspace/lldb-cmake-matrix/clang_1101_build/bin/../include/c++/v1/stdlib.h:143:12: error: no member named 'ldiv' in the global namespace
  return ::ldiv(__x, __y);
         ~~^
/Users/buildslave/jenkins/workspace/lldb-cmake-matrix/clang_1101_build/bin/../include/c++/v1/stdlib.h:146:34: error: unknown type name 'lldiv_t'
inline _LIBCPP_INLINE_VISIBILITY lldiv_t div(long long __x,
                                 ^
/Users/buildslave/jenkins/workspace/lldb-cmake-matrix/clang_1101_build/bin/../include/c++/v1/stdlib.h:148:12: error: no member named 'lldiv' in the global namespace
  return ::lldiv(__x, __y);
         ~~^
In file included from /Users/buildslave/jenkins/workspace/lldb-cmake-matrix/llvm-project/lldb/test/API/lang/cpp/namespace/main.cpp:2:
/Users/buildslave/jenkins/workspace/lldb-cmake-matrix/clang_1101_build/bin/../include/c++/v1/cstdlib:99:9: error: no member named 'size_t' in the global namespace
using ::size_t;
      ~~^
/Users/buildslave/jenkins/workspace/lldb-cmake-matrix/clang_1101_build/bin/../include/c++/v1/cstdlib:100:9: error: no member named 'div_t' in the global namespace
using ::div_t;
      ~~^
/Users/buildslave/jenkins/workspace/lldb-cmake-matrix/clang_1101_build/bin/../include/c++/v1/cstdlib:101:9: error: no member named 'ldiv_t' in the global namespace
using ::ldiv_t;
      ~~^
/Users/buildslave/jenkins/workspace/lldb-cmake-matrix/clang_1101_build/bin/../include/c++/v1/cstdlib:103:9: error: no member named 'lldiv_t' in the global namespace
using ::lldiv_t;
      ~~^
/Users/buildslave/jenkins/workspace/lldb-cmake-matrix/clang_1101_build/bin/../include/c++/v1/cstdlib:105:9: error: no member named 'atof' in the global namespace
using ::atof;
      ~~^
/Users/buildslave/jenkins/workspace/lldb-cmake-matrix/clang_1101_build/bin/../include/c++/v1/cstdlib:106:9: error: no member named 'atoi' in the global namespace
using ::atoi;
      ~~^
/Users/buildslave/jenkins/workspace/lldb-cmake-matrix/clang_1101_build/bin/../include/c++/v1/cstdlib:107:9: error: no member named 'atol' in the global namespace
using ::atol;
      ~~^
/Users/buildslave/jenkins/workspace/lldb-cmake-matrix/clang_1101_build/bin/../include/c++/v1/cstdlib:109:9: error: no member named 'atoll' in the global namespace
using ::atoll;
      ~~^
/Users/buildslave/jenkins/workspace/lldb-cmake-matrix/clang_1101_build/bin/../include/c++/v1/cstdlib:111:9: error: no member named 'strtod' in the global namespace
using ::strtod;
      ~~^
/Users/buildslave/jenkins/workspace/lldb-cmake-matrix/clang_1101_build/bin/../include/c++/v1/cstdlib:112:9: error: no member named 'strtof' in the global namespace
using ::strtof;
      ~~^
/Users/buildslave/jenkins/workspace/lldb-cmake-matrix/clang_1101_build/bin/../include/c++/v1/cstdlib:113:9: error: no member named 'strtold' in the global namespace
using ::strtold;
      ~~^
/Users/buildslave/jenkins/workspace/lldb-cmake-matrix/clang_1101_build/bin/../include/c++/v1/cstdlib:114:9: error: no member named 'strtol' in the global namespace
using ::strtol;
      ~~^
/Users/buildslave/jenkins/workspace/lldb-cmake-matrix/clang_1101_build/bin/../include/c++/v1/cstdlib:116:9: error: no member named 'strtoll' in the global namespace
using ::strtoll;
      ~~^
/Users/buildslave/jenkins/workspace/lldb-cmake-matrix/clang_1101_build/bin/../include/c++/v1/cstdlib:118:9: error: no member named 'strtoul' in the global namespace
using ::strtoul;
      ~~^
/Users/buildslave/jenkins/workspace/lldb-cmake-matrix/clang_1101_build/bin/../include/c++/v1/cstdlib:120:9: error: no member named 'strtoull' in the global namespace
using ::strtoull;
      ~~^
fatal error: too many errors emitted, stopping now [-ferror-limit=]
20 errors generated.
make: *** [main.o] Error 1

Test Directory:
/Users/buildslave/jenkins/workspace/lldb-cmake-matrix/llvm-project/lldb/test/API/lang/cpp/namespace
======================================================================
ERROR: test_scope_lookup_shadowed_by_using_with_run_command_dsym (TestNamespaceLookup.NamespaceLookupTestCase)
    Test scope lookup shadowed by using in lldb.
----------------------------------------------------------------------
Error when building test subject.

Build Command:
make VPATH=/Users/buildslave/jenkins/workspace/lldb-cmake-matrix/llvm-project/lldb/test/API/lang/cpp/namespace -C /Users/buildslave/jenkins/workspace/lldb-cmake-matrix/lldb-build/lldb-test-build.noindex/lang/cpp/namespace/TestNamespaceLookup.test_scope_lookup_shadowed_by_using_with_run_command_dsym -I /Users/buildslave/jenkins/workspace/lldb-cmake-matrix/llvm-project/lldb/test/API/lang/cpp/namespace -I /Users/buildslave/jenkins/workspace/lldb-cmake-matrix/llvm-project/lldb/packages/Python/lldbsuite/test/make -f /Users/buildslave/jenkins/workspace/lldb-cmake-matrix/llvm-project/lldb/test/API/lang/cpp/namespace/Makefile MAKE_DSYM=YES all ARCH=x86_64 'CC="/Users/buildslave/jenkins/workspace/lldb-cmake-matrix/clang_1101_build/bin/clang"' DSYMUTIL=/Users/buildslave/jenkins/workspace/lldb-cmake-matrix/lldb-build/./bin/dsymutil CODESIGN=codesign CLANG_MODULE_CACHE_DIR=/Users/buildslave/jenkins/workspace/lldb-cmake-matrix/lldb-build/lldb-test-build.noindex/module-cache-clang/lldb-api USE_HERMETIC_LIBCPP=1

Build Command Output:
"/Users/buildslave/jenkins/workspace/lldb-cmake-matrix/clang_1101_build/bin/clang"  -std=c++11 -g -O0 -isysroot "/Applications/Xcode.app/Contents/Developer/Platforms/MacOSX.platform/Developer/SDKs/MacOSX11.1.sdk" -arch x86_64  -I/Users/buildslave/jenkins/workspace/lldb-cmake-matrix/llvm-project/lldb/packages/Python/lldbsuite/test/make/../../../../../include -I/Users/buildslave/jenkins/workspace/lldb-cmake-matrix/llvm-project/lldb/test/API/lang/cpp/namespace -I/Users/buildslave/jenkins/workspace/lldb-cmake-matrix/llvm-project/lldb/packages/Python/lldbsuite/test/make -include /Users/buildslave/jenkins/workspace/lldb-cmake-matrix/llvm-project/lldb/packages/Python/lldbsuite/test/make/test_common.h  -fno-limit-debug-info     --driver-mode=g++ -MT main.o -MD -MP -MF main.d -c -o main.o /Users/buildslave/jenkins/workspace/lldb-cmake-matrix/llvm-project/lldb/test/API/lang/cpp/namespace/main.cpp
In file included from /Users/buildslave/jenkins/workspace/lldb-cmake-matrix/llvm-project/lldb/test/API/lang/cpp/namespace/main.cpp:2:
In file included from /Users/buildslave/jenkins/workspace/lldb-cmake-matrix/clang_1101_build/bin/../include/c++/v1/cstdlib:85:
/Users/buildslave/jenkins/workspace/lldb-cmake-matrix/clang_1101_build/bin/../include/c++/v1/stdlib.h:142:34: error: unknown type name 'ldiv_t'
inline _LIBCPP_INLINE_VISIBILITY ldiv_t div(long __x, long __y) _NOEXCEPT {
                                 ^
/Users/buildslave/jenkins/workspace/lldb-cmake-matrix/clang_1101_build/bin/../include/c++/v1/stdlib.h:143:12: error: no member named 'ldiv' in the global namespace
  return ::ldiv(__x, __y);
         ~~^
/Users/buildslave/jenkins/workspace/lldb-cmake-matrix/clang_1101_build/bin/../include/c++/v1/stdlib.h:146:34: error: unknown type name 'lldiv_t'
inline _LIBCPP_INLINE_VISIBILITY lldiv_t div(long long __x,
                                 ^
/Users/buildslave/jenkins/workspace/lldb-cmake-matrix/clang_1101_build/bin/../include/c++/v1/stdlib.h:148:12: error: no member named 'lldiv' in the global namespace
  return ::lldiv(__x, __y);
         ~~^
In file included from /Users/buildslave/jenkins/workspace/lldb-cmake-matrix/llvm-project/lldb/test/API/lang/cpp/namespace/main.cpp:2:
/Users/buildslave/jenkins/workspace/lldb-cmake-matrix/clang_1101_build/bin/../include/c++/v1/cstdlib:99:9: error: no member named 'size_t' in the global namespace
using ::size_t;
      ~~^
/Users/buildslave/jenkins/workspace/lldb-cmake-matrix/clang_1101_build/bin/../include/c++/v1/cstdlib:100:9: error: no member named 'div_t' in the global namespace
using ::div_t;
      ~~^
/Users/buildslave/jenkins/workspace/lldb-cmake-matrix/clang_1101_build/bin/../include/c++/v1/cstdlib:101:9: error: no member named 'ldiv_t' in the global namespace
using ::ldiv_t;
      ~~^
/Users/buildslave/jenkins/workspace/lldb-cmake-matrix/clang_1101_build/bin/../include/c++/v1/cstdlib:103:9: error: no member named 'lldiv_t' in the global namespace
using ::lldiv_t;
      ~~^
/Users/buildslave/jenkins/workspace/lldb-cmake-matrix/clang_1101_build/bin/../include/c++/v1/cstdlib:105:9: error: no member named 'atof' in the global namespace
using ::atof;
      ~~^
/Users/buildslave/jenkins/workspace/lldb-cmake-matrix/clang_1101_build/bin/../include/c++/v1/cstdlib:106:9: error: no member named 'atoi' in the global namespace
using ::atoi;
      ~~^
/Users/buildslave/jenkins/workspace/lldb-cmake-matrix/clang_1101_build/bin/../include/c++/v1/cstdlib:107:9: error: no member named 'atol' in the global namespace
using ::atol;
      ~~^
/Users/buildslave/jenkins/workspace/lldb-cmake-matrix/clang_1101_build/bin/../include/c++/v1/cstdlib:109:9: error: no member named 'atoll' in the global namespace
using ::atoll;
      ~~^
/Users/buildslave/jenkins/workspace/lldb-cmake-matrix/clang_1101_build/bin/../include/c++/v1/cstdlib:111:9: error: no member named 'strtod' in the global namespace
using ::strtod;
      ~~^
/Users/buildslave/jenkins/workspace/lldb-cmake-matrix/clang_1101_build/bin/../include/c++/v1/cstdlib:112:9: error: no member named 'strtof' in the global namespace
using ::strtof;
      ~~^
/Users/buildslave/jenkins/workspace/lldb-cmake-matrix/clang_1101_build/bin/../include/c++/v1/cstdlib:113:9: error: no member named 'strtold' in the global namespace
using ::strtold;
      ~~^
/Users/buildslave/jenkins/workspace/lldb-cmake-matrix/clang_1101_build/bin/../include/c++/v1/cstdlib:114:9: error: no member named 'strtol' in the global namespace
using ::strtol;
      ~~^
/Users/buildslave/jenkins/workspace/lldb-cmake-matrix/clang_1101_build/bin/../include/c++/v1/cstdlib:116:9: error: no member named 'strtoll' in the global namespace
using ::strtoll;
      ~~^
/Users/buildslave/jenkins/workspace/lldb-cmake-matrix/clang_1101_build/bin/../include/c++/v1/cstdlib:118:9: error: no member named 'strtoul' in the global namespace
using ::strtoul;
      ~~^
/Users/buildslave/jenkins/workspace/lldb-cmake-matrix/clang_1101_build/bin/../include/c++/v1/cstdlib:120:9: error: no member named 'strtoull' in the global namespace
using ::strtoull;
      ~~^
fatal error: too many errors emitted, stopping now [-ferror-limit=]
20 errors generated.
make: *** [main.o] Error 1

Test Directory:
/Users/buildslave/jenkins/workspace/lldb-cmake-matrix/llvm-project/lldb/test/API/lang/cpp/namespace
======================================================================
ERROR: test_scope_lookup_shadowed_by_using_with_run_command_dwarf (TestNamespaceLookup.NamespaceLookupTestCase)
    Test scope lookup shadowed by using in lldb.
----------------------------------------------------------------------
Error when building test subject.

Build Command:
make VPATH=/Users/buildslave/jenkins/workspace/lldb-cmake-matrix/llvm-project/lldb/test/API/lang/cpp/namespace -C /Users/buildslave/jenkins/workspace/lldb-cmake-matrix/lldb-build/lldb-test-build.noindex/lang/cpp/namespace/TestNamespaceLookup.test_scope_lookup_shadowed_by_using_with_run_command_dwarf -I /Users/buildslave/jenkins/workspace/lldb-cmake-matrix/llvm-project/lldb/test/API/lang/cpp/namespace -I /Users/buildslave/jenkins/workspace/lldb-cmake-matrix/llvm-project/lldb/packages/Python/lldbsuite/test/make -f /Users/buildslave/jenkins/workspace/lldb-cmake-matrix/llvm-project/lldb/test/API/lang/cpp/namespace/Makefile MAKE_DSYM=NO all ARCH=x86_64 'CC="/Users/buildslave/jenkins/workspace/lldb-cmake-matrix/clang_1101_build/bin/clang"' DSYMUTIL=/Users/buildslave/jenkins/workspace/lldb-cmake-matrix/lldb-build/./bin/dsymutil CODESIGN=codesign CLANG_MODULE_CACHE_DIR=/Users/buildslave/jenkins/workspace/lldb-cmake-matrix/lldb-build/lldb-test-build.noindex/module-cache-clang/lldb-api USE_HERMETIC_LIBCPP=1

Build Command Output:
"/Users/buildslave/jenkins/workspace/lldb-cmake-matrix/clang_1101_build/bin/clang"  -std=c++11 -g -O0 -isysroot "/Applications/Xcode.app/Contents/Developer/Platforms/MacOSX.platform/Developer/SDKs/MacOSX11.1.sdk" -arch x86_64  -I/Users/buildslave/jenkins/workspace/lldb-cmake-matrix/llvm-project/lldb/packages/Python/lldbsuite/test/make/../../../../../include -I/Users/buildslave/jenkins/workspace/lldb-cmake-matrix/llvm-project/lldb/test/API/lang/cpp/namespace -I/Users/buildslave/jenkins/workspace/lldb-cmake-matrix/llvm-project/lldb/packages/Python/lldbsuite/test/make -include /Users/buildslave/jenkins/workspace/lldb-cmake-matrix/llvm-project/lldb/packages/Python/lldbsuite/test/make/test_common.h  -fno-limit-debug-info     --driver-mode=g++ -MT main.o -MD -MP -MF main.d -c -o main.o /Users/buildslave/jenkins/workspace/lldb-cmake-matrix/llvm-project/lldb/test/API/lang/cpp/namespace/main.cpp
In file included from /Users/buildslave/jenkins/workspace/lldb-cmake-matrix/llvm-project/lldb/test/API/lang/cpp/namespace/main.cpp:2:
In file included from /Users/buildslave/jenkins/workspace/lldb-cmake-matrix/clang_1101_build/bin/../include/c++/v1/cstdlib:85:
/Users/buildslave/jenkins/workspace/lldb-cmake-matrix/clang_1101_build/bin/../include/c++/v1/stdlib.h:142:34: error: unknown type name 'ldiv_t'
inline _LIBCPP_INLINE_VISIBILITY ldiv_t div(long __x, long __y) _NOEXCEPT {
                                 ^
/Users/buildslave/jenkins/workspace/lldb-cmake-matrix/clang_1101_build/bin/../include/c++/v1/stdlib.h:143:12: error: no member named 'ldiv' in the global namespace
  return ::ldiv(__x, __y);
         ~~^
/Users/buildslave/jenkins/workspace/lldb-cmake-matrix/clang_1101_build/bin/../include/c++/v1/stdlib.h:146:34: error: unknown type name 'lldiv_t'
inline _LIBCPP_INLINE_VISIBILITY lldiv_t div(long long __x,
                                 ^
/Users/buildslave/jenkins/workspace/lldb-cmake-matrix/clang_1101_build/bin/../include/c++/v1/stdlib.h:148:12: error: no member named 'lldiv' in the global namespace
  return ::lldiv(__x, __y);
         ~~^
In file included from /Users/buildslave/jenkins/workspace/lldb-cmake-matrix/llvm-project/lldb/test/API/lang/cpp/namespace/main.cpp:2:
/Users/buildslave/jenkins/workspace/lldb-cmake-matrix/clang_1101_build/bin/../include/c++/v1/cstdlib:99:9: error: no member named 'size_t' in the global namespace
using ::size_t;
      ~~^
/Users/buildslave/jenkins/workspace/lldb-cmake-matrix/clang_1101_build/bin/../include/c++/v1/cstdlib:100:9: error: no member named 'div_t' in the global namespace
using ::div_t;
      ~~^
/Users/buildslave/jenkins/workspace/lldb-cmake-matrix/clang_1101_build/bin/../include/c++/v1/cstdlib:101:9: error: no member named 'ldiv_t' in the global namespace
using ::ldiv_t;
      ~~^
/Users/buildslave/jenkins/workspace/lldb-cmake-matrix/clang_1101_build/bin/../include/c++/v1/cstdlib:103:9: error: no member named 'lldiv_t' in the global namespace
using ::lldiv_t;
      ~~^
/Users/buildslave/jenkins/workspace/lldb-cmake-matrix/clang_1101_build/bin/../include/c++/v1/cstdlib:105:9: error: no member named 'atof' in the global namespace
using ::atof;
      ~~^
/Users/buildslave/jenkins/workspace/lldb-cmake-matrix/clang_1101_build/bin/../include/c++/v1/cstdlib:106:9: error: no member named 'atoi' in the global namespace
using ::atoi;
      ~~^
/Users/buildslave/jenkins/workspace/lldb-cmake-matrix/clang_1101_build/bin/../include/c++/v1/cstdlib:107:9: error: no member named 'atol' in the global namespace
using ::atol;
      ~~^
/Users/buildslave/jenkins/workspace/lldb-cmake-matrix/clang_1101_build/bin/../include/c++/v1/cstdlib:109:9: error: no member named 'atoll' in the global namespace
using ::atoll;
      ~~^
/Users/buildslave/jenkins/workspace/lldb-cmake-matrix/clang_1101_build/bin/../include/c++/v1/cstdlib:111:9: error: no member named 'strtod' in the global namespace
using ::strtod;
      ~~^
/Users/buildslave/jenkins/workspace/lldb-cmake-matrix/clang_1101_build/bin/../include/c++/v1/cstdlib:112:9: error: no member named 'strtof' in the global namespace
using ::strtof;
      ~~^
/Users/buildslave/jenkins/workspace/lldb-cmake-matrix/clang_1101_build/bin/../include/c++/v1/cstdlib:113:9: error: no member named 'strtold' in the global namespace
using ::strtold;
      ~~^
/Users/buildslave/jenkins/workspace/lldb-cmake-matrix/clang_1101_build/bin/../include/c++/v1/cstdlib:114:9: error: no member named 'strtol' in the global namespace
using ::strtol;
      ~~^
/Users/buildslave/jenkins/workspace/lldb-cmake-matrix/clang_1101_build/bin/../include/c++/v1/cstdlib:116:9: error: no member named 'strtoll' in the global namespace
using ::strtoll;
      ~~^
/Users/buildslave/jenkins/workspace/lldb-cmake-matrix/clang_1101_build/bin/../include/c++/v1/cstdlib:118:9: error: no member named 'strtoul' in the global namespace
using ::strtoul;
      ~~^
/Users/buildslave/jenkins/workspace/lldb-cmake-matrix/clang_1101_build/bin/../include/c++/v1/cstdlib:120:9: error: no member named 'strtoull' in the global namespace
using ::strtoull;
      ~~^
fatal error: too many errors emitted, stopping now [-ferror-limit=]
20 errors generated.
make: *** [main.o] Error 1

Test Directory:
/Users/buildslave/jenkins/workspace/lldb-cmake-matrix/llvm-project/lldb/test/API/lang/cpp/namespace
======================================================================
ERROR: test_scope_lookup_with_run_command_dsym (TestNamespaceLookup.NamespaceLookupTestCase)
    Test scope lookup of functions in lldb.
----------------------------------------------------------------------
Error when building test subject.

Build Command:
make VPATH=/Users/buildslave/jenkins/workspace/lldb-cmake-matrix/llvm-project/lldb/test/API/lang/cpp/namespace -C /Users/buildslave/jenkins/workspace/lldb-cmake-matrix/lldb-build/lldb-test-build.noindex/lang/cpp/namespace/TestNamespaceLookup.test_scope_lookup_with_run_command_dsym -I /Users/buildslave/jenkins/workspace/lldb-cmake-matrix/llvm-project/lldb/test/API/lang/cpp/namespace -I /Users/buildslave/jenkins/workspace/lldb-cmake-matrix/llvm-project/lldb/packages/Python/lldbsuite/test/make -f /Users/buildslave/jenkins/workspace/lldb-cmake-matrix/llvm-project/lldb/test/API/lang/cpp/namespace/Makefile MAKE_DSYM=YES all ARCH=x86_64 'CC="/Users/buildslave/jenkins/workspace/lldb-cmake-matrix/clang_1101_build/bin/clang"' DSYMUTIL=/Users/buildslave/jenkins/workspace/lldb-cmake-matrix/lldb-build/./bin/dsymutil CODESIGN=codesign CLANG_MODULE_CACHE_DIR=/Users/buildslave/jenkins/workspace/lldb-cmake-matrix/lldb-build/lldb-test-build.noindex/module-cache-clang/lldb-api USE_HERMETIC_LIBCPP=1

Build Command Output:
"/Users/buildslave/jenkins/workspace/lldb-cmake-matrix/clang_1101_build/bin/clang"  -std=c++11 -g -O0 -isysroot "/Applications/Xcode.app/Contents/Developer/Platforms/MacOSX.platform/Developer/SDKs/MacOSX11.1.sdk" -arch x86_64  -I/Users/buildslave/jenkins/workspace/lldb-cmake-matrix/llvm-project/lldb/packages/Python/lldbsuite/test/make/../../../../../include -I/Users/buildslave/jenkins/workspace/lldb-cmake-matrix/llvm-project/lldb/test/API/lang/cpp/namespace -I/Users/buildslave/jenkins/workspace/lldb-cmake-matrix/llvm-project/lldb/packages/Python/lldbsuite/test/make -include /Users/buildslave/jenkins/workspace/lldb-cmake-matrix/llvm-project/lldb/packages/Python/lldbsuite/test/make/test_common.h  -fno-limit-debug-info     --driver-mode=g++ -MT main.o -MD -MP -MF main.d -c -o main.o /Users/buildslave/jenkins/workspace/lldb-cmake-matrix/llvm-project/lldb/test/API/lang/cpp/namespace/main.cpp
In file included from /Users/buildslave/jenkins/workspace/lldb-cmake-matrix/llvm-project/lldb/test/API/lang/cpp/namespace/main.cpp:2:
In file included from /Users/buildslave/jenkins/workspace/lldb-cmake-matrix/clang_1101_build/bin/../include/c++/v1/cstdlib:85:
/Users/buildslave/jenkins/workspace/lldb-cmake-matrix/clang_1101_build/bin/../include/c++/v1/stdlib.h:142:34: error: unknown type name 'ldiv_t'
inline _LIBCPP_INLINE_VISIBILITY ldiv_t div(long __x, long __y) _NOEXCEPT {
                                 ^
/Users/buildslave/jenkins/workspace/lldb-cmake-matrix/clang_1101_build/bin/../include/c++/v1/stdlib.h:143:12: error: no member named 'ldiv' in the global namespace
  return ::ldiv(__x, __y);
         ~~^
/Users/buildslave/jenkins/workspace/lldb-cmake-matrix/clang_1101_build/bin/../include/c++/v1/stdlib.h:146:34: error: unknown type name 'lldiv_t'
inline _LIBCPP_INLINE_VISIBILITY lldiv_t div(long long __x,
                                 ^
/Users/buildslave/jenkins/workspace/lldb-cmake-matrix/clang_1101_build/bin/../include/c++/v1/stdlib.h:148:12: error: no member named 'lldiv' in the global namespace
  return ::lldiv(__x, __y);
         ~~^
In file included from /Users/buildslave/jenkins/workspace/lldb-cmake-matrix/llvm-project/lldb/test/API/lang/cpp/namespace/main.cpp:2:
/Users/buildslave/jenkins/workspace/lldb-cmake-matrix/clang_1101_build/bin/../include/c++/v1/cstdlib:99:9: error: no member named 'size_t' in the global namespace
using ::size_t;
      ~~^
/Users/buildslave/jenkins/workspace/lldb-cmake-matrix/clang_1101_build/bin/../include/c++/v1/cstdlib:100:9: error: no member named 'div_t' in the global namespace
using ::div_t;
      ~~^
/Users/buildslave/jenkins/workspace/lldb-cmake-matrix/clang_1101_build/bin/../include/c++/v1/cstdlib:101:9: error: no member named 'ldiv_t' in the global namespace
using ::ldiv_t;
      ~~^
/Users/buildslave/jenkins/workspace/lldb-cmake-matrix/clang_1101_build/bin/../include/c++/v1/cstdlib:103:9: error: no member named 'lldiv_t' in the global namespace
using ::lldiv_t;
      ~~^
/Users/buildslave/jenkins/workspace/lldb-cmake-matrix/clang_1101_build/bin/../include/c++/v1/cstdlib:105:9: error: no member named 'atof' in the global namespace
using ::atof;
      ~~^
/Users/buildslave/jenkins/workspace/lldb-cmake-matrix/clang_1101_build/bin/../include/c++/v1/cstdlib:106:9: error: no member named 'atoi' in the global namespace
using ::atoi;
      ~~^
/Users/buildslave/jenkins/workspace/lldb-cmake-matrix/clang_1101_build/bin/../include/c++/v1/cstdlib:107:9: error: no member named 'atol' in the global namespace
using ::atol;
      ~~^
/Users/buildslave/jenkins/workspace/lldb-cmake-matrix/clang_1101_build/bin/../include/c++/v1/cstdlib:109:9: error: no member named 'atoll' in the global namespace
using ::atoll;
      ~~^
/Users/buildslave/jenkins/workspace/lldb-cmake-matrix/clang_1101_build/bin/../include/c++/v1/cstdlib:111:9: error: no member named 'strtod' in the global namespace
using ::strtod;
      ~~^
/Users/buildslave/jenkins/workspace/lldb-cmake-matrix/clang_1101_build/bin/../include/c++/v1/cstdlib:112:9: error: no member named 'strtof' in the global namespace
using ::strtof;
      ~~^
/Users/buildslave/jenkins/workspace/lldb-cmake-matrix/clang_1101_build/bin/../include/c++/v1/cstdlib:113:9: error: no member named 'strtold' in the global namespace
using ::strtold;
      ~~^
/Users/buildslave/jenkins/workspace/lldb-cmake-matrix/clang_1101_build/bin/../include/c++/v1/cstdlib:114:9: error: no member named 'strtol' in the global namespace
using ::strtol;
      ~~^
/Users/buildslave/jenkins/workspace/lldb-cmake-matrix/clang_1101_build/bin/../include/c++/v1/cstdlib:116:9: error: no member named 'strtoll' in the global namespace
using ::strtoll;
      ~~^
/Users/buildslave/jenkins/workspace/lldb-cmake-matrix/clang_1101_build/bin/../include/c++/v1/cstdlib:118:9: error: no member named 'strtoul' in the global namespace
using ::strtoul;
      ~~^
/Users/buildslave/jenkins/workspace/lldb-cmake-matrix/clang_1101_build/bin/../include/c++/v1/cstdlib:120:9: error: no member named 'strtoull' in the global namespace
using ::strtoull;
      ~~^
fatal error: too many errors emitted, stopping now [-ferror-limit=]
20 errors generated.
make: *** [main.o] Error 1

Test Directory:
/Users/buildslave/jenkins/workspace/lldb-cmake-matrix/llvm-project/lldb/test/API/lang/cpp/namespace
======================================================================
ERROR: test_scope_lookup_with_run_command_dwarf (TestNamespaceLookup.NamespaceLookupTestCase)
    Test scope lookup of functions in lldb.
----------------------------------------------------------------------
Error when building test subject.

Build Command:
make VPATH=/Users/buildslave/jenkins/workspace/lldb-cmake-matrix/llvm-project/lldb/test/API/lang/cpp/namespace -C /Users/buildslave/jenkins/workspace/lldb-cmake-matrix/lldb-build/lldb-test-build.noindex/lang/cpp/namespace/TestNamespaceLookup.test_scope_lookup_with_run_command_dwarf -I /Users/buildslave/jenkins/workspace/lldb-cmake-matrix/llvm-project/lldb/test/API/lang/cpp/namespace -I /Users/buildslave/jenkins/workspace/lldb-cmake-matrix/llvm-project/lldb/packages/Python/lldbsuite/test/make -f /Users/buildslave/jenkins/workspace/lldb-cmake-matrix/llvm-project/lldb/test/API/lang/cpp/namespace/Makefile MAKE_DSYM=NO all ARCH=x86_64 'CC="/Users/buildslave/jenkins/workspace/lldb-cmake-matrix/clang_1101_build/bin/clang"' DSYMUTIL=/Users/buildslave/jenkins/workspace/lldb-cmake-matrix/lldb-build/./bin/dsymutil CODESIGN=codesign CLANG_MODULE_CACHE_DIR=/Users/buildslave/jenkins/workspace/lldb-cmake-matrix/lldb-build/lldb-test-build.noindex/module-cache-clang/lldb-api USE_HERMETIC_LIBCPP=1

Build Command Output:
"/Users/buildslave/jenkins/workspace/lldb-cmake-matrix/clang_1101_build/bin/clang"  -std=c++11 -g -O0 -isysroot "/Applications/Xcode.app/Contents/Developer/Platforms/MacOSX.platform/Developer/SDKs/MacOSX11.1.sdk" -arch x86_64  -I/Users/buildslave/jenkins/workspace/lldb-cmake-matrix/llvm-project/lldb/packages/Python/lldbsuite/test/make/../../../../../include -I/Users/buildslave/jenkins/workspace/lldb-cmake-matrix/llvm-project/lldb/test/API/lang/cpp/namespace -I/Users/buildslave/jenkins/workspace/lldb-cmake-matrix/llvm-project/lldb/packages/Python/lldbsuite/test/make -include /Users/buildslave/jenkins/workspace/lldb-cmake-matrix/llvm-project/lldb/packages/Python/lldbsuite/test/make/test_common.h  -fno-limit-debug-info     --driver-mode=g++ -MT main.o -MD -MP -MF main.d -c -o main.o /Users/buildslave/jenkins/workspace/lldb-cmake-matrix/llvm-project/lldb/test/API/lang/cpp/namespace/main.cpp
In file included from /Users/buildslave/jenkins/workspace/lldb-cmake-matrix/llvm-project/lldb/test/API/lang/cpp/namespace/main.cpp:2:
In file included from /Users/buildslave/jenkins/workspace/lldb-cmake-matrix/clang_1101_build/bin/../include/c++/v1/cstdlib:85:
/Users/buildslave/jenkins/workspace/lldb-cmake-matrix/clang_1101_build/bin/../include/c++/v1/stdlib.h:142:34: error: unknown type name 'ldiv_t'
inline _LIBCPP_INLINE_VISIBILITY ldiv_t div(long __x, long __y) _NOEXCEPT {
                                 ^
/Users/buildslave/jenkins/workspace/lldb-cmake-matrix/clang_1101_build/bin/../include/c++/v1/stdlib.h:143:12: error: no member named 'ldiv' in the global namespace
  return ::ldiv(__x, __y);
         ~~^
/Users/buildslave/jenkins/workspace/lldb-cmake-matrix/clang_1101_build/bin/../include/c++/v1/stdlib.h:146:34: error: unknown type name 'lldiv_t'
inline _LIBCPP_INLINE_VISIBILITY lldiv_t div(long long __x,
                                 ^
/Users/buildslave/jenkins/workspace/lldb-cmake-matrix/clang_1101_build/bin/../include/c++/v1/stdlib.h:148:12: error: no member named 'lldiv' in the global namespace
  return ::lldiv(__x, __y);
         ~~^
In file included from /Users/buildslave/jenkins/workspace/lldb-cmake-matrix/llvm-project/lldb/test/API/lang/cpp/namespace/main.cpp:2:
/Users/buildslave/jenkins/workspace/lldb-cmake-matrix/clang_1101_build/bin/../include/c++/v1/cstdlib:99:9: error: no member named 'size_t' in the global namespace
using ::size_t;
      ~~^
/Users/buildslave/jenkins/workspace/lldb-cmake-matrix/clang_1101_build/bin/../include/c++/v1/cstdlib:100:9: error: no member named 'div_t' in the global namespace
using ::div_t;
      ~~^
/Users/buildslave/jenkins/workspace/lldb-cmake-matrix/clang_1101_build/bin/../include/c++/v1/cstdlib:101:9: error: no member named 'ldiv_t' in the global namespace
using ::ldiv_t;
      ~~^
/Users/buildslave/jenkins/workspace/lldb-cmake-matrix/clang_1101_build/bin/../include/c++/v1/cstdlib:103:9: error: no member named 'lldiv_t' in the global namespace
using ::lldiv_t;
      ~~^
/Users/buildslave/jenkins/workspace/lldb-cmake-matrix/clang_1101_build/bin/../include/c++/v1/cstdlib:105:9: error: no member named 'atof' in the global namespace
using ::atof;
      ~~^
/Users/buildslave/jenkins/workspace/lldb-cmake-matrix/clang_1101_build/bin/../include/c++/v1/cstdlib:106:9: error: no member named 'atoi' in the global namespace
using ::atoi;
      ~~^
/Users/buildslave/jenkins/workspace/lldb-cmake-matrix/clang_1101_build/bin/../include/c++/v1/cstdlib:107:9: error: no member named 'atol' in the global namespace
using ::atol;
      ~~^
/Users/buildslave/jenkins/workspace/lldb-cmake-matrix/clang_1101_build/bin/../include/c++/v1/cstdlib:109:9: error: no member named 'atoll' in the global namespace
using ::atoll;
      ~~^
/Users/buildslave/jenkins/workspace/lldb-cmake-matrix/clang_1101_build/bin/../include/c++/v1/cstdlib:111:9: error: no member named 'strtod' in the global namespace
using ::strtod;
      ~~^
/Users/buildslave/jenkins/workspace/lldb-cmake-matrix/clang_1101_build/bin/../include/c++/v1/cstdlib:112:9: error: no member named 'strtof' in the global namespace
using ::strtof;
      ~~^
/Users/buildslave/jenkins/workspace/lldb-cmake-matrix/clang_1101_build/bin/../include/c++/v1/cstdlib:113:9: error: no member named 'strtold' in the global namespace
using ::strtold;
      ~~^
/Users/buildslave/jenkins/workspace/lldb-cmake-matrix/clang_1101_build/bin/../include/c++/v1/cstdlib:114:9: error: no member named 'strtol' in the global namespace
using ::strtol;
      ~~^
/Users/buildslave/jenkins/workspace/lldb-cmake-matrix/clang_1101_build/bin/../include/c++/v1/cstdlib:116:9: error: no member named 'strtoll' in the global namespace
using ::strtoll;
      ~~^
/Users/buildslave/jenkins/workspace/lldb-cmake-matrix/clang_1101_build/bin/../include/c++/v1/cstdlib:118:9: error: no member named 'strtoul' in the global namespace
using ::strtoul;
      ~~^
/Users/buildslave/jenkins/workspace/lldb-cmake-matrix/clang_1101_build/bin/../include/c++/v1/cstdlib:120:9: error: no member named 'strtoull' in the global namespace
using ::strtoull;
      ~~^
fatal error: too many errors emitted, stopping now [-ferror-limit=]
20 errors generated.
make: *** [main.o] Error 1

Test Directory:
/Users/buildslave/jenkins/workspace/lldb-cmake-matrix/llvm-project/lldb/test/API/lang/cpp/namespace
----------------------------------------------------------------------
Ran 32 tests in 1.750s

RESULT: FAILED (0 passes, 0 failures, 8 errors, 16 skipped, 8 expected failures, 0 unexpected successes)

--