Regression

Test Clang 11.0.1 / lldb-api.types.TestIntegerType.py (from lldb-api)

Failing for the past 1 build (Since #5017 )
Took 3.3 sec.

Stacktrace

Script:
--
/Applications/Xcode.app/Contents/Developer/Library/Frameworks/Python3.framework/Versions/3.8/bin/python3.8 /Users/buildslave/jenkins/workspace/lldb-cmake-matrix/llvm-project/lldb/test/API/dotest.py -u CXXFLAGS -u CFLAGS --codesign-identity lldb_codesign --arch x86_64 --build-dir /Users/buildslave/jenkins/workspace/lldb-cmake-matrix/lldb-build/lldb-test-build.noindex -t --env TERM=vt100 --skip-category gmodules --skip-category watchpoint --skip-category llgs --skip-category debugserver --arch=x86_64 --env LLVM_LIBS_DIR=/Users/buildslave/jenkins/workspace/lldb-cmake-matrix/lldb-build/./lib --env LLVM_INCLUDE_DIR=/Users/buildslave/jenkins/workspace/lldb-cmake-matrix/lldb-build/include --env LLVM_TOOLS_DIR=/Users/buildslave/jenkins/workspace/lldb-cmake-matrix/lldb-build/./bin --hermetic-libcxx --arch x86_64 --build-dir /Users/buildslave/jenkins/workspace/lldb-cmake-matrix/lldb-build/lldb-test-build.noindex --lldb-module-cache-dir /Users/buildslave/jenkins/workspace/lldb-cmake-matrix/lldb-build/lldb-test-build.noindex/module-cache-lldb/lldb-api --clang-module-cache-dir /Users/buildslave/jenkins/workspace/lldb-cmake-matrix/lldb-build/lldb-test-build.noindex/module-cache-clang/lldb-api --executable /Users/buildslave/jenkins/workspace/lldb-cmake-matrix/lldb-build/./bin/lldb --compiler /Users/buildslave/jenkins/workspace/lldb-cmake-matrix/clang_1101_build/bin/clang --dsymutil /Users/buildslave/jenkins/workspace/lldb-cmake-matrix/lldb-build/./bin/dsymutil --llvm-tools-dir /Users/buildslave/jenkins/workspace/lldb-cmake-matrix/lldb-build/./bin --lldb-libs-dir /Users/buildslave/jenkins/workspace/lldb-cmake-matrix/lldb-build/./lib /Users/buildslave/jenkins/workspace/lldb-cmake-matrix/llvm-project/lldb/test/API/types -p TestIntegerType.py
--
Exit Code: 1

Command Output (stdout):
--
lldb version 16.0.99git (http://labmaster3.local/git/llvm-project.git revision db008af501534d4590542253ae3acf783986f5f7)
  clang revision db008af501534d4590542253ae3acf783986f5f7
  llvm revision db008af501534d4590542253ae3acf783986f5f7
Skipping the following test categories: ['gmodules', 'watchpoint', 'llgs', 'debugserver', 'libstdcxx', 'dwo', 'llgs', 'fork']

--
Command Output (stderr):
--
Change dir to: /Users/buildslave/jenkins/workspace/lldb-cmake-matrix/llvm-project/lldb/test/API/types
runCmd: settings clear -all
output: 

runCmd: settings set symbols.enable-external-lookup false
output: 

runCmd: settings set target.inherit-tcc true
output: 

runCmd: settings set target.detach-on-error false
output: 

runCmd: settings set target.auto-apply-fixits false
output: 

runCmd: settings set plugin.process.gdb-remote.packet-timeout 60
output: 

runCmd: settings set symbols.clang-modules-cache-path "/Users/buildslave/jenkins/workspace/lldb-cmake-matrix/lldb-build/lldb-test-build.noindex/module-cache-lldb/lldb-api"
output: 

runCmd: settings set use-color false
output: 

runCmd: setting set target.prefer-dynamic-value no-dynamic-values
output: 

make VPATH=/Users/buildslave/jenkins/workspace/lldb-cmake-matrix/llvm-project/lldb/test/API/types -C /Users/buildslave/jenkins/workspace/lldb-cmake-matrix/lldb-build/lldb-test-build.noindex/types/TestIntegerType.test_int_type_dsym -I /Users/buildslave/jenkins/workspace/lldb-cmake-matrix/llvm-project/lldb/test/API/types -I /Users/buildslave/jenkins/workspace/lldb-cmake-matrix/llvm-project/lldb/packages/Python/lldbsuite/test/make -f /Users/buildslave/jenkins/workspace/lldb-cmake-matrix/llvm-project/lldb/test/API/types/Makefile MAKE_DSYM=YES all ARCH=x86_64 'CC="/Users/buildslave/jenkins/workspace/lldb-cmake-matrix/clang_1101_build/bin/clang"' DSYMUTIL=/Users/buildslave/jenkins/workspace/lldb-cmake-matrix/lldb-build/./bin/dsymutil CODESIGN=codesign CLANG_MODULE_CACHE_DIR=/Users/buildslave/jenkins/workspace/lldb-cmake-matrix/lldb-build/lldb-test-build.noindex/module-cache-clang/lldb-api USE_HERMETIC_LIBCPP=1 CXX_SOURCES=int.cpp EXE=test_int_type_dsym

FAIL: LLDB (/Users/buildslave/jenkins/workspace/lldb-cmake-matrix/clang_1101_build/bin/clang-x86_64) :: test_int_type_dsym (TestIntegerType.IntegerTypesTestCase)
runCmd: settings clear -all
output: 

runCmd: settings set symbols.enable-external-lookup false
output: 

runCmd: settings set target.inherit-tcc true
output: 

runCmd: settings set target.detach-on-error false
output: 

runCmd: settings set target.auto-apply-fixits false
output: 

runCmd: settings set plugin.process.gdb-remote.packet-timeout 60
output: 

runCmd: settings set symbols.clang-modules-cache-path "/Users/buildslave/jenkins/workspace/lldb-cmake-matrix/lldb-build/lldb-test-build.noindex/module-cache-lldb/lldb-api"
output: 

runCmd: settings set use-color false
output: 

runCmd: setting set target.prefer-dynamic-value no-dynamic-values
output: 

make VPATH=/Users/buildslave/jenkins/workspace/lldb-cmake-matrix/llvm-project/lldb/test/API/types -C /Users/buildslave/jenkins/workspace/lldb-cmake-matrix/lldb-build/lldb-test-build.noindex/types/TestIntegerType.test_int_type_dwarf -I /Users/buildslave/jenkins/workspace/lldb-cmake-matrix/llvm-project/lldb/test/API/types -I /Users/buildslave/jenkins/workspace/lldb-cmake-matrix/llvm-project/lldb/packages/Python/lldbsuite/test/make -f /Users/buildslave/jenkins/workspace/lldb-cmake-matrix/llvm-project/lldb/test/API/types/Makefile MAKE_DSYM=NO all ARCH=x86_64 'CC="/Users/buildslave/jenkins/workspace/lldb-cmake-matrix/clang_1101_build/bin/clang"' DSYMUTIL=/Users/buildslave/jenkins/workspace/lldb-cmake-matrix/lldb-build/./bin/dsymutil CODESIGN=codesign CLANG_MODULE_CACHE_DIR=/Users/buildslave/jenkins/workspace/lldb-cmake-matrix/lldb-build/lldb-test-build.noindex/module-cache-clang/lldb-api USE_HERMETIC_LIBCPP=1 CXX_SOURCES=int.cpp EXE=test_int_type_dwarf

FAIL: LLDB (/Users/buildslave/jenkins/workspace/lldb-cmake-matrix/clang_1101_build/bin/clang-x86_64) :: test_int_type_dwarf (TestIntegerType.IntegerTypesTestCase)
UNSUPPORTED: LLDB (/Users/buildslave/jenkins/workspace/lldb-cmake-matrix/clang_1101_build/bin/clang-x86_64) :: test_int_type_dwo (TestIntegerType.IntegerTypesTestCase) (test case does not fall in any category of interest for this run) 
runCmd: settings clear -all
output: 

runCmd: settings set symbols.enable-external-lookup false
output: 

runCmd: settings set target.inherit-tcc true
output: 

runCmd: settings set target.detach-on-error false
output: 

runCmd: settings set target.auto-apply-fixits false
output: 

runCmd: settings set plugin.process.gdb-remote.packet-timeout 60
output: 

runCmd: settings set symbols.clang-modules-cache-path "/Users/buildslave/jenkins/workspace/lldb-cmake-matrix/lldb-build/lldb-test-build.noindex/module-cache-lldb/lldb-api"
output: 

runCmd: settings set use-color false
output: 

runCmd: setting set target.prefer-dynamic-value no-dynamic-values
output: 

make VPATH=/Users/buildslave/jenkins/workspace/lldb-cmake-matrix/llvm-project/lldb/test/API/types -C /Users/buildslave/jenkins/workspace/lldb-cmake-matrix/lldb-build/lldb-test-build.noindex/types/TestIntegerType.test_int_type_from_block_dsym -I /Users/buildslave/jenkins/workspace/lldb-cmake-matrix/llvm-project/lldb/test/API/types -I /Users/buildslave/jenkins/workspace/lldb-cmake-matrix/llvm-project/lldb/packages/Python/lldbsuite/test/make -f /Users/buildslave/jenkins/workspace/lldb-cmake-matrix/llvm-project/lldb/test/API/types/Makefile MAKE_DSYM=YES all ARCH=x86_64 'CC="/Users/buildslave/jenkins/workspace/lldb-cmake-matrix/clang_1101_build/bin/clang"' DSYMUTIL=/Users/buildslave/jenkins/workspace/lldb-cmake-matrix/lldb-build/./bin/dsymutil CODESIGN=codesign CLANG_MODULE_CACHE_DIR=/Users/buildslave/jenkins/workspace/lldb-cmake-matrix/lldb-build/lldb-test-build.noindex/module-cache-clang/lldb-api USE_HERMETIC_LIBCPP=1 CXX_SOURCES=int.cpp EXE=test_int_type_from_block_dsym

FAIL: LLDB (/Users/buildslave/jenkins/workspace/lldb-cmake-matrix/clang_1101_build/bin/clang-x86_64) :: test_int_type_from_block_dsym (TestIntegerType.IntegerTypesTestCase)
runCmd: settings clear -all
output: 

runCmd: settings set symbols.enable-external-lookup false
output: 

runCmd: settings set target.inherit-tcc true
output: 

runCmd: settings set target.detach-on-error false
output: 

runCmd: settings set target.auto-apply-fixits false
output: 

runCmd: settings set plugin.process.gdb-remote.packet-timeout 60
output: 

runCmd: settings set symbols.clang-modules-cache-path "/Users/buildslave/jenkins/workspace/lldb-cmake-matrix/lldb-build/lldb-test-build.noindex/module-cache-lldb/lldb-api"
output: 

runCmd: settings set use-color false
output: 

runCmd: setting set target.prefer-dynamic-value no-dynamic-values
output: 

make VPATH=/Users/buildslave/jenkins/workspace/lldb-cmake-matrix/llvm-project/lldb/test/API/types -C /Users/buildslave/jenkins/workspace/lldb-cmake-matrix/lldb-build/lldb-test-build.noindex/types/TestIntegerType.test_int_type_from_block_dwarf -I /Users/buildslave/jenkins/workspace/lldb-cmake-matrix/llvm-project/lldb/test/API/types -I /Users/buildslave/jenkins/workspace/lldb-cmake-matrix/llvm-project/lldb/packages/Python/lldbsuite/test/make -f /Users/buildslave/jenkins/workspace/lldb-cmake-matrix/llvm-project/lldb/test/API/types/Makefile MAKE_DSYM=NO all ARCH=x86_64 'CC="/Users/buildslave/jenkins/workspace/lldb-cmake-matrix/clang_1101_build/bin/clang"' DSYMUTIL=/Users/buildslave/jenkins/workspace/lldb-cmake-matrix/lldb-build/./bin/dsymutil CODESIGN=codesign CLANG_MODULE_CACHE_DIR=/Users/buildslave/jenkins/workspace/lldb-cmake-matrix/lldb-build/lldb-test-build.noindex/module-cache-clang/lldb-api USE_HERMETIC_LIBCPP=1 CXX_SOURCES=int.cpp EXE=test_int_type_from_block_dwarf

FAIL: LLDB (/Users/buildslave/jenkins/workspace/lldb-cmake-matrix/clang_1101_build/bin/clang-x86_64) :: test_int_type_from_block_dwarf (TestIntegerType.IntegerTypesTestCase)
UNSUPPORTED: LLDB (/Users/buildslave/jenkins/workspace/lldb-cmake-matrix/clang_1101_build/bin/clang-x86_64) :: test_int_type_from_block_dwo (TestIntegerType.IntegerTypesTestCase) (test case does not fall in any category of interest for this run) 
UNSUPPORTED: LLDB (/Users/buildslave/jenkins/workspace/lldb-cmake-matrix/clang_1101_build/bin/clang-x86_64) :: test_int_type_from_block_gmodules (TestIntegerType.IntegerTypesTestCase) (test case does not fall in any category of interest for this run) 
UNSUPPORTED: LLDB (/Users/buildslave/jenkins/workspace/lldb-cmake-matrix/clang_1101_build/bin/clang-x86_64) :: test_int_type_gmodules (TestIntegerType.IntegerTypesTestCase) (test case does not fall in any category of interest for this run) 
runCmd: settings clear -all
output: 

runCmd: settings set symbols.enable-external-lookup false
output: 

runCmd: settings set target.inherit-tcc true
output: 

runCmd: settings set target.detach-on-error false
output: 

runCmd: settings set target.auto-apply-fixits false
output: 

runCmd: settings set plugin.process.gdb-remote.packet-timeout 60
output: 

runCmd: settings set symbols.clang-modules-cache-path "/Users/buildslave/jenkins/workspace/lldb-cmake-matrix/lldb-build/lldb-test-build.noindex/module-cache-lldb/lldb-api"
output: 

runCmd: settings set use-color false
output: 

runCmd: setting set target.prefer-dynamic-value no-dynamic-values
output: 

make VPATH=/Users/buildslave/jenkins/workspace/lldb-cmake-matrix/llvm-project/lldb/test/API/types -C /Users/buildslave/jenkins/workspace/lldb-cmake-matrix/lldb-build/lldb-test-build.noindex/types/TestIntegerType.test_unsigned_int_type_dsym -I /Users/buildslave/jenkins/workspace/lldb-cmake-matrix/llvm-project/lldb/test/API/types -I /Users/buildslave/jenkins/workspace/lldb-cmake-matrix/llvm-project/lldb/packages/Python/lldbsuite/test/make -f /Users/buildslave/jenkins/workspace/lldb-cmake-matrix/llvm-project/lldb/test/API/types/Makefile MAKE_DSYM=YES all ARCH=x86_64 'CC="/Users/buildslave/jenkins/workspace/lldb-cmake-matrix/clang_1101_build/bin/clang"' DSYMUTIL=/Users/buildslave/jenkins/workspace/lldb-cmake-matrix/lldb-build/./bin/dsymutil CODESIGN=codesign CLANG_MODULE_CACHE_DIR=/Users/buildslave/jenkins/workspace/lldb-cmake-matrix/lldb-build/lldb-test-build.noindex/module-cache-clang/lldb-api USE_HERMETIC_LIBCPP=1 CXX_SOURCES=unsigned_int.cpp EXE=test_unsigned_int_type_dsym

FAIL: LLDB (/Users/buildslave/jenkins/workspace/lldb-cmake-matrix/clang_1101_build/bin/clang-x86_64) :: test_unsigned_int_type_dsym (TestIntegerType.IntegerTypesTestCase)
runCmd: settings clear -all
output: 

runCmd: settings set symbols.enable-external-lookup false
output: 

runCmd: settings set target.inherit-tcc true
output: 

runCmd: settings set target.detach-on-error false
output: 

runCmd: settings set target.auto-apply-fixits false
output: 

runCmd: settings set plugin.process.gdb-remote.packet-timeout 60
output: 

runCmd: settings set symbols.clang-modules-cache-path "/Users/buildslave/jenkins/workspace/lldb-cmake-matrix/lldb-build/lldb-test-build.noindex/module-cache-lldb/lldb-api"
output: 

runCmd: settings set use-color false
output: 

runCmd: setting set target.prefer-dynamic-value no-dynamic-values
output: 

make VPATH=/Users/buildslave/jenkins/workspace/lldb-cmake-matrix/llvm-project/lldb/test/API/types -C /Users/buildslave/jenkins/workspace/lldb-cmake-matrix/lldb-build/lldb-test-build.noindex/types/TestIntegerType.test_unsigned_int_type_dwarf -I /Users/buildslave/jenkins/workspace/lldb-cmake-matrix/llvm-project/lldb/test/API/types -I /Users/buildslave/jenkins/workspace/lldb-cmake-matrix/llvm-project/lldb/packages/Python/lldbsuite/test/make -f /Users/buildslave/jenkins/workspace/lldb-cmake-matrix/llvm-project/lldb/test/API/types/Makefile MAKE_DSYM=NO all ARCH=x86_64 'CC="/Users/buildslave/jenkins/workspace/lldb-cmake-matrix/clang_1101_build/bin/clang"' DSYMUTIL=/Users/buildslave/jenkins/workspace/lldb-cmake-matrix/lldb-build/./bin/dsymutil CODESIGN=codesign CLANG_MODULE_CACHE_DIR=/Users/buildslave/jenkins/workspace/lldb-cmake-matrix/lldb-build/lldb-test-build.noindex/module-cache-clang/lldb-api USE_HERMETIC_LIBCPP=1 CXX_SOURCES=unsigned_int.cpp EXE=test_unsigned_int_type_dwarf

FAIL: LLDB (/Users/buildslave/jenkins/workspace/lldb-cmake-matrix/clang_1101_build/bin/clang-x86_64) :: test_unsigned_int_type_dwarf (TestIntegerType.IntegerTypesTestCase)
UNSUPPORTED: LLDB (/Users/buildslave/jenkins/workspace/lldb-cmake-matrix/clang_1101_build/bin/clang-x86_64) :: test_unsigned_int_type_dwo (TestIntegerType.IntegerTypesTestCase) (test case does not fall in any category of interest for this run) 
runCmd: settings clear -all
output: 

runCmd: settings set symbols.enable-external-lookup false
output: 

runCmd: settings set target.inherit-tcc true
output: 

runCmd: settings set target.detach-on-error false
output: 

runCmd: settings set target.auto-apply-fixits false
output: 

runCmd: settings set plugin.process.gdb-remote.packet-timeout 60
output: 

runCmd: settings set symbols.clang-modules-cache-path "/Users/buildslave/jenkins/workspace/lldb-cmake-matrix/lldb-build/lldb-test-build.noindex/module-cache-lldb/lldb-api"
output: 

runCmd: settings set use-color false
output: 

runCmd: setting set target.prefer-dynamic-value no-dynamic-values
output: 

make VPATH=/Users/buildslave/jenkins/workspace/lldb-cmake-matrix/llvm-project/lldb/test/API/types -C /Users/buildslave/jenkins/workspace/lldb-cmake-matrix/lldb-build/lldb-test-build.noindex/types/TestIntegerType.test_unsigned_int_type_from_block_dsym -I /Users/buildslave/jenkins/workspace/lldb-cmake-matrix/llvm-project/lldb/test/API/types -I /Users/buildslave/jenkins/workspace/lldb-cmake-matrix/llvm-project/lldb/packages/Python/lldbsuite/test/make -f /Users/buildslave/jenkins/workspace/lldb-cmake-matrix/llvm-project/lldb/test/API/types/Makefile MAKE_DSYM=YES all ARCH=x86_64 'CC="/Users/buildslave/jenkins/workspace/lldb-cmake-matrix/clang_1101_build/bin/clang"' DSYMUTIL=/Users/buildslave/jenkins/workspace/lldb-cmake-matrix/lldb-build/./bin/dsymutil CODESIGN=codesign CLANG_MODULE_CACHE_DIR=/Users/buildslave/jenkins/workspace/lldb-cmake-matrix/lldb-build/lldb-test-build.noindex/module-cache-clang/lldb-api USE_HERMETIC_LIBCPP=1 CXX_SOURCES=unsigned_int.cpp EXE=test_unsigned_int_type_from_block_dsym CFLAGS_EXTRAS=-DTEST_BLOCK_CAPTURED_VARS

FAIL: LLDB (/Users/buildslave/jenkins/workspace/lldb-cmake-matrix/clang_1101_build/bin/clang-x86_64) :: test_unsigned_int_type_from_block_dsym (TestIntegerType.IntegerTypesTestCase)
runCmd: settings clear -all
output: 

runCmd: settings set symbols.enable-external-lookup false
output: 

runCmd: settings set target.inherit-tcc true
output: 

runCmd: settings set target.detach-on-error false
output: 

runCmd: settings set target.auto-apply-fixits false
output: 

runCmd: settings set plugin.process.gdb-remote.packet-timeout 60
output: 

runCmd: settings set symbols.clang-modules-cache-path "/Users/buildslave/jenkins/workspace/lldb-cmake-matrix/lldb-build/lldb-test-build.noindex/module-cache-lldb/lldb-api"
output: 

runCmd: settings set use-color false
output: 

runCmd: setting set target.prefer-dynamic-value no-dynamic-values
output: 

make VPATH=/Users/buildslave/jenkins/workspace/lldb-cmake-matrix/llvm-project/lldb/test/API/types -C /Users/buildslave/jenkins/workspace/lldb-cmake-matrix/lldb-build/lldb-test-build.noindex/types/TestIntegerType.test_unsigned_int_type_from_block_dwarf -I /Users/buildslave/jenkins/workspace/lldb-cmake-matrix/llvm-project/lldb/test/API/types -I /Users/buildslave/jenkins/workspace/lldb-cmake-matrix/llvm-project/lldb/packages/Python/lldbsuite/test/make -f /Users/buildslave/jenkins/workspace/lldb-cmake-matrix/llvm-project/lldb/test/API/types/Makefile MAKE_DSYM=NO all ARCH=x86_64 'CC="/Users/buildslave/jenkins/workspace/lldb-cmake-matrix/clang_1101_build/bin/clang"' DSYMUTIL=/Users/buildslave/jenkins/workspace/lldb-cmake-matrix/lldb-build/./bin/dsymutil CODESIGN=codesign CLANG_MODULE_CACHE_DIR=/Users/buildslave/jenkins/workspace/lldb-cmake-matrix/lldb-build/lldb-test-build.noindex/module-cache-clang/lldb-api USE_HERMETIC_LIBCPP=1 CXX_SOURCES=unsigned_int.cpp EXE=test_unsigned_int_type_from_block_dwarf CFLAGS_EXTRAS=-DTEST_BLOCK_CAPTURED_VARS

FAIL: LLDB (/Users/buildslave/jenkins/workspace/lldb-cmake-matrix/clang_1101_build/bin/clang-x86_64) :: test_unsigned_int_type_from_block_dwarf (TestIntegerType.IntegerTypesTestCase)
UNSUPPORTED: LLDB (/Users/buildslave/jenkins/workspace/lldb-cmake-matrix/clang_1101_build/bin/clang-x86_64) :: test_unsigned_int_type_from_block_dwo (TestIntegerType.IntegerTypesTestCase) (test case does not fall in any category of interest for this run) 
UNSUPPORTED: LLDB (/Users/buildslave/jenkins/workspace/lldb-cmake-matrix/clang_1101_build/bin/clang-x86_64) :: test_unsigned_int_type_from_block_gmodules (TestIntegerType.IntegerTypesTestCase) (test case does not fall in any category of interest for this run) 
UNSUPPORTED: LLDB (/Users/buildslave/jenkins/workspace/lldb-cmake-matrix/clang_1101_build/bin/clang-x86_64) :: test_unsigned_int_type_gmodules (TestIntegerType.IntegerTypesTestCase) (test case does not fall in any category of interest for this run) 
Restore dir to: /Users/buildslave/jenkins/workspace/lldb-cmake-matrix/lldb-build/tools/lldb/test
======================================================================
ERROR: test_int_type_dsym (TestIntegerType.IntegerTypesTestCase)
    Test that int-type variables are displayed correctly.
----------------------------------------------------------------------
Error when building test subject.

Build Command:
make VPATH=/Users/buildslave/jenkins/workspace/lldb-cmake-matrix/llvm-project/lldb/test/API/types -C /Users/buildslave/jenkins/workspace/lldb-cmake-matrix/lldb-build/lldb-test-build.noindex/types/TestIntegerType.test_int_type_dsym -I /Users/buildslave/jenkins/workspace/lldb-cmake-matrix/llvm-project/lldb/test/API/types -I /Users/buildslave/jenkins/workspace/lldb-cmake-matrix/llvm-project/lldb/packages/Python/lldbsuite/test/make -f /Users/buildslave/jenkins/workspace/lldb-cmake-matrix/llvm-project/lldb/test/API/types/Makefile MAKE_DSYM=YES all ARCH=x86_64 'CC="/Users/buildslave/jenkins/workspace/lldb-cmake-matrix/clang_1101_build/bin/clang"' DSYMUTIL=/Users/buildslave/jenkins/workspace/lldb-cmake-matrix/lldb-build/./bin/dsymutil CODESIGN=codesign CLANG_MODULE_CACHE_DIR=/Users/buildslave/jenkins/workspace/lldb-cmake-matrix/lldb-build/lldb-test-build.noindex/module-cache-clang/lldb-api USE_HERMETIC_LIBCPP=1 CXX_SOURCES=int.cpp EXE=test_int_type_dsym

Build Command Output:
"/Users/buildslave/jenkins/workspace/lldb-cmake-matrix/clang_1101_build/bin/clang"  -std=c++11 -g -O0 -isysroot "/Applications/Xcode.app/Contents/Developer/Platforms/MacOSX.platform/Developer/SDKs/MacOSX11.1.sdk" -arch x86_64  -I/Users/buildslave/jenkins/workspace/lldb-cmake-matrix/llvm-project/lldb/packages/Python/lldbsuite/test/make/../../../../../include -I/Users/buildslave/jenkins/workspace/lldb-cmake-matrix/llvm-project/lldb/test/API/types -I/Users/buildslave/jenkins/workspace/lldb-cmake-matrix/llvm-project/lldb/packages/Python/lldbsuite/test/make -include /Users/buildslave/jenkins/workspace/lldb-cmake-matrix/llvm-project/lldb/packages/Python/lldbsuite/test/make/test_common.h  -fno-limit-debug-info     --driver-mode=g++ -MT int.o -MD -MP -MF int.d -c -o int.o /Users/buildslave/jenkins/workspace/lldb-cmake-matrix/llvm-project/lldb/test/API/types/int.cpp
In file included from /Users/buildslave/jenkins/workspace/lldb-cmake-matrix/llvm-project/lldb/test/API/types/int.cpp:9:
In file included from /Users/buildslave/jenkins/workspace/lldb-cmake-matrix/llvm-project/lldb/test/API/types/basic_type.cpp:26:
/Users/buildslave/jenkins/workspace/lldb-cmake-matrix/clang_1101_build/bin/../include/c++/v1/cstdint:152:8: error: no member named 'int8_t' in the global namespace
using::int8_t;
     ~~^
/Users/buildslave/jenkins/workspace/lldb-cmake-matrix/clang_1101_build/bin/../include/c++/v1/cstdint:153:8: error: no member named 'int16_t' in the global namespace
using::int16_t;
     ~~^
/Users/buildslave/jenkins/workspace/lldb-cmake-matrix/clang_1101_build/bin/../include/c++/v1/cstdint:154:8: error: no member named 'int32_t' in the global namespace
using::int32_t;
     ~~^
/Users/buildslave/jenkins/workspace/lldb-cmake-matrix/clang_1101_build/bin/../include/c++/v1/cstdint:155:8: error: no member named 'int64_t' in the global namespace
using::int64_t;
     ~~^
/Users/buildslave/jenkins/workspace/lldb-cmake-matrix/clang_1101_build/bin/../include/c++/v1/cstdint:157:8: error: no member named 'uint8_t' in the global namespace
using::uint8_t;
     ~~^
/Users/buildslave/jenkins/workspace/lldb-cmake-matrix/clang_1101_build/bin/../include/c++/v1/cstdint:158:8: error: no member named 'uint16_t' in the global namespace
using::uint16_t;
     ~~^
/Users/buildslave/jenkins/workspace/lldb-cmake-matrix/clang_1101_build/bin/../include/c++/v1/cstdint:159:8: error: no member named 'uint32_t' in the global namespace
using::uint32_t;
     ~~^
/Users/buildslave/jenkins/workspace/lldb-cmake-matrix/clang_1101_build/bin/../include/c++/v1/cstdint:160:8: error: no member named 'uint64_t' in the global namespace
using::uint64_t;
     ~~^
/Users/buildslave/jenkins/workspace/lldb-cmake-matrix/clang_1101_build/bin/../include/c++/v1/cstdint:162:8: error: no member named 'int_least8_t' in the global namespace
using::int_least8_t;
     ~~^
/Users/buildslave/jenkins/workspace/lldb-cmake-matrix/clang_1101_build/bin/../include/c++/v1/cstdint:163:8: error: no member named 'int_least16_t' in the global namespace
using::int_least16_t;
     ~~^
/Users/buildslave/jenkins/workspace/lldb-cmake-matrix/clang_1101_build/bin/../include/c++/v1/cstdint:164:8: error: no member named 'int_least32_t' in the global namespace
using::int_least32_t;
     ~~^
/Users/buildslave/jenkins/workspace/lldb-cmake-matrix/clang_1101_build/bin/../include/c++/v1/cstdint:165:8: error: no member named 'int_least64_t' in the global namespace
using::int_least64_t;
     ~~^
/Users/buildslave/jenkins/workspace/lldb-cmake-matrix/clang_1101_build/bin/../include/c++/v1/cstdint:167:8: error: no member named 'uint_least8_t' in the global namespace
using::uint_least8_t;
     ~~^
/Users/buildslave/jenkins/workspace/lldb-cmake-matrix/clang_1101_build/bin/../include/c++/v1/cstdint:168:8: error: no member named 'uint_least16_t' in the global namespace
using::uint_least16_t;
     ~~^
/Users/buildslave/jenkins/workspace/lldb-cmake-matrix/clang_1101_build/bin/../include/c++/v1/cstdint:169:8: error: no member named 'uint_least32_t' in the global namespace
using::uint_least32_t;
     ~~^
/Users/buildslave/jenkins/workspace/lldb-cmake-matrix/clang_1101_build/bin/../include/c++/v1/cstdint:170:8: error: no member named 'uint_least64_t' in the global namespace
using::uint_least64_t;
     ~~^
/Users/buildslave/jenkins/workspace/lldb-cmake-matrix/clang_1101_build/bin/../include/c++/v1/cstdint:172:8: error: no member named 'int_fast8_t' in the global namespace
using::int_fast8_t;
     ~~^
/Users/buildslave/jenkins/workspace/lldb-cmake-matrix/clang_1101_build/bin/../include/c++/v1/cstdint:173:8: error: no member named 'int_fast16_t' in the global namespace
using::int_fast16_t;
     ~~^
/Users/buildslave/jenkins/workspace/lldb-cmake-matrix/clang_1101_build/bin/../include/c++/v1/cstdint:174:8: error: no member named 'int_fast32_t' in the global namespace
using::int_fast32_t;
     ~~^
fatal error: too many errors emitted, stopping now [-ferror-limit=]
20 errors generated.
make: *** [int.o] Error 1

Test Directory:
/Users/buildslave/jenkins/workspace/lldb-cmake-matrix/llvm-project/lldb/test/API/types
======================================================================
ERROR: test_int_type_dwarf (TestIntegerType.IntegerTypesTestCase)
    Test that int-type variables are displayed correctly.
----------------------------------------------------------------------
Error when building test subject.

Build Command:
make VPATH=/Users/buildslave/jenkins/workspace/lldb-cmake-matrix/llvm-project/lldb/test/API/types -C /Users/buildslave/jenkins/workspace/lldb-cmake-matrix/lldb-build/lldb-test-build.noindex/types/TestIntegerType.test_int_type_dwarf -I /Users/buildslave/jenkins/workspace/lldb-cmake-matrix/llvm-project/lldb/test/API/types -I /Users/buildslave/jenkins/workspace/lldb-cmake-matrix/llvm-project/lldb/packages/Python/lldbsuite/test/make -f /Users/buildslave/jenkins/workspace/lldb-cmake-matrix/llvm-project/lldb/test/API/types/Makefile MAKE_DSYM=NO all ARCH=x86_64 'CC="/Users/buildslave/jenkins/workspace/lldb-cmake-matrix/clang_1101_build/bin/clang"' DSYMUTIL=/Users/buildslave/jenkins/workspace/lldb-cmake-matrix/lldb-build/./bin/dsymutil CODESIGN=codesign CLANG_MODULE_CACHE_DIR=/Users/buildslave/jenkins/workspace/lldb-cmake-matrix/lldb-build/lldb-test-build.noindex/module-cache-clang/lldb-api USE_HERMETIC_LIBCPP=1 CXX_SOURCES=int.cpp EXE=test_int_type_dwarf

Build Command Output:
"/Users/buildslave/jenkins/workspace/lldb-cmake-matrix/clang_1101_build/bin/clang"  -std=c++11 -g -O0 -isysroot "/Applications/Xcode.app/Contents/Developer/Platforms/MacOSX.platform/Developer/SDKs/MacOSX11.1.sdk" -arch x86_64  -I/Users/buildslave/jenkins/workspace/lldb-cmake-matrix/llvm-project/lldb/packages/Python/lldbsuite/test/make/../../../../../include -I/Users/buildslave/jenkins/workspace/lldb-cmake-matrix/llvm-project/lldb/test/API/types -I/Users/buildslave/jenkins/workspace/lldb-cmake-matrix/llvm-project/lldb/packages/Python/lldbsuite/test/make -include /Users/buildslave/jenkins/workspace/lldb-cmake-matrix/llvm-project/lldb/packages/Python/lldbsuite/test/make/test_common.h  -fno-limit-debug-info     --driver-mode=g++ -MT int.o -MD -MP -MF int.d -c -o int.o /Users/buildslave/jenkins/workspace/lldb-cmake-matrix/llvm-project/lldb/test/API/types/int.cpp
In file included from /Users/buildslave/jenkins/workspace/lldb-cmake-matrix/llvm-project/lldb/test/API/types/int.cpp:9:
In file included from /Users/buildslave/jenkins/workspace/lldb-cmake-matrix/llvm-project/lldb/test/API/types/basic_type.cpp:26:
/Users/buildslave/jenkins/workspace/lldb-cmake-matrix/clang_1101_build/bin/../include/c++/v1/cstdint:152:8: error: no member named 'int8_t' in the global namespace
using::int8_t;
     ~~^
/Users/buildslave/jenkins/workspace/lldb-cmake-matrix/clang_1101_build/bin/../include/c++/v1/cstdint:153:8: error: no member named 'int16_t' in the global namespace
using::int16_t;
     ~~^
/Users/buildslave/jenkins/workspace/lldb-cmake-matrix/clang_1101_build/bin/../include/c++/v1/cstdint:154:8: error: no member named 'int32_t' in the global namespace
using::int32_t;
     ~~^
/Users/buildslave/jenkins/workspace/lldb-cmake-matrix/clang_1101_build/bin/../include/c++/v1/cstdint:155:8: error: no member named 'int64_t' in the global namespace
using::int64_t;
     ~~^
/Users/buildslave/jenkins/workspace/lldb-cmake-matrix/clang_1101_build/bin/../include/c++/v1/cstdint:157:8: error: no member named 'uint8_t' in the global namespace
using::uint8_t;
     ~~^
/Users/buildslave/jenkins/workspace/lldb-cmake-matrix/clang_1101_build/bin/../include/c++/v1/cstdint:158:8: error: no member named 'uint16_t' in the global namespace
using::uint16_t;
     ~~^
/Users/buildslave/jenkins/workspace/lldb-cmake-matrix/clang_1101_build/bin/../include/c++/v1/cstdint:159:8: error: no member named 'uint32_t' in the global namespace
using::uint32_t;
     ~~^
/Users/buildslave/jenkins/workspace/lldb-cmake-matrix/clang_1101_build/bin/../include/c++/v1/cstdint:160:8: error: no member named 'uint64_t' in the global namespace
using::uint64_t;
     ~~^
/Users/buildslave/jenkins/workspace/lldb-cmake-matrix/clang_1101_build/bin/../include/c++/v1/cstdint:162:8: error: no member named 'int_least8_t' in the global namespace
using::int_least8_t;
     ~~^
/Users/buildslave/jenkins/workspace/lldb-cmake-matrix/clang_1101_build/bin/../include/c++/v1/cstdint:163:8: error: no member named 'int_least16_t' in the global namespace
using::int_least16_t;
     ~~^
/Users/buildslave/jenkins/workspace/lldb-cmake-matrix/clang_1101_build/bin/../include/c++/v1/cstdint:164:8: error: no member named 'int_least32_t' in the global namespace
using::int_least32_t;
     ~~^
/Users/buildslave/jenkins/workspace/lldb-cmake-matrix/clang_1101_build/bin/../include/c++/v1/cstdint:165:8: error: no member named 'int_least64_t' in the global namespace
using::int_least64_t;
     ~~^
/Users/buildslave/jenkins/workspace/lldb-cmake-matrix/clang_1101_build/bin/../include/c++/v1/cstdint:167:8: error: no member named 'uint_least8_t' in the global namespace
using::uint_least8_t;
     ~~^
/Users/buildslave/jenkins/workspace/lldb-cmake-matrix/clang_1101_build/bin/../include/c++/v1/cstdint:168:8: error: no member named 'uint_least16_t' in the global namespace
using::uint_least16_t;
     ~~^
/Users/buildslave/jenkins/workspace/lldb-cmake-matrix/clang_1101_build/bin/../include/c++/v1/cstdint:169:8: error: no member named 'uint_least32_t' in the global namespace
using::uint_least32_t;
     ~~^
/Users/buildslave/jenkins/workspace/lldb-cmake-matrix/clang_1101_build/bin/../include/c++/v1/cstdint:170:8: error: no member named 'uint_least64_t' in the global namespace
using::uint_least64_t;
     ~~^
/Users/buildslave/jenkins/workspace/lldb-cmake-matrix/clang_1101_build/bin/../include/c++/v1/cstdint:172:8: error: no member named 'int_fast8_t' in the global namespace
using::int_fast8_t;
     ~~^
/Users/buildslave/jenkins/workspace/lldb-cmake-matrix/clang_1101_build/bin/../include/c++/v1/cstdint:173:8: error: no member named 'int_fast16_t' in the global namespace
using::int_fast16_t;
     ~~^
/Users/buildslave/jenkins/workspace/lldb-cmake-matrix/clang_1101_build/bin/../include/c++/v1/cstdint:174:8: error: no member named 'int_fast32_t' in the global namespace
using::int_fast32_t;
     ~~^
fatal error: too many errors emitted, stopping now [-ferror-limit=]
20 errors generated.
make: *** [int.o] Error 1

Test Directory:
/Users/buildslave/jenkins/workspace/lldb-cmake-matrix/llvm-project/lldb/test/API/types
======================================================================
ERROR: test_int_type_from_block_dsym (TestIntegerType.IntegerTypesTestCase)
    Test that int-type variables are displayed correctly from a block.
----------------------------------------------------------------------
Error when building test subject.

Build Command:
make VPATH=/Users/buildslave/jenkins/workspace/lldb-cmake-matrix/llvm-project/lldb/test/API/types -C /Users/buildslave/jenkins/workspace/lldb-cmake-matrix/lldb-build/lldb-test-build.noindex/types/TestIntegerType.test_int_type_from_block_dsym -I /Users/buildslave/jenkins/workspace/lldb-cmake-matrix/llvm-project/lldb/test/API/types -I /Users/buildslave/jenkins/workspace/lldb-cmake-matrix/llvm-project/lldb/packages/Python/lldbsuite/test/make -f /Users/buildslave/jenkins/workspace/lldb-cmake-matrix/llvm-project/lldb/test/API/types/Makefile MAKE_DSYM=YES all ARCH=x86_64 'CC="/Users/buildslave/jenkins/workspace/lldb-cmake-matrix/clang_1101_build/bin/clang"' DSYMUTIL=/Users/buildslave/jenkins/workspace/lldb-cmake-matrix/lldb-build/./bin/dsymutil CODESIGN=codesign CLANG_MODULE_CACHE_DIR=/Users/buildslave/jenkins/workspace/lldb-cmake-matrix/lldb-build/lldb-test-build.noindex/module-cache-clang/lldb-api USE_HERMETIC_LIBCPP=1 CXX_SOURCES=int.cpp EXE=test_int_type_from_block_dsym

Build Command Output:
"/Users/buildslave/jenkins/workspace/lldb-cmake-matrix/clang_1101_build/bin/clang"  -std=c++11 -g -O0 -isysroot "/Applications/Xcode.app/Contents/Developer/Platforms/MacOSX.platform/Developer/SDKs/MacOSX11.1.sdk" -arch x86_64  -I/Users/buildslave/jenkins/workspace/lldb-cmake-matrix/llvm-project/lldb/packages/Python/lldbsuite/test/make/../../../../../include -I/Users/buildslave/jenkins/workspace/lldb-cmake-matrix/llvm-project/lldb/test/API/types -I/Users/buildslave/jenkins/workspace/lldb-cmake-matrix/llvm-project/lldb/packages/Python/lldbsuite/test/make -include /Users/buildslave/jenkins/workspace/lldb-cmake-matrix/llvm-project/lldb/packages/Python/lldbsuite/test/make/test_common.h  -fno-limit-debug-info     --driver-mode=g++ -MT int.o -MD -MP -MF int.d -c -o int.o /Users/buildslave/jenkins/workspace/lldb-cmake-matrix/llvm-project/lldb/test/API/types/int.cpp
In file included from /Users/buildslave/jenkins/workspace/lldb-cmake-matrix/llvm-project/lldb/test/API/types/int.cpp:9:
In file included from /Users/buildslave/jenkins/workspace/lldb-cmake-matrix/llvm-project/lldb/test/API/types/basic_type.cpp:26:
/Users/buildslave/jenkins/workspace/lldb-cmake-matrix/clang_1101_build/bin/../include/c++/v1/cstdint:152:8: error: no member named 'int8_t' in the global namespace
using::int8_t;
     ~~^
/Users/buildslave/jenkins/workspace/lldb-cmake-matrix/clang_1101_build/bin/../include/c++/v1/cstdint:153:8: error: no member named 'int16_t' in the global namespace
using::int16_t;
     ~~^
/Users/buildslave/jenkins/workspace/lldb-cmake-matrix/clang_1101_build/bin/../include/c++/v1/cstdint:154:8: error: no member named 'int32_t' in the global namespace
using::int32_t;
     ~~^
/Users/buildslave/jenkins/workspace/lldb-cmake-matrix/clang_1101_build/bin/../include/c++/v1/cstdint:155:8: error: no member named 'int64_t' in the global namespace
using::int64_t;
     ~~^
/Users/buildslave/jenkins/workspace/lldb-cmake-matrix/clang_1101_build/bin/../include/c++/v1/cstdint:157:8: error: no member named 'uint8_t' in the global namespace
using::uint8_t;
     ~~^
/Users/buildslave/jenkins/workspace/lldb-cmake-matrix/clang_1101_build/bin/../include/c++/v1/cstdint:158:8: error: no member named 'uint16_t' in the global namespace
using::uint16_t;
     ~~^
/Users/buildslave/jenkins/workspace/lldb-cmake-matrix/clang_1101_build/bin/../include/c++/v1/cstdint:159:8: error: no member named 'uint32_t' in the global namespace
using::uint32_t;
     ~~^
/Users/buildslave/jenkins/workspace/lldb-cmake-matrix/clang_1101_build/bin/../include/c++/v1/cstdint:160:8: error: no member named 'uint64_t' in the global namespace
using::uint64_t;
     ~~^
/Users/buildslave/jenkins/workspace/lldb-cmake-matrix/clang_1101_build/bin/../include/c++/v1/cstdint:162:8: error: no member named 'int_least8_t' in the global namespace
using::int_least8_t;
     ~~^
/Users/buildslave/jenkins/workspace/lldb-cmake-matrix/clang_1101_build/bin/../include/c++/v1/cstdint:163:8: error: no member named 'int_least16_t' in the global namespace
using::int_least16_t;
     ~~^
/Users/buildslave/jenkins/workspace/lldb-cmake-matrix/clang_1101_build/bin/../include/c++/v1/cstdint:164:8: error: no member named 'int_least32_t' in the global namespace
using::int_least32_t;
     ~~^
/Users/buildslave/jenkins/workspace/lldb-cmake-matrix/clang_1101_build/bin/../include/c++/v1/cstdint:165:8: error: no member named 'int_least64_t' in the global namespace
using::int_least64_t;
     ~~^
/Users/buildslave/jenkins/workspace/lldb-cmake-matrix/clang_1101_build/bin/../include/c++/v1/cstdint:167:8: error: no member named 'uint_least8_t' in the global namespace
using::uint_least8_t;
     ~~^
/Users/buildslave/jenkins/workspace/lldb-cmake-matrix/clang_1101_build/bin/../include/c++/v1/cstdint:168:8: error: no member named 'uint_least16_t' in the global namespace
using::uint_least16_t;
     ~~^
/Users/buildslave/jenkins/workspace/lldb-cmake-matrix/clang_1101_build/bin/../include/c++/v1/cstdint:169:8: error: no member named 'uint_least32_t' in the global namespace
using::uint_least32_t;
     ~~^
/Users/buildslave/jenkins/workspace/lldb-cmake-matrix/clang_1101_build/bin/../include/c++/v1/cstdint:170:8: error: no member named 'uint_least64_t' in the global namespace
using::uint_least64_t;
     ~~^
/Users/buildslave/jenkins/workspace/lldb-cmake-matrix/clang_1101_build/bin/../include/c++/v1/cstdint:172:8: error: no member named 'int_fast8_t' in the global namespace
using::int_fast8_t;
     ~~^
/Users/buildslave/jenkins/workspace/lldb-cmake-matrix/clang_1101_build/bin/../include/c++/v1/cstdint:173:8: error: no member named 'int_fast16_t' in the global namespace
using::int_fast16_t;
     ~~^
/Users/buildslave/jenkins/workspace/lldb-cmake-matrix/clang_1101_build/bin/../include/c++/v1/cstdint:174:8: error: no member named 'int_fast32_t' in the global namespace
using::int_fast32_t;
     ~~^
fatal error: too many errors emitted, stopping now [-ferror-limit=]
20 errors generated.
make: *** [int.o] Error 1

Test Directory:
/Users/buildslave/jenkins/workspace/lldb-cmake-matrix/llvm-project/lldb/test/API/types
======================================================================
ERROR: test_int_type_from_block_dwarf (TestIntegerType.IntegerTypesTestCase)
    Test that int-type variables are displayed correctly from a block.
----------------------------------------------------------------------
Error when building test subject.

Build Command:
make VPATH=/Users/buildslave/jenkins/workspace/lldb-cmake-matrix/llvm-project/lldb/test/API/types -C /Users/buildslave/jenkins/workspace/lldb-cmake-matrix/lldb-build/lldb-test-build.noindex/types/TestIntegerType.test_int_type_from_block_dwarf -I /Users/buildslave/jenkins/workspace/lldb-cmake-matrix/llvm-project/lldb/test/API/types -I /Users/buildslave/jenkins/workspace/lldb-cmake-matrix/llvm-project/lldb/packages/Python/lldbsuite/test/make -f /Users/buildslave/jenkins/workspace/lldb-cmake-matrix/llvm-project/lldb/test/API/types/Makefile MAKE_DSYM=NO all ARCH=x86_64 'CC="/Users/buildslave/jenkins/workspace/lldb-cmake-matrix/clang_1101_build/bin/clang"' DSYMUTIL=/Users/buildslave/jenkins/workspace/lldb-cmake-matrix/lldb-build/./bin/dsymutil CODESIGN=codesign CLANG_MODULE_CACHE_DIR=/Users/buildslave/jenkins/workspace/lldb-cmake-matrix/lldb-build/lldb-test-build.noindex/module-cache-clang/lldb-api USE_HERMETIC_LIBCPP=1 CXX_SOURCES=int.cpp EXE=test_int_type_from_block_dwarf

Build Command Output:
"/Users/buildslave/jenkins/workspace/lldb-cmake-matrix/clang_1101_build/bin/clang"  -std=c++11 -g -O0 -isysroot "/Applications/Xcode.app/Contents/Developer/Platforms/MacOSX.platform/Developer/SDKs/MacOSX11.1.sdk" -arch x86_64  -I/Users/buildslave/jenkins/workspace/lldb-cmake-matrix/llvm-project/lldb/packages/Python/lldbsuite/test/make/../../../../../include -I/Users/buildslave/jenkins/workspace/lldb-cmake-matrix/llvm-project/lldb/test/API/types -I/Users/buildslave/jenkins/workspace/lldb-cmake-matrix/llvm-project/lldb/packages/Python/lldbsuite/test/make -include /Users/buildslave/jenkins/workspace/lldb-cmake-matrix/llvm-project/lldb/packages/Python/lldbsuite/test/make/test_common.h  -fno-limit-debug-info     --driver-mode=g++ -MT int.o -MD -MP -MF int.d -c -o int.o /Users/buildslave/jenkins/workspace/lldb-cmake-matrix/llvm-project/lldb/test/API/types/int.cpp
In file included from /Users/buildslave/jenkins/workspace/lldb-cmake-matrix/llvm-project/lldb/test/API/types/int.cpp:9:
In file included from /Users/buildslave/jenkins/workspace/lldb-cmake-matrix/llvm-project/lldb/test/API/types/basic_type.cpp:26:
/Users/buildslave/jenkins/workspace/lldb-cmake-matrix/clang_1101_build/bin/../include/c++/v1/cstdint:152:8: error: no member named 'int8_t' in the global namespace
using::int8_t;
     ~~^
/Users/buildslave/jenkins/workspace/lldb-cmake-matrix/clang_1101_build/bin/../include/c++/v1/cstdint:153:8: error: no member named 'int16_t' in the global namespace
using::int16_t;
     ~~^
/Users/buildslave/jenkins/workspace/lldb-cmake-matrix/clang_1101_build/bin/../include/c++/v1/cstdint:154:8: error: no member named 'int32_t' in the global namespace
using::int32_t;
     ~~^
/Users/buildslave/jenkins/workspace/lldb-cmake-matrix/clang_1101_build/bin/../include/c++/v1/cstdint:155:8: error: no member named 'int64_t' in the global namespace
using::int64_t;
     ~~^
/Users/buildslave/jenkins/workspace/lldb-cmake-matrix/clang_1101_build/bin/../include/c++/v1/cstdint:157:8: error: no member named 'uint8_t' in the global namespace
using::uint8_t;
     ~~^
/Users/buildslave/jenkins/workspace/lldb-cmake-matrix/clang_1101_build/bin/../include/c++/v1/cstdint:158:8: error: no member named 'uint16_t' in the global namespace
using::uint16_t;
     ~~^
/Users/buildslave/jenkins/workspace/lldb-cmake-matrix/clang_1101_build/bin/../include/c++/v1/cstdint:159:8: error: no member named 'uint32_t' in the global namespace
using::uint32_t;
     ~~^
/Users/buildslave/jenkins/workspace/lldb-cmake-matrix/clang_1101_build/bin/../include/c++/v1/cstdint:160:8: error: no member named 'uint64_t' in the global namespace
using::uint64_t;
     ~~^
/Users/buildslave/jenkins/workspace/lldb-cmake-matrix/clang_1101_build/bin/../include/c++/v1/cstdint:162:8: error: no member named 'int_least8_t' in the global namespace
using::int_least8_t;
     ~~^
/Users/buildslave/jenkins/workspace/lldb-cmake-matrix/clang_1101_build/bin/../include/c++/v1/cstdint:163:8: error: no member named 'int_least16_t' in the global namespace
using::int_least16_t;
     ~~^
/Users/buildslave/jenkins/workspace/lldb-cmake-matrix/clang_1101_build/bin/../include/c++/v1/cstdint:164:8: error: no member named 'int_least32_t' in the global namespace
using::int_least32_t;
     ~~^
/Users/buildslave/jenkins/workspace/lldb-cmake-matrix/clang_1101_build/bin/../include/c++/v1/cstdint:165:8: error: no member named 'int_least64_t' in the global namespace
using::int_least64_t;
     ~~^
/Users/buildslave/jenkins/workspace/lldb-cmake-matrix/clang_1101_build/bin/../include/c++/v1/cstdint:167:8: error: no member named 'uint_least8_t' in the global namespace
using::uint_least8_t;
     ~~^
/Users/buildslave/jenkins/workspace/lldb-cmake-matrix/clang_1101_build/bin/../include/c++/v1/cstdint:168:8: error: no member named 'uint_least16_t' in the global namespace
using::uint_least16_t;
     ~~^
/Users/buildslave/jenkins/workspace/lldb-cmake-matrix/clang_1101_build/bin/../include/c++/v1/cstdint:169:8: error: no member named 'uint_least32_t' in the global namespace
using::uint_least32_t;
     ~~^
/Users/buildslave/jenkins/workspace/lldb-cmake-matrix/clang_1101_build/bin/../include/c++/v1/cstdint:170:8: error: no member named 'uint_least64_t' in the global namespace
using::uint_least64_t;
     ~~^
/Users/buildslave/jenkins/workspace/lldb-cmake-matrix/clang_1101_build/bin/../include/c++/v1/cstdint:172:8: error: no member named 'int_fast8_t' in the global namespace
using::int_fast8_t;
     ~~^
/Users/buildslave/jenkins/workspace/lldb-cmake-matrix/clang_1101_build/bin/../include/c++/v1/cstdint:173:8: error: no member named 'int_fast16_t' in the global namespace
using::int_fast16_t;
     ~~^
/Users/buildslave/jenkins/workspace/lldb-cmake-matrix/clang_1101_build/bin/../include/c++/v1/cstdint:174:8: error: no member named 'int_fast32_t' in the global namespace
using::int_fast32_t;
     ~~^
fatal error: too many errors emitted, stopping now [-ferror-limit=]
20 errors generated.
make: *** [int.o] Error 1

Test Directory:
/Users/buildslave/jenkins/workspace/lldb-cmake-matrix/llvm-project/lldb/test/API/types
======================================================================
ERROR: test_unsigned_int_type_dsym (TestIntegerType.IntegerTypesTestCase)
    Test that 'unsigned_int'-type variables are displayed correctly.
----------------------------------------------------------------------
Error when building test subject.

Build Command:
make VPATH=/Users/buildslave/jenkins/workspace/lldb-cmake-matrix/llvm-project/lldb/test/API/types -C /Users/buildslave/jenkins/workspace/lldb-cmake-matrix/lldb-build/lldb-test-build.noindex/types/TestIntegerType.test_unsigned_int_type_dsym -I /Users/buildslave/jenkins/workspace/lldb-cmake-matrix/llvm-project/lldb/test/API/types -I /Users/buildslave/jenkins/workspace/lldb-cmake-matrix/llvm-project/lldb/packages/Python/lldbsuite/test/make -f /Users/buildslave/jenkins/workspace/lldb-cmake-matrix/llvm-project/lldb/test/API/types/Makefile MAKE_DSYM=YES all ARCH=x86_64 'CC="/Users/buildslave/jenkins/workspace/lldb-cmake-matrix/clang_1101_build/bin/clang"' DSYMUTIL=/Users/buildslave/jenkins/workspace/lldb-cmake-matrix/lldb-build/./bin/dsymutil CODESIGN=codesign CLANG_MODULE_CACHE_DIR=/Users/buildslave/jenkins/workspace/lldb-cmake-matrix/lldb-build/lldb-test-build.noindex/module-cache-clang/lldb-api USE_HERMETIC_LIBCPP=1 CXX_SOURCES=unsigned_int.cpp EXE=test_unsigned_int_type_dsym

Build Command Output:
"/Users/buildslave/jenkins/workspace/lldb-cmake-matrix/clang_1101_build/bin/clang"  -std=c++11 -g -O0 -isysroot "/Applications/Xcode.app/Contents/Developer/Platforms/MacOSX.platform/Developer/SDKs/MacOSX11.1.sdk" -arch x86_64  -I/Users/buildslave/jenkins/workspace/lldb-cmake-matrix/llvm-project/lldb/packages/Python/lldbsuite/test/make/../../../../../include -I/Users/buildslave/jenkins/workspace/lldb-cmake-matrix/llvm-project/lldb/test/API/types -I/Users/buildslave/jenkins/workspace/lldb-cmake-matrix/llvm-project/lldb/packages/Python/lldbsuite/test/make -include /Users/buildslave/jenkins/workspace/lldb-cmake-matrix/llvm-project/lldb/packages/Python/lldbsuite/test/make/test_common.h  -fno-limit-debug-info     --driver-mode=g++ -MT unsigned_int.o -MD -MP -MF unsigned_int.d -c -o unsigned_int.o /Users/buildslave/jenkins/workspace/lldb-cmake-matrix/llvm-project/lldb/test/API/types/unsigned_int.cpp
In file included from /Users/buildslave/jenkins/workspace/lldb-cmake-matrix/llvm-project/lldb/test/API/types/unsigned_int.cpp:9:
In file included from /Users/buildslave/jenkins/workspace/lldb-cmake-matrix/llvm-project/lldb/test/API/types/basic_type.cpp:26:
/Users/buildslave/jenkins/workspace/lldb-cmake-matrix/clang_1101_build/bin/../include/c++/v1/cstdint:152:8: error: no member named 'int8_t' in the global namespace
using::int8_t;
     ~~^
/Users/buildslave/jenkins/workspace/lldb-cmake-matrix/clang_1101_build/bin/../include/c++/v1/cstdint:153:8: error: no member named 'int16_t' in the global namespace
using::int16_t;
     ~~^
/Users/buildslave/jenkins/workspace/lldb-cmake-matrix/clang_1101_build/bin/../include/c++/v1/cstdint:154:8: error: no member named 'int32_t' in the global namespace
using::int32_t;
     ~~^
/Users/buildslave/jenkins/workspace/lldb-cmake-matrix/clang_1101_build/bin/../include/c++/v1/cstdint:155:8: error: no member named 'int64_t' in the global namespace
using::int64_t;
     ~~^
/Users/buildslave/jenkins/workspace/lldb-cmake-matrix/clang_1101_build/bin/../include/c++/v1/cstdint:157:8: error: no member named 'uint8_t' in the global namespace
using::uint8_t;
     ~~^
/Users/buildslave/jenkins/workspace/lldb-cmake-matrix/clang_1101_build/bin/../include/c++/v1/cstdint:158:8: error: no member named 'uint16_t' in the global namespace
using::uint16_t;
     ~~^
/Users/buildslave/jenkins/workspace/lldb-cmake-matrix/clang_1101_build/bin/../include/c++/v1/cstdint:159:8: error: no member named 'uint32_t' in the global namespace
using::uint32_t;
     ~~^
/Users/buildslave/jenkins/workspace/lldb-cmake-matrix/clang_1101_build/bin/../include/c++/v1/cstdint:160:8: error: no member named 'uint64_t' in the global namespace
using::uint64_t;
     ~~^
/Users/buildslave/jenkins/workspace/lldb-cmake-matrix/clang_1101_build/bin/../include/c++/v1/cstdint:162:8: error: no member named 'int_least8_t' in the global namespace
using::int_least8_t;
     ~~^
/Users/buildslave/jenkins/workspace/lldb-cmake-matrix/clang_1101_build/bin/../include/c++/v1/cstdint:163:8: error: no member named 'int_least16_t' in the global namespace
using::int_least16_t;
     ~~^
/Users/buildslave/jenkins/workspace/lldb-cmake-matrix/clang_1101_build/bin/../include/c++/v1/cstdint:164:8: error: no member named 'int_least32_t' in the global namespace
using::int_least32_t;
     ~~^
/Users/buildslave/jenkins/workspace/lldb-cmake-matrix/clang_1101_build/bin/../include/c++/v1/cstdint:165:8: error: no member named 'int_least64_t' in the global namespace
using::int_least64_t;
     ~~^
/Users/buildslave/jenkins/workspace/lldb-cmake-matrix/clang_1101_build/bin/../include/c++/v1/cstdint:167:8: error: no member named 'uint_least8_t' in the global namespace
using::uint_least8_t;
     ~~^
/Users/buildslave/jenkins/workspace/lldb-cmake-matrix/clang_1101_build/bin/../include/c++/v1/cstdint:168:8: error: no member named 'uint_least16_t' in the global namespace
using::uint_least16_t;
     ~~^
/Users/buildslave/jenkins/workspace/lldb-cmake-matrix/clang_1101_build/bin/../include/c++/v1/cstdint:169:8: error: no member named 'uint_least32_t' in the global namespace
using::uint_least32_t;
     ~~^
/Users/buildslave/jenkins/workspace/lldb-cmake-matrix/clang_1101_build/bin/../include/c++/v1/cstdint:170:8: error: no member named 'uint_least64_t' in the global namespace
using::uint_least64_t;
     ~~^
/Users/buildslave/jenkins/workspace/lldb-cmake-matrix/clang_1101_build/bin/../include/c++/v1/cstdint:172:8: error: no member named 'int_fast8_t' in the global namespace
using::int_fast8_t;
     ~~^
/Users/buildslave/jenkins/workspace/lldb-cmake-matrix/clang_1101_build/bin/../include/c++/v1/cstdint:173:8: error: no member named 'int_fast16_t' in the global namespace
using::int_fast16_t;
     ~~^
/Users/buildslave/jenkins/workspace/lldb-cmake-matrix/clang_1101_build/bin/../include/c++/v1/cstdint:174:8: error: no member named 'int_fast32_t' in the global namespace
using::int_fast32_t;
     ~~^
fatal error: too many errors emitted, stopping now [-ferror-limit=]
20 errors generated.
make: *** [unsigned_int.o] Error 1

Test Directory:
/Users/buildslave/jenkins/workspace/lldb-cmake-matrix/llvm-project/lldb/test/API/types
======================================================================
ERROR: test_unsigned_int_type_dwarf (TestIntegerType.IntegerTypesTestCase)
    Test that 'unsigned_int'-type variables are displayed correctly.
----------------------------------------------------------------------
Error when building test subject.

Build Command:
make VPATH=/Users/buildslave/jenkins/workspace/lldb-cmake-matrix/llvm-project/lldb/test/API/types -C /Users/buildslave/jenkins/workspace/lldb-cmake-matrix/lldb-build/lldb-test-build.noindex/types/TestIntegerType.test_unsigned_int_type_dwarf -I /Users/buildslave/jenkins/workspace/lldb-cmake-matrix/llvm-project/lldb/test/API/types -I /Users/buildslave/jenkins/workspace/lldb-cmake-matrix/llvm-project/lldb/packages/Python/lldbsuite/test/make -f /Users/buildslave/jenkins/workspace/lldb-cmake-matrix/llvm-project/lldb/test/API/types/Makefile MAKE_DSYM=NO all ARCH=x86_64 'CC="/Users/buildslave/jenkins/workspace/lldb-cmake-matrix/clang_1101_build/bin/clang"' DSYMUTIL=/Users/buildslave/jenkins/workspace/lldb-cmake-matrix/lldb-build/./bin/dsymutil CODESIGN=codesign CLANG_MODULE_CACHE_DIR=/Users/buildslave/jenkins/workspace/lldb-cmake-matrix/lldb-build/lldb-test-build.noindex/module-cache-clang/lldb-api USE_HERMETIC_LIBCPP=1 CXX_SOURCES=unsigned_int.cpp EXE=test_unsigned_int_type_dwarf

Build Command Output:
"/Users/buildslave/jenkins/workspace/lldb-cmake-matrix/clang_1101_build/bin/clang"  -std=c++11 -g -O0 -isysroot "/Applications/Xcode.app/Contents/Developer/Platforms/MacOSX.platform/Developer/SDKs/MacOSX11.1.sdk" -arch x86_64  -I/Users/buildslave/jenkins/workspace/lldb-cmake-matrix/llvm-project/lldb/packages/Python/lldbsuite/test/make/../../../../../include -I/Users/buildslave/jenkins/workspace/lldb-cmake-matrix/llvm-project/lldb/test/API/types -I/Users/buildslave/jenkins/workspace/lldb-cmake-matrix/llvm-project/lldb/packages/Python/lldbsuite/test/make -include /Users/buildslave/jenkins/workspace/lldb-cmake-matrix/llvm-project/lldb/packages/Python/lldbsuite/test/make/test_common.h  -fno-limit-debug-info     --driver-mode=g++ -MT unsigned_int.o -MD -MP -MF unsigned_int.d -c -o unsigned_int.o /Users/buildslave/jenkins/workspace/lldb-cmake-matrix/llvm-project/lldb/test/API/types/unsigned_int.cpp
In file included from /Users/buildslave/jenkins/workspace/lldb-cmake-matrix/llvm-project/lldb/test/API/types/unsigned_int.cpp:9:
In file included from /Users/buildslave/jenkins/workspace/lldb-cmake-matrix/llvm-project/lldb/test/API/types/basic_type.cpp:26:
/Users/buildslave/jenkins/workspace/lldb-cmake-matrix/clang_1101_build/bin/../include/c++/v1/cstdint:152:8: error: no member named 'int8_t' in the global namespace
using::int8_t;
     ~~^
/Users/buildslave/jenkins/workspace/lldb-cmake-matrix/clang_1101_build/bin/../include/c++/v1/cstdint:153:8: error: no member named 'int16_t' in the global namespace
using::int16_t;
     ~~^
/Users/buildslave/jenkins/workspace/lldb-cmake-matrix/clang_1101_build/bin/../include/c++/v1/cstdint:154:8: error: no member named 'int32_t' in the global namespace
using::int32_t;
     ~~^
/Users/buildslave/jenkins/workspace/lldb-cmake-matrix/clang_1101_build/bin/../include/c++/v1/cstdint:155:8: error: no member named 'int64_t' in the global namespace
using::int64_t;
     ~~^
/Users/buildslave/jenkins/workspace/lldb-cmake-matrix/clang_1101_build/bin/../include/c++/v1/cstdint:157:8: error: no member named 'uint8_t' in the global namespace
using::uint8_t;
     ~~^
/Users/buildslave/jenkins/workspace/lldb-cmake-matrix/clang_1101_build/bin/../include/c++/v1/cstdint:158:8: error: no member named 'uint16_t' in the global namespace
using::uint16_t;
     ~~^
/Users/buildslave/jenkins/workspace/lldb-cmake-matrix/clang_1101_build/bin/../include/c++/v1/cstdint:159:8: error: no member named 'uint32_t' in the global namespace
using::uint32_t;
     ~~^
/Users/buildslave/jenkins/workspace/lldb-cmake-matrix/clang_1101_build/bin/../include/c++/v1/cstdint:160:8: error: no member named 'uint64_t' in the global namespace
using::uint64_t;
     ~~^
/Users/buildslave/jenkins/workspace/lldb-cmake-matrix/clang_1101_build/bin/../include/c++/v1/cstdint:162:8: error: no member named 'int_least8_t' in the global namespace
using::int_least8_t;
     ~~^
/Users/buildslave/jenkins/workspace/lldb-cmake-matrix/clang_1101_build/bin/../include/c++/v1/cstdint:163:8: error: no member named 'int_least16_t' in the global namespace
using::int_least16_t;
     ~~^
/Users/buildslave/jenkins/workspace/lldb-cmake-matrix/clang_1101_build/bin/../include/c++/v1/cstdint:164:8: error: no member named 'int_least32_t' in the global namespace
using::int_least32_t;
     ~~^
/Users/buildslave/jenkins/workspace/lldb-cmake-matrix/clang_1101_build/bin/../include/c++/v1/cstdint:165:8: error: no member named 'int_least64_t' in the global namespace
using::int_least64_t;
     ~~^
/Users/buildslave/jenkins/workspace/lldb-cmake-matrix/clang_1101_build/bin/../include/c++/v1/cstdint:167:8: error: no member named 'uint_least8_t' in the global namespace
using::uint_least8_t;
     ~~^
/Users/buildslave/jenkins/workspace/lldb-cmake-matrix/clang_1101_build/bin/../include/c++/v1/cstdint:168:8: error: no member named 'uint_least16_t' in the global namespace
using::uint_least16_t;
     ~~^
/Users/buildslave/jenkins/workspace/lldb-cmake-matrix/clang_1101_build/bin/../include/c++/v1/cstdint:169:8: error: no member named 'uint_least32_t' in the global namespace
using::uint_least32_t;
     ~~^
/Users/buildslave/jenkins/workspace/lldb-cmake-matrix/clang_1101_build/bin/../include/c++/v1/cstdint:170:8: error: no member named 'uint_least64_t' in the global namespace
using::uint_least64_t;
     ~~^
/Users/buildslave/jenkins/workspace/lldb-cmake-matrix/clang_1101_build/bin/../include/c++/v1/cstdint:172:8: error: no member named 'int_fast8_t' in the global namespace
using::int_fast8_t;
     ~~^
/Users/buildslave/jenkins/workspace/lldb-cmake-matrix/clang_1101_build/bin/../include/c++/v1/cstdint:173:8: error: no member named 'int_fast16_t' in the global namespace
using::int_fast16_t;
     ~~^
/Users/buildslave/jenkins/workspace/lldb-cmake-matrix/clang_1101_build/bin/../include/c++/v1/cstdint:174:8: error: no member named 'int_fast32_t' in the global namespace
using::int_fast32_t;
     ~~^
fatal error: too many errors emitted, stopping now [-ferror-limit=]
20 errors generated.
make: *** [unsigned_int.o] Error 1

Test Directory:
/Users/buildslave/jenkins/workspace/lldb-cmake-matrix/llvm-project/lldb/test/API/types
======================================================================
ERROR: test_unsigned_int_type_from_block_dsym (TestIntegerType.IntegerTypesTestCase)
    Test that 'unsigned int'-type variables are displayed correctly from a block.
----------------------------------------------------------------------
Error when building test subject.

Build Command:
make VPATH=/Users/buildslave/jenkins/workspace/lldb-cmake-matrix/llvm-project/lldb/test/API/types -C /Users/buildslave/jenkins/workspace/lldb-cmake-matrix/lldb-build/lldb-test-build.noindex/types/TestIntegerType.test_unsigned_int_type_from_block_dsym -I /Users/buildslave/jenkins/workspace/lldb-cmake-matrix/llvm-project/lldb/test/API/types -I /Users/buildslave/jenkins/workspace/lldb-cmake-matrix/llvm-project/lldb/packages/Python/lldbsuite/test/make -f /Users/buildslave/jenkins/workspace/lldb-cmake-matrix/llvm-project/lldb/test/API/types/Makefile MAKE_DSYM=YES all ARCH=x86_64 'CC="/Users/buildslave/jenkins/workspace/lldb-cmake-matrix/clang_1101_build/bin/clang"' DSYMUTIL=/Users/buildslave/jenkins/workspace/lldb-cmake-matrix/lldb-build/./bin/dsymutil CODESIGN=codesign CLANG_MODULE_CACHE_DIR=/Users/buildslave/jenkins/workspace/lldb-cmake-matrix/lldb-build/lldb-test-build.noindex/module-cache-clang/lldb-api USE_HERMETIC_LIBCPP=1 CXX_SOURCES=unsigned_int.cpp EXE=test_unsigned_int_type_from_block_dsym CFLAGS_EXTRAS=-DTEST_BLOCK_CAPTURED_VARS

Build Command Output:
"/Users/buildslave/jenkins/workspace/lldb-cmake-matrix/clang_1101_build/bin/clang"  -std=c++11 -g -O0 -isysroot "/Applications/Xcode.app/Contents/Developer/Platforms/MacOSX.platform/Developer/SDKs/MacOSX11.1.sdk" -arch x86_64  -I/Users/buildslave/jenkins/workspace/lldb-cmake-matrix/llvm-project/lldb/packages/Python/lldbsuite/test/make/../../../../../include -I/Users/buildslave/jenkins/workspace/lldb-cmake-matrix/llvm-project/lldb/test/API/types -I/Users/buildslave/jenkins/workspace/lldb-cmake-matrix/llvm-project/lldb/packages/Python/lldbsuite/test/make -include /Users/buildslave/jenkins/workspace/lldb-cmake-matrix/llvm-project/lldb/packages/Python/lldbsuite/test/make/test_common.h  -fno-limit-debug-info  -DTEST_BLOCK_CAPTURED_VARS   --driver-mode=g++ -MT unsigned_int.o -MD -MP -MF unsigned_int.d -c -o unsigned_int.o /Users/buildslave/jenkins/workspace/lldb-cmake-matrix/llvm-project/lldb/test/API/types/unsigned_int.cpp
In file included from /Users/buildslave/jenkins/workspace/lldb-cmake-matrix/llvm-project/lldb/test/API/types/unsigned_int.cpp:9:
In file included from /Users/buildslave/jenkins/workspace/lldb-cmake-matrix/llvm-project/lldb/test/API/types/basic_type.cpp:24:
In file included from /Applications/Xcode.app/Contents/Developer/Platforms/MacOSX.platform/Developer/SDKs/MacOSX11.1.sdk/usr/include/dispatch/dispatch.h:40:
/Users/buildslave/jenkins/workspace/lldb-cmake-matrix/clang_1101_build/bin/../include/c++/v1/string.h:73:64: error: use of undeclared identifier 'strchr'
char* __libcpp_strchr(const char* __s, int __c) {return (char*)strchr(__s, __c);}
                                                               ^
/Users/buildslave/jenkins/workspace/lldb-cmake-matrix/clang_1101_build/bin/../include/c++/v1/string.h:80:75: error: use of undeclared identifier 'strpbrk'
char* __libcpp_strpbrk(const char* __s1, const char* __s2) {return (char*)strpbrk(__s1, __s2);}
                                                                          ^
/Users/buildslave/jenkins/workspace/lldb-cmake-matrix/clang_1101_build/bin/../include/c++/v1/string.h:87:65: error: use of undeclared identifier 'strrchr'; did you mean 'strchr'?
char* __libcpp_strrchr(const char* __s, int __c) {return (char*)strrchr(__s, __c);}
                                                                ^
/Users/buildslave/jenkins/workspace/lldb-cmake-matrix/clang_1101_build/bin/../include/c++/v1/string.h:75:13: note: 'strchr' declared here
const char* strchr(const char* __s, int __c) {return __libcpp_strchr(__s, __c);}
            ^
/Users/buildslave/jenkins/workspace/lldb-cmake-matrix/clang_1101_build/bin/../include/c++/v1/string.h:94:76: error: use of undeclared identifier 'memchr'
void* __libcpp_memchr(const void* __s, int __c, size_t __n) {return (void*)memchr(__s, __c, __n);}
                                                                           ^
/Users/buildslave/jenkins/workspace/lldb-cmake-matrix/clang_1101_build/bin/../include/c++/v1/string.h:101:74: error: use of undeclared identifier 'strstr'; did you mean 'strchr'?
char* __libcpp_strstr(const char* __s1, const char* __s2) {return (char*)strstr(__s1, __s2);}
                                                                         ^
/Users/buildslave/jenkins/workspace/lldb-cmake-matrix/clang_1101_build/bin/../include/c++/v1/string.h:77:13: note: 'strchr' declared here
      char* strchr(      char* __s, int __c) {return __libcpp_strchr(__s, __c);}
            ^
/Users/buildslave/jenkins/workspace/lldb-cmake-matrix/clang_1101_build/bin/../include/c++/v1/string.h:101:74: error: no matching function for call to 'strchr'
char* __libcpp_strstr(const char* __s1, const char* __s2) {return (char*)strstr(__s1, __s2);}
                                                                         ^
/Users/buildslave/jenkins/workspace/lldb-cmake-matrix/clang_1101_build/bin/../include/c++/v1/string.h:77:13: note: candidate disabled: <no message provided>
      char* strchr(      char* __s, int __c) {return __libcpp_strchr(__s, __c);}
            ^
/Users/buildslave/jenkins/workspace/lldb-cmake-matrix/clang_1101_build/bin/../include/c++/v1/string.h:101:81: error: cannot initialize a parameter of type 'char *' with an lvalue of type 'const char *'
char* __libcpp_strstr(const char* __s1, const char* __s2) {return (char*)strstr(__s1, __s2);}
                                                                                ^~~~
/Users/buildslave/jenkins/workspace/lldb-cmake-matrix/clang_1101_build/bin/../include/c++/v1/string.h:77:32: note: passing argument to parameter '__s' here
      char* strchr(      char* __s, int __c) {return __libcpp_strchr(__s, __c);}
                               ^
In file included from /Users/buildslave/jenkins/workspace/lldb-cmake-matrix/llvm-project/lldb/test/API/types/unsigned_int.cpp:9:
In file included from /Users/buildslave/jenkins/workspace/lldb-cmake-matrix/llvm-project/lldb/test/API/types/basic_type.cpp:24:
In file included from /Applications/Xcode.app/Contents/Developer/Platforms/MacOSX.platform/Developer/SDKs/MacOSX11.1.sdk/usr/include/dispatch/dispatch.h:64:
In file included from /Applications/Xcode.app/Contents/Developer/Platforms/MacOSX.platform/Developer/SDKs/MacOSX11.1.sdk/usr/include/os/workgroup.h:29:
In file included from /Applications/Xcode.app/Contents/Developer/Platforms/MacOSX.platform/Developer/SDKs/MacOSX11.1.sdk/usr/include/os/workgroup_base.h:13:
/Users/buildslave/jenkins/workspace/lldb-cmake-matrix/clang_1101_build/bin/../include/c++/v1/stdlib.h:142:34: error: unknown type name 'ldiv_t'; did you mean 'dev_t'?
inline _LIBCPP_INLINE_VISIBILITY ldiv_t div(long __x, long __y) _NOEXCEPT {
                                 ^
/Applications/Xcode.app/Contents/Developer/Platforms/MacOSX.platform/Developer/SDKs/MacOSX11.1.sdk/usr/include/sys/_types/_dev_t.h:31:31: note: 'dev_t' declared here
typedef __darwin_dev_t        dev_t;    /* device number */
                              ^
In file included from /Users/buildslave/jenkins/workspace/lldb-cmake-matrix/llvm-project/lldb/test/API/types/unsigned_int.cpp:9:
In file included from /Users/buildslave/jenkins/workspace/lldb-cmake-matrix/llvm-project/lldb/test/API/types/basic_type.cpp:24:
In file included from /Applications/Xcode.app/Contents/Developer/Platforms/MacOSX.platform/Developer/SDKs/MacOSX11.1.sdk/usr/include/dispatch/dispatch.h:64:
In file included from /Applications/Xcode.app/Contents/Developer/Platforms/MacOSX.platform/Developer/SDKs/MacOSX11.1.sdk/usr/include/os/workgroup.h:29:
In file included from /Applications/Xcode.app/Contents/Developer/Platforms/MacOSX.platform/Developer/SDKs/MacOSX11.1.sdk/usr/include/os/workgroup_base.h:13:
/Users/buildslave/jenkins/workspace/lldb-cmake-matrix/clang_1101_build/bin/../include/c++/v1/stdlib.h:143:12: error: no member named 'ldiv' in the global namespace; did you mean 'div'?
  return ::ldiv(__x, __y);
         ~~^
/Users/buildslave/jenkins/workspace/lldb-cmake-matrix/clang_1101_build/bin/../include/c++/v1/stdlib.h:142:41: note: 'div' declared here
inline _LIBCPP_INLINE_VISIBILITY ldiv_t div(long __x, long __y) _NOEXCEPT {
                                        ^
/Users/buildslave/jenkins/workspace/lldb-cmake-matrix/clang_1101_build/bin/../include/c++/v1/stdlib.h:146:34: error: unknown type name 'lldiv_t'
inline _LIBCPP_INLINE_VISIBILITY lldiv_t div(long long __x,
                                 ^
/Users/buildslave/jenkins/workspace/lldb-cmake-matrix/clang_1101_build/bin/../include/c++/v1/stdlib.h:148:12: error: no member named 'lldiv' in the global namespace
  return ::lldiv(__x, __y);
         ~~^
In file included from /Users/buildslave/jenkins/workspace/lldb-cmake-matrix/llvm-project/lldb/test/API/types/unsigned_int.cpp:9:
In file included from /Users/buildslave/jenkins/workspace/lldb-cmake-matrix/llvm-project/lldb/test/API/types/basic_type.cpp:26:
/Users/buildslave/jenkins/workspace/lldb-cmake-matrix/clang_1101_build/bin/../include/c++/v1/cstdint:157:8: error: no member named 'uint8_t' in the global namespace
using::uint8_t;
     ~~^
/Users/buildslave/jenkins/workspace/lldb-cmake-matrix/clang_1101_build/bin/../include/c++/v1/cstdint:158:8: error: no member named 'uint16_t' in the global namespace
using::uint16_t;
     ~~^
/Users/buildslave/jenkins/workspace/lldb-cmake-matrix/clang_1101_build/bin/../include/c++/v1/cstdint:162:8: error: no member named 'int_least8_t' in the global namespace
using::int_least8_t;
     ~~^
/Users/buildslave/jenkins/workspace/lldb-cmake-matrix/clang_1101_build/bin/../include/c++/v1/cstdint:163:8: error: no member named 'int_least16_t' in the global namespace
using::int_least16_t;
     ~~^
/Users/buildslave/jenkins/workspace/lldb-cmake-matrix/clang_1101_build/bin/../include/c++/v1/cstdint:164:8: error: no member named 'int_least32_t' in the global namespace
using::int_least32_t;
     ~~^
/Users/buildslave/jenkins/workspace/lldb-cmake-matrix/clang_1101_build/bin/../include/c++/v1/cstdint:165:8: error: no member named 'int_least64_t' in the global namespace
using::int_least64_t;
     ~~^
/Users/buildslave/jenkins/workspace/lldb-cmake-matrix/clang_1101_build/bin/../include/c++/v1/cstdint:167:8: error: no member named 'uint_least8_t' in the global namespace
using::uint_least8_t;
     ~~^
/Users/buildslave/jenkins/workspace/lldb-cmake-matrix/clang_1101_build/bin/../include/c++/v1/cstdint:168:8: error: no member named 'uint_least16_t' in the global namespace
using::uint_least16_t;
     ~~^
fatal error: too many errors emitted, stopping now [-ferror-limit=]
20 errors generated.
make: *** [unsigned_int.o] Error 1

Test Directory:
/Users/buildslave/jenkins/workspace/lldb-cmake-matrix/llvm-project/lldb/test/API/types
======================================================================
ERROR: test_unsigned_int_type_from_block_dwarf (TestIntegerType.IntegerTypesTestCase)
    Test that 'unsigned int'-type variables are displayed correctly from a block.
----------------------------------------------------------------------
Error when building test subject.

Build Command:
make VPATH=/Users/buildslave/jenkins/workspace/lldb-cmake-matrix/llvm-project/lldb/test/API/types -C /Users/buildslave/jenkins/workspace/lldb-cmake-matrix/lldb-build/lldb-test-build.noindex/types/TestIntegerType.test_unsigned_int_type_from_block_dwarf -I /Users/buildslave/jenkins/workspace/lldb-cmake-matrix/llvm-project/lldb/test/API/types -I /Users/buildslave/jenkins/workspace/lldb-cmake-matrix/llvm-project/lldb/packages/Python/lldbsuite/test/make -f /Users/buildslave/jenkins/workspace/lldb-cmake-matrix/llvm-project/lldb/test/API/types/Makefile MAKE_DSYM=NO all ARCH=x86_64 'CC="/Users/buildslave/jenkins/workspace/lldb-cmake-matrix/clang_1101_build/bin/clang"' DSYMUTIL=/Users/buildslave/jenkins/workspace/lldb-cmake-matrix/lldb-build/./bin/dsymutil CODESIGN=codesign CLANG_MODULE_CACHE_DIR=/Users/buildslave/jenkins/workspace/lldb-cmake-matrix/lldb-build/lldb-test-build.noindex/module-cache-clang/lldb-api USE_HERMETIC_LIBCPP=1 CXX_SOURCES=unsigned_int.cpp EXE=test_unsigned_int_type_from_block_dwarf CFLAGS_EXTRAS=-DTEST_BLOCK_CAPTURED_VARS

Build Command Output:
"/Users/buildslave/jenkins/workspace/lldb-cmake-matrix/clang_1101_build/bin/clang"  -std=c++11 -g -O0 -isysroot "/Applications/Xcode.app/Contents/Developer/Platforms/MacOSX.platform/Developer/SDKs/MacOSX11.1.sdk" -arch x86_64  -I/Users/buildslave/jenkins/workspace/lldb-cmake-matrix/llvm-project/lldb/packages/Python/lldbsuite/test/make/../../../../../include -I/Users/buildslave/jenkins/workspace/lldb-cmake-matrix/llvm-project/lldb/test/API/types -I/Users/buildslave/jenkins/workspace/lldb-cmake-matrix/llvm-project/lldb/packages/Python/lldbsuite/test/make -include /Users/buildslave/jenkins/workspace/lldb-cmake-matrix/llvm-project/lldb/packages/Python/lldbsuite/test/make/test_common.h  -fno-limit-debug-info  -DTEST_BLOCK_CAPTURED_VARS   --driver-mode=g++ -MT unsigned_int.o -MD -MP -MF unsigned_int.d -c -o unsigned_int.o /Users/buildslave/jenkins/workspace/lldb-cmake-matrix/llvm-project/lldb/test/API/types/unsigned_int.cpp
In file included from /Users/buildslave/jenkins/workspace/lldb-cmake-matrix/llvm-project/lldb/test/API/types/unsigned_int.cpp:9:
In file included from /Users/buildslave/jenkins/workspace/lldb-cmake-matrix/llvm-project/lldb/test/API/types/basic_type.cpp:24:
In file included from /Applications/Xcode.app/Contents/Developer/Platforms/MacOSX.platform/Developer/SDKs/MacOSX11.1.sdk/usr/include/dispatch/dispatch.h:40:
/Users/buildslave/jenkins/workspace/lldb-cmake-matrix/clang_1101_build/bin/../include/c++/v1/string.h:73:64: error: use of undeclared identifier 'strchr'
char* __libcpp_strchr(const char* __s, int __c) {return (char*)strchr(__s, __c);}
                                                               ^
/Users/buildslave/jenkins/workspace/lldb-cmake-matrix/clang_1101_build/bin/../include/c++/v1/string.h:80:75: error: use of undeclared identifier 'strpbrk'
char* __libcpp_strpbrk(const char* __s1, const char* __s2) {return (char*)strpbrk(__s1, __s2);}
                                                                          ^
/Users/buildslave/jenkins/workspace/lldb-cmake-matrix/clang_1101_build/bin/../include/c++/v1/string.h:87:65: error: use of undeclared identifier 'strrchr'; did you mean 'strchr'?
char* __libcpp_strrchr(const char* __s, int __c) {return (char*)strrchr(__s, __c);}
                                                                ^
/Users/buildslave/jenkins/workspace/lldb-cmake-matrix/clang_1101_build/bin/../include/c++/v1/string.h:75:13: note: 'strchr' declared here
const char* strchr(const char* __s, int __c) {return __libcpp_strchr(__s, __c);}
            ^
/Users/buildslave/jenkins/workspace/lldb-cmake-matrix/clang_1101_build/bin/../include/c++/v1/string.h:94:76: error: use of undeclared identifier 'memchr'
void* __libcpp_memchr(const void* __s, int __c, size_t __n) {return (void*)memchr(__s, __c, __n);}
                                                                           ^
/Users/buildslave/jenkins/workspace/lldb-cmake-matrix/clang_1101_build/bin/../include/c++/v1/string.h:101:74: error: use of undeclared identifier 'strstr'; did you mean 'strchr'?
char* __libcpp_strstr(const char* __s1, const char* __s2) {return (char*)strstr(__s1, __s2);}
                                                                         ^
/Users/buildslave/jenkins/workspace/lldb-cmake-matrix/clang_1101_build/bin/../include/c++/v1/string.h:77:13: note: 'strchr' declared here
      char* strchr(      char* __s, int __c) {return __libcpp_strchr(__s, __c);}
            ^
/Users/buildslave/jenkins/workspace/lldb-cmake-matrix/clang_1101_build/bin/../include/c++/v1/string.h:101:74: error: no matching function for call to 'strchr'
char* __libcpp_strstr(const char* __s1, const char* __s2) {return (char*)strstr(__s1, __s2);}
                                                                         ^
/Users/buildslave/jenkins/workspace/lldb-cmake-matrix/clang_1101_build/bin/../include/c++/v1/string.h:77:13: note: candidate disabled: <no message provided>
      char* strchr(      char* __s, int __c) {return __libcpp_strchr(__s, __c);}
            ^
/Users/buildslave/jenkins/workspace/lldb-cmake-matrix/clang_1101_build/bin/../include/c++/v1/string.h:101:81: error: cannot initialize a parameter of type 'char *' with an lvalue of type 'const char *'
char* __libcpp_strstr(const char* __s1, const char* __s2) {return (char*)strstr(__s1, __s2);}
                                                                                ^~~~
/Users/buildslave/jenkins/workspace/lldb-cmake-matrix/clang_1101_build/bin/../include/c++/v1/string.h:77:32: note: passing argument to parameter '__s' here
      char* strchr(      char* __s, int __c) {return __libcpp_strchr(__s, __c);}
                               ^
In file included from /Users/buildslave/jenkins/workspace/lldb-cmake-matrix/llvm-project/lldb/test/API/types/unsigned_int.cpp:9:
In file included from /Users/buildslave/jenkins/workspace/lldb-cmake-matrix/llvm-project/lldb/test/API/types/basic_type.cpp:24:
In file included from /Applications/Xcode.app/Contents/Developer/Platforms/MacOSX.platform/Developer/SDKs/MacOSX11.1.sdk/usr/include/dispatch/dispatch.h:64:
In file included from /Applications/Xcode.app/Contents/Developer/Platforms/MacOSX.platform/Developer/SDKs/MacOSX11.1.sdk/usr/include/os/workgroup.h:29:
In file included from /Applications/Xcode.app/Contents/Developer/Platforms/MacOSX.platform/Developer/SDKs/MacOSX11.1.sdk/usr/include/os/workgroup_base.h:13:
/Users/buildslave/jenkins/workspace/lldb-cmake-matrix/clang_1101_build/bin/../include/c++/v1/stdlib.h:142:34: error: unknown type name 'ldiv_t'; did you mean 'dev_t'?
inline _LIBCPP_INLINE_VISIBILITY ldiv_t div(long __x, long __y) _NOEXCEPT {
                                 ^
/Applications/Xcode.app/Contents/Developer/Platforms/MacOSX.platform/Developer/SDKs/MacOSX11.1.sdk/usr/include/sys/_types/_dev_t.h:31:31: note: 'dev_t' declared here
typedef __darwin_dev_t        dev_t;    /* device number */
                              ^
In file included from /Users/buildslave/jenkins/workspace/lldb-cmake-matrix/llvm-project/lldb/test/API/types/unsigned_int.cpp:9:
In file included from /Users/buildslave/jenkins/workspace/lldb-cmake-matrix/llvm-project/lldb/test/API/types/basic_type.cpp:24:
In file included from /Applications/Xcode.app/Contents/Developer/Platforms/MacOSX.platform/Developer/SDKs/MacOSX11.1.sdk/usr/include/dispatch/dispatch.h:64:
In file included from /Applications/Xcode.app/Contents/Developer/Platforms/MacOSX.platform/Developer/SDKs/MacOSX11.1.sdk/usr/include/os/workgroup.h:29:
In file included from /Applications/Xcode.app/Contents/Developer/Platforms/MacOSX.platform/Developer/SDKs/MacOSX11.1.sdk/usr/include/os/workgroup_base.h:13:
/Users/buildslave/jenkins/workspace/lldb-cmake-matrix/clang_1101_build/bin/../include/c++/v1/stdlib.h:143:12: error: no member named 'ldiv' in the global namespace; did you mean 'div'?
  return ::ldiv(__x, __y);
         ~~^
/Users/buildslave/jenkins/workspace/lldb-cmake-matrix/clang_1101_build/bin/../include/c++/v1/stdlib.h:142:41: note: 'div' declared here
inline _LIBCPP_INLINE_VISIBILITY ldiv_t div(long __x, long __y) _NOEXCEPT {
                                        ^
/Users/buildslave/jenkins/workspace/lldb-cmake-matrix/clang_1101_build/bin/../include/c++/v1/stdlib.h:146:34: error: unknown type name 'lldiv_t'
inline _LIBCPP_INLINE_VISIBILITY lldiv_t div(long long __x,
                                 ^
/Users/buildslave/jenkins/workspace/lldb-cmake-matrix/clang_1101_build/bin/../include/c++/v1/stdlib.h:148:12: error: no member named 'lldiv' in the global namespace
  return ::lldiv(__x, __y);
         ~~^
In file included from /Users/buildslave/jenkins/workspace/lldb-cmake-matrix/llvm-project/lldb/test/API/types/unsigned_int.cpp:9:
In file included from /Users/buildslave/jenkins/workspace/lldb-cmake-matrix/llvm-project/lldb/test/API/types/basic_type.cpp:26:
/Users/buildslave/jenkins/workspace/lldb-cmake-matrix/clang_1101_build/bin/../include/c++/v1/cstdint:157:8: error: no member named 'uint8_t' in the global namespace
using::uint8_t;
     ~~^
/Users/buildslave/jenkins/workspace/lldb-cmake-matrix/clang_1101_build/bin/../include/c++/v1/cstdint:158:8: error: no member named 'uint16_t' in the global namespace
using::uint16_t;
     ~~^
/Users/buildslave/jenkins/workspace/lldb-cmake-matrix/clang_1101_build/bin/../include/c++/v1/cstdint:162:8: error: no member named 'int_least8_t' in the global namespace
using::int_least8_t;
     ~~^
/Users/buildslave/jenkins/workspace/lldb-cmake-matrix/clang_1101_build/bin/../include/c++/v1/cstdint:163:8: error: no member named 'int_least16_t' in the global namespace
using::int_least16_t;
     ~~^
/Users/buildslave/jenkins/workspace/lldb-cmake-matrix/clang_1101_build/bin/../include/c++/v1/cstdint:164:8: error: no member named 'int_least32_t' in the global namespace
using::int_least32_t;
     ~~^
/Users/buildslave/jenkins/workspace/lldb-cmake-matrix/clang_1101_build/bin/../include/c++/v1/cstdint:165:8: error: no member named 'int_least64_t' in the global namespace
using::int_least64_t;
     ~~^
/Users/buildslave/jenkins/workspace/lldb-cmake-matrix/clang_1101_build/bin/../include/c++/v1/cstdint:167:8: error: no member named 'uint_least8_t' in the global namespace
using::uint_least8_t;
     ~~^
/Users/buildslave/jenkins/workspace/lldb-cmake-matrix/clang_1101_build/bin/../include/c++/v1/cstdint:168:8: error: no member named 'uint_least16_t' in the global namespace
using::uint_least16_t;
     ~~^
fatal error: too many errors emitted, stopping now [-ferror-limit=]
20 errors generated.
make: *** [unsigned_int.o] Error 1

Test Directory:
/Users/buildslave/jenkins/workspace/lldb-cmake-matrix/llvm-project/lldb/test/API/types
----------------------------------------------------------------------
Ran 16 tests in 1.086s

RESULT: FAILED (0 passes, 0 failures, 8 errors, 8 skipped, 0 expected failures, 0 unexpected successes)

--