Console Output

Skipping 162,210 KB.. Full Log
UNSUPPORTED: lldb-shell :: SymbolFile/DWARF/split-optimized.c (454 of 1924)
PASS: lldb-shell :: Quit/TestQuitExitCode0.test (455 of 1924)
PASS: lldb-api :: functionalities/data-formatter/data-formatter-stl/libcxx/map/TestDataFormatterLibccMap.py (456 of 1924)
PASS: lldb-api :: driver/job_control/TestJobControl.py (457 of 1924)
PASS: lldb-api :: functionalities/breakpoint/breakpoint_on_overload/TestBreakOnOverload.py (458 of 1924)
PASS: lldb-shell :: Register/Core/x86-32-freebsd-multithread.test (459 of 1924)
UNSUPPORTED: lldb-api :: commands/trace/TestTraceTSC.py (460 of 1924)
PASS: lldb-api :: functionalities/tail_call_frames/cross_object/TestCrossObjectTailCalls.py (461 of 1924)
PASS: lldb-api :: commands/expression/call-throws/TestCallThatThrows.py (462 of 1924)
PASS: lldb-unit :: SymbolFile/DWARF/./SymbolFileDWARFTests/7/29 (463 of 1924)
PASS: lldb-api :: functionalities/gdb_remote_client/TestMemoryRegionDirtyPages.py (464 of 1924)
PASS: lldb-unit :: Platform/./LLDBPlatformTests/6/16 (465 of 1924)
UNSUPPORTED: lldb-api :: macosx/lc-note/addrable-bits/TestAddrableBitsCorefile.py (466 of 1924)
PASS: lldb-api :: lang/cpp/breakpoint-commands/TestCPPBreakpointCommands.py (467 of 1924)
PASS: lldb-api :: functionalities/data-formatter/data-formatter-objc/TestDataFormatterObjCNSDate.py (468 of 1924)
PASS: lldb-api :: commands/process/signal/TestProcessSignal.py (469 of 1924)
PASS: lldb-api :: functionalities/data-formatter/data-formatter-stl/libcxx/vbool/TestDataFormatterLibcxxVBool.py (470 of 1924)
PASS: lldb-shell :: Breakpoint/single-file-split-dwarf.test (471 of 1924)
PASS: lldb-shell :: ExecControl/StopHook/stop-hook.test (472 of 1924)
PASS: lldb-unit :: Host/./HostTests/4/19 (473 of 1924)
PASS: lldb-unit :: ScriptInterpreter/Python/./ScriptInterpreterPythonTests/17/19 (474 of 1924)
PASS: lldb-shell :: SymbolFile/DWARF/x86/debug_loc-aslr.s (475 of 1924)
PASS: lldb-api :: lang/c/stepping/TestStepAndBreakpoints.py (476 of 1924)
PASS: lldb-api :: commands/expression/test/TestExprs.py (477 of 1924)
PASS: lldb-api :: python_api/lldbutil/frame/TestFrameUtils.py (478 of 1924)
PASS: lldb-unit :: Core/./LLDBCoreTests/20/23 (479 of 1924)
PASS: lldb-api :: macosx/queues/TestQueues.py (480 of 1924)
PASS: lldb-api :: commands/process/launch-with-shellexpand/TestLaunchWithShellExpand.py (481 of 1924)
PASS: lldb-api :: iohandler/completion/TestIOHandlerCompletion.py (482 of 1924)
UNSUPPORTED: lldb-api :: commands/watchpoints/multiple_hits/TestMultipleHits.py (483 of 1924)
PASS: lldb-api :: commands/expression/entry-bp/TestExprEntryBP.py (484 of 1924)
PASS: lldb-shell :: ObjectFile/ELF/duplicate-section.yaml (485 of 1924)
PASS: lldb-api :: commands/platform/basic/TestPlatformPython.py (486 of 1924)
PASS: lldb-api :: lang/cpp/nsimport/TestCppNsImport.py (487 of 1924)
UNSUPPORTED: lldb-api :: commands/watchpoints/watchpoint_commands/command/TestWatchpointCommandPython.py (488 of 1924)
XFAIL: lldb-shell :: Register/x86-fp-write.test (489 of 1924)
PASS: lldb-shell :: Driver/TestFile.test (490 of 1924)
PASS: lldb-unit :: Language/Highlighting/./HighlighterTests/7/29 (491 of 1924)
PASS: lldb-api :: lang/cpp/multiple-inheritance/TestCppMultipleInheritance.py (492 of 1924)
PASS: lldb-api :: lang/cpp/complete-type-check/TestCppIsTypeComplete.py (493 of 1924)
PASS: lldb-api :: lang/objc/modules-cache/TestClangModulesCache.py (494 of 1924)
PASS: lldb-api :: lang/cpp/virtual-functions/TestCppVirtualFunctions.py (495 of 1924)
PASS: lldb-shell :: SymbolFile/Breakpad/symtab.test (496 of 1924)
PASS: lldb-shell :: ObjectFile/ELF/PT_TLS-overlap-PT_LOAD.yaml (497 of 1924)
PASS: lldb-api :: lang/cpp/extern_c/TestExternCSymbols.py (498 of 1924)
PASS: lldb-unit :: ObjectFile/Breakpad/./ObjectFileBreakpadTests/5/11 (499 of 1924)
PASS: lldb-api :: python_api/process/io/TestProcessIO.py (500 of 1924)
PASS: lldb-api :: commands/thread/backtrace/TestThreadBacktraceRepeat.py (501 of 1924)
PASS: lldb-api :: terminal/TestEditline.py (502 of 1924)
PASS: lldb-unit :: Expression/./ExpressionTests/1/22 (503 of 1924)
PASS: lldb-api :: lang/objc/objc-super/TestObjCSuper.py (504 of 1924)
UNSUPPORTED: lldb-shell :: Subprocess/clone-follow-child-softbp.test (505 of 1924)
UNSUPPORTED: lldb-api :: tools/lldb-server/TestGdbRemoteCompletion.py (506 of 1924)
PASS: lldb-api :: tools/lldb-vscode/breakpoint/TestVSCode_setFunctionBreakpoints.py (507 of 1924)
PASS: lldb-api :: commands/expression/calculator_mode/TestCalculatorMode.py (508 of 1924)
PASS: lldb-unit :: Signals/./SignalsTests/2/5 (509 of 1924)
PASS: lldb-api :: functionalities/data-formatter/data-formatter-named-summaries/TestDataFormatterNamedSummaries.py (510 of 1924)
PASS: lldb-unit :: Interpreter/./InterpreterTests/11/14 (511 of 1924)
PASS: lldb-unit :: SymbolFile/DWARF/./SymbolFileDWARFTests/8/29 (512 of 1924)
UNSUPPORTED: lldb-api :: lang/objc/modules-update/TestClangModulesUpdate.py (513 of 1924)
PASS: lldb-shell :: ObjectFile/ELF/netbsd-core-amd64.test (514 of 1924)
PASS: lldb-unit :: UnwindAssembly/x86/./UnwindAssemblyx86Tests/19/27 (515 of 1924)
PASS: lldb-shell :: ObjectFile/ELF/gnu-debuglink.yaml (516 of 1924)
PASS: lldb-shell :: SymbolFile/DWARF/x86/childless-compile-unit.s (517 of 1924)
UNSUPPORTED: lldb-shell :: ObjectFile/PECOFF/dep-modules.yaml (518 of 1924)
PASS: lldb-shell :: Commands/command-stop-hook-output.test (519 of 1924)
PASS: lldb-api :: lang/objc/objc-new-syntax/TestObjCNewSyntaxArray.py (520 of 1924)
PASS: lldb-unit :: Utility/./UtilityTests/13/30 (521 of 1924)
PASS: lldb-api :: iohandler/sigint/TestProcessIOHandlerInterrupt.py (522 of 1924)
PASS: lldb-unit :: Host/./HostTests/8/19 (523 of 1924)
PASS: lldb-unit :: Expression/./ExpressionTests/5/22 (524 of 1924)
PASS: lldb-api :: functionalities/data-formatter/data-formatter-stl/libcxx/span/TestDataFormatterLibcxxSpan.py (525 of 1924)
PASS: lldb-unit :: UnwindAssembly/x86/./UnwindAssemblyx86Tests/14/27 (526 of 1924)
PASS: lldb-api :: lang/objcxx/cpp_keywords_enabled/TestObjCppKeywordsEnabled.py (527 of 1924)
PASS: lldb-unit :: Symbol/./SymbolTests/4/16 (528 of 1924)
PASS: lldb-api :: functionalities/postmortem/elf-core/TestLinuxCore.py (529 of 1924)
UNSUPPORTED: lldb-api :: tools/lldb-server/inferior-crash/TestGdbRemoteSegFault.py (530 of 1924)
UNSUPPORTED: lldb-shell :: SymbolFile/NativePDB/tag-types.cpp (531 of 1924)
PASS: lldb-unit :: Process/Utility/./ProcessUtilityTests/0/16 (532 of 1924)
PASS: lldb-api :: functionalities/data-formatter/data-formatter-globals/TestDataFormatterGlobals.py (533 of 1924)
UNSUPPORTED: lldb-api :: functionalities/ptrauth_diagnostics/brkC47x_x16_invalid/TestPtrauthBRKc47xX16Invalid.py (534 of 1924)
PASS: lldb-api :: functionalities/set-data/TestSetData.py (535 of 1924)
PASS: lldb-shell :: SymbolFile/symbol-binding.test (536 of 1924)
PASS: lldb-api :: functionalities/breakpoint/breakpoint_by_file_colon_line/TestBreakpointByFileColonLine.py (537 of 1924)
PASS: lldb-unit :: Platform/./LLDBPlatformTests/14/16 (538 of 1924)
PASS: lldb-api :: commands/process/attach/TestProcessAttach.py (539 of 1924)
PASS: lldb-unit :: Host/./HostTests/5/19 (540 of 1924)
PASS: lldb-shell :: SymbolFile/DWARF/x86/DW_AT_location-DW_AT_const_value.s (541 of 1924)
PASS: lldb-api :: functionalities/launch_stop_at_entry/TestStopAtEntry.py (542 of 1924)
PASS: lldb-api :: symbol_ondemand/shared_library/TestSharedLibOnDemand.py (543 of 1924)
PASS: lldb-unit :: Language/CPlusPlus/./LanguageCPlusPlusTests/0/5 (544 of 1924)
PASS: lldb-shell :: ObjectFile/ELF/riscv-arch.yaml (545 of 1924)
UNSUPPORTED: lldb-api :: commands/expression/call-restarts/TestCallThatRestarts.py (546 of 1924)
PASS: lldb-api :: commands/expression/context-object/TestContextObject.py (547 of 1924)
PASS: lldb-api :: python_api/symbol-context/TestSymbolContext.py (548 of 1924)
PASS: lldb-shell :: SymbolFile/absolute-symbol.test (549 of 1924)
PASS: lldb-api :: commands/target/stop-hook/disable/TestTargetStopHookDisable.py (550 of 1924)
PASS: lldb-api :: functionalities/data-formatter/format-propagation/TestFormatPropagation.py (551 of 1924)
PASS: lldb-api :: functionalities/data-formatter/data-formatter-stl/generic/list/loop/TestDataFormatterGenericListLoop.py (552 of 1924)
UNSUPPORTED: lldb-api :: functionalities/thread/concurrent_events/TestConcurrentTwoWatchpointThreads.py (553 of 1924)
UNSUPPORTED: lldb-shell :: Subprocess/clone-follow-child.test (554 of 1924)
PASS: lldb-api :: commands/expression/import-std-module/basic/TestImportStdModule.py (555 of 1924)
PASS: lldb-api :: iohandler/sigint/TestIOHandlerPythonREPLSigint.py (556 of 1924)
PASS: lldb-shell :: SymbolFile/DWARF/x86/dwp.s (557 of 1924)
PASS: lldb-api :: functionalities/postmortem/netbsd-core/TestNetBSDCore.py (558 of 1924)
PASS: lldb-api :: functionalities/data-formatter/data-formatter-stl/libcxx/iterator/TestDataFormatterLibccIterator.py (559 of 1924)
PASS: lldb-api :: tools/lldb-vscode/stop-hooks/TestVSCode_stop_hooks.py (560 of 1924)
PASS: lldb-api :: functionalities/memory-region/TestMemoryRegion.py (561 of 1924)
UNSUPPORTED: lldb-api :: functionalities/process_save_core_minidump/TestProcessSaveCoreMinidump.py (562 of 1924)
PASS: lldb-api :: commands/statistics/basic/TestStats.py (563 of 1924)
UNSUPPORTED: lldb-api :: functionalities/unwind/aarch64_unwind_pac/TestAArch64UnwindPAC.py (564 of 1924)
PASS: lldb-api :: functionalities/data-formatter/poarray/TestPrintObjectArray.py (565 of 1924)
PASS: lldb-api :: functionalities/abbreviation/TestAbbreviations.py (566 of 1924)
UNSUPPORTED: lldb-shell :: SymbolFile/DWARF/x86/subprogram_ranges.test (567 of 1924)
PASS: lldb-unit :: ObjectFile/PECOFF/./ObjectFilePECOFFTests/0/3 (568 of 1924)
PASS: lldb-shell :: Driver/TestHelp.test (569 of 1924)
PASS: lldb-api :: functionalities/data-formatter/data-formatter-python-synth/TestDataFormatterPythonSynth.py (570 of 1924)
UNSUPPORTED: lldb-api :: tools/lldb-server/TestGdbRemoteHostInfo.py (571 of 1924)
PASS: lldb-unit :: SymbolFile/DWARF/./SymbolFileDWARFTests/5/29 (572 of 1924)
PASS: lldb-unit :: Symbol/./SymbolTests/2/16 (573 of 1924)
UNSUPPORTED: lldb-api :: lang/cpp/function-template-parameter-pack/TestFunctionTemplateParameterPack.py (574 of 1924)
PASS: lldb-unit :: Process/Utility/./ProcessUtilityTests/14/16 (575 of 1924)
PASS: lldb-api :: functionalities/thread/concurrent_events/TestConcurrentCrashWithBreak.py (576 of 1924)
PASS: lldb-shell :: SymbolFile/Breakpad/stack-cfi-parsing.test (577 of 1924)
PASS: lldb-api :: functionalities/postmortem/mach-core/TestMachCore.py (578 of 1924)
PASS: lldb-unit :: Target/./TargetTests/10/19 (579 of 1924)
PASS: lldb-api :: commands/process/attach/attach_denied/TestAttachDenied.py (580 of 1924)
UNSUPPORTED: lldb-shell :: SymbolFile/NativePDB/bitfields.cpp (581 of 1924)
UNSUPPORTED: lldb-shell :: Register/aarch64-fp-read.test (582 of 1924)
UNSUPPORTED: lldb-api :: lang/cpp/gmodules/TestWithModuleDebugging.py (583 of 1924)
PASS: lldb-api :: functionalities/data-formatter/data-formatter-synthtype/TestDataFormatterSynthType.py (584 of 1924)
PASS: lldb-api :: commands/frame/diagnose/inheritance/TestDiagnoseInheritance.py (585 of 1924)
PASS: lldb-api :: functionalities/scripted_process/TestScriptedProcess.py (586 of 1924)
PASS: lldb-api :: functionalities/value_md5_crash/TestValueMD5Crash.py (587 of 1924)
UNSUPPORTED: lldb-shell :: ScriptInterpreter/Python/Crashlog/scripted_crashlog_json.test (588 of 1924)
PASS: lldb-api :: commands/expression/import-std-module/retry-with-std-module/TestRetryWithStdModule.py (589 of 1924)
PASS: lldb-unit :: Symbol/./SymbolTests/7/16 (590 of 1924)
PASS: lldb-shell :: SymbolFile/DWARF/x86/compilercontext.ll (591 of 1924)
UNSUPPORTED: lldb-api :: functionalities/thread/concurrent_events/TestConcurrentBreakpointsDelayedBreakpointOneWatchpoint.py (592 of 1924)
PASS: lldb-api :: functionalities/data-formatter/data-formatter-advanced/TestDataFormatterAdv.py (593 of 1924)
UNSUPPORTED: lldb-shell :: ScriptInterpreter/Lua/bindings.test (594 of 1924)
PASS: lldb-api :: functionalities/data-formatter/data-formatter-disabling/TestDataFormatterDisabling.py (595 of 1924)
UNSUPPORTED: lldb-shell :: BuildScript/toolchain-msvc.test (596 of 1924)
UNSUPPORTED: lldb-api :: tools/lldb-server/registers-target-xml-reading/TestGdbRemoteTargetXmlPacket.py (597 of 1924)
PASS: lldb-api :: commands/command/script/TestCommandScript.py (598 of 1924)
UNSUPPORTED: lldb-shell :: SymbolFile/NativePDB/ast-types.cpp (599 of 1924)
PASS: lldb-api :: functionalities/gdb_remote_client/TestPlatformKill.py (600 of 1924)
PASS: lldb-unit :: Host/./HostTests/6/19 (601 of 1924)
PASS: lldb-unit :: Process/gdb-remote/./ProcessGdbRemoteTests/5/19 (602 of 1924)
UNSUPPORTED: lldb-api :: lang/c/typedef/Testtypedef.py (603 of 1924)
PASS: lldb-api :: functionalities/thread/ignore_suspended/TestIgnoreSuspendedThread.py (604 of 1924)
PASS: lldb-api :: functionalities/module_cache/universal/TestModuleCacheUniversal.py (605 of 1924)
UNSUPPORTED: lldb-api :: commands/expression/namespace_local_var_same_name_cpp_and_c/TestNamespaceLocalVarSameNameCppAndC.py (606 of 1924)
PASS: lldb-api :: macosx/profile_vrs_detach/TestDetachVrsProfile.py (607 of 1924)
PASS: lldb-api :: lang/cpp/class_static/TestStaticVariables.py (608 of 1924)
PASS: lldb-api :: iohandler/autosuggestion/TestAutosuggestion.py (609 of 1924)
PASS: lldb-api :: functionalities/conditional_break/TestConditionalBreak.py (610 of 1924)
PASS: lldb-shell :: Driver/TestUseColor.test (611 of 1924)
PASS: lldb-api :: functionalities/tail_call_frames/thread_step_out_or_return/TestSteppingOutWithArtificialFrames.py (612 of 1924)
PASS: lldb-shell :: Breakpoint/breakpoint-command.test (613 of 1924)
PASS: lldb-api :: macosx/ignore_exceptions/TestIgnoredExceptions.py (614 of 1924)
PASS: lldb-api :: commands/expression/deleting-implicit-copy-constructor/TestDeletingImplicitCopyConstructor.py (615 of 1924)
PASS: lldb-api :: commands/reproducer/invalid-args/TestInvalidArgsReproducer.py (616 of 1924)
UNSUPPORTED: lldb-shell :: SymbolFile/DWARF/x86/debug-types-address-ranges.s (617 of 1924)
PASS: lldb-api :: python_api/file_handle/TestFileHandle.py (618 of 1924)
PASS: lldb-shell :: SymbolFile/DWARF/x86/dwarf5-debug_line-file-index.s (619 of 1924)
UNSUPPORTED: lldb-api :: tools/lldb-server/signal-filtering/TestGdbRemote_QPassSignals.py (620 of 1924)
PASS: lldb-api :: functionalities/data-formatter/type_summary_list_arg/TestTypeSummaryListArg.py (621 of 1924)
PASS: lldb-api :: lang/objc/objc-new-syntax/TestObjCNewSyntaxLiteral.py (622 of 1924)
UNSUPPORTED: lldb-api :: functionalities/data-formatter/data-formatter-stl/libstdcpp/string/TestDataFormatterStdString.py (623 of 1924)
UNSUPPORTED: lldb-api :: functionalities/ptrauth_diagnostics/BRAA_error/TestPtrauthBRAADiagnostic.py (624 of 1924)
PASS: lldb-api :: functionalities/thread/concurrent_events/TestConcurrentManyBreakpoints.py (625 of 1924)
PASS: lldb-api :: macosx/order/TestOrderFile.py (626 of 1924)
UNSUPPORTED: lldb-shell :: Breakpoint/case-insensitive.test (627 of 1924)
PASS: lldb-api :: lang/cpp/default-template-args/TestDefaultTemplateArgs.py (628 of 1924)
PASS: lldb-api :: functionalities/thread/concurrent_events/TestConcurrentSignalBreak.py (629 of 1924)
PASS: lldb-unit :: UnwindAssembly/x86/./UnwindAssemblyx86Tests/5/27 (630 of 1924)
PASS: lldb-api :: lang/cpp/enum_types/TestCPP11EnumTypes.py (631 of 1924)
PASS: lldb-api :: terminal/TestSTTYBeforeAndAfter.py (632 of 1924)
PASS: lldb-api :: lang/objc/objc-struct-return/TestObjCStructReturn.py (633 of 1924)
PASS: lldb-api :: functionalities/breakpoint/breakpoint_options/TestBreakpointOptions.py (634 of 1924)
PASS: lldb-shell :: Quit/TestQuitExitCodeTooManyArgs.test (635 of 1924)
PASS: lldb-api :: functionalities/plugins/command_plugin/TestPluginCommands.py (636 of 1924)
PASS: lldb-api :: functionalities/abbreviation/TestCommonShortSpellings.py (637 of 1924)
UNSUPPORTED: lldb-api :: macosx/posix_spawn/TestLaunchProcessPosixSpawn.py (638 of 1924)
PASS: lldb-api :: functionalities/breakpoint/breakpoint_names/TestBreakpointNames.py (639 of 1924)
UNSUPPORTED: lldb-shell :: SymbolFile/NativePDB/inline_sites.test (640 of 1924)
PASS: lldb-api :: test_utils/TestInlineTest.py (641 of 1924)
UNSUPPORTED: lldb-shell :: SymbolFile/PDB/vbases.test (642 of 1924)
UNSUPPORTED: lldb-shell :: SymbolFile/NativePDB/lookup-by-address.cpp (643 of 1924)
PASS: lldb-unit :: UnwindAssembly/x86/./UnwindAssemblyx86Tests/6/27 (644 of 1924)
PASS: lldb-api :: commands/expression/call-function/TestCallStopAndContinue.py (645 of 1924)
PASS: lldb-api :: functionalities/inferior-assert/TestInferiorAssert.py (646 of 1924)
PASS: lldb-api :: lang/c/shared_lib_stripped_symbols/TestSharedLibStrippedSymbols.py (647 of 1924)
PASS: lldb-api :: tools/lldb-vscode/optimized/TestVSCode_optimized.py (648 of 1924)
UNSUPPORTED: lldb-shell :: ScriptInterpreter/Lua/watchpoint_callback.test (649 of 1924)
PASS: lldb-api :: api/listeners/TestListener.py (650 of 1924)
PASS: lldb-api :: python_api/signals/TestSignalsAPI.py (651 of 1924)
PASS: lldb-api :: commands/command/source/TestCommandSource.py (652 of 1924)
PASS: lldb-api :: commands/expression/import-std-module/iterator/TestIteratorFromStdModule.py (653 of 1924)
PASS: lldb-api :: functionalities/memory/cache/TestMemoryCache.py (654 of 1924)
PASS: lldb-api :: functionalities/data-formatter/data-formatter-stl/libcxx/unordered_map/TestDataFormatterLibccUnorderedMap.py (655 of 1924)
PASS: lldb-unit :: Process/gdb-remote/./ProcessGdbRemoteTests/6/19 (656 of 1924)
PASS: lldb-unit :: UnwindAssembly/x86/./UnwindAssemblyx86Tests/0/27 (657 of 1924)
PASS: lldb-shell :: ScriptInterpreter/Python/Crashlog/json.test (658 of 1924)
PASS: lldb-unit :: SymbolFile/DWARF/./SymbolFileDWARFTests/6/29 (659 of 1924)
PASS: lldb-shell :: SymbolFile/DWARF/x86/dwo-type-in-main-file.s (660 of 1924)
UNSUPPORTED: lldb-shell :: SymbolFile/DWARF/x86/DW_TAG_GNU_call_site-DW_AT_low_pc.s (661 of 1924)
PASS: lldb-api :: commands/platform/file/read/TestPlatformFileRead.py (662 of 1924)
UNSUPPORTED: lldb-shell :: SymbolFile/NativePDB/function-types-classes.cpp (663 of 1924)
UNSUPPORTED: lldb-shell :: SymbolFile/DWARF/x86/dwarf5-line-strp.s (664 of 1924)
PASS: lldb-unit :: Language/Highlighting/./HighlighterTests/24/29 (665 of 1924)
PASS: lldb-unit :: Process/minidump/./LLDBMinidumpTests/8/17 (666 of 1924)
PASS: lldb-unit :: UnwindAssembly/x86/./UnwindAssemblyx86Tests/1/27 (667 of 1924)
UNSUPPORTED: lldb-shell :: SymbolFile/PDB/calling-conventions-arm.test (668 of 1924)
PASS: lldb-api :: commands/target/create-no-such-arch/TestNoSuchArch.py (669 of 1924)
PASS: lldb-shell :: Register/x86-multithread-write.test (670 of 1924)
PASS: lldb-unit :: Core/./LLDBCoreTests/1/23 (671 of 1924)
UNSUPPORTED: lldb-api :: functionalities/thread/create_during_step/TestCreateDuringStep.py (672 of 1924)
PASS: lldb-unit :: Interpreter/./InterpreterTests/4/14 (673 of 1924)
PASS: lldb-api :: commands/expression/test/TestExprs2.py (674 of 1924)
PASS: lldb-unit :: Breakpoint/./LLDBBreakpointTests/0/1 (675 of 1924)
PASS: lldb-unit :: Platform/./LLDBPlatformTests/15/16 (676 of 1924)
PASS: lldb-api :: commands/thread/select/TestThreadSelect.py (677 of 1924)
PASS: lldb-shell :: SymbolFile/DWARF/x86/DW_OP_piece-smaller-than-struct.s (678 of 1924)
PASS: lldb-unit :: Symbol/./SymbolTests/1/16 (679 of 1924)
PASS: lldb-shell :: Register/Core/x86-64-netbsd-addr.test (680 of 1924)
PASS: lldb-api :: lang/cpp/function_refs/TestFunctionRefs.py (681 of 1924)
PASS: lldb-shell :: ObjectFile/ELF/PT_LOAD.yaml (682 of 1924)
PASS: lldb-unit :: SymbolFile/NativePDB/./SymbolFileNativePDBTests/11/15 (683 of 1924)
PASS: lldb-unit :: Symbol/./SymbolTests/10/16 (684 of 1924)
PASS: lldb-unit :: ObjectFile/Breakpad/./ObjectFileBreakpadTests/3/11 (685 of 1924)
PASS: lldb-shell :: Quit/TestQuitExitCodeHex0.test (686 of 1924)
UNSUPPORTED: lldb-shell :: SymbolFile/NativePDB/locate-pdb.cpp (687 of 1924)
PASS: lldb-api :: functionalities/data-formatter/data-formatter-objc/cmtime/TestDataFormatterCMTime.py (688 of 1924)
PASS: lldb-unit :: UnwindAssembly/x86/./UnwindAssemblyx86Tests/11/27 (689 of 1924)
PASS: lldb-shell :: SymbolFile/DWARF/x86/debug-types-line-tables.s (690 of 1924)
PASS: lldb-api :: lang/objc/real-definition/TestRealDefinition.py (691 of 1924)
PASS: lldb-shell :: ScriptInterpreter/Python/scripted_breakpoint_lua.test (692 of 1924)
PASS: lldb-api :: lang/objc/objc-foundation-dictionary-empty/TestNSDictionary0.py (693 of 1924)
PASS: lldb-unit :: Process/./ProcessEventDataTests/1/2 (694 of 1924)
PASS: lldb-api :: commands/expression/unicode-in-variable/TestUnicodeInVariable.py (695 of 1924)
PASS: lldb-shell :: Minidump/Windows/Sigsegv/sigsegv.test (696 of 1924)
PASS: lldb-unit :: Process/minidump/./LLDBMinidumpTests/12/17 (697 of 1924)
PASS: lldb-shell :: ObjectFile/wasm/unified-debug-sections.yaml (698 of 1924)
PASS: lldb-unit :: UnwindAssembly/ARM64/./Arm64InstEmulationTests/0/7 (699 of 1924)
PASS: lldb-api :: tools/lldb-vscode/coreFile/TestVSCode_coreFile.py (700 of 1924)
PASS: lldb-unit :: Core/./LLDBCoreTests/2/23 (701 of 1924)
UNSUPPORTED: lldb-api :: benchmarks/expression/TestExpressionCmd.py (702 of 1924)
PASS: lldb-shell :: Process/Optimization.test (703 of 1924)
PASS: lldb-shell :: SymbolFile/DWARF/x86/dwarf5-debug_line.s (704 of 1924)
PASS: lldb-shell :: Commands/CommandScriptImmediateOutput/CommandScriptImmediateOutputFile.test (705 of 1924)
PASS: lldb-shell :: ObjectFile/Breakpad/uuid-matching-mac.test (706 of 1924)
PASS: lldb-shell :: Register/Core/x86-32-netbsd-addr.test (707 of 1924)
UNSUPPORTED: lldb-api :: commands/register/register/aarch64_dynamic_regset/TestArm64DynamicRegsets.py (708 of 1924)
PASS: lldb-api :: lang/objc/objc-runtime-ivars/TestRuntimeIvars.py (709 of 1924)
PASS: lldb-unit :: Expression/./ExpressionTests/18/22 (710 of 1924)
UNSUPPORTED: lldb-api :: functionalities/thread/concurrent_events/TestConcurrentManySignals.py (711 of 1924)
PASS: lldb-unit :: Utility/./UtilityTests/4/30 (712 of 1924)
PASS: lldb-unit :: Utility/./UtilityTests/1/30 (713 of 1924)
PASS: lldb-unit :: Language/Highlighting/./HighlighterTests/14/29 (714 of 1924)
PASS: lldb-api :: functionalities/breakpoint/source_regexp/TestSourceRegexBreakpoints.py (715 of 1924)
PASS: lldb-api :: functionalities/ptr_refs/TestPtrRefs.py (716 of 1924)
PASS: lldb-api :: lang/cpp/forward-declared-template-specialization/TestCppForwardDeclaredTemplateSpecialization.py (717 of 1924)
PASS: lldb-shell :: SymbolFile/DWARF/x86/dwarf5-split.s (718 of 1924)
PASS: lldb-unit :: Language/CPlusPlus/./LanguageCPlusPlusTests/4/5 (719 of 1924)
PASS: lldb-unit :: Platform/./LLDBPlatformTests/11/16 (720 of 1924)
UNSUPPORTED: lldb-shell :: ScriptInterpreter/Lua/io.test (721 of 1924)
UNSUPPORTED: lldb-shell :: Register/x86-64-ymm16-write.test (722 of 1924)
PASS: lldb-api :: lang/cpp/incomplete-types/TestCppIncompleteTypes.py (723 of 1924)
PASS: lldb-shell :: lldb-server/TestGdbserverPort.test (724 of 1924)
PASS: lldb-unit :: ObjectFile/Breakpad/./ObjectFileBreakpadTests/2/11 (725 of 1924)
PASS: lldb-unit :: ObjectFile/ELF/./ObjectFileELFTests/1/4 (726 of 1924)
PASS: lldb-api :: functionalities/exec/TestExec.py (727 of 1924)
UNSUPPORTED: lldb-shell :: Register/x86-zmm-write.test (728 of 1924)
PASS: lldb-unit :: SymbolFile/NativePDB/./SymbolFileNativePDBTests/2/15 (729 of 1924)
PASS: lldb-unit :: Utility/./UtilityTests/10/30 (730 of 1924)
PASS: lldb-shell :: Register/Core/x86-64-linux-addr.test (731 of 1924)
PASS: lldb-api :: functionalities/object-file/TestImageListMultiArchitecture.py (732 of 1924)
UNSUPPORTED: lldb-shell :: SymbolFile/DWARF/find-type-in-function.cpp (733 of 1924)
PASS: lldb-unit :: Utility/./UtilityTests/19/30 (734 of 1924)
UNSUPPORTED: lldb-api :: functionalities/thread/concurrent_events/TestConcurrentSignalDelayWatch.py (735 of 1924)
PASS: lldb-shell :: ObjectFile/PECOFF/default-triple-windows-msvc.yaml (736 of 1924)
PASS: lldb-shell :: Minidump/no-process-id.yaml (737 of 1924)
PASS: lldb-api :: lang/objc/foundation/TestObjCMethodsNSArray.py (738 of 1924)
PASS: lldb-api :: functionalities/postmortem/minidump/TestMiniDump.py (739 of 1924)
PASS: lldb-shell :: Commands/command-regex-delete.test (740 of 1924)
PASS: lldb-api :: commands/expression/call-function/TestCallStdStringFunction.py (741 of 1924)
PASS: lldb-unit :: Interpreter/./InterpreterTests/5/14 (742 of 1924)
PASS: lldb-api :: functionalities/progress_reporting/TestProgressReporting.py (743 of 1924)
PASS: lldb-shell :: ObjectFile/ELF/null-jmprel.yaml (744 of 1924)
PASS: lldb-shell :: Breakpoint/debug_rnglist_offset_pair.test (745 of 1924)
PASS: lldb-api :: functionalities/breakpoint/breakpoint_language/TestBreakpointLanguage.py (746 of 1924)
PASS: lldb-shell :: Commands/command-regex-unalias.test (747 of 1924)
PASS: lldb-api :: functionalities/diagnostic_reporting/TestDiagnosticReporting.py (748 of 1924)
PASS: lldb-api :: functionalities/gdb_remote_client/TestQemuAArch64TargetXml.py (749 of 1924)
PASS: lldb-api :: functionalities/module_cache/simple_exe/TestModuleCacheSimple.py (750 of 1924)
PASS: lldb-shell :: SymbolFile/Breakpad/line-table-mixed-path-styles.test (751 of 1924)
PASS: lldb-api :: functionalities/thread/concurrent_events/TestConcurrentBreakpointOneDelayBreakpointThreads.py (752 of 1924)
PASS: lldb-unit :: Core/./LLDBCoreTests/13/23 (753 of 1924)
PASS: lldb-shell :: Reproducer/TestFileRepro.test (754 of 1924)
PASS: lldb-api :: tools/lldb-vscode/variables/TestVSCode_variables.py (755 of 1924)
PASS: lldb-unit :: Process/Utility/./ProcessUtilityTests/11/16 (756 of 1924)
PASS: lldb-api :: sanity/TestSettingSkipping.py (757 of 1924)
PASS: lldb-unit :: Expression/./ExpressionTests/7/22 (758 of 1924)
PASS: lldb-api :: lang/cpp/inlines/TestInlines.py (759 of 1924)
PASS: lldb-api :: functionalities/data-formatter/parray/TestPrintArray.py (760 of 1924)
PASS: lldb-shell :: SymbolFile/DWARF/x86/DW_TAG_variable-invalid_location.s (761 of 1924)
UNSUPPORTED: lldb-api :: python_api/watchpoint/TestWatchpointIter.py (762 of 1924)
PASS: lldb-api :: functionalities/reproducers/fs-case-sensitivity/TestReproducerFSCaseSensitivity.py (763 of 1924)
UNSUPPORTED: lldb-api :: functionalities/data-formatter/data-formatter-stl/libstdcpp/map/TestDataFormatterStdMap.py (764 of 1924)
UNSUPPORTED: lldb-shell :: SymbolFile/DWARF/x86/find-basic-type.cpp (765 of 1924)
PASS: lldb-unit :: Process/gdb-remote/./ProcessGdbRemoteTests/2/19 (766 of 1924)
PASS: lldb-shell :: SymbolFile/DWARF/clang-ast-from-dwarf-objc-property.m (767 of 1924)
PASS: lldb-api :: lang/objc/objc-baseclass-sbtype/TestObjCBaseClassSBType.py (768 of 1924)
PASS: lldb-api :: commands/session/history/TestSessionHistory.py (769 of 1924)
PASS: lldb-api :: functionalities/postmortem/wow64_minidump/TestWow64MiniDump.py (770 of 1924)
PASS: lldb-api :: lang/cpp/this/TestCPPThis.py (771 of 1924)
PASS: lldb-api :: commands/gui/basic/TestGuiBasic.py (772 of 1924)
PASS: lldb-unit :: Symbol/./SymbolTests/15/16 (773 of 1924)
PASS: lldb-api :: lang/cpp/dynamic-value/TestCppValueCast.py (774 of 1924)
PASS: lldb-api :: commands/expression/weak_symbols/TestWeakSymbols.py (775 of 1924)
PASS: lldb-api :: lang/cpp/thread_local/TestThreadLocal.py (776 of 1924)
PASS: lldb-unit :: ScriptInterpreter/Python/./ScriptInterpreterPythonTests/14/19 (777 of 1924)
PASS: lldb-unit :: UnwindAssembly/x86/./UnwindAssemblyx86Tests/24/27 (778 of 1924)
PASS: lldb-api :: functionalities/data-formatter/data-formatter-objc/nsstring/TestDataFormatterNSString.py (779 of 1924)
PASS: lldb-api :: lang/cpp/non-type-template-param/TestCppNonTypeTemplateParam.py (780 of 1924)
PASS: lldb-api :: functionalities/data-formatter/varscript_formatting/TestDataFormatterVarScriptFormatting.py (781 of 1924)
PASS: lldb-unit :: Target/./TargetTests/6/19 (782 of 1924)
UNSUPPORTED: lldb-api :: functionalities/longjmp/TestLongjmp.py (783 of 1924)
PASS: lldb-api :: iohandler/stdio/TestIOHandlerProcessSTDIO.py (784 of 1924)
PASS: lldb-shell :: Minidump/Windows/broken-unwind.test (785 of 1924)
PASS: lldb-shell :: ObjectFile/ELF/many-sections.s (786 of 1924)
UNSUPPORTED: lldb-api :: tools/lldb-server/thread-name/TestGdbRemoteThreadName.py (787 of 1924)
UNSUPPORTED: lldb-shell :: Subprocess/fork-follow-child-wp.test (788 of 1924)
PASS: lldb-api :: commands/target/stop-hooks/TestStopHookScripted.py (789 of 1924)
PASS: lldb-api :: functionalities/progress_reporting/TestTrimmedProgressReporting.py (790 of 1924)
PASS: lldb-shell :: SymbolFile/DWARF/x86/DW_AT_const_value-bitfields.s (791 of 1924)
PASS: lldb-api :: functionalities/gdb_remote_client/TestGDBRemoteLoad.py (792 of 1924)
PASS: lldb-shell :: SymbolFile/DWARF/x86/DW_AT_decl_file-DW_AT_specification-crosscu.s (793 of 1924)
PASS: lldb-unit :: Utility/./UtilityTests/26/30 (794 of 1924)
PASS: lldb-api :: python_api/frame/TestFrames.py (795 of 1924)
PASS: lldb-api :: macosx/indirect_symbol/TestIndirectSymbols.py (796 of 1924)
UNSUPPORTED: lldb-shell :: SymbolFile/NativePDB/disassembly.cpp (797 of 1924)
PASS: lldb-api :: commands/target/stop-hooks/TestStopHooks.py (798 of 1924)
PASS: lldb-api :: functionalities/data-formatter/data-formatter-script/TestDataFormatterScript.py (799 of 1924)
PASS: lldb-api :: commands/expression/import-std-module/deque-basic/TestDequeFromStdModule.py (800 of 1924)
PASS: lldb-api :: commands/log/basic/TestLogHandlers.py (801 of 1924)
PASS: lldb-api :: source-manager/TestSourceManager.py (802 of 1924)
PASS: lldb-unit :: ObjectFile/MachO/./ObjectFileMachOTests/1/2 (803 of 1924)
UNSUPPORTED: lldb-api :: python_api/watchpoint/watchlocation/TestSetWatchlocation.py (804 of 1924)
PASS: lldb-api :: functionalities/data-formatter/user-format-vs-summary/TestUserFormatVsSummary.py (805 of 1924)
PASS: lldb-api :: functionalities/gdb_remote_client/TestTargetXMLArch.py (806 of 1924)
PASS: lldb-shell :: Unwind/thread-step-out-ret-addr-check.test (807 of 1924)
PASS: lldb-unit :: Utility/./UtilityTests/8/30 (808 of 1924)
PASS: lldb-api :: lang/cpp/typedef/TestCppTypedef.py (809 of 1924)
PASS: lldb-unit :: Process/minidump/./LLDBMinidumpTests/14/17 (810 of 1924)
PASS: lldb-api :: commands/memory/read/TestMemoryRead.py (811 of 1924)
PASS: lldb-api :: commands/gui/viewlarge/TestGuiViewLarge.py (812 of 1924)
PASS: lldb-api :: functionalities/source-map/TestTargetSourceMap.py (813 of 1924)
PASS: lldb-api :: commands/add-dsym/uuid/TestAddDsymCommand.py (814 of 1924)
UNSUPPORTED: lldb-api :: lang/objc/modules-hash-mismatch/TestClangModulesHashMismatch.py (815 of 1924)
PASS: lldb-unit :: Language/Highlighting/./HighlighterTests/19/29 (816 of 1924)
UNSUPPORTED: lldb-api :: lang/objc/rdar-12408181/TestRdar12408181.py (817 of 1924)
PASS: lldb-unit :: SymbolFile/DWARF/./SymbolFileDWARFTests/16/29 (818 of 1924)
UNSUPPORTED: lldb-shell :: SymbolFile/DWARF/x86/debug-types-signature-loop.s (819 of 1924)
PASS: lldb-api :: functionalities/process_group/TestChangeProcessGroup.py (820 of 1924)
UNSUPPORTED: lldb-api :: lang/cpp/breakpoint_in_member_func_w_non_primitive_params/TestBreakpointInMemberFuncWNonPrimitiveParams.py (821 of 1924)
PASS: lldb-api :: functionalities/tail_call_frames/disambiguate_call_site/TestDisambiguateCallSite.py (822 of 1924)
PASS: lldb-api :: python_api/lldbutil/TestSwigVersion.py (823 of 1924)
PASS: lldb-api :: functionalities/gdb_remote_client/TestGDBServerNoTargetXML.py (824 of 1924)
UNSUPPORTED: lldb-shell :: SymbolFile/NativePDB/subfield_register_simple_type.s (825 of 1924)
PASS: lldb-api :: functionalities/thread/thread_exit/TestThreadExit.py (826 of 1924)
PASS: lldb-unit :: UnwindAssembly/x86/./UnwindAssemblyx86Tests/4/27 (827 of 1924)
PASS: lldb-api :: commands/expression/codegen-crash-typedefdecl-not-in_declcontext/TestCodegenCrashTypedefDeclNotInDeclContext.py (828 of 1924)
PASS: lldb-unit :: Expression/./ExpressionTests/13/22 (829 of 1924)
PASS: lldb-shell :: Settings/TestStopCommandSourceOnError.test (830 of 1924)
PASS: lldb-api :: lang/objcxx/objcxx-ivar-vector/TestIvarVector.py (831 of 1924)
PASS: lldb-unit :: ObjectFile/Breakpad/./ObjectFileBreakpadTests/0/11 (832 of 1924)
PASS: lldb-shell :: ObjectFile/ELF/build-id-case.yaml (833 of 1924)
PASS: lldb-api :: functionalities/stop-on-sharedlibrary-load/TestStopOnSharedlibraryEvents.py (834 of 1924)
PASS: lldb-unit :: Language/Highlighting/./HighlighterTests/6/29 (835 of 1924)
PASS: lldb-unit :: ScriptInterpreter/Python/./ScriptInterpreterPythonTests/1/19 (836 of 1924)
PASS: lldb-shell :: ObjectFile/ELF/avr-basic-info.yaml (837 of 1924)
PASS: lldb-shell :: Breakpoint/jit-loader_jitlink_elf.test (838 of 1924)
PASS: lldb-api :: lang/cpp/unicode-literals/TestUnicodeLiterals.py (839 of 1924)
PASS: lldb-shell :: SymbolFile/DWARF/deterministic-build.cpp (840 of 1924)
PASS: lldb-shell :: ScriptInterpreter/Python/Crashlog/parser_json.test (841 of 1924)
PASS: lldb-api :: commands/command/nested_alias/TestNestedAlias.py (842 of 1924)
PASS: lldb-api :: commands/expression/import-std-module/conflicts/TestStdModuleWithConflicts.py (843 of 1924)
PASS: lldb-api :: functionalities/unwind/noreturn/TestNoreturnUnwind.py (844 of 1924)
UNSUPPORTED: lldb-shell :: SymbolFile/DWARF/debug-types-expressions.test (845 of 1924)
PASS: lldb-shell :: ScriptInterpreter/Python/scripted_breakpoint.test (846 of 1924)
PASS: lldb-api :: functionalities/breakpoint/cpp/TestCPPBreakpointLocations.py (847 of 1924)
PASS: lldb-unit :: debugserver/./debugserverTests/3/6 (848 of 1924)
PASS: lldb-unit :: UnwindAssembly/ARM64/./Arm64InstEmulationTests/1/7 (849 of 1924)
PASS: lldb-shell :: Reproducer/TestDSYM.test (850 of 1924)
PASS: lldb-shell :: SymbolFile/DWARF/x86/debug_ranges-missing-section.s (851 of 1924)
PASS: lldb-api :: functionalities/data-formatter/data-formatter-stl/libcxx/string/simulator/TestDataFormatterLibcxxStringSimulator.py (852 of 1924)
PASS: lldb-api :: commands/expression/rdar42038760/TestScalarURem.py (853 of 1924)
PASS: lldb-api :: lang/cpp/incomplete-types/members/TestCppIncompleteTypeMembers.py (854 of 1924)
PASS: lldb-api :: functionalities/thread/crash_during_step/TestCrashDuringStep.py (855 of 1924)
PASS: lldb-api :: tools/lldb-vscode/console/TestVSCode_redirection_to_console.py (856 of 1924)
PASS: lldb-shell :: Reproducer/TestDump.test (857 of 1924)
PASS: lldb-shell :: SymbolFile/DWARF/x86/debug-types-dwarf5.s (858 of 1924)
PASS: lldb-api :: functionalities/find-line-entry/TestFindLineEntry.py (859 of 1924)
PASS: lldb-api :: lang/cpp/overloaded-functions/TestOverloadedFunctions.py (860 of 1924)
PASS: lldb-shell :: Quit/TestQuitExitCodeNonInt.test (861 of 1924)
PASS: lldb-shell :: ScriptInterpreter/Python/fail_breakpoint_oneline.test (862 of 1924)
PASS: lldb-api :: test_utils/TestDecorators.py (863 of 1924)
PASS: lldb-api :: lang/cpp/this_class_type_mixing/TestThisClassTypeMixing.py (864 of 1924)
UNSUPPORTED: lldb-shell :: SymbolFile/DWARF/x86/find-variable-dwo.cpp (865 of 1924)
PASS: lldb-api :: functionalities/gdb_remote_client/TestNoGPacketSupported.py (866 of 1924)
PASS: lldb-api :: types/TestLongTypes.py (867 of 1924)
PASS: lldb-api :: linux/aarch64/non_address_bit_memory_access/TestAArch64LinuxNonAddressBitMemoryAccess.py (868 of 1924)
PASS: lldb-shell :: Register/Core/x86-64-freebsd-addr.test (869 of 1924)
PASS: lldb-api :: functionalities/data-formatter/data-formatter-stl/libcxx/variant/TestDataFormatterLibcxxVariant.py (870 of 1924)
PASS: lldb-unit :: SymbolFile/DWARF/./SymbolFileDWARFTests/14/29 (871 of 1924)
PASS: lldb-api :: types/TestRecursiveTypes.py (872 of 1924)
UNSUPPORTED: lldb-api :: commands/gui/expand-threads-tree/TestGuiExpandThreadsTree.py (873 of 1924)
PASS: lldb-shell :: SymbolFile/DWARF/x86/unused-inlined-params.test (874 of 1924)
PASS: lldb-api :: iohandler/unicode/TestUnicode.py (875 of 1924)
PASS: lldb-unit :: Utility/./UtilityTests/23/30 (876 of 1924)
PASS: lldb-api :: python_api/value/empty_class/TestValueAPIEmptyClass.py (877 of 1924)
PASS: lldb-api :: commands/expression/import-std-module/list/TestListFromStdModule.py (878 of 1924)
PASS: lldb-shell :: SymbolFile/OnDemand/symbolic-breakpoint.test (879 of 1924)
PASS: lldb-api :: python_api/frame/inlines/TestInlinedFrame.py (880 of 1924)
UNSUPPORTED: lldb-shell :: Register/x86-db-read.test (881 of 1924)
PASS: lldb-api :: functionalities/thread/exit_during_expression/TestExitDuringExpression.py (882 of 1924)
PASS: lldb-api :: lang/c/vla/TestVLA.py (883 of 1924)
PASS: lldb-api :: functionalities/breakpoint/serialize/TestBreakpointSerialization.py (884 of 1924)
PASS: lldb-api :: commands/process/handle/TestProcessHandle.py (885 of 1924)
UNSUPPORTED: lldb-api :: lang/objc/modules-app-update/TestClangModulesAppUpdate.py (886 of 1924)
UNSUPPORTED: lldb-api :: tools/lldb-server/inferior-crash/TestGdbRemoteAbort.py (887 of 1924)
PASS: lldb-shell :: SymbolFile/DWARF/x86/DW_TAG_basic_type_DW_ATE_UTF_nonC.ll (888 of 1924)
PASS: lldb-api :: functionalities/data-formatter/data-formatter-objc/TestDataFormatterObjCNSContainer.py (889 of 1924)
PASS: lldb-unit :: Core/./LLDBCoreTests/6/23 (890 of 1924)
UNSUPPORTED: lldb-api :: commands/trace/TestTraceStartStop.py (891 of 1924)
PASS: lldb-api :: functionalities/module_cache/debug_index/TestDebugIndexCache.py (892 of 1924)
UNSUPPORTED: lldb-shell :: Register/arm-gp-read.test (893 of 1924)
UNSUPPORTED: lldb-api :: commands/watchpoints/watchpoint_count/TestWatchpointCount.py (894 of 1924)
PASS: lldb-api :: python_api/get-value-32bit-int/TestGetValue32BitInt.py (895 of 1924)
PASS: lldb-api :: macosx/macCatalyst/TestMacCatalyst.py (896 of 1924)
UNSUPPORTED: lldb-api :: lang/objc/objc-dynamic-value/TestObjCDynamicValue.py (897 of 1924)
PASS: lldb-unit :: Language/Highlighting/./HighlighterTests/20/29 (898 of 1924)
UNSUPPORTED: lldb-shell :: SymbolFile/DWARF/split-dwarf-expression-eval-bug.cpp (899 of 1924)
PASS: lldb-unit :: Symbol/./SymbolTests/8/16 (900 of 1924)
UNSUPPORTED: lldb-api :: functionalities/thread/concurrent_events/TestConcurrentDelayWatchBreak.py (901 of 1924)
UNSUPPORTED: lldb-shell :: SymbolFile/PDB/calling-conventions-x86.test (902 of 1924)
PASS: lldb-api :: lang/cpp/sizeof/TestCPPSizeof.py (903 of 1924)
PASS: lldb-api :: commands/expression/completion/TestExprCompletion.py (904 of 1924)
PASS: lldb-shell :: Driver/TestTarget.test (905 of 1924)
PASS: lldb-api :: lang/cpp/symbols/TestSymbols.py (906 of 1924)
PASS: lldb-unit :: Language/Highlighting/./HighlighterTests/0/29 (907 of 1924)
PASS: lldb-shell :: Symtab/symtab-regex-demangled.test (908 of 1924)
PASS: lldb-unit :: Expression/./ExpressionTests/20/22 (909 of 1924)
PASS: lldb-api :: qemu/TestQemuAPI.py (910 of 1924)
PASS: lldb-api :: lang/cpp/namespace_definitions/TestNamespaceDefinitions.py (911 of 1924)
PASS: lldb-shell :: SymbolFile/DWARF/x86/debug_rnglists-dwp.s (912 of 1924)
UNSUPPORTED: lldb-shell :: SymbolFile/PDB/type-quals.test (913 of 1924)
PASS: lldb-api :: lang/cpp/virtual-overload/TestVirtualOverload.py (914 of 1924)
PASS: lldb-unit :: Target/./TargetTests/5/19 (915 of 1924)
PASS: lldb-api :: functionalities/data-formatter/setvaluefromcstring/TestSetValueFromCString.py (916 of 1924)
PASS: lldb-api :: commands/frame/diagnose/local-variable/TestLocalVariable.py (917 of 1924)
UNSUPPORTED: lldb-api :: commands/watchpoints/variable_out_of_scope/TestWatchedVarHitWhenInScope.py (918 of 1924)
UNSUPPORTED: lldb-api :: tools/lldb-server/TestGdbRemoteForkNonStop.py (919 of 1924)
PASS: lldb-unit :: Expression/./ExpressionTests/0/22 (920 of 1924)
PASS: lldb-api :: python_api/default-constructor/TestDefaultConstructorForAPIObjects.py (921 of 1924)
PASS: lldb-unit :: UnwindAssembly/ARM64/./Arm64InstEmulationTests/2/7 (922 of 1924)
UNSUPPORTED: lldb-api :: benchmarks/libcxxmap/TestBenchmarkLibcxxMap.py (923 of 1924)
XFAIL: lldb-api :: lang/c/local_types/TestUseClosestType.py (924 of 1924)
PASS: lldb-api :: commands/expression/persistent_ptr_update/TestPersistentPtrUpdate.py (925 of 1924)
UNSUPPORTED: lldb-api :: python_api/watchpoint/watchlocation/TestTargetWatchAddress.py (926 of 1924)
UNSUPPORTED: lldb-shell :: SymbolFile/PDB/variables-locations.test (927 of 1924)
UNSUPPORTED: lldb-shell :: SymbolFile/NativePDB/s_constant.cpp (928 of 1924)
PASS: lldb-api :: types/TestDoubleTypesExpr.py (929 of 1924)
PASS: lldb-api :: lang/objc/rdar-10967107/TestRdar10967107.py (930 of 1924)
PASS: lldb-api :: lang/cpp/wchar_t/TestCxxWCharT.py (931 of 1924)
UNSUPPORTED: lldb-api :: benchmarks/turnaround/TestCompileRunToBreakpointTurnaround.py (932 of 1924)
PASS: lldb-api :: functionalities/gdb_remote_client/TestWasm.py (933 of 1924)
UNSUPPORTED: lldb-shell :: Unwind/windows-unaligned-x86_64.test (934 of 1924)
PASS: lldb-api :: python_api/sbmodule/TestSBModule.py (935 of 1924)
FAIL: lldb-api :: lang/cpp/const_static_integral_member/TestConstStaticIntegralMember.py (936 of 1924)
******************** TEST 'lldb-api :: lang/cpp/const_static_integral_member/TestConstStaticIntegralMember.py' FAILED ********************
Script:
--
/Applications/Xcode.app/Contents/Developer/Library/Frameworks/Python3.framework/Versions/3.8/bin/python3.8 /Users/buildslave/jenkins/workspace/lldb-cmake-matrix/llvm-project/lldb/test/API/dotest.py -u CXXFLAGS -u CFLAGS --codesign-identity lldb_codesign --arch x86_64 --build-dir /Users/buildslave/jenkins/workspace/lldb-cmake-matrix/lldb-build/lldb-test-build.noindex -t --env TERM=vt100 --skip-category gmodules --skip-category watchpoint --skip-category llgs --skip-category debugserver --arch=x86_64 --env LLVM_LIBS_DIR=/Users/buildslave/jenkins/workspace/lldb-cmake-matrix/lldb-build/./lib --env LLVM_INCLUDE_DIR=/Users/buildslave/jenkins/workspace/lldb-cmake-matrix/lldb-build/include --env LLVM_TOOLS_DIR=/Users/buildslave/jenkins/workspace/lldb-cmake-matrix/lldb-build/./bin --hermetic-libcxx --arch x86_64 --build-dir /Users/buildslave/jenkins/workspace/lldb-cmake-matrix/lldb-build/lldb-test-build.noindex --lldb-module-cache-dir /Users/buildslave/jenkins/workspace/lldb-cmake-matrix/lldb-build/lldb-test-build.noindex/module-cache-lldb/lldb-api --clang-module-cache-dir /Users/buildslave/jenkins/workspace/lldb-cmake-matrix/lldb-build/lldb-test-build.noindex/module-cache-clang/lldb-api --executable /Users/buildslave/jenkins/workspace/lldb-cmake-matrix/lldb-build/./bin/lldb --compiler /Users/buildslave/jenkins/workspace/lldb-cmake-matrix/clang_1300_build/bin/clang --dsymutil /Users/buildslave/jenkins/workspace/lldb-cmake-matrix/lldb-build/./bin/dsymutil --llvm-tools-dir /Users/buildslave/jenkins/workspace/lldb-cmake-matrix/lldb-build/./bin --lldb-libs-dir /Users/buildslave/jenkins/workspace/lldb-cmake-matrix/lldb-build/./lib /Users/buildslave/jenkins/workspace/lldb-cmake-matrix/llvm-project/lldb/test/API/lang/cpp/const_static_integral_member -p TestConstStaticIntegralMember.py
--
Exit Code: 1

Hide Details

Command Output (stdout): -- lldb version 16.0.99git (http://labmaster3.local/git/llvm-project.git revision 205701fd47535a7525789f3291bd686cef1a9773) clang revision 205701fd47535a7525789f3291bd686cef1a9773 llvm revision 205701fd47535a7525789f3291bd686cef1a9773 Skipping the following test categories: ['gmodules', 'watchpoint', 'llgs', 'debugserver', 'libstdcxx', 'dwo', 'llgs', 'fork']

Hide Details

-- Command Output (stderr): -- Change dir to: /Users/buildslave/jenkins/workspace/lldb-cmake-matrix/llvm-project/lldb/test/API/lang/cpp/const_static_integral_member runCmd: settings clear -all output:

Hide Details

runCmd: settings set symbols.enable-external-lookup false output:

Hide Details

runCmd: settings set target.inherit-tcc true output:

Hide Details

runCmd: settings set target.detach-on-error false output:

Hide Details

runCmd: settings set target.auto-apply-fixits false output:

Hide Details

runCmd: settings set plugin.process.gdb-remote.packet-timeout 60 output:

Hide Details

runCmd: settings set symbols.clang-modules-cache-path "/Users/buildslave/jenkins/workspace/lldb-cmake-matrix/lldb-build/lldb-test-build.noindex/module-cache-lldb/lldb-api" output:

Hide Details

runCmd: settings set use-color false output:

Hide Details

runCmd: setting set target.prefer-dynamic-value no-dynamic-values output:

Hide Details

make VPATH=/Users/buildslave/jenkins/workspace/lldb-cmake-matrix/llvm-project/lldb/test/API/lang/cpp/const_static_integral_member -C /Users/buildslave/jenkins/workspace/lldb-cmake-matrix/lldb-build/lldb-test-build.noindex/lang/cpp/const_static_integral_member/TestConstStaticIntegralMember.test_class_with_only_const_static_dsym -I /Users/buildslave/jenkins/workspace/lldb-cmake-matrix/llvm-project/lldb/test/API/lang/cpp/const_static_integral_member -I /Users/buildslave/jenkins/workspace/lldb-cmake-matrix/llvm-project/lldb/packages/Python/lldbsuite/test/make -f /Users/buildslave/jenkins/workspace/lldb-cmake-matrix/llvm-project/lldb/test/API/lang/cpp/const_static_integral_member/Makefile MAKE_DSYM=YES all ARCH=x86_64 'CC="/Users/buildslave/jenkins/workspace/lldb-cmake-matrix/clang_1300_build/bin/clang"' DSYMUTIL=/Users/buildslave/jenkins/workspace/lldb-cmake-matrix/lldb-build/./bin/dsymutil CODESIGN=codesign CLANG_MODULE_CACHE_DIR=/Users/buildslave/jenkins/workspace/lldb-cmake-matrix/lldb-build/lldb-test-build.noindex/module-cache-clang/lldb-api USE_HERMETIC_LIBCPP=1

Hide Details

"/Users/buildslave/jenkins/workspace/lldb-cmake-matrix/clang_1300_build/bin/clang" -std=c++11 -g -O0 -isysroot "/Applications/Xcode.app/Contents/Developer/Platforms/MacOSX.platform/Developer/SDKs/MacOSX11.1.sdk" -arch x86_64 -I/Users/buildslave/jenkins/workspace/lldb-cmake-matrix/llvm-project/lldb/packages/Python/lldbsuite/test/make/../../../../../include -I/Users/buildslave/jenkins/workspace/lldb-cmake-matrix/llvm-project/lldb/test/API/lang/cpp/const_static_integral_member -I/Users/buildslave/jenkins/workspace/lldb-cmake-matrix/llvm-project/lldb/packages/Python/lldbsuite/test/make -include /Users/buildslave/jenkins/workspace/lldb-cmake-matrix/llvm-project/lldb/packages/Python/lldbsuite/test/make/test_common.h -fno-limit-debug-info --driver-mode=g++ -MT main.o -MD -MP -MF main.d -c -o main.o /Users/buildslave/jenkins/workspace/lldb-cmake-matrix/llvm-project/lldb/test/API/lang/cpp/const_static_integral_member/main.cpp "/Users/buildslave/jenkins/workspace/lldb-cmake-matrix/clang_1300_build/bin/clang" main.o -g -O0 -isysroot "/Applications/Xcode.app/Contents/Developer/Platforms/MacOSX.platform/Developer/SDKs/MacOSX11.1.sdk" -arch x86_64 -I/Users/buildslave/jenkins/workspace/lldb-cmake-matrix/llvm-project/lldb/packages/Python/lldbsuite/test/make/../../../../../include -I/Users/buildslave/jenkins/workspace/lldb-cmake-matrix/llvm-project/lldb/test/API/lang/cpp/const_static_integral_member -I/Users/buildslave/jenkins/workspace/lldb-cmake-matrix/llvm-project/lldb/packages/Python/lldbsuite/test/make -include /Users/buildslave/jenkins/workspace/lldb-cmake-matrix/llvm-project/lldb/packages/Python/lldbsuite/test/make/test_common.h -fno-limit-debug-info --driver-mode=g++ -o "a.out" codesign -s - "a.out" "/Users/buildslave/jenkins/workspace/lldb-cmake-matrix/lldb-build/./bin/dsymutil" -o "a.out.dSYM" "a.out"

Hide Details

Hide Details

XFAIL: LLDB (/Users/buildslave/jenkins/workspace/lldb-cmake-matrix/clang_1300_build/bin/clang-x86_64) :: test_class_with_only_const_static_dsym (TestConstStaticIntegralMember.TestCase) <bound method SBProcess.Kill of SBProcess: pid = 57912, state = stopped, threads = 1, executable = a.out>: success

Hide Details

runCmd: settings clear -all output:

Hide Details

runCmd: settings set symbols.enable-external-lookup false output:

Hide Details

runCmd: settings set target.inherit-tcc true output:

Hide Details

runCmd: settings set target.detach-on-error false output:

Hide Details

runCmd: settings set target.auto-apply-fixits false output:

Hide Details

runCmd: settings set plugin.process.gdb-remote.packet-timeout 60 output:

Hide Details

runCmd: settings set symbols.clang-modules-cache-path "/Users/buildslave/jenkins/workspace/lldb-cmake-matrix/lldb-build/lldb-test-build.noindex/module-cache-lldb/lldb-api" output:

Hide Details

runCmd: settings set use-color false output:

Hide Details

runCmd: setting set target.prefer-dynamic-value no-dynamic-values output:

Hide Details

make VPATH=/Users/buildslave/jenkins/workspace/lldb-cmake-matrix/llvm-project/lldb/test/API/lang/cpp/const_static_integral_member -C /Users/buildslave/jenkins/workspace/lldb-cmake-matrix/lldb-build/lldb-test-build.noindex/lang/cpp/const_static_integral_member/TestConstStaticIntegralMember.test_class_with_only_const_static_dwarf -I /Users/buildslave/jenkins/workspace/lldb-cmake-matrix/llvm-project/lldb/test/API/lang/cpp/const_static_integral_member -I /Users/buildslave/jenkins/workspace/lldb-cmake-matrix/llvm-project/lldb/packages/Python/lldbsuite/test/make -f /Users/buildslave/jenkins/workspace/lldb-cmake-matrix/llvm-project/lldb/test/API/lang/cpp/const_static_integral_member/Makefile MAKE_DSYM=NO all ARCH=x86_64 'CC="/Users/buildslave/jenkins/workspace/lldb-cmake-matrix/clang_1300_build/bin/clang"' DSYMUTIL=/Users/buildslave/jenkins/workspace/lldb-cmake-matrix/lldb-build/./bin/dsymutil CODESIGN=codesign CLANG_MODULE_CACHE_DIR=/Users/buildslave/jenkins/workspace/lldb-cmake-matrix/lldb-build/lldb-test-build.noindex/module-cache-clang/lldb-api USE_HERMETIC_LIBCPP=1

Hide Details

"/Users/buildslave/jenkins/workspace/lldb-cmake-matrix/clang_1300_build/bin/clang" -std=c++11 -g -O0 -isysroot "/Applications/Xcode.app/Contents/Developer/Platforms/MacOSX.platform/Developer/SDKs/MacOSX11.1.sdk" -arch x86_64 -I/Users/buildslave/jenkins/workspace/lldb-cmake-matrix/llvm-project/lldb/packages/Python/lldbsuite/test/make/../../../../../include -I/Users/buildslave/jenkins/workspace/lldb-cmake-matrix/llvm-project/lldb/test/API/lang/cpp/const_static_integral_member -I/Users/buildslave/jenkins/workspace/lldb-cmake-matrix/llvm-project/lldb/packages/Python/lldbsuite/test/make -include /Users/buildslave/jenkins/workspace/lldb-cmake-matrix/llvm-project/lldb/packages/Python/lldbsuite/test/make/test_common.h -fno-limit-debug-info --driver-mode=g++ -MT main.o -MD -MP -MF main.d -c -o main.o /Users/buildslave/jenkins/workspace/lldb-cmake-matrix/llvm-project/lldb/test/API/lang/cpp/const_static_integral_member/main.cpp "/Users/buildslave/jenkins/workspace/lldb-cmake-matrix/clang_1300_build/bin/clang" main.o -g -O0 -isysroot "/Applications/Xcode.app/Contents/Developer/Platforms/MacOSX.platform/Developer/SDKs/MacOSX11.1.sdk" -arch x86_64 -I/Users/buildslave/jenkins/workspace/lldb-cmake-matrix/llvm-project/lldb/packages/Python/lldbsuite/test/make/../../../../../include -I/Users/buildslave/jenkins/workspace/lldb-cmake-matrix/llvm-project/lldb/test/API/lang/cpp/const_static_integral_member -I/Users/buildslave/jenkins/workspace/lldb-cmake-matrix/llvm-project/lldb/packages/Python/lldbsuite/test/make -include /Users/buildslave/jenkins/workspace/lldb-cmake-matrix/llvm-project/lldb/packages/Python/lldbsuite/test/make/test_common.h -fno-limit-debug-info --driver-mode=g++ -o "a.out" codesign -s - "a.out"

Hide Details

Hide Details

<bound method SBProcess.Kill of SBProcess: pid = 58052, state = stopped, threads = 1, executable = a.out>: success

Hide Details

PASS: LLDB (/Users/buildslave/jenkins/workspace/lldb-cmake-matrix/clang_1300_build/bin/clang-x86_64) :: test_class_with_only_const_static_dwarf (TestConstStaticIntegralMember.TestCase) UNSUPPORTED: LLDB (/Users/buildslave/jenkins/workspace/lldb-cmake-matrix/clang_1300_build/bin/clang-x86_64) :: test_class_with_only_const_static_dwo (TestConstStaticIntegralMember.TestCase) (test case does not fall in any category of interest for this run) UNSUPPORTED: LLDB (/Users/buildslave/jenkins/workspace/lldb-cmake-matrix/clang_1300_build/bin/clang-x86_64) :: test_class_with_only_const_static_gmodules (TestConstStaticIntegralMember.TestCase) (test case does not fall in any category of interest for this run) runCmd: settings clear -all output:

Hide Details

runCmd: settings set symbols.enable-external-lookup false output:

Hide Details

runCmd: settings set target.inherit-tcc true output:

Hide Details

runCmd: settings set target.detach-on-error false output:

Hide Details

runCmd: settings set target.auto-apply-fixits false output:

Hide Details

runCmd: settings set plugin.process.gdb-remote.packet-timeout 60 output:

Hide Details

runCmd: settings set symbols.clang-modules-cache-path "/Users/buildslave/jenkins/workspace/lldb-cmake-matrix/lldb-build/lldb-test-build.noindex/module-cache-lldb/lldb-api" output:

Hide Details

runCmd: settings set use-color false output:

Hide Details

runCmd: setting set target.prefer-dynamic-value no-dynamic-values output:

Hide Details

make VPATH=/Users/buildslave/jenkins/workspace/lldb-cmake-matrix/llvm-project/lldb/test/API/lang/cpp/const_static_integral_member -C /Users/buildslave/jenkins/workspace/lldb-cmake-matrix/lldb-build/lldb-test-build.noindex/lang/cpp/const_static_integral_member/TestConstStaticIntegralMember.test_dsym -I /Users/buildslave/jenkins/workspace/lldb-cmake-matrix/llvm-project/lldb/test/API/lang/cpp/const_static_integral_member -I /Users/buildslave/jenkins/workspace/lldb-cmake-matrix/llvm-project/lldb/packages/Python/lldbsuite/test/make -f /Users/buildslave/jenkins/workspace/lldb-cmake-matrix/llvm-project/lldb/test/API/lang/cpp/const_static_integral_member/Makefile MAKE_DSYM=YES all ARCH=x86_64 'CC="/Users/buildslave/jenkins/workspace/lldb-cmake-matrix/clang_1300_build/bin/clang"' DSYMUTIL=/Users/buildslave/jenkins/workspace/lldb-cmake-matrix/lldb-build/./bin/dsymutil CODESIGN=codesign CLANG_MODULE_CACHE_DIR=/Users/buildslave/jenkins/workspace/lldb-cmake-matrix/lldb-build/lldb-test-build.noindex/module-cache-clang/lldb-api USE_HERMETIC_LIBCPP=1

Hide Details

"/Users/buildslave/jenkins/workspace/lldb-cmake-matrix/clang_1300_build/bin/clang" -std=c++11 -g -O0 -isysroot "/Applications/Xcode.app/Contents/Developer/Platforms/MacOSX.platform/Developer/SDKs/MacOSX11.1.sdk" -arch x86_64 -I/Users/buildslave/jenkins/workspace/lldb-cmake-matrix/llvm-project/lldb/packages/Python/lldbsuite/test/make/../../../../../include -I/Users/buildslave/jenkins/workspace/lldb-cmake-matrix/llvm-project/lldb/test/API/lang/cpp/const_static_integral_member -I/Users/buildslave/jenkins/workspace/lldb-cmake-matrix/llvm-project/lldb/packages/Python/lldbsuite/test/make -include /Users/buildslave/jenkins/workspace/lldb-cmake-matrix/llvm-project/lldb/packages/Python/lldbsuite/test/make/test_common.h -fno-limit-debug-info --driver-mode=g++ -MT main.o -MD -MP -MF main.d -c -o main.o /Users/buildslave/jenkins/workspace/lldb-cmake-matrix/llvm-project/lldb/test/API/lang/cpp/const_static_integral_member/main.cpp "/Users/buildslave/jenkins/workspace/lldb-cmake-matrix/clang_1300_build/bin/clang" main.o -g -O0 -isysroot "/Applications/Xcode.app/Contents/Developer/Platforms/MacOSX.platform/Developer/SDKs/MacOSX11.1.sdk" -arch x86_64 -I/Users/buildslave/jenkins/workspace/lldb-cmake-matrix/llvm-project/lldb/packages/Python/lldbsuite/test/make/../../../../../include -I/Users/buildslave/jenkins/workspace/lldb-cmake-matrix/llvm-project/lldb/test/API/lang/cpp/const_static_integral_member -I/Users/buildslave/jenkins/workspace/lldb-cmake-matrix/llvm-project/lldb/packages/Python/lldbsuite/test/make -include /Users/buildslave/jenkins/workspace/lldb-cmake-matrix/llvm-project/lldb/packages/Python/lldbsuite/test/make/test_common.h -fno-limit-debug-info --driver-mode=g++ -o "a.out" codesign -s - "a.out" "/Users/buildslave/jenkins/workspace/lldb-cmake-matrix/lldb-build/./bin/dsymutil" -o "a.out.dSYM" "a.out"

Hide Details

Hide Details

FAIL: LLDB (/Users/buildslave/jenkins/workspace/lldb-cmake-matrix/clang_1300_build/bin/clang-x86_64) :: test_dsym (TestConstStaticIntegralMember.TestCase) <bound method SBProcess.Kill of SBProcess: pid = 58174, state = stopped, threads = 1, executable = a.out>: success

Hide Details

runCmd: settings clear -all output:

Hide Details

runCmd: settings set symbols.enable-external-lookup false output:

Hide Details

runCmd: settings set target.inherit-tcc true output:

Hide Details

runCmd: settings set target.detach-on-error false output:

Hide Details

runCmd: settings set target.auto-apply-fixits false output:

Hide Details

runCmd: settings set plugin.process.gdb-remote.packet-timeout 60 output:

Hide Details

runCmd: settings set symbols.clang-modules-cache-path "/Users/buildslave/jenkins/workspace/lldb-cmake-matrix/lldb-build/lldb-test-build.noindex/module-cache-lldb/lldb-api" output:

Hide Details

runCmd: settings set use-color false output:

Hide Details

runCmd: setting set target.prefer-dynamic-value no-dynamic-values output:

Hide Details

make VPATH=/Users/buildslave/jenkins/workspace/lldb-cmake-matrix/llvm-project/lldb/test/API/lang/cpp/const_static_integral_member -C /Users/buildslave/jenkins/workspace/lldb-cmake-matrix/lldb-build/lldb-test-build.noindex/lang/cpp/const_static_integral_member/TestConstStaticIntegralMember.test_dwarf -I /Users/buildslave/jenkins/workspace/lldb-cmake-matrix/llvm-project/lldb/test/API/lang/cpp/const_static_integral_member -I /Users/buildslave/jenkins/workspace/lldb-cmake-matrix/llvm-project/lldb/packages/Python/lldbsuite/test/make -f /Users/buildslave/jenkins/workspace/lldb-cmake-matrix/llvm-project/lldb/test/API/lang/cpp/const_static_integral_member/Makefile MAKE_DSYM=NO all ARCH=x86_64 'CC="/Users/buildslave/jenkins/workspace/lldb-cmake-matrix/clang_1300_build/bin/clang"' DSYMUTIL=/Users/buildslave/jenkins/workspace/lldb-cmake-matrix/lldb-build/./bin/dsymutil CODESIGN=codesign CLANG_MODULE_CACHE_DIR=/Users/buildslave/jenkins/workspace/lldb-cmake-matrix/lldb-build/lldb-test-build.noindex/module-cache-clang/lldb-api USE_HERMETIC_LIBCPP=1

Hide Details

"/Users/buildslave/jenkins/workspace/lldb-cmake-matrix/clang_1300_build/bin/clang" -std=c++11 -g -O0 -isysroot "/Applications/Xcode.app/Contents/Developer/Platforms/MacOSX.platform/Developer/SDKs/MacOSX11.1.sdk" -arch x86_64 -I/Users/buildslave/jenkins/workspace/lldb-cmake-matrix/llvm-project/lldb/packages/Python/lldbsuite/test/make/../../../../../include -I/Users/buildslave/jenkins/workspace/lldb-cmake-matrix/llvm-project/lldb/test/API/lang/cpp/const_static_integral_member -I/Users/buildslave/jenkins/workspace/lldb-cmake-matrix/llvm-project/lldb/packages/Python/lldbsuite/test/make -include /Users/buildslave/jenkins/workspace/lldb-cmake-matrix/llvm-project/lldb/packages/Python/lldbsuite/test/make/test_common.h -fno-limit-debug-info --driver-mode=g++ -MT main.o -MD -MP -MF main.d -c -o main.o /Users/buildslave/jenkins/workspace/lldb-cmake-matrix/llvm-project/lldb/test/API/lang/cpp/const_static_integral_member/main.cpp "/Users/buildslave/jenkins/workspace/lldb-cmake-matrix/clang_1300_build/bin/clang" main.o -g -O0 -isysroot "/Applications/Xcode.app/Contents/Developer/Platforms/MacOSX.platform/Developer/SDKs/MacOSX11.1.sdk" -arch x86_64 -I/Users/buildslave/jenkins/workspace/lldb-cmake-matrix/llvm-project/lldb/packages/Python/lldbsuite/test/make/../../../../../include -I/Users/buildslave/jenkins/workspace/lldb-cmake-matrix/llvm-project/lldb/test/API/lang/cpp/const_static_integral_member -I/Users/buildslave/jenkins/workspace/lldb-cmake-matrix/llvm-project/lldb/packages/Python/lldbsuite/test/make -include /Users/buildslave/jenkins/workspace/lldb-cmake-matrix/llvm-project/lldb/packages/Python/lldbsuite/test/make/test_common.h -fno-limit-debug-info --driver-mode=g++ -o "a.out" codesign -s - "a.out"

Hide Details

Hide Details

runCmd: expr const int *i = &A::int_val; *i check of return status not required runCmd failed! error: expression failed to parse: error: Couldn't lookup symbols: __ZN1A7int_valE

Hide Details

Hide Details

Ran command: "expr const int *i = &A::int_val; *i"

Hide Details

Got output: error: expression failed to parse: error: Couldn't lookup symbols: __ZN1A7int_valE

Hide Details

Expecting sub string: "Couldn't lookup symbols:" (was found)

Hide Details

<bound method SBProcess.Kill of SBProcess: pid = 58334, state = stopped, threads = 1, executable = a.out>: success

Hide Details

PASS: LLDB (/Users/buildslave/jenkins/workspace/lldb-cmake-matrix/clang_1300_build/bin/clang-x86_64) :: test_dwarf (TestConstStaticIntegralMember.TestCase) UNSUPPORTED: LLDB (/Users/buildslave/jenkins/workspace/lldb-cmake-matrix/clang_1300_build/bin/clang-x86_64) :: test_dwo (TestConstStaticIntegralMember.TestCase) (test case does not fall in any category of interest for this run) UNSUPPORTED: LLDB (/Users/buildslave/jenkins/workspace/lldb-cmake-matrix/clang_1300_build/bin/clang-x86_64) :: test_gmodules (TestConstStaticIntegralMember.TestCase) (test case does not fall in any category of interest for this run) Restore dir to: /Users/buildslave/jenkins/workspace/lldb-cmake-matrix/lldb-build/tools/lldb/test ====================================================================== FAIL: test_dsym (TestConstStaticIntegralMember.TestCase) ---------------------------------------------------------------------- Traceback (most recent call last): File "/Users/buildslave/jenkins/workspace/lldb-cmake-matrix/llvm-project/lldb/packages/Python/lldbsuite/test/lldbtest.py", line 1673, in test_method return attrvalue(self) File "/Users/buildslave/jenkins/workspace/lldb-cmake-matrix/llvm-project/lldb/test/API/lang/cpp/const_static_integral_member/TestConstStaticIntegralMember.py", line 68, in test self.expect_expr("ClassWithEnumAlias::enum_alias", File "/Users/buildslave/jenkins/workspace/lldb-cmake-matrix/llvm-project/lldb/packages/Python/lldbsuite/test/lldbtest.py", line 2430, in expect_expr value_check.check_value(self, eval_result, str(eval_result)) File "/Users/buildslave/jenkins/workspace/lldb-cmake-matrix/llvm-project/lldb/packages/Python/lldbsuite/test/lldbtest.py", line 286, in check_value test_base.assertSuccess(val.GetError()) File "/Users/buildslave/jenkins/workspace/lldb-cmake-matrix/llvm-project/lldb/packages/Python/lldbsuite/test/lldbtest.py", line 2466, in assertSuccess self.fail(self._formatMessage(msg, AssertionError: 'expression failed to parse: error: <user expression 30>:1:1: use of undeclared identifier 'ClassWithEnumAlias' ClassWithEnumAlias::enum_alias ^ ' is not success Config=x86_64-/Users/buildslave/jenkins/workspace/lldb-cmake-matrix/clang_1300_build/bin/clang ---------------------------------------------------------------------- Ran 8 tests in 6.867s

Hide Details

RESULT: FAILED (2 passes, 1 failures, 0 errors, 4 skipped, 1 expected failures, 0 unexpected successes)

Hide Details

--

Hide Details

******************** UNSUPPORTED: lldb-shell :: Subprocess/vfork-follow-child.test (937 of 1924) PASS: lldb-api :: commands/target/modules/search-paths/insert/TestTargetModulesSearchpathsInsert.py (938 of 1924) PASS: lldb-api :: commands/expression/anonymous-struct/TestCallUserAnonTypedef.py (939 of 1924) PASS: lldb-api :: commands/expression/import-std-module/vector-dbg-info-content/TestDbgInfoContentVectorFromStdModule.py (940 of 1924) PASS: lldb-api :: functionalities/memory/tag/TestMemoryTag.py (941 of 1924) PASS: lldb-api :: lang/objc/cpp_keyword_identifiers/TestCppKeywordsAsObjCIdentifiers.py (942 of 1924) PASS: lldb-api :: functionalities/data-formatter/data-formatter-synth/TestDataFormatterSynth.py (943 of 1924) UNSUPPORTED: lldb-shell :: SymbolFile/DWARF/x86/debug-types-dwo-cross-reference.cpp (944 of 1924) PASS: lldb-api :: sanity/TestModuleCacheSanity.py (945 of 1924) PASS: lldb-unit :: Language/Highlighting/./HighlighterTests/3/29 (946 of 1924) PASS: lldb-api :: functionalities/thread/jump/TestThreadJump.py (947 of 1924) PASS: lldb-api :: commands/expression/regression-access-function-template-in-record/TestRegressionAccessFunctionTemplateInRecord.py (948 of 1924) PASS: lldb-shell :: SymbolFile/Breakpad/line-table-discontinuous-file-ids.test (949 of 1924) PASS: lldb-shell :: Commands/command-thread-select.test (950 of 1924) UNSUPPORTED: lldb-api :: functionalities/thread/concurrent_events/TestConcurrentSignalWatchBreak.py (951 of 1924) PASS: lldb-shell :: Breakpoint/debug_rnglistx_rlex.test (952 of 1924) PASS: lldb-api :: commands/expression/import-std-module/shared_ptr/TestSharedPtrFromStdModule.py (953 of 1924) PASS: lldb-unit :: Signals/./SignalsTests/3/5 (954 of 1924) UNSUPPORTED: lldb-shell :: SymbolFile/PDB/enums-layout.test (955 of 1924) PASS: lldb-shell :: ScriptInterpreter/Python/Crashlog/text.test (956 of 1924) PASS: lldb-unit :: Utility/./UtilityTests/6/30 (957 of 1924) PASS: lldb-api :: functionalities/thread/concurrent_events/TestConcurrentBreakpointDelayBreakpointOneSignal.py (958 of 1924) PASS: lldb-shell :: Register/Core/x86-32-linux-multithread.test (959 of 1924) PASS: lldb-unit :: SymbolFile/DWARF/./SymbolFileDWARFTests/21/29 (960 of 1924) PASS: lldb-api :: lang/objc/objc-static-method-stripped/TestObjCStaticMethodStripped.py (961 of 1924) PASS: lldb-api :: functionalities/data-formatter/data-formatter-stl/generic/set/TestDataFormatterGenericSet.py (962 of 1924) PASS: lldb-api :: functionalities/data-formatter/data-formatter-stl/libcxx/unique_ptr/TestDataFormatterLibcxxUniquePtr.py (963 of 1924) PASS: lldb-api :: functionalities/thread/create_after_attach/TestCreateAfterAttach.py (964 of 1924) PASS: lldb-api :: functionalities/data-formatter/data-formatter-enum-format/TestDataFormatterEnumFormat.py (965 of 1924) PASS: lldb-shell :: ScriptInterpreter/None/import_module.test (966 of 1924) PASS: lldb-shell :: SymbolFile/DWARF/x86/debug_loclists-dwp.s (967 of 1924) PASS: lldb-unit :: Host/./HostTests/7/19 (968 of 1924) UNSUPPORTED: lldb-api :: functionalities/tsan/basic/TestTsanBasic.py (969 of 1924) PASS: lldb-unit :: SymbolFile/NativePDB/./SymbolFileNativePDBTests/6/15 (970 of 1924) PASS: lldb-api :: functionalities/thread/state_after_expression/TestStateAfterExpression.py (971 of 1924) PASS: lldb-shell :: ObjectFile/ELF/section-types.yaml (972 of 1924) PASS: lldb-shell :: Settings/TestDefaultModuleCachePath.test (973 of 1924) UNSUPPORTED: lldb-shell :: Commands/command-thread-siginfo.test (974 of 1924) PASS: lldb-unit :: Process/Utility/./ProcessUtilityTests/15/16 (975 of 1924) PASS: lldb-unit :: Utility/./UtilityTests/25/30 (976 of 1924) PASS: lldb-api :: functionalities/data-formatter/vector-types/TestVectorTypesFormatting.py (977 of 1924) PASS: lldb-api :: commands/expression/import-std-module/array/TestArrayFromStdModule.py (978 of 1924) PASS: lldb-unit :: ScriptInterpreter/Python/./ScriptInterpreterPythonTests/16/19 (979 of 1924) PASS: lldb-api :: commands/expression/call-function/TestCallBuiltinFunction.py (980 of 1924) UNSUPPORTED: lldb-api :: functionalities/ubsan/basic/TestUbsanBasic.py (981 of 1924) PASS: lldb-api :: functionalities/data-formatter/data-formatter-categories/TestDataFormatterCategories.py (982 of 1924) PASS: lldb-api :: functionalities/gdb_remote_client/TestRecognizeBreakpoint.py (983 of 1924) PASS: lldb-api :: functionalities/thread/step_out/TestThreadStepOut.py (984 of 1924) PASS: lldb-api :: python_api/disassemble-raw-data/TestDisassemble_VST1_64.py (985 of 1924) PASS: lldb-shell :: SymbolFile/DWARF/x86/dwp-debug-types.s (986 of 1924) PASS: lldb-api :: iohandler/resize/TestIOHandlerResizeNoEditline.py (987 of 1924) UNSUPPORTED: lldb-shell :: Commands/command-target-create-resolve-exe.test (988 of 1924) PASS: lldb-shell :: ObjectFile/ELF/netbsd-exec-8.99.30-amd64.yaml (989 of 1924) UNSUPPORTED: lldb-api :: lang/cpp/reference-to-outer-type/TestCppReferenceToOuterClass.py (990 of 1924) UNSUPPORTED: lldb-api :: functionalities/ptrauth_diagnostics/brkC47x_code/TestPtrauthBRKc47xDiagnostic.py (991 of 1924) PASS: lldb-unit :: Process/Utility/./ProcessUtilityTests/9/16 (992 of 1924) PASS: lldb-api :: macosx/load-kext/TestLoadKext.py (993 of 1924) PASS: lldb-api :: lang/c/global_variables/TestGlobalVariables.py (994 of 1924) PASS: lldb-api :: python_api/findvalue_duplist/TestSBFrameFindValue.py (995 of 1924) PASS: lldb-shell :: Register/Core/x86-64-freebsd-gp.test (996 of 1924) PASS: lldb-api :: functionalities/multiword-commands/TestMultiWordCommands.py (997 of 1924) PASS: lldb-api :: macosx/find-dsym/deep-bundle/TestDeepBundle.py (998 of 1924) PASS: lldb-api :: commands/command/invalid-args/TestInvalidArgsCommand.py (999 of 1924) PASS: lldb-unit :: Symbol/./SymbolTests/13/16 (1000 of 1924) PASS: lldb-api :: functionalities/testid/TestTestId.py (1001 of 1924) PASS: lldb-api :: commands/frame/language/TestGuessLanguage.py (1002 of 1924) UNSUPPORTED: lldb-api :: tools/lldb-server/TestGdbRemoteAttach.py (1003 of 1924) PASS: lldb-api :: python_api/symbol-context/two-files/TestSymbolContextTwoFiles.py (1004 of 1924) PASS: lldb-unit :: Process/gdb-remote/./ProcessGdbRemoteTests/13/19 (1005 of 1924) PASS: lldb-unit :: Utility/./UtilityTests/20/30 (1006 of 1924) PASS: lldb-shell :: ObjectFile/ELF/short-build-id.yaml (1007 of 1924) PASS: lldb-unit :: Language/Highlighting/./HighlighterTests/22/29 (1008 of 1924) UNSUPPORTED: lldb-api :: functionalities/breakpoint/hardware_breakpoints/hardware_breakpoint_on_multiple_threads/TestHWBreakMultiThread.py (1009 of 1924) PASS: lldb-api :: python_api/value_var_update/TestValueVarUpdate.py (1010 of 1924) PASS: lldb-api :: commands/expression/import-std-module/list-dbg-info-content/TestDbgInfoContentListFromStdModule.py (1011 of 1924) PASS: lldb-api :: lang/c/stepping/TestThreadStepInAvoidRegexp.py (1012 of 1924) PASS: lldb-shell :: ObjectFile/ELF/section-addresses.yaml (1013 of 1924) PASS: lldb-api :: functionalities/inferior-crashing/recursive-inferior/TestRecursiveInferior.py (1014 of 1924) PASS: lldb-shell :: ObjectFile/PECOFF/sections.yaml (1015 of 1924) UNSUPPORTED: lldb-shell :: SymbolFile/NativePDB/function-types-calling-conv.cpp (1016 of 1924) UNSUPPORTED: lldb-api :: benchmarks/stepping/TestSteppingSpeed.py (1017 of 1924) PASS: lldb-api :: functionalities/inferior-crashing/recursive-inferior/TestRecursiveInferiorStep.py (1018 of 1924) PASS: lldb-unit :: Target/./TargetTests/0/19 (1019 of 1924) PASS: lldb-api :: lang/objc/ivar-IMP/TestObjCiVarIMP.py (1020 of 1924) PASS: lldb-api :: commands/frame/diagnose/virtual-method-call/TestDiagnoseDereferenceVirtualMethodCall.py (1021 of 1924) UNSUPPORTED: lldb-shell :: ScriptInterpreter/Lua/persistent_state.test (1022 of 1924) UNSUPPORTED: lldb-shell :: SymbolFile/DWARF/dwarf5-lazy-dwo.c (1023 of 1924) PASS: lldb-shell :: Register/Core/x86-32-netbsd-multithread.test (1024 of 1924) UNSUPPORTED: lldb-shell :: SymbolFile/NativePDB/nested-types.cpp (1025 of 1924) PASS: lldb-shell :: Minidump/disassemble-no-module.yaml (1026 of 1924) PASS: lldb-shell :: ScriptInterpreter/Python/sb_address_exception.test (1027 of 1924) PASS: lldb-api :: functionalities/unwind/zeroth_frame/TestZerothFrame.py (1028 of 1924) UNSUPPORTED: lldb-shell :: Subprocess/fork-follow-parent-softbp.test (1029 of 1924) PASS: lldb-api :: commands/target/stop-hook/delete/TestTargetStopHookDelete.py (1030 of 1924) PASS: lldb-api :: functionalities/data-formatter/data-formatter-stl/generic/forward_list/TestDataFormatterGenericForwardList.py (1031 of 1924) PASS: lldb-api :: functionalities/thread_plan/TestThreadPlanCommands.py (1032 of 1924) UNSUPPORTED: lldb-shell :: SymbolFile/PDB/ast-restore.test (1033 of 1924) PASS: lldb-shell :: ObjectFile/MachO/lc_build_version.yaml (1034 of 1924) UNSUPPORTED: lldb-api :: python_api/watchpoint/TestWatchpointIgnoreCount.py (1035 of 1924) PASS: lldb-unit :: Core/./LLDBCoreTests/11/23 (1036 of 1924) PASS: lldb-shell :: Reproducer/TestVersionCheck.test (1037 of 1924) UNSUPPORTED: lldb-shell :: Unwind/eh-frame-small-fde.test (1038 of 1924) PASS: lldb-shell :: Breakpoint/split-dwarf-5-addrbase.test (1039 of 1924) PASS: lldb-unit :: UnwindAssembly/x86/./UnwindAssemblyx86Tests/10/27 (1040 of 1924) UNSUPPORTED: lldb-api :: python_api/watchpoint/condition/TestWatchpointConditionAPI.py (1041 of 1924) PASS: lldb-shell :: Driver/LocalLLDBInit.test (1042 of 1924) UNSUPPORTED: lldb-api :: functionalities/thread/concurrent_events/TestConcurrentTwoWatchpointsOneBreakpoint.py (1043 of 1924) PASS: lldb-api :: lang/cpp/call-function/TestCallCPPFunction.py (1044 of 1924) PASS: lldb-api :: commands/target/dump/TestTargetDumpTypeSystem.py (1045 of 1924) PASS: lldb-unit :: Host/./HostTests/2/19 (1046 of 1924) PASS: lldb-unit :: ScriptInterpreter/Python/./ScriptInterpreterPythonTests/0/19 (1047 of 1924) PASS: lldb-unit :: ObjectFile/PECOFF/./ObjectFilePECOFFTests/1/3 (1048 of 1924) PASS: lldb-api :: functionalities/breakpoint/global_constructor/TestBreakpointInGlobalConstructor.py (1049 of 1924) PASS: lldb-shell :: SymbolFile/DWARF/x86/debug_line-relative_path.s (1050 of 1924) PASS: lldb-api :: functionalities/thread/thread_specific_break/TestThreadSpecificBreakpoint.py (1051 of 1924) PASS: lldb-api :: functionalities/optimized_code/TestNoASanExceptionAfterEvalOP_piece.py (1052 of 1924) PASS: lldb-api :: commands/frame/diagnose/array/TestArray.py (1053 of 1924) PASS: lldb-shell :: Expr/TestStringLiteralExpr.test (1054 of 1924) PASS: lldb-unit :: Process/Utility/./ProcessUtilityTests/7/16 (1055 of 1924) UNSUPPORTED: lldb-shell :: SymbolFile/DWARF/x86/find-basic-variable.cpp (1056 of 1924) PASS: lldb-api :: lang/cpp/constructors/TestCppConstructors.py (1057 of 1924) PASS: lldb-unit :: Platform/./LLDBPlatformTests/5/16 (1058 of 1924) PASS: lldb-api :: lang/c/conflicting-symbol/TestConflictingSymbol.py (1059 of 1924) PASS: lldb-unit :: Interpreter/./InterpreterTests/9/14 (1060 of 1924) PASS: lldb-shell :: ObjectFile/ELF/section-permissions.yaml (1061 of 1924) PASS: lldb-unit :: Host/./HostTests/9/19 (1062 of 1924) PASS: lldb-unit :: Platform/./LLDBPlatformTests/2/16 (1063 of 1924) PASS: lldb-api :: lang/c/function_types/TestFunctionTypes.py (1064 of 1924) PASS: lldb-shell :: SymbolFile/DWARF/x86/apple-index-is-used.cpp (1065 of 1924) PASS: lldb-shell :: Register/x86-64-read.test (1066 of 1924) PASS: lldb-shell :: Register/Core/x86-32-linux-fp.test (1067 of 1924) PASS: lldb-api :: functionalities/breakpoint/debugbreak/TestDebugBreak.py (1068 of 1924) PASS: lldb-api :: lang/objc/hidden-ivars/TestHiddenIvars.py (1069 of 1924) PASS: lldb-shell :: SymbolFile/DWARF/x86/debug_loc.s (1070 of 1924) PASS: lldb-api :: lang/cpp/bool/TestCPPBool.py (1071 of 1924) PASS: lldb-shell :: Settings/TestSettingsSet.test (1072 of 1924) PASS: lldb-unit :: Interpreter/./InterpreterTests/8/14 (1073 of 1924) PASS: lldb-shell :: ScriptInterpreter/Python/Crashlog/no-args.test (1074 of 1924) PASS: lldb-unit :: UnwindAssembly/ARM64/./Arm64InstEmulationTests/5/7 (1075 of 1924) PASS: lldb-api :: functionalities/data-formatter/data-formatter-stl/libcxx/atomic/TestLibCxxAtomic.py (1076 of 1924) PASS: lldb-unit :: Core/./LLDBCoreTests/19/23 (1077 of 1924) PASS: lldb-api :: lang/cpp/class-template-type-parameter-pack/TestClassTemplateTypeParameterPack.py (1078 of 1924) PASS: lldb-api :: commands/target/select/TestTargetSelect.py (1079 of 1924) PASS: lldb-api :: functionalities/breakpoint/cpp_exception/TestCPPExceptionBreakpoint.py (1080 of 1924) PASS: lldb-api :: sanity/TestReprStrEquality.py (1081 of 1924) PASS: lldb-api :: functionalities/step_scripted/TestStepScripted.py (1082 of 1924) PASS: lldb-api :: tools/lldb-vscode/step/TestVSCode_step.py (1083 of 1924) PASS: lldb-api :: functionalities/data-formatter/data-formatter-stl/libcxx/vector/TestDataFormatterLibcxxVector.py (1084 of 1924) PASS: lldb-shell :: SymbolFile/DWARF/x86/DW_AT_const_value.s (1085 of 1924) PASS: lldb-api :: functionalities/gdb_remote_client/TestNoWatchpointSupportInfo.py (1086 of 1924) UNSUPPORTED: lldb-api :: lang/objcxx/cxx-bridged-po/TestObjCXXBridgedPO.py (1087 of 1924) XFAIL: lldb-shell :: Register/x86-64-fp-read.test (1088 of 1924) UNSUPPORTED: lldb-api :: linux/sepdebugsymlink/TestTargetSymbolsSepDebugSymlink.py (1089 of 1924) PASS: lldb-api :: types/TestDoubleTypes.py (1090 of 1924) PASS: lldb-api :: commands/settings/quoting/TestQuoting.py (1091 of 1924) PASS: lldb-unit :: DataFormatter/./LLDBFormatterTests/7/11 (1092 of 1924) UNSUPPORTED: lldb-shell :: ObjectFile/PECOFF/uuid.yaml (1093 of 1924) UNSUPPORTED: lldb-api :: functionalities/thread/concurrent_events/TestConcurrentSignalNWatchNBreak.py (1094 of 1924) PASS: lldb-shell :: Register/Core/x86-64-netbsd-gp.test (1095 of 1924) PASS: lldb-api :: functionalities/tail_call_frames/sbapi_support/TestTailCallFrameSBAPI.py (1096 of 1924) PASS: lldb-shell :: Driver/TestPageZeroRead.test (1097 of 1924) PASS: lldb-api :: macosx/lc-note/multiple-binary-corefile/TestMultipleBinaryCorefile.py (1098 of 1924) PASS: lldb-unit :: Signals/./SignalsTests/0/5 (1099 of 1924) PASS: lldb-api :: commands/breakpoint/set/func-regex/TestBreakpointRegexError.py (1100 of 1924) PASS: lldb-api :: functionalities/type_get_module/TestTypeGetModule.py (1101 of 1924) PASS: lldb-api :: lang/objc/warnings-in-expr-parser/TestObjCWarningsInExprParser.py (1102 of 1924) PASS: lldb-unit :: SymbolFile/DWARF/./SymbolFileDWARFTests/12/29 (1103 of 1924) PASS: lldb-unit :: SymbolFile/DWARF/./SymbolFileDWARFTests/1/29 (1104 of 1924) PASS: lldb-unit :: Utility/./UtilityTests/22/30 (1105 of 1924) UNSUPPORTED: lldb-api :: tools/lldb-server/TestGdbRemoteProcessInfo.py (1106 of 1924) UNSUPPORTED: lldb-api :: functionalities/thread/concurrent_events/TestConcurrentWatchBreak.py (1107 of 1924) XFAIL: lldb-shell :: Register/x86-64-fp-write.test (1108 of 1924) PASS: lldb-unit :: Process/Utility/./ProcessUtilityTests/8/16 (1109 of 1924) PASS: lldb-api :: functionalities/data-formatter/hexcaps/TestDataFormatterHexCaps.py (1110 of 1924) PASS: lldb-api :: functionalities/gdb_remote_client/TestNoLocalFile.py (1111 of 1924) PASS: lldb-api :: commands/expression/pr52257/TestExprCrash.py (1112 of 1924) PASS: lldb-api :: python_api/sbstructureddata/TestStructuredDataAPI.py (1113 of 1924) PASS: lldb-unit :: tools/lldb-server/tests/./LLDBServerTests/0/2 (1114 of 1924) PASS: lldb-shell :: Unwind/eh-frame-dwarf-unwind.test (1115 of 1924) PASS: lldb-shell :: Driver/TestRepl.test (1116 of 1924) PASS: lldb-api :: lang/cpp/template-function/TestTemplateFunctions.py (1117 of 1924) PASS: lldb-api :: functionalities/thread/exit_during_step/TestExitDuringStep.py (1118 of 1924) PASS: lldb-api :: macosx/safe-to-func-call/TestSafeFuncCalls.py (1119 of 1924) PASS: lldb-unit :: Language/Highlighting/./HighlighterTests/15/29 (1120 of 1924) PASS: lldb-api :: lang/cpp/crtp/TestCppCRTP.py (1121 of 1924) UNSUPPORTED: lldb-api :: linux/mix-dwo-and-regular-objects/TestMixedDwarfBinary.py (1122 of 1924) PASS: lldb-shell :: ObjectFile/PDB/object.test (1123 of 1924) UNSUPPORTED: lldb-api :: tools/lldb-server/commandline/TestStubSetSID.py (1124 of 1924) PASS: lldb-api :: functionalities/inline-stepping/TestInlineStepping.py (1125 of 1924) PASS: lldb-unit :: Core/./LLDBCoreTests/9/23 (1126 of 1924) UNSUPPORTED: lldb-shell :: Subprocess/vfork-follow-parent-wp.test (1127 of 1924) PASS: lldb-shell :: ObjectFile/PECOFF/dwarf-gnu-debuglink-mismatched-crc.yaml (1128 of 1924) UNSUPPORTED: lldb-api :: functionalities/ptrauth_diagnostics/LDRAA_error/TestPtrauthLDRAADiagnostic.py (1129 of 1924) PASS: lldb-api :: lang/c/step-target/TestStepTarget.py (1130 of 1924) UNSUPPORTED: lldb-api :: lang/objc/modules-incomplete/TestIncompleteModules.py (1131 of 1924) UNSUPPORTED: lldb-api :: functionalities/process_save_core/TestProcessSaveCore.py (1132 of 1924) PASS: lldb-api :: functionalities/gdb_remote_client/TestWriteMemory.py (1133 of 1924) PASS: lldb-api :: functionalities/dead-strip/TestDeadStrip.py (1134 of 1924) PASS: lldb-shell :: ObjectFile/PECOFF/basic-info-arm64.yaml (1135 of 1924) UNSUPPORTED: lldb-shell :: SymbolFile/DWARF/x86/debug-line-basic.s (1136 of 1924) XFAIL: lldb-shell :: Register/x86-mm-xmm-write.test (1137 of 1924) UNSUPPORTED: lldb-api :: macosx/corefile-exception-reason/TestCorefileExceptionReason.py (1138 of 1924) PASS: lldb-shell :: Breakpoint/dummy-target.test (1139 of 1924) UNSUPPORTED: lldb-api :: lua_api/TestLuaAPI.py (1140 of 1924) PASS: lldb-api :: commands/expression/persistent_types/TestPersistentTypes.py (1141 of 1924) PASS: lldb-unit :: SymbolFile/DWARF/./SymbolFileDWARFTests/17/29 (1142 of 1924) PASS: lldb-unit :: ScriptInterpreter/Python/./ScriptInterpreterPythonTests/18/19 (1143 of 1924) PASS: lldb-shell :: Reproducer/TestHomeDir.test (1144 of 1924) UNSUPPORTED: lldb-shell :: Register/x86-64-xmm16-read.test (1145 of 1924) PASS: lldb-api :: lang/objc/objc-static-method/TestObjCStaticMethod.py (1146 of 1924) PASS: lldb-api :: lang/c/cpp_keyword_identifiers/TestCppKeywordsAsCIdentifiers.py (1147 of 1924) PASS: lldb-unit :: DataFormatter/./LLDBFormatterTests/6/11 (1148 of 1924) UNSUPPORTED: lldb-api :: tools/lldb-server/TestGdbRemoteKill.py (1149 of 1924) UNSUPPORTED: lldb-shell :: SymbolFile/DWARF/x86/array-sizes.s (1150 of 1924) PASS: lldb-api :: api/log/TestAPILog.py (1151 of 1924) PASS: lldb-shell :: Quit/TestQuitExitCodeHexA.test (1152 of 1924) PASS: lldb-api :: commands/target/dump-symtab-demangle/TestDumpSymtabDemangle.py (1153 of 1924) PASS: lldb-unit :: SymbolFile/DWARF/./SymbolFileDWARFTests/20/29 (1154 of 1924) PASS: lldb-unit :: Host/./HostTests/11/19 (1155 of 1924) UNSUPPORTED: lldb-api :: commands/expression/completion-crash-invalid-iterator/TestInvalidIteratorCompletionCrash.py (1156 of 1924) PASS: lldb-api :: functionalities/plugins/python_os_plugin/stepping_plugin_threads/TestOSPluginStepping.py (1157 of 1924) UNSUPPORTED: lldb-shell :: BuildScript/toolchain-clang-cl.test (1158 of 1924) PASS: lldb-api :: functionalities/tail_call_frames/cross_dso/TestCrossDSOTailCalls.py (1159 of 1924) PASS: lldb-api :: functionalities/postmortem/elf-core/gcore/TestGCore.py (1160 of 1924) PASS: lldb-unit :: Process/minidump/./LLDBMinidumpTests/10/17 (1161 of 1924) UNSUPPORTED: lldb-shell :: SymbolFile/DWARF/x86/dir-separator-posix.s (1162 of 1924) UNSUPPORTED: lldb-api :: linux/aarch64/mte_memory_region/TestAArch64LinuxMTEMemoryRegion.py (1163 of 1924) UNSUPPORTED: lldb-api :: functionalities/breakpoint/hardware_breakpoints/write_memory_with_hw_breakpoint/TestWriteMemoryWithHWBreakpoint.py (1164 of 1924) PASS: lldb-api :: macosx/universal/TestUniversal.py (1165 of 1924) PASS: lldb-shell :: ObjectFile/wasm/basic.yaml (1166 of 1924) PASS: lldb-unit :: Interpreter/./InterpreterTests/12/14 (1167 of 1924) PASS: lldb-unit :: Core/./LLDBCoreTests/17/23 (1168 of 1924) PASS: lldb-api :: functionalities/data-formatter/data-formatter-smart-array/TestDataFormatterSmartArray.py (1169 of 1924) UNSUPPORTED: lldb-api :: benchmarks/frame_variable/TestFrameVariableResponse.py (1170 of 1924) PASS: lldb-shell :: SymbolFile/Breakpad/line-table-missing-file.test (1171 of 1924) PASS: lldb-api :: lang/objc/objc-ivar-stripped/TestObjCIvarStripped.py (1172 of 1924) PASS: lldb-shell :: SymbolFile/DWARF/x86/find-qualified-variable.cpp (1173 of 1924) PASS: lldb-unit :: Core/./LLDBCoreTests/22/23 (1174 of 1924) PASS: lldb-unit :: Expression/./ExpressionTests/4/22 (1175 of 1924) PASS: lldb-api :: sample_test/TestSampleTest.py (1176 of 1924) PASS: lldb-api :: lang/objc/direct-dispatch-step/TestObjCDirectDispatchStepping.py (1177 of 1924) PASS: lldb-api :: lang/c/array_types/TestArrayTypes.py (1178 of 1924) PASS: lldb-api :: functionalities/gdb_remote_client/TestGDBServerTargetXML.py (1179 of 1924) UNSUPPORTED: lldb-api :: functionalities/thread/thread_specific_break_plus_condition/TestThreadSpecificBpPlusCondition.py (1180 of 1924) PASS: lldb-unit :: Core/./LLDBCoreTests/15/23 (1181 of 1924) UNSUPPORTED: lldb-shell :: SymbolFile/DWARF/x86/find-method.cpp (1182 of 1924) PASS: lldb-api :: lang/objc/objc_direct-methods/TestObjCDirectMethods.py (1183 of 1924) PASS: lldb-api :: functionalities/breakpoint/breakpoint_conditions/TestBreakpointConditions.py (1184 of 1924) UNSUPPORTED: lldb-api :: commands/expression/macros/TestMacros.py (1185 of 1924) PASS: lldb-shell :: ScriptInterpreter/Python/exit.test (1186 of 1924) PASS: lldb-api :: commands/expression/radar_8638051/Test8638051.py (1187 of 1924) UNSUPPORTED: lldb-shell :: ScriptInterpreter/Lua/breakpoint_function_callback.test (1188 of 1924) PASS: lldb-api :: commands/expression/fixits/TestFixIts.py (1189 of 1924) PASS: lldb-api :: lang/c/tls_globals/TestTlsGlobals.py (1190 of 1924) PASS: lldb-api :: functionalities/data-formatter/data-formatter-stl/generic/multimap/TestDataFormatterGenericMultiMap.py (1191 of 1924) PASS: lldb-shell :: Register/Core/x86-32-freebsd-gp.test (1192 of 1924) UNSUPPORTED: lldb-api :: functionalities/asan/TestReportData.py (1193 of 1924) PASS: lldb-api :: commands/frame/diagnose/dereference-this/TestDiagnoseDereferenceThis.py (1194 of 1924) UNSUPPORTED: lldb-api :: benchmarks/expression/TestRepeatedExprs.py (1195 of 1924) PASS: lldb-api :: python_api/disassemble-raw-data/TestDisassembleRawData.py (1196 of 1924) UNSUPPORTED: lldb-api :: functionalities/dyld-exec-linux/TestDyldExecLinux.py (1197 of 1924) PASS: lldb-shell :: ObjectFile/ELF/compressed-sections.yaml (1198 of 1924) PASS: lldb-api :: functionalities/breakpoint/inlined_breakpoints/TestInlinedBreakpoints.py (1199 of 1924) UNSUPPORTED: lldb-api :: commands/trace/TestTraceSave.py (1200 of 1924) PASS: lldb-unit :: SymbolFile/NativePDB/./SymbolFileNativePDBTests/5/15 (1201 of 1924) PASS: lldb-api :: commands/expression/import_base_class_when_class_has_derived_member/TestImportBaseClassWhenClassHasDerivedMember.py (1202 of 1924) PASS: lldb-unit :: Process/Utility/./ProcessUtilityTests/6/16 (1203 of 1924) UNSUPPORTED: lldb-api :: commands/watchpoints/watchpoint_events/TestWatchpointEvents.py (1204 of 1924) PASS: lldb-shell :: SymbolFile/DWARF/x86/DW_AT_loclists_base.s (1205 of 1924) UNSUPPORTED: lldb-shell :: ScriptInterpreter/Lua/breakpoint_oneline_callback.test (1206 of 1924) PASS: lldb-api :: python_api/breakpoint/TestBreakpointAPI.py (1207 of 1924) PASS: lldb-api :: lang/objc/foundation/TestSymbolTable.py (1208 of 1924) UNSUPPORTED: lldb-api :: macosx/rosetta/TestRosetta.py (1209 of 1924) PASS: lldb-api :: commands/expression/multiline-completion/TestMultilineCompletion.py (1210 of 1924) PASS: lldb-shell :: ScriptInterpreter/Python/command_relative_import.test (1211 of 1924) PASS: lldb-unit :: debugserver/./debugserverTests/4/6 (1212 of 1924) PASS: lldb-api :: functionalities/lazy-loading/TestLazyLoading.py (1213 of 1924) UNSUPPORTED: lldb-shell :: SymbolFile/NativePDB/load-pdb.cpp (1214 of 1924) PASS: lldb-api :: functionalities/data-formatter/stringprinter/TestStringPrinter.py (1215 of 1924) PASS: lldb-api :: functionalities/data-formatter/var-in-aggregate-misuse/TestVarInAggregateMisuse.py (1216 of 1924) UNSUPPORTED: lldb-api :: tools/lldb-server/TestGdbRemote_vCont.py (1217 of 1924) PASS: lldb-api :: lang/objc/exceptions/TestObjCExceptions.py (1218 of 1924) PASS: lldb-unit :: Language/Highlighting/./HighlighterTests/4/29 (1219 of 1924) UNSUPPORTED: lldb-shell :: ScriptInterpreter/Lua/partial_statements.test (1220 of 1924) PASS: lldb-shell :: Breakpoint/case-sensitive.test (1221 of 1924) PASS: lldb-api :: commands/settings/TestSettings.py (1222 of 1924) UNSUPPORTED: lldb-api :: commands/register/register/aarch64_sve_registers/rw_access_dynamic_resize/TestSVEThreadedDynamic.py (1223 of 1924) PASS: lldb-unit :: SymbolFile/NativePDB/./SymbolFileNativePDBTests/9/15 (1224 of 1924) PASS: lldb-unit :: debugserver/./debugserverTests/0/6 (1225 of 1924) UNSUPPORTED: lldb-api :: functionalities/thread/concurrent_events/TestConcurrentDelaySignalWatch.py (1226 of 1924) PASS: lldb-api :: python_api/section/TestSectionAPI.py (1227 of 1924) PASS: lldb-unit :: Signals/./SignalsTests/1/5 (1228 of 1924) PASS: lldb-unit :: UnwindAssembly/x86/./UnwindAssemblyx86Tests/15/27 (1229 of 1924) UNSUPPORTED: lldb-api :: linux/aarch64/mte_tag_faults/TestAArch64LinuxMTEMemoryTagFaults.py (1230 of 1924) PASS: lldb-unit :: Process/Utility/./ProcessUtilityTests/10/16 (1231 of 1924) PASS: lldb-unit :: Core/./LLDBCoreTests/0/23 (1232 of 1924) PASS: lldb-api :: functionalities/archives/TestBSDArchives.py (1233 of 1924) PASS: lldb-api :: functionalities/mtc/simple/TestMTCSimple.py (1234 of 1924) PASS: lldb-api :: functionalities/thread/step_until/TestStepUntil.py (1235 of 1924) PASS: lldb-api :: lang/objc/variadic_methods/TestVariadicMethods.py (1236 of 1924) PASS: lldb-unit :: UnwindAssembly/x86/./UnwindAssemblyx86Tests/18/27 (1237 of 1924) PASS: lldb-unit :: ScriptInterpreter/Python/./ScriptInterpreterPythonTests/12/19 (1238 of 1924) PASS: lldb-api :: functionalities/data-formatter/data-formatter-objc/TestDataFormatterObjCNSNumber.py (1239 of 1924) PASS: lldb-api :: macosx/DBGSourcePathRemapping/TestDSYMSourcePathRemapping.py (1240 of 1924) UNSUPPORTED: lldb-shell :: SymbolFile/PDB/typedefs.test (1241 of 1924) PASS: lldb-unit :: SymbolFile/DWARF/./SymbolFileDWARFTests/18/29 (1242 of 1924) PASS: lldb-api :: commands/frame/select/TestFrameSelect.py (1243 of 1924) PASS: lldb-shell :: ObjectFile/MachO/lc_version_min.yaml (1244 of 1924) PASS: lldb-unit :: Host/./HostTests/3/19 (1245 of 1924) PASS: lldb-api :: functionalities/recursion/TestValueObjectRecursion.py (1246 of 1924) PASS: lldb-unit :: Process/minidump/./LLDBMinidumpTests/7/17 (1247 of 1924) PASS: lldb-api :: commands/frame/var-scope/TestFrameVariableScope.py (1248 of 1924) PASS: lldb-api :: functionalities/tail_call_frames/ambiguous_tail_call_seq1/TestAmbiguousTailCallSeq1.py (1249 of 1924) PASS: lldb-shell :: ObjectFile/PECOFF/symbol.yaml (1250 of 1924) UNSUPPORTED: lldb-api :: commands/watchpoints/hello_watchpoint/TestMyFirstWatchpoint.py (1251 of 1924) UNSUPPORTED: lldb-shell :: ExecControl/StopHook/stop-hook-threads.test (1252 of 1924) PASS: lldb-api :: functionalities/breakpoint/breakpoint_callback_command_source/TestBreakpointCallbackCommandSource.py (1253 of 1924) PASS: lldb-api :: commands/target/create-deps/TestTargetCreateDeps.py (1254 of 1924) PASS: lldb-unit :: Process/gdb-remote/./ProcessGdbRemoteTests/10/19 (1255 of 1924) PASS: lldb-unit :: Platform/./LLDBPlatformTests/13/16 (1256 of 1924) UNSUPPORTED: lldb-shell :: Process/Windows/exception_access_violation.cpp (1257 of 1924) PASS: lldb-shell :: SymbolFile/NativePDB/lookup-by-types.cpp (1258 of 1924) PASS: lldb-api :: python_api/value/change_values/TestChangeValueAPI.py (1259 of 1924) PASS: lldb-shell :: ObjectFile/Breakpad/discontiguous-sections.test (1260 of 1924) PASS: lldb-unit :: Process/Utility/./ProcessUtilityTests/5/16 (1261 of 1924) PASS: lldb-api :: macosx/lc-note/kern-ver-str/TestKernVerStrLCNOTE.py (1262 of 1924) PASS: lldb-api :: functionalities/gdb_remote_client/TestGdbClientModuleLoad.py (1263 of 1924) UNSUPPORTED: lldb-shell :: ScriptInterpreter/Lua/breakpoint_callback.test (1264 of 1924) UNSUPPORTED: lldb-api :: linux/aarch64/tagged_memory_region/TestAArch64LinuxTaggedMemoryRegion.py (1265 of 1924) PASS: lldb-unit :: UnwindAssembly/ARM64/./Arm64InstEmulationTests/6/7 (1266 of 1924) PASS: lldb-unit :: API/./APITests/2/3 (1267 of 1924) PASS: lldb-api :: lang/objc/foundation/TestObjCMethodsNSError.py (1268 of 1924) UNSUPPORTED: lldb-api :: commands/watchpoints/watchpoint_commands/TestWatchpointCommands.py (1269 of 1924) PASS: lldb-unit :: Interpreter/./InterpreterTests/2/14 (1270 of 1924) PASS: lldb-shell :: Process/TestEnvironment.test (1271 of 1924) PASS: lldb-unit :: Process/minidump/./LLDBMinidumpTests/13/17 (1272 of 1924) PASS: lldb-shell :: Register/x86-64-write.test (1273 of 1924) PASS: lldb-api :: commands/expression/completion-crash-incomplete-record/TestCompletionCrashIncompleteRecord.py (1274 of 1924) PASS: lldb-shell :: SymbolFile/DWARF/x86/split-dwarf-inlining.cpp (1275 of 1924) PASS: lldb-api :: lang/objcxx/class-name-clash/TestNameClash.py (1276 of 1924) PASS: lldb-api :: types/TestIntegerType.py (1277 of 1924) UNSUPPORTED: lldb-api :: functionalities/thread/break_after_join/TestBreakAfterJoin.py (1278 of 1924) PASS: lldb-api :: python_api/process/read-mem-cstring/TestReadMemCString.py (1279 of 1924) PASS: lldb-api :: commands/register/register/register_command/TestRegisters.py (1280 of 1924) UNSUPPORTED: lldb-api :: tools/lldb-server/libraries-svr4/TestGdbRemoteLibrariesSvr4Support.py (1281 of 1924) UNSUPPORTED: lldb-shell :: Register/x86-zmm-read.test (1282 of 1924) PASS: lldb-shell :: Commands/command-image-lookup.yaml (1283 of 1924) PASS: lldb-api :: functionalities/gdb_remote_client/TestPlatformMacOSX.py (1284 of 1924) UNSUPPORTED: lldb-api :: commands/trace/multiple-threads/TestTraceStartStopMultipleThreads.py (1285 of 1924) PASS: lldb-unit :: Language/Highlighting/./HighlighterTests/11/29 (1286 of 1924) PASS: lldb-api :: commands/expression/import-std-module/vector/TestVectorFromStdModule.py (1287 of 1924) PASS: lldb-api :: functionalities/data-formatter/data-formatter-objc/TestDataFormatterObjCKVO.py (1288 of 1924) PASS: lldb-api :: functionalities/target-new-solib-notifications/TestModuleLoadedNotifys.py (1289 of 1924) PASS: lldb-shell :: Settings/TestDisassemblyFormat.test (1290 of 1924) PASS: lldb-unit :: Expression/./ExpressionTests/15/22 (1291 of 1924) PASS: lldb-api :: functionalities/data-formatter/data-formatter-objc/TestDataFormatterObjCNSURL.py (1292 of 1924) PASS: lldb-api :: commands/command/delete/TestCommandDelete.py (1293 of 1924) UNSUPPORTED: lldb-api :: functionalities/data-formatter/data-formatter-stl/libstdcpp/smart_ptr/TestDataFormatterStdSmartPtr.py (1294 of 1924) UNSUPPORTED: lldb-shell :: SymbolFile/PDB/function-nested-block.test (1295 of 1924) PASS: lldb-shell :: SymbolFile/DWARF/x86/split-dwarf-multiple-cu.ll (1296 of 1924) UNSUPPORTED: lldb-api :: tools/lldb-server/vCont-threads/TestSignal.py (1297 of 1924) PASS: lldb-api :: lang/cpp/member-and-local-vars-with-same-name/TestMembersAndLocalsWithSameName.py (1298 of 1924) PASS: lldb-unit :: Target/./TargetTests/8/19 (1299 of 1924) PASS: lldb-shell :: SymbolFile/DWARF/x86/DW_OP_piece-struct.s (1300 of 1924) PASS: lldb-unit :: SymbolFile/DWARF/./SymbolFileDWARFTests/13/29 (1301 of 1924) PASS: lldb-api :: functionalities/data-formatter/nssetsynth/TestNSSetSynthetic.py (1302 of 1924) PASS: lldb-api :: lang/cpp/class_types/TestClassTypesDisassembly.py (1303 of 1924) PASS: lldb-api :: commands/expression/options/TestExprOptions.py (1304 of 1924) PASS: lldb-shell :: Breakpoint/invalid-condition.test (1305 of 1924) PASS: lldb-api :: functionalities/gdb_remote_client/TestMultiprocess.py (1306 of 1924) PASS: lldb-api :: lang/objc/global_ptrs/TestGlobalObjects.py (1307 of 1924) PASS: lldb-unit :: Expression/./ExpressionTests/12/22 (1308 of 1924) PASS: lldb-api :: functionalities/completion/TestCompletion.py (1309 of 1924) PASS: lldb-unit :: Process/minidump/./LLDBMinidumpTests/1/17 (1310 of 1924) UNSUPPORTED: lldb-api :: tools/lldb-server/memory-allocation/TestGdbRemoteMemoryAllocation.py (1311 of 1924) PASS: lldb-api :: commands/expression/pr35310/TestExprsBug35310.py (1312 of 1924) PASS: lldb-unit :: Language/Highlighting/./HighlighterTests/23/29 (1313 of 1924) UNSUPPORTED: lldb-api :: commands/platform/connect/TestPlatformConnect.py (1314 of 1924) PASS: lldb-api :: lang/cpp/trivial_abi/TestTrivialABI.py (1315 of 1924) UNSUPPORTED: lldb-api :: lang/cpp/modules-import/TestCXXModulesImport.py (1316 of 1924) PASS: lldb-unit :: Target/./TargetTests/4/19 (1317 of 1924) PASS: lldb-api :: lang/c/inlines/TestRedefinitionsInInlines.py (1318 of 1924) UNSUPPORTED: lldb-shell :: SymbolFile/PDB/class-layout.test (1319 of 1924) PASS: lldb-unit :: Utility/./UtilityTests/21/30 (1320 of 1924) PASS: lldb-api :: api/command-return-object/TestSBCommandReturnObject.py (1321 of 1924) PASS: lldb-shell :: Driver/TestSingleQuote.test (1322 of 1924) UNSUPPORTED: lldb-api :: functionalities/unwind/ehframe/TestEhFrameUnwind.py (1323 of 1924) PASS: lldb-shell :: SymbolFile/DWARF/x86/DW_TAG_variable-DW_AT_const_value.s (1324 of 1924) PASS: lldb-api :: commands/expression/completion-in-lambda-and-unnamed-class/TestCompletionInLambdaAndUnnamedClass.py (1325 of 1924) PASS: lldb-unit :: UnwindAssembly/ARM64/./Arm64InstEmulationTests/3/7 (1326 of 1924) PASS: lldb-api :: functionalities/breakpoint/breakpoint_ignore_count/TestBreakpointIgnoreCount.py (1327 of 1924) UNSUPPORTED: lldb-shell :: SymbolFile/PDB/function-level-linking.test (1328 of 1924) PASS: lldb-unit :: UnwindAssembly/ARM64/./Arm64InstEmulationTests/4/7 (1329 of 1924) UNSUPPORTED: lldb-api :: tools/lldb-server/TestAppleSimulatorOSType.py (1330 of 1924) PASS: lldb-api :: lang/cpp/dereferencing_references/TestCPPDereferencingReferences.py (1331 of 1924) PASS: lldb-api :: commands/expression/function_template_specialization_temp_args/TestFunctionTemplateSpecializationTempArgs.py (1332 of 1924) UNSUPPORTED: lldb-shell :: ObjectFile/ELF/minidebuginfo-set-and-hit-breakpoint.test (1333 of 1924) PASS: lldb-api :: functionalities/gdb_remote_client/TestProcessConnect.py (1334 of 1924) PASS: lldb-unit :: Disassembler/x86/./GetControlFlowKindx86Tests/0/1 (1335 of 1924) PASS: lldb-shell :: SymbolFile/Breakpad/unwind-via-stack-win.test (1336 of 1924) PASS: lldb-api :: tools/lldb-vscode/stackTrace/TestVSCode_stackTrace.py (1337 of 1924) UNSUPPORTED: lldb-shell :: SymbolFile/DWARF/x86/find-basic-function.cpp (1338 of 1924) PASS: lldb-unit :: Target/./TargetTests/3/19 (1339 of 1924) PASS: lldb-api :: lang/objc/foundation/TestObjCMethods2.py (1340 of 1924) PASS: lldb-unit :: Core/./LLDBCoreTests/18/23 (1341 of 1924) PASS: lldb-api :: lang/mixed/TestMixedLanguages.py (1342 of 1924) PASS: lldb-unit :: Disassembler/ARM/./DisassemblerTests/1/2 (1343 of 1924) PASS: lldb-unit :: SymbolFile/NativePDB/./SymbolFileNativePDBTests/7/15 (1344 of 1924) PASS: lldb-unit :: Symbol/./SymbolTests/0/16 (1345 of 1924) PASS: lldb-api :: functionalities/gdb_remote_client/TestGDBRemotePlatformFile.py (1346 of 1924) UNSUPPORTED: lldb-api :: commands/watchpoints/watchpoint_commands/command/TestWatchpointCommandLLDB.py (1347 of 1924) UNSUPPORTED: lldb-shell :: SymbolFile/NativePDB/break-by-line.cpp (1348 of 1924) PASS: lldb-api :: functionalities/data-formatter/data-formatter-cpp/TestDataFormatterCpp.py (1349 of 1924) PASS: lldb-shell :: SymbolFile/DWARF/x86/dead-code-filtering.yaml (1350 of 1924) PASS: lldb-shell :: Register/Core/x86-32-freebsd-fp.test (1351 of 1924) PASS: lldb-api :: commands/expression/inline-namespace/TestInlineNamespace.py (1352 of 1924) PASS: lldb-shell :: ObjectFile/Breakpad/sections.test (1353 of 1924) PASS: lldb-api :: functionalities/process_crash_info/TestProcessCrashInfo.py (1354 of 1924) PASS: lldb-api :: commands/command/container/TestContainerCommands.py (1355 of 1924) PASS: lldb-unit :: Core/./LLDBCoreTests/5/23 (1356 of 1924) PASS: lldb-api :: commands/apropos/basic/TestApropos.py (1357 of 1924) UNSUPPORTED: lldb-api :: functionalities/thread/concurrent_events/TestConcurrentCrashWithWatchpointBreakpointSignal.py (1358 of 1924) PASS: lldb-unit :: UnwindAssembly/x86/./UnwindAssemblyx86Tests/20/27 (1359 of 1924) UNSUPPORTED: lldb-shell :: Register/x86-64-zmm-read.test (1360 of 1924) PASS: lldb-api :: arm/emulation/TestEmulations.py (1361 of 1924) PASS: lldb-api :: functionalities/param_entry_vals/basic_entry_values/TestBasicEntryValues.py (1362 of 1924) PASS: lldb-unit :: Platform/./LLDBPlatformTests/9/16 (1363 of 1924) PASS: lldb-api :: commands/command/script/import/TestImport.py (1364 of 1924) UNSUPPORTED: lldb-api :: tools/lldb-server/TestGdbRemoteExitCode.py (1365 of 1924) PASS: lldb-shell :: SymbolFile/DWARF/x86/DW_AT_data_bit_offset-DW_OP_stack_value.s (1366 of 1924) PASS: lldb-shell :: SymbolFile/DWARF/clang-ast-from-dwarf-unamed-and-anon-structs.cpp (1367 of 1924) UNSUPPORTED: lldb-shell :: Subprocess/fork-follow-child.test (1368 of 1924) PASS: lldb-api :: commands/source/info/TestSourceInfo.py (1369 of 1924) PASS: lldb-unit :: Process/minidump/./LLDBMinidumpTests/16/17 (1370 of 1924) PASS: lldb-api :: functionalities/data-formatter/data-formatter-stl/libcxx/queue/TestDataFormatterLibcxxQueue.py (1371 of 1924) UNSUPPORTED: lldb-shell :: ObjectFile/PECOFF/export-dllfunc.yaml (1372 of 1924) UNSUPPORTED: lldb-api :: linux/aarch64/mte_tag_access/TestAArch64LinuxMTEMemoryTagAccess.py (1373 of 1924) UNSUPPORTED: lldb-api :: linux/aarch64/unwind_signal/TestUnwindSignal.py (1374 of 1924) PASS: lldb-unit :: SymbolFile/NativePDB/./SymbolFileNativePDBTests/4/15 (1375 of 1924) PASS: lldb-shell :: Commands/command-script-import.test (1376 of 1924) PASS: lldb-api :: lang/cpp/llvm-style/TestLLVMStyle.py (1377 of 1924) PASS: lldb-shell :: Reproducer/Modules/TestModuleCXX.test (1378 of 1924) PASS: lldb-shell :: Reproducer/TestDiscard.test (1379 of 1924) PASS: lldb-api :: functionalities/fat_archives/TestFatArchives.py (1380 of 1924) UNSUPPORTED: lldb-api :: tools/lldb-server/TestGdbRemoteThreadsInStopReply.py (1381 of 1924) PASS: lldb-unit :: Language/Highlighting/./HighlighterTests/16/29 (1382 of 1924) PASS: lldb-unit :: Platform/Android/./AdbClientTests/0/2 (1383 of 1924) PASS: lldb-api :: functionalities/data-formatter/type_summary_list_script/TestTypeSummaryListScript.py (1384 of 1924) PASS: lldb-unit :: SymbolFile/DWARF/./SymbolFileDWARFTests/2/29 (1385 of 1924) PASS: lldb-api :: lang/objc/print-obj/TestPrintObj.py (1386 of 1924) PASS: lldb-unit :: DataFormatter/./LLDBFormatterTests/3/11 (1387 of 1924) PASS: lldb-api :: functionalities/data-formatter/synthupdate/TestSyntheticFilterRecompute.py (1388 of 1924) PASS: lldb-api :: lang/cpp/static_members/TestCPPStaticMembers.py (1389 of 1924) PASS: lldb-api :: qemu/TestQemuLaunch.py (1390 of 1924) PASS: lldb-unit :: Core/./LLDBCoreTests/14/23 (1391 of 1924) PASS: lldb-api :: python_api/module_section/TestModuleAndSection.py (1392 of 1924) PASS: lldb-shell :: Register/Core/x86-32-freebsd-addr.test (1393 of 1924) PASS: lldb-api :: functionalities/thread/num_threads/TestNumThreads.py (1394 of 1924) PASS: lldb-api :: functionalities/data-formatter/data-formatter-stl/generic/bitset/TestDataFormatterGenericBitset.py (1395 of 1924) PASS: lldb-unit :: Process/gdb-remote/./ProcessGdbRemoteTests/3/19 (1396 of 1924) UNSUPPORTED: lldb-api :: functionalities/data-formatter/data-formatter-stl/libstdcpp/iterator/TestDataFormatterStdIterator.py (1397 of 1924) PASS: lldb-api :: python_api/objc_type/TestObjCType.py (1398 of 1924) PASS: lldb-api :: functionalities/thread/concurrent_events/TestConcurrentCrashWithSignal.py (1399 of 1924) PASS: lldb-api :: types/TestFloatTypesExpr.py (1400 of 1924) PASS: lldb-api :: lang/cpp/namespace/TestNamespaceLookup.py (1401 of 1924) UNSUPPORTED: lldb-shell :: Subprocess/vfork-follow-child-wp.test (1402 of 1924) PASS: lldb-api :: tools/lldb-vscode/console/TestVSCode_console.py (1403 of 1924) PASS: lldb-unit :: Expression/./ExpressionTests/8/22 (1404 of 1924) PASS: lldb-api :: functionalities/gdb_remote_client/TestPty.py (1405 of 1924) UNSUPPORTED: lldb-shell :: SymbolFile/NativePDB/ast-functions.cpp (1406 of 1924) PASS: lldb-unit :: ObjectFile/ELF/./ObjectFileELFTests/3/4 (1407 of 1924) UNSUPPORTED: lldb-api :: functionalities/thread/concurrent_events/TestConcurrentDelayedCrashWithBreakpointWatchpoint.py (1408 of 1924) PASS: lldb-shell :: SymbolFile/DWARF/x86/debug_line-tombstone.s (1409 of 1924) PASS: lldb-api :: functionalities/thread/concurrent_events/TestConcurrentDelayedCrashWithBreakpointSignal.py (1410 of 1924) PASS: lldb-shell :: ObjectFile/PECOFF/settings-abi-i686.yaml (1411 of 1924) PASS: lldb-api :: functionalities/inferior-changed/TestInferiorChanged.py (1412 of 1924) PASS: lldb-api :: commands/expression/import-std-module/weak_ptr-dbg-info-content/TestDbgInfoContentWeakPtrFromStdModule.py (1413 of 1924) UNSUPPORTED: lldb-shell :: Subprocess/clone-follow-parent.test (1414 of 1924) PASS: lldb-shell :: ObjectFile/ELF/PT_LOAD-overlap.yaml (1415 of 1924) PASS: lldb-api :: lang/cpp/chained-calls/TestCppChainedCalls.py (1416 of 1924) PASS: lldb-api :: sample_test/TestSampleInlineTest.py (1417 of 1924) PASS: lldb-api :: functionalities/gdb_remote_client/TestGDBRemoteClient.py (1418 of 1924) PASS: lldb-unit :: Utility/./UtilityTests/9/30 (1419 of 1924) UNSUPPORTED: lldb-shell :: SymbolFile/PDB/compilands.test (1420 of 1924) PASS: lldb-shell :: SymbolFile/DWARF/x86/dwarf5-implicit-const.s (1421 of 1924) PASS: lldb-api :: python_api/lldbutil/iter/TestLLDBIterator.py (1422 of 1924) PASS: lldb-shell :: ScriptInterpreter/Python/eof.test (1423 of 1924) PASS: lldb-api :: python_api/compile_unit/TestCompileUnitAPI.py (1424 of 1924) UNSUPPORTED: lldb-shell :: SymbolFile/DWARF/x86/dir-separator-no-comp-dir-relative-name.s (1425 of 1924) PASS: lldb-api :: functionalities/gdb_remote_client/TestqOffsets.py (1426 of 1924) PASS: lldb-api :: macosx/save_crashlog/TestSaveCrashlog.py (1427 of 1924) PASS: lldb-unit :: DataFormatter/./LLDBFormatterTests/8/11 (1428 of 1924) PASS: lldb-api :: lang/cpp/auto/TestCPPAuto.py (1429 of 1924) PASS: lldb-api :: commands/expression/ignore-artificial-constructors/TestIgnoreArtificialConstructors.py (1430 of 1924) PASS: lldb-shell :: ObjectFile/PECOFF/basic-info.yaml (1431 of 1924) PASS: lldb-shell :: Breakpoint/split-dwarf5-debug-stroffsets.test (1432 of 1924) PASS: lldb-api :: commands/expression/multiline-navigation/TestMultilineNavigation.py (1433 of 1924) UNSUPPORTED: lldb-api :: macosx/macCatalystAppMacOSFramework/TestMacCatalystAppWithMacOSFramework.py (1434 of 1924) UNSUPPORTED: lldb-shell :: SymbolFile/DWARF/x86/find-basic-namespace.cpp (1435 of 1924) PASS: lldb-shell :: Commands/command-disassemble.s (1436 of 1924) PASS: lldb-api :: lang/objc/objc-ivar-protocols/TestIvarProtocols.py (1437 of 1924) PASS: lldb-api :: functionalities/data-formatter/data-formatter-synthval/TestDataFormatterSynthVal.py (1438 of 1924) PASS: lldb-api :: functionalities/breakpoint/break_in_loaded_dylib/TestBreakInLoadedDylib.py (1439 of 1924) PASS: lldb-unit :: SymbolFile/DWARF/./SymbolFileDWARFTests/11/29 (1440 of 1924) PASS: lldb-api :: functionalities/avoids-fd-leak/TestFdLeak.py (1441 of 1924) PASS: lldb-api :: functionalities/load_using_paths/TestLoadUsingPaths.py (1442 of 1924) PASS: lldb-shell :: Commands/command-backtrace-parser-2.test (1443 of 1924) PASS: lldb-unit :: Process/Utility/./ProcessUtilityTests/1/16 (1444 of 1924) PASS: lldb-api :: functionalities/pointer_num_children/TestPointerNumChildren.py (1445 of 1924) PASS: lldb-unit :: Expression/./ExpressionTests/19/22 (1446 of 1924) UNSUPPORTED: lldb-api :: tools/lldb-server/memory-tagging/TestGdbRemoteMemoryTagging.py (1447 of 1924) PASS: lldb-api :: commands/session/save/TestSessionSave.py (1448 of 1924) PASS: lldb-unit :: Instruction/./EmulatorTests/0/1 (1449 of 1924) PASS: lldb-shell :: Error/assert.test (1450 of 1924) PASS: lldb-api :: functionalities/reproducers/attach/TestReproducerAttach.py (1451 of 1924) PASS: lldb-shell :: ObjectFile/MachO/symtab.yaml (1452 of 1924) PASS: lldb-api :: lang/c/strings/TestCStrings.py (1453 of 1924) PASS: lldb-api :: functionalities/thread/concurrent_events/TestConcurrentSignalDelayBreak.py (1454 of 1924) PASS: lldb-api :: macosx/find-app-in-bundle/TestFindAppInBundle.py (1455 of 1924) PASS: lldb-unit :: Language/CLanguages/./LanguageCLanguagesTests/0/1 (1456 of 1924) PASS: lldb-api :: commands/expression/cast_int_to_anonymous_enum/TestCastIntToAnonymousEnum.py (1457 of 1924) UNSUPPORTED: lldb-shell :: SymbolFile/DWARF/x86/debug-names-compressed.cpp (1458 of 1924) PASS: lldb-api :: commands/expression/argument_passing_restrictions/TestArgumentPassingRestrictions.py (1459 of 1924) PASS: lldb-api :: lang/c/shared_lib/TestSharedLib.py (1460 of 1924) PASS: lldb-api :: functionalities/stats_api/TestStatisticsAPI.py (1461 of 1924) PASS: lldb-shell :: Breakpoint/jit-loader_rtdyld_elf.test (1462 of 1924) PASS: lldb-shell :: SymbolFile/add-dsym.test (1463 of 1924) PASS: lldb-unit :: SymbolFile/DWARF/./SymbolFileDWARFTests/28/29 (1464 of 1924) PASS: lldb-unit :: Interpreter/./InterpreterTests/1/14 (1465 of 1924) PASS: lldb-shell :: Minidump/memory-region.yaml (1466 of 1924) PASS: lldb-api :: tools/lldb-vscode/evaluate/TestVSCode_evaluate.py (1467 of 1924) PASS: lldb-shell :: Quit/TestQuitExitCode30.test (1468 of 1924) PASS: lldb-api :: lang/objc/objc-new-syntax/TestObjCNewSyntaxDictionary.py (1469 of 1924) PASS: lldb-api :: lang/objc/foundation/TestObjectDescriptionAPI.py (1470 of 1924) PASS: lldb-shell :: ScriptInterpreter/Python/python.test (1471 of 1924) XFAIL: lldb-shell :: Unwind/prefer-debug-over-eh-frame.test (1472 of 1924) PASS: lldb-unit :: Utility/./UtilityTests/7/30 (1473 of 1924) PASS: lldb-api :: tools/lldb-vscode/breakpoint/TestVSCode_logpoints.py (1474 of 1924) UNSUPPORTED: lldb-shell :: Watchpoint/netbsd-nouserdbregs.test (1475 of 1924) PASS: lldb-api :: functionalities/target_var/TestTargetVar.py (1476 of 1924) PASS: lldb-shell :: SymbolFile/DWARF/x86/DW_AT_low_pc-addrx.s (1477 of 1924) UNSUPPORTED: lldb-api :: tools/lldb-server/register-reading/TestGdbRemoteGPacket.py (1478 of 1924) PASS: lldb-shell :: Driver/TestProcessAttach.test (1479 of 1924) UNSUPPORTED: lldb-api :: functionalities/thread/concurrent_events/TestConcurrentNWatchNBreak.py (1480 of 1924) PASS: lldb-api :: python_api/sbvalue_const_addrof/TestSBValueConstAddrOf.py (1481 of 1924) UNSUPPORTED: lldb-shell :: ScriptInterpreter/Lua/nested_sessions.test (1482 of 1924) PASS: lldb-unit :: Core/./LLDBCoreTests/7/23 (1483 of 1924) UNSUPPORTED: lldb-shell :: SymbolFile/NativePDB/ast-methods.cpp (1484 of 1924) PASS: lldb-api :: commands/target/auto-install-main-executable/TestAutoInstallMainExecutable.py (1485 of 1924) PASS: lldb-unit :: Language/Highlighting/./HighlighterTests/13/29 (1486 of 1924) PASS: lldb-shell :: SymbolFile/DWARF/x86/debug_static-member-anonymous-namespace.s (1487 of 1924) PASS: lldb-api :: commands/command/script/import/rdar-12586188/TestRdar12586188.py (1488 of 1924) UNSUPPORTED: lldb-shell :: SymbolFile/DWARF/x86/dwarf5_locations.s (1489 of 1924) PASS: lldb-unit :: Process/gdb-remote/./ProcessGdbRemoteTests/17/19 (1490 of 1924) PASS: lldb-shell :: ObjectFile/PECOFF/basic-info-arm.yaml (1491 of 1924) PASS: lldb-unit :: UnwindAssembly/x86/./UnwindAssemblyx86Tests/17/27 (1492 of 1924) PASS: lldb-api :: functionalities/gdb_remote_client/TestAArch64XMLRegOffsets.py (1493 of 1924) PASS: lldb-unit :: Utility/./UtilityTests/16/30 (1494 of 1924) PASS: lldb-unit :: Language/CPlusPlus/./LanguageCPlusPlusTests/2/5 (1495 of 1924) PASS: lldb-unit :: Utility/./UtilityTests/12/30 (1496 of 1924) PASS: lldb-api :: functionalities/data-formatter/builtin-formats/TestBuiltinFormats.py (1497 of 1924) PASS: lldb-api :: commands/log/basic/TestLogging.py (1498 of 1924) UNSUPPORTED: lldb-api :: functionalities/ptrauth_diagnostics/BLRAA_error/TestPtrauthBLRAADiagnostic.py (1499 of 1924) PASS: lldb-api :: lang/cpp/elaborated-types/TestElaboratedTypes.py (1500 of 1924) PASS: lldb-api :: functionalities/thread/concurrent_events/TestConcurrentDelaySignalBreak.py (1501 of 1924) PASS: lldb-shell :: Driver/TestNoUseColor.test (1502 of 1924) PASS: lldb-api :: lang/c/step_over_no_deadlock/TestStepOverDoesntBlock.py (1503 of 1924) PASS: lldb-api :: lang/objc/modules-non-objc-target/TestObjCModulesNonObjCTarget.py (1504 of 1924) PASS: lldb-unit :: Language/Highlighting/./HighlighterTests/8/29 (1505 of 1924) PASS: lldb-shell :: Minidump/dump-all.test (1506 of 1924) PASS: lldb-unit :: Symbol/./SymbolTests/9/16 (1507 of 1924) PASS: lldb-api :: commands/expression/po_verbosity/TestPoVerbosity.py (1508 of 1924) UNSUPPORTED: lldb-shell :: SymbolFile/NativePDB/local-variables-registers.s (1509 of 1924) PASS: lldb-unit :: ScriptInterpreter/Python/./ScriptInterpreterPythonTests/10/19 (1510 of 1924) PASS: lldb-api :: macosx/add-dsym/TestAddDsymDownload.py (1511 of 1924) PASS: lldb-unit :: Symbol/./SymbolTests/14/16 (1512 of 1924) PASS: lldb-api :: lang/cpp/pointer_to_member_type_depending_on_parent_size/TestPointerToMemberTypeDependingOnParentSize.py (1513 of 1924) PASS: lldb-shell :: SymbolFile/DWARF/x86/debug_loclists-dwo.s (1514 of 1924) PASS: lldb-unit :: Expression/./ExpressionTests/10/22 (1515 of 1924) PASS: lldb-api :: lang/objc/foundation/TestObjCMethods.py (1516 of 1924) PASS: lldb-api :: linux/builtin_trap/TestBuiltinTrap.py (1517 of 1924) PASS: lldb-unit :: ScriptInterpreter/Python/./ScriptInterpreterPythonTests/8/19 (1518 of 1924) PASS: lldb-shell :: Breakpoint/debug_rnglist_rlestartend.test (1519 of 1924) PASS: lldb-api :: lang/objc/modules-objc-property/TestModulesObjCProperty.py (1520 of 1924) PASS: lldb-shell :: ScriptInterpreter/None/none.test (1521 of 1924) PASS: lldb-api :: lang/cpp/operators/TestCppOperators.py (1522 of 1924) UNSUPPORTED: lldb-shell :: Unwind/basic-block-sections.test (1523 of 1924) PASS: lldb-shell :: ObjectFile/wasm/embedded-debug-sections.yaml (1524 of 1924) PASS: lldb-api :: commands/version/TestVersion.py (1525 of 1924) PASS: lldb-shell :: Register/Core/x86-64-freebsd-multithread.test (1526 of 1924) PASS: lldb-unit :: Host/./HostTests/14/19 (1527 of 1924) UNSUPPORTED: lldb-api :: commands/watchpoints/watch_tagged_addr/TestWatchTaggedAddress.py (1528 of 1924) PASS: lldb-shell :: Commands/command-source.test (1529 of 1924) PASS: lldb-api :: lang/objc/objc-optimized/TestObjcOptimized.py (1530 of 1924) UNSUPPORTED: lldb-shell :: SymbolFile/DWARF/x86/debug_ranges_and_rnglists.test (1531 of 1924) PASS: lldb-unit :: UnwindAssembly/x86/./UnwindAssemblyx86Tests/22/27 (1532 of 1924) PASS: lldb-api :: lang/cpp/class-template-parameter-pack/TestClassTemplateParameterPack.py (1533 of 1924) PASS: lldb-unit :: SymbolFile/DWARF/./SymbolFileDWARFTests/26/29 (1534 of 1924) UNSUPPORTED: lldb-api :: commands/watchpoints/watchpoint_size/TestWatchpointSizes.py (1535 of 1924) PASS: lldb-api :: tools/lldb-vscode/runInTerminal/TestVSCode_runInTerminal.py (1536 of 1924) PASS: lldb-shell :: Register/Core/aarch64-freebsd-multithread.test (1537 of 1924) PASS: lldb-api :: commands/expression/import-std-module/deque-dbg-info-content/TestDbgInfoContentDequeFromStdModule.py (1538 of 1924) PASS: lldb-api :: iohandler/resize/TestIOHandlerResize.py (1539 of 1924) UNSUPPORTED: lldb-shell :: SymbolFile/NativePDB/globals-bss.cpp (1540 of 1924) UNSUPPORTED: lldb-shell :: Register/x86-ymm-write.test (1541 of 1924) PASS: lldb-unit :: debugserver/./debugserverTests/5/6 (1542 of 1924) UNSUPPORTED: lldb-shell :: Reproducer/TestLuaImport.test (1543 of 1924) UNSUPPORTED: lldb-api :: tools/lldb-server/TestPtyServer.py (1544 of 1924) PASS: lldb-api :: functionalities/thread/concurrent_events/TestConcurrentManyCrash.py (1545 of 1924) PASS: lldb-shell :: SymbolFile/DWARF/x86/debug_loc_and_loclists.s (1546 of 1924) PASS: lldb-api :: macosx/stack-corefile/TestStackCorefile.py (1547 of 1924) PASS: lldb-unit :: Process/gdb-remote/./ProcessGdbRemoteTests/15/19 (1548 of 1924) PASS: lldb-unit :: Host/./HostTests/10/19 (1549 of 1924) PASS: lldb-api :: functionalities/data-formatter/data-formatter-stl/generic/optional/TestDataFormatterGenericOptional.py (1550 of 1924) PASS: lldb-shell :: ObjectFile/ELF/minidebuginfo-find-symbols.yaml (1551 of 1924) PASS: lldb-shell :: Quit/TestQuitExitCode-30.test (1552 of 1924) PASS: lldb-api :: functionalities/float-display/TestFloatDisplay.py (1553 of 1924) PASS: lldb-api :: tools/lldb-vscode/correct-thread/TestVSCode_correct_thread.py (1554 of 1924) UNSUPPORTED: lldb-shell :: SymbolFile/DWARF/x86/DW_TAG_variable-DW_AT_decl_file-DW_AT_abstract_origin-crosscu1.s (1555 of 1924) PASS: lldb-api :: functionalities/jitloader_gdb/TestJITLoaderGDB.py (1556 of 1924) PASS: lldb-api :: functionalities/gdb_remote_client/TestStopPCs.py (1557 of 1924) PASS: lldb-api :: functionalities/tail_call_frames/thread_step_out_message/TestArtificialFrameStepOutMessage.py (1558 of 1924) UNSUPPORTED: lldb-api :: tools/lldb-server/TestGdbRemoteModuleInfo.py (1559 of 1924) UNSUPPORTED: lldb-api :: commands/expression/import-std-module/pair/TestPairFromStdModule.py (1560 of 1924) PASS: lldb-api :: functionalities/data-formatter/dump_dynamic/TestDumpDynamic.py (1561 of 1924) PASS: lldb-unit :: Interpreter/./InterpreterTests/10/14 (1562 of 1924) UNSUPPORTED: lldb-api :: commands/watchpoints/multi_watchpoint_slots/TestWatchpointMultipleSlots.py (1563 of 1924) UNSUPPORTED: lldb-api :: tools/lldb-server/TestGdbRemoteRegisterState.py (1564 of 1924) PASS: lldb-api :: commands/expression/rdar44436068/Test128BitsInteger.py (1565 of 1924) PASS: lldb-api :: functionalities/signal/raise/TestRaise.py (1566 of 1924) PASS: lldb-api :: lang/objc/complete-type-check/TestObjCIsTypeComplete.py (1567 of 1924) PASS: lldb-shell :: Reproducer/TestPythonImport.test (1568 of 1924) PASS: lldb-unit :: Interpreter/./InterpreterTests/3/14 (1569 of 1924) PASS: lldb-unit :: ScriptInterpreter/Python/./ScriptInterpreterPythonTests/6/19 (1570 of 1924) PASS: lldb-api :: commands/expression/no-deadlock/TestExprDoesntBlock.py (1571 of 1924) PASS: lldb-api :: python_api/type/TestTypeList.py (1572 of 1924) PASS: lldb-unit :: SymbolFile/DWARF/./SymbolFileDWARFTests/9/29 (1573 of 1924) PASS: lldb-unit :: SymbolFile/DWARF/./SymbolFileDWARFTests/19/29 (1574 of 1924) UNSUPPORTED: lldb-shell :: SymbolFile/PDB/pointers.test (1575 of 1924) PASS: lldb-api :: commands/process/continue_to_bkpt/TestContinueToBkpts.py (1576 of 1924) PASS: lldb-api :: commands/expression/static-initializers/TestStaticInitializers.py (1577 of 1924) PASS: lldb-api :: lang/objc/radar-9691614/TestObjCMethodReturningBOOL.py (1578 of 1924) PASS: lldb-api :: macosx/unregistered-macho/TestUnregisteredMacho.py (1579 of 1924) PASS: lldb-api :: functionalities/unwind/noreturn/module-end/TestNoReturnModuleEnd.py (1580 of 1924) UNSUPPORTED: lldb-api :: functionalities/tsan/thread_numbers/TestTsanThreadNumbers.py (1581 of 1924) PASS: lldb-unit :: Language/Highlighting/./HighlighterTests/2/29 (1582 of 1924) PASS: lldb-unit :: UnwindAssembly/x86/./UnwindAssemblyx86Tests/7/27 (1583 of 1924) PASS: lldb-shell :: lldb-server/TestErrorMessages.test (1584 of 1924) UNSUPPORTED: lldb-api :: commands/expression/import-std-module/stack/TestStackFromStdModule.py (1585 of 1924) PASS: lldb-api :: lang/objc/self/TestObjCSelf.py (1586 of 1924) PASS: lldb-api :: lang/cpp/global_variables/TestCPPGlobalVariables.py (1587 of 1924) PASS: lldb-api :: lang/cpp/gmodules-templates/TestGModules.py (1588 of 1924) PASS: lldb-api :: commands/expression/result_numbering/TestResultNumbering.py (1589 of 1924) PASS: lldb-shell :: BuildScript/script-args.test (1590 of 1924) PASS: lldb-api :: commands/expression/import-std-module/queue/TestQueueFromStdModule.py (1591 of 1924) PASS: lldb-api :: functionalities/tail_call_frames/unambiguous_sequence/TestUnambiguousTailCalls.py (1592 of 1924) PASS: lldb-api :: tools/lldb-vscode/breakpoint/TestVSCode_setExceptionBreakpoints.py (1593 of 1924) PASS: lldb-unit :: API/./APITests/0/3 (1594 of 1924) UNSUPPORTED: lldb-shell :: SymbolFile/DWARF/x86/dwp-separate-debug-file.cpp (1595 of 1924) UNSUPPORTED: lldb-api :: api/multiple-targets/TestMultipleTargets.py (1596 of 1924) PASS: lldb-api :: macosx/duplicate-archive-members/TestDuplicateMembers.py (1597 of 1924) PASS: lldb-unit :: UnwindAssembly/x86/./UnwindAssemblyx86Tests/26/27 (1598 of 1924) PASS: lldb-unit :: UnwindAssembly/x86/./UnwindAssemblyx86Tests/9/27 (1599 of 1924) UNSUPPORTED: lldb-api :: functionalities/tsan/global_location/TestTsanGlobalLocation.py (1600 of 1924) PASS: lldb-api :: commands/breakpoint/command/list/TestBreakpointCommandList.py (1601 of 1924) PASS: lldb-api :: functionalities/location-list-lookup/TestLocationListLookup.py (1602 of 1924) PASS: lldb-api :: commands/expression/import-std-module/unique_ptr/TestUniquePtrFromStdModule.py (1603 of 1924) PASS: lldb-api :: functionalities/tail_call_frames/ambiguous_tail_call_seq2/TestAmbiguousTailCallSeq2.py (1604 of 1924) PASS: lldb-shell :: ObjectFile/PECOFF/settings-abi.yaml (1605 of 1924) UNSUPPORTED: lldb-shell :: SymbolFile/DWARF/dwo-relative-path.s (1606 of 1924) PASS: lldb-api :: api/multithreaded/TestMultithreaded.py (1607 of 1924) PASS: lldb-shell :: VSCode/TestOptions.test (1608 of 1924) PASS: lldb-api :: lang/cpp/step-through-trampoline/TestStepThroughTrampoline.py (1609 of 1924) PASS: lldb-unit :: UnwindAssembly/x86/./UnwindAssemblyx86Tests/23/27 (1610 of 1924) UNSUPPORTED: lldb-shell :: ScriptInterpreter/Lua/lua-python.test (1611 of 1924) PASS: lldb-api :: commands/expression/issue_11588/Test11588.py (1612 of 1924) PASS: lldb-api :: commands/expression/invalid-args/TestInvalidArgsExpression.py (1613 of 1924) UNSUPPORTED: lldb-shell :: SymbolFile/PDB/func-symbols.test (1614 of 1924) PASS: lldb-unit :: UnwindAssembly/x86/./UnwindAssemblyx86Tests/2/27 (1615 of 1924) PASS: lldb-api :: functionalities/unwind/sigtramp/TestSigtrampUnwind.py (1616 of 1924) PASS: lldb-api :: lang/c/sizeof/TestCSizeof.py (1617 of 1924) PASS: lldb-api :: functionalities/breakpoint/move_nearest/TestMoveNearest.py (1618 of 1924) PASS: lldb-api :: functionalities/disassemble/aarch64-adrp-add/TestAArch64AdrpAdd.py (1619 of 1924) PASS: lldb-api :: commands/expression/formatters/TestFormatters.py (1620 of 1924) PASS: lldb-api :: lang/cpp/subst_template_type_param/TestSubstTemplateTypeParam.py (1621 of 1924) PASS: lldb-api :: commands/expression/timeout/TestCallWithTimeout.py (1622 of 1924) PASS: lldb-shell :: Recognizer/assert.test (1623 of 1924) PASS: lldb-unit :: Utility/./UtilityTests/2/30 (1624 of 1924) PASS: lldb-api :: lang/objc/tagged-pointer/TestTaggedPointerCmd.py (1625 of 1924) PASS: lldb-api :: lang/objc/objc-checker/TestObjCCheckers.py (1626 of 1924) PASS: lldb-api :: lang/c/calling-conventions/TestCCallingConventions.py (1627 of 1924) PASS: lldb-api :: commands/frame/diagnose/dereference-argument/TestDiagnoseDereferenceArgument.py (1628 of 1924) PASS: lldb-api :: functionalities/gdb_remote_client/TestPlatformClient.py (1629 of 1924) PASS: lldb-unit :: Target/./TargetTests/14/19 (1630 of 1924) PASS: lldb-unit :: Utility/./UtilityTests/24/30 (1631 of 1924) PASS: lldb-api :: commands/process/launch/TestProcessLaunch.py (1632 of 1924) PASS: lldb-api :: commands/expression/ir-interpreter/TestIRInterpreter.py (1633 of 1924) PASS: lldb-api :: macosx/add-dsym/TestAddDsymMidExecutionCommand.py (1634 of 1924) PASS: lldb-api :: lang/objc/objc-class-method/TestObjCClassMethod.py (1635 of 1924) UNSUPPORTED: lldb-shell :: ScriptInterpreter/Lua/convenience_variables.test (1636 of 1924) PASS: lldb-api :: lang/cpp/class-template-non-type-parameter-pack/TestClassTemplateNonTypeParameterPack.py (1637 of 1924) UNSUPPORTED: lldb-shell :: Register/x86-64-ymm16-read.test (1638 of 1924) PASS: lldb-unit :: ObjectFile/Breakpad/./ObjectFileBreakpadTests/7/11 (1639 of 1924) PASS: lldb-unit :: ObjectFile/Breakpad/./ObjectFileBreakpadTests/1/11 (1640 of 1924) PASS: lldb-api :: functionalities/data-formatter/data-formatter-stl/libcxx/shared_ptr/TestDataFormatterLibcxxSharedPtr.py (1641 of 1924) PASS: lldb-shell :: SymbolFile/OnDemand/source-breakpoint.test (1642 of 1924) PASS: lldb-unit :: Target/./TargetTests/17/19 (1643 of 1924) PASS: lldb-api :: lang/c/blocks/TestBlocks.py (1644 of 1924) PASS: lldb-api :: python_api/formatters/TestFormattersSBAPI.py (1645 of 1924) PASS: lldb-api :: functionalities/step-avoids-no-debug/TestStepNoDebug.py (1646 of 1924) PASS: lldb-api :: commands/expression/import-std-module/sysroot/TestStdModuleSysroot.py (1647 of 1924) PASS: lldb-unit :: Process/gdb-remote/./ProcessGdbRemoteTests/14/19 (1648 of 1924) PASS: lldb-api :: lang/cpp/unique-types/TestUniqueTypes.py (1649 of 1924) PASS: lldb-api :: lang/objc/objc-stepping/TestObjCStepping.py (1650 of 1924) PASS: lldb-api :: lang/c/builtin-types/TestCBuiltinTypes.py (1651 of 1924) PASS: lldb-api :: functionalities/breakpoint/dummy_target_breakpoints/TestBreakpointsWithNoTargets.py (1652 of 1924) XFAIL: lldb-shell :: Register/x86-mm-xmm-read.test (1653 of 1924) PASS: lldb-unit :: debugserver/./debugserverTests/2/6 (1654 of 1924) UNSUPPORTED: lldb-api :: functionalities/data-formatter/data-formatter-stl/libstdcpp/vector/TestDataFormatterStdVector.py (1655 of 1924) PASS: lldb-api :: macosx/find-dsym/bundle-with-dot-in-filename/TestBundleWithDotInFilename.py (1656 of 1924) UNSUPPORTED: lldb-shell :: ObjectFile/ELF/basic-info.yaml (1657 of 1924) PASS: lldb-api :: functionalities/limit-debug-info/TestLimitDebugInfo.py (1658 of 1924) UNSUPPORTED: lldb-shell :: SymbolFile/NativePDB/source-list.cpp (1659 of 1924) PASS: lldb-api :: lang/cpp/global_operators/TestCppGlobalOperators.py (1660 of 1924) PASS: lldb-api :: functionalities/breakpoint/breakpoint_hit_count/TestBreakpointHitCount.py (1661 of 1924) PASS: lldb-api :: lang/cpp/stl/TestSTL.py (1662 of 1924) PASS: lldb-shell :: ScriptInterpreter/Python/command_import.test (1663 of 1924) PASS: lldb-unit :: Process/gdb-remote/./ProcessGdbRemoteTests/7/19 (1664 of 1924) UNSUPPORTED: lldb-shell :: SymbolFile/NativePDB/find-functions.cpp (1665 of 1924) PASS: lldb-shell :: Commands/command-disassemble-aarch64-extensions.s (1666 of 1924) PASS: lldb-api :: python_api/lldbutil/process/TestPrintStackTraces.py (1667 of 1924) PASS: lldb-unit :: ObjectFile/Breakpad/./ObjectFileBreakpadTests/10/11 (1668 of 1924) UNSUPPORTED: lldb-api :: functionalities/thread/concurrent_events/TestConcurrentTwoWatchpointsOneSignal.py (1669 of 1924) PASS: lldb-api :: functionalities/postmortem/minidump-new/TestMiniDumpUUID.py (1670 of 1924) PASS: lldb-api :: repl/clang/TestClangREPL.py (1671 of 1924) PASS: lldb-unit :: SymbolFile/DWARF/./SymbolFileDWARFTests/27/29 (1672 of 1924) UNSUPPORTED: lldb-shell :: SymbolFile/DWARF/x86/win-i386-line-table.s (1673 of 1924) PASS: lldb-unit :: Interpreter/./InterpreterTests/7/14 (1674 of 1924) PASS: lldb-unit :: debugserver/./debugserverTests/1/6 (1675 of 1924) PASS: lldb-api :: lang/cpp/namespace/TestNamespace.py (1676 of 1924) UNSUPPORTED: lldb-shell :: ScriptInterpreter/Lua/independent_state.test (1677 of 1924) PASS: lldb-api :: lang/cpp/incompatible-class-templates/TestCppIncompatibleClassTemplates.py (1678 of 1924) PASS: lldb-api :: commands/expression/import-std-module/forward_decl_from_module/TestForwardDeclFromStdModule.py (1679 of 1924) PASS: lldb-api :: functionalities/data-formatter/data-formatter-objc/TestDataFormatterObjCNSBundle.py (1680 of 1924) PASS: lldb-shell :: Minidump/fb-dump.test (1681 of 1924) PASS: lldb-shell :: SymbolFile/Breakpad/unwind-via-stack-cfi.test (1682 of 1924) PASS: lldb-api :: python_api/exprpath_synthetic/TestExprPathSynthetic.py (1683 of 1924) PASS: lldb-shell :: SymbolFile/DWARF/x86/static_scope.s (1684 of 1924) UNSUPPORTED: lldb-shell :: SymbolFile/NativePDB/local-variables.cpp (1685 of 1924) PASS: lldb-unit :: Host/./HostTests/16/19 (1686 of 1924) PASS: lldb-api :: lang/objcxx/hide-runtime-values/TestObjCXXHideRuntimeValues.py (1687 of 1924) PASS: lldb-unit :: SymbolFile/DWARF/./SymbolFileDWARFTests/23/29 (1688 of 1924) PASS: lldb-unit :: ObjectFile/Breakpad/./ObjectFileBreakpadTests/4/11 (1689 of 1924) PASS: lldb-unit :: ObjectFile/MachO/./ObjectFileMachOTests/0/2 (1690 of 1924) PASS: lldb-api :: lang/cpp/covariant-return-types/TestCovariantReturnTypes.py (1691 of 1924) PASS: lldb-api :: macosx/nslog/TestDarwinNSLogOutput.py (1692 of 1924) PASS: lldb-shell :: Expr/TestIRMemoryMap.test (1693 of 1924) PASS: lldb-api :: commands/expression/import-std-module/empty-module/TestEmptyStdModule.py (1694 of 1924) PASS: lldb-unit :: UnwindAssembly/x86/./UnwindAssemblyx86Tests/3/27 (1695 of 1924) UNSUPPORTED: lldb-api :: functionalities/breakpoint/breakpoint_in_delayslot/TestAvoidBreakpointInDelaySlot.py (1696 of 1924) PASS: lldb-unit :: Platform/./LLDBPlatformTests/8/16 (1697 of 1924) PASS: lldb-api :: python_api/value/TestValueAPI.py (1698 of 1924) PASS: lldb-api :: types/TestCharTypeExpr.py (1699 of 1924) PASS: lldb-unit :: Process/gdb-remote/./ProcessGdbRemoteTests/11/19 (1700 of 1924) PASS: lldb-api :: functionalities/gdb_remote_client/TestIOSSimulator.py (1701 of 1924) UNSUPPORTED: lldb-shell :: Register/x86-gp-read.test (1702 of 1924) UNSUPPORTED: lldb-api :: tools/lldb-server/TestNonStop.py (1703 of 1924) PASS: lldb-api :: lang/cpp/dynamic-value-same-basename/TestDynamicValueSameBase.py (1704 of 1924) PASS: lldb-api :: commands/frame/diagnose/bad-reference/TestBadReference.py (1705 of 1924) PASS: lldb-unit :: SymbolFile/NativePDB/./SymbolFileNativePDBTests/1/15 (1706 of 1924) PASS: lldb-api :: api/check_public_api_headers/TestPublicAPIHeaders.py (1707 of 1924) UNSUPPORTED: lldb-shell :: SymbolFile/DWARF/x86/limit-debug-info.s (1708 of 1924) PASS: lldb-shell :: SymbolFile/DWARF/x86/find-method-local-struct.cpp (1709 of 1924) PASS: lldb-api :: lang/cpp/break-on-initializers/TestBreakOnCPP11Initializers.py (1710 of 1924) UNSUPPORTED: lldb-api :: functionalities/tsan/thread_leak/TestTsanThreadLeak.py (1711 of 1924) PASS: lldb-unit :: Signals/./SignalsTests/4/5 (1712 of 1924) PASS: lldb-api :: functionalities/dlopen_other_executable/TestDlopenOtherExecutable.py (1713 of 1924) PASS: lldb-api :: functionalities/gdb_remote_client/TestThreadSelectionBug.py (1714 of 1924) PASS: lldb-shell :: Breakpoint/debug_addrx.test (1715 of 1924) PASS: lldb-shell :: Driver/TestError.test (1716 of 1924) PASS: lldb-api :: functionalities/gdb_remote_client/TestFork.py (1717 of 1924) PASS: lldb-shell :: ObjectFile/ELF/PT_LOAD-overlap-PT_INTERP.yaml (1718 of 1924) UNSUPPORTED: lldb-api :: android/platform/TestDefaultCacheLineSize.py (1719 of 1924) PASS: lldb-shell :: Expr/TestMultilineExpr.test (1720 of 1924) PASS: lldb-api :: python_api/sbplatform/TestSBPlatform.py (1721 of 1924) PASS: lldb-shell :: SymbolFile/DWARF/anon_class_w_and_wo_export_symbols.ll (1722 of 1924) UNSUPPORTED: lldb-api :: functionalities/tsan/multiple/TestTsanMultiple.py (1723 of 1924) PASS: lldb-api :: test_utils/TestPExpectTest.py (1724 of 1924) PASS: lldb-api :: functionalities/gdb_remote_client/TestRemoteRegNums.py (1725 of 1924) PASS: lldb-unit :: Host/./HostTests/18/19 (1726 of 1924) PASS: lldb-shell :: Settings/TestFrameFormatColor.test (1727 of 1924) UNSUPPORTED: lldb-shell :: ScriptInterpreter/Lua/quit.test (1728 of 1924) UNSUPPORTED: lldb-api :: tools/lldb-server/vCont-threads/TestPartialResume.py (1729 of 1924) PASS: lldb-api :: functionalities/history/TestHistoryRecall.py (1730 of 1924) PASS: lldb-api :: lang/cpp/class_types/TestClassTypes.py (1731 of 1924) XFAIL: lldb-shell :: Expr/nodefaultlib.cpp (1732 of 1924) UNSUPPORTED: lldb-shell :: SymbolFile/NativePDB/break-by-function.cpp (1733 of 1924) PASS: lldb-shell :: Commands/command-stop-hook-no-target.test (1734 of 1924) PASS: lldb-unit :: Core/./LLDBCoreTests/4/23 (1735 of 1924) PASS: lldb-api :: commands/expression/import-std-module/no-std-module/TestMissingStdModule.py (1736 of 1924) UNSUPPORTED: lldb-api :: functionalities/thread/concurrent_events/TestConcurrentTwoBreakpointsOneWatchpoint.py (1737 of 1924) PASS: lldb-unit :: Core/./LLDBCoreTests/10/23 (1738 of 1924) PASS: lldb-api :: lang/cpp/offsetof/TestOffsetofCpp.py (1739 of 1924) UNSUPPORTED: lldb-shell :: Subprocess/clone-follow-parent-softbp.test (1740 of 1924) PASS: lldb-api :: functionalities/data-formatter/data-formatter-objc/TestDataFormatterObjCExpr.py (1741 of 1924) PASS: lldb-api :: assert_messages_test/TestAssertMessages.py (1742 of 1924) UNSUPPORTED: lldb-shell :: SymbolFile/DWARF/x86/find-inline-method.s (1743 of 1924) PASS: lldb-api :: functionalities/data-formatter/pyobjsynthprovider/TestPyObjSynthProvider.py (1744 of 1924) PASS: lldb-unit :: Core/./LLDBCoreTests/21/23 (1745 of 1924) PASS: lldb-api :: commands/expression/import-std-module/forward_list/TestForwardListFromStdModule.py (1746 of 1924) UNSUPPORTED: lldb-api :: functionalities/thread/multi_break/TestMultipleBreakpoints.py (1747 of 1924) PASS: lldb-api :: lang/cpp/lambdas/TestLambdas.py (1748 of 1924) PASS: lldb-api :: functionalities/data-formatter/refpointer-recursion/TestDataFormatterRefPtrRecursion.py (1749 of 1924) PASS: lldb-unit :: DataFormatter/./LLDBFormatterTests/0/11 (1750 of 1924) PASS: lldb-unit :: SymbolFile/DWARF/./SymbolFileDWARFTests/10/29 (1751 of 1924) PASS: lldb-shell :: Settings/TestFrameFormatNoColor.test (1752 of 1924) PASS: lldb-api :: functionalities/data-formatter/data-formatter-stl/libcxx/initializerlist/TestInitializerList.py (1753 of 1924) PASS: lldb-api :: functionalities/data-formatter/nsdictionarysynth/TestNSDictionarySynthetic.py (1754 of 1924) UNSUPPORTED: lldb-api :: arm/breakpoint-thumb-codesection/TestBreakpointThumbCodesection.py (1755 of 1924) PASS: lldb-api :: functionalities/data-formatter/data-formatter-stl/generic/unordered/TestDataFormatterGenericUnordered.py (1756 of 1924) UNSUPPORTED: lldb-shell :: Register/x86-ymm-read.test (1757 of 1924) PASS: lldb-api :: functionalities/breakpoint/breakpoint_command/TestRegexpBreakCommand.py (1758 of 1924) UNSUPPORTED: lldb-api :: lang/objc/conflicting-class-list-function-from-user/TestObjCClassListFunctionFromUser.py (1759 of 1924) PASS: lldb-shell :: SymbolFile/DWARF/x86/DW_AT_declaration-with-children.s (1760 of 1924) PASS: lldb-unit :: Host/./HostTests/12/19 (1761 of 1924) PASS: lldb-unit :: SymbolFile/DWARF/./SymbolFileDWARFTests/3/29 (1762 of 1924) PASS: lldb-api :: macosx/thread-names/TestInterruptThreadNames.py (1763 of 1924) PASS: lldb-unit :: Expression/./ExpressionTests/9/22 (1764 of 1924) PASS: lldb-shell :: ObjectFile/PECOFF/dwarf-gnu-debuglink-pdb-buildid.yaml (1765 of 1924) PASS: lldb-api :: lang/cpp/static_member_type_depending_on_parent_size/TestStaticMemberTypeDependingOnParentSize.py (1766 of 1924) PASS: lldb-unit :: Utility/./UtilityTests/28/30 (1767 of 1924) PASS: lldb-api :: macosx/lc-note/firmware-corefile/TestFirmwareCorefiles.py (1768 of 1924) PASS: lldb-api :: lang/objc/blocks/TestObjCIvarsInBlocks.py (1769 of 1924) PASS: lldb-api :: macosx/builtin-debugtrap/TestBuiltinDebugTrap.py (1770 of 1924) PASS: lldb-unit :: Target/./TargetTests/7/19 (1771 of 1924) UNSUPPORTED: lldb-shell :: Register/x86-64-gp-write.test (1772 of 1924) PASS: lldb-api :: functionalities/breakpoint/breakpoint_set_restart/TestBreakpointSetRestart.py (1773 of 1924) PASS: lldb-api :: lang/objcxx/conflicting-names-class-update-utility-expr/TestObjCConflictingNamesForClassUpdateExpr.py (1774 of 1924) PASS: lldb-api :: functionalities/rerun/TestRerun.py (1775 of 1924) PASS: lldb-api :: functionalities/data-formatter/boolreference/TestFormattersBoolRefPtr.py (1776 of 1924) PASS: lldb-api :: lang/cpp/typeof/TestTypeOfDeclTypeExpr.py (1777 of 1924) UNSUPPORTED: lldb-api :: benchmarks/continue/TestBenchmarkContinue.py (1778 of 1924) PASS: lldb-api :: functionalities/breakpoint/breakpoint_by_line_and_column/TestBreakpointByLineAndColumn.py (1779 of 1924) PASS: lldb-unit :: Symbol/./SymbolTests/12/16 (1780 of 1924) PASS: lldb-api :: functionalities/breakpoint/scripted_bkpt/TestScriptedResolver.py (1781 of 1924) PASS: lldb-api :: functionalities/non-overlapping-index-variable-i/TestIndexVariable.py (1782 of 1924) UNSUPPORTED: lldb-api :: tools/lldb-server/TestGdbRemoteFork.py (1783 of 1924) PASS: lldb-unit :: Process/minidump/./LLDBMinidumpTests/4/17 (1784 of 1924) PASS: lldb-api :: lang/objc/ptr_refs/TestPtrRefsObjC.py (1785 of 1924) PASS: lldb-api :: python_api/class_members/TestSBTypeClassMembers.py (1786 of 1924) PASS: lldb-unit :: Platform/Android/./AdbClientTests/1/2 (1787 of 1924) PASS: lldb-api :: lang/objc/foundation/TestObjCMethodsString.py (1788 of 1924) PASS: lldb-api :: lang/cpp/static_methods/TestCPPStaticMethods.py (1789 of 1924) PASS: lldb-api :: functionalities/breakpoint/objc/TestObjCBreakpoints.py (1790 of 1924) PASS: lldb-unit :: Disassembler/ARM/./DisassemblerTests/0/2 (1791 of 1924) PASS: lldb-shell :: Settings/TestEchoCommands.test (1792 of 1924) PASS: lldb-api :: commands/expression/diagnostics/TestExprDiagnostics.py (1793 of 1924) PASS: lldb-api :: lang/cpp/diamond/TestCppDiamond.py (1794 of 1924) PASS: lldb-api :: functionalities/thread/concurrent_events/TestConcurrentTwoBreakpointThreads.py (1795 of 1924) PASS: lldb-api :: functionalities/data-formatter/frameformat_smallstruct/TestFrameFormatSmallStruct.py (1796 of 1924) UNSUPPORTED: lldb-shell :: ScriptInterpreter/Lua/lua.test (1797 of 1924) XFAIL: lldb-api :: functionalities/gdb_remote_client/TestRestartBug.py (1798 of 1924) PASS: lldb-api :: python_api/sblaunchinfo/TestSBLaunchInfo.py (1799 of 1924) PASS: lldb-unit :: Target/./TargetTests/2/19 (1800 of 1924) PASS: lldb-api :: functionalities/dynamic_value_child_count/TestDynamicValueChildCount.py (1801 of 1924) PASS: lldb-api :: lang/cpp/signed_types/TestSignedTypes.py (1802 of 1924) PASS: lldb-api :: lang/objc/unicode-string/TestUnicodeString.py (1803 of 1924) UNSUPPORTED: lldb-api :: tools/lldb-server/attach-wait/TestGdbRemoteAttachWait.py (1804 of 1924) PASS: lldb-unit :: Symbol/./SymbolTests/11/16 (1805 of 1924) PASS: lldb-unit :: Language/Highlighting/./HighlighterTests/12/29 (1806 of 1924) PASS: lldb-api :: lang/cpp/type_lookup/TestCppTypeLookup.py (1807 of 1924) PASS: lldb-unit :: ScriptInterpreter/Python/./ScriptInterpreterPythonTests/13/19 (1808 of 1924) PASS: lldb-unit :: Thread/./ThreadTests/1/2 (1809 of 1924) PASS: lldb-api :: functionalities/backticks/TestBackticksWithoutATarget.py (1810 of 1924) UNSUPPORTED: lldb-shell :: ScriptInterpreter/Lua/fail_breakpoint_oneline.test (1811 of 1924) PASS: lldb-unit :: Host/./HostTests/17/19 (1812 of 1924) PASS: lldb-api :: functionalities/breakpoint/two_hits_one_actual/TestTwoHitsOneActual.py (1813 of 1924) PASS: lldb-api :: functionalities/data-formatter/typedef_array/TestTypedefArray.py (1814 of 1924) PASS: lldb-api :: commands/expression/xvalue/TestXValuePrinting.py (1815 of 1924) PASS: lldb-api :: types/TestIntegerTypeExpr.py (1816 of 1924) PASS: lldb-shell :: SymbolFile/DWARF/x86/debug_rnglists-dwo.s (1817 of 1924) PASS: lldb-api :: functionalities/data-formatter/ptr_ref_typedef/TestPtrRef2Typedef.py (1818 of 1924) PASS: lldb-unit :: Utility/./UtilityTests/5/30 (1819 of 1924) PASS: lldb-api :: lang/cpp/rvalue-references/TestRvalueReferences.py (1820 of 1924) PASS: lldb-api :: lang/cpp/const_static_integral_member_int128/TestConstStaticIntegralMemberInt128.py (1821 of 1924) PASS: lldb-api :: functionalities/breakpoint/breakpoint_command/TestBreakpointCommandsFromPython.py (1822 of 1924) PASS: lldb-api :: lang/cpp/keywords_enabled/TestCppKeywordsEnabled.py (1823 of 1924) PASS: lldb-shell :: ObjectFile/ELF/PT_LOAD-overlap-section.yaml (1824 of 1924) PASS: lldb-api :: lang/objc/single-entry-dictionary/TestObjCSingleEntryDictionary.py (1825 of 1924) PASS: lldb-api :: functionalities/step-vrs-interrupt/TestStepVrsInterruptTimeout.py (1826 of 1924) PASS: lldb-unit :: SymbolFile/DWARF/./SymbolFileDWARFTests/24/29 (1827 of 1924) PASS: lldb-api :: commands/quit/TestQuit.py (1828 of 1924) PASS: lldb-shell :: Register/Core/x86-64-freebsd-fp.test (1829 of 1924) PASS: lldb-api :: lang/objc/foundation/TestRuntimeTypes.py (1830 of 1924) PASS: lldb-api :: python_api/sbenvironment/TestSBEnvironment.py (1831 of 1924) PASS: lldb-unit :: Core/./LLDBCoreTests/8/23 (1832 of 1924) UNSUPPORTED: lldb-api :: commands/trace/TestTraceDumpInfo.py (1833 of 1924) PASS: lldb-api :: functionalities/breakpoint/hardware_breakpoints/require_hw_breakpoints/TestRequireHWBreakpoints.py (1834 of 1924) PASS: lldb-unit :: tools/lldb-server/tests/./LLDBServerTests/1/2 (1835 of 1924) PASS: lldb-api :: commands/expression/import-std-module/missing-module-sources/TestStdModuleSourcesMissing.py (1836 of 1924) PASS: lldb-api :: lang/cpp/struct_with_keyword_name/TestStructWithKeywordName.py (1837 of 1924) PASS: lldb-unit :: Platform/./LLDBPlatformTests/3/16 (1838 of 1924) UNSUPPORTED: lldb-api :: commands/register/register/aarch64_sve_registers/rw_access_static_config/TestSVERegisters.py (1839 of 1924) UNSUPPORTED: lldb-shell :: SymbolFile/DWARF/x86/dir-separator-windows.s (1840 of 1924) PASS: lldb-unit :: Utility/./UtilityTests/27/30 (1841 of 1924) PASS: lldb-unit :: ObjectFile/ELF/./ObjectFileELFTests/0/4 (1842 of 1924) PASS: lldb-unit :: Editline/./EditlineTests/1/2 (1843 of 1924) PASS: lldb-api :: python_api/lldbutil/iter/TestRegistersIterator.py (1844 of 1924) PASS: lldb-api :: lang/cpp/bitfields/TestCppBitfields.py (1845 of 1924) UNSUPPORTED: lldb-api :: commands/trace/TestTraceLoad.py (1846 of 1924) UNSUPPORTED: lldb-api :: functionalities/thread/concurrent_events/TestConcurrentWatchBreakDelay.py (1847 of 1924) PASS: lldb-api :: commands/expression/import-std-module/shared_ptr-dbg-info-content/TestSharedPtrDbgInfoContentFromStdModule.py (1848 of 1924) UNSUPPORTED: lldb-shell :: SymbolFile/NativePDB/function-types-builtins.cpp (1849 of 1924) PASS: lldb-api :: tools/lldb-vscode/module/TestVSCode_module.py (1850 of 1924) PASS: lldb-unit :: Process/gdb-remote/./ProcessGdbRemoteTests/8/19 (1851 of 1924) PASS: lldb-shell :: Process/UnsupportedLanguage.test (1852 of 1924) PASS: lldb-api :: functionalities/data-formatter/data-formatter-caching/TestDataFormatterCaching.py (1853 of 1924) PASS: lldb-api :: tools/lldb-vscode/breakpoint/TestVSCode_setBreakpoints.py (1854 of 1924) PASS: lldb-shell :: ObjectFile/PECOFF/section-types.yaml (1855 of 1924) PASS: lldb-api :: functionalities/return-value/TestReturnValue.py (1856 of 1924) PASS: lldb-shell :: BuildScript/toolchain-clang.test (1857 of 1924) UNSUPPORTED: lldb-api :: commands/watchpoints/watchpoint_commands/condition/TestWatchpointConditionCmd.py (1858 of 1924) PASS: lldb-api :: lang/c/bitfields/TestBitfields.py (1859 of 1924) PASS: lldb-shell :: SymbolFile/Breakpad/symtab-macho.test (1860 of 1924) PASS: lldb-unit :: UnwindAssembly/x86/./UnwindAssemblyx86Tests/21/27 (1861 of 1924) PASS: lldb-shell :: Register/x86-64-gp-read.test (1862 of 1924) PASS: lldb-api :: functionalities/data-formatter/language_category_updates/TestDataFormatterLanguageCategoryUpdates.py (1863 of 1924) UNSUPPORTED: lldb-api :: functionalities/thread/concurrent_events/TestConcurrentManyWatchpoints.py (1864 of 1924) PASS: lldb-api :: lang/objc/modules/TestObjCModules.py (1865 of 1924) PASS: lldb-api :: commands/process/attach-resume/TestAttachResume.py (1866 of 1924) PASS: lldb-unit :: Process/minidump/./LLDBMinidumpTests/2/17 (1867 of 1924) PASS: lldb-api :: functionalities/multidebugger_commands/TestMultipleDebuggersCommands.py (1868 of 1924) PASS: lldb-api :: commands/expression/class_template_specialization_empty_pack/TestClassTemplateSpecializationParametersHandling.py (1869 of 1924) PASS: lldb-unit :: Target/./TargetTests/11/19 (1870 of 1924) PASS: lldb-api :: commands/expression/expr-in-syscall/TestExpressionInSyscall.py (1871 of 1924) PASS: lldb-api :: commands/apropos/with-process/TestAproposWithProcess.py (1872 of 1924) PASS: lldb-api :: functionalities/breakpoint/breakpoint_on_lambda_capture/TestBreakOnLambdaCapture.py (1873 of 1924) UNSUPPORTED: lldb-shell :: ScriptInterpreter/Lua/command_script_import.test (1874 of 1924) PASS: lldb-unit :: UnwindAssembly/x86/./UnwindAssemblyx86Tests/12/27 (1875 of 1924) PASS: lldb-unit :: Process/minidump/./LLDBMinidumpTests/0/17 (1876 of 1924) PASS: lldb-shell :: Register/x86-64-ymm-read.test (1877 of 1924) PASS: lldb-unit :: Host/./HostTests/15/19 (1878 of 1924) PASS: lldb-shell :: ObjectFile/ELF/aarch64-relocations.yaml (1879 of 1924) PASS: lldb-api :: python_api/hello_world/TestHelloWorld.py (1880 of 1924) UNSUPPORTED: lldb-api :: commands/expression/import_builtin_fileid/TestImportBuiltinFileID.py (1881 of 1924) PASS: lldb-api :: functionalities/module_cache/bsd/TestModuleCacheBSD.py (1882 of 1924) PASS: lldb-api :: python_api/value/linked_list/TestValueAPILinkedList.py (1883 of 1924) PASS: lldb-api :: lang/objc/bitfield_ivars/TestBitfieldIvars.py (1884 of 1924) UNSUPPORTED: lldb-api :: functionalities/thread/state/TestThreadStates.py (1885 of 1924) PASS: lldb-shell :: Reproducer/TestWorkingDir.test (1886 of 1924) PASS: lldb-unit :: Process/gdb-remote/./ProcessGdbRemoteTests/0/19 (1887 of 1924) PASS: lldb-shell :: SymbolFile/DWARF/DW_AT_range-DW_FORM_sec_offset.s (1888 of 1924) PASS: lldb-api :: lang/cpp/std-function-step-into-callable/TestStdFunctionStepIntoCallable.py (1889 of 1924) PASS: lldb-shell :: ScriptInterpreter/Python/silent_command_script_import.test (1890 of 1924) UNSUPPORTED: lldb-api :: tools/lldb-server/TestGdbRemoteSingleStep.py (1891 of 1924) PASS: lldb-shell :: ObjectFile/MachO/lc_build_version_notools.yaml (1892 of 1924) UNSUPPORTED: lldb-api :: functionalities/signal/handle-segv/TestHandleSegv.py (1893 of 1924) PASS: lldb-api :: commands/expression/ir-interpreter-phi-nodes/TestIRInterpreterPHINodes.py (1894 of 1924) PASS: lldb-shell :: Driver/TestPositionalArgs.test (1895 of 1924) PASS: lldb-unit :: Utility/./UtilityTests/15/30 (1896 of 1924) UNSUPPORTED: lldb-api :: tools/lldb-server/TestGdbRemote_qThreadStopInfo.py (1897 of 1924) PASS: lldb-api :: functionalities/data-formatter/data-formatter-stl/libcxx/function/TestLibCxxFunction.py (1898 of 1924) PASS: lldb-api :: commands/log/invalid-args/TestInvalidArgsLog.py (1899 of 1924) UNSUPPORTED: lldb-shell :: SymbolFile/PDB/variables.test (1900 of 1924) UNSUPPORTED: lldb-api :: tools/lldb-vscode/completions/TestVSCode_completions.py (1901 of 1924) PASS: lldb-api :: functionalities/thread/concurrent_events/TestConcurrentTwoBreakpointsOneDelaySignal.py (1902 of 1924) PASS: lldb-api :: python_api/frame/get-variables/TestGetVariables.py (1903 of 1924) UNSUPPORTED: lldb-shell :: SymbolFile/NativePDB/missing-type.s (1904 of 1924) UNSUPPORTED: lldb-shell :: SymbolFile/DWARF/x86/dir-separator-no-comp-dir.s (1905 of 1924) PASS: lldb-api :: commands/frame/diagnose/dereference-function-return/TestDiagnoseDereferenceFunctionReturn.py (1906 of 1924) PASS: lldb-api :: lang/cpp/template/TestTemplateArgs.py (1907 of 1924) UNSUPPORTED: lldb-api :: commands/trace/TestTraceDumpInstructions.py (1908 of 1924) PASS: lldb-api :: functionalities/data-formatter/data-formatter-stl/libcxx/tuple/TestDataFormatterLibcxxTuple.py (1909 of 1924) PASS: lldb-shell :: Register/x86-64-ymm-write.test (1910 of 1924) PASS: lldb-shell :: Subprocess/vfork-follow-parent.test (1911 of 1924) UNSUPPORTED: lldb-api :: functionalities/asan/TestMemoryHistory.py (1912 of 1924) PASS: lldb-api :: functionalities/gdb_remote_client/TestGDBRemoteDiskFileCompletion.py (1913 of 1924) UNSUPPORTED: lldb-api :: functionalities/thread/concurrent_events/TestConcurrentWatchpointWithDelayWatchpointThreads.py (1914 of 1924) PASS: lldb-api :: lang/cpp/class-loading-via-member-typedef/TestClassLoadingViaMemberTypedef.py (1915 of 1924) PASS: lldb-api :: functionalities/breakpoint/auto_continue/TestBreakpointAutoContinue.py (1916 of 1924) PASS: lldb-api :: lang/cpp/unsigned_types/TestUnsignedTypes.py (1917 of 1924) PASS: lldb-api :: functionalities/tail_call_frames/disambiguate_tail_call_seq/TestDisambiguateTailCallSeq.py (1918 of 1924) PASS: lldb-api :: functionalities/tail_call_frames/disambiguate_paths_to_common_sink/TestDisambiguatePathsToCommonSink.py (1919 of 1924) PASS: lldb-api :: lang/cpp/scope/TestCppScope.py (1920 of 1924) PASS: lldb-api :: commands/expression/import-std-module/vector-of-vectors/TestVectorOfVectorsFromStdModule.py (1921 of 1924) PASS: lldb-api :: commands/expression/import-std-module/vector-bool/TestVectorBoolFromStdModule.py (1922 of 1924) PASS: lldb-api :: lang/c/anonymous/TestAnonymous.py (1923 of 1924) PASS: lldb-api :: commands/expression/import-std-module/unique_ptr-dbg-info-content/TestUniquePtrDbgInfoContent.py (1924 of 1924) Slowest Tests: -------------------------------------------------------------------------- 95.49s: lldb-api :: api/multithreaded/TestMultithreaded.py 72.16s: lldb-api :: commands/process/attach/TestProcessAttach.py 62.77s: lldb-api :: lang/objc/foundation/TestFoundationDisassembly.py 49.07s: lldb-api :: lang/objc/hidden-ivars/TestHiddenIvars.py 44.81s: lldb-api :: functionalities/completion/TestCompletion.py 44.37s: lldb-api :: lang/objc/exceptions/TestObjCExceptions.py 40.98s: lldb-api :: python_api/target/TestTargetAPI.py 40.94s: lldb-api :: functionalities/load_unload/TestLoadUnload.py 38.43s: lldb-api :: types/TestLongTypesExpr.py 33.31s: lldb-api :: lang/cpp/namespace/TestNamespaceLookup.py 32.73s: lldb-api :: lang/objc/objc-new-syntax/TestObjCNewSyntaxLiteral.py 32.27s: lldb-api :: functionalities/gdb_remote_client/TestPlatformMacOSX.py 32.26s: lldb-api :: lang/objc/real-definition/TestRealDefinition.py 32.11s: lldb-api :: lang/objc/foundation/TestObjCMethods.py 28.56s: lldb-api :: types/TestLongTypes.py 27.81s: lldb-api :: tools/lldb-vscode/launch/TestVSCode_launch.py 27.34s: lldb-api :: commands/settings/TestSettings.py 25.21s: lldb-api :: types/TestIntegerTypeExpr.py 24.62s: lldb-api :: tools/lldb-vscode/evaluate/TestVSCode_evaluate.py 24.54s: lldb-api :: functionalities/limit-debug-info/TestLimitDebugInfo.py

Hide Details

Tests Times: -------------------------------------------------------------------------- [ Range ] :: [ Percentage ] :: [ Count ] -------------------------------------------------------------------------- [95.0s,100.0s) :: [ ] :: [ 1/1836] [90.0s,95.0s) :: [ ] :: [ 0/1836] [85.0s,90.0s) :: [ ] :: [ 0/1836] [80.0s,85.0s) :: [ ] :: [ 0/1836] [75.0s,80.0s) :: [ ] :: [ 1/1836] [70.0s,75.0s) :: [ ] :: [ 0/1836] [65.0s,70.0s) :: [ ] :: [ 1/1836] [60.0s,65.0s) :: [ ] :: [ 0/1836] [55.0s,60.0s) :: [ ] :: [ 0/1836] [50.0s,55.0s) :: [ ] :: [ 1/1836] [45.0s,50.0s) :: [ ] :: [ 2/1836] [40.0s,45.0s) :: [ ] :: [ 3/1836] [35.0s,40.0s) :: [ ] :: [ 0/1836] [30.0s,35.0s) :: [ ] :: [ 5/1836] [25.0s,30.0s) :: [ ] :: [ 8/1836] [20.0s,25.0s) :: [ ] :: [ 16/1836] [15.0s,20.0s) :: [ ] :: [ 43/1836] [10.0s,15.0s) :: [** ] :: [ 120/1836] [ 5.0s,10.0s) :: [******* ] :: [ 336/1836] [ 0.0s, 5.0s) :: [**************************** ] :: [1299/1836] -------------------------------------------------------------------------- ******************** Failed Tests (1): lldb-api :: lang/cpp/const_static_integral_member/TestConstStaticIntegralMember.py

Hide Details

Hide Details

Testing Time: 449.96s Unsupported : 364 Passed : 2239 Expectedly Failed: 10 Failed : 1 FAILED: tools/lldb/test/CMakeFiles/check-lldb /Users/buildslave/jenkins/workspace/lldb-cmake-matrix/lldb-build/tools/lldb/test/CMakeFiles/check-lldb cd /Users/buildslave/jenkins/workspace/lldb-cmake-matrix/lldb-build/tools/lldb/test && /Applications/Xcode.app/Contents/Developer/Library/Frameworks/Python3.framework/Versions/3.8/bin/python3.8 /Users/buildslave/jenkins/workspace/lldb-cmake-matrix/lldb-build/./bin/llvm-lit -v --time-tests --shuffle --xunit-xml-output=/Users/buildslave/jenkins/workspace/lldb-cmake-matrix/test/results.xml -v /Users/buildslave/jenkins/workspace/lldb-cmake-matrix/lldb-build/tools/lldb/test ninja: build stopped: subcommand failed. Command failed: Command '['/usr/bin/env', 'TERM=vt100', '/usr/local/bin/ninja', '-v', 'check-lldb']' returned non-zero exit status 1. Command: ['/usr/bin/env', 'TERM=vt100', '/usr/local/bin/ninja', '-v', 'check-lldb'] + set -e [Pipeline] } [Pipeline] // timeout [Pipeline] junit Recording test results [Checks API] No suitable checks publisher found. [Pipeline] } [Pipeline] // stage [Pipeline] } [Pipeline] // withEnv [Pipeline] } [Pipeline] // node [Pipeline] End of Pipeline Finished: UNSTABLE