Console Output

Skipping 163,711 KB.. Full Log
UNSUPPORTED: lldb-api :: linux/aarch64/tagged_memory_access/TestAArch64LinuxTaggedMemoryAccess.py (237 of 1524)
UNSUPPORTED: lldb-shell :: SymbolFile/DWARF/x86/find-variable-file.cpp (238 of 1524)
PASS: lldb-api :: functionalities/data-formatter/data-formatter-ptr-to-array/TestPtrToArrayFormatting.py (239 of 1524)
PASS: lldb-api :: lang/c/register_variables/TestRegisterVariables.py (240 of 1524)
PASS: lldb-api :: functionalities/breakpoint/objc/TestObjCBreakpoints.py (241 of 1524)
PASS: lldb-shell :: Process/UnsupportedLanguage.test (242 of 1524)
PASS: lldb-api :: functionalities/data-formatter/builtin-formats/TestBuiltinFormats.py (243 of 1524)
UNSUPPORTED: lldb-api :: tools/lldb-server/TestGdbRemoteExitCode.py (244 of 1524)
PASS: lldb-api :: commands/expression/import-std-module/missing-module-sources/TestStdModuleSourcesMissing.py (245 of 1524)
PASS: lldb-shell :: Minidump/fb-dump.test (246 of 1524)
PASS: lldb-shell :: Commands/command-disassemble-aarch64-extensions.s (247 of 1524)
PASS: lldb-shell :: Settings/TestSettingsWrite.test (248 of 1524)
PASS: lldb-shell :: ObjectFile/ELF/netbsd-core-amd64.test (249 of 1524)
PASS: lldb-api :: types/TestFloatTypesExpr.py (250 of 1524)
PASS: lldb-shell :: Register/x86-64-write.test (251 of 1524)
PASS: lldb-api :: commands/expression/completion-in-lambda-and-unnamed-class/TestCompletionInLambdaAndUnnamedClass.py (252 of 1524)
PASS: lldb-api :: types/TestDoubleTypesExpr.py (253 of 1524)
PASS: lldb-shell :: Commands/CommandScriptImmediateOutput/CommandScriptImmediateOutputConsole.test (254 of 1524)
PASS: lldb-shell :: SymbolFile/DWARF/x86/debug_line-tombstone.s (255 of 1524)
PASS: lldb-api :: functionalities/data-formatter/data-formatter-categories/TestDataFormatterCategories.py (256 of 1524)
PASS: lldb-shell :: Settings/TestFrameFormatColor.test (257 of 1524)
PASS: lldb-shell :: ObjectFile/PECOFF/section-types.yaml (258 of 1524)
PASS: lldb-api :: macosx/version_zero/TestGetVersionZeroVersion.py (259 of 1524)
UNSUPPORTED: lldb-api :: functionalities/data-formatter/data-formatter-stl/libstdcpp/smart_ptr/TestDataFormatterStdSmartPtr.py (260 of 1524)
PASS: lldb-api :: functionalities/data-formatter/type_summary_list_script/TestTypeSummaryListScript.py (261 of 1524)
PASS: lldb-api :: lang/objc/ivar-IMP/TestObjCiVarIMP.py (262 of 1524)
UNSUPPORTED: lldb-shell :: SymbolFile/NativePDB/subfield_register_simple_type.s (263 of 1524)
PASS: lldb-shell :: Register/Core/x86-32-linux-fp.test (264 of 1524)
PASS: lldb-api :: lang/objc/modules-compile-error/TestModulesCompileError.py (265 of 1524)
PASS: lldb-api :: functionalities/inferior-assert/TestInferiorAssert.py (266 of 1524)
PASS: lldb-shell :: ObjectFile/PECOFF/basic-info-arm64.yaml (267 of 1524)
PASS: lldb-api :: python_api/target/TestTargetAPI.py (268 of 1524)
UNSUPPORTED: lldb-api :: tools/lldb-server/vCont-threads/TestPartialResume.py (269 of 1524)
PASS: lldb-api :: functionalities/breakpoint/consecutive_breakpoints/TestConsecutiveBreakpoints.py (270 of 1524)
UNSUPPORTED: lldb-api :: functionalities/unwind/aarch64_unwind_pac/TestAArch64UnwindPAC.py (271 of 1524)
PASS: lldb-shell :: ObjectFile/MachO/lc_build_version.yaml (272 of 1524)
PASS: lldb-shell :: SymbolFile/DWARF/x86/split-dwarf-inlining.cpp (273 of 1524)
PASS: lldb-api :: functionalities/gdb_remote_client/TestGDBRemotePlatformFile.py (274 of 1524)
PASS: lldb-api :: commands/quit/TestQuit.py (275 of 1524)
PASS: lldb-api :: commands/expression/cast_int_to_anonymous_enum/TestCastIntToAnonymousEnum.py (276 of 1524)
PASS: lldb-api :: lang/cpp/forward-declared-template-specialization/TestCppForwardDeclaredTemplateSpecialization.py (277 of 1524)
PASS: lldb-api :: lang/cpp/auto/TestCPPAuto.py (278 of 1524)
PASS: lldb-api :: functionalities/inferior-crashing/TestInferiorCrashingStep.py (279 of 1524)
PASS: lldb-api :: commands/expression/fixits/TestFixIts.py (280 of 1524)
PASS: lldb-api :: lang/cpp/incomplete-types/TestCppIncompleteTypes.py (281 of 1524)
PASS: lldb-shell :: Symtab/symtab-regex-mangled.test (282 of 1524)
PASS: lldb-api :: functionalities/thread/concurrent_events/TestConcurrentBreakpointDelayBreakpointOneSignal.py (283 of 1524)
PASS: lldb-api :: python_api/value/change_values/TestChangeValueAPI.py (284 of 1524)
PASS: lldb-api :: lang/cpp/template-arguments/TestCppTemplateArguments.py (285 of 1524)
PASS: lldb-api :: sanity/TestModuleCacheSanity.py (286 of 1524)
PASS: lldb-api :: symbol_ondemand/breakpoint_source_regex/TestSourceTextRegexBreakpoint.py (287 of 1524)
UNSUPPORTED: lldb-api :: functionalities/ubsan/basic/TestUbsanBasic.py (288 of 1524)
PASS: lldb-api :: commands/expression/import-std-module/weak_ptr-dbg-info-content/TestDbgInfoContentWeakPtrFromStdModule.py (289 of 1524)
PASS: lldb-shell :: ObjectFile/ELF/PT_LOAD-overlap-PT_INTERP.yaml (290 of 1524)
PASS: lldb-api :: functionalities/thread/concurrent_events/TestConcurrentDelayedCrashWithBreakpointSignal.py (291 of 1524)
PASS: lldb-api :: functionalities/step-avoids-no-debug/TestStepNoDebug.py (292 of 1524)
PASS: lldb-shell :: Register/x86-multithread-write.test (293 of 1524)
PASS: lldb-api :: lang/cpp/break-on-initializers/TestBreakOnCPP11Initializers.py (294 of 1524)
PASS: lldb-api :: commands/expression/test/TestExprs2.py (295 of 1524)
PASS: lldb-api :: functionalities/breakpoint/breakpoint_locations/TestBreakpointLocations.py (296 of 1524)
PASS: lldb-api :: functionalities/data-formatter/user-format-vs-summary/TestUserFormatVsSummary.py (297 of 1524)
PASS: lldb-api :: lang/cpp/non-type-template-param/TestCppNonTypeTemplateParam.py (298 of 1524)
PASS: lldb-api :: functionalities/gdb_remote_client/TestNoLocalFile.py (299 of 1524)
PASS: lldb-api :: lang/objc/objc-property/TestObjCProperty.py (300 of 1524)
PASS: lldb-api :: functionalities/plugins/python_os_plugin/stepping_plugin_threads/TestOSPluginStepping.py (301 of 1524)
PASS: lldb-shell :: lldb-server/TestErrorMessages.test (302 of 1524)
UNSUPPORTED: lldb-api :: commands/expression/import-std-module/pair/TestPairFromStdModule.py (303 of 1524)
PASS: lldb-api :: functionalities/tail_call_frames/ambiguous_tail_call_seq1/TestAmbiguousTailCallSeq1.py (304 of 1524)
PASS: lldb-api :: lang/objcxx/conflicting-names-class-update-utility-expr/TestObjCConflictingNamesForClassUpdateExpr.py (305 of 1524)
PASS: lldb-api :: commands/thread/select/TestThreadSelect.py (306 of 1524)
PASS: lldb-api :: functionalities/scripted_process/TestScriptedProcess.py (307 of 1524)
PASS: lldb-api :: lang/objc/objc-struct-return/TestObjCStructReturn.py (308 of 1524)
UNSUPPORTED: lldb-api :: functionalities/data-formatter/data-formatter-stl/libstdcpp/vector/TestDataFormatterStdVector.py (309 of 1524)
PASS: lldb-api :: macosx/add-dsym/TestAddDsymMidExecutionCommand.py (310 of 1524)
UNSUPPORTED: lldb-shell :: Subprocess/clone-follow-child.test (311 of 1524)
PASS: lldb-api :: macosx/indirect_symbol/TestIndirectSymbols.py (312 of 1524)
PASS: lldb-api :: lang/cpp/virtual-functions/TestCppVirtualFunctions.py (313 of 1524)
PASS: lldb-api :: lang/cpp/function-local-class/TestCppFunctionLocalClass.py (314 of 1524)
PASS: lldb-api :: functionalities/gdb_remote_client/TestFork.py (315 of 1524)
PASS: lldb-api :: lang/cpp/this/TestCPPThis.py (316 of 1524)
PASS: lldb-api :: commands/expression/entry-bp/TestExprEntryBP.py (317 of 1524)
PASS: lldb-api :: functionalities/plugins/python_os_plugin/TestPythonOSPlugin.py (318 of 1524)
XFAIL: lldb-shell :: Register/x86-mm-xmm-read.test (319 of 1524)
PASS: lldb-shell :: SymbolFile/DWARF/x86/debug_rnglists.s (320 of 1524)
PASS: lldb-shell :: Minidump/breakpad-symbols.test (321 of 1524)
PASS: lldb-api :: lang/c/conflicting-symbol/TestConflictingSymbol.py (322 of 1524)
PASS: lldb-shell :: SymbolFile/DWARF/x86/debug_loc_and_loclists.s (323 of 1524)
UNSUPPORTED: lldb-shell :: SymbolFile/DWARF/x86/dwp-separate-debug-file.cpp (324 of 1524)
PASS: lldb-api :: functionalities/dead-strip/TestDeadStrip.py (325 of 1524)
PASS: lldb-api :: functionalities/data-formatter/nsdictionarysynth/TestNSDictionarySynthetic.py (326 of 1524)
PASS: lldb-api :: types/TestFloatTypes.py (327 of 1524)
PASS: lldb-api :: lang/cpp/signed_types/TestSignedTypes.py (328 of 1524)
UNSUPPORTED: lldb-shell :: SymbolFile/DWARF/x86/DW_TAG_variable-DW_AT_decl_file-DW_AT_abstract_origin-crosscu1.s (329 of 1524)
PASS: lldb-shell :: Settings/TestFrameFormatNoColor.test (330 of 1524)
PASS: lldb-shell :: ScriptInterpreter/Python/command_import.test (331 of 1524)
PASS: lldb-api :: symbol_ondemand/shared_library/TestSharedLibOnDemand.py (332 of 1524)
UNSUPPORTED: lldb-api :: tools/lldb-server/TestAppleSimulatorOSType.py (333 of 1524)
PASS: lldb-api :: lang/c/struct_types/TestStructTypes.py (334 of 1524)
UNSUPPORTED: lldb-shell :: SymbolFile/DWARF/x86/find-inline-method.s (335 of 1524)
UNSUPPORTED: lldb-api :: commands/watchpoints/watchpoint_disable/TestWatchpointDisable.py (336 of 1524)
PASS: lldb-api :: functionalities/multiword-commands/TestMultiWordCommands.py (337 of 1524)
UNSUPPORTED: lldb-api :: functionalities/thread/concurrent_events/TestConcurrentTwoWatchpointsOneBreakpoint.py (338 of 1524)
UNSUPPORTED: lldb-shell :: ScriptInterpreter/Lua/persistent_state.test (339 of 1524)
PASS: lldb-api :: functionalities/data-formatter/nssetsynth/TestNSSetSynthetic.py (340 of 1524)
PASS: lldb-shell :: ObjectFile/ELF/base-address.yaml (341 of 1524)
PASS: lldb-shell :: ObjectFile/ELF/PT_LOAD-empty.yaml (342 of 1524)
UNSUPPORTED: lldb-shell :: Unwind/eh-frame-small-fde.test (343 of 1524)
PASS: lldb-shell :: Register/Core/x86-64-freebsd-gp.test (344 of 1524)
PASS: lldb-api :: lang/cpp/char8_t/TestCxxChar8_t.py (345 of 1524)
PASS: lldb-api :: functionalities/breakpoint/cpp_exception/TestCPPExceptionBreakpoint.py (346 of 1524)
PASS: lldb-shell :: SymbolFile/DWARF/x86/DW_TAG_variable-invalid_location.s (347 of 1524)
PASS: lldb-api :: lang/objcxx/objc-builtin-types/TestObjCBuiltinTypes.py (348 of 1524)
UNSUPPORTED: lldb-api :: functionalities/thread/concurrent_events/TestConcurrentWatchpointDelayWatchpointOneBreakpoint.py (349 of 1524)
PASS: lldb-api :: functionalities/gdb_remote_client/TestAArch64XMLRegOffsets.py (350 of 1524)
PASS: lldb-api :: lang/cpp/enum_types/TestCPP11EnumTypes.py (351 of 1524)
PASS: lldb-api :: lang/objc/objc_direct-methods/TestObjCDirectMethods.py (352 of 1524)
PASS: lldb-shell :: ObjectFile/wasm/basic.yaml (353 of 1524)
PASS: lldb-api :: lang/c/builtin-types/TestCBuiltinTypes.py (354 of 1524)
PASS: lldb-api :: commands/gui/invalid-args/TestInvalidArgsGui.py (355 of 1524)
PASS: lldb-api :: lang/cpp/namespace/TestNamespaceLookup.py (356 of 1524)
UNSUPPORTED: lldb-api :: functionalities/asan/TestReportData.py (357 of 1524)
PASS: lldb-api :: commands/thread/backtrace/TestThreadBacktraceRepeat.py (358 of 1524)
PASS: lldb-shell :: Driver/TestCommands.test (359 of 1524)
PASS: lldb-shell :: SymbolFile/Breakpad/symtab.test (360 of 1524)
PASS: lldb-api :: api/check_public_api_headers/TestPublicAPIHeaders.py (361 of 1524)
UNSUPPORTED: lldb-shell :: SymbolFile/PDB/vbases.test (362 of 1524)
PASS: lldb-api :: macosx/skinny-corefile/TestSkinnyCorefile.py (363 of 1524)
PASS: lldb-api :: functionalities/data-formatter/data-formatter-stl/generic/unordered/TestDataFormatterGenericUnordered.py (364 of 1524)
PASS: lldb-shell :: SymbolFile/DWARF/x86/debug-types-missing-signature.test (365 of 1524)
PASS: lldb-shell :: SymbolFile/DWARF/x86/find-qualified-variable.cpp (366 of 1524)
PASS: lldb-api :: lang/objc/print-obj/TestPrintObj.py (367 of 1524)
PASS: lldb-api :: functionalities/gdb_remote_client/TestThreadSelectionBug.py (368 of 1524)
PASS: lldb-api :: lang/cpp/static_members/TestCPPStaticMembers.py (369 of 1524)
UNSUPPORTED: lldb-api :: functionalities/ptrauth_diagnostics/brkC47x_code/TestPtrauthBRKc47xDiagnostic.py (370 of 1524)
PASS: lldb-shell :: Breakpoint/jit-loader_rtdyld_elf.test (371 of 1524)
PASS: lldb-api :: functionalities/data-formatter/setvaluefromcstring/TestSetValueFromCString.py (372 of 1524)
PASS: lldb-shell :: Minidump/Windows/arm-fp-unwind.test (373 of 1524)
PASS: lldb-api :: lang/objc/tagged-pointer/TestTaggedPointerCmd.py (374 of 1524)
PASS: lldb-api :: python_api/name_lookup/TestNameLookup.py (375 of 1524)
PASS: lldb-api :: lang/objc/objc-class-method/TestObjCClassMethod.py (376 of 1524)
PASS: lldb-api :: lang/objc/self/TestObjCSelf.py (377 of 1524)
PASS: lldb-api :: functionalities/breakpoint/breakpoint_hit_count/TestBreakpointHitCount.py (378 of 1524)
PASS: lldb-shell :: SymbolFile/DWARF/x86/DW_AT_decl_file-DW_AT_specification-crosscu.s (379 of 1524)
PASS: lldb-shell :: SymbolFile/DWARF/x86/DW_AT_const_value-bitfields.s (380 of 1524)
PASS: lldb-api :: python_api/sbstructureddata/TestStructuredDataAPI.py (381 of 1524)
PASS: lldb-api :: macosx/save_crashlog/TestSaveCrashlog.py (382 of 1524)
PASS: lldb-api :: iohandler/sigint/TestProcessIOHandlerInterrupt.py (383 of 1524)
PASS: lldb-shell :: SymbolFile/DWARF/x86/dead-code-filtering.yaml (384 of 1524)
PASS: lldb-shell :: SymbolFile/Breakpad/line-table-discontinuous-file-ids.test (385 of 1524)
PASS: lldb-api :: functionalities/postmortem/minidump-new/TestMiniDumpNew.py (386 of 1524)
PASS: lldb-api :: lang/c/vla/TestVLA.py (387 of 1524)
PASS: lldb-shell :: Heap/heap-cstr.test (388 of 1524)
UNSUPPORTED: lldb-shell :: SymbolFile/DWARF/x86/debug-types-address-ranges.s (389 of 1524)
PASS: lldb-api :: commands/expression/import-std-module/forward_decl_from_module/TestForwardDeclFromStdModule.py (390 of 1524)
PASS: lldb-api :: functionalities/mtc/simple/TestMTCSimple.py (391 of 1524)
UNSUPPORTED: lldb-api :: lang/cpp/structured-binding/TestStructuredBinding.py (392 of 1524)
PASS: lldb-api :: tools/lldb-vscode/optimized/TestVSCode_optimized.py (393 of 1524)
PASS: lldb-shell :: ObjectFile/ELF/aarch64-relocations.yaml (394 of 1524)
UNSUPPORTED: lldb-shell :: SymbolFile/DWARF/x86/dir-separator-no-comp-dir.s (395 of 1524)
PASS: lldb-api :: functionalities/memory/tag/TestMemoryTag.py (396 of 1524)
PASS: lldb-shell :: SymbolFile/DWARF/clang-ast-from-dwarf-unamed-and-anon-structs.cpp (397 of 1524)
PASS: lldb-api :: lang/c/const_variables/TestConstVariables.py (398 of 1524)
PASS: lldb-api :: commands/process/launch-with-shellexpand/TestLaunchWithShellExpand.py (399 of 1524)
PASS: lldb-api :: functionalities/stop-on-sharedlibrary-load/TestStopOnSharedlibraryEvents.py (400 of 1524)
PASS: lldb-api :: functionalities/type_get_module/TestTypeGetModule.py (401 of 1524)
UNSUPPORTED: lldb-api :: functionalities/signal/handle-segv/TestHandleSegv.py (402 of 1524)
PASS: lldb-api :: functionalities/limit-debug-info/TestLimitDebugInfo.py (403 of 1524)
PASS: lldb-api :: functionalities/gdb_remote_client/TestTargetXMLArch.py (404 of 1524)
PASS: lldb-api :: functionalities/plugins/command_plugin/TestPluginCommands.py (405 of 1524)
PASS: lldb-api :: lang/cpp/member-and-local-vars-with-same-name/TestMembersAndLocalsWithSameName.py (406 of 1524)
UNSUPPORTED: lldb-api :: lang/cpp/limit-debug-info/TestWithLimitDebugInfo.py (407 of 1524)
UNSUPPORTED: lldb-shell :: ScriptInterpreter/Lua/independent_state.test (408 of 1524)
PASS: lldb-api :: tools/lldb-vscode/variables/TestVSCode_variables.py (409 of 1524)
PASS: lldb-api :: lang/objc/rdar-11355592/TestRdar11355592.py (410 of 1524)
PASS: lldb-api :: macosx/profile_vrs_detach/TestDetachVrsProfile.py (411 of 1524)
PASS: lldb-api :: commands/frame/select/TestFrameSelect.py (412 of 1524)
PASS: lldb-api :: lang/objc/foundation/TestObjCMethodsString.py (413 of 1524)
PASS: lldb-api :: functionalities/gdb_remote_client/TestNoWatchpointSupportInfo.py (414 of 1524)
PASS: lldb-api :: functionalities/breakpoint/breakpoint_on_overload/TestBreakOnOverload.py (415 of 1524)
UNSUPPORTED: lldb-shell :: SymbolFile/PDB/class-layout.test (416 of 1524)
PASS: lldb-api :: lang/cpp/type_lookup/TestCppTypeLookup.py (417 of 1524)
PASS: lldb-shell :: SymbolFile/DWARF/x86/static_scope.s (418 of 1524)
PASS: lldb-api :: commands/command/source/TestCommandSource.py (419 of 1524)
UNSUPPORTED: lldb-api :: tools/lldb-server/commandline/TestStubSetSID.py (420 of 1524)
UNSUPPORTED: lldb-api :: functionalities/ptrauth_diagnostics/BLRAA_error/TestPtrauthBLRAADiagnostic.py (421 of 1524)
PASS: lldb-api :: commands/process/attach/TestProcessAttach.py (422 of 1524)
UNSUPPORTED: lldb-shell :: SymbolFile/DWARF/x86/array-sizes.s (423 of 1524)
UNSUPPORTED: lldb-api :: arm/breakpoint-it/TestBreakpointIt.py (424 of 1524)
PASS: lldb-api :: commands/expression/timeout/TestCallWithTimeout.py (425 of 1524)
PASS: lldb-api :: lang/c/flexible-array-members/TestCFlexibleArrayMembers.py (426 of 1524)
PASS: lldb-api :: functionalities/breakpoint/scripted_bkpt/TestScriptedResolver.py (427 of 1524)
PASS: lldb-api :: functionalities/signal/raise/TestRaise.py (428 of 1524)
UNSUPPORTED: lldb-api :: functionalities/thread/concurrent_events/exit/TestConcurrentThreadExit.py (429 of 1524)
PASS: lldb-shell :: VSCode/TestOptions.test (430 of 1524)
PASS: lldb-api :: functionalities/process_crash_info/TestProcessCrashInfo.py (431 of 1524)
PASS: lldb-api :: sanity/TestReprStrEquality.py (432 of 1524)
PASS: lldb-shell :: ObjectFile/ELF/PT_LOAD.yaml (433 of 1524)
PASS: lldb-api :: functionalities/data-formatter/parray/TestPrintArray.py (434 of 1524)
UNSUPPORTED: lldb-api :: tools/lldb-server/memory-allocation/TestGdbRemoteMemoryAllocation.py (435 of 1524)
PASS: lldb-api :: commands/target/select/TestTargetSelect.py (436 of 1524)
PASS: lldb-shell :: SymbolFile/DWARF/x86/debug_loclists-dwo.s (437 of 1524)
PASS: lldb-api :: python_api/compile_unit/TestCompileUnitAPI.py (438 of 1524)
PASS: lldb-shell :: SymbolFile/DWARF/x86/DW_AT_declaration-with-children.s (439 of 1524)
PASS: lldb-api :: lang/objc/objc-new-syntax/TestObjCNewSyntaxLiteral.py (440 of 1524)
UNSUPPORTED: lldb-shell :: Breakpoint/case-insensitive.test (441 of 1524)
PASS: lldb-api :: lang/cpp/extern_c/TestExternCSymbols.py (442 of 1524)
PASS: lldb-shell :: SymbolFile/add-dsym.test (443 of 1524)
PASS: lldb-api :: lang/objc/foundation/TestObjCMethodsNSError.py (444 of 1524)
PASS: lldb-api :: functionalities/data-formatter/data-formatter-stl/libstdcpp/unique_ptr/invalid/TestDataFormatterInvalidStdUniquePtr.py (445 of 1524)
PASS: lldb-api :: macosx/debugserver-exit-code/TestDebugServerExitCode.py (446 of 1524)
PASS: lldb-api :: functionalities/thread/concurrent_events/TestConcurrentManyBreakpoints.py (447 of 1524)
PASS: lldb-api :: functionalities/archives/TestBSDArchives.py (448 of 1524)
UNSUPPORTED: lldb-shell :: Commands/command-thread-siginfo.test (449 of 1524)
PASS: lldb-api :: lang/cpp/typeof/TestTypeOfDeclTypeExpr.py (450 of 1524)
PASS: lldb-api :: functionalities/fat_archives/TestFatArchives.py (451 of 1524)
PASS: lldb-api :: commands/expression/top-level/TestTopLevelExprs.py (452 of 1524)
PASS: lldb-shell :: BuildScript/compiler-full-path.test (453 of 1524)
PASS: lldb-shell :: SymbolFile/DWARF/x86/dwarf5-atomic.s (454 of 1524)
UNSUPPORTED: lldb-api :: functionalities/thread/thread_specific_break_plus_condition/TestThreadSpecificBpPlusCondition.py (455 of 1524)
PASS: lldb-api :: python_api/exprpath_synthetic/TestExprPathSynthetic.py (456 of 1524)
UNSUPPORTED: lldb-shell :: SymbolFile/NativePDB/bitfields.cpp (457 of 1524)
PASS: lldb-api :: functionalities/load_after_attach/TestLoadAfterAttach.py (458 of 1524)
PASS: lldb-api :: functionalities/data-formatter/ostypeformatting/TestFormattersOsType.py (459 of 1524)
PASS: lldb-api :: commands/log/basic/TestLogHandlers.py (460 of 1524)
PASS: lldb-api :: functionalities/gdb_remote_client/TestPlatformMacOSX.py (461 of 1524)
PASS: lldb-shell :: Expr/TestIRMemoryMap.test (462 of 1524)
UNSUPPORTED: lldb-api :: python_api/watchpoint/watchlocation/TestTargetWatchAddress.py (463 of 1524)
PASS: lldb-api :: macosx/lc-note/kern-ver-str/TestKernVerStrLCNOTE.py (464 of 1524)
UNSUPPORTED: lldb-shell :: SymbolFile/DWARF/find-type-in-function.cpp (465 of 1524)
PASS: lldb-api :: lang/cpp/dereferencing_references/TestCPPDereferencingReferences.py (466 of 1524)
UNSUPPORTED: lldb-api :: benchmarks/libcxxlist/TestBenchmarkLibcxxList.py (467 of 1524)
PASS: lldb-api :: macosx/macCatalyst/TestMacCatalyst.py (468 of 1524)
PASS: lldb-api :: functionalities/data-formatter/data-formatter-caching/TestDataFormatterCaching.py (469 of 1524)
PASS: lldb-shell :: SymbolFile/DWARF/x86/debug-types-dwarf5.s (470 of 1524)
PASS: lldb-api :: functionalities/data-formatter/data-formatter-stl/generic/optional/TestDataFormatterGenericOptional.py (471 of 1524)
PASS: lldb-shell :: SymbolFile/DWARF/x86/apple-index-is-used.cpp (472 of 1524)
PASS: lldb-api :: commands/target/dump-pcm-info/TestDumpPCMInfo.py (473 of 1524)
PASS: lldb-api :: commands/expression/codegen-crash-typedefdecl-not-in_declcontext/TestCodegenCrashTypedefDeclNotInDeclContext.py (474 of 1524)
PASS: lldb-api :: functionalities/tail_call_frames/thread_step_out_or_return/TestSteppingOutWithArtificialFrames.py (475 of 1524)
UNSUPPORTED: lldb-shell :: ObjectFile/PECOFF/dep-modules.yaml (476 of 1524)
UNSUPPORTED: lldb-api :: lang/cpp/function-template-parameter-pack/TestFunctionTemplateParameterPack.py (477 of 1524)
PASS: lldb-api :: python_api/hello_world/TestHelloWorld.py (478 of 1524)
UNSUPPORTED: lldb-shell :: SymbolFile/NativePDB/local-variables-registers.s (479 of 1524)
PASS: lldb-shell :: Commands/command-stop-hook-output.test (480 of 1524)
PASS: lldb-api :: commands/expression/argument_passing_restrictions/TestArgumentPassingRestrictions.py (481 of 1524)
PASS: lldb-api :: python_api/value_var_update/TestValueVarUpdate.py (482 of 1524)
PASS: lldb-api :: commands/process/handle/TestProcessHandle.py (483 of 1524)
UNSUPPORTED: lldb-api :: functionalities/thread/concurrent_events/TestConcurrentBreakpointsDelayedBreakpointOneWatchpoint.py (484 of 1524)
PASS: lldb-api :: tools/lldb-vscode/runInTerminal/TestVSCode_runInTerminal.py (485 of 1524)
PASS: lldb-api :: python_api/frame/get-variables/TestGetVariables.py (486 of 1524)
PASS: lldb-api :: functionalities/signal/handle-abrt/TestHandleAbort.py (487 of 1524)
PASS: lldb-api :: functionalities/thread/concurrent_events/TestConcurrentSignalDelayBreak.py (488 of 1524)
UNSUPPORTED: lldb-api :: commands/watchpoints/watchpoint_commands/TestWatchpointCommands.py (489 of 1524)
PASS: lldb-api :: commands/breakpoint/set/func-regex/TestBreakpointRegexError.py (490 of 1524)
PASS: lldb-api :: macosx/find-app-in-bundle/TestFindAppInBundle.py (491 of 1524)
PASS: lldb-shell :: Register/Core/x86-64-linux-addr.test (492 of 1524)
PASS: lldb-api :: lang/objc/objc-checker/TestObjCCheckers.py (493 of 1524)
PASS: lldb-api :: functionalities/gdb_remote_client/TestMemoryRegionDirtyPages.py (494 of 1524)
PASS: lldb-shell :: SymbolFile/DWARF/x86/debug_aranges-empty-section.s (495 of 1524)
UNSUPPORTED: lldb-api :: functionalities/asan/TestMemoryHistory.py (496 of 1524)
PASS: lldb-api :: lang/objc/objc-new-syntax/TestObjCNewSyntaxArray.py (497 of 1524)
PASS: lldb-api :: commands/expression/import-std-module/forward_list/TestForwardListFromStdModule.py (498 of 1524)
PASS: lldb-shell :: Minidump/memory-region.yaml (499 of 1524)
PASS: lldb-api :: functionalities/data-formatter/data-formatter-stl/libcxx/unordered_map/TestDataFormatterLibccUnorderedMap.py (500 of 1524)
PASS: lldb-api :: commands/expression/persistent_types/TestPersistentTypes.py (501 of 1524)
PASS: lldb-api :: functionalities/data-formatter/data-formatter-stl/generic/bitset/TestDataFormatterGenericBitset.py (502 of 1524)
PASS: lldb-shell :: ObjectFile/ELF/section-types-edgecases.yaml (503 of 1524)
PASS: lldb-api :: sample_test/TestSampleInlineTest.py (504 of 1524)
PASS: lldb-shell :: Settings/TestModuleCacheSanity.test (505 of 1524)
PASS: lldb-shell :: SymbolFile/DWARF/x86/find-method-local-struct.cpp (506 of 1524)
PASS: lldb-api :: functionalities/postmortem/netbsd-core/TestNetBSDCore.py (507 of 1524)
UNSUPPORTED: lldb-shell :: SymbolFile/NativePDB/global-classes.cpp (508 of 1524)
PASS: lldb-api :: functionalities/tail_call_frames/thread_step_out_message/TestArtificialFrameStepOutMessage.py (509 of 1524)
UNSUPPORTED: lldb-api :: tools/lldb-server/thread-name/TestGdbRemoteThreadName.py (510 of 1524)
PASS: lldb-api :: commands/command/script/import/TestImport.py (511 of 1524)
PASS: lldb-api :: functionalities/conditional_break/TestConditionalBreak.py (512 of 1524)
PASS: lldb-shell :: ObjectFile/ELF/compressed-sections.yaml (513 of 1524)
PASS: lldb-api :: functionalities/rerun/TestRerun.py (514 of 1524)
PASS: lldb-api :: iohandler/unicode/TestUnicode.py (515 of 1524)
PASS: lldb-api :: tools/lldb-vscode/breakpoint/TestVSCode_setFunctionBreakpoints.py (516 of 1524)
PASS: lldb-shell :: Quit/TestQuitExitCode-30.test (517 of 1524)
UNSUPPORTED: lldb-api :: functionalities/thread/concurrent_events/TestConcurrentWatchBreak.py (518 of 1524)
PASS: lldb-api :: functionalities/gdb_remote_client/TestJLink6Armv7RegisterDefinition.py (519 of 1524)
UNSUPPORTED: lldb-shell :: ScriptInterpreter/Lua/fail_breakpoint_oneline.test (520 of 1524)
PASS: lldb-api :: lang/cpp/offsetof/TestOffsetofCpp.py (521 of 1524)
PASS: lldb-shell :: Register/Core/x86-64-netbsd-fp.test (522 of 1524)
PASS: lldb-api :: lang/cpp/global_operators/TestCppGlobalOperators.py (523 of 1524)
PASS: lldb-shell :: BuildScript/modes.test (524 of 1524)
UNSUPPORTED: lldb-api :: functionalities/thread/concurrent_events/TestConcurrentTwoBreakpointsOneWatchpoint.py (525 of 1524)
PASS: lldb-api :: lang/c/shared_lib/TestSharedLib.py (526 of 1524)
PASS: lldb-api :: functionalities/completion/TestCompletion.py (527 of 1524)
PASS: lldb-api :: commands/frame/diagnose/complicated-expression/TestComplicatedExpression.py (528 of 1524)
UNSUPPORTED: lldb-api :: functionalities/thread/concurrent_events/TestConcurrentSignalWatchBreak.py (529 of 1524)
PASS: lldb-api :: commands/expression/import-std-module/array/TestArrayFromStdModule.py (530 of 1524)
UNSUPPORTED: lldb-api :: lang/objc/conflicting-class-list-function-from-user/TestObjCClassListFunctionFromUser.py (531 of 1524)
PASS: lldb-api :: functionalities/data-formatter/synthupdate/TestSyntheticFilterRecompute.py (532 of 1524)
PASS: lldb-shell :: ObjectFile/ELF/duplicate-section.yaml (533 of 1524)
UNSUPPORTED: lldb-api :: benchmarks/continue/TestBenchmarkContinue.py (534 of 1524)
PASS: lldb-api :: types/TestIntegerType.py (535 of 1524)
PASS: lldb-api :: functionalities/gdb_remote_client/TestGdbClientModuleLoad.py (536 of 1524)
PASS: lldb-shell :: SymbolFile/DWARF/x86/DW_OP_piece-struct.s (537 of 1524)
PASS: lldb-api :: commands/expression/call-function/TestCallStopAndContinue.py (538 of 1524)
PASS: lldb-api :: commands/target/stop-hooks/TestStopHooks.py (539 of 1524)
PASS: lldb-api :: python_api/sbvalue_persist/TestSBValuePersist.py (540 of 1524)
PASS: lldb-api :: lang/c/local_variables/TestLocalVariables.py (541 of 1524)
PASS: lldb-api :: macosx/thread_suspend/TestInternalThreadSuspension.py (542 of 1524)
PASS: lldb-api :: functionalities/data-formatter/data-formatter-stl/libcxx/variant/TestDataFormatterLibcxxVariant.py (543 of 1524)
PASS: lldb-shell :: SymbolFile/Breakpad/stack-cfi-parsing.test (544 of 1524)
UNSUPPORTED: lldb-api :: functionalities/thread/concurrent_events/TestConcurrentWatchpointWithDelayWatchpointThreads.py (545 of 1524)
PASS: lldb-api :: tools/lldb-vscode/correct-thread/TestVSCode_correct_thread.py (546 of 1524)
PASS: lldb-api :: functionalities/data-formatter/data-formatter-stl/libcxx/string_view/TestDataFormatterLibcxxStringView.py (547 of 1524)
PASS: lldb-api :: lang/objc/objc++/TestObjCXX.py (548 of 1524)
PASS: lldb-api :: lang/cpp/virtual-overload/TestVirtualOverload.py (549 of 1524)
UNSUPPORTED: lldb-api :: commands/trace/TestTraceSchema.py (550 of 1524)
UNSUPPORTED: lldb-api :: functionalities/thread/concurrent_events/TestConcurrentTwoWatchpointsOneDelayBreakpoint.py (551 of 1524)
PASS: lldb-api :: lang/objc/unicode-string/TestUnicodeString.py (552 of 1524)
PASS: lldb-api :: macosx/queues/TestQueues.py (553 of 1524)
UNSUPPORTED: lldb-shell :: SymbolFile/NativePDB/missing-type.s (554 of 1524)
PASS: lldb-shell :: ObjectFile/Breakpad/discontiguous-sections.test (555 of 1524)
UNSUPPORTED: lldb-api :: functionalities/tsan/thread_numbers/TestTsanThreadNumbers.py (556 of 1524)
UNSUPPORTED: lldb-api :: functionalities/ubsan/user-expression/TestUbsanUserExpression.py (557 of 1524)
PASS: lldb-api :: commands/expression/ir-interpreter-phi-nodes/TestIRInterpreterPHINodes.py (558 of 1524)
PASS: lldb-api :: functionalities/tail_call_frames/unambiguous_sequence/TestUnambiguousTailCalls.py (559 of 1524)
PASS: lldb-api :: functionalities/data-formatter/data-formatter-stl/generic/forward_list/TestDataFormatterGenericForwardList.py (560 of 1524)
UNSUPPORTED: lldb-shell :: SymbolFile/NativePDB/ast-types.cpp (561 of 1524)
PASS: lldb-api :: lang/c/inlines/TestRedefinitionsInInlines.py (562 of 1524)
UNSUPPORTED: lldb-api :: commands/platform/connect/TestPlatformConnect.py (563 of 1524)
UNSUPPORTED: lldb-shell :: SymbolFile/DWARF/x86/find-variable-dwo.cpp (564 of 1524)
PASS: lldb-api :: lang/objc/forward-decl/TestForwardDecl.py (565 of 1524)
PASS: lldb-api :: functionalities/tail_call_frames/sbapi_support/TestTailCallFrameSBAPI.py (566 of 1524)
PASS: lldb-api :: functionalities/data-formatter/stringprinter/TestStringPrinter.py (567 of 1524)
UNSUPPORTED: lldb-api :: tools/lldb-server/commandline/TestGdbRemoteConnection.py (568 of 1524)
PASS: lldb-api :: commands/source/info/TestSourceInfo.py (569 of 1524)
PASS: lldb-api :: functionalities/gdb_remote_client/TestGDBRemoteDiskFileCompletion.py (570 of 1524)
PASS: lldb-api :: lang/c/cpp_keyword_identifiers/TestCppKeywordsAsCIdentifiers.py (571 of 1524)
PASS: lldb-shell :: SymbolFile/DWARF/DW_AT_range-DW_FORM_sec_offset.s (572 of 1524)
PASS: lldb-api :: functionalities/thread_plan/TestThreadPlanCommands.py (573 of 1524)
UNSUPPORTED: lldb-api :: lang/cpp/gmodules/TestWithModuleDebugging.py (574 of 1524)
PASS: lldb-api :: api/command-return-object/TestSBCommandReturnObject.py (575 of 1524)
PASS: lldb-api :: functionalities/thread/thread_specific_break/TestThreadSpecificBreakpoint.py (576 of 1524)
PASS: lldb-api :: functionalities/load_lazy/TestLoadUsingLazyBind.py (577 of 1524)
PASS: lldb-shell :: Commands/command-thread-select.test (578 of 1524)
UNSUPPORTED: lldb-api :: functionalities/ptrauth_diagnostics/LDRAA_error/TestPtrauthLDRAADiagnostic.py (579 of 1524)
PASS: lldb-shell :: SymbolFile/DWARF/x86/DW_AT_const_value.s (580 of 1524)
UNSUPPORTED: lldb-api :: lang/c/typedef/Testtypedef.py (581 of 1524)
PASS: lldb-api :: lang/objc/foundation/TestObjCMethodsNSArray.py (582 of 1524)
UNSUPPORTED: lldb-shell :: Expr/TestIRMemoryMapWindows.test (583 of 1524)
PASS: lldb-api :: types/TestShortType.py (584 of 1524)
PASS: lldb-api :: commands/command/invalid-args/TestInvalidArgsCommand.py (585 of 1524)
UNSUPPORTED: lldb-api :: functionalities/tsan/global_location/TestTsanGlobalLocation.py (586 of 1524)
PASS: lldb-api :: lang/objc/single-entry-dictionary/TestObjCSingleEntryDictionary.py (587 of 1524)
PASS: lldb-shell :: Register/Core/x86-32-freebsd-addr.test (588 of 1524)
PASS: lldb-api :: macosx/dyld-trie-symbols/TestDyldTrieSymbols.py (589 of 1524)
UNSUPPORTED: lldb-shell :: Register/x86-gp-write.test (590 of 1524)
PASS: lldb-api :: commands/expression/call-function/TestCallStdStringFunction.py (591 of 1524)
PASS: lldb-api :: commands/expression/import-std-module/sysroot/TestStdModuleSysroot.py (592 of 1524)
PASS: lldb-api :: lang/cpp/class-template-non-type-parameter-pack/TestClassTemplateNonTypeParameterPack.py (593 of 1524)
PASS: lldb-shell :: Driver/TestHelp.test (594 of 1524)
PASS: lldb-api :: commands/gui/breakpoints/TestGuiBreakpoints.py (595 of 1524)
PASS: lldb-shell :: ScriptInterpreter/Python/exit.test (596 of 1524)
PASS: lldb-api :: lang/cpp/const_static_integral_member_int128/TestConstStaticIntegralMemberInt128.py (597 of 1524)
PASS: lldb-api :: api/multithreaded/TestMultithreaded.py (598 of 1524)
PASS: lldb-api :: functionalities/breakpoint/breakpoint_on_lambda_capture/TestBreakOnLambdaCapture.py (599 of 1524)
PASS: lldb-shell :: Commands/command-source.test (600 of 1524)
UNSUPPORTED: lldb-shell :: SymbolFile/NativePDB/ast-methods.cpp (601 of 1524)
PASS: lldb-api :: commands/target/stop-hooks/TestStopHookScripted.py (602 of 1524)
UNSUPPORTED: lldb-api :: commands/watchpoints/watch_tagged_addr/TestWatchTaggedAddress.py (603 of 1524)
PASS: lldb-api :: functionalities/pointer_num_children/TestPointerNumChildren.py (604 of 1524)
PASS: lldb-api :: functionalities/gdb_remote_client/TestNestedRegDefinitions.py (605 of 1524)
PASS: lldb-shell :: SymbolFile/DWARF/x86/DW_OP_piece-smaller-than-struct.s (606 of 1524)
UNSUPPORTED: lldb-shell :: Unwind/eh-frame-augment-noop.test (607 of 1524)
PASS: lldb-api :: functionalities/gdb_remote_client/TestqOffsets.py (608 of 1524)
PASS: lldb-shell :: SymbolFile/Breakpad/line-table-edgecases.test (609 of 1524)
UNSUPPORTED: lldb-shell :: SymbolFile/DWARF/x86/subprogram_ranges.test (610 of 1524)
PASS: lldb-api :: functionalities/data-formatter/data-formatter-objc/nsstring/TestDataFormatterNSString.py (611 of 1524)
PASS: lldb-api :: commands/target/basic/TestTargetCommand.py (612 of 1524)
UNSUPPORTED: lldb-shell :: Register/x86-ymm-read.test (613 of 1524)
PASS: lldb-api :: functionalities/dlopen_other_executable/TestDlopenOtherExecutable.py (614 of 1524)
PASS: lldb-api :: lang/objc/objc-baseclass-sbtype/TestObjCBaseClassSBType.py (615 of 1524)
PASS: lldb-api :: commands/expression/radar_9673664/TestExprHelpExamples.py (616 of 1524)
PASS: lldb-api :: python_api/lldbutil/iter/TestLLDBIterator.py (617 of 1524)
PASS: lldb-api :: functionalities/pre_run_dylibs/TestPreRunDylibs.py (618 of 1524)
PASS: lldb-api :: python_api/process/io/TestProcessIO.py (619 of 1524)
PASS: lldb-api :: functionalities/data-formatter/frameformat_smallstruct/TestFrameFormatSmallStruct.py (620 of 1524)
PASS: lldb-api :: functionalities/data-formatter/var-in-aggregate-misuse/TestVarInAggregateMisuse.py (621 of 1524)
PASS: lldb-api :: types/TestLongTypesExpr.py (622 of 1524)
FAIL: lldb-api :: lang/cpp/const_static_integral_member/TestConstStaticIntegralMember.py (623 of 1524)
******************** TEST 'lldb-api :: lang/cpp/const_static_integral_member/TestConstStaticIntegralMember.py' FAILED ********************
Script:
--
/Applications/Xcode.app/Contents/Developer/Library/Frameworks/Python3.framework/Versions/3.8/bin/python3.8 /Users/buildslave/jenkins/workspace/lldb-cmake-matrix/llvm-project/lldb/test/API/dotest.py -u CXXFLAGS -u CFLAGS --codesign-identity lldb_codesign --arch x86_64 --build-dir /Users/buildslave/jenkins/workspace/lldb-cmake-matrix/lldb-build/lldb-test-build.noindex -t --env TERM=vt100 --skip-category gmodules --skip-category watchpoint --skip-category llgs --skip-category debugserver --arch=x86_64 --env LLVM_LIBS_DIR=/Users/buildslave/jenkins/workspace/lldb-cmake-matrix/lldb-build/./lib --env LLVM_INCLUDE_DIR=/Users/buildslave/jenkins/workspace/lldb-cmake-matrix/lldb-build/include --env LLVM_TOOLS_DIR=/Users/buildslave/jenkins/workspace/lldb-cmake-matrix/lldb-build/./bin --hermetic-libcxx --arch x86_64 --build-dir /Users/buildslave/jenkins/workspace/lldb-cmake-matrix/lldb-build/lldb-test-build.noindex --lldb-module-cache-dir /Users/buildslave/jenkins/workspace/lldb-cmake-matrix/lldb-build/lldb-test-build.noindex/module-cache-lldb/lldb-api --clang-module-cache-dir /Users/buildslave/jenkins/workspace/lldb-cmake-matrix/lldb-build/lldb-test-build.noindex/module-cache-clang/lldb-api --executable /Users/buildslave/jenkins/workspace/lldb-cmake-matrix/lldb-build/./bin/lldb --compiler /Users/buildslave/jenkins/workspace/lldb-cmake-matrix/clang_1300_build/bin/clang --dsymutil /Users/buildslave/jenkins/workspace/lldb-cmake-matrix/lldb-build/./bin/dsymutil --llvm-tools-dir /Users/buildslave/jenkins/workspace/lldb-cmake-matrix/lldb-build/./bin --lldb-libs-dir /Users/buildslave/jenkins/workspace/lldb-cmake-matrix/lldb-build/./lib /Users/buildslave/jenkins/workspace/lldb-cmake-matrix/llvm-project/lldb/test/API/lang/cpp/const_static_integral_member -p TestConstStaticIntegralMember.py
--
Exit Code: 1

Hide Details

Command Output (stdout): -- lldb version 16.0.99git (http://labmaster3.local/git/llvm-project.git revision b3f1a6bf1080fb67cb1760a924a56d38d51211aa) clang revision b3f1a6bf1080fb67cb1760a924a56d38d51211aa llvm revision b3f1a6bf1080fb67cb1760a924a56d38d51211aa Skipping the following test categories: ['gmodules', 'watchpoint', 'llgs', 'debugserver', 'libstdcxx', 'dwo', 'llgs', 'fork']

Hide Details

-- Command Output (stderr): -- Change dir to: /Users/buildslave/jenkins/workspace/lldb-cmake-matrix/llvm-project/lldb/test/API/lang/cpp/const_static_integral_member runCmd: settings clear -all output:

Hide Details

runCmd: settings set symbols.enable-external-lookup false output:

Hide Details

runCmd: settings set target.inherit-tcc true output:

Hide Details

runCmd: settings set target.detach-on-error false output:

Hide Details

runCmd: settings set target.auto-apply-fixits false output:

Hide Details

runCmd: settings set plugin.process.gdb-remote.packet-timeout 60 output:

Hide Details

runCmd: settings set symbols.clang-modules-cache-path "/Users/buildslave/jenkins/workspace/lldb-cmake-matrix/lldb-build/lldb-test-build.noindex/module-cache-lldb/lldb-api" output:

Hide Details

runCmd: settings set use-color false output:

Hide Details

runCmd: setting set target.prefer-dynamic-value no-dynamic-values output:

Hide Details

make VPATH=/Users/buildslave/jenkins/workspace/lldb-cmake-matrix/llvm-project/lldb/test/API/lang/cpp/const_static_integral_member -C /Users/buildslave/jenkins/workspace/lldb-cmake-matrix/lldb-build/lldb-test-build.noindex/lang/cpp/const_static_integral_member/TestConstStaticIntegralMember.test_class_with_only_const_static_dsym -I /Users/buildslave/jenkins/workspace/lldb-cmake-matrix/llvm-project/lldb/test/API/lang/cpp/const_static_integral_member -I /Users/buildslave/jenkins/workspace/lldb-cmake-matrix/llvm-project/lldb/packages/Python/lldbsuite/test/make -f /Users/buildslave/jenkins/workspace/lldb-cmake-matrix/llvm-project/lldb/test/API/lang/cpp/const_static_integral_member/Makefile MAKE_DSYM=YES all ARCH=x86_64 'CC="/Users/buildslave/jenkins/workspace/lldb-cmake-matrix/clang_1300_build/bin/clang"' DSYMUTIL=/Users/buildslave/jenkins/workspace/lldb-cmake-matrix/lldb-build/./bin/dsymutil CODESIGN=codesign CLANG_MODULE_CACHE_DIR=/Users/buildslave/jenkins/workspace/lldb-cmake-matrix/lldb-build/lldb-test-build.noindex/module-cache-clang/lldb-api USE_HERMETIC_LIBCPP=1

Hide Details

"/Users/buildslave/jenkins/workspace/lldb-cmake-matrix/clang_1300_build/bin/clang" -std=c++11 -g -O0 -isysroot "/Applications/Xcode.app/Contents/Developer/Platforms/MacOSX.platform/Developer/SDKs/MacOSX11.1.sdk" -arch x86_64 -I/Users/buildslave/jenkins/workspace/lldb-cmake-matrix/llvm-project/lldb/packages/Python/lldbsuite/test/make/../../../../../include -I/Users/buildslave/jenkins/workspace/lldb-cmake-matrix/llvm-project/lldb/test/API/lang/cpp/const_static_integral_member -I/Users/buildslave/jenkins/workspace/lldb-cmake-matrix/llvm-project/lldb/packages/Python/lldbsuite/test/make -include /Users/buildslave/jenkins/workspace/lldb-cmake-matrix/llvm-project/lldb/packages/Python/lldbsuite/test/make/test_common.h -fno-limit-debug-info --driver-mode=g++ -MT main.o -MD -MP -MF main.d -c -o main.o /Users/buildslave/jenkins/workspace/lldb-cmake-matrix/llvm-project/lldb/test/API/lang/cpp/const_static_integral_member/main.cpp "/Users/buildslave/jenkins/workspace/lldb-cmake-matrix/clang_1300_build/bin/clang" main.o -g -O0 -isysroot "/Applications/Xcode.app/Contents/Developer/Platforms/MacOSX.platform/Developer/SDKs/MacOSX11.1.sdk" -arch x86_64 -I/Users/buildslave/jenkins/workspace/lldb-cmake-matrix/llvm-project/lldb/packages/Python/lldbsuite/test/make/../../../../../include -I/Users/buildslave/jenkins/workspace/lldb-cmake-matrix/llvm-project/lldb/test/API/lang/cpp/const_static_integral_member -I/Users/buildslave/jenkins/workspace/lldb-cmake-matrix/llvm-project/lldb/packages/Python/lldbsuite/test/make -include /Users/buildslave/jenkins/workspace/lldb-cmake-matrix/llvm-project/lldb/packages/Python/lldbsuite/test/make/test_common.h -fno-limit-debug-info --driver-mode=g++ -o "a.out" codesign -s - "a.out" "/Users/buildslave/jenkins/workspace/lldb-cmake-matrix/lldb-build/./bin/dsymutil" -o "a.out.dSYM" "a.out"

Hide Details

Hide Details

XFAIL: LLDB (/Users/buildslave/jenkins/workspace/lldb-cmake-matrix/clang_1300_build/bin/clang-x86_64) :: test_class_with_only_const_static_dsym (TestConstStaticIntegralMember.TestCase) <bound method SBProcess.Kill of SBProcess: pid = 17689, state = stopped, threads = 1, executable = a.out>: success

Hide Details

runCmd: settings clear -all output:

Hide Details

runCmd: settings set symbols.enable-external-lookup false output:

Hide Details

runCmd: settings set target.inherit-tcc true output:

Hide Details

runCmd: settings set target.detach-on-error false output:

Hide Details

runCmd: settings set target.auto-apply-fixits false output:

Hide Details

runCmd: settings set plugin.process.gdb-remote.packet-timeout 60 output:

Hide Details

runCmd: settings set symbols.clang-modules-cache-path "/Users/buildslave/jenkins/workspace/lldb-cmake-matrix/lldb-build/lldb-test-build.noindex/module-cache-lldb/lldb-api" output:

Hide Details

runCmd: settings set use-color false output:

Hide Details

runCmd: setting set target.prefer-dynamic-value no-dynamic-values output:

Hide Details

make VPATH=/Users/buildslave/jenkins/workspace/lldb-cmake-matrix/llvm-project/lldb/test/API/lang/cpp/const_static_integral_member -C /Users/buildslave/jenkins/workspace/lldb-cmake-matrix/lldb-build/lldb-test-build.noindex/lang/cpp/const_static_integral_member/TestConstStaticIntegralMember.test_class_with_only_const_static_dwarf -I /Users/buildslave/jenkins/workspace/lldb-cmake-matrix/llvm-project/lldb/test/API/lang/cpp/const_static_integral_member -I /Users/buildslave/jenkins/workspace/lldb-cmake-matrix/llvm-project/lldb/packages/Python/lldbsuite/test/make -f /Users/buildslave/jenkins/workspace/lldb-cmake-matrix/llvm-project/lldb/test/API/lang/cpp/const_static_integral_member/Makefile MAKE_DSYM=NO all ARCH=x86_64 'CC="/Users/buildslave/jenkins/workspace/lldb-cmake-matrix/clang_1300_build/bin/clang"' DSYMUTIL=/Users/buildslave/jenkins/workspace/lldb-cmake-matrix/lldb-build/./bin/dsymutil CODESIGN=codesign CLANG_MODULE_CACHE_DIR=/Users/buildslave/jenkins/workspace/lldb-cmake-matrix/lldb-build/lldb-test-build.noindex/module-cache-clang/lldb-api USE_HERMETIC_LIBCPP=1

Hide Details

"/Users/buildslave/jenkins/workspace/lldb-cmake-matrix/clang_1300_build/bin/clang" -std=c++11 -g -O0 -isysroot "/Applications/Xcode.app/Contents/Developer/Platforms/MacOSX.platform/Developer/SDKs/MacOSX11.1.sdk" -arch x86_64 -I/Users/buildslave/jenkins/workspace/lldb-cmake-matrix/llvm-project/lldb/packages/Python/lldbsuite/test/make/../../../../../include -I/Users/buildslave/jenkins/workspace/lldb-cmake-matrix/llvm-project/lldb/test/API/lang/cpp/const_static_integral_member -I/Users/buildslave/jenkins/workspace/lldb-cmake-matrix/llvm-project/lldb/packages/Python/lldbsuite/test/make -include /Users/buildslave/jenkins/workspace/lldb-cmake-matrix/llvm-project/lldb/packages/Python/lldbsuite/test/make/test_common.h -fno-limit-debug-info --driver-mode=g++ -MT main.o -MD -MP -MF main.d -c -o main.o /Users/buildslave/jenkins/workspace/lldb-cmake-matrix/llvm-project/lldb/test/API/lang/cpp/const_static_integral_member/main.cpp "/Users/buildslave/jenkins/workspace/lldb-cmake-matrix/clang_1300_build/bin/clang" main.o -g -O0 -isysroot "/Applications/Xcode.app/Contents/Developer/Platforms/MacOSX.platform/Developer/SDKs/MacOSX11.1.sdk" -arch x86_64 -I/Users/buildslave/jenkins/workspace/lldb-cmake-matrix/llvm-project/lldb/packages/Python/lldbsuite/test/make/../../../../../include -I/Users/buildslave/jenkins/workspace/lldb-cmake-matrix/llvm-project/lldb/test/API/lang/cpp/const_static_integral_member -I/Users/buildslave/jenkins/workspace/lldb-cmake-matrix/llvm-project/lldb/packages/Python/lldbsuite/test/make -include /Users/buildslave/jenkins/workspace/lldb-cmake-matrix/llvm-project/lldb/packages/Python/lldbsuite/test/make/test_common.h -fno-limit-debug-info --driver-mode=g++ -o "a.out" codesign -s - "a.out"

Hide Details

Hide Details

<bound method SBProcess.Kill of SBProcess: pid = 17885, state = stopped, threads = 1, executable = a.out>: success

Hide Details

PASS: LLDB (/Users/buildslave/jenkins/workspace/lldb-cmake-matrix/clang_1300_build/bin/clang-x86_64) :: test_class_with_only_const_static_dwarf (TestConstStaticIntegralMember.TestCase) UNSUPPORTED: LLDB (/Users/buildslave/jenkins/workspace/lldb-cmake-matrix/clang_1300_build/bin/clang-x86_64) :: test_class_with_only_const_static_dwo (TestConstStaticIntegralMember.TestCase) (test case does not fall in any category of interest for this run) UNSUPPORTED: LLDB (/Users/buildslave/jenkins/workspace/lldb-cmake-matrix/clang_1300_build/bin/clang-x86_64) :: test_class_with_only_const_static_gmodules (TestConstStaticIntegralMember.TestCase) (test case does not fall in any category of interest for this run) runCmd: settings clear -all output:

Hide Details

runCmd: settings set symbols.enable-external-lookup false output:

Hide Details

runCmd: settings set target.inherit-tcc true output:

Hide Details

runCmd: settings set target.detach-on-error false output:

Hide Details

runCmd: settings set target.auto-apply-fixits false output:

Hide Details

runCmd: settings set plugin.process.gdb-remote.packet-timeout 60 output:

Hide Details

runCmd: settings set symbols.clang-modules-cache-path "/Users/buildslave/jenkins/workspace/lldb-cmake-matrix/lldb-build/lldb-test-build.noindex/module-cache-lldb/lldb-api" output:

Hide Details

runCmd: settings set use-color false output:

Hide Details

runCmd: setting set target.prefer-dynamic-value no-dynamic-values output:

Hide Details

make VPATH=/Users/buildslave/jenkins/workspace/lldb-cmake-matrix/llvm-project/lldb/test/API/lang/cpp/const_static_integral_member -C /Users/buildslave/jenkins/workspace/lldb-cmake-matrix/lldb-build/lldb-test-build.noindex/lang/cpp/const_static_integral_member/TestConstStaticIntegralMember.test_dsym -I /Users/buildslave/jenkins/workspace/lldb-cmake-matrix/llvm-project/lldb/test/API/lang/cpp/const_static_integral_member -I /Users/buildslave/jenkins/workspace/lldb-cmake-matrix/llvm-project/lldb/packages/Python/lldbsuite/test/make -f /Users/buildslave/jenkins/workspace/lldb-cmake-matrix/llvm-project/lldb/test/API/lang/cpp/const_static_integral_member/Makefile MAKE_DSYM=YES all ARCH=x86_64 'CC="/Users/buildslave/jenkins/workspace/lldb-cmake-matrix/clang_1300_build/bin/clang"' DSYMUTIL=/Users/buildslave/jenkins/workspace/lldb-cmake-matrix/lldb-build/./bin/dsymutil CODESIGN=codesign CLANG_MODULE_CACHE_DIR=/Users/buildslave/jenkins/workspace/lldb-cmake-matrix/lldb-build/lldb-test-build.noindex/module-cache-clang/lldb-api USE_HERMETIC_LIBCPP=1

Hide Details

"/Users/buildslave/jenkins/workspace/lldb-cmake-matrix/clang_1300_build/bin/clang" -std=c++11 -g -O0 -isysroot "/Applications/Xcode.app/Contents/Developer/Platforms/MacOSX.platform/Developer/SDKs/MacOSX11.1.sdk" -arch x86_64 -I/Users/buildslave/jenkins/workspace/lldb-cmake-matrix/llvm-project/lldb/packages/Python/lldbsuite/test/make/../../../../../include -I/Users/buildslave/jenkins/workspace/lldb-cmake-matrix/llvm-project/lldb/test/API/lang/cpp/const_static_integral_member -I/Users/buildslave/jenkins/workspace/lldb-cmake-matrix/llvm-project/lldb/packages/Python/lldbsuite/test/make -include /Users/buildslave/jenkins/workspace/lldb-cmake-matrix/llvm-project/lldb/packages/Python/lldbsuite/test/make/test_common.h -fno-limit-debug-info --driver-mode=g++ -MT main.o -MD -MP -MF main.d -c -o main.o /Users/buildslave/jenkins/workspace/lldb-cmake-matrix/llvm-project/lldb/test/API/lang/cpp/const_static_integral_member/main.cpp "/Users/buildslave/jenkins/workspace/lldb-cmake-matrix/clang_1300_build/bin/clang" main.o -g -O0 -isysroot "/Applications/Xcode.app/Contents/Developer/Platforms/MacOSX.platform/Developer/SDKs/MacOSX11.1.sdk" -arch x86_64 -I/Users/buildslave/jenkins/workspace/lldb-cmake-matrix/llvm-project/lldb/packages/Python/lldbsuite/test/make/../../../../../include -I/Users/buildslave/jenkins/workspace/lldb-cmake-matrix/llvm-project/lldb/test/API/lang/cpp/const_static_integral_member -I/Users/buildslave/jenkins/workspace/lldb-cmake-matrix/llvm-project/lldb/packages/Python/lldbsuite/test/make -include /Users/buildslave/jenkins/workspace/lldb-cmake-matrix/llvm-project/lldb/packages/Python/lldbsuite/test/make/test_common.h -fno-limit-debug-info --driver-mode=g++ -o "a.out" codesign -s - "a.out" "/Users/buildslave/jenkins/workspace/lldb-cmake-matrix/lldb-build/./bin/dsymutil" -o "a.out.dSYM" "a.out"

Hide Details

Hide Details

FAIL: LLDB (/Users/buildslave/jenkins/workspace/lldb-cmake-matrix/clang_1300_build/bin/clang-x86_64) :: test_dsym (TestConstStaticIntegralMember.TestCase) <bound method SBProcess.Kill of SBProcess: pid = 18036, state = stopped, threads = 1, executable = a.out>: success

Hide Details

runCmd: settings clear -all output:

Hide Details

runCmd: settings set symbols.enable-external-lookup false output:

Hide Details

runCmd: settings set target.inherit-tcc true output:

Hide Details

runCmd: settings set target.detach-on-error false output:

Hide Details

runCmd: settings set target.auto-apply-fixits false output:

Hide Details

runCmd: settings set plugin.process.gdb-remote.packet-timeout 60 output:

Hide Details

runCmd: settings set symbols.clang-modules-cache-path "/Users/buildslave/jenkins/workspace/lldb-cmake-matrix/lldb-build/lldb-test-build.noindex/module-cache-lldb/lldb-api" output:

Hide Details

runCmd: settings set use-color false output:

Hide Details

runCmd: setting set target.prefer-dynamic-value no-dynamic-values output:

Hide Details

make VPATH=/Users/buildslave/jenkins/workspace/lldb-cmake-matrix/llvm-project/lldb/test/API/lang/cpp/const_static_integral_member -C /Users/buildslave/jenkins/workspace/lldb-cmake-matrix/lldb-build/lldb-test-build.noindex/lang/cpp/const_static_integral_member/TestConstStaticIntegralMember.test_dwarf -I /Users/buildslave/jenkins/workspace/lldb-cmake-matrix/llvm-project/lldb/test/API/lang/cpp/const_static_integral_member -I /Users/buildslave/jenkins/workspace/lldb-cmake-matrix/llvm-project/lldb/packages/Python/lldbsuite/test/make -f /Users/buildslave/jenkins/workspace/lldb-cmake-matrix/llvm-project/lldb/test/API/lang/cpp/const_static_integral_member/Makefile MAKE_DSYM=NO all ARCH=x86_64 'CC="/Users/buildslave/jenkins/workspace/lldb-cmake-matrix/clang_1300_build/bin/clang"' DSYMUTIL=/Users/buildslave/jenkins/workspace/lldb-cmake-matrix/lldb-build/./bin/dsymutil CODESIGN=codesign CLANG_MODULE_CACHE_DIR=/Users/buildslave/jenkins/workspace/lldb-cmake-matrix/lldb-build/lldb-test-build.noindex/module-cache-clang/lldb-api USE_HERMETIC_LIBCPP=1

Hide Details

"/Users/buildslave/jenkins/workspace/lldb-cmake-matrix/clang_1300_build/bin/clang" -std=c++11 -g -O0 -isysroot "/Applications/Xcode.app/Contents/Developer/Platforms/MacOSX.platform/Developer/SDKs/MacOSX11.1.sdk" -arch x86_64 -I/Users/buildslave/jenkins/workspace/lldb-cmake-matrix/llvm-project/lldb/packages/Python/lldbsuite/test/make/../../../../../include -I/Users/buildslave/jenkins/workspace/lldb-cmake-matrix/llvm-project/lldb/test/API/lang/cpp/const_static_integral_member -I/Users/buildslave/jenkins/workspace/lldb-cmake-matrix/llvm-project/lldb/packages/Python/lldbsuite/test/make -include /Users/buildslave/jenkins/workspace/lldb-cmake-matrix/llvm-project/lldb/packages/Python/lldbsuite/test/make/test_common.h -fno-limit-debug-info --driver-mode=g++ -MT main.o -MD -MP -MF main.d -c -o main.o /Users/buildslave/jenkins/workspace/lldb-cmake-matrix/llvm-project/lldb/test/API/lang/cpp/const_static_integral_member/main.cpp "/Users/buildslave/jenkins/workspace/lldb-cmake-matrix/clang_1300_build/bin/clang" main.o -g -O0 -isysroot "/Applications/Xcode.app/Contents/Developer/Platforms/MacOSX.platform/Developer/SDKs/MacOSX11.1.sdk" -arch x86_64 -I/Users/buildslave/jenkins/workspace/lldb-cmake-matrix/llvm-project/lldb/packages/Python/lldbsuite/test/make/../../../../../include -I/Users/buildslave/jenkins/workspace/lldb-cmake-matrix/llvm-project/lldb/test/API/lang/cpp/const_static_integral_member -I/Users/buildslave/jenkins/workspace/lldb-cmake-matrix/llvm-project/lldb/packages/Python/lldbsuite/test/make -include /Users/buildslave/jenkins/workspace/lldb-cmake-matrix/llvm-project/lldb/packages/Python/lldbsuite/test/make/test_common.h -fno-limit-debug-info --driver-mode=g++ -o "a.out" codesign -s - "a.out"

Hide Details

Hide Details

runCmd: expr const int *i = &A::int_val; *i check of return status not required runCmd failed! error: expression failed to parse: error: Couldn't lookup symbols: __ZN1A7int_valE

Hide Details

Hide Details

Ran command: "expr const int *i = &A::int_val; *i"

Hide Details

Got output: error: expression failed to parse: error: Couldn't lookup symbols: __ZN1A7int_valE

Hide Details

Expecting sub string: "Couldn't lookup symbols:" (was found)

Hide Details

<bound method SBProcess.Kill of SBProcess: pid = 18235, state = stopped, threads = 1, executable = a.out>: success

Hide Details

PASS: LLDB (/Users/buildslave/jenkins/workspace/lldb-cmake-matrix/clang_1300_build/bin/clang-x86_64) :: test_dwarf (TestConstStaticIntegralMember.TestCase) UNSUPPORTED: LLDB (/Users/buildslave/jenkins/workspace/lldb-cmake-matrix/clang_1300_build/bin/clang-x86_64) :: test_dwo (TestConstStaticIntegralMember.TestCase) (test case does not fall in any category of interest for this run) UNSUPPORTED: LLDB (/Users/buildslave/jenkins/workspace/lldb-cmake-matrix/clang_1300_build/bin/clang-x86_64) :: test_gmodules (TestConstStaticIntegralMember.TestCase) (test case does not fall in any category of interest for this run) Restore dir to: /Users/buildslave/jenkins/workspace/lldb-cmake-matrix/lldb-build/tools/lldb/test ====================================================================== FAIL: test_dsym (TestConstStaticIntegralMember.TestCase) ---------------------------------------------------------------------- Traceback (most recent call last): File "/Users/buildslave/jenkins/workspace/lldb-cmake-matrix/llvm-project/lldb/packages/Python/lldbsuite/test/lldbtest.py", line 1669, in test_method return attrvalue(self) File "/Users/buildslave/jenkins/workspace/lldb-cmake-matrix/llvm-project/lldb/test/API/lang/cpp/const_static_integral_member/TestConstStaticIntegralMember.py", line 71, in test self.expect_expr("ClassWithEnumAlias::enum_alias", File "/Users/buildslave/jenkins/workspace/lldb-cmake-matrix/llvm-project/lldb/packages/Python/lldbsuite/test/lldbtest.py", line 2425, in expect_expr value_check.check_value(self, eval_result, str(eval_result)) File "/Users/buildslave/jenkins/workspace/lldb-cmake-matrix/llvm-project/lldb/packages/Python/lldbsuite/test/lldbtest.py", line 283, in check_value test_base.assertSuccess(val.GetError()) File "/Users/buildslave/jenkins/workspace/lldb-cmake-matrix/llvm-project/lldb/packages/Python/lldbsuite/test/lldbtest.py", line 2461, in assertSuccess self.fail(self._formatMessage(msg, AssertionError: 'expression failed to parse: error: <user expression 31>:1:1: use of undeclared identifier 'ClassWithEnumAlias' ClassWithEnumAlias::enum_alias ^ ' is not success Config=x86_64-/Users/buildslave/jenkins/workspace/lldb-cmake-matrix/clang_1300_build/bin/clang ---------------------------------------------------------------------- Ran 8 tests in 8.054s

Hide Details

RESULT: FAILED (2 passes, 1 failures, 0 errors, 4 skipped, 1 expected failures, 0 unexpected successes)

Hide Details

--

Hide Details

******************** UNSUPPORTED: lldb-shell :: ScriptInterpreter/Lua/breakpoint_oneline_callback.test (624 of 1524) PASS: lldb-api :: commands/expression/import-std-module/no-std-module/TestMissingStdModule.py (625 of 1524) UNSUPPORTED: lldb-api :: functionalities/thread/multi_break/TestMultipleBreakpoints.py (626 of 1524) PASS: lldb-api :: tools/lldb-vscode/stackTrace/TestVSCode_stackTrace.py (627 of 1524) PASS: lldb-api :: functionalities/breakpoint/breakpoint_language/TestBreakpointLanguage.py (628 of 1524) PASS: lldb-shell :: SymbolFile/DWARF/x86/debug_rnglists-dwo.s (629 of 1524) UNSUPPORTED: lldb-shell :: Register/x86-gp-read.test (630 of 1524) UNSUPPORTED: lldb-shell :: SymbolFile/NativePDB/function-types-calling-conv.cpp (631 of 1524) PASS: lldb-api :: commands/expression/diagnostics/TestExprDiagnostics.py (632 of 1524) PASS: lldb-api :: macosx/function-starts/TestFunctionStarts.py (633 of 1524) PASS: lldb-api :: python_api/thread/TestThreadAPI.py (634 of 1524) UNSUPPORTED: lldb-api :: tools/lldb-server/TestGdbRemoteHostInfo.py (635 of 1524) PASS: lldb-api :: functionalities/data-formatter/data-formatter-stl/generic/multimap/TestDataFormatterGenericMultiMap.py (636 of 1524) PASS: lldb-shell :: SymbolFile/DWARF/x86/dwarf5-debug_line-file-index.s (637 of 1524) PASS: lldb-api :: commands/disassemble/basic/TestFrameDisassemble.py (638 of 1524) PASS: lldb-api :: lang/objc/foundation/TestSymbolTable.py (639 of 1524) PASS: lldb-api :: macosx/stack-corefile/TestStackCorefile.py (640 of 1524) PASS: lldb-api :: functionalities/gdb_remote_client/TestGDBRemoteLoad.py (641 of 1524) PASS: lldb-api :: test_utils/TestDecorators.py (642 of 1524) PASS: lldb-shell :: ScriptInterpreter/Python/python.test (643 of 1524) PASS: lldb-api :: functionalities/breakpoint/breakpoint_command/TestBreakpointCommand.py (644 of 1524) PASS: lldb-shell :: SymbolFile/DWARF/x86/debug_loc.s (645 of 1524) PASS: lldb-shell :: SymbolFile/symbol-binding.test (646 of 1524) PASS: lldb-shell :: Reproducer/TestPythonImport.test (647 of 1524) PASS: lldb-api :: commands/frame/recognizer/TestFrameRecognizer.py (648 of 1524) PASS: lldb-api :: commands/expression/expr-in-syscall/TestExpressionInSyscall.py (649 of 1524) PASS: lldb-api :: commands/frame/diagnose/virtual-method-call/TestDiagnoseDereferenceVirtualMethodCall.py (650 of 1524) PASS: lldb-api :: lang/objc/modules-auto-import/TestModulesAutoImport.py (651 of 1524) UNSUPPORTED: lldb-shell :: Register/x86-64-zmm-read.test (652 of 1524) UNSUPPORTED: lldb-api :: arm/breakpoint-thumb-codesection/TestBreakpointThumbCodesection.py (653 of 1524) PASS: lldb-api :: commands/expression/static-initializers/TestStaticInitializers.py (654 of 1524) UNSUPPORTED: lldb-shell :: SymbolFile/DWARF/x86/find-function-regex.cpp (655 of 1524) PASS: lldb-api :: iohandler/resize/TestIOHandlerResize.py (656 of 1524) PASS: lldb-api :: functionalities/thread/num_threads/TestNumThreads.py (657 of 1524) PASS: lldb-api :: tools/lldb-vscode/step/TestVSCode_step.py (658 of 1524) PASS: lldb-api :: commands/expression/import-std-module/weak_ptr/TestWeakPtrFromStdModule.py (659 of 1524) PASS: lldb-shell :: Quit/TestQuitExitCode0.test (660 of 1524) UNSUPPORTED: lldb-shell :: SymbolFile/NativePDB/function-types-classes.cpp (661 of 1524) PASS: lldb-api :: functionalities/gdb_remote_client/TestArmRegisterDefinition.py (662 of 1524) PASS: lldb-api :: functionalities/gdb_remote_client/TestPlatformKill.py (663 of 1524) PASS: lldb-api :: python_api/findvalue_duplist/TestSBFrameFindValue.py (664 of 1524) PASS: lldb-api :: iohandler/sigint/TestIOHandlerPythonREPLSigint.py (665 of 1524) PASS: lldb-api :: functionalities/inferior-crashing/recursive-inferior/TestRecursiveInferior.py (666 of 1524) PASS: lldb-shell :: Minidump/Windows/broken-unwind.test (667 of 1524) PASS: lldb-api :: symbol_ondemand/breakpoint_language/TestBreakpointLanguageOnDemand.py (668 of 1524) UNSUPPORTED: lldb-api :: commands/expression/import-std-module/stack/TestStackFromStdModule.py (669 of 1524) PASS: lldb-api :: commands/expression/options/TestExprOptions.py (670 of 1524) UNSUPPORTED: lldb-api :: lang/objc/modules-update/TestClangModulesUpdate.py (671 of 1524) PASS: lldb-api :: functionalities/data-formatter/data-formatter-stl/generic/deque/TestDataFormatterGenericDeque.py (672 of 1524) UNSUPPORTED: lldb-shell :: Register/aarch64-fp-read.test (673 of 1524) PASS: lldb-api :: commands/expression/import-std-module/empty-module/TestEmptyStdModule.py (674 of 1524) PASS: lldb-api :: commands/expression/context-object-objc/TestContextObjectObjc.py (675 of 1524) PASS: lldb-api :: functionalities/data-formatter/data-formatter-disabling/TestDataFormatterDisabling.py (676 of 1524) PASS: lldb-api :: tools/lldb-vscode/launch/TestVSCode_launch.py (677 of 1524) PASS: lldb-api :: functionalities/location-list-lookup/TestLocationListLookup.py (678 of 1524) PASS: lldb-api :: commands/expression/completion/TestExprCompletion.py (679 of 1524) PASS: lldb-shell :: SymbolFile/absolute-symbol.test (680 of 1524) PASS: lldb-shell :: SymbolFile/DWARF/x86/dwarf5_tu_index_abbrev_offset.s (681 of 1524) PASS: lldb-shell :: ObjectFile/MachO/lc_version_min.yaml (682 of 1524) PASS: lldb-shell :: Register/Core/x86-64-freebsd-multithread.test (683 of 1524) PASS: lldb-api :: python_api/module_section/TestModuleAndSection.py (684 of 1524) UNSUPPORTED: lldb-shell :: ScriptInterpreter/Lua/quit.test (685 of 1524) PASS: lldb-api :: functionalities/data-formatter/data-formatter-stl/libcxx/map/TestDataFormatterLibccMap.py (686 of 1524) PASS: lldb-api :: functionalities/data-formatter/data-formatter-objc/TestDataFormatterObjCKVO.py (687 of 1524) PASS: lldb-api :: commands/target/stop-hook/enable/TestTargetStopHookEnable.py (688 of 1524) PASS: lldb-shell :: SymbolFile/DWARF/x86/dwp-debug-types.s (689 of 1524) UNSUPPORTED: lldb-shell :: ObjectFile/PECOFF/export-dllfunc.yaml (690 of 1524) UNSUPPORTED: lldb-api :: linux/aarch64/mte_tag_access/TestAArch64LinuxMTEMemoryTagAccess.py (691 of 1524) PASS: lldb-shell :: ScriptInterpreter/Python/silent_command_script_import.test (692 of 1524) PASS: lldb-api :: lang/c/global_variables/TestGlobalVariables.py (693 of 1524) PASS: lldb-api :: functionalities/source-map/TestTargetSourceMap.py (694 of 1524) PASS: lldb-api :: lang/cpp/nsimport/TestCppNsImport.py (695 of 1524) PASS: lldb-shell :: ObjectFile/ELF/section-permissions.yaml (696 of 1524) PASS: lldb-api :: linux/builtin_trap/TestBuiltinTrap.py (697 of 1524) PASS: lldb-api :: macosx/nslog/TestDarwinNSLogOutput.py (698 of 1524) PASS: lldb-api :: functionalities/signal/TestSendSignal.py (699 of 1524) PASS: lldb-shell :: SymbolFile/Breakpad/unwind-via-stack-cfi.test (700 of 1524) PASS: lldb-shell :: Register/Core/x86-64-netbsd-gp.test (701 of 1524) PASS: lldb-shell :: Register/Core/x86-64-linux-gp.test (702 of 1524) UNSUPPORTED: lldb-shell :: ScriptInterpreter/Lua/lua-python.test (703 of 1524) UNSUPPORTED: lldb-api :: functionalities/tsan/cpp_global_location/TestTsanCPPGlobalLocation.py (704 of 1524) UNSUPPORTED: lldb-api :: commands/trace/TestTraceStartStop.py (705 of 1524) PASS: lldb-api :: functionalities/module_cache/bsd/TestModuleCacheBSD.py (706 of 1524) PASS: lldb-api :: commands/expression/regression-access-function-template-in-record/TestRegressionAccessFunctionTemplateInRecord.py (707 of 1524) PASS: lldb-api :: lang/objc/objc-ivar-offsets/TestObjCIvarOffsets.py (708 of 1524) PASS: lldb-shell :: REPL/Basic.test (709 of 1524) PASS: lldb-shell :: Register/Core/x86-32-netbsd-gp.test (710 of 1524) UNSUPPORTED: lldb-api :: tools/lldb-server/TestGdbRemoteProcessInfo.py (711 of 1524) PASS: lldb-shell :: SymbolFile/DWARF/x86/DW_AT_location-DW_AT_const_value.s (712 of 1524) PASS: lldb-api :: test_utils/TestPExpectTest.py (713 of 1524) PASS: lldb-shell :: Settings/TestDisableColor.test (714 of 1524) PASS: lldb-shell :: Reproducer/TestDriverOptions.test (715 of 1524) PASS: lldb-api :: functionalities/module_cache/simple_exe/TestModuleCacheSimple.py (716 of 1524) PASS: lldb-api :: lang/cpp/thread_local/TestThreadLocal.py (717 of 1524) UNSUPPORTED: lldb-shell :: ObjectFile/ELF/minidebuginfo-set-and-hit-breakpoint.test (718 of 1524) PASS: lldb-api :: lang/cpp/class-template-parameter-pack/TestClassTemplateParameterPack.py (719 of 1524) PASS: lldb-shell :: ObjectFile/PECOFF/settings-abi-i686.yaml (720 of 1524) UNSUPPORTED: lldb-shell :: SymbolFile/DWARF/x86/inline-function-address.ll (721 of 1524) PASS: lldb-api :: lang/objc/foundation/TestObjectDescriptionAPI.py (722 of 1524) PASS: lldb-api :: functionalities/load_using_paths/TestLoadUsingPaths.py (723 of 1524) PASS: lldb-api :: commands/expression/import-std-module/conflicts/TestStdModuleWithConflicts.py (724 of 1524) PASS: lldb-api :: lang/objc/warnings-in-expr-parser/TestObjCWarningsInExprParser.py (725 of 1524) XFAIL: lldb-shell :: Unwind/prefer-debug-over-eh-frame.test (726 of 1524) PASS: lldb-shell :: ObjectFile/ELF/netbsd-exec-8.99.30-amd64.yaml (727 of 1524) PASS: lldb-api :: lang/cpp/keywords_enabled/TestCppKeywordsEnabled.py (728 of 1524) UNSUPPORTED: lldb-shell :: SymbolFile/NativePDB/lookup-by-address.cpp (729 of 1524) PASS: lldb-api :: functionalities/breakpoint/address_breakpoints/TestAddressBreakpoints.py (730 of 1524) PASS: lldb-api :: lang/cpp/class-loading-via-member-typedef/TestClassLoadingViaMemberTypedef.py (731 of 1524) UNSUPPORTED: lldb-api :: functionalities/postmortem/FreeBSDKernel/TestFreeBSDKernelVMCore.py (732 of 1524) PASS: lldb-api :: lang/cpp/chained-calls/TestCppChainedCalls.py (733 of 1524) PASS: lldb-api :: functionalities/abbreviation/TestCommonShortSpellings.py (734 of 1524) PASS: lldb-shell :: SymbolFile/Breakpad/unwind-via-raSearch.test (735 of 1524) PASS: lldb-api :: lang/objc/objc-super/TestObjCSuper.py (736 of 1524) PASS: lldb-api :: lang/cpp/const_this/TestConstThis.py (737 of 1524) PASS: lldb-api :: macosx/builtin-debugtrap/TestBuiltinDebugTrap.py (738 of 1524) UNSUPPORTED: lldb-shell :: SymbolFile/NativePDB/typedefs.cpp (739 of 1524) PASS: lldb-api :: functionalities/thread/step_until/TestStepUntil.py (740 of 1524) PASS: lldb-api :: functionalities/data-formatter/data-formatter-skip-summary/TestDataFormatterSkipSummary.py (741 of 1524) PASS: lldb-api :: commands/expression/radar_9531204/TestPrintfAfterUp.py (742 of 1524) PASS: lldb-shell :: Commands/command-stop-hook-no-target.test (743 of 1524) PASS: lldb-api :: functionalities/breakpoint/breakpoint_command/TestBreakpointCommandsFromPython.py (744 of 1524) PASS: lldb-api :: source-manager/TestSourceManager.py (745 of 1524) PASS: lldb-api :: functionalities/data-formatter/data-formatter-stl/libcxx/vbool/TestDataFormatterLibcxxVBool.py (746 of 1524) UNSUPPORTED: lldb-api :: benchmarks/turnaround/TestCompileRunToBreakpointTurnaround.py (747 of 1524) PASS: lldb-api :: functionalities/multidebugger_commands/TestMultipleDebuggersCommands.py (748 of 1524) PASS: lldb-api :: python_api/process/read-mem-cstring/TestReadMemCString.py (749 of 1524) PASS: lldb-api :: lang/cpp/struct_with_keyword_name/TestStructWithKeywordName.py (750 of 1524) PASS: lldb-api :: functionalities/breakpoint/breakpoint_by_line_and_column/TestBreakpointByLineAndColumn.py (751 of 1524) PASS: lldb-shell :: Recognizer/assert.test (752 of 1524) UNSUPPORTED: lldb-shell :: ScriptInterpreter/Lua/lua.test (753 of 1524) PASS: lldb-api :: functionalities/data-formatter/data-formatter-synthtype/TestDataFormatterSynthType.py (754 of 1524) PASS: lldb-shell :: Commands/command-disassemble.s (755 of 1524) PASS: lldb-shell :: Breakpoint/split-dwarf-5-addrbase.test (756 of 1524) PASS: lldb-api :: lang/cpp/symbols/TestSymbols.py (757 of 1524) UNSUPPORTED: lldb-api :: functionalities/dyld-launch-linux/TestDyldLaunchLinux.py (758 of 1524) UNSUPPORTED: lldb-api :: tools/lldb-server/TestGdbRemoteFork.py (759 of 1524) PASS: lldb-api :: lang/objc/objc-stepping/TestObjCStepping.py (760 of 1524) PASS: lldb-api :: functionalities/data-formatter/data-formatter-stl/libcxx/vector/TestDataFormatterLibcxxVector.py (761 of 1524) UNSUPPORTED: lldb-api :: commands/expression/macros/TestMacros.py (762 of 1524) PASS: lldb-api :: functionalities/data-formatter/cstring-utf8-summary/TestCstringUnicode.py (763 of 1524) PASS: lldb-shell :: ObjectFile/ELF/eh_frame-symbols.yaml (764 of 1524) PASS: lldb-api :: commands/expression/pr52257/TestExprCrash.py (765 of 1524) UNSUPPORTED: lldb-shell :: ScriptInterpreter/Python/Crashlog/interactive_crashlog_invalid_target.test (766 of 1524) PASS: lldb-api :: commands/expression/import-std-module/shared_ptr/TestSharedPtrFromStdModule.py (767 of 1524) PASS: lldb-shell :: Reproducer/TestWorkingDir.test (768 of 1524) PASS: lldb-api :: functionalities/inferior-changed/TestInferiorChanged.py (769 of 1524) UNSUPPORTED: lldb-api :: tools/lldb-server/TestGdbRemoteExpeditedRegisters.py (770 of 1524) UNSUPPORTED: lldb-shell :: SymbolFile/PDB/udt-layout.test (771 of 1524) PASS: lldb-api :: macosx/DBGSourcePathRemapping/TestDSYMSourcePathRemapping.py (772 of 1524) PASS: lldb-api :: api/log/TestAPILog.py (773 of 1524) UNSUPPORTED: lldb-api :: functionalities/ptrauth_diagnostics/BRAA_error/TestPtrauthBRAADiagnostic.py (774 of 1524) PASS: lldb-api :: commands/reproducer/invalid-args/TestInvalidArgsReproducer.py (775 of 1524) PASS: lldb-api :: commands/platform/process/list/TestProcessList.py (776 of 1524) PASS: lldb-api :: python_api/value/linked_list/TestValueAPILinkedList.py (777 of 1524) PASS: lldb-api :: lang/objc/foundation/TestRuntimeTypes.py (778 of 1524) PASS: lldb-api :: macosx/thread-names/TestInterruptThreadNames.py (779 of 1524) PASS: lldb-api :: lang/objc/objc-runtime-ivars/TestRuntimeIvars.py (780 of 1524) UNSUPPORTED: lldb-shell :: Unwind/windows-unaligned-x86_64.test (781 of 1524) PASS: lldb-api :: lang/objcxx/cpp_keywords_enabled/TestObjCppKeywordsEnabled.py (782 of 1524) PASS: lldb-shell :: ScriptInterpreter/Python/Crashlog/parser_json.test (783 of 1524) UNSUPPORTED: lldb-shell :: SymbolFile/DWARF/x86/debug-types-basic.test (784 of 1524) PASS: lldb-shell :: Driver/TestPositionalArgs.test (785 of 1524) PASS: lldb-api :: functionalities/breakpoint/cpp/TestCPPBreakpointLocations.py (786 of 1524) PASS: lldb-shell :: Register/Core/x86-64-freebsd-addr.test (787 of 1524) PASS: lldb-api :: functionalities/step_scripted/TestStepScripted.py (788 of 1524) PASS: lldb-shell :: ObjectFile/wasm/embedded-debug-sections.yaml (789 of 1524) PASS: lldb-api :: functionalities/breakpoint/global_constructor/TestBreakpointInGlobalConstructor.py (790 of 1524) PASS: lldb-shell :: Reproducer/TestDiscard.test (791 of 1524) PASS: lldb-shell :: Settings/TestSettingsSet.test (792 of 1524) UNSUPPORTED: lldb-api :: commands/trace/TestTraceDumpInfo.py (793 of 1524) PASS: lldb-api :: commands/expression/persistent_ptr_update/TestPersistentPtrUpdate.py (794 of 1524) PASS: lldb-shell :: Unwind/thread-step-out-ret-addr-check.test (795 of 1524) PASS: lldb-api :: python_api/lldbutil/frame/TestFrameUtils.py (796 of 1524) PASS: lldb-api :: commands/expression/no-deadlock/TestExprDoesntBlock.py (797 of 1524) UNSUPPORTED: lldb-shell :: Register/x86-fp-read.test (798 of 1524) UNSUPPORTED: lldb-api :: tools/lldb-server/TestGdbRemoteKill.py (799 of 1524) PASS: lldb-shell :: Symtab/symtab-regex-demangled.test (800 of 1524) PASS: lldb-shell :: Register/Core/x86-32-linux-gp.test (801 of 1524) PASS: lldb-shell :: ScriptInterpreter/Python/command_relative_import.test (802 of 1524) UNSUPPORTED: lldb-api :: functionalities/data-formatter/data-formatter-stl/libstdcpp/iterator/TestDataFormatterStdIterator.py (803 of 1524) PASS: lldb-api :: commands/expression/call-throws/TestCallThatThrows.py (804 of 1524) PASS: lldb-api :: commands/expression/anonymous-struct/TestCallUserAnonTypedef.py (805 of 1524) PASS: lldb-api :: lang/cpp/constructors/TestCppConstructors.py (806 of 1524) UNSUPPORTED: lldb-api :: commands/watchpoints/watchpoint_commands/command/TestWatchpointCommandPython.py (807 of 1524) PASS: lldb-api :: functionalities/data-formatter/hexcaps/TestDataFormatterHexCaps.py (808 of 1524) UNSUPPORTED: lldb-api :: tools/lldb-server/attach-wait/TestGdbRemoteAttachWait.py (809 of 1524) PASS: lldb-api :: python_api/sbplatform/TestSBPlatform.py (810 of 1524) UNSUPPORTED: lldb-shell :: Reproducer/TestLuaImport.test (811 of 1524) PASS: lldb-api :: lang/objc/variadic_methods/TestVariadicMethods.py (812 of 1524) PASS: lldb-shell :: Commands/command-regex-delete.test (813 of 1524) PASS: lldb-shell :: ObjectFile/ELF/build-id-case.yaml (814 of 1524) PASS: lldb-api :: functionalities/thread/concurrent_events/TestConcurrentCrashWithBreak.py (815 of 1524) PASS: lldb-shell :: Minidump/Windows/find-module.test (816 of 1524) PASS: lldb-shell :: ObjectFile/ELF/section-overlap.yaml (817 of 1524) PASS: lldb-api :: driver/job_control/TestJobControl.py (818 of 1524) PASS: lldb-shell :: ScriptInterpreter/None/none.test (819 of 1524) PASS: lldb-api :: commands/expression/multiline-navigation/TestMultilineNavigation.py (820 of 1524) PASS: lldb-api :: lang/objc/objc-static-method-stripped/TestObjCStaticMethodStripped.py (821 of 1524) PASS: lldb-shell :: ObjectFile/ELF/minidebuginfo-find-symbols.yaml (822 of 1524) PASS: lldb-api :: macosx/duplicate-archive-members/TestDuplicateMembers.py (823 of 1524) PASS: lldb-api :: lang/c/bitfields/TestBitfields.py (824 of 1524) PASS: lldb-api :: lang/c/array_types/TestArrayTypes.py (825 of 1524) UNSUPPORTED: lldb-shell :: Subprocess/vfork-follow-parent-softbp.test (826 of 1524) PASS: lldb-api :: lang/cpp/template/TestTemplateArgs.py (827 of 1524) UNSUPPORTED: lldb-api :: commands/gui/basicdebug/TestGuiBasicDebug.py (828 of 1524) PASS: lldb-api :: functionalities/target_var/TestTargetVar.py (829 of 1524) UNSUPPORTED: lldb-api :: commands/trace/TestTraceLoad.py (830 of 1524) PASS: lldb-api :: commands/platform/basic/TestPlatformCommand.py (831 of 1524) PASS: lldb-api :: repl/clang/TestClangREPL.py (832 of 1524) PASS: lldb-api :: macosx/lc-note/firmware-corefile/TestFirmwareCorefiles.py (833 of 1524) PASS: lldb-api :: lang/cpp/rvalue-references/TestRvalueReferences.py (834 of 1524) PASS: lldb-api :: lang/cpp/elaborated-types/TestElaboratedTypes.py (835 of 1524) UNSUPPORTED: lldb-shell :: ScriptInterpreter/Lua/watchpoint_callback.test (836 of 1524) PASS: lldb-api :: functionalities/data-formatter/data-formatter-objc/TestDataFormatterObjCNSData.py (837 of 1524) PASS: lldb-api :: commands/expression/import-std-module/unique_ptr-dbg-info-content/TestUniquePtrDbgInfoContent.py (838 of 1524) UNSUPPORTED: lldb-shell :: SymbolFile/DWARF/dwo-relative-path.s (839 of 1524) PASS: lldb-api :: terminal/TestSTTYBeforeAndAfter.py (840 of 1524) PASS: lldb-shell :: BuildScript/script-args.test (841 of 1524) PASS: lldb-shell :: ObjectFile/ELF/short-build-id.yaml (842 of 1524) PASS: lldb-api :: functionalities/load_unload/TestLoadUnload.py (843 of 1524) PASS: lldb-api :: lang/c/stepping/TestThreadStepping.py (844 of 1524) PASS: lldb-api :: functionalities/gdb_remote_client/TestPlatformClient.py (845 of 1524) UNSUPPORTED: lldb-api :: functionalities/thread/concurrent_events/TestConcurrentCrashWithWatchpoint.py (846 of 1524) PASS: lldb-shell :: SymbolFile/DWARF/x86/debug_rnglists-dwp.s (847 of 1524) PASS: lldb-api :: commands/expression/ignore-artificial-constructors/TestIgnoreArtificialConstructors.py (848 of 1524) PASS: lldb-api :: functionalities/abbreviation/TestAbbreviations.py (849 of 1524) PASS: lldb-api :: functionalities/gdb_remote_client/TestIOSSimulator.py (850 of 1524) UNSUPPORTED: lldb-api :: functionalities/thread/concurrent_events/TestConcurrentDelayWatchBreak.py (851 of 1524) PASS: lldb-shell :: Settings/TestDisassemblyFormat.test (852 of 1524) UNSUPPORTED: lldb-shell :: Register/x86-db-read.test (853 of 1524) PASS: lldb-api :: commands/target/stop-hook/disable/TestTargetStopHookDisable.py (854 of 1524) PASS: lldb-api :: commands/version/TestVersion.py (855 of 1524) UNSUPPORTED: lldb-shell :: Subprocess/fork-follow-child.test (856 of 1524) PASS: lldb-api :: functionalities/launch_stop_at_entry/TestStopAtEntry.py (857 of 1524) UNSUPPORTED: lldb-api :: tools/lldb-server/TestGdbRemoteRegisterState.py (858 of 1524) PASS: lldb-api :: commands/expression/import-std-module/retry-with-std-module/TestRetryWithStdModule.py (859 of 1524) PASS: lldb-api :: lang/objc/cpp_keyword_identifiers/TestCppKeywordsAsObjCIdentifiers.py (860 of 1524) UNSUPPORTED: lldb-api :: linux/thread/create_during_instruction_step/TestCreateDuringInstructionStep.py (861 of 1524) PASS: lldb-api :: functionalities/step-vrs-interrupt/TestStepVrsInterruptTimeout.py (862 of 1524) PASS: lldb-shell :: Commands/command-target-modules-dump-sections.yaml (863 of 1524) PASS: lldb-api :: lang/objc/modules/TestObjCModules.py (864 of 1524) UNSUPPORTED: lldb-shell :: Subprocess/vfork-follow-child-softbp.test (865 of 1524) PASS: lldb-shell :: ExecControl/StopHook/stop-hook.test (866 of 1524) PASS: lldb-api :: lang/cpp/typedef/TestCppTypedef.py (867 of 1524) UNSUPPORTED: lldb-api :: tools/lldb-server/TestGdbRemoteCompletion.py (868 of 1524) UNSUPPORTED: lldb-api :: commands/trace/multiple-threads/TestTraceStartStopMultipleThreads.py (869 of 1524) UNSUPPORTED: lldb-shell :: ObjectFile/ELF/minidebuginfo-no-lzma.yaml (870 of 1524) UNSUPPORTED: lldb-api :: functionalities/thread/concurrent_events/TestConcurrentDelaySignalWatch.py (871 of 1524) PASS: lldb-api :: functionalities/data-formatter/data-formatter-stl/libcxx/span/TestDataFormatterLibcxxSpan.py (872 of 1524) PASS: lldb-shell :: Subprocess/vfork-follow-parent.test (873 of 1524) PASS: lldb-api :: commands/session/history/TestSessionHistory.py (874 of 1524) UNSUPPORTED: lldb-api :: functionalities/thread/concurrent_events/TestConcurrentDelayedCrashWithBreakpointWatchpoint.py (875 of 1524) PASS: lldb-api :: lang/objcxx/class-name-clash/TestNameClash.py (876 of 1524) UNSUPPORTED: lldb-shell :: SymbolFile/PDB/ast-restore.test (877 of 1524) PASS: lldb-api :: test_utils/base/TestBaseTest.py (878 of 1524) PASS: lldb-api :: python_api/symbol-context/two-files/TestSymbolContextTwoFiles.py (879 of 1524) UNSUPPORTED: lldb-api :: commands/trace/TestTraceEvents.py (880 of 1524) UNSUPPORTED: lldb-shell :: Subprocess/vfork-follow-child.test (881 of 1524) PASS: lldb-api :: python_api/value/empty_class/TestValueAPIEmptyClass.py (882 of 1524) PASS: lldb-shell :: ScriptInterpreter/Python/scripted_breakpoint.test (883 of 1524) UNSUPPORTED: lldb-shell :: SymbolFile/DWARF/x86/limit-debug-info.s (884 of 1524) PASS: lldb-shell :: Breakpoint/debug_rnglistx_rlex.test (885 of 1524) PASS: lldb-api :: commands/command/script/import/rdar-12586188/TestRdar12586188.py (886 of 1524) PASS: lldb-api :: functionalities/data-formatter/data-formatter-smart-array/TestDataFormatterSmartArray.py (887 of 1524) PASS: lldb-shell :: Commands/command-image-lookup.yaml (888 of 1524) PASS: lldb-api :: functionalities/breakpoint/inlined_breakpoints/TestInlinedBreakpoints.py (889 of 1524) PASS: lldb-api :: lang/cpp/char1632_t/TestChar1632T.py (890 of 1524) PASS: lldb-api :: commands/expression/call-function/TestCallUserDefinedFunction.py (891 of 1524) PASS: lldb-api :: commands/expression/unicode-in-variable/TestUnicodeInVariable.py (892 of 1524) PASS: lldb-api :: commands/log/invalid-args/TestInvalidArgsLog.py (893 of 1524) PASS: lldb-api :: functionalities/data-formatter/pyobjsynthprovider/TestPyObjSynthProvider.py (894 of 1524) PASS: lldb-shell :: Breakpoint/breakpoint-command.test (895 of 1524) PASS: lldb-api :: lang/cpp/std-function-step-into-callable/TestStdFunctionStepIntoCallable.py (896 of 1524) PASS: lldb-api :: lang/cpp/class_types/TestClassTypesDisassembly.py (897 of 1524) PASS: lldb-shell :: SymbolFile/DWARF/x86/debug_ranges.s (898 of 1524) PASS: lldb-api :: python_api/frame/TestFrames.py (899 of 1524) PASS: lldb-api :: lang/objc/objc-static-method/TestObjCStaticMethod.py (900 of 1524) PASS: lldb-api :: functionalities/breakpoint/breakpoint_conditions/TestBreakpointConditions.py (901 of 1524) PASS: lldb-api :: commands/expression/error-limit/TestExprErrorLimit.py (902 of 1524) PASS: lldb-api :: lang/objc/global_ptrs/TestGlobalObjects.py (903 of 1524) PASS: lldb-api :: lang/objc/conflicting-definition/TestConflictingDefinition.py (904 of 1524) PASS: lldb-shell :: Reproducer/TestVersionCheck.test (905 of 1524) UNSUPPORTED: lldb-api :: linux/aarch64/unwind_signal/TestUnwindSignal.py (906 of 1524) PASS: lldb-api :: functionalities/stats_api/TestStatisticsAPI.py (907 of 1524) PASS: lldb-api :: functionalities/thread/concurrent_events/TestConcurrentDelaySignalBreak.py (908 of 1524) PASS: lldb-api :: functionalities/data-formatter/data-formatter-stl/libcxx/iterator/TestDataFormatterLibccIterator.py (909 of 1524) PASS: lldb-shell :: ObjectFile/PECOFF/sections.yaml (910 of 1524) PASS: lldb-api :: functionalities/gdb_remote_client/TestRegDefinitionInParts.py (911 of 1524) PASS: lldb-api :: commands/expression/import-std-module/list-dbg-info-content/TestDbgInfoContentListFromStdModule.py (912 of 1524) XFAIL: lldb-shell :: ObjectFile/PECOFF/default-triple-windows-gnu.yaml (913 of 1524) UNSUPPORTED: lldb-api :: tools/lldb-server/memory-tagging/TestGdbRemoteMemoryTagging.py (914 of 1524) UNSUPPORTED: lldb-api :: lang/objc/modules-incomplete/TestIncompleteModules.py (915 of 1524) PASS: lldb-api :: lang/cpp/wchar_t/TestCxxWCharT.py (916 of 1524) PASS: lldb-api :: functionalities/memory/find/TestMemoryFind.py (917 of 1524) PASS: lldb-api :: functionalities/paths/TestPaths.py (918 of 1524) PASS: lldb-api :: commands/expression/inline-namespace/TestInlineNamespace.py (919 of 1524) PASS: lldb-api :: lang/cpp/breakpoint-commands/TestCPPBreakpointCommands.py (920 of 1524) PASS: lldb-api :: python_api/breakpoint/TestBreakpointAPI.py (921 of 1524) UNSUPPORTED: lldb-shell :: Breakpoint/ppc64-localentry.test (922 of 1524) UNSUPPORTED: lldb-shell :: SymbolFile/PDB/func-symbols.test (923 of 1524) PASS: lldb-api :: functionalities/tail_call_frames/disambiguate_paths_to_common_sink/TestDisambiguatePathsToCommonSink.py (924 of 1524) PASS: lldb-api :: lang/objc/objc-foundation-dictionary-empty/TestNSDictionary0.py (925 of 1524) UNSUPPORTED: lldb-shell :: Unwind/split-machine-functions.test (926 of 1524) PASS: lldb-api :: lang/cpp/incompatible-class-templates/TestCppIncompatibleClassTemplates.py (927 of 1524) PASS: lldb-api :: sanity/TestSettingSkipping.py (928 of 1524) PASS: lldb-api :: functionalities/data-formatter/data-formatter-stl/generic/list/loop/TestDataFormatterGenericListLoop.py (929 of 1524) PASS: lldb-api :: lang/cpp/subst_template_type_param/TestSubstTemplateTypeParam.py (930 of 1524) PASS: lldb-shell :: ObjectFile/ELF/PT_LOAD-overlap-PT_TLS.yaml (931 of 1524) PASS: lldb-shell :: Watchpoint/SetErrorCases.test (932 of 1524) PASS: lldb-api :: functionalities/data-formatter/data-formatter-objc/TestDataFormatterObjCPlain.py (933 of 1524) PASS: lldb-shell :: SymbolFile/Breakpad/symtab-macho.test (934 of 1524) PASS: lldb-shell :: Unwind/eh-frame-dwarf-unwind.test (935 of 1524) PASS: lldb-api :: test_utils/TestInlineTest.py (936 of 1524) PASS: lldb-api :: commands/expression/call-function/TestCallBuiltinFunction.py (937 of 1524) PASS: lldb-shell :: ObjectFile/ELF/minidebuginfo-corrupt-xz.yaml (938 of 1524) PASS: lldb-api :: lang/cpp/crtp/TestCppCRTP.py (939 of 1524) PASS: lldb-shell :: SymbolFile/Breakpad/stack-cfi-arm.yaml (940 of 1524) PASS: lldb-api :: functionalities/thread/concurrent_events/TestConcurrentCrashWithSignal.py (941 of 1524) PASS: lldb-api :: functionalities/data-formatter/data-formatter-globals/TestDataFormatterGlobals.py (942 of 1524) PASS: lldb-api :: lang/c/step_over_no_deadlock/TestStepOverDoesntBlock.py (943 of 1524) PASS: lldb-api :: functionalities/set-data/TestSetData.py (944 of 1524) XFAIL: lldb-shell :: Register/x86-mm-xmm-write.test (945 of 1524) PASS: lldb-api :: functionalities/breakpoint/address_breakpoints/TestBadAddressBreakpoints.py (946 of 1524) UNSUPPORTED: lldb-api :: lang/cpp/modules-import/TestCXXModulesImport.py (947 of 1524) PASS: lldb-shell :: Breakpoint/case-sensitive.test (948 of 1524) PASS: lldb-shell :: Driver/LocalLLDBInit.test (949 of 1524) PASS: lldb-api :: functionalities/breakpoint/auto_continue/TestBreakpointAutoContinue.py (950 of 1524) UNSUPPORTED: lldb-api :: linux/aarch64/mte_tag_faults/TestAArch64LinuxMTEMemoryTagFaults.py (951 of 1524) UNSUPPORTED: lldb-shell :: SymbolFile/PDB/variables-locations.test (952 of 1524) PASS: lldb-api :: functionalities/wrong_commands/TestWrongCommands.py (953 of 1524) PASS: lldb-api :: commands/expression/save_jit_objects/TestSaveJITObjects.py (954 of 1524) PASS: lldb-api :: commands/expression/char/TestExprsChar.py (955 of 1524) PASS: lldb-shell :: Reproducer/TestHomeDir.test (956 of 1524) PASS: lldb-api :: functionalities/data-formatter/typedef_array/TestTypedefArray.py (957 of 1524) PASS: lldb-api :: lang/objc/direct-dispatch-step/TestObjCDirectDispatchStepping.py (958 of 1524) UNSUPPORTED: lldb-api :: linux/aarch64/tagged_memory_region/TestAArch64LinuxTaggedMemoryRegion.py (959 of 1524) UNSUPPORTED: lldb-api :: functionalities/thread/concurrent_events/TestConcurrentTwoWatchpointsOneSignal.py (960 of 1524) PASS: lldb-api :: functionalities/thread/jump/TestThreadJump.py (961 of 1524) UNSUPPORTED: lldb-shell :: SymbolFile/NativePDB/load-pdb.cpp (962 of 1524) PASS: lldb-api :: functionalities/data-formatter/data-formatter-stl/libcxx/tuple/TestDataFormatterLibcxxTuple.py (963 of 1524) PASS: lldb-api :: lang/c/forward/TestForwardDeclaration.py (964 of 1524) PASS: lldb-api :: iohandler/resize/TestIOHandlerResizeNoEditline.py (965 of 1524) UNSUPPORTED: lldb-shell :: SymbolFile/PDB/expressions.test (966 of 1524) PASS: lldb-api :: functionalities/breakpoint/hardware_breakpoints/require_hw_breakpoints/TestRequireHWBreakpoints.py (967 of 1524) PASS: lldb-api :: tools/lldb-vscode/console/TestVSCode_redirection_to_console.py (968 of 1524) UNSUPPORTED: lldb-api :: functionalities/thread/create_during_step/TestCreateDuringStep.py (969 of 1524) PASS: lldb-api :: python_api/objc_type/TestObjCType.py (970 of 1524) PASS: lldb-api :: functionalities/thread/thread_exit/TestThreadExit.py (971 of 1524) PASS: lldb-shell :: ObjectFile/ELF/riscv-arch.yaml (972 of 1524) PASS: lldb-api :: functionalities/postmortem/elf-core/gcore/TestGCore.py (973 of 1524) PASS: lldb-api :: commands/expression/vector_of_enums/TestVectorOfEnums.py (974 of 1524) UNSUPPORTED: lldb-api :: commands/watchpoints/watchpoint_count/TestWatchpointCount.py (975 of 1524) PASS: lldb-api :: commands/expression/pr35310/TestExprsBug35310.py (976 of 1524) PASS: lldb-api :: functionalities/tail_call_frames/cross_object/TestCrossObjectTailCalls.py (977 of 1524) UNSUPPORTED: lldb-api :: functionalities/tsan/thread_leak/TestTsanThreadLeak.py (978 of 1524) PASS: lldb-api :: lang/cpp/scratch-context-merging/structs/TestCppScratchContextMergingStructs.py (979 of 1524) PASS: lldb-api :: lang/objc/objc-ivar-protocols/TestIvarProtocols.py (980 of 1524) PASS: lldb-api :: functionalities/exec/TestExec.py (981 of 1524) UNSUPPORTED: lldb-api :: functionalities/data-formatter/data-formatter-stl/libstdcpp/vbool/TestDataFormatterStdVBool.py (982 of 1524) PASS: lldb-api :: iohandler/stdio/TestIOHandlerProcessSTDIO.py (983 of 1524) PASS: lldb-api :: lang/cpp/stl/TestStdCXXDisassembly.py (984 of 1524) PASS: lldb-api :: commands/platform/file/close/TestPlatformFileClose.py (985 of 1524) PASS: lldb-api :: lang/cpp/static_member_type_depending_on_parent_size/TestStaticMemberTypeDependingOnParentSize.py (986 of 1524) PASS: lldb-api :: commands/gui/basic/TestGuiBasic.py (987 of 1524) PASS: lldb-api :: qemu/TestQemuAPI.py (988 of 1524) PASS: lldb-api :: commands/process/continue_to_bkpt/TestContinueToBkpts.py (989 of 1524) PASS: lldb-api :: linux/aarch64/mte_core_file/TestAArch64LinuxMTEMemoryTagCoreFile.py (990 of 1524) PASS: lldb-api :: python_api/sbmodule/TestSBModule.py (991 of 1524) PASS: lldb-api :: lang/cpp/unsigned_types/TestUnsignedTypes.py (992 of 1524) PASS: lldb-api :: python_api/get-value-32bit-int/TestGetValue32BitInt.py (993 of 1524) UNSUPPORTED: lldb-shell :: SymbolFile/DWARF/x86/DW_TAG_GNU_call_site-DW_AT_low_pc.s (994 of 1524) PASS: lldb-shell :: Breakpoint/dummy-target.test (995 of 1524) UNSUPPORTED: lldb-shell :: Register/x86-64-zmm-write.test (996 of 1524) PASS: lldb-api :: functionalities/breakpoint/serialize/TestBreakpointSerialization.py (997 of 1524) FAIL: lldb-api :: functionalities/scripted_process/TestStackCoreScriptedProcess.py (998 of 1524) ******************** TEST 'lldb-api :: functionalities/scripted_process/TestStackCoreScriptedProcess.py' FAILED ******************** Script: -- /Applications/Xcode.app/Contents/Developer/Library/Frameworks/Python3.framework/Versions/3.8/bin/python3.8 /Users/buildslave/jenkins/workspace/lldb-cmake-matrix/llvm-project/lldb/test/API/dotest.py -u CXXFLAGS -u CFLAGS --codesign-identity lldb_codesign --arch x86_64 --build-dir /Users/buildslave/jenkins/workspace/lldb-cmake-matrix/lldb-build/lldb-test-build.noindex -t --env TERM=vt100 --skip-category gmodules --skip-category watchpoint --skip-category llgs --skip-category debugserver --arch=x86_64 --env LLVM_LIBS_DIR=/Users/buildslave/jenkins/workspace/lldb-cmake-matrix/lldb-build/./lib --env LLVM_INCLUDE_DIR=/Users/buildslave/jenkins/workspace/lldb-cmake-matrix/lldb-build/include --env LLVM_TOOLS_DIR=/Users/buildslave/jenkins/workspace/lldb-cmake-matrix/lldb-build/./bin --hermetic-libcxx --arch x86_64 --build-dir /Users/buildslave/jenkins/workspace/lldb-cmake-matrix/lldb-build/lldb-test-build.noindex --lldb-module-cache-dir /Users/buildslave/jenkins/workspace/lldb-cmake-matrix/lldb-build/lldb-test-build.noindex/module-cache-lldb/lldb-api --clang-module-cache-dir /Users/buildslave/jenkins/workspace/lldb-cmake-matrix/lldb-build/lldb-test-build.noindex/module-cache-clang/lldb-api --executable /Users/buildslave/jenkins/workspace/lldb-cmake-matrix/lldb-build/./bin/lldb --compiler /Users/buildslave/jenkins/workspace/lldb-cmake-matrix/clang_1300_build/bin/clang --dsymutil /Users/buildslave/jenkins/workspace/lldb-cmake-matrix/lldb-build/./bin/dsymutil --llvm-tools-dir /Users/buildslave/jenkins/workspace/lldb-cmake-matrix/lldb-build/./bin --lldb-libs-dir /Users/buildslave/jenkins/workspace/lldb-cmake-matrix/lldb-build/./lib /Users/buildslave/jenkins/workspace/lldb-cmake-matrix/llvm-project/lldb/test/API/functionalities/scripted_process -p TestStackCoreScriptedProcess.py -- Exit Code: 1

Hide Details

Command Output (stdout): -- lldb version 16.0.99git (http://labmaster3.local/git/llvm-project.git revision b3f1a6bf1080fb67cb1760a924a56d38d51211aa) clang revision b3f1a6bf1080fb67cb1760a924a56d38d51211aa llvm revision b3f1a6bf1080fb67cb1760a924a56d38d51211aa Name of the class that will manage the scripted process: 'stack_core_scripted_process.StackCoreScriptedProcess' Skipping the following test categories: ['gmodules', 'watchpoint', 'llgs', 'debugserver', 'libstdcxx', 'dwo', 'llgs', 'fork'] Saving 8192 bytes of data for memory region at 0x70000ae13000 Saving 4096 bytes of data for memory region at 0x70000ae97000 Saving 8192 bytes of data for memory region at 0x7ffeefbf5000 Saving 16384 bytes of data for memory region at 0x7ffeefbfc000

Hide Details

-- Command Output (stderr): -- Change dir to: /Users/buildslave/jenkins/workspace/lldb-cmake-matrix/llvm-project/lldb/test/API/functionalities/scripted_process runCmd: settings clear -all output:

Hide Details

runCmd: settings set symbols.enable-external-lookup false output:

Hide Details

runCmd: settings set target.inherit-tcc true output:

Hide Details

runCmd: settings set target.detach-on-error false output:

Hide Details

runCmd: settings set target.auto-apply-fixits false output:

Hide Details

runCmd: settings set plugin.process.gdb-remote.packet-timeout 60 output:

Hide Details

runCmd: settings set symbols.clang-modules-cache-path "/Users/buildslave/jenkins/workspace/lldb-cmake-matrix/lldb-build/lldb-test-build.noindex/module-cache-lldb/lldb-api" output:

Hide Details

runCmd: settings set use-color false output:

Hide Details

runCmd: setting set target.prefer-dynamic-value no-dynamic-values output:

Hide Details

make VPATH=/Users/buildslave/jenkins/workspace/lldb-cmake-matrix/llvm-project/lldb/test/API/functionalities/scripted_process -C /Users/buildslave/jenkins/workspace/lldb-cmake-matrix/lldb-build/lldb-test-build.noindex/functionalities/scripted_process/TestStackCoreScriptedProcess.test_launch_scripted_process_stack_frames -I /Users/buildslave/jenkins/workspace/lldb-cmake-matrix/llvm-project/lldb/test/API/functionalities/scripted_process -I /Users/buildslave/jenkins/workspace/lldb-cmake-matrix/llvm-project/lldb/packages/Python/lldbsuite/test/make -f /Users/buildslave/jenkins/workspace/lldb-cmake-matrix/llvm-project/lldb/test/API/functionalities/scripted_process/Makefile all ARCH=x86_64 'CC="/Users/buildslave/jenkins/workspace/lldb-cmake-matrix/clang_1300_build/bin/clang"' DSYMUTIL=/Users/buildslave/jenkins/workspace/lldb-cmake-matrix/lldb-build/./bin/dsymutil CODESIGN=codesign CLANG_MODULE_CACHE_DIR=/Users/buildslave/jenkins/workspace/lldb-cmake-matrix/lldb-build/lldb-test-build.noindex/module-cache-clang/lldb-api USE_HERMETIC_LIBCPP=1

Hide Details

/Applications/Xcode.app/Contents/Developer/usr/bin/make -f /Users/buildslave/jenkins/workspace/lldb-cmake-matrix/llvm-project/lldb/packages/Python/lldbsuite/test/make/Makefile.rules ARCH=x86_64 \ DYLIB_ONLY=YES DYLIB_NAME=baz DYLIB_C_SOURCES=baz.c "/Users/buildslave/jenkins/workspace/lldb-cmake-matrix/clang_1300_build/bin/clang" -g -O0 -isysroot "/Applications/Xcode.app/Contents/Developer/Platforms/MacOSX.platform/Developer/SDKs/MacOSX11.1.sdk" -arch x86_64 -I/Users/buildslave/jenkins/workspace/lldb-cmake-matrix/llvm-project/lldb/packages/Python/lldbsuite/test/make/../../../../../include -I/Users/buildslave/jenkins/workspace/lldb-cmake-matrix/llvm-project/lldb/packages/Python/lldbsuite/test/make -I/Users/buildslave/jenkins/workspace/lldb-cmake-matrix/llvm-project/lldb/packages/Python/lldbsuite/test/make -include /Users/buildslave/jenkins/workspace/lldb-cmake-matrix/llvm-project/lldb/packages/Python/lldbsuite/test/make/test_common.h -fno-limit-debug-info -DCOMPILING_LLDB_TEST_DLL -fPIC -MT baz.o -MD -MP -MF baz.d -c -o baz.o /Users/buildslave/jenkins/workspace/lldb-cmake-matrix/llvm-project/lldb/test/API/functionalities/scripted_process/baz.c "/Users/buildslave/jenkins/workspace/lldb-cmake-matrix/clang_1300_build/bin/clang" baz.o -g -O0 -isysroot "/Applications/Xcode.app/Contents/Developer/Platforms/MacOSX.platform/Developer/SDKs/MacOSX11.1.sdk" -arch x86_64 -I/Users/buildslave/jenkins/workspace/lldb-cmake-matrix/llvm-project/lldb/packages/Python/lldbsuite/test/make/../../../../../include -I/Users/buildslave/jenkins/workspace/lldb-cmake-matrix/llvm-project/lldb/packages/Python/lldbsuite/test/make -I/Users/buildslave/jenkins/workspace/lldb-cmake-matrix/llvm-project/lldb/packages/Python/lldbsuite/test/make -include /Users/buildslave/jenkins/workspace/lldb-cmake-matrix/llvm-project/lldb/packages/Python/lldbsuite/test/make/test_common.h -fno-limit-debug-info --driver-mode=g++ -install_name "@executable_path/libbaz.dylib" -dynamiclib -o "libbaz.dylib" codesign -s - "libbaz.dylib" "/Users/buildslave/jenkins/workspace/lldb-cmake-matrix/lldb-build/./bin/dsymutil" "libbaz.dylib" "/Users/buildslave/jenkins/workspace/lldb-cmake-matrix/clang_1300_build/bin/clang" -std=c++11 -g -O0 -isysroot "/Applications/Xcode.app/Contents/Developer/Platforms/MacOSX.platform/Developer/SDKs/MacOSX11.1.sdk" -arch x86_64 -I/Users/buildslave/jenkins/workspace/lldb-cmake-matrix/llvm-project/lldb/packages/Python/lldbsuite/test/make/../../../../../include -I/Users/buildslave/jenkins/workspace/lldb-cmake-matrix/llvm-project/lldb/test/API/functionalities/scripted_process -I/Users/buildslave/jenkins/workspace/lldb-cmake-matrix/llvm-project/lldb/packages/Python/lldbsuite/test/make -include /Users/buildslave/jenkins/workspace/lldb-cmake-matrix/llvm-project/lldb/packages/Python/lldbsuite/test/make/test_common.h -fno-limit-debug-info --driver-mode=g++ -MT main.o -MD -MP -MF main.d -c -o main.o /Users/buildslave/jenkins/workspace/lldb-cmake-matrix/llvm-project/lldb/test/API/functionalities/scripted_process/main.cpp "/Users/buildslave/jenkins/workspace/lldb-cmake-matrix/clang_1300_build/bin/clang" main.o -g -O0 -isysroot "/Applications/Xcode.app/Contents/Developer/Platforms/MacOSX.platform/Developer/SDKs/MacOSX11.1.sdk" -arch x86_64 -I/Users/buildslave/jenkins/workspace/lldb-cmake-matrix/llvm-project/lldb/packages/Python/lldbsuite/test/make/../../../../../include -I/Users/buildslave/jenkins/workspace/lldb-cmake-matrix/llvm-project/lldb/test/API/functionalities/scripted_process -I/Users/buildslave/jenkins/workspace/lldb-cmake-matrix/llvm-project/lldb/packages/Python/lldbsuite/test/make -include /Users/buildslave/jenkins/workspace/lldb-cmake-matrix/llvm-project/lldb/packages/Python/lldbsuite/test/make/test_common.h -fno-limit-debug-info -L. -lbaz -I. --driver-mode=g++ -o "a.out" codesign -s - "a.out" "/Users/buildslave/jenkins/workspace/lldb-cmake-matrix/lldb-build/./bin/dsymutil" -o "a.out.dSYM" "a.out"

Hide Details

Hide Details

Adding tearDown hook: def cleanup(): del os.environ["SKIP_SCRIPTED_PROCESS_LAUNCH"]

Hide Details

Hide Details

runCmd: command script import /Users/buildslave/jenkins/workspace/lldb-cmake-matrix/llvm-project/lldb/test/API/functionalities/scripted_process/stack_core_scripted_process.py output:

Hide Details

make VPATH=/Users/buildslave/jenkins/workspace/lldb-cmake-matrix/llvm-project/lldb/test/API/functionalities/scripted_process -C /Users/buildslave/jenkins/workspace/lldb-cmake-matrix/lldb-build/lldb-test-build.noindex/functionalities/scripted_process/TestStackCoreScriptedProcess.test_launch_scripted_process_stack_frames -I /Users/buildslave/jenkins/workspace/lldb-cmake-matrix/llvm-project/lldb/test/API/functionalities/scripted_process -I /Users/buildslave/jenkins/workspace/lldb-cmake-matrix/llvm-project/lldb/packages/Python/lldbsuite/test/make -f /Users/buildslave/jenkins/workspace/lldb-cmake-matrix/llvm-project/lldb/test/API/functionalities/scripted_process/Makefile all ARCH=x86_64 'CC="/Users/buildslave/jenkins/workspace/lldb-cmake-matrix/clang_1300_build/bin/clang"' DSYMUTIL=/Users/buildslave/jenkins/workspace/lldb-cmake-matrix/lldb-build/./bin/dsymutil CODESIGN=codesign CLANG_MODULE_CACHE_DIR=/Users/buildslave/jenkins/workspace/lldb-cmake-matrix/lldb-build/lldb-test-build.noindex/module-cache-clang/lldb-api USE_HERMETIC_LIBCPP=1

Hide Details

make: Nothing to be done for `all'.

Hide Details

Hide Details

runCmd: process save-core -s stack /var/folders/09/r4vw4v8n5kb67jl66zvlbljw0000gn/T/lit-tmp-ex0cxt48/tmpgqdsgouh output: Modified-memory or stack-memory only corefile created. This corefile may not show library/framework/app binaries on a different system, or when those binaries have been updated/modified. Copies are not included in this corefile. Use --style full to include all process memory.

Hide Details

Hide Details

FAIL: LLDB (/Users/buildslave/jenkins/workspace/lldb-cmake-matrix/clang_1300_build/bin/clang-x86_64) :: test_launch_scripted_process_stack_frames (TestStackCoreScriptedProcess.StackCoreScriptedProcesTestCase) <bound method SBProcess.Kill of SBProcess: pid = 42, state = stopped, threads = 2, executable = a.out>: success

Hide Details

<bound method SBProcess.Kill of SBProcess: pid = 0, state = stopped, threads = 2, executable = a.out>: success

Hide Details

Executing tearDown hook: def cleanup(): del os.environ["SKIP_SCRIPTED_PROCESS_LAUNCH"]

Hide Details

Hide Details

Restore dir to: /Users/buildslave/jenkins/workspace/lldb-cmake-matrix/lldb-build/tools/lldb/test ====================================================================== FAIL: test_launch_scripted_process_stack_frames (TestStackCoreScriptedProcess.StackCoreScriptedProcesTestCase) Test that we can launch an lldb scripted process from the command ---------------------------------------------------------------------- Traceback (most recent call last): File "/Users/buildslave/jenkins/workspace/lldb-cmake-matrix/llvm-project/lldb/packages/Python/lldbsuite/test/decorators.py", line 155, in wrapper return func(*args, **kwargs) File "/Users/buildslave/jenkins/workspace/lldb-cmake-matrix/llvm-project/lldb/test/API/functionalities/scripted_process/TestStackCoreScriptedProcess.py", line 119, in test_launch_scripted_process_stack_frames self.assertEqual(int(frame.vars.GetFirstValueByName('j').GetValue()), 42 * 42) AssertionError: 42 != 1764 Config=x86_64-/Users/buildslave/jenkins/workspace/lldb-cmake-matrix/clang_1300_build/bin/clang ---------------------------------------------------------------------- Ran 1 test in 4.996s

Hide Details

RESULT: FAILED (0 passes, 1 failures, 0 errors, 0 skipped, 0 expected failures, 0 unexpected successes)

Hide Details

--

Hide Details

******************** PASS: lldb-shell :: ObjectFile/PECOFF/default-triple-windows-msvc.yaml (999 of 1524) UNSUPPORTED: lldb-api :: linux/aarch64/mte_memory_region/TestAArch64LinuxMTEMemoryRegion.py (1000 of 1524) PASS: lldb-api :: python_api/signals/TestSignalsAPI.py (1001 of 1524) PASS: lldb-shell :: SymbolFile/DWARF/x86/childless-compile-unit.s (1002 of 1524) PASS: lldb-api :: functionalities/ptr_refs/TestPtrRefs.py (1003 of 1524) UNSUPPORTED: lldb-api :: functionalities/thread/state/TestThreadStates.py (1004 of 1524) PASS: lldb-api :: functionalities/data-formatter/data-formatter-objc/TestDataFormatterObjCCF.py (1005 of 1524) PASS: lldb-api :: python_api/function_symbol/TestDisasmAPI.py (1006 of 1524) UNSUPPORTED: lldb-api :: commands/register/register/aarch64_dynamic_regset/TestArm64DynamicRegsets.py (1007 of 1524) PASS: lldb-shell :: Register/Core/x86-32-linux-multithread.test (1008 of 1524) UNSUPPORTED: lldb-shell :: SymbolFile/NativePDB/globals-fundamental.cpp (1009 of 1524) UNSUPPORTED: lldb-shell :: SymbolFile/DWARF/x86/debug_ranges_and_rnglists.test (1010 of 1524) PASS: lldb-api :: commands/expression/import-std-module/vector-of-vectors/TestVectorOfVectorsFromStdModule.py (1011 of 1524) PASS: lldb-api :: functionalities/disassemble/aarch64-adrp-add/TestAArch64AdrpAdd.py (1012 of 1524) PASS: lldb-api :: assert_messages_test/TestAssertMessages.py (1013 of 1524) UNSUPPORTED: lldb-api :: functionalities/thread/concurrent_events/TestConcurrentSignalWatch.py (1014 of 1524) PASS: lldb-api :: types/TestCharTypeExpr.py (1015 of 1524) UNSUPPORTED: lldb-shell :: Subprocess/fork-follow-child-wp.test (1016 of 1524) PASS: lldb-shell :: SymbolFile/DWARF/x86/debug_line-relative_path.s (1017 of 1524) PASS: lldb-api :: macosx/unregistered-macho/TestUnregisteredMacho.py (1018 of 1524) PASS: lldb-api :: lang/objc/modules-objc-property/TestModulesObjCProperty.py (1019 of 1524) UNSUPPORTED: lldb-shell :: SymbolFile/NativePDB/globals-bss.cpp (1020 of 1524) UNSUPPORTED: lldb-shell :: SymbolFile/DWARF/x86/dir-separator-windows.s (1021 of 1524) UNSUPPORTED: lldb-shell :: SymbolFile/NativePDB/local-variables.cpp (1022 of 1524) PASS: lldb-api :: functionalities/data-formatter/ptr_ref_typedef/TestPtrRef2Typedef.py (1023 of 1524) PASS: lldb-api :: functionalities/data-formatter/data-formatter-stl/libcxx/shared_ptr/TestDataFormatterLibcxxSharedPtr.py (1024 of 1524) PASS: lldb-api :: commands/expression/dollar-in-variable/TestDollarInVariable.py (1025 of 1524) UNSUPPORTED: lldb-shell :: Subprocess/clone-follow-parent-wp.test (1026 of 1524) PASS: lldb-api :: python_api/file_handle/TestFileHandle.py (1027 of 1524) PASS: lldb-shell :: ScriptInterpreter/Python/eof.test (1028 of 1524) PASS: lldb-api :: functionalities/value_md5_crash/TestValueMD5Crash.py (1029 of 1524) PASS: lldb-api :: commands/disassemble/basic/TestDisassembleBreakpoint.py (1030 of 1524) PASS: lldb-api :: functionalities/breakpoint/move_nearest/TestMoveNearest.py (1031 of 1524) PASS: lldb-shell :: Driver/TestRepl.test (1032 of 1524) PASS: lldb-api :: macosx/load-kext/TestLoadKext.py (1033 of 1524) PASS: lldb-shell :: Driver/TestCore.test (1034 of 1524) PASS: lldb-shell :: ObjectFile/PECOFF/basic-info-arm.yaml (1035 of 1524) UNSUPPORTED: lldb-shell :: SymbolFile/PDB/variables.test (1036 of 1524) PASS: lldb-api :: python_api/debugger/TestDebuggerAPI.py (1037 of 1524) PASS: lldb-shell :: Unwind/trap_frame_sym_ctx.test (1038 of 1524) PASS: lldb-api :: linux/aarch64/non_address_bit_memory_access/TestAArch64LinuxNonAddressBitMemoryAccess.py (1039 of 1524) PASS: lldb-api :: python_api/class_members/TestSBTypeClassMembers.py (1040 of 1524) UNSUPPORTED: lldb-api :: commands/watchpoints/multi_watchpoint_slots/TestWatchpointMultipleSlots.py (1041 of 1524) PASS: lldb-api :: functionalities/backticks/TestBackticksWithoutATarget.py (1042 of 1524) UNSUPPORTED: lldb-shell :: ScriptInterpreter/Lua/nested_sessions.test (1043 of 1524) UNSUPPORTED: lldb-shell :: SymbolFile/NativePDB/function-types-builtins.cpp (1044 of 1524) PASS: lldb-api :: types/TestLongTypes.py (1045 of 1524) PASS: lldb-api :: macosx/safe-to-func-call/TestSafeFuncCalls.py (1046 of 1524) UNSUPPORTED: lldb-api :: functionalities/thread/break_after_join/TestBreakAfterJoin.py (1047 of 1524) UNSUPPORTED: lldb-api :: commands/watchpoints/watchpoint_on_vectors/TestValueOfVectorVariable.py (1048 of 1524) PASS: lldb-shell :: ScriptInterpreter/Python/sb_address_exception.test (1049 of 1524) PASS: lldb-api :: lang/c/strings/TestCStrings.py (1050 of 1524) PASS: lldb-shell :: SymbolFile/DWARF/x86/DW_OP_deref_size_static_var.s (1051 of 1524) UNSUPPORTED: lldb-shell :: Commands/command-target-create-resolve-exe.test (1052 of 1524) UNSUPPORTED: lldb-api :: commands/watchpoints/watchpoint_size/TestWatchpointSizes.py (1053 of 1524) UNSUPPORTED: lldb-api :: commands/register/register/aarch64_sve_registers/rw_access_static_config/TestSVERegisters.py (1054 of 1524) PASS: lldb-api :: types/TestIntegerTypeExpr.py (1055 of 1524) PASS: lldb-api :: lang/objc/foundation/TestConstStrings.py (1056 of 1524) PASS: lldb-api :: types/TestCharType.py (1057 of 1524) UNSUPPORTED: lldb-shell :: Subprocess/fork-follow-child-softbp.test (1058 of 1524) UNSUPPORTED: lldb-shell :: SymbolFile/NativePDB/ast-functions.cpp (1059 of 1524) PASS: lldb-api :: functionalities/breakpoint/two_hits_one_actual/TestTwoHitsOneActual.py (1060 of 1524) PASS: lldb-shell :: SymbolFile/DWARF/x86/DW_AT_loclists_base.s (1061 of 1524) PASS: lldb-shell :: Driver/TestNoUseColor.test (1062 of 1524) PASS: lldb-api :: python_api/lldbutil/iter/TestRegistersIterator.py (1063 of 1524) PASS: lldb-shell :: Commands/command-script-import.test (1064 of 1524) PASS: lldb-shell :: SymbolFile/DWARF/x86/debug_static-member-anonymous-namespace.s (1065 of 1524) PASS: lldb-api :: lang/c/modules/TestCModules.py (1066 of 1524) PASS: lldb-api :: functionalities/breakpoint/dummy_target_breakpoints/TestBreakpointsWithNoTargets.py (1067 of 1524) PASS: lldb-api :: commands/apropos/with-process/TestAproposWithProcess.py (1068 of 1524) PASS: lldb-api :: tools/lldb-vscode/console/TestVSCode_console.py (1069 of 1524) PASS: lldb-api :: functionalities/unwind/sigtramp/TestSigtrampUnwind.py (1070 of 1524) PASS: lldb-api :: commands/expression/completion-crash-incomplete-record/TestCompletionCrashIncompleteRecord.py (1071 of 1524) UNSUPPORTED: lldb-api :: commands/watchpoints/hello_watchpoint/TestMyFirstWatchpoint.py (1072 of 1524) PASS: lldb-api :: lang/cpp/default-template-args/TestDefaultTemplateArgs.py (1073 of 1524) UNSUPPORTED: lldb-shell :: Register/x86-64-ymm16-write.test (1074 of 1524) PASS: lldb-shell :: SymbolFile/DWARF/anon_class_w_and_wo_export_symbols.ll (1075 of 1524) PASS: lldb-api :: lang/objc/real-definition/TestRealDefinition.py (1076 of 1524) PASS: lldb-api :: commands/frame/diagnose/array/TestArray.py (1077 of 1524) PASS: lldb-shell :: Breakpoint/debug_addrx.test (1078 of 1524) PASS: lldb-shell :: Register/x86-64-read.test (1079 of 1524) PASS: lldb-shell :: Settings/TestEchoCommands.test (1080 of 1524) UNSUPPORTED: lldb-api :: commands/expression/namespace_local_var_same_name_obj_c/TestNamespaceLocalVarSameNameObjC.py (1081 of 1524) UNSUPPORTED: lldb-api :: python_api/watchpoint/TestSetWatchpoint.py (1082 of 1524) UNSUPPORTED: lldb-shell :: SymbolFile/DWARF/x86/dwarf5-partial-index.cpp (1083 of 1524) PASS: lldb-shell :: ScriptInterpreter/Python/fail_breakpoint_oneline.test (1084 of 1524) PASS: lldb-api :: lang/objc/objc-ivar-stripped/TestObjCIvarStripped.py (1085 of 1524) PASS: lldb-api :: functionalities/data-formatter/synthcapping/TestSyntheticCapping.py (1086 of 1524) PASS: lldb-api :: functionalities/data-formatter/data-formatter-stl/libcxx/atomic/TestLibCxxAtomic.py (1087 of 1524) PASS: lldb-api :: commands/command/script/TestCommandScript.py (1088 of 1524) PASS: lldb-api :: lang/cpp/frame-var-anon-unions/TestFrameVariableAnonymousUnions.py (1089 of 1524) UNSUPPORTED: lldb-api :: commands/trace/TestTraceExport.py (1090 of 1524) UNSUPPORTED: lldb-shell :: SymbolFile/NativePDB/inline_sites.test (1091 of 1524) PASS: lldb-api :: lang/objc/foundation/TestFoundationDisassembly.py (1092 of 1524) PASS: lldb-api :: functionalities/data-formatter/data-formatter-script/TestDataFormatterScript.py (1093 of 1524) PASS: lldb-shell :: ScriptInterpreter/None/import_module.test (1094 of 1524) PASS: lldb-api :: functionalities/data-formatter/data-formatter-objc/TestDataFormatterObjCNSContainer.py (1095 of 1524) PASS: lldb-api :: commands/frame/language/TestGuessLanguage.py (1096 of 1524) PASS: lldb-api :: python_api/sbenvironment/TestSBEnvironment.py (1097 of 1524) UNSUPPORTED: lldb-api :: lua_api/TestLuaAPI.py (1098 of 1524) PASS: lldb-shell :: Register/Core/x86-32-linux-addr.test (1099 of 1524) PASS: lldb-api :: functionalities/data-formatter/nsarraysynth/TestNSArraySynthetic.py (1100 of 1524) PASS: lldb-api :: python_api/process/TestProcessAPI.py (1101 of 1524) PASS: lldb-shell :: Commands/command-disassemble-process.yaml (1102 of 1524) PASS: lldb-api :: commands/target/modules/search-paths/insert/TestTargetModulesSearchpathsInsert.py (1103 of 1524) PASS: lldb-shell :: Quit/TestQuitExitCodeHexA.test (1104 of 1524) UNSUPPORTED: lldb-shell :: Unwind/unwind-plan-dwarf-dump.test (1105 of 1524) PASS: lldb-api :: functionalities/breakpoint/break_in_loaded_dylib/TestBreakInLoadedDylib.py (1106 of 1524) UNSUPPORTED: lldb-api :: lang/objc/rdar-12408181/TestRdar12408181.py (1107 of 1524) PASS: lldb-shell :: ObjectFile/PECOFF/settings-abi.yaml (1108 of 1524) UNSUPPORTED: lldb-api :: macosx/lc-note/addrable-bits/TestAddrableBitsCorefile.py (1109 of 1524) PASS: lldb-shell :: ObjectFile/PECOFF/basic-info.yaml (1110 of 1524) UNSUPPORTED: lldb-shell :: Subprocess/fork-follow-parent-softbp.test (1111 of 1524) PASS: lldb-api :: python_api/disassemble-raw-data/TestDisassembleRawData.py (1112 of 1524) UNSUPPORTED: lldb-shell :: SymbolFile/PDB/pointers.test (1113 of 1524) UNSUPPORTED: lldb-api :: functionalities/postmortem/FreeBSDKernel/TestFreeBSDKernelLive.py (1114 of 1524) PASS: lldb-api :: tools/lldb-vscode/module/TestVSCode_module.py (1115 of 1524) UNSUPPORTED: lldb-shell :: SymbolFile/NativePDB/locate-pdb.cpp (1116 of 1524) PASS: lldb-api :: commands/breakpoint/command/list/TestBreakpointCommandList.py (1117 of 1524) UNSUPPORTED: lldb-shell :: ExecControl/StopHook/stop-hook-threads.test (1118 of 1524) UNSUPPORTED: lldb-api :: functionalities/process_save_core_minidump/TestProcessSaveCoreMinidump.py (1119 of 1524) UNSUPPORTED: lldb-api :: functionalities/thread/concurrent_events/TestConcurrentSignalNWatchNBreak.py (1120 of 1524) UNSUPPORTED: lldb-api :: python_api/watchpoint/condition/TestWatchpointConditionAPI.py (1121 of 1524) PASS: lldb-shell :: Settings/TestFrameFormatMangling.test (1122 of 1524) UNSUPPORTED: lldb-shell :: ScriptInterpreter/Lua/command_script_import.test (1123 of 1524) UNSUPPORTED: lldb-api :: python_api/watchpoint/TestWatchpointIter.py (1124 of 1524) PASS: lldb-shell :: SymbolFile/DWARF/x86/DW_TAG_variable-DW_AT_const_value.s (1125 of 1524) PASS: lldb-api :: lang/objc/complete-type-check/TestObjCIsTypeComplete.py (1126 of 1524) PASS: lldb-api :: commands/expression/import-std-module/vector-dbg-info-content/TestDbgInfoContentVectorFromStdModule.py (1127 of 1524) PASS: lldb-api :: commands/command/container/TestContainerCommands.py (1128 of 1524) PASS: lldb-shell :: SymbolFile/NativePDB/lookup-by-types.cpp (1129 of 1524) PASS: lldb-shell :: SymbolFile/DWARF/deterministic-build.cpp (1130 of 1524) PASS: lldb-api :: functionalities/data-formatter/data-formatter-objc/cmtime/TestDataFormatterCMTime.py (1131 of 1524) PASS: lldb-api :: functionalities/diagnostic_reporting/TestDiagnosticReporting.py (1132 of 1524) PASS: lldb-shell :: Minidump/disassemble-no-module.yaml (1133 of 1524) PASS: lldb-api :: commands/gui/viewlarge/TestGuiViewLarge.py (1134 of 1524) PASS: lldb-api :: functionalities/thread/exit_during_step/TestExitDuringStep.py (1135 of 1524) PASS: lldb-shell :: Driver/TestProcessAttach.test (1136 of 1524) PASS: lldb-shell :: Minidump/memory-region-from-module.yaml (1137 of 1524) PASS: lldb-api :: lang/mixed/TestMixedLanguages.py (1138 of 1524) PASS: lldb-api :: lang/objc/modules-non-objc-target/TestObjCModulesNonObjCTarget.py (1139 of 1524) PASS: lldb-api :: functionalities/postmortem/elf-core/TestLinuxCore.py (1140 of 1524) UNSUPPORTED: lldb-shell :: Register/aarch64-gp-read.test (1141 of 1524) UNSUPPORTED: lldb-api :: functionalities/breakpoint/breakpoint_in_delayslot/TestAvoidBreakpointInDelaySlot.py (1142 of 1524) PASS: lldb-api :: python_api/type/TestTypeList.py (1143 of 1524) PASS: lldb-shell :: Reproducer/Modules/TestModuleCXX.test (1144 of 1524) PASS: lldb-api :: functionalities/data-formatter/data-formatter-stl/libcxx/string/simulator/TestDataFormatterLibcxxStringSimulator.py (1145 of 1524) PASS: lldb-api :: lang/cpp/namespace/TestNamespace.py (1146 of 1524) PASS: lldb-api :: functionalities/thread/step_out/TestThreadStepOut.py (1147 of 1524) UNSUPPORTED: lldb-shell :: SymbolFile/DWARF/x86/find-basic-namespace.cpp (1148 of 1524) PASS: lldb-api :: lang/cpp/unique-types/TestUniqueTypes.py (1149 of 1524) PASS: lldb-shell :: ScriptInterpreter/Python/Crashlog/no_threadState.test (1150 of 1524) PASS: lldb-shell :: ObjectFile/Breakpad/sections-trailing-func.test (1151 of 1524) PASS: lldb-shell :: ScriptInterpreter/Python/Crashlog/text.test (1152 of 1524) PASS: lldb-shell :: Settings/TestLineMarkerColor.test (1153 of 1524) PASS: lldb-shell :: Commands/command-regex-unalias.test (1154 of 1524) PASS: lldb-api :: tools/lldb-vscode/stop-hooks/TestVSCode_stop_hooks.py (1155 of 1524) UNSUPPORTED: lldb-shell :: SymbolFile/DWARF/x86/debug-types-dwo-cross-reference.cpp (1156 of 1524) PASS: lldb-api :: lang/objc/rdar-10967107/TestRdar10967107.py (1157 of 1524) UNSUPPORTED: lldb-api :: commands/expression/call-restarts/TestCallThatRestarts.py (1158 of 1524) PASS: lldb-api :: macosx/universal/TestUniversal.py (1159 of 1524) UNSUPPORTED: lldb-api :: commands/watchpoints/watchpoint_commands/command/TestWatchpointCommandLLDB.py (1160 of 1524) PASS: lldb-shell :: ObjectFile/MachO/lc_build_version_notools.yaml (1161 of 1524) PASS: lldb-api :: functionalities/thread/concurrent_events/TestConcurrentBreakpointOneDelayBreakpointThreads.py (1162 of 1524) PASS: lldb-api :: functionalities/show_location/TestShowLocationDwarf5.py (1163 of 1524) UNSUPPORTED: lldb-api :: commands/trace/TestTraceSave.py (1164 of 1524) UNSUPPORTED: lldb-shell :: Subprocess/clone-follow-parent-softbp.test (1165 of 1524) UNSUPPORTED: lldb-api :: functionalities/thread/concurrent_events/TestConcurrentManyWatchpoints.py (1166 of 1524) PASS: lldb-api :: commands/expression/rdar44436068/Test128BitsInteger.py (1167 of 1524) PASS: lldb-api :: functionalities/gdb_remote_client/TestStopPCs.py (1168 of 1524) UNSUPPORTED: lldb-shell :: SymbolFile/PDB/enums-layout.test (1169 of 1524) UNSUPPORTED: lldb-shell :: SymbolFile/DWARF/x86/find-basic-type.cpp (1170 of 1524) PASS: lldb-api :: functionalities/testid/TestTestId.py (1171 of 1524) PASS: lldb-api :: functionalities/type_lookup/TestTypeLookup.py (1172 of 1524) PASS: lldb-api :: functionalities/postmortem/minidump-new/TestMiniDumpUUID.py (1173 of 1524) PASS: lldb-api :: functionalities/inferior-crashing/recursive-inferior/TestRecursiveInferiorStep.py (1174 of 1524) PASS: lldb-api :: functionalities/gdb_remote_client/TestNoGPacketSupported.py (1175 of 1524) UNSUPPORTED: lldb-api :: functionalities/unwind/ehframe/TestEhFrameUnwind.py (1176 of 1524) PASS: lldb-api :: functionalities/lazy-loading/TestLazyLoading.py (1177 of 1524) PASS: lldb-shell :: Driver/TestFile.test (1178 of 1524) PASS: lldb-api :: commands/frame/var-scope/TestFrameVariableScope.py (1179 of 1524) PASS: lldb-shell :: Register/Core/x86-64-linux-multithread.test (1180 of 1524) PASS: lldb-api :: lang/objc/objc-struct-argument/TestObjCStructArgument.py (1181 of 1524) UNSUPPORTED: lldb-api :: benchmarks/startup/TestStartupDelays.py (1182 of 1524) PASS: lldb-api :: lang/c/set_values/TestSetValues.py (1183 of 1524) PASS: lldb-api :: functionalities/gdb_remote_client/TestPty.py (1184 of 1524) PASS: lldb-shell :: SymbolFile/Breakpad/line-table-missing-file.test (1185 of 1524) UNSUPPORTED: lldb-shell :: Subprocess/clone-follow-child-softbp.test (1186 of 1524) UNSUPPORTED: lldb-shell :: SymbolFile/dissassemble-entry-point.s (1187 of 1524) PASS: lldb-shell :: Register/x86-64-ymm-write.test (1188 of 1524) PASS: lldb-api :: functionalities/gdb_remote_client/TestProcessConnect.py (1189 of 1524) PASS: lldb-api :: commands/expression/weak_symbols/TestWeakSymbols.py (1190 of 1524) PASS: lldb-api :: macosx/find-dsym/bundle-with-dot-in-filename/TestBundleWithDotInFilename.py (1191 of 1524) PASS: lldb-shell :: SymbolFile/DWARF/x86/debug_ranges-missing-section.s (1192 of 1524) PASS: lldb-api :: functionalities/data-formatter/dump_dynamic/TestDumpDynamic.py (1193 of 1524) UNSUPPORTED: lldb-shell :: Subprocess/clone-follow-parent.test (1194 of 1524) PASS: lldb-shell :: Settings/TestDefaultModuleCachePath.test (1195 of 1524) UNSUPPORTED: lldb-api :: commands/watchpoints/hello_watchlocation/TestWatchLocation.py (1196 of 1524) PASS: lldb-api :: functionalities/target_var/no_vars/TestTargetVarNoVars.py (1197 of 1524) PASS: lldb-api :: lang/cpp/namespace_conflicts/TestNamespaceConflicts.py (1198 of 1524) PASS: lldb-shell :: Expr/TestMultilineExpr.test (1199 of 1524) UNSUPPORTED: lldb-api :: benchmarks/frame_variable/TestFrameVariableResponse.py (1200 of 1524) UNSUPPORTED: lldb-shell :: SymbolFile/PDB/function-nested-block.test (1201 of 1524) PASS: lldb-api :: commands/expression/xvalue/TestXValuePrinting.py (1202 of 1524) PASS: lldb-api :: commands/expression/import_base_class_when_class_has_derived_member/TestImportBaseClassWhenClassHasDerivedMember.py (1203 of 1524) PASS: lldb-api :: python_api/interpreter/TestRunCommandInterpreterAPI.py (1204 of 1524) PASS: lldb-api :: commands/expression/multiline-completion/TestMultilineCompletion.py (1205 of 1524) PASS: lldb-api :: commands/memory/read/TestMemoryRead.py (1206 of 1524) PASS: lldb-api :: functionalities/unwind/noreturn/module-end/TestNoReturnModuleEnd.py (1207 of 1524) PASS: lldb-shell :: ObjectFile/PECOFF/sections-names.yaml (1208 of 1524) PASS: lldb-api :: commands/apropos/basic/TestApropos.py (1209 of 1524) PASS: lldb-api :: commands/platform/basic/TestPlatformPython.py (1210 of 1524) PASS: lldb-api :: commands/settings/quoting/TestQuoting.py (1211 of 1524) PASS: lldb-api :: lang/cpp/class_static/TestStaticVariables.py (1212 of 1524) PASS: lldb-shell :: Breakpoint/jit-loader_jitlink_elf.test (1213 of 1524) PASS: lldb-api :: functionalities/gdb_remote_client/TestRemoteRegNums.py (1214 of 1524) UNSUPPORTED: lldb-api :: commands/gui/expand-threads-tree/TestGuiExpandThreadsTree.py (1215 of 1524) PASS: lldb-api :: functionalities/data-formatter/data-formatter-objc/TestDataFormatterObjCNSBundle.py (1216 of 1524) PASS: lldb-api :: functionalities/jitloader_gdb/TestJITLoaderGDB.py (1217 of 1524) UNSUPPORTED: lldb-shell :: SymbolFile/NativePDB/inline_sites_live.cpp (1218 of 1524) UNSUPPORTED: lldb-api :: tools/lldb-server/registers-target-xml-reading/TestGdbRemoteTargetXmlPacket.py (1219 of 1524) PASS: lldb-api :: lang/c/stepping/TestStepAndBreakpoints.py (1220 of 1524) UNSUPPORTED: lldb-api :: tools/lldb-server/TestGdbRemoteSaveCore.py (1221 of 1524) PASS: lldb-api :: commands/expression/two-files/TestObjCTypeQueryFromOtherCompileUnit.py (1222 of 1524) UNSUPPORTED: lldb-shell :: Register/x86-zmm-write.test (1223 of 1524) PASS: lldb-api :: functionalities/inline-stepping/TestInlineStepping.py (1224 of 1524) UNSUPPORTED: lldb-api :: functionalities/ptrauth_diagnostics/brkC47x_x16_invalid/TestPtrauthBRKc47xX16Invalid.py (1225 of 1524) PASS: lldb-api :: commands/frame/diagnose/dereference-function-return/TestDiagnoseDereferenceFunctionReturn.py (1226 of 1524) PASS: lldb-api :: functionalities/tail_call_frames/disambiguate_call_site/TestDisambiguateCallSite.py (1227 of 1524) PASS: lldb-shell :: Driver/TestQuiet.test (1228 of 1524) PASS: lldb-shell :: Settings/TestStopCommandSourceOnError.test (1229 of 1524) UNSUPPORTED: lldb-shell :: BuildScript/toolchain-clang-cl.test (1230 of 1524) PASS: lldb-shell :: SymbolFile/DWARF/x86/unused-inlined-params.test (1231 of 1524) PASS: lldb-api :: types/TestShortTypeExpr.py (1232 of 1524) UNSUPPORTED: lldb-shell :: SymbolFile/DWARF/x86/dwarf5-index-is-used.cpp (1233 of 1524) PASS: lldb-api :: functionalities/thread/exit_during_expression/TestExitDuringExpression.py (1234 of 1524) UNSUPPORTED: lldb-api :: functionalities/longjmp/TestLongjmp.py (1235 of 1524) UNSUPPORTED: lldb-shell :: SymbolFile/NativePDB/nested-types.cpp (1236 of 1524) UNSUPPORTED: lldb-shell :: Register/arm-gp-read.test (1237 of 1524) PASS: lldb-api :: lang/objc/ptr_refs/TestPtrRefsObjC.py (1238 of 1524) PASS: lldb-api :: functionalities/data-formatter/vector-types/TestVectorTypesFormatting.py (1239 of 1524) PASS: lldb-api :: lang/c/anonymous/TestAnonymous.py (1240 of 1524) UNSUPPORTED: lldb-api :: tools/lldb-server/libraries-svr4/TestGdbRemoteLibrariesSvr4Support.py (1241 of 1524) PASS: lldb-api :: commands/settings/TestSettings.py (1242 of 1524) PASS: lldb-api :: lang/cpp/bool/TestCPPBool.py (1243 of 1524) PASS: lldb-api :: commands/settings/use_source_cache/TestUseSourceCache.py (1244 of 1524) PASS: lldb-shell :: ObjectFile/MachO/subsections.yaml (1245 of 1524) UNSUPPORTED: lldb-api :: commands/expression/namespace_local_var_same_name_cpp_and_c/TestNamespaceLocalVarSameNameCppAndC.py (1246 of 1524) UNSUPPORTED: lldb-api :: macosx/corefile-default-ptrauth/TestCorefileDefaultPtrauth.py (1247 of 1524) PASS: lldb-api :: functionalities/postmortem/wow64_minidump/TestWow64MiniDump.py (1248 of 1524) PASS: lldb-shell :: Quit/TestQuitExitCodeTooManyArgs.test (1249 of 1524) UNSUPPORTED: lldb-shell :: SymbolFile/PDB/function-level-linking.test (1250 of 1524) PASS: lldb-shell :: ObjectFile/PECOFF/symbol.yaml (1251 of 1524) PASS: lldb-api :: lang/c/find_struct_type/TestFindStructTypes.py (1252 of 1524) PASS: lldb-api :: lang/cpp/overloaded-functions/TestOverloadedFunctions.py (1253 of 1524) PASS: lldb-shell :: ObjectFile/PECOFF/dwarf-gnu-debuglink.yaml (1254 of 1524) PASS: lldb-shell :: ObjectFile/PECOFF/disassemble-thumb.yaml (1255 of 1524) PASS: lldb-api :: tools/lldb-vscode/attach/TestVSCode_attach.py (1256 of 1524) PASS: lldb-api :: lang/c/record_decl_in_expr/TestRecordDeclInExpr.py (1257 of 1524) UNSUPPORTED: lldb-api :: tools/lldb-server/signal-filtering/TestGdbRemote_QPassSignals.py (1258 of 1524) PASS: lldb-shell :: ObjectFile/MachO/symtab.yaml (1259 of 1524) PASS: lldb-api :: lang/cpp/namespace_definitions/TestNamespaceDefinitions.py (1260 of 1524) PASS: lldb-shell :: Quit/TestQuitExitCode30.test (1261 of 1524) PASS: lldb-api :: commands/expression/po_verbosity/TestPoVerbosity.py (1262 of 1524) PASS: lldb-api :: functionalities/data-formatter/data-formatter-stl/libcxx/unique_ptr/TestDataFormatterLibcxxUniquePtr.py (1263 of 1524) UNSUPPORTED: lldb-api :: functionalities/tsan/basic/TestTsanBasic.py (1264 of 1524) UNSUPPORTED: lldb-api :: commands/trace/TestTraceDumpInstructions.py (1265 of 1524) PASS: lldb-api :: macosx/find-dsym/deep-bundle/TestDeepBundle.py (1266 of 1524) PASS: lldb-api :: lang/objc/modules-cache/TestClangModulesCache.py (1267 of 1524) UNSUPPORTED: lldb-shell :: ScriptInterpreter/Python/Crashlog/skipped_status_interactive_crashlog.test (1268 of 1524) XFAIL: lldb-shell :: Register/x86-64-fp-write.test (1269 of 1524) PASS: lldb-shell :: BuildScript/toolchain-clang.test (1270 of 1524) PASS: lldb-api :: commands/expression/deleting-implicit-copy-constructor/TestDeletingImplicitCopyConstructor.py (1271 of 1524) PASS: lldb-shell :: Reproducer/TestDSYM.test (1272 of 1524) PASS: lldb-api :: commands/expression/issue_11588/Test11588.py (1273 of 1524) PASS: lldb-api :: functionalities/gdb_remote_client/TestMultiprocess.py (1274 of 1524) PASS: lldb-shell :: ObjectFile/ELF/PT_LOAD-overlap.yaml (1275 of 1524) PASS: lldb-shell :: Reproducer/TestDump.test (1276 of 1524) PASS: lldb-shell :: Register/Core/x86-32-freebsd-fp.test (1277 of 1524) UNSUPPORTED: lldb-shell :: Process/Windows/process_load.cpp (1278 of 1524) PASS: lldb-shell :: SymbolFile/DWARF/x86/dwo-not-found-warning.cpp (1279 of 1524) PASS: lldb-api :: commands/expression/import-std-module/deque-dbg-info-content/TestDbgInfoContentDequeFromStdModule.py (1280 of 1524) PASS: lldb-api :: functionalities/data-formatter/array_typedef/TestArrayTypedef.py (1281 of 1524) PASS: lldb-api :: functionalities/module_cache/debug_index/TestDebugIndexCache.py (1282 of 1524) PASS: lldb-api :: commands/add-dsym/uuid/TestAddDsymCommand.py (1283 of 1524) PASS: lldb-api :: functionalities/recursion/TestValueObjectRecursion.py (1284 of 1524) PASS: lldb-api :: api/multiple-debuggers/TestMultipleDebuggers.py (1285 of 1524) PASS: lldb-api :: commands/log/basic/TestLogging.py (1286 of 1524) PASS: lldb-shell :: Breakpoint/debug_rnglist_basic.test (1287 of 1524) PASS: lldb-api :: lang/c/tls_globals/TestTlsGlobals.py (1288 of 1524) UNSUPPORTED: lldb-api :: functionalities/process_save_core/TestProcessSaveCore.py (1289 of 1524) UNSUPPORTED: lldb-api :: functionalities/thread/concurrent_events/TestConcurrentNWatchNBreak.py (1290 of 1524) PASS: lldb-api :: commands/process/launch/TestProcessLaunch.py (1291 of 1524) PASS: lldb-api :: qemu/TestQemuLaunch.py (1292 of 1524) PASS: lldb-shell :: Register/x86-64-gp-read.test (1293 of 1524) PASS: lldb-api :: lang/objc/bitfield_ivars/TestBitfieldIvars.py (1294 of 1524) PASS: lldb-api :: functionalities/thread/concurrent_events/TestConcurrentManyCrash.py (1295 of 1524) PASS: lldb-api :: functionalities/thread/backtrace_limit/TestBacktraceLimit.py (1296 of 1524) PASS: lldb-api :: functionalities/find-line-entry/TestFindLineEntry.py (1297 of 1524) PASS: lldb-api :: functionalities/data-formatter/data-formatter-synthval/TestDataFormatterSynthVal.py (1298 of 1524) PASS: lldb-api :: lang/objc/hidden-ivars/TestHiddenIvars.py (1299 of 1524) PASS: lldb-api :: lang/cpp/this_class_type_mixing/TestThisClassTypeMixing.py (1300 of 1524) UNSUPPORTED: lldb-api :: tools/lldb-vscode/completions/TestVSCode_completions.py (1301 of 1524) UNSUPPORTED: lldb-api :: commands/watchpoints/watchpoint_events/TestWatchpointEvents.py (1302 of 1524) PASS: lldb-api :: functionalities/data-formatter/data-formatter-objc/TestDataFormatterObjCNSDate.py (1303 of 1524) PASS: lldb-shell :: Register/Core/x86-64-linux-fp.test (1304 of 1524) PASS: lldb-api :: lang/cpp/inlines/TestInlines.py (1305 of 1524) UNSUPPORTED: lldb-api :: tools/lldb-server/TestGdbRemotePlatformFile.py (1306 of 1524) PASS: lldb-api :: functionalities/var_path/TestVarPath.py (1307 of 1524) PASS: lldb-api :: functionalities/data-formatter/data-formatter-synth/TestDataFormatterSynth.py (1308 of 1524) UNSUPPORTED: lldb-api :: commands/watchpoints/step_over_watchpoint/TestStepOverWatchpoint.py (1309 of 1524) PASS: lldb-shell :: Register/Core/x86-32-freebsd-gp.test (1310 of 1524) PASS: lldb-shell :: ObjectFile/ELF/PT_LOAD-overlap-section.yaml (1311 of 1524) PASS: lldb-shell :: Breakpoint/single-file-split-dwarf.test (1312 of 1524) PASS: lldb-api :: functionalities/postmortem/elf-core/thread_crash/TestLinuxCoreThreads.py (1313 of 1524) PASS: lldb-shell :: SymbolFile/DWARF/x86/debug_loc-aslr.s (1314 of 1524) PASS: lldb-api :: commands/memory/write/TestMemoryWrite.py (1315 of 1524) PASS: lldb-api :: lang/c/blocks/TestBlocks.py (1316 of 1524) PASS: lldb-api :: functionalities/breakpoint/source_regexp/TestSourceRegexBreakpoints.py (1317 of 1524) PASS: lldb-api :: functionalities/breakpoint/breakpoint_ids/TestBreakpointIDs.py (1318 of 1524) UNSUPPORTED: lldb-api :: functionalities/thread/concurrent_events/TestConcurrentManySignals.py (1319 of 1524) PASS: lldb-api :: lang/cpp/operators/TestCppOperators.py (1320 of 1524) UNSUPPORTED: lldb-api :: benchmarks/expression/TestRepeatedExprs.py (1321 of 1524) PASS: lldb-api :: commands/expression/import-std-module/vector-bool/TestVectorBoolFromStdModule.py (1322 of 1524) PASS: lldb-api :: functionalities/data-formatter/data-formatter-proper-plurals/TestFormattersOneIsSingular.py (1323 of 1524) UNSUPPORTED: lldb-api :: benchmarks/expression/TestExpressionCmd.py (1324 of 1524) UNSUPPORTED: lldb-api :: commands/watchpoints/variable_out_of_scope/TestWatchedVarHitWhenInScope.py (1325 of 1524) PASS: lldb-api :: functionalities/thread/exit_during_break/TestExitDuringBreak.py (1326 of 1524) PASS: lldb-api :: functionalities/data-formatter/data-formatter-stl/libcxx/string/TestDataFormatterLibcxxString.py (1327 of 1524) PASS: lldb-api :: functionalities/gdb_remote_client/TestGDBServerTargetXML.py (1328 of 1524) PASS: lldb-api :: functionalities/tail_call_frames/disambiguate_tail_call_seq/TestDisambiguateTailCallSeq.py (1329 of 1524) PASS: lldb-shell :: ObjectFile/Breakpad/breakpad-identification.test (1330 of 1524) PASS: lldb-api :: commands/expression/context-object/TestContextObject.py (1331 of 1524) PASS: lldb-api :: functionalities/thread/create_after_attach/TestCreateAfterAttach.py (1332 of 1524) PASS: lldb-shell :: ScriptInterpreter/Python/scripted_breakpoint_lua.test (1333 of 1524) UNSUPPORTED: lldb-shell :: SymbolFile/DWARF/x86/dwarf5-line-strp.s (1334 of 1524) PASS: lldb-api :: functionalities/reproducers/fs-case-sensitivity/TestReproducerFSCaseSensitivity.py (1335 of 1524) PASS: lldb-api :: lang/cpp/lambdas/TestLambdas.py (1336 of 1524) PASS: lldb-shell :: SymbolFile/OnDemand/symbolic-breakpoint.test (1337 of 1524) PASS: lldb-api :: commands/expression/persist_objc_pointeetype/TestPersistObjCPointeeType.py (1338 of 1524) UNSUPPORTED: lldb-api :: tools/lldb-server/TestGdbRemote_qThreadStopInfo.py (1339 of 1524) PASS: lldb-shell :: SymbolFile/DWARF/x86/dwp.s (1340 of 1524) UNSUPPORTED: lldb-shell :: Process/Windows/exception_access_violation.cpp (1341 of 1524) UNSUPPORTED: lldb-shell :: SymbolFile/DWARF/x86/find-basic-variable.cpp (1342 of 1524) PASS: lldb-api :: functionalities/non-overlapping-index-variable-i/TestIndexVariable.py (1343 of 1524) UNSUPPORTED: lldb-api :: functionalities/data-formatter/data-formatter-stl/libstdcpp/tuple/TestDataFormatterStdTuple.py (1344 of 1524) PASS: lldb-api :: commands/expression/expr_inside_lambda/TestExprInsideLambdas.py (1345 of 1524) PASS: lldb-api :: functionalities/breakpoint/breakpoint_ignore_count/TestBreakpointIgnoreCount.py (1346 of 1524) PASS: lldb-api :: commands/target/dump-symtab-demangle/TestDumpSymtabDemangle.py (1347 of 1524) UNSUPPORTED: lldb-api :: functionalities/tty/TestTerminal.py (1348 of 1524) PASS: lldb-shell :: Register/Core/x86-32-netbsd-addr.test (1349 of 1524) PASS: lldb-shell :: Subprocess/fork-follow-parent-wp.test (1350 of 1524) PASS: lldb-api :: commands/frame/var/TestFrameVar.py (1351 of 1524) UNSUPPORTED: lldb-api :: python_api/watchpoint/TestWatchpointIgnoreCount.py (1352 of 1524) PASS: lldb-shell :: Commands/CommandScriptImmediateOutput/CommandScriptImmediateOutputFile.test (1353 of 1524) PASS: lldb-api :: lang/cpp/template-function/TestTemplateFunctions.py (1354 of 1524) PASS: lldb-api :: functionalities/dynamic_value_child_count/TestDynamicValueChildCount.py (1355 of 1524) PASS: lldb-api :: functionalities/gdb_remote_client/TestThreadInfoTrailingComma.py (1356 of 1524) PASS: lldb-api :: functionalities/data-formatter/data-formatter-objc/TestDataFormatterObjNSException.py (1357 of 1524) UNSUPPORTED: lldb-shell :: Register/x86-64-gp-write.test (1358 of 1524) PASS: lldb-api :: python_api/formatters/TestFormattersSBAPI.py (1359 of 1524) PASS: lldb-shell :: Driver/TestPageZeroRead.test (1360 of 1524) PASS: lldb-api :: iohandler/autosuggestion/TestAutosuggestion.py (1361 of 1524) PASS: lldb-api :: lang/cpp/global_variables/TestCPPGlobalVariables.py (1362 of 1524) UNSUPPORTED: lldb-api :: functionalities/breakpoint/hardware_breakpoints/hardware_breakpoint_on_multiple_threads/TestHWBreakMultiThread.py (1363 of 1524) PASS: lldb-api :: functionalities/data-formatter/data-formatter-objc/nsindexpath/TestDataFormatterNSIndexPath.py (1364 of 1524) UNSUPPORTED: lldb-api :: api/multiple-targets/TestMultipleTargets.py (1365 of 1524) PASS: lldb-api :: lang/c/step-target/TestStepTarget.py (1366 of 1524) PASS: lldb-api :: lang/c/sizeof/TestCSizeof.py (1367 of 1524) PASS: lldb-api :: python_api/section/TestSectionAPI.py (1368 of 1524) PASS: lldb-api :: functionalities/gdb_remote_client/TestQemuAArch64TargetXml.py (1369 of 1524) PASS: lldb-api :: python_api/sberror/TestSBError.py (1370 of 1524) UNSUPPORTED: lldb-shell :: Breakpoint/ppc64le-localentry.test (1371 of 1524) UNSUPPORTED: lldb-api :: functionalities/thread/main_thread_exit/TestMainThreadExit.py (1372 of 1524) PASS: lldb-api :: lang/cpp/dynamic-value/TestCppValueCast.py (1373 of 1524) UNSUPPORTED: lldb-api :: functionalities/dyld-exec-linux/TestDyldExecLinux.py (1374 of 1524) PASS: lldb-api :: python_api/interpreter/TestCommandInterpreterAPI.py (1375 of 1524) PASS: lldb-api :: functionalities/gdb_remote_client/TestWriteMemory.py (1376 of 1524) PASS: lldb-api :: commands/statistics/basic/TestStats.py (1377 of 1524) PASS: lldb-shell :: Breakpoint/debug_rnglist_rlestartend.test (1378 of 1524) UNSUPPORTED: lldb-api :: lang/cpp/breakpoint_in_member_func_w_non_primitive_params/TestBreakpointInMemberFuncWNonPrimitiveParams.py (1379 of 1524) UNSUPPORTED: lldb-api :: functionalities/breakpoint/hardware_breakpoints/write_memory_with_hw_breakpoint/TestWriteMemoryWithHWBreakpoint.py (1380 of 1524) UNSUPPORTED: lldb-shell :: Subprocess/vfork-follow-child-wp.test (1381 of 1524) PASS: lldb-api :: lang/cpp/function-qualifiers/TestCppFunctionQualifiers.py (1382 of 1524) PASS: lldb-api :: commands/target/create-no-such-arch/TestNoSuchArch.py (1383 of 1524) PASS: lldb-shell :: ObjectFile/PDB/object.test (1384 of 1524) PASS: lldb-api :: commands/expression/codegen-crash-import-def-arraytype-element/TestImportDefinitionArrayType.py (1385 of 1524) PASS: lldb-api :: functionalities/thread/concurrent_events/TestConcurrentTwoBreakpointThreads.py (1386 of 1524) PASS: lldb-api :: python_api/lldbutil/process/TestPrintStackTraces.py (1387 of 1524) PASS: lldb-shell :: Process/TestEnvironment.test (1388 of 1524) UNSUPPORTED: lldb-api :: macosx/macCatalystAppMacOSFramework/TestMacCatalystAppWithMacOSFramework.py (1389 of 1524) PASS: lldb-shell :: ObjectFile/Breakpad/sections.test (1390 of 1524) PASS: lldb-api :: functionalities/unwind/zeroth_frame/TestZerothFrame.py (1391 of 1524) XFAIL: lldb-api :: lang/c/local_types/TestUseClosestType.py (1392 of 1524) PASS: lldb-api :: commands/expression/ir-interpreter/TestIRInterpreter.py (1393 of 1524) PASS: lldb-api :: functionalities/reproducers/attach/TestReproducerAttach.py (1394 of 1524) PASS: lldb-api :: functionalities/thread/concurrent_events/TestConcurrentTwoBreakpointsOneSignal.py (1395 of 1524) PASS: lldb-shell :: SymbolFile/DWARF/x86/split-dwarf-multiple-cu.ll (1396 of 1524) PASS: lldb-api :: functionalities/thread/crash_during_step/TestCrashDuringStep.py (1397 of 1524) PASS: lldb-api :: functionalities/data-formatter/data-formatter-objc/TestDataFormatterObjCExpr.py (1398 of 1524) PASS: lldb-api :: functionalities/data-formatter/data-formatter-cpp/TestDataFormatterCpp.py (1399 of 1524) PASS: lldb-shell :: ScriptInterpreter/Python/Crashlog/json.test (1400 of 1524) UNSUPPORTED: lldb-api :: macosx/simulator/TestSimulatorPlatform.py (1401 of 1524) PASS: lldb-api :: types/TestDoubleTypes.py (1402 of 1524) PASS: lldb-api :: lang/objc/foundation/TestObjCMethods2.py (1403 of 1524) PASS: lldb-api :: functionalities/gdb_remote_client/TestRecognizeBreakpoint.py (1404 of 1524) PASS: lldb-shell :: Register/Core/x86-64-netbsd-addr.test (1405 of 1524) PASS: lldb-api :: lang/c/complex_int/TestComplexInt.py (1406 of 1524) PASS: lldb-api :: functionalities/data-formatter/data-formatter-enum-format/TestDataFormatterEnumFormat.py (1407 of 1524) UNSUPPORTED: lldb-shell :: SymbolFile/PDB/calling-conventions-arm.test (1408 of 1524) PASS: lldb-api :: functionalities/data-formatter/varscript_formatting/TestDataFormatterVarScriptFormatting.py (1409 of 1524) PASS: lldb-api :: lang/objc/orderedset/TestOrderedSet.py (1410 of 1524) UNSUPPORTED: lldb-shell :: Register/x86-64-xmm16-write.test (1411 of 1524) PASS: lldb-api :: python_api/sbtype_typeclass/TestSBTypeTypeClass.py (1412 of 1524) PASS: lldb-api :: python_api/sblaunchinfo/TestSBLaunchInfo.py (1413 of 1524) XFAIL: lldb-shell :: Register/x86-fp-write.test (1414 of 1524) PASS: lldb-shell :: ObjectFile/PECOFF/dwarf-gnu-debuglink-i686.yaml (1415 of 1524) PASS: lldb-shell :: ObjectFile/ELF/section-types.yaml (1416 of 1524) PASS: lldb-api :: lang/cpp/multiple-inheritance/TestCppMultipleInheritance.py (1417 of 1524) PASS: lldb-api :: functionalities/data-formatter/data-formatter-objc/TestDataFormatterObjCNSNumber.py (1418 of 1524) PASS: lldb-shell :: ObjectFile/PECOFF/dwarf-gnu-debuglink-mismatched-crc.yaml (1419 of 1524) UNSUPPORTED: lldb-api :: linux/sepdebugsymlink/TestTargetSymbolsSepDebugSymlink.py (1420 of 1524) PASS: lldb-api :: functionalities/data-formatter/data-formatter-stl/libcxx/initializerlist/TestInitializerList.py (1421 of 1524) PASS: lldb-api :: commands/expression/test/TestExprs.py (1422 of 1524) UNSUPPORTED: lldb-api :: tools/lldb-server/TestGdbRemoteSingleStep.py (1423 of 1524) PASS: lldb-shell :: Minidump/dump-all.test (1424 of 1524) PASS: lldb-api :: commands/frame/diagnose/bad-reference/TestBadReference.py (1425 of 1524) PASS: lldb-shell :: Driver/TestError.test (1426 of 1524) PASS: lldb-shell :: ScriptInterpreter/Python/Crashlog/parser_text.test (1427 of 1524) UNSUPPORTED: lldb-shell :: SymbolFile/DWARF/split-optimized.c (1428 of 1524) PASS: lldb-api :: macosx/add-dsym/TestAddDsymDownload.py (1429 of 1524) UNSUPPORTED: lldb-shell :: ScriptInterpreter/Lua/breakpoint_function_callback.test (1430 of 1524) PASS: lldb-api :: commands/target/create-deps/TestTargetCreateDeps.py (1431 of 1524) PASS: lldb-api :: lang/cpp/covariant-return-types/TestCovariantReturnTypes.py (1432 of 1524) PASS: lldb-api :: lang/c/enum_types/TestEnumTypes.py (1433 of 1524) UNSUPPORTED: lldb-api :: commands/watchpoints/watchpoint_set_command/TestWatchLocationWithWatchSet.py (1434 of 1524) PASS: lldb-api :: functionalities/thread/state_after_expression/TestStateAfterExpression.py (1435 of 1524) PASS: lldb-api :: commands/target/auto-install-main-executable/TestAutoInstallMainExecutable.py (1436 of 1524) PASS: lldb-shell :: SymbolFile/DWARF/x86/compilercontext.ll (1437 of 1524) UNSUPPORTED: lldb-api :: tools/lldb-server/TestGdbRemote_vCont.py (1438 of 1524) UNSUPPORTED: lldb-api :: commands/trace/TestTraceTSC.py (1439 of 1524) PASS: lldb-api :: lang/cpp/function_refs/TestFunctionRefs.py (1440 of 1524) PASS: lldb-shell :: SymbolFile/DWARF/x86/DW_TAG_basic_type_DW_ATE_UTF_nonC.ll (1441 of 1524) UNSUPPORTED: lldb-api :: lang/objcxx/cxx-bridged-po/TestObjCXXBridgedPO.py (1442 of 1524) PASS: lldb-api :: functionalities/optimized_code/TestNoASanExceptionAfterEvalOP_piece.py (1443 of 1524) UNSUPPORTED: lldb-shell :: Unwind/basic-block-sections.test (1444 of 1524) UNSUPPORTED: lldb-api :: macosx/corefile-exception-reason/TestCorefileExceptionReason.py (1445 of 1524) UNSUPPORTED: lldb-shell :: SymbolFile/NativePDB/stack_unwinding01.cpp (1446 of 1524) PASS: lldb-api :: python_api/lldbutil/TestSwigVersion.py (1447 of 1524) PASS: lldb-api :: commands/target/dump/TestTargetDumpTypeSystem.py (1448 of 1524) PASS: lldb-api :: lang/c/complex/TestComplexC99.py (1449 of 1524) PASS: lldb-api :: lang/cpp/accelerator-table/TestCPPAccelerator.py (1450 of 1524) PASS: lldb-api :: lang/cpp/template-specialization-type/TestTemplateSpecializationType.py (1451 of 1524) PASS: lldb-api :: lang/cpp/exceptions/TestCPPExceptionBreakpoints.py (1452 of 1524) UNSUPPORTED: lldb-api :: functionalities/data-formatter/data-formatter-stl/libstdcpp/unique_ptr/TestDataFormatterStdUniquePtr.py (1453 of 1524) PASS: lldb-api :: commands/expression/import-std-module/basic/TestImportStdModule.py (1454 of 1524) PASS: lldb-api :: commands/expression/persistent_types/TestNestedPersistentTypes.py (1455 of 1524) UNSUPPORTED: lldb-shell :: BuildScript/toolchain-msvc.test (1456 of 1524) PASS: lldb-api :: python_api/sbvalue_const_addrof/TestSBValueConstAddrOf.py (1457 of 1524) PASS: lldb-api :: functionalities/memory/cache/TestMemoryCache.py (1458 of 1524) PASS: lldb-api :: commands/expression/radar_8638051/Test8638051.py (1459 of 1524) PASS: lldb-shell :: Expr/TestStringLiteralExpr.test (1460 of 1524) PASS: lldb-api :: functionalities/data-formatter/data-formatter-stl/generic/multiset/TestDataFormatterGenericMultiSet.py (1461 of 1524) PASS: lldb-api :: functionalities/breakpoint/breakpoint_set_restart/TestBreakpointSetRestart.py (1462 of 1524) PASS: lldb-api :: types/TestRecursiveTypes.py (1463 of 1524) UNSUPPORTED: lldb-api :: commands/watchpoints/watchpoint_commands/condition/TestWatchpointConditionCmd.py (1464 of 1524) PASS: lldb-shell :: Minidump/Windows/Sigsegv/sigsegv.test (1465 of 1524) UNSUPPORTED: lldb-shell :: SymbolFile/PDB/type-quals.test (1466 of 1524) PASS: lldb-api :: functionalities/postmortem/minidump/TestMiniDump.py (1467 of 1524) PASS: lldb-api :: functionalities/progress_reporting/TestProgressReporting.py (1468 of 1524) PASS: lldb-api :: tools/lldb-vscode/breakpoint/TestVSCode_setExceptionBreakpoints.py (1469 of 1524) PASS: lldb-api :: lang/objc/objc-dyn-sbtype/TestObjCDynamicSBType.py (1470 of 1524) PASS: lldb-shell :: ObjectFile/PECOFF/dwarf-gnu-debuglink-pdb-buildid.yaml (1471 of 1524) PASS: lldb-shell :: ObjectFile/ELF/many-sections.s (1472 of 1524) UNSUPPORTED: lldb-shell :: SymbolFile/NativePDB/source-list.cpp (1473 of 1524) UNSUPPORTED: lldb-shell :: Register/x86-ymm-write.test (1474 of 1524) UNSUPPORTED: lldb-shell :: SymbolFile/NativePDB/find-functions.cpp (1475 of 1524) PASS: lldb-shell :: Commands/command-breakpoint-col.test (1476 of 1524) PASS: lldb-api :: functionalities/tail_call_frames/inlining_and_tail_calls/TestInliningAndTailCalls.py (1477 of 1524) PASS: lldb-api :: arm/emulation/TestEmulations.py (1478 of 1524) UNSUPPORTED: lldb-api :: python_api/watchpoint/watchlocation/TestSetWatchlocation.py (1479 of 1524) PASS: lldb-api :: functionalities/thread/concurrent_events/TestConcurrentSignalBreak.py (1480 of 1524) PASS: lldb-api :: lang/c/function_types/TestFunctionTypes.py (1481 of 1524) UNSUPPORTED: lldb-api :: commands/watchpoints/multiple_threads/TestWatchpointMultipleThreads.py (1482 of 1524) PASS: lldb-api :: tools/lldb-vscode/breakpoint/TestVSCode_logpoints.py (1483 of 1524) UNSUPPORTED: lldb-shell :: Register/arm-fp-read.test (1484 of 1524) PASS: lldb-api :: commands/expression/invalid-args/TestInvalidArgsExpression.py (1485 of 1524) PASS: lldb-api :: lang/objc/modules-inline-functions/TestModulesInlineFunctions.py (1486 of 1524) PASS: lldb-api :: commands/expression/import-std-module/iterator/TestIteratorFromStdModule.py (1487 of 1524) PASS: lldb-api :: tools/lldb-vscode/breakpoint/TestVSCode_setBreakpoints.py (1488 of 1524) PASS: lldb-api :: functionalities/data-formatter/type_summary_list_arg/TestTypeSummaryListArg.py (1489 of 1524) PASS: lldb-api :: commands/process/attach-resume/TestAttachResume.py (1490 of 1524) UNSUPPORTED: lldb-api :: lang/objc/objc-dynamic-value/TestObjCDynamicValue.py (1491 of 1524) PASS: lldb-api :: commands/expression/function_template_specialization_temp_args/TestFunctionTemplateSpecializationTempArgs.py (1492 of 1524) PASS: lldb-shell :: ScriptInterpreter/Python/Crashlog/no-args.test (1493 of 1524) UNSUPPORTED: lldb-shell :: SymbolFile/DWARF/x86/find-method.cpp (1494 of 1524) PASS: lldb-api :: lang/cpp/incomplete-types/members/TestCppIncompleteTypeMembers.py (1495 of 1524) UNSUPPORTED: lldb-api :: tools/lldb-server/TestGdbRemoteAttach.py (1496 of 1524) PASS: lldb-api :: driver/batch_mode/TestBatchMode.py (1497 of 1524) PASS: lldb-api :: lang/c/fpeval/TestFPEval.py (1498 of 1524) PASS: lldb-shell :: ObjectFile/wasm/stripped-debug-sections.yaml (1499 of 1524) UNSUPPORTED: lldb-api :: lang/objc/modules-hash-mismatch/TestClangModulesHashMismatch.py (1500 of 1524) PASS: lldb-api :: lang/cpp/class_types/TestClassTypes.py (1501 of 1524) UNSUPPORTED: lldb-shell :: SymbolFile/DWARF/x86/debug-types-signature-loop.s (1502 of 1524) PASS: lldb-api :: commands/command/regex/TestRegexCommand.py (1503 of 1524) UNSUPPORTED: lldb-shell :: SymbolFile/NativePDB/break-by-function.cpp (1504 of 1524) UNSUPPORTED: lldb-api :: functionalities/data-formatter/data-formatter-stl/libstdcpp/map/TestDataFormatterStdMap.py (1505 of 1524) PASS: lldb-api :: commands/process/attach/attach_denied/TestAttachDenied.py (1506 of 1524) UNSUPPORTED: lldb-api :: tools/lldb-server/TestGdbRemoteForkNonStop.py (1507 of 1524) PASS: lldb-api :: lang/cpp/call-function/TestCallCPPFunction.py (1508 of 1524) PASS: lldb-api :: lang/c/shared_lib_stripped_symbols/TestSharedLibStrippedSymbols.py (1509 of 1524) PASS: lldb-api :: functionalities/gdb_remote_client/TestGDBServerNoTargetXML.py (1510 of 1524) PASS: lldb-api :: lang/cpp/step-through-trampoline/TestStepThroughTrampoline.py (1511 of 1524) PASS: lldb-api :: lang/objc/blocks/TestObjCIvarsInBlocks.py (1512 of 1524) PASS: lldb-api :: commands/command/script_alias/TestCommandScriptAlias.py (1513 of 1524) PASS: lldb-api :: commands/platform/file/read/TestPlatformFileRead.py (1514 of 1524) UNSUPPORTED: lldb-api :: linux/mix-dwo-and-regular-objects/TestMixedDwarfBinary.py (1515 of 1524) PASS: lldb-api :: functionalities/breakpoint/breakpoint_command/TestRegexpBreakCommand.py (1516 of 1524) PASS: lldb-api :: commands/expression/import-std-module/module-build-errors/TestStdModuleBuildErrors.py (1517 of 1524) PASS: lldb-api :: functionalities/inferior-crashing/TestInferiorCrashing.py (1518 of 1524) PASS: lldb-api :: tools/lldb-vscode/coreFile/TestVSCode_coreFile.py (1519 of 1524) PASS: lldb-api :: functionalities/thread/concurrent_events/TestConcurrentTwoBreakpointsOneDelaySignal.py (1520 of 1524) PASS: lldb-api :: lang/objc/radar-9691614/TestObjCMethodReturningBOOL.py (1521 of 1524) PASS: lldb-api :: functionalities/progress_reporting/TestTrimmedProgressReporting.py (1522 of 1524) PASS: lldb-api :: commands/register/register/register_command/TestRegisters.py (1523 of 1524) PASS: lldb-api :: lang/objc/exceptions/TestObjCExceptions.py (1524 of 1524)

Hide Details

1 warning(s) in tests Slowest Tests: -------------------------------------------------------------------------- 92.42s: lldb-api :: api/multithreaded/TestMultithreaded.py 72.83s: lldb-api :: commands/process/attach/TestProcessAttach.py 67.26s: lldb-api :: lang/objc/foundation/TestFoundationDisassembly.py 46.33s: lldb-api :: lang/objc/hidden-ivars/TestHiddenIvars.py 43.93s: lldb-api :: functionalities/completion/TestCompletion.py 43.73s: lldb-api :: functionalities/load_unload/TestLoadUnload.py 40.46s: lldb-api :: python_api/target/TestTargetAPI.py 40.45s: lldb-api :: lang/objc/exceptions/TestObjCExceptions.py 39.78s: lldb-api :: types/TestLongTypesExpr.py 35.06s: lldb-api :: lang/cpp/namespace/TestNamespaceLookup.py 33.19s: lldb-api :: lang/objc/foundation/TestObjCMethods.py 32.10s: lldb-api :: functionalities/gdb_remote_client/TestPlatformMacOSX.py 31.11s: lldb-api :: lang/objc/objc-new-syntax/TestObjCNewSyntaxLiteral.py 30.16s: lldb-api :: lang/objc/real-definition/TestRealDefinition.py 28.64s: lldb-api :: commands/settings/TestSettings.py 27.53s: lldb-api :: tools/lldb-vscode/evaluate/TestVSCode_evaluate.py 27.03s: lldb-api :: types/TestLongTypes.py 26.48s: lldb-api :: tools/lldb-vscode/launch/TestVSCode_launch.py 25.35s: lldb-api :: lang/objc/objc-new-syntax/TestObjCNewSyntaxArray.py 24.90s: lldb-api :: lang/objc/objc-new-syntax/TestObjCNewSyntaxDictionary.py

Hide Details

Tests Times: -------------------------------------------------------------------------- [ Range ] :: [ Percentage ] :: [ Count ] -------------------------------------------------------------------------- [90.0s,95.0s) :: [ ] :: [ 1/1524] [85.0s,90.0s) :: [ ] :: [ 0/1524] [80.0s,85.0s) :: [ ] :: [ 0/1524] [75.0s,80.0s) :: [ ] :: [ 0/1524] [70.0s,75.0s) :: [ ] :: [ 1/1524] [65.0s,70.0s) :: [ ] :: [ 1/1524] [60.0s,65.0s) :: [ ] :: [ 0/1524] [55.0s,60.0s) :: [ ] :: [ 0/1524] [50.0s,55.0s) :: [ ] :: [ 0/1524] [45.0s,50.0s) :: [ ] :: [ 2/1524] [40.0s,45.0s) :: [ ] :: [ 4/1524] [35.0s,40.0s) :: [ ] :: [ 1/1524] [30.0s,35.0s) :: [ ] :: [ 4/1524] [25.0s,30.0s) :: [ ] :: [ 8/1524] [20.0s,25.0s) :: [ ] :: [ 14/1524] [15.0s,20.0s) :: [* ] :: [ 46/1524] [10.0s,15.0s) :: [** ] :: [ 100/1524] [ 5.0s,10.0s) :: [********* ] :: [ 346/1524] [ 0.0s, 5.0s) :: [************************** ] :: [ 996/1524] -------------------------------------------------------------------------- ******************** Failed Tests (2): lldb-api :: functionalities/scripted_process/TestStackCoreScriptedProcess.py lldb-api :: lang/cpp/const_static_integral_member/TestConstStaticIntegralMember.py

Hide Details

Hide Details

Testing Time: 457.39s Unsupported : 366 Passed : 1146 Expectedly Failed: 10 Failed : 2 FAILED: tools/lldb/test/CMakeFiles/check-lldb /Users/buildslave/jenkins/workspace/lldb-cmake-matrix/lldb-build/tools/lldb/test/CMakeFiles/check-lldb cd /Users/buildslave/jenkins/workspace/lldb-cmake-matrix/lldb-build/tools/lldb/test && /Applications/Xcode.app/Contents/Developer/Library/Frameworks/Python3.framework/Versions/3.8/bin/python3.8 /Users/buildslave/jenkins/workspace/lldb-cmake-matrix/lldb-build/./bin/llvm-lit -v --time-tests --shuffle --xunit-xml-output=/Users/buildslave/jenkins/workspace/lldb-cmake-matrix/test/results.xml -v /Users/buildslave/jenkins/workspace/lldb-cmake-matrix/lldb-build/tools/lldb/test ninja: build stopped: subcommand failed. Command failed: Command '['/usr/bin/env', 'TERM=vt100', '/usr/local/bin/ninja', '-v', 'check-lldb']' returned non-zero exit status 1. Command: ['/usr/bin/env', 'TERM=vt100', '/usr/local/bin/ninja', '-v', 'check-lldb'] + set -e [Pipeline] } [Pipeline] // timeout [Pipeline] junit Recording test results [Checks API] No suitable checks publisher found. [Pipeline] } [Pipeline] // stage [Pipeline] } [Pipeline] // withEnv [Pipeline] } [Pipeline] // node [Pipeline] End of Pipeline Finished: UNSTABLE