Regression

Test Clang 5.0.2 / lldb-api.api/multiple-debuggers.TestMultipleDebuggers.py (from lldb-api)

Failing for the past 1 build (Since #5034 )
Took 2.9 sec.

Stacktrace

Script:
--
/Applications/Xcode.app/Contents/Developer/Library/Frameworks/Python3.framework/Versions/3.8/bin/python3.8 /Users/buildslave/jenkins/workspace/lldb-cmake-matrix/llvm-project/lldb/test/API/dotest.py -u CXXFLAGS -u CFLAGS --codesign-identity lldb_codesign --arch x86_64 --build-dir /Users/buildslave/jenkins/workspace/lldb-cmake-matrix/lldb-build/lldb-test-build.noindex -t --env TERM=vt100 --skip-category gmodules --skip-category watchpoint --skip-category llgs --skip-category debugserver --arch=x86_64 --env LLVM_LIBS_DIR=/Users/buildslave/jenkins/workspace/lldb-cmake-matrix/lldb-build/./lib --env LLVM_INCLUDE_DIR=/Users/buildslave/jenkins/workspace/lldb-cmake-matrix/lldb-build/include --env LLVM_TOOLS_DIR=/Users/buildslave/jenkins/workspace/lldb-cmake-matrix/lldb-build/./bin --hermetic-libcxx --arch x86_64 --build-dir /Users/buildslave/jenkins/workspace/lldb-cmake-matrix/lldb-build/lldb-test-build.noindex --lldb-module-cache-dir /Users/buildslave/jenkins/workspace/lldb-cmake-matrix/lldb-build/lldb-test-build.noindex/module-cache-lldb/lldb-api --clang-module-cache-dir /Users/buildslave/jenkins/workspace/lldb-cmake-matrix/lldb-build/lldb-test-build.noindex/module-cache-clang/lldb-api --executable /Users/buildslave/jenkins/workspace/lldb-cmake-matrix/lldb-build/./bin/lldb --compiler /Users/buildslave/jenkins/workspace/lldb-cmake-matrix/clang_502_build/bin/clang --dsymutil /Users/buildslave/jenkins/workspace/lldb-cmake-matrix/lldb-build/./bin/dsymutil --llvm-tools-dir /Users/buildslave/jenkins/workspace/lldb-cmake-matrix/lldb-build/./bin --lldb-libs-dir /Users/buildslave/jenkins/workspace/lldb-cmake-matrix/lldb-build/./lib /Users/buildslave/jenkins/workspace/lldb-cmake-matrix/llvm-project/lldb/test/API/api/multiple-debuggers -p TestMultipleDebuggers.py
--
Exit Code: 1

Command Output (stdout):
--
lldb version 16.0.99git (http://labmaster3.local/git/llvm-project.git revision b2f31cac28c8a03ceb908b544f5790f4f9f2d9ab)
  clang revision b2f31cac28c8a03ceb908b544f5790f4f9f2d9ab
  llvm revision b2f31cac28c8a03ceb908b544f5790f4f9f2d9ab
Skipping the following test categories: ['gmodules', 'watchpoint', 'llgs', 'debugserver', 'libstdcxx', 'dwo', 'llgs', 'fork']
Building LLDB Driver (/Users/buildslave/jenkins/workspace/lldb-cmake-matrix/lldb-build/lldb-test-build.noindex/api/multiple-debuggers/TestMultipleDebuggers.test_multiple_debuggers/multi-process-driver) from sources multi-process-driver.cpp

--
Command Output (stderr):
--
Change dir to: /Users/buildslave/jenkins/workspace/lldb-cmake-matrix/llvm-project/lldb/test/API/api/multiple-debuggers
runCmd: settings clear -all
output: 

runCmd: settings set symbols.enable-external-lookup false
output: 

runCmd: settings set target.inherit-tcc true
output: 

runCmd: settings set target.detach-on-error false
output: 

runCmd: settings set target.auto-apply-fixits false
output: 

runCmd: settings set plugin.process.gdb-remote.packet-timeout 60
output: 

runCmd: settings set symbols.clang-modules-cache-path "/Users/buildslave/jenkins/workspace/lldb-cmake-matrix/lldb-build/lldb-test-build.noindex/module-cache-lldb/lldb-api"
output: 

runCmd: settings set use-color false
output: 

runCmd: setting set target.prefer-dynamic-value no-dynamic-values
output: 

make VPATH=/Users/buildslave/jenkins/workspace/lldb-cmake-matrix/llvm-project/lldb/test/API/api/multiple-debuggers -C /Users/buildslave/jenkins/workspace/lldb-cmake-matrix/lldb-build/lldb-test-build.noindex/api/multiple-debuggers/TestMultipleDebuggers.test_multiple_debuggers -I /Users/buildslave/jenkins/workspace/lldb-cmake-matrix/llvm-project/lldb/test/API/api/multiple-debuggers -I /Users/buildslave/jenkins/workspace/lldb-cmake-matrix/llvm-project/lldb/packages/Python/lldbsuite/test/make -f /Users/buildslave/jenkins/workspace/lldb-cmake-matrix/llvm-project/lldb/test/API/api/multiple-debuggers/Makefile all ARCH=x86_64 'CC="/Users/buildslave/jenkins/workspace/lldb-cmake-matrix/clang_502_build/bin/clang"' DSYMUTIL=/Users/buildslave/jenkins/workspace/lldb-cmake-matrix/lldb-build/./bin/dsymutil CODESIGN=codesign CLANG_MODULE_CACHE_DIR=/Users/buildslave/jenkins/workspace/lldb-cmake-matrix/lldb-build/lldb-test-build.noindex/module-cache-clang/lldb-api USE_HERMETIC_LIBCPP=1 CXX_SOURCES=multi-process-driver.cpp EXE=/Users/buildslave/jenkins/workspace/lldb-cmake-matrix/lldb-build/lldb-test-build.noindex/api/multiple-debuggers/TestMultipleDebuggers.test_multiple_debuggers/multi-process-driver 'CFLAGS_EXTRAS=-std=c++11 -stdlib=libc++ -I/Users/buildslave/jenkins/workspace/lldb-cmake-matrix/llvm-project/lldb/include' 'LD_EXTRAS=-L/Users/buildslave/jenkins/workspace/lldb-cmake-matrix/lldb-build/./lib -llldb -Wl,-rpath,/Users/buildslave/jenkins/workspace/lldb-cmake-matrix/lldb-build/./lib'

FAIL: LLDB (/Users/buildslave/jenkins/workspace/lldb-cmake-matrix/clang_502_build/bin/clang-x86_64) :: test_multiple_debuggers (TestMultipleDebuggers.TestMultipleSimultaneousDebuggers)
Restore dir to: /Users/buildslave/jenkins/workspace/lldb-cmake-matrix/lldb-build/tools/lldb/test
======================================================================
ERROR: test_multiple_debuggers (TestMultipleDebuggers.TestMultipleSimultaneousDebuggers)
----------------------------------------------------------------------
Error when building test subject.

Build Command:
make VPATH=/Users/buildslave/jenkins/workspace/lldb-cmake-matrix/llvm-project/lldb/test/API/api/multiple-debuggers -C /Users/buildslave/jenkins/workspace/lldb-cmake-matrix/lldb-build/lldb-test-build.noindex/api/multiple-debuggers/TestMultipleDebuggers.test_multiple_debuggers -I /Users/buildslave/jenkins/workspace/lldb-cmake-matrix/llvm-project/lldb/test/API/api/multiple-debuggers -I /Users/buildslave/jenkins/workspace/lldb-cmake-matrix/llvm-project/lldb/packages/Python/lldbsuite/test/make -f /Users/buildslave/jenkins/workspace/lldb-cmake-matrix/llvm-project/lldb/test/API/api/multiple-debuggers/Makefile all ARCH=x86_64 'CC="/Users/buildslave/jenkins/workspace/lldb-cmake-matrix/clang_502_build/bin/clang"' DSYMUTIL=/Users/buildslave/jenkins/workspace/lldb-cmake-matrix/lldb-build/./bin/dsymutil CODESIGN=codesign CLANG_MODULE_CACHE_DIR=/Users/buildslave/jenkins/workspace/lldb-cmake-matrix/lldb-build/lldb-test-build.noindex/module-cache-clang/lldb-api USE_HERMETIC_LIBCPP=1 CXX_SOURCES=multi-process-driver.cpp EXE=/Users/buildslave/jenkins/workspace/lldb-cmake-matrix/lldb-build/lldb-test-build.noindex/api/multiple-debuggers/TestMultipleDebuggers.test_multiple_debuggers/multi-process-driver 'CFLAGS_EXTRAS=-std=c++11 -stdlib=libc++ -I/Users/buildslave/jenkins/workspace/lldb-cmake-matrix/llvm-project/lldb/include' 'LD_EXTRAS=-L/Users/buildslave/jenkins/workspace/lldb-cmake-matrix/lldb-build/./lib -llldb -Wl,-rpath,/Users/buildslave/jenkins/workspace/lldb-cmake-matrix/lldb-build/./lib'

Build Command Output:
"/Users/buildslave/jenkins/workspace/lldb-cmake-matrix/clang_502_build/bin/clang"  -std=c++11 -g -O0 -isysroot "/Applications/Xcode.app/Contents/Developer/Platforms/MacOSX.platform/Developer/SDKs/MacOSX11.1.sdk" -arch x86_64  -I/Users/buildslave/jenkins/workspace/lldb-cmake-matrix/llvm-project/lldb/packages/Python/lldbsuite/test/make/../../../../../include -I/Users/buildslave/jenkins/workspace/lldb-cmake-matrix/llvm-project/lldb/test/API/api/multiple-debuggers -I/Users/buildslave/jenkins/workspace/lldb-cmake-matrix/llvm-project/lldb/packages/Python/lldbsuite/test/make -include /Users/buildslave/jenkins/workspace/lldb-cmake-matrix/llvm-project/lldb/packages/Python/lldbsuite/test/make/test_common.h  -fno-limit-debug-info  -std=c++11 -stdlib=libc++ -I/Users/buildslave/jenkins/workspace/lldb-cmake-matrix/llvm-project/lldb/include   --driver-mode=g++ -MT multi-process-driver.o -MD -MP -MF multi-process-driver.d -c -o multi-process-driver.o /Users/buildslave/jenkins/workspace/lldb-cmake-matrix/llvm-project/lldb/test/API/api/multiple-debuggers/multi-process-driver.cpp
In file included from /Users/buildslave/jenkins/workspace/lldb-cmake-matrix/llvm-project/lldb/test/API/api/multiple-debuggers/multi-process-driver.cpp:17:
/Users/buildslave/jenkins/workspace/lldb-cmake-matrix/clang_502_build/include/c++/v1/stdlib.h:111:82: error: use of undeclared identifier 'labs'; did you mean 'abs'?
inline _LIBCPP_INLINE_VISIBILITY long      abs(     long __x) _NOEXCEPT {return  labs(__x);}
                                                                                 ^
/Users/buildslave/jenkins/workspace/lldb-cmake-matrix/clang_502_build/include/c++/v1/stdlib.h:111:44: note: 'abs' declared here
inline _LIBCPP_INLINE_VISIBILITY long      abs(     long __x) _NOEXCEPT {return  labs(__x);}
                                           ^
/Users/buildslave/jenkins/workspace/lldb-cmake-matrix/clang_502_build/include/c++/v1/stdlib.h:113:81: error: use of undeclared identifier 'llabs'
inline _LIBCPP_INLINE_VISIBILITY long long abs(long long __x) _NOEXCEPT {return llabs(__x);}
                                                                                ^
/Users/buildslave/jenkins/workspace/lldb-cmake-matrix/clang_502_build/include/c++/v1/stdlib.h:116:35: error: unknown type name 'ldiv_t'
inline _LIBCPP_INLINE_VISIBILITY  ldiv_t div(     long __x,      long __y) _NOEXCEPT {return  ldiv(__x, __y);}
                                  ^
/Users/buildslave/jenkins/workspace/lldb-cmake-matrix/clang_502_build/include/c++/v1/stdlib.h:116:95: error: use of undeclared identifier 'ldiv'; did you mean 'div'?
inline _LIBCPP_INLINE_VISIBILITY  ldiv_t div(     long __x,      long __y) _NOEXCEPT {return  ldiv(__x, __y);}
                                                                                              ^
/Users/buildslave/jenkins/workspace/lldb-cmake-matrix/clang_502_build/include/c++/v1/stdlib.h:116:42: note: 'div' declared here
inline _LIBCPP_INLINE_VISIBILITY  ldiv_t div(     long __x,      long __y) _NOEXCEPT {return  ldiv(__x, __y);}
                                         ^
/Users/buildslave/jenkins/workspace/lldb-cmake-matrix/clang_502_build/include/c++/v1/stdlib.h:118:34: error: unknown type name 'lldiv_t'
inline _LIBCPP_INLINE_VISIBILITY lldiv_t div(long long __x, long long __y) _NOEXCEPT {return lldiv(__x, __y);}
                                 ^
/Users/buildslave/jenkins/workspace/lldb-cmake-matrix/clang_502_build/include/c++/v1/stdlib.h:118:94: error: use of undeclared identifier 'lldiv'
inline _LIBCPP_INLINE_VISIBILITY lldiv_t div(long long __x, long long __y) _NOEXCEPT {return lldiv(__x, __y);}
                                                                                             ^
In file included from /Users/buildslave/jenkins/workspace/lldb-cmake-matrix/llvm-project/lldb/test/API/api/multiple-debuggers/multi-process-driver.cpp:18:
/Users/buildslave/jenkins/workspace/lldb-cmake-matrix/clang_502_build/include/c++/v1/string.h:74:64: error: use of undeclared identifier 'strchr'
char* __libcpp_strchr(const char* __s, int __c) {return (char*)strchr(__s, __c);}
                                                               ^
/Users/buildslave/jenkins/workspace/lldb-cmake-matrix/clang_502_build/include/c++/v1/string.h:81:75: error: use of undeclared identifier 'strpbrk'
char* __libcpp_strpbrk(const char* __s1, const char* __s2) {return (char*)strpbrk(__s1, __s2);}
                                                                          ^
/Users/buildslave/jenkins/workspace/lldb-cmake-matrix/clang_502_build/include/c++/v1/string.h:88:65: error: use of undeclared identifier 'strrchr'; did you mean 'strchr'?
char* __libcpp_strrchr(const char* __s, int __c) {return (char*)strrchr(__s, __c);}
                                                                ^
/Users/buildslave/jenkins/workspace/lldb-cmake-matrix/clang_502_build/include/c++/v1/string.h:76:13: note: 'strchr' declared here
const char* strchr(const char* __s, int __c) {return __libcpp_strchr(__s, __c);}
            ^
/Users/buildslave/jenkins/workspace/lldb-cmake-matrix/clang_502_build/include/c++/v1/string.h:95:49: error: unknown type name 'size_t'
void* __libcpp_memchr(const void* __s, int __c, size_t __n) {return (void*)memchr(__s, __c, __n);}
                                                ^
/Users/buildslave/jenkins/workspace/lldb-cmake-matrix/clang_502_build/include/c++/v1/string.h:97:46: error: unknown type name 'size_t'
const void* memchr(const void* __s, int __c, size_t __n) {return __libcpp_memchr(__s, __c, __n);}
                                             ^
/Users/buildslave/jenkins/workspace/lldb-cmake-matrix/clang_502_build/include/c++/v1/string.h:99:46: error: unknown type name 'size_t'
      void* memchr(      void* __s, int __c, size_t __n) {return __libcpp_memchr(__s, __c, __n);}
                                             ^
/Users/buildslave/jenkins/workspace/lldb-cmake-matrix/clang_502_build/include/c++/v1/string.h:102:74: error: use of undeclared identifier 'strstr'; did you mean 'strchr'?
char* __libcpp_strstr(const char* __s1, const char* __s2) {return (char*)strstr(__s1, __s2);}
                                                                         ^
/Users/buildslave/jenkins/workspace/lldb-cmake-matrix/clang_502_build/include/c++/v1/string.h:78:13: note: 'strchr' declared here
      char* strchr(      char* __s, int __c) {return __libcpp_strchr(__s, __c);}
            ^
/Users/buildslave/jenkins/workspace/lldb-cmake-matrix/clang_502_build/include/c++/v1/string.h:102:74: error: no matching function for call to 'strchr'
char* __libcpp_strstr(const char* __s1, const char* __s2) {return (char*)strstr(__s1, __s2);}
                                                                         ^
/Users/buildslave/jenkins/workspace/lldb-cmake-matrix/clang_502_build/include/c++/v1/string.h:78:13: note: candidate disabled: <no message provided>
      char* strchr(      char* __s, int __c) {return __libcpp_strchr(__s, __c);}
            ^
/Users/buildslave/jenkins/workspace/lldb-cmake-matrix/clang_502_build/include/c++/v1/string.h:102:81: error: cannot initialize a parameter of type 'char *' with an lvalue of type 'const char *'
char* __libcpp_strstr(const char* __s1, const char* __s2) {return (char*)strstr(__s1, __s2);}
                                                                                ^~~~
/Users/buildslave/jenkins/workspace/lldb-cmake-matrix/clang_502_build/include/c++/v1/string.h:78:32: note: passing argument to parameter '__s' here
      char* strchr(      char* __s, int __c) {return __libcpp_strchr(__s, __c);}
                               ^
In file included from /Users/buildslave/jenkins/workspace/lldb-cmake-matrix/llvm-project/lldb/test/API/api/multiple-debuggers/multi-process-driver.cpp:20:
In file included from /Users/buildslave/jenkins/workspace/lldb-cmake-matrix/llvm-project/lldb/packages/Python/lldbsuite/test/make/../../../../../include/lldb/API/LLDB.h:12:
In file included from /Users/buildslave/jenkins/workspace/lldb-cmake-matrix/llvm-project/lldb/packages/Python/lldbsuite/test/make/../../../../../include/lldb/API/SBAddress.h:12:
In file included from /Users/buildslave/jenkins/workspace/lldb-cmake-matrix/llvm-project/lldb/packages/Python/lldbsuite/test/make/../../../../../include/lldb/API/SBDefines.h:12:
In file included from /Users/buildslave/jenkins/workspace/lldb-cmake-matrix/llvm-project/lldb/packages/Python/lldbsuite/test/make/../../../../../include/lldb/lldb-defines.h:12:
In file included from /Users/buildslave/jenkins/workspace/lldb-cmake-matrix/llvm-project/lldb/packages/Python/lldbsuite/test/make/../../../../../include/lldb/lldb-types.h:13:
In file included from /Users/buildslave/jenkins/workspace/lldb-cmake-matrix/llvm-project/lldb/packages/Python/lldbsuite/test/make/../../../../../include/lldb/lldb-forward.h:14:
In file included from /Users/buildslave/jenkins/workspace/lldb-cmake-matrix/clang_502_build/include/c++/v1/memory:644:
In file included from /Users/buildslave/jenkins/workspace/lldb-cmake-matrix/clang_502_build/include/c++/v1/typeinfo:61:
In file included from /Users/buildslave/jenkins/workspace/lldb-cmake-matrix/clang_502_build/include/c++/v1/exception:82:
/Users/buildslave/jenkins/workspace/lldb-cmake-matrix/clang_502_build/include/c++/v1/cstdlib:101:9: error: no member named 'div_t' in the global namespace
using ::div_t;
      ~~^
/Users/buildslave/jenkins/workspace/lldb-cmake-matrix/clang_502_build/include/c++/v1/cstdlib:102:9: error: no member named 'ldiv_t' in the global namespace
using ::ldiv_t;
      ~~^
/Users/buildslave/jenkins/workspace/lldb-cmake-matrix/clang_502_build/include/c++/v1/cstdlib:104:9: error: no member named 'lldiv_t' in the global namespace
using ::lldiv_t;
      ~~^
/Users/buildslave/jenkins/workspace/lldb-cmake-matrix/clang_502_build/include/c++/v1/cstdlib:106:9: error: no member named 'atof' in the global namespace
using ::atof;
      ~~^
fatal error: too many errors emitted, stopping now [-ferror-limit=]
20 errors generated.
make: *** [multi-process-driver.o] Error 1

Test Directory:
/Users/buildslave/jenkins/workspace/lldb-cmake-matrix/llvm-project/lldb/test/API/api/multiple-debuggers
----------------------------------------------------------------------
Ran 1 test in 0.776s

RESULT: FAILED (0 passes, 0 failures, 1 errors, 0 skipped, 0 expected failures, 0 unexpected successes)

--