Regression

Test Clang 9.0.0 / lldb-api.commands/expression/import-std-module/array.TestArrayFromStdModule.py (from lldb-api)

Failing for the past 1 build (Since #5040 )
Took 3.6 sec.

Stacktrace

Script:
--
/Applications/Xcode.app/Contents/Developer/Library/Frameworks/Python3.framework/Versions/3.8/bin/python3.8 /Users/buildslave/jenkins/workspace/lldb-cmake-matrix/llvm-project/lldb/test/API/dotest.py -u CXXFLAGS -u CFLAGS --codesign-identity lldb_codesign --arch x86_64 --build-dir /Users/buildslave/jenkins/workspace/lldb-cmake-matrix/lldb-build/lldb-test-build.noindex -t --env TERM=vt100 --skip-category gmodules --skip-category watchpoint --skip-category llgs --skip-category debugserver --arch=x86_64 --env LLVM_LIBS_DIR=/Users/buildslave/jenkins/workspace/lldb-cmake-matrix/lldb-build/./lib --env LLVM_INCLUDE_DIR=/Users/buildslave/jenkins/workspace/lldb-cmake-matrix/lldb-build/include --env LLVM_TOOLS_DIR=/Users/buildslave/jenkins/workspace/lldb-cmake-matrix/lldb-build/./bin --hermetic-libcxx --arch x86_64 --build-dir /Users/buildslave/jenkins/workspace/lldb-cmake-matrix/lldb-build/lldb-test-build.noindex --lldb-module-cache-dir /Users/buildslave/jenkins/workspace/lldb-cmake-matrix/lldb-build/lldb-test-build.noindex/module-cache-lldb/lldb-api --clang-module-cache-dir /Users/buildslave/jenkins/workspace/lldb-cmake-matrix/lldb-build/lldb-test-build.noindex/module-cache-clang/lldb-api --executable /Users/buildslave/jenkins/workspace/lldb-cmake-matrix/lldb-build/./bin/lldb --compiler /Users/buildslave/jenkins/workspace/lldb-cmake-matrix/clang_900_build/bin/clang --dsymutil /Users/buildslave/jenkins/workspace/lldb-cmake-matrix/lldb-build/./bin/dsymutil --llvm-tools-dir /Users/buildslave/jenkins/workspace/lldb-cmake-matrix/lldb-build/./bin --lldb-libs-dir /Users/buildslave/jenkins/workspace/lldb-cmake-matrix/lldb-build/./lib /Users/buildslave/jenkins/workspace/lldb-cmake-matrix/llvm-project/lldb/test/API/commands/expression/import-std-module/array -p TestArrayFromStdModule.py
--
Exit Code: 1

Command Output (stdout):
--
lldb version 16.0.99git (http://labmaster3.local/git/llvm-project.git revision d1f36da9e03baeccb2f4dd8095f8aaf5b4547c68)
  clang revision d1f36da9e03baeccb2f4dd8095f8aaf5b4547c68
  llvm revision d1f36da9e03baeccb2f4dd8095f8aaf5b4547c68
Skipping the following test categories: ['gmodules', 'watchpoint', 'llgs', 'debugserver', 'libstdcxx', 'dwo', 'llgs', 'fork']

--
Command Output (stderr):
--
Change dir to: /Users/buildslave/jenkins/workspace/lldb-cmake-matrix/llvm-project/lldb/test/API/commands/expression/import-std-module/array
runCmd: settings clear -all
output: 

runCmd: settings set symbols.enable-external-lookup false
output: 

runCmd: settings set target.inherit-tcc true
output: 

runCmd: settings set target.detach-on-error false
output: 

runCmd: settings set target.auto-apply-fixits false
output: 

runCmd: settings set plugin.process.gdb-remote.packet-timeout 60
output: 

runCmd: settings set symbols.clang-modules-cache-path "/Users/buildslave/jenkins/workspace/lldb-cmake-matrix/lldb-build/lldb-test-build.noindex/module-cache-lldb/lldb-api"
output: 

runCmd: settings set use-color false
output: 

runCmd: setting set target.prefer-dynamic-value no-dynamic-values
output: 

make VPATH=/Users/buildslave/jenkins/workspace/lldb-cmake-matrix/llvm-project/lldb/test/API/commands/expression/import-std-module/array -C /Users/buildslave/jenkins/workspace/lldb-cmake-matrix/lldb-build/lldb-test-build.noindex/commands/expression/import-std-module/array/TestArrayFromStdModule.test_dsym -I /Users/buildslave/jenkins/workspace/lldb-cmake-matrix/llvm-project/lldb/test/API/commands/expression/import-std-module/array -I /Users/buildslave/jenkins/workspace/lldb-cmake-matrix/llvm-project/lldb/packages/Python/lldbsuite/test/make -f /Users/buildslave/jenkins/workspace/lldb-cmake-matrix/llvm-project/lldb/test/API/commands/expression/import-std-module/array/Makefile MAKE_DSYM=YES all ARCH=x86_64 'CC="/Users/buildslave/jenkins/workspace/lldb-cmake-matrix/clang_900_build/bin/clang"' DSYMUTIL=/Users/buildslave/jenkins/workspace/lldb-cmake-matrix/lldb-build/./bin/dsymutil CODESIGN=codesign CLANG_MODULE_CACHE_DIR=/Users/buildslave/jenkins/workspace/lldb-cmake-matrix/lldb-build/lldb-test-build.noindex/module-cache-clang/lldb-api USE_HERMETIC_LIBCPP=1

FAIL: LLDB (/Users/buildslave/jenkins/workspace/lldb-cmake-matrix/clang_900_build/bin/clang-x86_64) :: test_dsym (TestArrayFromStdModule.TestCase)
runCmd: settings clear -all
output: 

runCmd: settings set symbols.enable-external-lookup false
output: 

runCmd: settings set target.inherit-tcc true
output: 

runCmd: settings set target.detach-on-error false
output: 

runCmd: settings set target.auto-apply-fixits false
output: 

runCmd: settings set plugin.process.gdb-remote.packet-timeout 60
output: 

runCmd: settings set symbols.clang-modules-cache-path "/Users/buildslave/jenkins/workspace/lldb-cmake-matrix/lldb-build/lldb-test-build.noindex/module-cache-lldb/lldb-api"
output: 

runCmd: settings set use-color false
output: 

runCmd: setting set target.prefer-dynamic-value no-dynamic-values
output: 

make VPATH=/Users/buildslave/jenkins/workspace/lldb-cmake-matrix/llvm-project/lldb/test/API/commands/expression/import-std-module/array -C /Users/buildslave/jenkins/workspace/lldb-cmake-matrix/lldb-build/lldb-test-build.noindex/commands/expression/import-std-module/array/TestArrayFromStdModule.test_dwarf -I /Users/buildslave/jenkins/workspace/lldb-cmake-matrix/llvm-project/lldb/test/API/commands/expression/import-std-module/array -I /Users/buildslave/jenkins/workspace/lldb-cmake-matrix/llvm-project/lldb/packages/Python/lldbsuite/test/make -f /Users/buildslave/jenkins/workspace/lldb-cmake-matrix/llvm-project/lldb/test/API/commands/expression/import-std-module/array/Makefile MAKE_DSYM=NO all ARCH=x86_64 'CC="/Users/buildslave/jenkins/workspace/lldb-cmake-matrix/clang_900_build/bin/clang"' DSYMUTIL=/Users/buildslave/jenkins/workspace/lldb-cmake-matrix/lldb-build/./bin/dsymutil CODESIGN=codesign CLANG_MODULE_CACHE_DIR=/Users/buildslave/jenkins/workspace/lldb-cmake-matrix/lldb-build/lldb-test-build.noindex/module-cache-clang/lldb-api USE_HERMETIC_LIBCPP=1

FAIL: LLDB (/Users/buildslave/jenkins/workspace/lldb-cmake-matrix/clang_900_build/bin/clang-x86_64) :: test_dwarf (TestArrayFromStdModule.TestCase)
UNSUPPORTED: LLDB (/Users/buildslave/jenkins/workspace/lldb-cmake-matrix/clang_900_build/bin/clang-x86_64) :: test_dwo (TestArrayFromStdModule.TestCase) (test case does not fall in any category of interest for this run) 
UNSUPPORTED: LLDB (/Users/buildslave/jenkins/workspace/lldb-cmake-matrix/clang_900_build/bin/clang-x86_64) :: test_gmodules (TestArrayFromStdModule.TestCase) (test case does not fall in any category of interest for this run) 
Restore dir to: /Users/buildslave/jenkins/workspace/lldb-cmake-matrix/lldb-build/tools/lldb/test
======================================================================
ERROR: test_dsym (TestArrayFromStdModule.TestCase)
----------------------------------------------------------------------
Error when building test subject.

Build Command:
make VPATH=/Users/buildslave/jenkins/workspace/lldb-cmake-matrix/llvm-project/lldb/test/API/commands/expression/import-std-module/array -C /Users/buildslave/jenkins/workspace/lldb-cmake-matrix/lldb-build/lldb-test-build.noindex/commands/expression/import-std-module/array/TestArrayFromStdModule.test_dsym -I /Users/buildslave/jenkins/workspace/lldb-cmake-matrix/llvm-project/lldb/test/API/commands/expression/import-std-module/array -I /Users/buildslave/jenkins/workspace/lldb-cmake-matrix/llvm-project/lldb/packages/Python/lldbsuite/test/make -f /Users/buildslave/jenkins/workspace/lldb-cmake-matrix/llvm-project/lldb/test/API/commands/expression/import-std-module/array/Makefile MAKE_DSYM=YES all ARCH=x86_64 'CC="/Users/buildslave/jenkins/workspace/lldb-cmake-matrix/clang_900_build/bin/clang"' DSYMUTIL=/Users/buildslave/jenkins/workspace/lldb-cmake-matrix/lldb-build/./bin/dsymutil CODESIGN=codesign CLANG_MODULE_CACHE_DIR=/Users/buildslave/jenkins/workspace/lldb-cmake-matrix/lldb-build/lldb-test-build.noindex/module-cache-clang/lldb-api USE_HERMETIC_LIBCPP=1

Build Command Output:
"/Users/buildslave/jenkins/workspace/lldb-cmake-matrix/clang_900_build/bin/clang"  -std=c++11 -g -O0 -isysroot "/Applications/Xcode.app/Contents/Developer/Platforms/MacOSX.platform/Developer/SDKs/MacOSX11.1.sdk" -arch x86_64  -I/Users/buildslave/jenkins/workspace/lldb-cmake-matrix/llvm-project/lldb/packages/Python/lldbsuite/test/make/../../../../../include -I/Users/buildslave/jenkins/workspace/lldb-cmake-matrix/llvm-project/lldb/test/API/commands/expression/import-std-module/array -I/Users/buildslave/jenkins/workspace/lldb-cmake-matrix/llvm-project/lldb/packages/Python/lldbsuite/test/make -include /Users/buildslave/jenkins/workspace/lldb-cmake-matrix/llvm-project/lldb/packages/Python/lldbsuite/test/make/test_common.h  -fno-limit-debug-info    -DLLDB_USING_LIBCPP -D_LIBCPP_NO_ABI_TAG -stdlib=libc++  --driver-mode=g++ -MT main.o -MD -MP -MF main.d -c -o main.o /Users/buildslave/jenkins/workspace/lldb-cmake-matrix/llvm-project/lldb/test/API/commands/expression/import-std-module/array/main.cpp
In file included from /Users/buildslave/jenkins/workspace/lldb-cmake-matrix/llvm-project/lldb/test/API/commands/expression/import-std-module/array/main.cpp:1:
In file included from /Users/buildslave/jenkins/workspace/lldb-cmake-matrix/clang_900_build/bin/../include/c++/v1/array:109:
In file included from /Users/buildslave/jenkins/workspace/lldb-cmake-matrix/clang_900_build/bin/../include/c++/v1/utility:203:
In file included from /Users/buildslave/jenkins/workspace/lldb-cmake-matrix/clang_900_build/bin/../include/c++/v1/cstring:60:
/Users/buildslave/jenkins/workspace/lldb-cmake-matrix/clang_900_build/bin/../include/c++/v1/string.h:73:64: error: use of undeclared identifier 'strchr'
char* __libcpp_strchr(const char* __s, int __c) {return (char*)strchr(__s, __c);}
                                                               ^
/Users/buildslave/jenkins/workspace/lldb-cmake-matrix/clang_900_build/bin/../include/c++/v1/string.h:80:75: error: use of undeclared identifier 'strpbrk'
char* __libcpp_strpbrk(const char* __s1, const char* __s2) {return (char*)strpbrk(__s1, __s2);}
                                                                          ^
/Users/buildslave/jenkins/workspace/lldb-cmake-matrix/clang_900_build/bin/../include/c++/v1/string.h:87:65: error: use of undeclared identifier 'strrchr'; did you mean 'strchr'?
char* __libcpp_strrchr(const char* __s, int __c) {return (char*)strrchr(__s, __c);}
                                                                ^
/Users/buildslave/jenkins/workspace/lldb-cmake-matrix/clang_900_build/bin/../include/c++/v1/string.h:75:13: note: 'strchr' declared here
const char* strchr(const char* __s, int __c) {return __libcpp_strchr(__s, __c);}
            ^
/Users/buildslave/jenkins/workspace/lldb-cmake-matrix/clang_900_build/bin/../include/c++/v1/string.h:94:76: error: use of undeclared identifier 'memchr'
void* __libcpp_memchr(const void* __s, int __c, size_t __n) {return (void*)memchr(__s, __c, __n);}
                                                                           ^
/Users/buildslave/jenkins/workspace/lldb-cmake-matrix/clang_900_build/bin/../include/c++/v1/string.h:101:74: error: use of undeclared identifier 'strstr'; did you mean 'strchr'?
char* __libcpp_strstr(const char* __s1, const char* __s2) {return (char*)strstr(__s1, __s2);}
                                                                         ^
/Users/buildslave/jenkins/workspace/lldb-cmake-matrix/clang_900_build/bin/../include/c++/v1/string.h:77:13: note: 'strchr' declared here
      char* strchr(      char* __s, int __c) {return __libcpp_strchr(__s, __c);}
            ^
/Users/buildslave/jenkins/workspace/lldb-cmake-matrix/clang_900_build/bin/../include/c++/v1/string.h:101:74: error: no matching function for call to 'strchr'
char* __libcpp_strstr(const char* __s1, const char* __s2) {return (char*)strstr(__s1, __s2);}
                                                                         ^
/Users/buildslave/jenkins/workspace/lldb-cmake-matrix/clang_900_build/bin/../include/c++/v1/string.h:77:13: note: candidate disabled: <no message provided>
      char* strchr(      char* __s, int __c) {return __libcpp_strchr(__s, __c);}
            ^
/Users/buildslave/jenkins/workspace/lldb-cmake-matrix/clang_900_build/bin/../include/c++/v1/string.h:101:81: error: cannot initialize a parameter of type 'char *' with an lvalue of type 'const char *'
char* __libcpp_strstr(const char* __s1, const char* __s2) {return (char*)strstr(__s1, __s2);}
                                                                                ^~~~
/Users/buildslave/jenkins/workspace/lldb-cmake-matrix/clang_900_build/bin/../include/c++/v1/string.h:77:32: note: passing argument to parameter '__s' here
      char* strchr(      char* __s, int __c) {return __libcpp_strchr(__s, __c);}
                               ^
In file included from /Users/buildslave/jenkins/workspace/lldb-cmake-matrix/llvm-project/lldb/test/API/commands/expression/import-std-module/array/main.cpp:1:
In file included from /Users/buildslave/jenkins/workspace/lldb-cmake-matrix/clang_900_build/bin/../include/c++/v1/array:109:
In file included from /Users/buildslave/jenkins/workspace/lldb-cmake-matrix/clang_900_build/bin/../include/c++/v1/utility:203:
/Users/buildslave/jenkins/workspace/lldb-cmake-matrix/clang_900_build/bin/../include/c++/v1/cstring:69:9: error: no member named 'memcpy' in the global namespace; did you mean 'memchr'?
using ::memcpy;
      ~~^
/Users/buildslave/jenkins/workspace/lldb-cmake-matrix/clang_900_build/bin/../include/c++/v1/string.h:96:13: note: 'memchr' declared here
const void* memchr(const void* __s, int __c, size_t __n) {return __libcpp_memchr(__s, __c, __n);}
            ^
In file included from /Users/buildslave/jenkins/workspace/lldb-cmake-matrix/llvm-project/lldb/test/API/commands/expression/import-std-module/array/main.cpp:1:
In file included from /Users/buildslave/jenkins/workspace/lldb-cmake-matrix/clang_900_build/bin/../include/c++/v1/array:109:
In file included from /Users/buildslave/jenkins/workspace/lldb-cmake-matrix/clang_900_build/bin/../include/c++/v1/utility:203:
/Users/buildslave/jenkins/workspace/lldb-cmake-matrix/clang_900_build/bin/../include/c++/v1/cstring:70:9: error: no member named 'memmove' in the global namespace
using ::memmove;
      ~~^
/Users/buildslave/jenkins/workspace/lldb-cmake-matrix/clang_900_build/bin/../include/c++/v1/cstring:71:9: error: no member named 'strcpy' in the global namespace; did you mean 'strchr'?
using ::strcpy;
      ~~^
/Users/buildslave/jenkins/workspace/lldb-cmake-matrix/clang_900_build/bin/../include/c++/v1/string.h:75:13: note: 'strchr' declared here
const char* strchr(const char* __s, int __c) {return __libcpp_strchr(__s, __c);}
            ^
In file included from /Users/buildslave/jenkins/workspace/lldb-cmake-matrix/llvm-project/lldb/test/API/commands/expression/import-std-module/array/main.cpp:1:
In file included from /Users/buildslave/jenkins/workspace/lldb-cmake-matrix/clang_900_build/bin/../include/c++/v1/array:109:
In file included from /Users/buildslave/jenkins/workspace/lldb-cmake-matrix/clang_900_build/bin/../include/c++/v1/utility:203:
/Users/buildslave/jenkins/workspace/lldb-cmake-matrix/clang_900_build/bin/../include/c++/v1/cstring:72:9: error: no member named 'strncpy' in the global namespace
using ::strncpy;
      ~~^
/Users/buildslave/jenkins/workspace/lldb-cmake-matrix/clang_900_build/bin/../include/c++/v1/cstring:73:9: error: no member named 'strcat' in the global namespace; did you mean 'strchr'?
using ::strcat;
      ~~^
/Users/buildslave/jenkins/workspace/lldb-cmake-matrix/clang_900_build/bin/../include/c++/v1/string.h:75:13: note: 'strchr' declared here
const char* strchr(const char* __s, int __c) {return __libcpp_strchr(__s, __c);}
            ^
In file included from /Users/buildslave/jenkins/workspace/lldb-cmake-matrix/llvm-project/lldb/test/API/commands/expression/import-std-module/array/main.cpp:1:
In file included from /Users/buildslave/jenkins/workspace/lldb-cmake-matrix/clang_900_build/bin/../include/c++/v1/array:109:
In file included from /Users/buildslave/jenkins/workspace/lldb-cmake-matrix/clang_900_build/bin/../include/c++/v1/utility:203:
/Users/buildslave/jenkins/workspace/lldb-cmake-matrix/clang_900_build/bin/../include/c++/v1/cstring:74:9: error: no member named 'strncat' in the global namespace
using ::strncat;
      ~~^
/Users/buildslave/jenkins/workspace/lldb-cmake-matrix/clang_900_build/bin/../include/c++/v1/cstring:75:9: error: no member named 'memcmp' in the global namespace; did you mean 'memchr'?
using ::memcmp;
      ~~^
/Users/buildslave/jenkins/workspace/lldb-cmake-matrix/clang_900_build/bin/../include/c++/v1/string.h:96:13: note: 'memchr' declared here
const void* memchr(const void* __s, int __c, size_t __n) {return __libcpp_memchr(__s, __c, __n);}
            ^
In file included from /Users/buildslave/jenkins/workspace/lldb-cmake-matrix/llvm-project/lldb/test/API/commands/expression/import-std-module/array/main.cpp:1:
In file included from /Users/buildslave/jenkins/workspace/lldb-cmake-matrix/clang_900_build/bin/../include/c++/v1/array:109:
In file included from /Users/buildslave/jenkins/workspace/lldb-cmake-matrix/clang_900_build/bin/../include/c++/v1/utility:203:
/Users/buildslave/jenkins/workspace/lldb-cmake-matrix/clang_900_build/bin/../include/c++/v1/cstring:76:9: error: no member named 'strcmp' in the global namespace; did you mean 'strchr'?
using ::strcmp;
      ~~^
/Users/buildslave/jenkins/workspace/lldb-cmake-matrix/clang_900_build/bin/../include/c++/v1/string.h:75:13: note: 'strchr' declared here
const char* strchr(const char* __s, int __c) {return __libcpp_strchr(__s, __c);}
            ^
In file included from /Users/buildslave/jenkins/workspace/lldb-cmake-matrix/llvm-project/lldb/test/API/commands/expression/import-std-module/array/main.cpp:1:
In file included from /Users/buildslave/jenkins/workspace/lldb-cmake-matrix/clang_900_build/bin/../include/c++/v1/array:109:
In file included from /Users/buildslave/jenkins/workspace/lldb-cmake-matrix/clang_900_build/bin/../include/c++/v1/utility:203:
/Users/buildslave/jenkins/workspace/lldb-cmake-matrix/clang_900_build/bin/../include/c++/v1/cstring:77:9: error: no member named 'strncmp' in the global namespace
using ::strncmp;
      ~~^
/Users/buildslave/jenkins/workspace/lldb-cmake-matrix/clang_900_build/bin/../include/c++/v1/cstring:78:9: error: no member named 'strcoll' in the global namespace
using ::strcoll;
      ~~^
/Users/buildslave/jenkins/workspace/lldb-cmake-matrix/clang_900_build/bin/../include/c++/v1/cstring:79:9: error: no member named 'strxfrm' in the global namespace
using ::strxfrm;
      ~~^
/Users/buildslave/jenkins/workspace/lldb-cmake-matrix/clang_900_build/bin/../include/c++/v1/cstring:82:9: error: no member named 'strcspn' in the global namespace
using ::strcspn;
      ~~^
fatal error: too many errors emitted, stopping now [-ferror-limit=]
20 errors generated.
make: *** [main.o] Error 1

Test Directory:
/Users/buildslave/jenkins/workspace/lldb-cmake-matrix/llvm-project/lldb/test/API/commands/expression/import-std-module/array
======================================================================
ERROR: test_dwarf (TestArrayFromStdModule.TestCase)
----------------------------------------------------------------------
Error when building test subject.

Build Command:
make VPATH=/Users/buildslave/jenkins/workspace/lldb-cmake-matrix/llvm-project/lldb/test/API/commands/expression/import-std-module/array -C /Users/buildslave/jenkins/workspace/lldb-cmake-matrix/lldb-build/lldb-test-build.noindex/commands/expression/import-std-module/array/TestArrayFromStdModule.test_dwarf -I /Users/buildslave/jenkins/workspace/lldb-cmake-matrix/llvm-project/lldb/test/API/commands/expression/import-std-module/array -I /Users/buildslave/jenkins/workspace/lldb-cmake-matrix/llvm-project/lldb/packages/Python/lldbsuite/test/make -f /Users/buildslave/jenkins/workspace/lldb-cmake-matrix/llvm-project/lldb/test/API/commands/expression/import-std-module/array/Makefile MAKE_DSYM=NO all ARCH=x86_64 'CC="/Users/buildslave/jenkins/workspace/lldb-cmake-matrix/clang_900_build/bin/clang"' DSYMUTIL=/Users/buildslave/jenkins/workspace/lldb-cmake-matrix/lldb-build/./bin/dsymutil CODESIGN=codesign CLANG_MODULE_CACHE_DIR=/Users/buildslave/jenkins/workspace/lldb-cmake-matrix/lldb-build/lldb-test-build.noindex/module-cache-clang/lldb-api USE_HERMETIC_LIBCPP=1

Build Command Output:
"/Users/buildslave/jenkins/workspace/lldb-cmake-matrix/clang_900_build/bin/clang"  -std=c++11 -g -O0 -isysroot "/Applications/Xcode.app/Contents/Developer/Platforms/MacOSX.platform/Developer/SDKs/MacOSX11.1.sdk" -arch x86_64  -I/Users/buildslave/jenkins/workspace/lldb-cmake-matrix/llvm-project/lldb/packages/Python/lldbsuite/test/make/../../../../../include -I/Users/buildslave/jenkins/workspace/lldb-cmake-matrix/llvm-project/lldb/test/API/commands/expression/import-std-module/array -I/Users/buildslave/jenkins/workspace/lldb-cmake-matrix/llvm-project/lldb/packages/Python/lldbsuite/test/make -include /Users/buildslave/jenkins/workspace/lldb-cmake-matrix/llvm-project/lldb/packages/Python/lldbsuite/test/make/test_common.h  -fno-limit-debug-info    -DLLDB_USING_LIBCPP -D_LIBCPP_NO_ABI_TAG -stdlib=libc++  --driver-mode=g++ -MT main.o -MD -MP -MF main.d -c -o main.o /Users/buildslave/jenkins/workspace/lldb-cmake-matrix/llvm-project/lldb/test/API/commands/expression/import-std-module/array/main.cpp
In file included from /Users/buildslave/jenkins/workspace/lldb-cmake-matrix/llvm-project/lldb/test/API/commands/expression/import-std-module/array/main.cpp:1:
In file included from /Users/buildslave/jenkins/workspace/lldb-cmake-matrix/clang_900_build/bin/../include/c++/v1/array:109:
In file included from /Users/buildslave/jenkins/workspace/lldb-cmake-matrix/clang_900_build/bin/../include/c++/v1/utility:203:
In file included from /Users/buildslave/jenkins/workspace/lldb-cmake-matrix/clang_900_build/bin/../include/c++/v1/cstring:60:
/Users/buildslave/jenkins/workspace/lldb-cmake-matrix/clang_900_build/bin/../include/c++/v1/string.h:73:64: error: use of undeclared identifier 'strchr'
char* __libcpp_strchr(const char* __s, int __c) {return (char*)strchr(__s, __c);}
                                                               ^
/Users/buildslave/jenkins/workspace/lldb-cmake-matrix/clang_900_build/bin/../include/c++/v1/string.h:80:75: error: use of undeclared identifier 'strpbrk'
char* __libcpp_strpbrk(const char* __s1, const char* __s2) {return (char*)strpbrk(__s1, __s2);}
                                                                          ^
/Users/buildslave/jenkins/workspace/lldb-cmake-matrix/clang_900_build/bin/../include/c++/v1/string.h:87:65: error: use of undeclared identifier 'strrchr'; did you mean 'strchr'?
char* __libcpp_strrchr(const char* __s, int __c) {return (char*)strrchr(__s, __c);}
                                                                ^
/Users/buildslave/jenkins/workspace/lldb-cmake-matrix/clang_900_build/bin/../include/c++/v1/string.h:75:13: note: 'strchr' declared here
const char* strchr(const char* __s, int __c) {return __libcpp_strchr(__s, __c);}
            ^
/Users/buildslave/jenkins/workspace/lldb-cmake-matrix/clang_900_build/bin/../include/c++/v1/string.h:94:76: error: use of undeclared identifier 'memchr'
void* __libcpp_memchr(const void* __s, int __c, size_t __n) {return (void*)memchr(__s, __c, __n);}
                                                                           ^
/Users/buildslave/jenkins/workspace/lldb-cmake-matrix/clang_900_build/bin/../include/c++/v1/string.h:101:74: error: use of undeclared identifier 'strstr'; did you mean 'strchr'?
char* __libcpp_strstr(const char* __s1, const char* __s2) {return (char*)strstr(__s1, __s2);}
                                                                         ^
/Users/buildslave/jenkins/workspace/lldb-cmake-matrix/clang_900_build/bin/../include/c++/v1/string.h:77:13: note: 'strchr' declared here
      char* strchr(      char* __s, int __c) {return __libcpp_strchr(__s, __c);}
            ^
/Users/buildslave/jenkins/workspace/lldb-cmake-matrix/clang_900_build/bin/../include/c++/v1/string.h:101:74: error: no matching function for call to 'strchr'
char* __libcpp_strstr(const char* __s1, const char* __s2) {return (char*)strstr(__s1, __s2);}
                                                                         ^
/Users/buildslave/jenkins/workspace/lldb-cmake-matrix/clang_900_build/bin/../include/c++/v1/string.h:77:13: note: candidate disabled: <no message provided>
      char* strchr(      char* __s, int __c) {return __libcpp_strchr(__s, __c);}
            ^
/Users/buildslave/jenkins/workspace/lldb-cmake-matrix/clang_900_build/bin/../include/c++/v1/string.h:101:81: error: cannot initialize a parameter of type 'char *' with an lvalue of type 'const char *'
char* __libcpp_strstr(const char* __s1, const char* __s2) {return (char*)strstr(__s1, __s2);}
                                                                                ^~~~
/Users/buildslave/jenkins/workspace/lldb-cmake-matrix/clang_900_build/bin/../include/c++/v1/string.h:77:32: note: passing argument to parameter '__s' here
      char* strchr(      char* __s, int __c) {return __libcpp_strchr(__s, __c);}
                               ^
In file included from /Users/buildslave/jenkins/workspace/lldb-cmake-matrix/llvm-project/lldb/test/API/commands/expression/import-std-module/array/main.cpp:1:
In file included from /Users/buildslave/jenkins/workspace/lldb-cmake-matrix/clang_900_build/bin/../include/c++/v1/array:109:
In file included from /Users/buildslave/jenkins/workspace/lldb-cmake-matrix/clang_900_build/bin/../include/c++/v1/utility:203:
/Users/buildslave/jenkins/workspace/lldb-cmake-matrix/clang_900_build/bin/../include/c++/v1/cstring:69:9: error: no member named 'memcpy' in the global namespace; did you mean 'memchr'?
using ::memcpy;
      ~~^
/Users/buildslave/jenkins/workspace/lldb-cmake-matrix/clang_900_build/bin/../include/c++/v1/string.h:96:13: note: 'memchr' declared here
const void* memchr(const void* __s, int __c, size_t __n) {return __libcpp_memchr(__s, __c, __n);}
            ^
In file included from /Users/buildslave/jenkins/workspace/lldb-cmake-matrix/llvm-project/lldb/test/API/commands/expression/import-std-module/array/main.cpp:1:
In file included from /Users/buildslave/jenkins/workspace/lldb-cmake-matrix/clang_900_build/bin/../include/c++/v1/array:109:
In file included from /Users/buildslave/jenkins/workspace/lldb-cmake-matrix/clang_900_build/bin/../include/c++/v1/utility:203:
/Users/buildslave/jenkins/workspace/lldb-cmake-matrix/clang_900_build/bin/../include/c++/v1/cstring:70:9: error: no member named 'memmove' in the global namespace
using ::memmove;
      ~~^
/Users/buildslave/jenkins/workspace/lldb-cmake-matrix/clang_900_build/bin/../include/c++/v1/cstring:71:9: error: no member named 'strcpy' in the global namespace; did you mean 'strchr'?
using ::strcpy;
      ~~^
/Users/buildslave/jenkins/workspace/lldb-cmake-matrix/clang_900_build/bin/../include/c++/v1/string.h:75:13: note: 'strchr' declared here
const char* strchr(const char* __s, int __c) {return __libcpp_strchr(__s, __c);}
            ^
In file included from /Users/buildslave/jenkins/workspace/lldb-cmake-matrix/llvm-project/lldb/test/API/commands/expression/import-std-module/array/main.cpp:1:
In file included from /Users/buildslave/jenkins/workspace/lldb-cmake-matrix/clang_900_build/bin/../include/c++/v1/array:109:
In file included from /Users/buildslave/jenkins/workspace/lldb-cmake-matrix/clang_900_build/bin/../include/c++/v1/utility:203:
/Users/buildslave/jenkins/workspace/lldb-cmake-matrix/clang_900_build/bin/../include/c++/v1/cstring:72:9: error: no member named 'strncpy' in the global namespace
using ::strncpy;
      ~~^
/Users/buildslave/jenkins/workspace/lldb-cmake-matrix/clang_900_build/bin/../include/c++/v1/cstring:73:9: error: no member named 'strcat' in the global namespace; did you mean 'strchr'?
using ::strcat;
      ~~^
/Users/buildslave/jenkins/workspace/lldb-cmake-matrix/clang_900_build/bin/../include/c++/v1/string.h:75:13: note: 'strchr' declared here
const char* strchr(const char* __s, int __c) {return __libcpp_strchr(__s, __c);}
            ^
In file included from /Users/buildslave/jenkins/workspace/lldb-cmake-matrix/llvm-project/lldb/test/API/commands/expression/import-std-module/array/main.cpp:1:
In file included from /Users/buildslave/jenkins/workspace/lldb-cmake-matrix/clang_900_build/bin/../include/c++/v1/array:109:
In file included from /Users/buildslave/jenkins/workspace/lldb-cmake-matrix/clang_900_build/bin/../include/c++/v1/utility:203:
/Users/buildslave/jenkins/workspace/lldb-cmake-matrix/clang_900_build/bin/../include/c++/v1/cstring:74:9: error: no member named 'strncat' in the global namespace
using ::strncat;
      ~~^
/Users/buildslave/jenkins/workspace/lldb-cmake-matrix/clang_900_build/bin/../include/c++/v1/cstring:75:9: error: no member named 'memcmp' in the global namespace; did you mean 'memchr'?
using ::memcmp;
      ~~^
/Users/buildslave/jenkins/workspace/lldb-cmake-matrix/clang_900_build/bin/../include/c++/v1/string.h:96:13: note: 'memchr' declared here
const void* memchr(const void* __s, int __c, size_t __n) {return __libcpp_memchr(__s, __c, __n);}
            ^
In file included from /Users/buildslave/jenkins/workspace/lldb-cmake-matrix/llvm-project/lldb/test/API/commands/expression/import-std-module/array/main.cpp:1:
In file included from /Users/buildslave/jenkins/workspace/lldb-cmake-matrix/clang_900_build/bin/../include/c++/v1/array:109:
In file included from /Users/buildslave/jenkins/workspace/lldb-cmake-matrix/clang_900_build/bin/../include/c++/v1/utility:203:
/Users/buildslave/jenkins/workspace/lldb-cmake-matrix/clang_900_build/bin/../include/c++/v1/cstring:76:9: error: no member named 'strcmp' in the global namespace; did you mean 'strchr'?
using ::strcmp;
      ~~^
/Users/buildslave/jenkins/workspace/lldb-cmake-matrix/clang_900_build/bin/../include/c++/v1/string.h:75:13: note: 'strchr' declared here
const char* strchr(const char* __s, int __c) {return __libcpp_strchr(__s, __c);}
            ^
In file included from /Users/buildslave/jenkins/workspace/lldb-cmake-matrix/llvm-project/lldb/test/API/commands/expression/import-std-module/array/main.cpp:1:
In file included from /Users/buildslave/jenkins/workspace/lldb-cmake-matrix/clang_900_build/bin/../include/c++/v1/array:109:
In file included from /Users/buildslave/jenkins/workspace/lldb-cmake-matrix/clang_900_build/bin/../include/c++/v1/utility:203:
/Users/buildslave/jenkins/workspace/lldb-cmake-matrix/clang_900_build/bin/../include/c++/v1/cstring:77:9: error: no member named 'strncmp' in the global namespace
using ::strncmp;
      ~~^
/Users/buildslave/jenkins/workspace/lldb-cmake-matrix/clang_900_build/bin/../include/c++/v1/cstring:78:9: error: no member named 'strcoll' in the global namespace
using ::strcoll;
      ~~^
/Users/buildslave/jenkins/workspace/lldb-cmake-matrix/clang_900_build/bin/../include/c++/v1/cstring:79:9: error: no member named 'strxfrm' in the global namespace
using ::strxfrm;
      ~~^
/Users/buildslave/jenkins/workspace/lldb-cmake-matrix/clang_900_build/bin/../include/c++/v1/cstring:82:9: error: no member named 'strcspn' in the global namespace
using ::strcspn;
      ~~^
fatal error: too many errors emitted, stopping now [-ferror-limit=]
20 errors generated.
make: *** [main.o] Error 1

Test Directory:
/Users/buildslave/jenkins/workspace/lldb-cmake-matrix/llvm-project/lldb/test/API/commands/expression/import-std-module/array
----------------------------------------------------------------------
Ran 4 tests in 1.206s

RESULT: FAILED (0 passes, 0 failures, 2 errors, 2 skipped, 0 expected failures, 0 unexpected successes)

--