Regression

Test Clang 11.0.1 / lldb-api.functionalities/stop-on-sharedlibrary-load.TestStopOnSharedlibraryEvents.py (from lldb-api)

Failing for the past 1 build (Since #5040 )
Took 2.4 sec.

Stacktrace

Script:
--
/Applications/Xcode.app/Contents/Developer/Library/Frameworks/Python3.framework/Versions/3.8/bin/python3.8 /Users/buildslave/jenkins/workspace/lldb-cmake-matrix/llvm-project/lldb/test/API/dotest.py -u CXXFLAGS -u CFLAGS --codesign-identity lldb_codesign --arch x86_64 --build-dir /Users/buildslave/jenkins/workspace/lldb-cmake-matrix/lldb-build/lldb-test-build.noindex -t --env TERM=vt100 --skip-category gmodules --skip-category watchpoint --skip-category llgs --skip-category debugserver --arch=x86_64 --env LLVM_LIBS_DIR=/Users/buildslave/jenkins/workspace/lldb-cmake-matrix/lldb-build/./lib --env LLVM_INCLUDE_DIR=/Users/buildslave/jenkins/workspace/lldb-cmake-matrix/lldb-build/include --env LLVM_TOOLS_DIR=/Users/buildslave/jenkins/workspace/lldb-cmake-matrix/lldb-build/./bin --hermetic-libcxx --arch x86_64 --build-dir /Users/buildslave/jenkins/workspace/lldb-cmake-matrix/lldb-build/lldb-test-build.noindex --lldb-module-cache-dir /Users/buildslave/jenkins/workspace/lldb-cmake-matrix/lldb-build/lldb-test-build.noindex/module-cache-lldb/lldb-api --clang-module-cache-dir /Users/buildslave/jenkins/workspace/lldb-cmake-matrix/lldb-build/lldb-test-build.noindex/module-cache-clang/lldb-api --executable /Users/buildslave/jenkins/workspace/lldb-cmake-matrix/lldb-build/./bin/lldb --compiler /Users/buildslave/jenkins/workspace/lldb-cmake-matrix/clang_1101_build/bin/clang --dsymutil /Users/buildslave/jenkins/workspace/lldb-cmake-matrix/lldb-build/./bin/dsymutil --llvm-tools-dir /Users/buildslave/jenkins/workspace/lldb-cmake-matrix/lldb-build/./bin --lldb-libs-dir /Users/buildslave/jenkins/workspace/lldb-cmake-matrix/lldb-build/./lib /Users/buildslave/jenkins/workspace/lldb-cmake-matrix/llvm-project/lldb/test/API/functionalities/stop-on-sharedlibrary-load -p TestStopOnSharedlibraryEvents.py
--
Exit Code: 1

Command Output (stdout):
--
lldb version 16.0.99git (http://labmaster3.local/git/llvm-project.git revision d1f36da9e03baeccb2f4dd8095f8aaf5b4547c68)
  clang revision d1f36da9e03baeccb2f4dd8095f8aaf5b4547c68
  llvm revision d1f36da9e03baeccb2f4dd8095f8aaf5b4547c68
Skipping the following test categories: ['gmodules', 'watchpoint', 'llgs', 'debugserver', 'libstdcxx', 'dwo', 'llgs', 'fork']

--
Command Output (stderr):
--
Change dir to: /Users/buildslave/jenkins/workspace/lldb-cmake-matrix/llvm-project/lldb/test/API/functionalities/stop-on-sharedlibrary-load
runCmd: settings clear -all
output: 

runCmd: settings set symbols.enable-external-lookup false
output: 

runCmd: settings set target.inherit-tcc true
output: 

runCmd: settings set target.detach-on-error false
output: 

runCmd: settings set target.auto-apply-fixits false
output: 

runCmd: settings set plugin.process.gdb-remote.packet-timeout 60
output: 

runCmd: settings set symbols.clang-modules-cache-path "/Users/buildslave/jenkins/workspace/lldb-cmake-matrix/lldb-build/lldb-test-build.noindex/module-cache-lldb/lldb-api"
output: 

runCmd: settings set use-color false
output: 

runCmd: setting set target.prefer-dynamic-value no-dynamic-values
output: 

make VPATH=/Users/buildslave/jenkins/workspace/lldb-cmake-matrix/llvm-project/lldb/test/API/functionalities/stop-on-sharedlibrary-load -C /Users/buildslave/jenkins/workspace/lldb-cmake-matrix/lldb-build/lldb-test-build.noindex/functionalities/stop-on-sharedlibrary-load/TestStopOnSharedlibraryEvents.test_auto_continue -I /Users/buildslave/jenkins/workspace/lldb-cmake-matrix/llvm-project/lldb/test/API/functionalities/stop-on-sharedlibrary-load -I /Users/buildslave/jenkins/workspace/lldb-cmake-matrix/llvm-project/lldb/packages/Python/lldbsuite/test/make -f /Users/buildslave/jenkins/workspace/lldb-cmake-matrix/llvm-project/lldb/test/API/functionalities/stop-on-sharedlibrary-load/Makefile all ARCH=x86_64 'CC="/Users/buildslave/jenkins/workspace/lldb-cmake-matrix/clang_1101_build/bin/clang"' DSYMUTIL=/Users/buildslave/jenkins/workspace/lldb-cmake-matrix/lldb-build/./bin/dsymutil CODESIGN=codesign CLANG_MODULE_CACHE_DIR=/Users/buildslave/jenkins/workspace/lldb-cmake-matrix/lldb-build/lldb-test-build.noindex/module-cache-clang/lldb-api USE_HERMETIC_LIBCPP=1

FAIL: LLDB (/Users/buildslave/jenkins/workspace/lldb-cmake-matrix/clang_1101_build/bin/clang-x86_64) :: test_auto_continue (TestStopOnSharedlibraryEvents.TestStopOnSharedlibraryEvents)
runCmd: settings clear -all
output: 

runCmd: settings set symbols.enable-external-lookup false
output: 

runCmd: settings set target.inherit-tcc true
output: 

runCmd: settings set target.detach-on-error false
output: 

runCmd: settings set target.auto-apply-fixits false
output: 

runCmd: settings set plugin.process.gdb-remote.packet-timeout 60
output: 

runCmd: settings set symbols.clang-modules-cache-path "/Users/buildslave/jenkins/workspace/lldb-cmake-matrix/lldb-build/lldb-test-build.noindex/module-cache-lldb/lldb-api"
output: 

runCmd: settings set use-color false
output: 

runCmd: setting set target.prefer-dynamic-value no-dynamic-values
output: 

make VPATH=/Users/buildslave/jenkins/workspace/lldb-cmake-matrix/llvm-project/lldb/test/API/functionalities/stop-on-sharedlibrary-load -C /Users/buildslave/jenkins/workspace/lldb-cmake-matrix/lldb-build/lldb-test-build.noindex/functionalities/stop-on-sharedlibrary-load/TestStopOnSharedlibraryEvents.test_continue_callback -I /Users/buildslave/jenkins/workspace/lldb-cmake-matrix/llvm-project/lldb/test/API/functionalities/stop-on-sharedlibrary-load -I /Users/buildslave/jenkins/workspace/lldb-cmake-matrix/llvm-project/lldb/packages/Python/lldbsuite/test/make -f /Users/buildslave/jenkins/workspace/lldb-cmake-matrix/llvm-project/lldb/test/API/functionalities/stop-on-sharedlibrary-load/Makefile all ARCH=x86_64 'CC="/Users/buildslave/jenkins/workspace/lldb-cmake-matrix/clang_1101_build/bin/clang"' DSYMUTIL=/Users/buildslave/jenkins/workspace/lldb-cmake-matrix/lldb-build/./bin/dsymutil CODESIGN=codesign CLANG_MODULE_CACHE_DIR=/Users/buildslave/jenkins/workspace/lldb-cmake-matrix/lldb-build/lldb-test-build.noindex/module-cache-clang/lldb-api USE_HERMETIC_LIBCPP=1

FAIL: LLDB (/Users/buildslave/jenkins/workspace/lldb-cmake-matrix/clang_1101_build/bin/clang-x86_64) :: test_continue_callback (TestStopOnSharedlibraryEvents.TestStopOnSharedlibraryEvents)
runCmd: settings clear -all
output: 

runCmd: settings set symbols.enable-external-lookup false
output: 

runCmd: settings set target.inherit-tcc true
output: 

runCmd: settings set target.detach-on-error false
output: 

runCmd: settings set target.auto-apply-fixits false
output: 

runCmd: settings set plugin.process.gdb-remote.packet-timeout 60
output: 

runCmd: settings set symbols.clang-modules-cache-path "/Users/buildslave/jenkins/workspace/lldb-cmake-matrix/lldb-build/lldb-test-build.noindex/module-cache-lldb/lldb-api"
output: 

runCmd: settings set use-color false
output: 

runCmd: setting set target.prefer-dynamic-value no-dynamic-values
output: 

make VPATH=/Users/buildslave/jenkins/workspace/lldb-cmake-matrix/llvm-project/lldb/test/API/functionalities/stop-on-sharedlibrary-load -C /Users/buildslave/jenkins/workspace/lldb-cmake-matrix/lldb-build/lldb-test-build.noindex/functionalities/stop-on-sharedlibrary-load/TestStopOnSharedlibraryEvents.test_failing_condition -I /Users/buildslave/jenkins/workspace/lldb-cmake-matrix/llvm-project/lldb/test/API/functionalities/stop-on-sharedlibrary-load -I /Users/buildslave/jenkins/workspace/lldb-cmake-matrix/llvm-project/lldb/packages/Python/lldbsuite/test/make -f /Users/buildslave/jenkins/workspace/lldb-cmake-matrix/llvm-project/lldb/test/API/functionalities/stop-on-sharedlibrary-load/Makefile all ARCH=x86_64 'CC="/Users/buildslave/jenkins/workspace/lldb-cmake-matrix/clang_1101_build/bin/clang"' DSYMUTIL=/Users/buildslave/jenkins/workspace/lldb-cmake-matrix/lldb-build/./bin/dsymutil CODESIGN=codesign CLANG_MODULE_CACHE_DIR=/Users/buildslave/jenkins/workspace/lldb-cmake-matrix/lldb-build/lldb-test-build.noindex/module-cache-clang/lldb-api USE_HERMETIC_LIBCPP=1

FAIL: LLDB (/Users/buildslave/jenkins/workspace/lldb-cmake-matrix/clang_1101_build/bin/clang-x86_64) :: test_failing_condition (TestStopOnSharedlibraryEvents.TestStopOnSharedlibraryEvents)
runCmd: settings clear -all
output: 

runCmd: settings set symbols.enable-external-lookup false
output: 

runCmd: settings set target.inherit-tcc true
output: 

runCmd: settings set target.detach-on-error false
output: 

runCmd: settings set target.auto-apply-fixits false
output: 

runCmd: settings set plugin.process.gdb-remote.packet-timeout 60
output: 

runCmd: settings set symbols.clang-modules-cache-path "/Users/buildslave/jenkins/workspace/lldb-cmake-matrix/lldb-build/lldb-test-build.noindex/module-cache-lldb/lldb-api"
output: 

runCmd: settings set use-color false
output: 

runCmd: setting set target.prefer-dynamic-value no-dynamic-values
output: 

make VPATH=/Users/buildslave/jenkins/workspace/lldb-cmake-matrix/llvm-project/lldb/test/API/functionalities/stop-on-sharedlibrary-load -C /Users/buildslave/jenkins/workspace/lldb-cmake-matrix/lldb-build/lldb-test-build.noindex/functionalities/stop-on-sharedlibrary-load/TestStopOnSharedlibraryEvents.test_stopping_breakpoints -I /Users/buildslave/jenkins/workspace/lldb-cmake-matrix/llvm-project/lldb/test/API/functionalities/stop-on-sharedlibrary-load -I /Users/buildslave/jenkins/workspace/lldb-cmake-matrix/llvm-project/lldb/packages/Python/lldbsuite/test/make -f /Users/buildslave/jenkins/workspace/lldb-cmake-matrix/llvm-project/lldb/test/API/functionalities/stop-on-sharedlibrary-load/Makefile all ARCH=x86_64 'CC="/Users/buildslave/jenkins/workspace/lldb-cmake-matrix/clang_1101_build/bin/clang"' DSYMUTIL=/Users/buildslave/jenkins/workspace/lldb-cmake-matrix/lldb-build/./bin/dsymutil CODESIGN=codesign CLANG_MODULE_CACHE_DIR=/Users/buildslave/jenkins/workspace/lldb-cmake-matrix/lldb-build/lldb-test-build.noindex/module-cache-clang/lldb-api USE_HERMETIC_LIBCPP=1

FAIL: LLDB (/Users/buildslave/jenkins/workspace/lldb-cmake-matrix/clang_1101_build/bin/clang-x86_64) :: test_stopping_breakpoints (TestStopOnSharedlibraryEvents.TestStopOnSharedlibraryEvents)
Restore dir to: /Users/buildslave/jenkins/workspace/lldb-cmake-matrix/lldb-build/tools/lldb/test
======================================================================
ERROR: test_auto_continue (TestStopOnSharedlibraryEvents.TestStopOnSharedlibraryEvents)
----------------------------------------------------------------------
Error when building test subject.

Build Command:
make VPATH=/Users/buildslave/jenkins/workspace/lldb-cmake-matrix/llvm-project/lldb/test/API/functionalities/stop-on-sharedlibrary-load -C /Users/buildslave/jenkins/workspace/lldb-cmake-matrix/lldb-build/lldb-test-build.noindex/functionalities/stop-on-sharedlibrary-load/TestStopOnSharedlibraryEvents.test_auto_continue -I /Users/buildslave/jenkins/workspace/lldb-cmake-matrix/llvm-project/lldb/test/API/functionalities/stop-on-sharedlibrary-load -I /Users/buildslave/jenkins/workspace/lldb-cmake-matrix/llvm-project/lldb/packages/Python/lldbsuite/test/make -f /Users/buildslave/jenkins/workspace/lldb-cmake-matrix/llvm-project/lldb/test/API/functionalities/stop-on-sharedlibrary-load/Makefile all ARCH=x86_64 'CC="/Users/buildslave/jenkins/workspace/lldb-cmake-matrix/clang_1101_build/bin/clang"' DSYMUTIL=/Users/buildslave/jenkins/workspace/lldb-cmake-matrix/lldb-build/./bin/dsymutil CODESIGN=codesign CLANG_MODULE_CACHE_DIR=/Users/buildslave/jenkins/workspace/lldb-cmake-matrix/lldb-build/lldb-test-build.noindex/module-cache-clang/lldb-api USE_HERMETIC_LIBCPP=1

Build Command Output:
"/Users/buildslave/jenkins/workspace/lldb-cmake-matrix/clang_1101_build/bin/clang"  -std=c++11 -g -O0 -isysroot "/Applications/Xcode.app/Contents/Developer/Platforms/MacOSX.platform/Developer/SDKs/MacOSX11.1.sdk" -arch x86_64  -I/Users/buildslave/jenkins/workspace/lldb-cmake-matrix/llvm-project/lldb/packages/Python/lldbsuite/test/make/../../../../../include -I/Users/buildslave/jenkins/workspace/lldb-cmake-matrix/llvm-project/lldb/test/API/functionalities/stop-on-sharedlibrary-load -I/Users/buildslave/jenkins/workspace/lldb-cmake-matrix/llvm-project/lldb/packages/Python/lldbsuite/test/make -include /Users/buildslave/jenkins/workspace/lldb-cmake-matrix/llvm-project/lldb/packages/Python/lldbsuite/test/make/test_common.h  -fno-limit-debug-info     --driver-mode=g++ -MT main.o -MD -MP -MF main.d -c -o main.o /Users/buildslave/jenkins/workspace/lldb-cmake-matrix/llvm-project/lldb/test/API/functionalities/stop-on-sharedlibrary-load/main.cpp
In file included from /Users/buildslave/jenkins/workspace/lldb-cmake-matrix/llvm-project/lldb/test/API/functionalities/stop-on-sharedlibrary-load/main.cpp:1:
/Users/buildslave/jenkins/workspace/lldb-cmake-matrix/llvm-project/lldb/packages/Python/lldbsuite/test/make/dylib.h:35:3: error: use of undeclared identifier 'snprintf'
  snprintf(fullname, sizeof(fullname), "%s%s%s", dylib_prefix, name, dylib_suffix);
  ^
In file included from /Users/buildslave/jenkins/workspace/lldb-cmake-matrix/llvm-project/lldb/test/API/functionalities/stop-on-sharedlibrary-load/main.cpp:4:
/Users/buildslave/jenkins/workspace/lldb-cmake-matrix/clang_1101_build/bin/../include/c++/v1/stdlib.h:142:34: error: unknown type name 'ldiv_t'
inline _LIBCPP_INLINE_VISIBILITY ldiv_t div(long __x, long __y) _NOEXCEPT {
                                 ^
/Users/buildslave/jenkins/workspace/lldb-cmake-matrix/clang_1101_build/bin/../include/c++/v1/stdlib.h:143:12: error: no member named 'ldiv' in the global namespace
  return ::ldiv(__x, __y);
         ~~^
/Users/buildslave/jenkins/workspace/lldb-cmake-matrix/clang_1101_build/bin/../include/c++/v1/stdlib.h:146:34: error: unknown type name 'lldiv_t'
inline _LIBCPP_INLINE_VISIBILITY lldiv_t div(long long __x,
                                 ^
/Users/buildslave/jenkins/workspace/lldb-cmake-matrix/clang_1101_build/bin/../include/c++/v1/stdlib.h:148:12: error: no member named 'lldiv' in the global namespace
  return ::lldiv(__x, __y);
         ~~^
In file included from /Users/buildslave/jenkins/workspace/lldb-cmake-matrix/llvm-project/lldb/test/API/functionalities/stop-on-sharedlibrary-load/main.cpp:5:
/Users/buildslave/jenkins/workspace/lldb-cmake-matrix/clang_1101_build/bin/../include/c++/v1/string.h:73:64: error: use of undeclared identifier 'strchr'
char* __libcpp_strchr(const char* __s, int __c) {return (char*)strchr(__s, __c);}
                                                               ^
/Users/buildslave/jenkins/workspace/lldb-cmake-matrix/clang_1101_build/bin/../include/c++/v1/string.h:80:75: error: use of undeclared identifier 'strpbrk'
char* __libcpp_strpbrk(const char* __s1, const char* __s2) {return (char*)strpbrk(__s1, __s2);}
                                                                          ^
/Users/buildslave/jenkins/workspace/lldb-cmake-matrix/clang_1101_build/bin/../include/c++/v1/string.h:87:65: error: use of undeclared identifier 'strrchr'; did you mean 'strchr'?
char* __libcpp_strrchr(const char* __s, int __c) {return (char*)strrchr(__s, __c);}
                                                                ^
/Users/buildslave/jenkins/workspace/lldb-cmake-matrix/clang_1101_build/bin/../include/c++/v1/string.h:75:13: note: 'strchr' declared here
const char* strchr(const char* __s, int __c) {return __libcpp_strchr(__s, __c);}
            ^
/Users/buildslave/jenkins/workspace/lldb-cmake-matrix/clang_1101_build/bin/../include/c++/v1/string.h:94:49: error: unknown type name 'size_t'
void* __libcpp_memchr(const void* __s, int __c, size_t __n) {return (void*)memchr(__s, __c, __n);}
                                                ^
/Users/buildslave/jenkins/workspace/lldb-cmake-matrix/clang_1101_build/bin/../include/c++/v1/string.h:96:46: error: unknown type name 'size_t'
const void* memchr(const void* __s, int __c, size_t __n) {return __libcpp_memchr(__s, __c, __n);}
                                             ^
/Users/buildslave/jenkins/workspace/lldb-cmake-matrix/clang_1101_build/bin/../include/c++/v1/string.h:98:46: error: unknown type name 'size_t'
      void* memchr(      void* __s, int __c, size_t __n) {return __libcpp_memchr(__s, __c, __n);}
                                             ^
/Users/buildslave/jenkins/workspace/lldb-cmake-matrix/clang_1101_build/bin/../include/c++/v1/string.h:101:74: error: use of undeclared identifier 'strstr'; did you mean 'strchr'?
char* __libcpp_strstr(const char* __s1, const char* __s2) {return (char*)strstr(__s1, __s2);}
                                                                         ^
/Users/buildslave/jenkins/workspace/lldb-cmake-matrix/clang_1101_build/bin/../include/c++/v1/string.h:77:13: note: 'strchr' declared here
      char* strchr(      char* __s, int __c) {return __libcpp_strchr(__s, __c);}
            ^
/Users/buildslave/jenkins/workspace/lldb-cmake-matrix/clang_1101_build/bin/../include/c++/v1/string.h:101:74: error: no matching function for call to 'strchr'
char* __libcpp_strstr(const char* __s1, const char* __s2) {return (char*)strstr(__s1, __s2);}
                                                                         ^
/Users/buildslave/jenkins/workspace/lldb-cmake-matrix/clang_1101_build/bin/../include/c++/v1/string.h:77:13: note: candidate disabled: <no message provided>
      char* strchr(      char* __s, int __c) {return __libcpp_strchr(__s, __c);}
            ^
/Users/buildslave/jenkins/workspace/lldb-cmake-matrix/clang_1101_build/bin/../include/c++/v1/string.h:101:81: error: cannot initialize a parameter of type 'char *' with an lvalue of type 'const char *'
char* __libcpp_strstr(const char* __s1, const char* __s2) {return (char*)strstr(__s1, __s2);}
                                                                                ^~~~
/Users/buildslave/jenkins/workspace/lldb-cmake-matrix/clang_1101_build/bin/../include/c++/v1/string.h:77:32: note: passing argument to parameter '__s' here
      char* strchr(      char* __s, int __c) {return __libcpp_strchr(__s, __c);}
                               ^
/Users/buildslave/jenkins/workspace/lldb-cmake-matrix/llvm-project/lldb/test/API/functionalities/stop-on-sharedlibrary-load/main.cpp:9:26: error: use of undeclared identifier 'NULL'
  void *a_dylib_handle = NULL;
                         ^
/Users/buildslave/jenkins/workspace/lldb-cmake-matrix/llvm-project/lldb/test/API/functionalities/stop-on-sharedlibrary-load/main.cpp:12:25: error: use of undeclared identifier 'NULL'
  if (a_dylib_handle == NULL) { // Set another here - we should not hit this one
                        ^
/Users/buildslave/jenkins/workspace/lldb-cmake-matrix/llvm-project/lldb/test/API/functionalities/stop-on-sharedlibrary-load/main.cpp:13:13: error: use of undeclared identifier 'stderr'
    fprintf(stderr, "%s\n", dylib_last_error());
            ^
/Users/buildslave/jenkins/workspace/lldb-cmake-matrix/llvm-project/lldb/test/API/functionalities/stop-on-sharedlibrary-load/main.cpp:14:5: error: use of undeclared identifier 'exit'
    exit(1);
    ^
/Users/buildslave/jenkins/workspace/lldb-cmake-matrix/llvm-project/lldb/test/API/functionalities/stop-on-sharedlibrary-load/main.cpp:18:26: error: use of undeclared identifier 'NULL'
  void *b_dylib_handle = NULL;
                         ^
fatal error: too many errors emitted, stopping now [-ferror-limit=]
20 errors generated.
make: *** [main.o] Error 1

Test Directory:
/Users/buildslave/jenkins/workspace/lldb-cmake-matrix/llvm-project/lldb/test/API/functionalities/stop-on-sharedlibrary-load
======================================================================
ERROR: test_continue_callback (TestStopOnSharedlibraryEvents.TestStopOnSharedlibraryEvents)
----------------------------------------------------------------------
Error when building test subject.

Build Command:
make VPATH=/Users/buildslave/jenkins/workspace/lldb-cmake-matrix/llvm-project/lldb/test/API/functionalities/stop-on-sharedlibrary-load -C /Users/buildslave/jenkins/workspace/lldb-cmake-matrix/lldb-build/lldb-test-build.noindex/functionalities/stop-on-sharedlibrary-load/TestStopOnSharedlibraryEvents.test_continue_callback -I /Users/buildslave/jenkins/workspace/lldb-cmake-matrix/llvm-project/lldb/test/API/functionalities/stop-on-sharedlibrary-load -I /Users/buildslave/jenkins/workspace/lldb-cmake-matrix/llvm-project/lldb/packages/Python/lldbsuite/test/make -f /Users/buildslave/jenkins/workspace/lldb-cmake-matrix/llvm-project/lldb/test/API/functionalities/stop-on-sharedlibrary-load/Makefile all ARCH=x86_64 'CC="/Users/buildslave/jenkins/workspace/lldb-cmake-matrix/clang_1101_build/bin/clang"' DSYMUTIL=/Users/buildslave/jenkins/workspace/lldb-cmake-matrix/lldb-build/./bin/dsymutil CODESIGN=codesign CLANG_MODULE_CACHE_DIR=/Users/buildslave/jenkins/workspace/lldb-cmake-matrix/lldb-build/lldb-test-build.noindex/module-cache-clang/lldb-api USE_HERMETIC_LIBCPP=1

Build Command Output:
"/Users/buildslave/jenkins/workspace/lldb-cmake-matrix/clang_1101_build/bin/clang"  -std=c++11 -g -O0 -isysroot "/Applications/Xcode.app/Contents/Developer/Platforms/MacOSX.platform/Developer/SDKs/MacOSX11.1.sdk" -arch x86_64  -I/Users/buildslave/jenkins/workspace/lldb-cmake-matrix/llvm-project/lldb/packages/Python/lldbsuite/test/make/../../../../../include -I/Users/buildslave/jenkins/workspace/lldb-cmake-matrix/llvm-project/lldb/test/API/functionalities/stop-on-sharedlibrary-load -I/Users/buildslave/jenkins/workspace/lldb-cmake-matrix/llvm-project/lldb/packages/Python/lldbsuite/test/make -include /Users/buildslave/jenkins/workspace/lldb-cmake-matrix/llvm-project/lldb/packages/Python/lldbsuite/test/make/test_common.h  -fno-limit-debug-info     --driver-mode=g++ -MT main.o -MD -MP -MF main.d -c -o main.o /Users/buildslave/jenkins/workspace/lldb-cmake-matrix/llvm-project/lldb/test/API/functionalities/stop-on-sharedlibrary-load/main.cpp
In file included from /Users/buildslave/jenkins/workspace/lldb-cmake-matrix/llvm-project/lldb/test/API/functionalities/stop-on-sharedlibrary-load/main.cpp:1:
/Users/buildslave/jenkins/workspace/lldb-cmake-matrix/llvm-project/lldb/packages/Python/lldbsuite/test/make/dylib.h:35:3: error: use of undeclared identifier 'snprintf'
  snprintf(fullname, sizeof(fullname), "%s%s%s", dylib_prefix, name, dylib_suffix);
  ^
In file included from /Users/buildslave/jenkins/workspace/lldb-cmake-matrix/llvm-project/lldb/test/API/functionalities/stop-on-sharedlibrary-load/main.cpp:4:
/Users/buildslave/jenkins/workspace/lldb-cmake-matrix/clang_1101_build/bin/../include/c++/v1/stdlib.h:142:34: error: unknown type name 'ldiv_t'
inline _LIBCPP_INLINE_VISIBILITY ldiv_t div(long __x, long __y) _NOEXCEPT {
                                 ^
/Users/buildslave/jenkins/workspace/lldb-cmake-matrix/clang_1101_build/bin/../include/c++/v1/stdlib.h:143:12: error: no member named 'ldiv' in the global namespace
  return ::ldiv(__x, __y);
         ~~^
/Users/buildslave/jenkins/workspace/lldb-cmake-matrix/clang_1101_build/bin/../include/c++/v1/stdlib.h:146:34: error: unknown type name 'lldiv_t'
inline _LIBCPP_INLINE_VISIBILITY lldiv_t div(long long __x,
                                 ^
/Users/buildslave/jenkins/workspace/lldb-cmake-matrix/clang_1101_build/bin/../include/c++/v1/stdlib.h:148:12: error: no member named 'lldiv' in the global namespace
  return ::lldiv(__x, __y);
         ~~^
In file included from /Users/buildslave/jenkins/workspace/lldb-cmake-matrix/llvm-project/lldb/test/API/functionalities/stop-on-sharedlibrary-load/main.cpp:5:
/Users/buildslave/jenkins/workspace/lldb-cmake-matrix/clang_1101_build/bin/../include/c++/v1/string.h:73:64: error: use of undeclared identifier 'strchr'
char* __libcpp_strchr(const char* __s, int __c) {return (char*)strchr(__s, __c);}
                                                               ^
/Users/buildslave/jenkins/workspace/lldb-cmake-matrix/clang_1101_build/bin/../include/c++/v1/string.h:80:75: error: use of undeclared identifier 'strpbrk'
char* __libcpp_strpbrk(const char* __s1, const char* __s2) {return (char*)strpbrk(__s1, __s2);}
                                                                          ^
/Users/buildslave/jenkins/workspace/lldb-cmake-matrix/clang_1101_build/bin/../include/c++/v1/string.h:87:65: error: use of undeclared identifier 'strrchr'; did you mean 'strchr'?
char* __libcpp_strrchr(const char* __s, int __c) {return (char*)strrchr(__s, __c);}
                                                                ^
/Users/buildslave/jenkins/workspace/lldb-cmake-matrix/clang_1101_build/bin/../include/c++/v1/string.h:75:13: note: 'strchr' declared here
const char* strchr(const char* __s, int __c) {return __libcpp_strchr(__s, __c);}
            ^
/Users/buildslave/jenkins/workspace/lldb-cmake-matrix/clang_1101_build/bin/../include/c++/v1/string.h:94:49: error: unknown type name 'size_t'
void* __libcpp_memchr(const void* __s, int __c, size_t __n) {return (void*)memchr(__s, __c, __n);}
                                                ^
/Users/buildslave/jenkins/workspace/lldb-cmake-matrix/clang_1101_build/bin/../include/c++/v1/string.h:96:46: error: unknown type name 'size_t'
const void* memchr(const void* __s, int __c, size_t __n) {return __libcpp_memchr(__s, __c, __n);}
                                             ^
/Users/buildslave/jenkins/workspace/lldb-cmake-matrix/clang_1101_build/bin/../include/c++/v1/string.h:98:46: error: unknown type name 'size_t'
      void* memchr(      void* __s, int __c, size_t __n) {return __libcpp_memchr(__s, __c, __n);}
                                             ^
/Users/buildslave/jenkins/workspace/lldb-cmake-matrix/clang_1101_build/bin/../include/c++/v1/string.h:101:74: error: use of undeclared identifier 'strstr'; did you mean 'strchr'?
char* __libcpp_strstr(const char* __s1, const char* __s2) {return (char*)strstr(__s1, __s2);}
                                                                         ^
/Users/buildslave/jenkins/workspace/lldb-cmake-matrix/clang_1101_build/bin/../include/c++/v1/string.h:77:13: note: 'strchr' declared here
      char* strchr(      char* __s, int __c) {return __libcpp_strchr(__s, __c);}
            ^
/Users/buildslave/jenkins/workspace/lldb-cmake-matrix/clang_1101_build/bin/../include/c++/v1/string.h:101:74: error: no matching function for call to 'strchr'
char* __libcpp_strstr(const char* __s1, const char* __s2) {return (char*)strstr(__s1, __s2);}
                                                                         ^
/Users/buildslave/jenkins/workspace/lldb-cmake-matrix/clang_1101_build/bin/../include/c++/v1/string.h:77:13: note: candidate disabled: <no message provided>
      char* strchr(      char* __s, int __c) {return __libcpp_strchr(__s, __c);}
            ^
/Users/buildslave/jenkins/workspace/lldb-cmake-matrix/clang_1101_build/bin/../include/c++/v1/string.h:101:81: error: cannot initialize a parameter of type 'char *' with an lvalue of type 'const char *'
char* __libcpp_strstr(const char* __s1, const char* __s2) {return (char*)strstr(__s1, __s2);}
                                                                                ^~~~
/Users/buildslave/jenkins/workspace/lldb-cmake-matrix/clang_1101_build/bin/../include/c++/v1/string.h:77:32: note: passing argument to parameter '__s' here
      char* strchr(      char* __s, int __c) {return __libcpp_strchr(__s, __c);}
                               ^
/Users/buildslave/jenkins/workspace/lldb-cmake-matrix/llvm-project/lldb/test/API/functionalities/stop-on-sharedlibrary-load/main.cpp:9:26: error: use of undeclared identifier 'NULL'
  void *a_dylib_handle = NULL;
                         ^
/Users/buildslave/jenkins/workspace/lldb-cmake-matrix/llvm-project/lldb/test/API/functionalities/stop-on-sharedlibrary-load/main.cpp:12:25: error: use of undeclared identifier 'NULL'
  if (a_dylib_handle == NULL) { // Set another here - we should not hit this one
                        ^
/Users/buildslave/jenkins/workspace/lldb-cmake-matrix/llvm-project/lldb/test/API/functionalities/stop-on-sharedlibrary-load/main.cpp:13:13: error: use of undeclared identifier 'stderr'
    fprintf(stderr, "%s\n", dylib_last_error());
            ^
/Users/buildslave/jenkins/workspace/lldb-cmake-matrix/llvm-project/lldb/test/API/functionalities/stop-on-sharedlibrary-load/main.cpp:14:5: error: use of undeclared identifier 'exit'
    exit(1);
    ^
/Users/buildslave/jenkins/workspace/lldb-cmake-matrix/llvm-project/lldb/test/API/functionalities/stop-on-sharedlibrary-load/main.cpp:18:26: error: use of undeclared identifier 'NULL'
  void *b_dylib_handle = NULL;
                         ^
fatal error: too many errors emitted, stopping now [-ferror-limit=]
20 errors generated.
make: *** [main.o] Error 1

Test Directory:
/Users/buildslave/jenkins/workspace/lldb-cmake-matrix/llvm-project/lldb/test/API/functionalities/stop-on-sharedlibrary-load
======================================================================
ERROR: test_failing_condition (TestStopOnSharedlibraryEvents.TestStopOnSharedlibraryEvents)
----------------------------------------------------------------------
Error when building test subject.

Build Command:
make VPATH=/Users/buildslave/jenkins/workspace/lldb-cmake-matrix/llvm-project/lldb/test/API/functionalities/stop-on-sharedlibrary-load -C /Users/buildslave/jenkins/workspace/lldb-cmake-matrix/lldb-build/lldb-test-build.noindex/functionalities/stop-on-sharedlibrary-load/TestStopOnSharedlibraryEvents.test_failing_condition -I /Users/buildslave/jenkins/workspace/lldb-cmake-matrix/llvm-project/lldb/test/API/functionalities/stop-on-sharedlibrary-load -I /Users/buildslave/jenkins/workspace/lldb-cmake-matrix/llvm-project/lldb/packages/Python/lldbsuite/test/make -f /Users/buildslave/jenkins/workspace/lldb-cmake-matrix/llvm-project/lldb/test/API/functionalities/stop-on-sharedlibrary-load/Makefile all ARCH=x86_64 'CC="/Users/buildslave/jenkins/workspace/lldb-cmake-matrix/clang_1101_build/bin/clang"' DSYMUTIL=/Users/buildslave/jenkins/workspace/lldb-cmake-matrix/lldb-build/./bin/dsymutil CODESIGN=codesign CLANG_MODULE_CACHE_DIR=/Users/buildslave/jenkins/workspace/lldb-cmake-matrix/lldb-build/lldb-test-build.noindex/module-cache-clang/lldb-api USE_HERMETIC_LIBCPP=1

Build Command Output:
"/Users/buildslave/jenkins/workspace/lldb-cmake-matrix/clang_1101_build/bin/clang"  -std=c++11 -g -O0 -isysroot "/Applications/Xcode.app/Contents/Developer/Platforms/MacOSX.platform/Developer/SDKs/MacOSX11.1.sdk" -arch x86_64  -I/Users/buildslave/jenkins/workspace/lldb-cmake-matrix/llvm-project/lldb/packages/Python/lldbsuite/test/make/../../../../../include -I/Users/buildslave/jenkins/workspace/lldb-cmake-matrix/llvm-project/lldb/test/API/functionalities/stop-on-sharedlibrary-load -I/Users/buildslave/jenkins/workspace/lldb-cmake-matrix/llvm-project/lldb/packages/Python/lldbsuite/test/make -include /Users/buildslave/jenkins/workspace/lldb-cmake-matrix/llvm-project/lldb/packages/Python/lldbsuite/test/make/test_common.h  -fno-limit-debug-info     --driver-mode=g++ -MT main.o -MD -MP -MF main.d -c -o main.o /Users/buildslave/jenkins/workspace/lldb-cmake-matrix/llvm-project/lldb/test/API/functionalities/stop-on-sharedlibrary-load/main.cpp
In file included from /Users/buildslave/jenkins/workspace/lldb-cmake-matrix/llvm-project/lldb/test/API/functionalities/stop-on-sharedlibrary-load/main.cpp:1:
/Users/buildslave/jenkins/workspace/lldb-cmake-matrix/llvm-project/lldb/packages/Python/lldbsuite/test/make/dylib.h:35:3: error: use of undeclared identifier 'snprintf'
  snprintf(fullname, sizeof(fullname), "%s%s%s", dylib_prefix, name, dylib_suffix);
  ^
In file included from /Users/buildslave/jenkins/workspace/lldb-cmake-matrix/llvm-project/lldb/test/API/functionalities/stop-on-sharedlibrary-load/main.cpp:4:
/Users/buildslave/jenkins/workspace/lldb-cmake-matrix/clang_1101_build/bin/../include/c++/v1/stdlib.h:142:34: error: unknown type name 'ldiv_t'
inline _LIBCPP_INLINE_VISIBILITY ldiv_t div(long __x, long __y) _NOEXCEPT {
                                 ^
/Users/buildslave/jenkins/workspace/lldb-cmake-matrix/clang_1101_build/bin/../include/c++/v1/stdlib.h:143:12: error: no member named 'ldiv' in the global namespace
  return ::ldiv(__x, __y);
         ~~^
/Users/buildslave/jenkins/workspace/lldb-cmake-matrix/clang_1101_build/bin/../include/c++/v1/stdlib.h:146:34: error: unknown type name 'lldiv_t'
inline _LIBCPP_INLINE_VISIBILITY lldiv_t div(long long __x,
                                 ^
/Users/buildslave/jenkins/workspace/lldb-cmake-matrix/clang_1101_build/bin/../include/c++/v1/stdlib.h:148:12: error: no member named 'lldiv' in the global namespace
  return ::lldiv(__x, __y);
         ~~^
In file included from /Users/buildslave/jenkins/workspace/lldb-cmake-matrix/llvm-project/lldb/test/API/functionalities/stop-on-sharedlibrary-load/main.cpp:5:
/Users/buildslave/jenkins/workspace/lldb-cmake-matrix/clang_1101_build/bin/../include/c++/v1/string.h:73:64: error: use of undeclared identifier 'strchr'
char* __libcpp_strchr(const char* __s, int __c) {return (char*)strchr(__s, __c);}
                                                               ^
/Users/buildslave/jenkins/workspace/lldb-cmake-matrix/clang_1101_build/bin/../include/c++/v1/string.h:80:75: error: use of undeclared identifier 'strpbrk'
char* __libcpp_strpbrk(const char* __s1, const char* __s2) {return (char*)strpbrk(__s1, __s2);}
                                                                          ^
/Users/buildslave/jenkins/workspace/lldb-cmake-matrix/clang_1101_build/bin/../include/c++/v1/string.h:87:65: error: use of undeclared identifier 'strrchr'; did you mean 'strchr'?
char* __libcpp_strrchr(const char* __s, int __c) {return (char*)strrchr(__s, __c);}
                                                                ^
/Users/buildslave/jenkins/workspace/lldb-cmake-matrix/clang_1101_build/bin/../include/c++/v1/string.h:75:13: note: 'strchr' declared here
const char* strchr(const char* __s, int __c) {return __libcpp_strchr(__s, __c);}
            ^
/Users/buildslave/jenkins/workspace/lldb-cmake-matrix/clang_1101_build/bin/../include/c++/v1/string.h:94:49: error: unknown type name 'size_t'
void* __libcpp_memchr(const void* __s, int __c, size_t __n) {return (void*)memchr(__s, __c, __n);}
                                                ^
/Users/buildslave/jenkins/workspace/lldb-cmake-matrix/clang_1101_build/bin/../include/c++/v1/string.h:96:46: error: unknown type name 'size_t'
const void* memchr(const void* __s, int __c, size_t __n) {return __libcpp_memchr(__s, __c, __n);}
                                             ^
/Users/buildslave/jenkins/workspace/lldb-cmake-matrix/clang_1101_build/bin/../include/c++/v1/string.h:98:46: error: unknown type name 'size_t'
      void* memchr(      void* __s, int __c, size_t __n) {return __libcpp_memchr(__s, __c, __n);}
                                             ^
/Users/buildslave/jenkins/workspace/lldb-cmake-matrix/clang_1101_build/bin/../include/c++/v1/string.h:101:74: error: use of undeclared identifier 'strstr'; did you mean 'strchr'?
char* __libcpp_strstr(const char* __s1, const char* __s2) {return (char*)strstr(__s1, __s2);}
                                                                         ^
/Users/buildslave/jenkins/workspace/lldb-cmake-matrix/clang_1101_build/bin/../include/c++/v1/string.h:77:13: note: 'strchr' declared here
      char* strchr(      char* __s, int __c) {return __libcpp_strchr(__s, __c);}
            ^
/Users/buildslave/jenkins/workspace/lldb-cmake-matrix/clang_1101_build/bin/../include/c++/v1/string.h:101:74: error: no matching function for call to 'strchr'
char* __libcpp_strstr(const char* __s1, const char* __s2) {return (char*)strstr(__s1, __s2);}
                                                                         ^
/Users/buildslave/jenkins/workspace/lldb-cmake-matrix/clang_1101_build/bin/../include/c++/v1/string.h:77:13: note: candidate disabled: <no message provided>
      char* strchr(      char* __s, int __c) {return __libcpp_strchr(__s, __c);}
            ^
/Users/buildslave/jenkins/workspace/lldb-cmake-matrix/clang_1101_build/bin/../include/c++/v1/string.h:101:81: error: cannot initialize a parameter of type 'char *' with an lvalue of type 'const char *'
char* __libcpp_strstr(const char* __s1, const char* __s2) {return (char*)strstr(__s1, __s2);}
                                                                                ^~~~
/Users/buildslave/jenkins/workspace/lldb-cmake-matrix/clang_1101_build/bin/../include/c++/v1/string.h:77:32: note: passing argument to parameter '__s' here
      char* strchr(      char* __s, int __c) {return __libcpp_strchr(__s, __c);}
                               ^
/Users/buildslave/jenkins/workspace/lldb-cmake-matrix/llvm-project/lldb/test/API/functionalities/stop-on-sharedlibrary-load/main.cpp:9:26: error: use of undeclared identifier 'NULL'
  void *a_dylib_handle = NULL;
                         ^
/Users/buildslave/jenkins/workspace/lldb-cmake-matrix/llvm-project/lldb/test/API/functionalities/stop-on-sharedlibrary-load/main.cpp:12:25: error: use of undeclared identifier 'NULL'
  if (a_dylib_handle == NULL) { // Set another here - we should not hit this one
                        ^
/Users/buildslave/jenkins/workspace/lldb-cmake-matrix/llvm-project/lldb/test/API/functionalities/stop-on-sharedlibrary-load/main.cpp:13:13: error: use of undeclared identifier 'stderr'
    fprintf(stderr, "%s\n", dylib_last_error());
            ^
/Users/buildslave/jenkins/workspace/lldb-cmake-matrix/llvm-project/lldb/test/API/functionalities/stop-on-sharedlibrary-load/main.cpp:14:5: error: use of undeclared identifier 'exit'
    exit(1);
    ^
/Users/buildslave/jenkins/workspace/lldb-cmake-matrix/llvm-project/lldb/test/API/functionalities/stop-on-sharedlibrary-load/main.cpp:18:26: error: use of undeclared identifier 'NULL'
  void *b_dylib_handle = NULL;
                         ^
fatal error: too many errors emitted, stopping now [-ferror-limit=]
20 errors generated.
make: *** [main.o] Error 1

Test Directory:
/Users/buildslave/jenkins/workspace/lldb-cmake-matrix/llvm-project/lldb/test/API/functionalities/stop-on-sharedlibrary-load
======================================================================
ERROR: test_stopping_breakpoints (TestStopOnSharedlibraryEvents.TestStopOnSharedlibraryEvents)
----------------------------------------------------------------------
Error when building test subject.

Build Command:
make VPATH=/Users/buildslave/jenkins/workspace/lldb-cmake-matrix/llvm-project/lldb/test/API/functionalities/stop-on-sharedlibrary-load -C /Users/buildslave/jenkins/workspace/lldb-cmake-matrix/lldb-build/lldb-test-build.noindex/functionalities/stop-on-sharedlibrary-load/TestStopOnSharedlibraryEvents.test_stopping_breakpoints -I /Users/buildslave/jenkins/workspace/lldb-cmake-matrix/llvm-project/lldb/test/API/functionalities/stop-on-sharedlibrary-load -I /Users/buildslave/jenkins/workspace/lldb-cmake-matrix/llvm-project/lldb/packages/Python/lldbsuite/test/make -f /Users/buildslave/jenkins/workspace/lldb-cmake-matrix/llvm-project/lldb/test/API/functionalities/stop-on-sharedlibrary-load/Makefile all ARCH=x86_64 'CC="/Users/buildslave/jenkins/workspace/lldb-cmake-matrix/clang_1101_build/bin/clang"' DSYMUTIL=/Users/buildslave/jenkins/workspace/lldb-cmake-matrix/lldb-build/./bin/dsymutil CODESIGN=codesign CLANG_MODULE_CACHE_DIR=/Users/buildslave/jenkins/workspace/lldb-cmake-matrix/lldb-build/lldb-test-build.noindex/module-cache-clang/lldb-api USE_HERMETIC_LIBCPP=1

Build Command Output:
"/Users/buildslave/jenkins/workspace/lldb-cmake-matrix/clang_1101_build/bin/clang"  -std=c++11 -g -O0 -isysroot "/Applications/Xcode.app/Contents/Developer/Platforms/MacOSX.platform/Developer/SDKs/MacOSX11.1.sdk" -arch x86_64  -I/Users/buildslave/jenkins/workspace/lldb-cmake-matrix/llvm-project/lldb/packages/Python/lldbsuite/test/make/../../../../../include -I/Users/buildslave/jenkins/workspace/lldb-cmake-matrix/llvm-project/lldb/test/API/functionalities/stop-on-sharedlibrary-load -I/Users/buildslave/jenkins/workspace/lldb-cmake-matrix/llvm-project/lldb/packages/Python/lldbsuite/test/make -include /Users/buildslave/jenkins/workspace/lldb-cmake-matrix/llvm-project/lldb/packages/Python/lldbsuite/test/make/test_common.h  -fno-limit-debug-info     --driver-mode=g++ -MT main.o -MD -MP -MF main.d -c -o main.o /Users/buildslave/jenkins/workspace/lldb-cmake-matrix/llvm-project/lldb/test/API/functionalities/stop-on-sharedlibrary-load/main.cpp
In file included from /Users/buildslave/jenkins/workspace/lldb-cmake-matrix/llvm-project/lldb/test/API/functionalities/stop-on-sharedlibrary-load/main.cpp:1:
/Users/buildslave/jenkins/workspace/lldb-cmake-matrix/llvm-project/lldb/packages/Python/lldbsuite/test/make/dylib.h:35:3: error: use of undeclared identifier 'snprintf'
  snprintf(fullname, sizeof(fullname), "%s%s%s", dylib_prefix, name, dylib_suffix);
  ^
In file included from /Users/buildslave/jenkins/workspace/lldb-cmake-matrix/llvm-project/lldb/test/API/functionalities/stop-on-sharedlibrary-load/main.cpp:4:
/Users/buildslave/jenkins/workspace/lldb-cmake-matrix/clang_1101_build/bin/../include/c++/v1/stdlib.h:142:34: error: unknown type name 'ldiv_t'
inline _LIBCPP_INLINE_VISIBILITY ldiv_t div(long __x, long __y) _NOEXCEPT {
                                 ^
/Users/buildslave/jenkins/workspace/lldb-cmake-matrix/clang_1101_build/bin/../include/c++/v1/stdlib.h:143:12: error: no member named 'ldiv' in the global namespace
  return ::ldiv(__x, __y);
         ~~^
/Users/buildslave/jenkins/workspace/lldb-cmake-matrix/clang_1101_build/bin/../include/c++/v1/stdlib.h:146:34: error: unknown type name 'lldiv_t'
inline _LIBCPP_INLINE_VISIBILITY lldiv_t div(long long __x,
                                 ^
/Users/buildslave/jenkins/workspace/lldb-cmake-matrix/clang_1101_build/bin/../include/c++/v1/stdlib.h:148:12: error: no member named 'lldiv' in the global namespace
  return ::lldiv(__x, __y);
         ~~^
In file included from /Users/buildslave/jenkins/workspace/lldb-cmake-matrix/llvm-project/lldb/test/API/functionalities/stop-on-sharedlibrary-load/main.cpp:5:
/Users/buildslave/jenkins/workspace/lldb-cmake-matrix/clang_1101_build/bin/../include/c++/v1/string.h:73:64: error: use of undeclared identifier 'strchr'
char* __libcpp_strchr(const char* __s, int __c) {return (char*)strchr(__s, __c);}
                                                               ^
/Users/buildslave/jenkins/workspace/lldb-cmake-matrix/clang_1101_build/bin/../include/c++/v1/string.h:80:75: error: use of undeclared identifier 'strpbrk'
char* __libcpp_strpbrk(const char* __s1, const char* __s2) {return (char*)strpbrk(__s1, __s2);}
                                                                          ^
/Users/buildslave/jenkins/workspace/lldb-cmake-matrix/clang_1101_build/bin/../include/c++/v1/string.h:87:65: error: use of undeclared identifier 'strrchr'; did you mean 'strchr'?
char* __libcpp_strrchr(const char* __s, int __c) {return (char*)strrchr(__s, __c);}
                                                                ^
/Users/buildslave/jenkins/workspace/lldb-cmake-matrix/clang_1101_build/bin/../include/c++/v1/string.h:75:13: note: 'strchr' declared here
const char* strchr(const char* __s, int __c) {return __libcpp_strchr(__s, __c);}
            ^
/Users/buildslave/jenkins/workspace/lldb-cmake-matrix/clang_1101_build/bin/../include/c++/v1/string.h:94:49: error: unknown type name 'size_t'
void* __libcpp_memchr(const void* __s, int __c, size_t __n) {return (void*)memchr(__s, __c, __n);}
                                                ^
/Users/buildslave/jenkins/workspace/lldb-cmake-matrix/clang_1101_build/bin/../include/c++/v1/string.h:96:46: error: unknown type name 'size_t'
const void* memchr(const void* __s, int __c, size_t __n) {return __libcpp_memchr(__s, __c, __n);}
                                             ^
/Users/buildslave/jenkins/workspace/lldb-cmake-matrix/clang_1101_build/bin/../include/c++/v1/string.h:98:46: error: unknown type name 'size_t'
      void* memchr(      void* __s, int __c, size_t __n) {return __libcpp_memchr(__s, __c, __n);}
                                             ^
/Users/buildslave/jenkins/workspace/lldb-cmake-matrix/clang_1101_build/bin/../include/c++/v1/string.h:101:74: error: use of undeclared identifier 'strstr'; did you mean 'strchr'?
char* __libcpp_strstr(const char* __s1, const char* __s2) {return (char*)strstr(__s1, __s2);}
                                                                         ^
/Users/buildslave/jenkins/workspace/lldb-cmake-matrix/clang_1101_build/bin/../include/c++/v1/string.h:77:13: note: 'strchr' declared here
      char* strchr(      char* __s, int __c) {return __libcpp_strchr(__s, __c);}
            ^
/Users/buildslave/jenkins/workspace/lldb-cmake-matrix/clang_1101_build/bin/../include/c++/v1/string.h:101:74: error: no matching function for call to 'strchr'
char* __libcpp_strstr(const char* __s1, const char* __s2) {return (char*)strstr(__s1, __s2);}
                                                                         ^
/Users/buildslave/jenkins/workspace/lldb-cmake-matrix/clang_1101_build/bin/../include/c++/v1/string.h:77:13: note: candidate disabled: <no message provided>
      char* strchr(      char* __s, int __c) {return __libcpp_strchr(__s, __c);}
            ^
/Users/buildslave/jenkins/workspace/lldb-cmake-matrix/clang_1101_build/bin/../include/c++/v1/string.h:101:81: error: cannot initialize a parameter of type 'char *' with an lvalue of type 'const char *'
char* __libcpp_strstr(const char* __s1, const char* __s2) {return (char*)strstr(__s1, __s2);}
                                                                                ^~~~
/Users/buildslave/jenkins/workspace/lldb-cmake-matrix/clang_1101_build/bin/../include/c++/v1/string.h:77:32: note: passing argument to parameter '__s' here
      char* strchr(      char* __s, int __c) {return __libcpp_strchr(__s, __c);}
                               ^
/Users/buildslave/jenkins/workspace/lldb-cmake-matrix/llvm-project/lldb/test/API/functionalities/stop-on-sharedlibrary-load/main.cpp:9:26: error: use of undeclared identifier 'NULL'
  void *a_dylib_handle = NULL;
                         ^
/Users/buildslave/jenkins/workspace/lldb-cmake-matrix/llvm-project/lldb/test/API/functionalities/stop-on-sharedlibrary-load/main.cpp:12:25: error: use of undeclared identifier 'NULL'
  if (a_dylib_handle == NULL) { // Set another here - we should not hit this one
                        ^
/Users/buildslave/jenkins/workspace/lldb-cmake-matrix/llvm-project/lldb/test/API/functionalities/stop-on-sharedlibrary-load/main.cpp:13:13: error: use of undeclared identifier 'stderr'
    fprintf(stderr, "%s\n", dylib_last_error());
            ^
/Users/buildslave/jenkins/workspace/lldb-cmake-matrix/llvm-project/lldb/test/API/functionalities/stop-on-sharedlibrary-load/main.cpp:14:5: error: use of undeclared identifier 'exit'
    exit(1);
    ^
/Users/buildslave/jenkins/workspace/lldb-cmake-matrix/llvm-project/lldb/test/API/functionalities/stop-on-sharedlibrary-load/main.cpp:18:26: error: use of undeclared identifier 'NULL'
  void *b_dylib_handle = NULL;
                         ^
fatal error: too many errors emitted, stopping now [-ferror-limit=]
20 errors generated.
make: *** [main.o] Error 1

Test Directory:
/Users/buildslave/jenkins/workspace/lldb-cmake-matrix/llvm-project/lldb/test/API/functionalities/stop-on-sharedlibrary-load
----------------------------------------------------------------------
Ran 4 tests in 0.450s

RESULT: FAILED (0 passes, 0 failures, 4 errors, 0 skipped, 0 expected failures, 0 unexpected successes)

--