Regression

Test Clang 5.0.2 / lldb-api.lang/cpp/offsetof.TestOffsetofCpp.py (from lldb-api)

Failing for the past 1 build (Since #5040 )
Took 2.1 sec.

Stacktrace

Script:
--
/Applications/Xcode.app/Contents/Developer/Library/Frameworks/Python3.framework/Versions/3.8/bin/python3.8 /Users/buildslave/jenkins/workspace/lldb-cmake-matrix/llvm-project/lldb/test/API/dotest.py -u CXXFLAGS -u CFLAGS --codesign-identity lldb_codesign --arch x86_64 --build-dir /Users/buildslave/jenkins/workspace/lldb-cmake-matrix/lldb-build/lldb-test-build.noindex -t --env TERM=vt100 --skip-category gmodules --skip-category watchpoint --skip-category llgs --skip-category debugserver --arch=x86_64 --env LLVM_LIBS_DIR=/Users/buildslave/jenkins/workspace/lldb-cmake-matrix/lldb-build/./lib --env LLVM_INCLUDE_DIR=/Users/buildslave/jenkins/workspace/lldb-cmake-matrix/lldb-build/include --env LLVM_TOOLS_DIR=/Users/buildslave/jenkins/workspace/lldb-cmake-matrix/lldb-build/./bin --hermetic-libcxx --arch x86_64 --build-dir /Users/buildslave/jenkins/workspace/lldb-cmake-matrix/lldb-build/lldb-test-build.noindex --lldb-module-cache-dir /Users/buildslave/jenkins/workspace/lldb-cmake-matrix/lldb-build/lldb-test-build.noindex/module-cache-lldb/lldb-api --clang-module-cache-dir /Users/buildslave/jenkins/workspace/lldb-cmake-matrix/lldb-build/lldb-test-build.noindex/module-cache-clang/lldb-api --executable /Users/buildslave/jenkins/workspace/lldb-cmake-matrix/lldb-build/./bin/lldb --compiler /Users/buildslave/jenkins/workspace/lldb-cmake-matrix/clang_502_build/bin/clang --dsymutil /Users/buildslave/jenkins/workspace/lldb-cmake-matrix/lldb-build/./bin/dsymutil --llvm-tools-dir /Users/buildslave/jenkins/workspace/lldb-cmake-matrix/lldb-build/./bin --lldb-libs-dir /Users/buildslave/jenkins/workspace/lldb-cmake-matrix/lldb-build/./lib /Users/buildslave/jenkins/workspace/lldb-cmake-matrix/llvm-project/lldb/test/API/lang/cpp/offsetof -p TestOffsetofCpp.py
--
Exit Code: 1

Command Output (stdout):
--
lldb version 16.0.99git (http://labmaster3.local/git/llvm-project.git revision d1f36da9e03baeccb2f4dd8095f8aaf5b4547c68)
  clang revision d1f36da9e03baeccb2f4dd8095f8aaf5b4547c68
  llvm revision d1f36da9e03baeccb2f4dd8095f8aaf5b4547c68
Skipping the following test categories: ['gmodules', 'watchpoint', 'llgs', 'debugserver', 'libstdcxx', 'dwo', 'llgs', 'fork']

--
Command Output (stderr):
--
Change dir to: /Users/buildslave/jenkins/workspace/lldb-cmake-matrix/llvm-project/lldb/test/API/lang/cpp/offsetof
runCmd: settings clear -all
output: 

runCmd: settings set symbols.enable-external-lookup false
output: 

runCmd: settings set target.inherit-tcc true
output: 

runCmd: settings set target.detach-on-error false
output: 

runCmd: settings set target.auto-apply-fixits false
output: 

runCmd: settings set plugin.process.gdb-remote.packet-timeout 60
output: 

runCmd: settings set symbols.clang-modules-cache-path "/Users/buildslave/jenkins/workspace/lldb-cmake-matrix/lldb-build/lldb-test-build.noindex/module-cache-lldb/lldb-api"
output: 

runCmd: settings set use-color false
output: 

runCmd: setting set target.prefer-dynamic-value no-dynamic-values
output: 

make VPATH=/Users/buildslave/jenkins/workspace/lldb-cmake-matrix/llvm-project/lldb/test/API/lang/cpp/offsetof -C /Users/buildslave/jenkins/workspace/lldb-cmake-matrix/lldb-build/lldb-test-build.noindex/lang/cpp/offsetof/TestOffsetofCpp.test -I /Users/buildslave/jenkins/workspace/lldb-cmake-matrix/llvm-project/lldb/test/API/lang/cpp/offsetof -I /Users/buildslave/jenkins/workspace/lldb-cmake-matrix/llvm-project/lldb/packages/Python/lldbsuite/test/make -f /Users/buildslave/jenkins/workspace/lldb-cmake-matrix/lldb-build/lldb-test-build.noindex/lang/cpp/offsetof/TestOffsetofCpp.test/Makefile all ARCH=x86_64 'CC="/Users/buildslave/jenkins/workspace/lldb-cmake-matrix/clang_502_build/bin/clang"' DSYMUTIL=/Users/buildslave/jenkins/workspace/lldb-cmake-matrix/lldb-build/./bin/dsymutil CODESIGN=codesign CLANG_MODULE_CACHE_DIR=/Users/buildslave/jenkins/workspace/lldb-cmake-matrix/lldb-build/lldb-test-build.noindex/module-cache-clang/lldb-api USE_HERMETIC_LIBCPP=1

FAIL: LLDB (/Users/buildslave/jenkins/workspace/lldb-cmake-matrix/clang_502_build/bin/clang-x86_64) :: test (lldbsuite.test.lldbtest.TestOffsetofCpp)
Restore dir to: /Users/buildslave/jenkins/workspace/lldb-cmake-matrix/lldb-build/tools/lldb/test
======================================================================
ERROR: test (lldbsuite.test.lldbtest.TestOffsetofCpp)
----------------------------------------------------------------------
Error when building test subject.

Build Command:
make VPATH=/Users/buildslave/jenkins/workspace/lldb-cmake-matrix/llvm-project/lldb/test/API/lang/cpp/offsetof -C /Users/buildslave/jenkins/workspace/lldb-cmake-matrix/lldb-build/lldb-test-build.noindex/lang/cpp/offsetof/TestOffsetofCpp.test -I /Users/buildslave/jenkins/workspace/lldb-cmake-matrix/llvm-project/lldb/test/API/lang/cpp/offsetof -I /Users/buildslave/jenkins/workspace/lldb-cmake-matrix/llvm-project/lldb/packages/Python/lldbsuite/test/make -f /Users/buildslave/jenkins/workspace/lldb-cmake-matrix/lldb-build/lldb-test-build.noindex/lang/cpp/offsetof/TestOffsetofCpp.test/Makefile all ARCH=x86_64 'CC="/Users/buildslave/jenkins/workspace/lldb-cmake-matrix/clang_502_build/bin/clang"' DSYMUTIL=/Users/buildslave/jenkins/workspace/lldb-cmake-matrix/lldb-build/./bin/dsymutil CODESIGN=codesign CLANG_MODULE_CACHE_DIR=/Users/buildslave/jenkins/workspace/lldb-cmake-matrix/lldb-build/lldb-test-build.noindex/module-cache-clang/lldb-api USE_HERMETIC_LIBCPP=1

Build Command Output:
"/Users/buildslave/jenkins/workspace/lldb-cmake-matrix/clang_502_build/bin/clang"  -std=c++11 -std=c++11 -g -O0 -isysroot "/Applications/Xcode.app/Contents/Developer/Platforms/MacOSX.platform/Developer/SDKs/MacOSX11.1.sdk" -arch x86_64  -I/Users/buildslave/jenkins/workspace/lldb-cmake-matrix/llvm-project/lldb/packages/Python/lldbsuite/test/make/../../../../../include -I/Users/buildslave/jenkins/workspace/lldb-cmake-matrix/lldb-build/lldb-test-build.noindex/lang/cpp/offsetof/TestOffsetofCpp.test -I/Users/buildslave/jenkins/workspace/lldb-cmake-matrix/llvm-project/lldb/packages/Python/lldbsuite/test/make -include /Users/buildslave/jenkins/workspace/lldb-cmake-matrix/llvm-project/lldb/packages/Python/lldbsuite/test/make/test_common.h  -fno-limit-debug-info     --driver-mode=g++ -MT main.o -MD -MP -MF main.d -c -o main.o /Users/buildslave/jenkins/workspace/lldb-cmake-matrix/llvm-project/lldb/test/API/lang/cpp/offsetof/main.cpp
In file included from /Users/buildslave/jenkins/workspace/lldb-cmake-matrix/llvm-project/lldb/test/API/lang/cpp/offsetof/main.cpp:1:
/Users/buildslave/jenkins/workspace/lldb-cmake-matrix/clang_502_build/include/c++/v1/cstdint:153:8: error: no member named 'int8_t' in the global namespace
using::int8_t;
     ~~^
/Users/buildslave/jenkins/workspace/lldb-cmake-matrix/clang_502_build/include/c++/v1/cstdint:154:8: error: no member named 'int16_t' in the global namespace
using::int16_t;
     ~~^
/Users/buildslave/jenkins/workspace/lldb-cmake-matrix/clang_502_build/include/c++/v1/cstdint:155:8: error: no member named 'int32_t' in the global namespace
using::int32_t;
     ~~^
/Users/buildslave/jenkins/workspace/lldb-cmake-matrix/clang_502_build/include/c++/v1/cstdint:156:8: error: no member named 'int64_t' in the global namespace
using::int64_t;
     ~~^
/Users/buildslave/jenkins/workspace/lldb-cmake-matrix/clang_502_build/include/c++/v1/cstdint:158:8: error: no member named 'uint8_t' in the global namespace
using::uint8_t;
     ~~^
/Users/buildslave/jenkins/workspace/lldb-cmake-matrix/clang_502_build/include/c++/v1/cstdint:159:8: error: no member named 'uint16_t' in the global namespace
using::uint16_t;
     ~~^
/Users/buildslave/jenkins/workspace/lldb-cmake-matrix/clang_502_build/include/c++/v1/cstdint:160:8: error: no member named 'uint32_t' in the global namespace
using::uint32_t;
     ~~^
/Users/buildslave/jenkins/workspace/lldb-cmake-matrix/clang_502_build/include/c++/v1/cstdint:161:8: error: no member named 'uint64_t' in the global namespace
using::uint64_t;
     ~~^
/Users/buildslave/jenkins/workspace/lldb-cmake-matrix/clang_502_build/include/c++/v1/cstdint:163:8: error: no member named 'int_least8_t' in the global namespace
using::int_least8_t;
     ~~^
/Users/buildslave/jenkins/workspace/lldb-cmake-matrix/clang_502_build/include/c++/v1/cstdint:164:8: error: no member named 'int_least16_t' in the global namespace
using::int_least16_t;
     ~~^
/Users/buildslave/jenkins/workspace/lldb-cmake-matrix/clang_502_build/include/c++/v1/cstdint:165:8: error: no member named 'int_least32_t' in the global namespace
using::int_least32_t;
     ~~^
/Users/buildslave/jenkins/workspace/lldb-cmake-matrix/clang_502_build/include/c++/v1/cstdint:166:8: error: no member named 'int_least64_t' in the global namespace
using::int_least64_t;
     ~~^
/Users/buildslave/jenkins/workspace/lldb-cmake-matrix/clang_502_build/include/c++/v1/cstdint:168:8: error: no member named 'uint_least8_t' in the global namespace
using::uint_least8_t;
     ~~^
/Users/buildslave/jenkins/workspace/lldb-cmake-matrix/clang_502_build/include/c++/v1/cstdint:169:8: error: no member named 'uint_least16_t' in the global namespace
using::uint_least16_t;
     ~~^
/Users/buildslave/jenkins/workspace/lldb-cmake-matrix/clang_502_build/include/c++/v1/cstdint:170:8: error: no member named 'uint_least32_t' in the global namespace
using::uint_least32_t;
     ~~^
/Users/buildslave/jenkins/workspace/lldb-cmake-matrix/clang_502_build/include/c++/v1/cstdint:171:8: error: no member named 'uint_least64_t' in the global namespace
using::uint_least64_t;
     ~~^
/Users/buildslave/jenkins/workspace/lldb-cmake-matrix/clang_502_build/include/c++/v1/cstdint:173:8: error: no member named 'int_fast8_t' in the global namespace
using::int_fast8_t;
     ~~^
/Users/buildslave/jenkins/workspace/lldb-cmake-matrix/clang_502_build/include/c++/v1/cstdint:174:8: error: no member named 'int_fast16_t' in the global namespace
using::int_fast16_t;
     ~~^
/Users/buildslave/jenkins/workspace/lldb-cmake-matrix/clang_502_build/include/c++/v1/cstdint:175:8: error: no member named 'int_fast32_t' in the global namespace
using::int_fast32_t;
     ~~^
fatal error: too many errors emitted, stopping now [-ferror-limit=]
20 errors generated.
make: *** [main.o] Error 1

Test Directory:
/Users/buildslave/jenkins/workspace/lldb-cmake-matrix/llvm-project/lldb/test/API/lang/cpp/offsetof
----------------------------------------------------------------------
Ran 1 test in 0.111s

RESULT: FAILED (0 passes, 0 failures, 1 errors, 0 skipped, 0 expected failures, 0 unexpected successes)

--