Regression

Test Clang 11.0.1 / lldb-api.lang/objcxx/class-name-clash.TestNameClash.py (from lldb-api)

Failing for the past 1 build (Since #5040 )
Took 7.1 sec.

Stacktrace

Script:
--
/Applications/Xcode.app/Contents/Developer/Library/Frameworks/Python3.framework/Versions/3.8/bin/python3.8 /Users/buildslave/jenkins/workspace/lldb-cmake-matrix/llvm-project/lldb/test/API/dotest.py -u CXXFLAGS -u CFLAGS --codesign-identity lldb_codesign --arch x86_64 --build-dir /Users/buildslave/jenkins/workspace/lldb-cmake-matrix/lldb-build/lldb-test-build.noindex -t --env TERM=vt100 --skip-category gmodules --skip-category watchpoint --skip-category llgs --skip-category debugserver --arch=x86_64 --env LLVM_LIBS_DIR=/Users/buildslave/jenkins/workspace/lldb-cmake-matrix/lldb-build/./lib --env LLVM_INCLUDE_DIR=/Users/buildslave/jenkins/workspace/lldb-cmake-matrix/lldb-build/include --env LLVM_TOOLS_DIR=/Users/buildslave/jenkins/workspace/lldb-cmake-matrix/lldb-build/./bin --hermetic-libcxx --arch x86_64 --build-dir /Users/buildslave/jenkins/workspace/lldb-cmake-matrix/lldb-build/lldb-test-build.noindex --lldb-module-cache-dir /Users/buildslave/jenkins/workspace/lldb-cmake-matrix/lldb-build/lldb-test-build.noindex/module-cache-lldb/lldb-api --clang-module-cache-dir /Users/buildslave/jenkins/workspace/lldb-cmake-matrix/lldb-build/lldb-test-build.noindex/module-cache-clang/lldb-api --executable /Users/buildslave/jenkins/workspace/lldb-cmake-matrix/lldb-build/./bin/lldb --compiler /Users/buildslave/jenkins/workspace/lldb-cmake-matrix/clang_1101_build/bin/clang --dsymutil /Users/buildslave/jenkins/workspace/lldb-cmake-matrix/lldb-build/./bin/dsymutil --llvm-tools-dir /Users/buildslave/jenkins/workspace/lldb-cmake-matrix/lldb-build/./bin --lldb-libs-dir /Users/buildslave/jenkins/workspace/lldb-cmake-matrix/lldb-build/./lib /Users/buildslave/jenkins/workspace/lldb-cmake-matrix/llvm-project/lldb/test/API/lang/objcxx/class-name-clash -p TestNameClash.py
--
Exit Code: 1

Command Output (stdout):
--
lldb version 16.0.99git (http://labmaster3.local/git/llvm-project.git revision d1f36da9e03baeccb2f4dd8095f8aaf5b4547c68)
  clang revision d1f36da9e03baeccb2f4dd8095f8aaf5b4547c68
  llvm revision d1f36da9e03baeccb2f4dd8095f8aaf5b4547c68
Skipping the following test categories: ['gmodules', 'watchpoint', 'llgs', 'debugserver', 'libstdcxx', 'dwo', 'llgs', 'fork']

--
Command Output (stderr):
--
Change dir to: /Users/buildslave/jenkins/workspace/lldb-cmake-matrix/llvm-project/lldb/test/API/lang/objcxx/class-name-clash
runCmd: settings clear -all
output: 

runCmd: settings set symbols.enable-external-lookup false
output: 

runCmd: settings set target.inherit-tcc true
output: 

runCmd: settings set target.detach-on-error false
output: 

runCmd: settings set target.auto-apply-fixits false
output: 

runCmd: settings set plugin.process.gdb-remote.packet-timeout 60
output: 

runCmd: settings set symbols.clang-modules-cache-path "/Users/buildslave/jenkins/workspace/lldb-cmake-matrix/lldb-build/lldb-test-build.noindex/module-cache-lldb/lldb-api"
output: 

runCmd: settings set use-color false
output: 

runCmd: setting set target.prefer-dynamic-value no-dynamic-values
output: 

make VPATH=/Users/buildslave/jenkins/workspace/lldb-cmake-matrix/llvm-project/lldb/test/API/lang/objcxx/class-name-clash -C /Users/buildslave/jenkins/workspace/lldb-cmake-matrix/lldb-build/lldb-test-build.noindex/lang/objcxx/class-name-clash/TestNameClash.test_dsym -I /Users/buildslave/jenkins/workspace/lldb-cmake-matrix/llvm-project/lldb/test/API/lang/objcxx/class-name-clash -I /Users/buildslave/jenkins/workspace/lldb-cmake-matrix/llvm-project/lldb/packages/Python/lldbsuite/test/make -f /Users/buildslave/jenkins/workspace/lldb-cmake-matrix/llvm-project/lldb/test/API/lang/objcxx/class-name-clash/Makefile MAKE_DSYM=YES all ARCH=x86_64 'CC="/Users/buildslave/jenkins/workspace/lldb-cmake-matrix/clang_1101_build/bin/clang"' DSYMUTIL=/Users/buildslave/jenkins/workspace/lldb-cmake-matrix/lldb-build/./bin/dsymutil CODESIGN=codesign CLANG_MODULE_CACHE_DIR=/Users/buildslave/jenkins/workspace/lldb-cmake-matrix/lldb-build/lldb-test-build.noindex/module-cache-clang/lldb-api USE_HERMETIC_LIBCPP=1

FAIL: LLDB (/Users/buildslave/jenkins/workspace/lldb-cmake-matrix/clang_1101_build/bin/clang-x86_64) :: test_dsym (lldbsuite.test.lldbtest.TestNameClash)
runCmd: settings clear -all
output: 

runCmd: settings set symbols.enable-external-lookup false
output: 

runCmd: settings set target.inherit-tcc true
output: 

runCmd: settings set target.detach-on-error false
output: 

runCmd: settings set target.auto-apply-fixits false
output: 

runCmd: settings set plugin.process.gdb-remote.packet-timeout 60
output: 

runCmd: settings set symbols.clang-modules-cache-path "/Users/buildslave/jenkins/workspace/lldb-cmake-matrix/lldb-build/lldb-test-build.noindex/module-cache-lldb/lldb-api"
output: 

runCmd: settings set use-color false
output: 

runCmd: setting set target.prefer-dynamic-value no-dynamic-values
output: 

make VPATH=/Users/buildslave/jenkins/workspace/lldb-cmake-matrix/llvm-project/lldb/test/API/lang/objcxx/class-name-clash -C /Users/buildslave/jenkins/workspace/lldb-cmake-matrix/lldb-build/lldb-test-build.noindex/lang/objcxx/class-name-clash/TestNameClash.test_dwarf -I /Users/buildslave/jenkins/workspace/lldb-cmake-matrix/llvm-project/lldb/test/API/lang/objcxx/class-name-clash -I /Users/buildslave/jenkins/workspace/lldb-cmake-matrix/llvm-project/lldb/packages/Python/lldbsuite/test/make -f /Users/buildslave/jenkins/workspace/lldb-cmake-matrix/llvm-project/lldb/test/API/lang/objcxx/class-name-clash/Makefile MAKE_DSYM=NO all ARCH=x86_64 'CC="/Users/buildslave/jenkins/workspace/lldb-cmake-matrix/clang_1101_build/bin/clang"' DSYMUTIL=/Users/buildslave/jenkins/workspace/lldb-cmake-matrix/lldb-build/./bin/dsymutil CODESIGN=codesign CLANG_MODULE_CACHE_DIR=/Users/buildslave/jenkins/workspace/lldb-cmake-matrix/lldb-build/lldb-test-build.noindex/module-cache-clang/lldb-api USE_HERMETIC_LIBCPP=1

FAIL: LLDB (/Users/buildslave/jenkins/workspace/lldb-cmake-matrix/clang_1101_build/bin/clang-x86_64) :: test_dwarf (lldbsuite.test.lldbtest.TestNameClash)
UNSUPPORTED: LLDB (/Users/buildslave/jenkins/workspace/lldb-cmake-matrix/clang_1101_build/bin/clang-x86_64) :: test_dwo (lldbsuite.test.lldbtest.TestNameClash) (test case does not fall in any category of interest for this run) 
UNSUPPORTED: LLDB (/Users/buildslave/jenkins/workspace/lldb-cmake-matrix/clang_1101_build/bin/clang-x86_64) :: test_gmodules (lldbsuite.test.lldbtest.TestNameClash) (test case does not fall in any category of interest for this run) 
Restore dir to: /Users/buildslave/jenkins/workspace/lldb-cmake-matrix/lldb-build/tools/lldb/test
======================================================================
ERROR: test_dsym (lldbsuite.test.lldbtest.TestNameClash)
----------------------------------------------------------------------
Error when building test subject.

Build Command:
make VPATH=/Users/buildslave/jenkins/workspace/lldb-cmake-matrix/llvm-project/lldb/test/API/lang/objcxx/class-name-clash -C /Users/buildslave/jenkins/workspace/lldb-cmake-matrix/lldb-build/lldb-test-build.noindex/lang/objcxx/class-name-clash/TestNameClash.test_dsym -I /Users/buildslave/jenkins/workspace/lldb-cmake-matrix/llvm-project/lldb/test/API/lang/objcxx/class-name-clash -I /Users/buildslave/jenkins/workspace/lldb-cmake-matrix/llvm-project/lldb/packages/Python/lldbsuite/test/make -f /Users/buildslave/jenkins/workspace/lldb-cmake-matrix/llvm-project/lldb/test/API/lang/objcxx/class-name-clash/Makefile MAKE_DSYM=YES all ARCH=x86_64 'CC="/Users/buildslave/jenkins/workspace/lldb-cmake-matrix/clang_1101_build/bin/clang"' DSYMUTIL=/Users/buildslave/jenkins/workspace/lldb-cmake-matrix/lldb-build/./bin/dsymutil CODESIGN=codesign CLANG_MODULE_CACHE_DIR=/Users/buildslave/jenkins/workspace/lldb-cmake-matrix/lldb-build/lldb-test-build.noindex/module-cache-clang/lldb-api USE_HERMETIC_LIBCPP=1

Build Command Output:
"/Users/buildslave/jenkins/workspace/lldb-cmake-matrix/clang_1101_build/bin/clang" -std=c++11 -g -O0 -isysroot "/Applications/Xcode.app/Contents/Developer/Platforms/MacOSX.platform/Developer/SDKs/MacOSX11.1.sdk" -arch x86_64  -I/Users/buildslave/jenkins/workspace/lldb-cmake-matrix/llvm-project/lldb/packages/Python/lldbsuite/test/make/../../../../../include -I/Users/buildslave/jenkins/workspace/lldb-cmake-matrix/llvm-project/lldb/test/API/lang/objcxx/class-name-clash -I/Users/buildslave/jenkins/workspace/lldb-cmake-matrix/llvm-project/lldb/packages/Python/lldbsuite/test/make -include /Users/buildslave/jenkins/workspace/lldb-cmake-matrix/llvm-project/lldb/packages/Python/lldbsuite/test/make/test_common.h  -fno-limit-debug-info     --driver-mode=g++ -MT main.o -MD -MP -MF main.d -c -o main.o /Users/buildslave/jenkins/workspace/lldb-cmake-matrix/llvm-project/lldb/test/API/lang/objcxx/class-name-clash/main.mm
In file included from /Users/buildslave/jenkins/workspace/lldb-cmake-matrix/llvm-project/lldb/test/API/lang/objcxx/class-name-clash/main.mm:1:
In file included from /Applications/Xcode.app/Contents/Developer/Platforms/MacOSX.platform/Developer/SDKs/MacOSX11.1.sdk/System/Library/Frameworks/Foundation.framework/Headers/Foundation.h:6:
In file included from /Applications/Xcode.app/Contents/Developer/Platforms/MacOSX.platform/Developer/SDKs/MacOSX11.1.sdk/System/Library/Frameworks/CoreFoundation.framework/Headers/CoreFoundation.h:18:
In file included from /Applications/Xcode.app/Contents/Developer/Platforms/MacOSX.platform/Developer/SDKs/MacOSX11.1.sdk/usr/include/assert.h:44:
/Users/buildslave/jenkins/workspace/lldb-cmake-matrix/clang_1101_build/bin/../include/c++/v1/stdlib.h:142:34: error: unknown type name 'ldiv_t'; did you mean 'dev_t'?
inline _LIBCPP_INLINE_VISIBILITY ldiv_t div(long __x, long __y) _NOEXCEPT {
                                 ^
/Applications/Xcode.app/Contents/Developer/Platforms/MacOSX.platform/Developer/SDKs/MacOSX11.1.sdk/usr/include/sys/_types/_dev_t.h:31:31: note: 'dev_t' declared here
typedef __darwin_dev_t        dev_t;    /* device number */
                              ^
In file included from /Users/buildslave/jenkins/workspace/lldb-cmake-matrix/llvm-project/lldb/test/API/lang/objcxx/class-name-clash/main.mm:1:
In file included from /Applications/Xcode.app/Contents/Developer/Platforms/MacOSX.platform/Developer/SDKs/MacOSX11.1.sdk/System/Library/Frameworks/Foundation.framework/Headers/Foundation.h:6:
In file included from /Applications/Xcode.app/Contents/Developer/Platforms/MacOSX.platform/Developer/SDKs/MacOSX11.1.sdk/System/Library/Frameworks/CoreFoundation.framework/Headers/CoreFoundation.h:18:
In file included from /Applications/Xcode.app/Contents/Developer/Platforms/MacOSX.platform/Developer/SDKs/MacOSX11.1.sdk/usr/include/assert.h:44:
/Users/buildslave/jenkins/workspace/lldb-cmake-matrix/clang_1101_build/bin/../include/c++/v1/stdlib.h:143:12: error: no member named 'ldiv' in the global namespace; did you mean 'div'?
  return ::ldiv(__x, __y);
         ~~^
/Users/buildslave/jenkins/workspace/lldb-cmake-matrix/clang_1101_build/bin/../include/c++/v1/stdlib.h:142:41: note: 'div' declared here
inline _LIBCPP_INLINE_VISIBILITY ldiv_t div(long __x, long __y) _NOEXCEPT {
                                        ^
/Users/buildslave/jenkins/workspace/lldb-cmake-matrix/clang_1101_build/bin/../include/c++/v1/stdlib.h:146:34: error: unknown type name 'lldiv_t'
inline _LIBCPP_INLINE_VISIBILITY lldiv_t div(long long __x,
                                 ^
/Users/buildslave/jenkins/workspace/lldb-cmake-matrix/clang_1101_build/bin/../include/c++/v1/stdlib.h:148:12: error: no member named 'lldiv' in the global namespace
  return ::lldiv(__x, __y);
         ~~^
In file included from /Users/buildslave/jenkins/workspace/lldb-cmake-matrix/llvm-project/lldb/test/API/lang/objcxx/class-name-clash/main.mm:1:
In file included from /Applications/Xcode.app/Contents/Developer/Platforms/MacOSX.platform/Developer/SDKs/MacOSX11.1.sdk/System/Library/Frameworks/Foundation.framework/Headers/Foundation.h:6:
In file included from /Applications/Xcode.app/Contents/Developer/Platforms/MacOSX.platform/Developer/SDKs/MacOSX11.1.sdk/System/Library/Frameworks/CoreFoundation.framework/Headers/CoreFoundation.h:24:
/Users/buildslave/jenkins/workspace/lldb-cmake-matrix/clang_1101_build/bin/../include/c++/v1/math.h:771:93: error: no member named 'acosf' in the global namespace; did you mean 'acos'?
inline _LIBCPP_INLINE_VISIBILITY float       acos(float __lcpp_x) _NOEXCEPT       {return ::acosf(__lcpp_x);}
                                                                                          ~~^
/Users/buildslave/jenkins/workspace/lldb-cmake-matrix/clang_1101_build/bin/../include/c++/v1/math.h:771:46: note: 'acos' declared here
inline _LIBCPP_INLINE_VISIBILITY float       acos(float __lcpp_x) _NOEXCEPT       {return ::acosf(__lcpp_x);}
                                             ^
/Users/buildslave/jenkins/workspace/lldb-cmake-matrix/clang_1101_build/bin/../include/c++/v1/math.h:772:93: error: no member named 'acosl' in the global namespace; did you mean 'acos'?
inline _LIBCPP_INLINE_VISIBILITY long double acos(long double __lcpp_x) _NOEXCEPT {return ::acosl(__lcpp_x);}
                                                                                          ~~^
/Users/buildslave/jenkins/workspace/lldb-cmake-matrix/clang_1101_build/bin/../include/c++/v1/math.h:771:46: note: 'acos' declared here
inline _LIBCPP_INLINE_VISIBILITY float       acos(float __lcpp_x) _NOEXCEPT       {return ::acosf(__lcpp_x);}
                                             ^
/Users/buildslave/jenkins/workspace/lldb-cmake-matrix/clang_1101_build/bin/../include/c++/v1/math.h:778:38: error: call to 'acos' is ambiguous
acos(_A1 __lcpp_x) _NOEXCEPT {return ::acos((double)__lcpp_x);}
                                     ^~~~~~
/Users/buildslave/jenkins/workspace/lldb-cmake-matrix/clang_1101_build/bin/../include/c++/v1/math.h:771:46: note: candidate function
inline _LIBCPP_INLINE_VISIBILITY float       acos(float __lcpp_x) _NOEXCEPT       {return ::acosf(__lcpp_x);}
                                             ^
/Users/buildslave/jenkins/workspace/lldb-cmake-matrix/clang_1101_build/bin/../include/c++/v1/math.h:772:46: note: candidate function
inline _LIBCPP_INLINE_VISIBILITY long double acos(long double __lcpp_x) _NOEXCEPT {return ::acosl(__lcpp_x);}
                                             ^
/Users/buildslave/jenkins/workspace/lldb-cmake-matrix/clang_1101_build/bin/../include/c++/v1/math.h:783:93: error: no member named 'asinf' in the global namespace; did you mean 'asin'?
inline _LIBCPP_INLINE_VISIBILITY float       asin(float __lcpp_x) _NOEXCEPT       {return ::asinf(__lcpp_x);}
                                                                                          ~~^
/Users/buildslave/jenkins/workspace/lldb-cmake-matrix/clang_1101_build/bin/../include/c++/v1/math.h:783:46: note: 'asin' declared here
inline _LIBCPP_INLINE_VISIBILITY float       asin(float __lcpp_x) _NOEXCEPT       {return ::asinf(__lcpp_x);}
                                             ^
/Users/buildslave/jenkins/workspace/lldb-cmake-matrix/clang_1101_build/bin/../include/c++/v1/math.h:784:93: error: no member named 'asinl' in the global namespace; did you mean 'asin'?
inline _LIBCPP_INLINE_VISIBILITY long double asin(long double __lcpp_x) _NOEXCEPT {return ::asinl(__lcpp_x);}
                                                                                          ~~^
/Users/buildslave/jenkins/workspace/lldb-cmake-matrix/clang_1101_build/bin/../include/c++/v1/math.h:783:46: note: 'asin' declared here
inline _LIBCPP_INLINE_VISIBILITY float       asin(float __lcpp_x) _NOEXCEPT       {return ::asinf(__lcpp_x);}
                                             ^
/Users/buildslave/jenkins/workspace/lldb-cmake-matrix/clang_1101_build/bin/../include/c++/v1/math.h:790:38: error: call to 'asin' is ambiguous
asin(_A1 __lcpp_x) _NOEXCEPT {return ::asin((double)__lcpp_x);}
                                     ^~~~~~
/Users/buildslave/jenkins/workspace/lldb-cmake-matrix/clang_1101_build/bin/../include/c++/v1/math.h:783:46: note: candidate function
inline _LIBCPP_INLINE_VISIBILITY float       asin(float __lcpp_x) _NOEXCEPT       {return ::asinf(__lcpp_x);}
                                             ^
/Users/buildslave/jenkins/workspace/lldb-cmake-matrix/clang_1101_build/bin/../include/c++/v1/math.h:784:46: note: candidate function
inline _LIBCPP_INLINE_VISIBILITY long double asin(long double __lcpp_x) _NOEXCEPT {return ::asinl(__lcpp_x);}
                                             ^
/Users/buildslave/jenkins/workspace/lldb-cmake-matrix/clang_1101_build/bin/../include/c++/v1/math.h:795:93: error: no member named 'atanf' in the global namespace; did you mean 'atan'?
inline _LIBCPP_INLINE_VISIBILITY float       atan(float __lcpp_x) _NOEXCEPT       {return ::atanf(__lcpp_x);}
                                                                                          ~~^
/Users/buildslave/jenkins/workspace/lldb-cmake-matrix/clang_1101_build/bin/../include/c++/v1/math.h:795:46: note: 'atan' declared here
inline _LIBCPP_INLINE_VISIBILITY float       atan(float __lcpp_x) _NOEXCEPT       {return ::atanf(__lcpp_x);}
                                             ^
/Users/buildslave/jenkins/workspace/lldb-cmake-matrix/clang_1101_build/bin/../include/c++/v1/math.h:796:93: error: no member named 'atanl' in the global namespace; did you mean 'atan'?
inline _LIBCPP_INLINE_VISIBILITY long double atan(long double __lcpp_x) _NOEXCEPT {return ::atanl(__lcpp_x);}
                                                                                          ~~^
/Users/buildslave/jenkins/workspace/lldb-cmake-matrix/clang_1101_build/bin/../include/c++/v1/math.h:795:46: note: 'atan' declared here
inline _LIBCPP_INLINE_VISIBILITY float       atan(float __lcpp_x) _NOEXCEPT       {return ::atanf(__lcpp_x);}
                                             ^
/Users/buildslave/jenkins/workspace/lldb-cmake-matrix/clang_1101_build/bin/../include/c++/v1/math.h:802:38: error: call to 'atan' is ambiguous
atan(_A1 __lcpp_x) _NOEXCEPT {return ::atan((double)__lcpp_x);}
                                     ^~~~~~
/Users/buildslave/jenkins/workspace/lldb-cmake-matrix/clang_1101_build/bin/../include/c++/v1/math.h:795:46: note: candidate function
inline _LIBCPP_INLINE_VISIBILITY float       atan(float __lcpp_x) _NOEXCEPT       {return ::atanf(__lcpp_x);}
                                             ^
/Users/buildslave/jenkins/workspace/lldb-cmake-matrix/clang_1101_build/bin/../include/c++/v1/math.h:796:46: note: candidate function
inline _LIBCPP_INLINE_VISIBILITY long double atan(long double __lcpp_x) _NOEXCEPT {return ::atanl(__lcpp_x);}
                                             ^
/Users/buildslave/jenkins/workspace/lldb-cmake-matrix/clang_1101_build/bin/../include/c++/v1/math.h:807:116: error: no member named 'atan2f' in the global namespace; did you mean 'atan2'?
inline _LIBCPP_INLINE_VISIBILITY float       atan2(float __lcpp_y, float __lcpp_x) _NOEXCEPT             {return ::atan2f(__lcpp_y, __lcpp_x);}
                                                                                                                 ~~^
/Users/buildslave/jenkins/workspace/lldb-cmake-matrix/clang_1101_build/bin/../include/c++/v1/math.h:807:46: note: 'atan2' declared here
inline _LIBCPP_INLINE_VISIBILITY float       atan2(float __lcpp_y, float __lcpp_x) _NOEXCEPT             {return ::atan2f(__lcpp_y, __lcpp_x);}
                                             ^
/Users/buildslave/jenkins/workspace/lldb-cmake-matrix/clang_1101_build/bin/../include/c++/v1/math.h:808:116: error: no member named 'atan2l' in the global namespace; did you mean 'atan2'?
inline _LIBCPP_INLINE_VISIBILITY long double atan2(long double __lcpp_y, long double __lcpp_x) _NOEXCEPT {return ::atan2l(__lcpp_y, __lcpp_x);}
                                                                                                                 ~~^
/Users/buildslave/jenkins/workspace/lldb-cmake-matrix/clang_1101_build/bin/../include/c++/v1/math.h:807:46: note: 'atan2' declared here
inline _LIBCPP_INLINE_VISIBILITY float       atan2(float __lcpp_y, float __lcpp_x) _NOEXCEPT             {return ::atan2f(__lcpp_y, __lcpp_x);}
                                             ^
/Users/buildslave/jenkins/workspace/lldb-cmake-matrix/clang_1101_build/bin/../include/c++/v1/math.h:830:93: error: no member named 'ceilf' in the global namespace; did you mean 'ceil'?
inline _LIBCPP_INLINE_VISIBILITY float       ceil(float __lcpp_x) _NOEXCEPT       {return ::ceilf(__lcpp_x);}
                                                                                          ~~^
/Users/buildslave/jenkins/workspace/lldb-cmake-matrix/clang_1101_build/bin/../include/c++/v1/math.h:830:46: note: 'ceil' declared here
inline _LIBCPP_INLINE_VISIBILITY float       ceil(float __lcpp_x) _NOEXCEPT       {return ::ceilf(__lcpp_x);}
                                             ^
/Users/buildslave/jenkins/workspace/lldb-cmake-matrix/clang_1101_build/bin/../include/c++/v1/math.h:831:93: error: no member named 'ceill' in the global namespace; did you mean 'ceil'?
inline _LIBCPP_INLINE_VISIBILITY long double ceil(long double __lcpp_x) _NOEXCEPT {return ::ceill(__lcpp_x);}
                                                                                          ~~^
/Users/buildslave/jenkins/workspace/lldb-cmake-matrix/clang_1101_build/bin/../include/c++/v1/math.h:830:46: note: 'ceil' declared here
inline _LIBCPP_INLINE_VISIBILITY float       ceil(float __lcpp_x) _NOEXCEPT       {return ::ceilf(__lcpp_x);}
                                             ^
/Users/buildslave/jenkins/workspace/lldb-cmake-matrix/clang_1101_build/bin/../include/c++/v1/math.h:837:38: error: call to 'ceil' is ambiguous
ceil(_A1 __lcpp_x) _NOEXCEPT {return ::ceil((double)__lcpp_x);}
                                     ^~~~~~
/Users/buildslave/jenkins/workspace/lldb-cmake-matrix/clang_1101_build/bin/../include/c++/v1/math.h:830:46: note: candidate function
inline _LIBCPP_INLINE_VISIBILITY float       ceil(float __lcpp_x) _NOEXCEPT       {return ::ceilf(__lcpp_x);}
                                             ^
/Users/buildslave/jenkins/workspace/lldb-cmake-matrix/clang_1101_build/bin/../include/c++/v1/math.h:831:46: note: candidate function
inline _LIBCPP_INLINE_VISIBILITY long double ceil(long double __lcpp_x) _NOEXCEPT {return ::ceill(__lcpp_x);}
                                             ^
/Users/buildslave/jenkins/workspace/lldb-cmake-matrix/clang_1101_build/bin/../include/c++/v1/math.h:842:92: error: no member named 'cosf' in the global namespace; did you mean 'cos'?
inline _LIBCPP_INLINE_VISIBILITY float       cos(float __lcpp_x) _NOEXCEPT       {return ::cosf(__lcpp_x);}
                                                                                         ~~^
/Users/buildslave/jenkins/workspace/lldb-cmake-matrix/clang_1101_build/bin/../include/c++/v1/math.h:842:46: note: 'cos' declared here
inline _LIBCPP_INLINE_VISIBILITY float       cos(float __lcpp_x) _NOEXCEPT       {return ::cosf(__lcpp_x);}
                                             ^
fatal error: too many errors emitted, stopping now [-ferror-limit=]
20 errors generated.
make: *** [main.o] Error 1

Test Directory:
/Users/buildslave/jenkins/workspace/lldb-cmake-matrix/llvm-project/lldb/test/API/lang/objcxx/class-name-clash
======================================================================
ERROR: test_dwarf (lldbsuite.test.lldbtest.TestNameClash)
----------------------------------------------------------------------
Error when building test subject.

Build Command:
make VPATH=/Users/buildslave/jenkins/workspace/lldb-cmake-matrix/llvm-project/lldb/test/API/lang/objcxx/class-name-clash -C /Users/buildslave/jenkins/workspace/lldb-cmake-matrix/lldb-build/lldb-test-build.noindex/lang/objcxx/class-name-clash/TestNameClash.test_dwarf -I /Users/buildslave/jenkins/workspace/lldb-cmake-matrix/llvm-project/lldb/test/API/lang/objcxx/class-name-clash -I /Users/buildslave/jenkins/workspace/lldb-cmake-matrix/llvm-project/lldb/packages/Python/lldbsuite/test/make -f /Users/buildslave/jenkins/workspace/lldb-cmake-matrix/llvm-project/lldb/test/API/lang/objcxx/class-name-clash/Makefile MAKE_DSYM=NO all ARCH=x86_64 'CC="/Users/buildslave/jenkins/workspace/lldb-cmake-matrix/clang_1101_build/bin/clang"' DSYMUTIL=/Users/buildslave/jenkins/workspace/lldb-cmake-matrix/lldb-build/./bin/dsymutil CODESIGN=codesign CLANG_MODULE_CACHE_DIR=/Users/buildslave/jenkins/workspace/lldb-cmake-matrix/lldb-build/lldb-test-build.noindex/module-cache-clang/lldb-api USE_HERMETIC_LIBCPP=1

Build Command Output:
"/Users/buildslave/jenkins/workspace/lldb-cmake-matrix/clang_1101_build/bin/clang" -std=c++11 -g -O0 -isysroot "/Applications/Xcode.app/Contents/Developer/Platforms/MacOSX.platform/Developer/SDKs/MacOSX11.1.sdk" -arch x86_64  -I/Users/buildslave/jenkins/workspace/lldb-cmake-matrix/llvm-project/lldb/packages/Python/lldbsuite/test/make/../../../../../include -I/Users/buildslave/jenkins/workspace/lldb-cmake-matrix/llvm-project/lldb/test/API/lang/objcxx/class-name-clash -I/Users/buildslave/jenkins/workspace/lldb-cmake-matrix/llvm-project/lldb/packages/Python/lldbsuite/test/make -include /Users/buildslave/jenkins/workspace/lldb-cmake-matrix/llvm-project/lldb/packages/Python/lldbsuite/test/make/test_common.h  -fno-limit-debug-info     --driver-mode=g++ -MT main.o -MD -MP -MF main.d -c -o main.o /Users/buildslave/jenkins/workspace/lldb-cmake-matrix/llvm-project/lldb/test/API/lang/objcxx/class-name-clash/main.mm
In file included from /Users/buildslave/jenkins/workspace/lldb-cmake-matrix/llvm-project/lldb/test/API/lang/objcxx/class-name-clash/main.mm:1:
In file included from /Applications/Xcode.app/Contents/Developer/Platforms/MacOSX.platform/Developer/SDKs/MacOSX11.1.sdk/System/Library/Frameworks/Foundation.framework/Headers/Foundation.h:6:
In file included from /Applications/Xcode.app/Contents/Developer/Platforms/MacOSX.platform/Developer/SDKs/MacOSX11.1.sdk/System/Library/Frameworks/CoreFoundation.framework/Headers/CoreFoundation.h:18:
In file included from /Applications/Xcode.app/Contents/Developer/Platforms/MacOSX.platform/Developer/SDKs/MacOSX11.1.sdk/usr/include/assert.h:44:
/Users/buildslave/jenkins/workspace/lldb-cmake-matrix/clang_1101_build/bin/../include/c++/v1/stdlib.h:142:34: error: unknown type name 'ldiv_t'; did you mean 'dev_t'?
inline _LIBCPP_INLINE_VISIBILITY ldiv_t div(long __x, long __y) _NOEXCEPT {
                                 ^
/Applications/Xcode.app/Contents/Developer/Platforms/MacOSX.platform/Developer/SDKs/MacOSX11.1.sdk/usr/include/sys/_types/_dev_t.h:31:31: note: 'dev_t' declared here
typedef __darwin_dev_t        dev_t;    /* device number */
                              ^
In file included from /Users/buildslave/jenkins/workspace/lldb-cmake-matrix/llvm-project/lldb/test/API/lang/objcxx/class-name-clash/main.mm:1:
In file included from /Applications/Xcode.app/Contents/Developer/Platforms/MacOSX.platform/Developer/SDKs/MacOSX11.1.sdk/System/Library/Frameworks/Foundation.framework/Headers/Foundation.h:6:
In file included from /Applications/Xcode.app/Contents/Developer/Platforms/MacOSX.platform/Developer/SDKs/MacOSX11.1.sdk/System/Library/Frameworks/CoreFoundation.framework/Headers/CoreFoundation.h:18:
In file included from /Applications/Xcode.app/Contents/Developer/Platforms/MacOSX.platform/Developer/SDKs/MacOSX11.1.sdk/usr/include/assert.h:44:
/Users/buildslave/jenkins/workspace/lldb-cmake-matrix/clang_1101_build/bin/../include/c++/v1/stdlib.h:143:12: error: no member named 'ldiv' in the global namespace; did you mean 'div'?
  return ::ldiv(__x, __y);
         ~~^
/Users/buildslave/jenkins/workspace/lldb-cmake-matrix/clang_1101_build/bin/../include/c++/v1/stdlib.h:142:41: note: 'div' declared here
inline _LIBCPP_INLINE_VISIBILITY ldiv_t div(long __x, long __y) _NOEXCEPT {
                                        ^
/Users/buildslave/jenkins/workspace/lldb-cmake-matrix/clang_1101_build/bin/../include/c++/v1/stdlib.h:146:34: error: unknown type name 'lldiv_t'
inline _LIBCPP_INLINE_VISIBILITY lldiv_t div(long long __x,
                                 ^
/Users/buildslave/jenkins/workspace/lldb-cmake-matrix/clang_1101_build/bin/../include/c++/v1/stdlib.h:148:12: error: no member named 'lldiv' in the global namespace
  return ::lldiv(__x, __y);
         ~~^
In file included from /Users/buildslave/jenkins/workspace/lldb-cmake-matrix/llvm-project/lldb/test/API/lang/objcxx/class-name-clash/main.mm:1:
In file included from /Applications/Xcode.app/Contents/Developer/Platforms/MacOSX.platform/Developer/SDKs/MacOSX11.1.sdk/System/Library/Frameworks/Foundation.framework/Headers/Foundation.h:6:
In file included from /Applications/Xcode.app/Contents/Developer/Platforms/MacOSX.platform/Developer/SDKs/MacOSX11.1.sdk/System/Library/Frameworks/CoreFoundation.framework/Headers/CoreFoundation.h:24:
/Users/buildslave/jenkins/workspace/lldb-cmake-matrix/clang_1101_build/bin/../include/c++/v1/math.h:771:93: error: no member named 'acosf' in the global namespace; did you mean 'acos'?
inline _LIBCPP_INLINE_VISIBILITY float       acos(float __lcpp_x) _NOEXCEPT       {return ::acosf(__lcpp_x);}
                                                                                          ~~^
/Users/buildslave/jenkins/workspace/lldb-cmake-matrix/clang_1101_build/bin/../include/c++/v1/math.h:771:46: note: 'acos' declared here
inline _LIBCPP_INLINE_VISIBILITY float       acos(float __lcpp_x) _NOEXCEPT       {return ::acosf(__lcpp_x);}
                                             ^
/Users/buildslave/jenkins/workspace/lldb-cmake-matrix/clang_1101_build/bin/../include/c++/v1/math.h:772:93: error: no member named 'acosl' in the global namespace; did you mean 'acos'?
inline _LIBCPP_INLINE_VISIBILITY long double acos(long double __lcpp_x) _NOEXCEPT {return ::acosl(__lcpp_x);}
                                                                                          ~~^
/Users/buildslave/jenkins/workspace/lldb-cmake-matrix/clang_1101_build/bin/../include/c++/v1/math.h:771:46: note: 'acos' declared here
inline _LIBCPP_INLINE_VISIBILITY float       acos(float __lcpp_x) _NOEXCEPT       {return ::acosf(__lcpp_x);}
                                             ^
/Users/buildslave/jenkins/workspace/lldb-cmake-matrix/clang_1101_build/bin/../include/c++/v1/math.h:778:38: error: call to 'acos' is ambiguous
acos(_A1 __lcpp_x) _NOEXCEPT {return ::acos((double)__lcpp_x);}
                                     ^~~~~~
/Users/buildslave/jenkins/workspace/lldb-cmake-matrix/clang_1101_build/bin/../include/c++/v1/math.h:771:46: note: candidate function
inline _LIBCPP_INLINE_VISIBILITY float       acos(float __lcpp_x) _NOEXCEPT       {return ::acosf(__lcpp_x);}
                                             ^
/Users/buildslave/jenkins/workspace/lldb-cmake-matrix/clang_1101_build/bin/../include/c++/v1/math.h:772:46: note: candidate function
inline _LIBCPP_INLINE_VISIBILITY long double acos(long double __lcpp_x) _NOEXCEPT {return ::acosl(__lcpp_x);}
                                             ^
/Users/buildslave/jenkins/workspace/lldb-cmake-matrix/clang_1101_build/bin/../include/c++/v1/math.h:783:93: error: no member named 'asinf' in the global namespace; did you mean 'asin'?
inline _LIBCPP_INLINE_VISIBILITY float       asin(float __lcpp_x) _NOEXCEPT       {return ::asinf(__lcpp_x);}
                                                                                          ~~^
/Users/buildslave/jenkins/workspace/lldb-cmake-matrix/clang_1101_build/bin/../include/c++/v1/math.h:783:46: note: 'asin' declared here
inline _LIBCPP_INLINE_VISIBILITY float       asin(float __lcpp_x) _NOEXCEPT       {return ::asinf(__lcpp_x);}
                                             ^
/Users/buildslave/jenkins/workspace/lldb-cmake-matrix/clang_1101_build/bin/../include/c++/v1/math.h:784:93: error: no member named 'asinl' in the global namespace; did you mean 'asin'?
inline _LIBCPP_INLINE_VISIBILITY long double asin(long double __lcpp_x) _NOEXCEPT {return ::asinl(__lcpp_x);}
                                                                                          ~~^
/Users/buildslave/jenkins/workspace/lldb-cmake-matrix/clang_1101_build/bin/../include/c++/v1/math.h:783:46: note: 'asin' declared here
inline _LIBCPP_INLINE_VISIBILITY float       asin(float __lcpp_x) _NOEXCEPT       {return ::asinf(__lcpp_x);}
                                             ^
/Users/buildslave/jenkins/workspace/lldb-cmake-matrix/clang_1101_build/bin/../include/c++/v1/math.h:790:38: error: call to 'asin' is ambiguous
asin(_A1 __lcpp_x) _NOEXCEPT {return ::asin((double)__lcpp_x);}
                                     ^~~~~~
/Users/buildslave/jenkins/workspace/lldb-cmake-matrix/clang_1101_build/bin/../include/c++/v1/math.h:783:46: note: candidate function
inline _LIBCPP_INLINE_VISIBILITY float       asin(float __lcpp_x) _NOEXCEPT       {return ::asinf(__lcpp_x);}
                                             ^
/Users/buildslave/jenkins/workspace/lldb-cmake-matrix/clang_1101_build/bin/../include/c++/v1/math.h:784:46: note: candidate function
inline _LIBCPP_INLINE_VISIBILITY long double asin(long double __lcpp_x) _NOEXCEPT {return ::asinl(__lcpp_x);}
                                             ^
/Users/buildslave/jenkins/workspace/lldb-cmake-matrix/clang_1101_build/bin/../include/c++/v1/math.h:795:93: error: no member named 'atanf' in the global namespace; did you mean 'atan'?
inline _LIBCPP_INLINE_VISIBILITY float       atan(float __lcpp_x) _NOEXCEPT       {return ::atanf(__lcpp_x);}
                                                                                          ~~^
/Users/buildslave/jenkins/workspace/lldb-cmake-matrix/clang_1101_build/bin/../include/c++/v1/math.h:795:46: note: 'atan' declared here
inline _LIBCPP_INLINE_VISIBILITY float       atan(float __lcpp_x) _NOEXCEPT       {return ::atanf(__lcpp_x);}
                                             ^
/Users/buildslave/jenkins/workspace/lldb-cmake-matrix/clang_1101_build/bin/../include/c++/v1/math.h:796:93: error: no member named 'atanl' in the global namespace; did you mean 'atan'?
inline _LIBCPP_INLINE_VISIBILITY long double atan(long double __lcpp_x) _NOEXCEPT {return ::atanl(__lcpp_x);}
                                                                                          ~~^
/Users/buildslave/jenkins/workspace/lldb-cmake-matrix/clang_1101_build/bin/../include/c++/v1/math.h:795:46: note: 'atan' declared here
inline _LIBCPP_INLINE_VISIBILITY float       atan(float __lcpp_x) _NOEXCEPT       {return ::atanf(__lcpp_x);}
                                             ^
/Users/buildslave/jenkins/workspace/lldb-cmake-matrix/clang_1101_build/bin/../include/c++/v1/math.h:802:38: error: call to 'atan' is ambiguous
atan(_A1 __lcpp_x) _NOEXCEPT {return ::atan((double)__lcpp_x);}
                                     ^~~~~~
/Users/buildslave/jenkins/workspace/lldb-cmake-matrix/clang_1101_build/bin/../include/c++/v1/math.h:795:46: note: candidate function
inline _LIBCPP_INLINE_VISIBILITY float       atan(float __lcpp_x) _NOEXCEPT       {return ::atanf(__lcpp_x);}
                                             ^
/Users/buildslave/jenkins/workspace/lldb-cmake-matrix/clang_1101_build/bin/../include/c++/v1/math.h:796:46: note: candidate function
inline _LIBCPP_INLINE_VISIBILITY long double atan(long double __lcpp_x) _NOEXCEPT {return ::atanl(__lcpp_x);}
                                             ^
/Users/buildslave/jenkins/workspace/lldb-cmake-matrix/clang_1101_build/bin/../include/c++/v1/math.h:807:116: error: no member named 'atan2f' in the global namespace; did you mean 'atan2'?
inline _LIBCPP_INLINE_VISIBILITY float       atan2(float __lcpp_y, float __lcpp_x) _NOEXCEPT             {return ::atan2f(__lcpp_y, __lcpp_x);}
                                                                                                                 ~~^
/Users/buildslave/jenkins/workspace/lldb-cmake-matrix/clang_1101_build/bin/../include/c++/v1/math.h:807:46: note: 'atan2' declared here
inline _LIBCPP_INLINE_VISIBILITY float       atan2(float __lcpp_y, float __lcpp_x) _NOEXCEPT             {return ::atan2f(__lcpp_y, __lcpp_x);}
                                             ^
/Users/buildslave/jenkins/workspace/lldb-cmake-matrix/clang_1101_build/bin/../include/c++/v1/math.h:808:116: error: no member named 'atan2l' in the global namespace; did you mean 'atan2'?
inline _LIBCPP_INLINE_VISIBILITY long double atan2(long double __lcpp_y, long double __lcpp_x) _NOEXCEPT {return ::atan2l(__lcpp_y, __lcpp_x);}
                                                                                                                 ~~^
/Users/buildslave/jenkins/workspace/lldb-cmake-matrix/clang_1101_build/bin/../include/c++/v1/math.h:807:46: note: 'atan2' declared here
inline _LIBCPP_INLINE_VISIBILITY float       atan2(float __lcpp_y, float __lcpp_x) _NOEXCEPT             {return ::atan2f(__lcpp_y, __lcpp_x);}
                                             ^
/Users/buildslave/jenkins/workspace/lldb-cmake-matrix/clang_1101_build/bin/../include/c++/v1/math.h:830:93: error: no member named 'ceilf' in the global namespace; did you mean 'ceil'?
inline _LIBCPP_INLINE_VISIBILITY float       ceil(float __lcpp_x) _NOEXCEPT       {return ::ceilf(__lcpp_x);}
                                                                                          ~~^
/Users/buildslave/jenkins/workspace/lldb-cmake-matrix/clang_1101_build/bin/../include/c++/v1/math.h:830:46: note: 'ceil' declared here
inline _LIBCPP_INLINE_VISIBILITY float       ceil(float __lcpp_x) _NOEXCEPT       {return ::ceilf(__lcpp_x);}
                                             ^
/Users/buildslave/jenkins/workspace/lldb-cmake-matrix/clang_1101_build/bin/../include/c++/v1/math.h:831:93: error: no member named 'ceill' in the global namespace; did you mean 'ceil'?
inline _LIBCPP_INLINE_VISIBILITY long double ceil(long double __lcpp_x) _NOEXCEPT {return ::ceill(__lcpp_x);}
                                                                                          ~~^
/Users/buildslave/jenkins/workspace/lldb-cmake-matrix/clang_1101_build/bin/../include/c++/v1/math.h:830:46: note: 'ceil' declared here
inline _LIBCPP_INLINE_VISIBILITY float       ceil(float __lcpp_x) _NOEXCEPT       {return ::ceilf(__lcpp_x);}
                                             ^
/Users/buildslave/jenkins/workspace/lldb-cmake-matrix/clang_1101_build/bin/../include/c++/v1/math.h:837:38: error: call to 'ceil' is ambiguous
ceil(_A1 __lcpp_x) _NOEXCEPT {return ::ceil((double)__lcpp_x);}
                                     ^~~~~~
/Users/buildslave/jenkins/workspace/lldb-cmake-matrix/clang_1101_build/bin/../include/c++/v1/math.h:830:46: note: candidate function
inline _LIBCPP_INLINE_VISIBILITY float       ceil(float __lcpp_x) _NOEXCEPT       {return ::ceilf(__lcpp_x);}
                                             ^
/Users/buildslave/jenkins/workspace/lldb-cmake-matrix/clang_1101_build/bin/../include/c++/v1/math.h:831:46: note: candidate function
inline _LIBCPP_INLINE_VISIBILITY long double ceil(long double __lcpp_x) _NOEXCEPT {return ::ceill(__lcpp_x);}
                                             ^
/Users/buildslave/jenkins/workspace/lldb-cmake-matrix/clang_1101_build/bin/../include/c++/v1/math.h:842:92: error: no member named 'cosf' in the global namespace; did you mean 'cos'?
inline _LIBCPP_INLINE_VISIBILITY float       cos(float __lcpp_x) _NOEXCEPT       {return ::cosf(__lcpp_x);}
                                                                                         ~~^
/Users/buildslave/jenkins/workspace/lldb-cmake-matrix/clang_1101_build/bin/../include/c++/v1/math.h:842:46: note: 'cos' declared here
inline _LIBCPP_INLINE_VISIBILITY float       cos(float __lcpp_x) _NOEXCEPT       {return ::cosf(__lcpp_x);}
                                             ^
fatal error: too many errors emitted, stopping now [-ferror-limit=]
20 errors generated.
make: *** [main.o] Error 1

Test Directory:
/Users/buildslave/jenkins/workspace/lldb-cmake-matrix/llvm-project/lldb/test/API/lang/objcxx/class-name-clash
----------------------------------------------------------------------
Ran 4 tests in 4.776s

RESULT: FAILED (0 passes, 0 failures, 2 errors, 2 skipped, 0 expected failures, 0 unexpected successes)

--