Regression

Test Clang 11.0.1 / lldb-api.macosx/lc-note/multiple-binary-corefile.TestMultipleBinaryCorefile.py (from lldb-api)

Failing for the past 1 build (Since #5040 )
Took 5.8 sec.

Stacktrace

Script:
--
/Applications/Xcode.app/Contents/Developer/Library/Frameworks/Python3.framework/Versions/3.8/bin/python3.8 /Users/buildslave/jenkins/workspace/lldb-cmake-matrix/llvm-project/lldb/test/API/dotest.py -u CXXFLAGS -u CFLAGS --codesign-identity lldb_codesign --arch x86_64 --build-dir /Users/buildslave/jenkins/workspace/lldb-cmake-matrix/lldb-build/lldb-test-build.noindex -t --env TERM=vt100 --skip-category gmodules --skip-category watchpoint --skip-category llgs --skip-category debugserver --arch=x86_64 --env LLVM_LIBS_DIR=/Users/buildslave/jenkins/workspace/lldb-cmake-matrix/lldb-build/./lib --env LLVM_INCLUDE_DIR=/Users/buildslave/jenkins/workspace/lldb-cmake-matrix/lldb-build/include --env LLVM_TOOLS_DIR=/Users/buildslave/jenkins/workspace/lldb-cmake-matrix/lldb-build/./bin --hermetic-libcxx --arch x86_64 --build-dir /Users/buildslave/jenkins/workspace/lldb-cmake-matrix/lldb-build/lldb-test-build.noindex --lldb-module-cache-dir /Users/buildslave/jenkins/workspace/lldb-cmake-matrix/lldb-build/lldb-test-build.noindex/module-cache-lldb/lldb-api --clang-module-cache-dir /Users/buildslave/jenkins/workspace/lldb-cmake-matrix/lldb-build/lldb-test-build.noindex/module-cache-clang/lldb-api --executable /Users/buildslave/jenkins/workspace/lldb-cmake-matrix/lldb-build/./bin/lldb --compiler /Users/buildslave/jenkins/workspace/lldb-cmake-matrix/clang_1101_build/bin/clang --dsymutil /Users/buildslave/jenkins/workspace/lldb-cmake-matrix/lldb-build/./bin/dsymutil --llvm-tools-dir /Users/buildslave/jenkins/workspace/lldb-cmake-matrix/lldb-build/./bin --lldb-libs-dir /Users/buildslave/jenkins/workspace/lldb-cmake-matrix/lldb-build/./lib /Users/buildslave/jenkins/workspace/lldb-cmake-matrix/llvm-project/lldb/test/API/macosx/lc-note/multiple-binary-corefile -p TestMultipleBinaryCorefile.py
--
Exit Code: 1

Command Output (stdout):
--
lldb version 16.0.99git (http://labmaster3.local/git/llvm-project.git revision d1f36da9e03baeccb2f4dd8095f8aaf5b4547c68)
  clang revision d1f36da9e03baeccb2f4dd8095f8aaf5b4547c68
  llvm revision d1f36da9e03baeccb2f4dd8095f8aaf5b4547c68
Skipping the following test categories: ['gmodules', 'watchpoint', 'llgs', 'debugserver', 'libstdcxx', 'dwo', 'llgs', 'fork']

--
Command Output (stderr):
--
Change dir to: /Users/buildslave/jenkins/workspace/lldb-cmake-matrix/llvm-project/lldb/test/API/macosx/lc-note/multiple-binary-corefile
runCmd: settings clear -all
output: 

runCmd: settings set symbols.enable-external-lookup false
output: 

runCmd: settings set target.inherit-tcc true
output: 

runCmd: settings set target.detach-on-error false
output: 

runCmd: settings set target.auto-apply-fixits false
output: 

runCmd: settings set plugin.process.gdb-remote.packet-timeout 60
output: 

runCmd: settings set symbols.clang-modules-cache-path "/Users/buildslave/jenkins/workspace/lldb-cmake-matrix/lldb-build/lldb-test-build.noindex/module-cache-lldb/lldb-api"
output: 

runCmd: settings set use-color false
output: 

runCmd: setting set target.prefer-dynamic-value no-dynamic-values
output: 

make VPATH=/Users/buildslave/jenkins/workspace/lldb-cmake-matrix/llvm-project/lldb/test/API/macosx/lc-note/multiple-binary-corefile -C /Users/buildslave/jenkins/workspace/lldb-cmake-matrix/lldb-build/lldb-test-build.noindex/macosx/lc-note/multiple-binary-corefile/TestMultipleBinaryCorefile.test_corefile_binaries_dsymforuuid -I /Users/buildslave/jenkins/workspace/lldb-cmake-matrix/llvm-project/lldb/test/API/macosx/lc-note/multiple-binary-corefile -I /Users/buildslave/jenkins/workspace/lldb-cmake-matrix/llvm-project/lldb/packages/Python/lldbsuite/test/make -f /Users/buildslave/jenkins/workspace/lldb-cmake-matrix/llvm-project/lldb/test/API/macosx/lc-note/multiple-binary-corefile/Makefile all ARCH=x86_64 'CC="/Users/buildslave/jenkins/workspace/lldb-cmake-matrix/clang_1101_build/bin/clang"' DSYMUTIL=/Users/buildslave/jenkins/workspace/lldb-cmake-matrix/lldb-build/./bin/dsymutil CODESIGN=codesign CLANG_MODULE_CACHE_DIR=/Users/buildslave/jenkins/workspace/lldb-cmake-matrix/lldb-build/lldb-test-build.noindex/module-cache-clang/lldb-api USE_HERMETIC_LIBCPP=1

FAIL: LLDB (/Users/buildslave/jenkins/workspace/lldb-cmake-matrix/clang_1101_build/bin/clang-x86_64) :: test_corefile_binaries_dsymforuuid (TestMultipleBinaryCorefile.TestMultipleBinaryCorefile)
runCmd: settings clear -all
output: 

runCmd: settings set symbols.enable-external-lookup false
output: 

runCmd: settings set target.inherit-tcc true
output: 

runCmd: settings set target.detach-on-error false
output: 

runCmd: settings set target.auto-apply-fixits false
output: 

runCmd: settings set plugin.process.gdb-remote.packet-timeout 60
output: 

runCmd: settings set symbols.clang-modules-cache-path "/Users/buildslave/jenkins/workspace/lldb-cmake-matrix/lldb-build/lldb-test-build.noindex/module-cache-lldb/lldb-api"
output: 

runCmd: settings set use-color false
output: 

runCmd: setting set target.prefer-dynamic-value no-dynamic-values
output: 

make VPATH=/Users/buildslave/jenkins/workspace/lldb-cmake-matrix/llvm-project/lldb/test/API/macosx/lc-note/multiple-binary-corefile -C /Users/buildslave/jenkins/workspace/lldb-cmake-matrix/lldb-build/lldb-test-build.noindex/macosx/lc-note/multiple-binary-corefile/TestMultipleBinaryCorefile.test_corefile_binaries_preloaded -I /Users/buildslave/jenkins/workspace/lldb-cmake-matrix/llvm-project/lldb/test/API/macosx/lc-note/multiple-binary-corefile -I /Users/buildslave/jenkins/workspace/lldb-cmake-matrix/llvm-project/lldb/packages/Python/lldbsuite/test/make -f /Users/buildslave/jenkins/workspace/lldb-cmake-matrix/llvm-project/lldb/test/API/macosx/lc-note/multiple-binary-corefile/Makefile all ARCH=x86_64 'CC="/Users/buildslave/jenkins/workspace/lldb-cmake-matrix/clang_1101_build/bin/clang"' DSYMUTIL=/Users/buildslave/jenkins/workspace/lldb-cmake-matrix/lldb-build/./bin/dsymutil CODESIGN=codesign CLANG_MODULE_CACHE_DIR=/Users/buildslave/jenkins/workspace/lldb-cmake-matrix/lldb-build/lldb-test-build.noindex/module-cache-clang/lldb-api USE_HERMETIC_LIBCPP=1

FAIL: LLDB (/Users/buildslave/jenkins/workspace/lldb-cmake-matrix/clang_1101_build/bin/clang-x86_64) :: test_corefile_binaries_preloaded (TestMultipleBinaryCorefile.TestMultipleBinaryCorefile)
Restore dir to: /Users/buildslave/jenkins/workspace/lldb-cmake-matrix/lldb-build/tools/lldb/test
======================================================================
ERROR: test_corefile_binaries_dsymforuuid (TestMultipleBinaryCorefile.TestMultipleBinaryCorefile)
----------------------------------------------------------------------
Error when building test subject.

Build Command:
make VPATH=/Users/buildslave/jenkins/workspace/lldb-cmake-matrix/llvm-project/lldb/test/API/macosx/lc-note/multiple-binary-corefile -C /Users/buildslave/jenkins/workspace/lldb-cmake-matrix/lldb-build/lldb-test-build.noindex/macosx/lc-note/multiple-binary-corefile/TestMultipleBinaryCorefile.test_corefile_binaries_dsymforuuid -I /Users/buildslave/jenkins/workspace/lldb-cmake-matrix/llvm-project/lldb/test/API/macosx/lc-note/multiple-binary-corefile -I /Users/buildslave/jenkins/workspace/lldb-cmake-matrix/llvm-project/lldb/packages/Python/lldbsuite/test/make -f /Users/buildslave/jenkins/workspace/lldb-cmake-matrix/llvm-project/lldb/test/API/macosx/lc-note/multiple-binary-corefile/Makefile all ARCH=x86_64 'CC="/Users/buildslave/jenkins/workspace/lldb-cmake-matrix/clang_1101_build/bin/clang"' DSYMUTIL=/Users/buildslave/jenkins/workspace/lldb-cmake-matrix/lldb-build/./bin/dsymutil CODESIGN=codesign CLANG_MODULE_CACHE_DIR=/Users/buildslave/jenkins/workspace/lldb-cmake-matrix/lldb-build/lldb-test-build.noindex/module-cache-clang/lldb-api USE_HERMETIC_LIBCPP=1

Build Command Output:
/Applications/Xcode.app/Contents/Developer/usr/bin/make -f /Users/buildslave/jenkins/workspace/lldb-cmake-matrix/llvm-project/lldb/packages/Python/lldbsuite/test/make/Makefile.rules \
		DYLIB_ONLY=YES DYLIB_NAME=one DYLIB_C_SOURCES=one.c
"/Users/buildslave/jenkins/workspace/lldb-cmake-matrix/clang_1101_build/bin/clang" -g -O0 -isysroot "/Applications/Xcode.app/Contents/Developer/Platforms/MacOSX.platform/Developer/SDKs/MacOSX11.1.sdk" -arch x86_64  -I/Users/buildslave/jenkins/workspace/lldb-cmake-matrix/llvm-project/lldb/packages/Python/lldbsuite/test/make/../../../../../include -I/Users/buildslave/jenkins/workspace/lldb-cmake-matrix/llvm-project/lldb/packages/Python/lldbsuite/test/make -I/Users/buildslave/jenkins/workspace/lldb-cmake-matrix/llvm-project/lldb/packages/Python/lldbsuite/test/make -include /Users/buildslave/jenkins/workspace/lldb-cmake-matrix/llvm-project/lldb/packages/Python/lldbsuite/test/make/test_common.h  -fno-limit-debug-info   -DCOMPILING_LLDB_TEST_DLL -fPIC -MT one.o -MD -MP -MF one.d -c -o one.o /Users/buildslave/jenkins/workspace/lldb-cmake-matrix/llvm-project/lldb/test/API/macosx/lc-note/multiple-binary-corefile/one.c
"/Users/buildslave/jenkins/workspace/lldb-cmake-matrix/clang_1101_build/bin/clang" one.o  -g -O0 -isysroot "/Applications/Xcode.app/Contents/Developer/Platforms/MacOSX.platform/Developer/SDKs/MacOSX11.1.sdk" -arch x86_64  -I/Users/buildslave/jenkins/workspace/lldb-cmake-matrix/llvm-project/lldb/packages/Python/lldbsuite/test/make/../../../../../include -I/Users/buildslave/jenkins/workspace/lldb-cmake-matrix/llvm-project/lldb/packages/Python/lldbsuite/test/make -I/Users/buildslave/jenkins/workspace/lldb-cmake-matrix/llvm-project/lldb/packages/Python/lldbsuite/test/make -include /Users/buildslave/jenkins/workspace/lldb-cmake-matrix/llvm-project/lldb/packages/Python/lldbsuite/test/make/test_common.h  -fno-limit-debug-info     --driver-mode=g++ -install_name "@executable_path/libone.dylib" -dynamiclib -o "libone.dylib"
codesign -s - "libone.dylib"
"/Users/buildslave/jenkins/workspace/lldb-cmake-matrix/lldb-build/./bin/dsymutil"  "libone.dylib"
/Applications/Xcode.app/Contents/Developer/usr/bin/make -f /Users/buildslave/jenkins/workspace/lldb-cmake-matrix/llvm-project/lldb/packages/Python/lldbsuite/test/make/Makefile.rules \
		DYLIB_ONLY=YES DYLIB_NAME=two DYLIB_C_SOURCES=two.c
"/Users/buildslave/jenkins/workspace/lldb-cmake-matrix/clang_1101_build/bin/clang" -g -O0 -isysroot "/Applications/Xcode.app/Contents/Developer/Platforms/MacOSX.platform/Developer/SDKs/MacOSX11.1.sdk" -arch x86_64  -I/Users/buildslave/jenkins/workspace/lldb-cmake-matrix/llvm-project/lldb/packages/Python/lldbsuite/test/make/../../../../../include -I/Users/buildslave/jenkins/workspace/lldb-cmake-matrix/llvm-project/lldb/packages/Python/lldbsuite/test/make -I/Users/buildslave/jenkins/workspace/lldb-cmake-matrix/llvm-project/lldb/packages/Python/lldbsuite/test/make -include /Users/buildslave/jenkins/workspace/lldb-cmake-matrix/llvm-project/lldb/packages/Python/lldbsuite/test/make/test_common.h  -fno-limit-debug-info   -DCOMPILING_LLDB_TEST_DLL -fPIC -MT two.o -MD -MP -MF two.d -c -o two.o /Users/buildslave/jenkins/workspace/lldb-cmake-matrix/llvm-project/lldb/test/API/macosx/lc-note/multiple-binary-corefile/two.c
"/Users/buildslave/jenkins/workspace/lldb-cmake-matrix/clang_1101_build/bin/clang" two.o  -g -O0 -isysroot "/Applications/Xcode.app/Contents/Developer/Platforms/MacOSX.platform/Developer/SDKs/MacOSX11.1.sdk" -arch x86_64  -I/Users/buildslave/jenkins/workspace/lldb-cmake-matrix/llvm-project/lldb/packages/Python/lldbsuite/test/make/../../../../../include -I/Users/buildslave/jenkins/workspace/lldb-cmake-matrix/llvm-project/lldb/packages/Python/lldbsuite/test/make -I/Users/buildslave/jenkins/workspace/lldb-cmake-matrix/llvm-project/lldb/packages/Python/lldbsuite/test/make -include /Users/buildslave/jenkins/workspace/lldb-cmake-matrix/llvm-project/lldb/packages/Python/lldbsuite/test/make/test_common.h  -fno-limit-debug-info     --driver-mode=g++ -install_name "@executable_path/libtwo.dylib" -dynamiclib -o "libtwo.dylib"
codesign -s - "libtwo.dylib"
"/Users/buildslave/jenkins/workspace/lldb-cmake-matrix/lldb-build/./bin/dsymutil"  "libtwo.dylib"
"/Users/buildslave/jenkins/workspace/lldb-cmake-matrix/clang_1101_build/bin/clang" -g -O0 -isysroot "/Applications/Xcode.app/Contents/Developer/Platforms/MacOSX.platform/Developer/SDKs/MacOSX11.1.sdk" -arch x86_64  -I/Users/buildslave/jenkins/workspace/lldb-cmake-matrix/llvm-project/lldb/packages/Python/lldbsuite/test/make/../../../../../include -I/Users/buildslave/jenkins/workspace/lldb-cmake-matrix/llvm-project/lldb/test/API/macosx/lc-note/multiple-binary-corefile -I/Users/buildslave/jenkins/workspace/lldb-cmake-matrix/llvm-project/lldb/packages/Python/lldbsuite/test/make -include /Users/buildslave/jenkins/workspace/lldb-cmake-matrix/llvm-project/lldb/packages/Python/lldbsuite/test/make/test_common.h  -fno-limit-debug-info   -MT main.o -MD -MP -MF main.d -c -o main.o /Users/buildslave/jenkins/workspace/lldb-cmake-matrix/llvm-project/lldb/test/API/macosx/lc-note/multiple-binary-corefile/main.c
"/Users/buildslave/jenkins/workspace/lldb-cmake-matrix/clang_1101_build/bin/clang"  main.o -g -O0 -isysroot "/Applications/Xcode.app/Contents/Developer/Platforms/MacOSX.platform/Developer/SDKs/MacOSX11.1.sdk" -arch x86_64  -I/Users/buildslave/jenkins/workspace/lldb-cmake-matrix/llvm-project/lldb/packages/Python/lldbsuite/test/make/../../../../../include -I/Users/buildslave/jenkins/workspace/lldb-cmake-matrix/llvm-project/lldb/test/API/macosx/lc-note/multiple-binary-corefile -I/Users/buildslave/jenkins/workspace/lldb-cmake-matrix/llvm-project/lldb/packages/Python/lldbsuite/test/make -include /Users/buildslave/jenkins/workspace/lldb-cmake-matrix/llvm-project/lldb/packages/Python/lldbsuite/test/make/test_common.h  -fno-limit-debug-info   -L. -lone -ltwo  --driver-mode=g++ -o "a.out"
codesign -s - "a.out"
"/Applications/Xcode.app/Contents/Developer/usr/bin/make" -f "/Users/buildslave/jenkins/workspace/lldb-cmake-matrix/llvm-project/lldb/packages/Python/lldbsuite/test/make/Makefile.rules" EXE=create-multibin-corefile \
		CXX_SOURCES=create-multibin-corefile.cpp
"/Users/buildslave/jenkins/workspace/lldb-cmake-matrix/clang_1101_build/bin/clang"  -std=c++11 -g -O0 -isysroot "/Applications/Xcode.app/Contents/Developer/Platforms/MacOSX.platform/Developer/SDKs/MacOSX11.1.sdk" -arch x86_64  -I/Users/buildslave/jenkins/workspace/lldb-cmake-matrix/llvm-project/lldb/packages/Python/lldbsuite/test/make/../../../../../include -I/Users/buildslave/jenkins/workspace/lldb-cmake-matrix/llvm-project/lldb/packages/Python/lldbsuite/test/make -I/Users/buildslave/jenkins/workspace/lldb-cmake-matrix/llvm-project/lldb/packages/Python/lldbsuite/test/make -include /Users/buildslave/jenkins/workspace/lldb-cmake-matrix/llvm-project/lldb/packages/Python/lldbsuite/test/make/test_common.h  -fno-limit-debug-info     --driver-mode=g++ -MT create-multibin-corefile.o -MD -MP -MF create-multibin-corefile.d -c -o create-multibin-corefile.o /Users/buildslave/jenkins/workspace/lldb-cmake-matrix/llvm-project/lldb/test/API/macosx/lc-note/multiple-binary-corefile/create-multibin-corefile.cpp
In file included from /Users/buildslave/jenkins/workspace/lldb-cmake-matrix/llvm-project/lldb/test/API/macosx/lc-note/multiple-binary-corefile/create-multibin-corefile.cpp:4:
In file included from /Applications/Xcode.app/Contents/Developer/Platforms/MacOSX.platform/Developer/SDKs/MacOSX11.1.sdk/usr/include/mach-o/loader.h:35:
In file included from /Applications/Xcode.app/Contents/Developer/Platforms/MacOSX.platform/Developer/SDKs/MacOSX11.1.sdk/usr/include/mach/machine.h:67:
In file included from /Applications/Xcode.app/Contents/Developer/Platforms/MacOSX.platform/Developer/SDKs/MacOSX11.1.sdk/usr/include/mach/machine/vm_types.h:33:
/Applications/Xcode.app/Contents/Developer/Platforms/MacOSX.platform/Developer/SDKs/MacOSX11.1.sdk/usr/include/mach/i386/vm_types.h:123:9: error: unknown type name 'uint64_t'
typedef uint64_t                mach_vm_address_t;
        ^
/Applications/Xcode.app/Contents/Developer/Platforms/MacOSX.platform/Developer/SDKs/MacOSX11.1.sdk/usr/include/mach/i386/vm_types.h:124:9: error: unknown type name 'uint64_t'
typedef uint64_t                mach_vm_offset_t;
        ^
/Applications/Xcode.app/Contents/Developer/Platforms/MacOSX.platform/Developer/SDKs/MacOSX11.1.sdk/usr/include/mach/i386/vm_types.h:125:9: error: unknown type name 'uint64_t'
typedef uint64_t                mach_vm_size_t;
        ^
/Applications/Xcode.app/Contents/Developer/Platforms/MacOSX.platform/Developer/SDKs/MacOSX11.1.sdk/usr/include/mach/i386/vm_types.h:127:9: error: unknown type name 'uint64_t'
typedef uint64_t                vm_map_offset_t;
        ^
/Applications/Xcode.app/Contents/Developer/Platforms/MacOSX.platform/Developer/SDKs/MacOSX11.1.sdk/usr/include/mach/i386/vm_types.h:128:9: error: unknown type name 'uint64_t'
typedef uint64_t                vm_map_address_t;
        ^
/Applications/Xcode.app/Contents/Developer/Platforms/MacOSX.platform/Developer/SDKs/MacOSX11.1.sdk/usr/include/mach/i386/vm_types.h:129:9: error: unknown type name 'uint64_t'
typedef uint64_t                vm_map_size_t;
        ^
In file included from /Users/buildslave/jenkins/workspace/lldb-cmake-matrix/llvm-project/lldb/test/API/macosx/lc-note/multiple-binary-corefile/create-multibin-corefile.cpp:4:
In file included from /Applications/Xcode.app/Contents/Developer/Platforms/MacOSX.platform/Developer/SDKs/MacOSX11.1.sdk/usr/include/mach-o/loader.h:47:
In file included from /Applications/Xcode.app/Contents/Developer/Platforms/MacOSX.platform/Developer/SDKs/MacOSX11.1.sdk/usr/include/mach/machine/thread_status.h:33:
In file included from /Applications/Xcode.app/Contents/Developer/Platforms/MacOSX.platform/Developer/SDKs/MacOSX11.1.sdk/usr/include/mach/i386/thread_status.h:71:
In file included from /Applications/Xcode.app/Contents/Developer/Platforms/MacOSX.platform/Developer/SDKs/MacOSX11.1.sdk/usr/include/mach/message.h:75:
/Applications/Xcode.app/Contents/Developer/Platforms/MacOSX.platform/Developer/SDKs/MacOSX11.1.sdk/usr/include/mach/port.h:293:2: error: unknown type name 'uint32_t'
        uint32_t                reserved[6];
        ^
/Applications/Xcode.app/Contents/Developer/Platforms/MacOSX.platform/Developer/SDKs/MacOSX11.1.sdk/usr/include/mach/port.h:350:2: error: unknown type name 'uint32_t'
        uint32_t                flags;          /* Flags defining attributes for port */
        ^
/Applications/Xcode.app/Contents/Developer/Platforms/MacOSX.platform/Developer/SDKs/MacOSX11.1.sdk/usr/include/mach/port.h:353:3: error: unknown type name 'uint64_t'
                uint64_t                reserved[2];           /* Reserved */
                ^
In file included from /Users/buildslave/jenkins/workspace/lldb-cmake-matrix/llvm-project/lldb/test/API/macosx/lc-note/multiple-binary-corefile/create-multibin-corefile.cpp:4:
In file included from /Applications/Xcode.app/Contents/Developer/Platforms/MacOSX.platform/Developer/SDKs/MacOSX11.1.sdk/usr/include/mach-o/loader.h:47:
In file included from /Applications/Xcode.app/Contents/Developer/Platforms/MacOSX.platform/Developer/SDKs/MacOSX11.1.sdk/usr/include/mach/machine/thread_status.h:33:
In file included from /Applications/Xcode.app/Contents/Developer/Platforms/MacOSX.platform/Developer/SDKs/MacOSX11.1.sdk/usr/include/mach/i386/thread_status.h:71:
/Applications/Xcode.app/Contents/Developer/Platforms/MacOSX.platform/Developer/SDKs/MacOSX11.1.sdk/usr/include/mach/message.h:300:2: error: unknown type name 'uint32_t'
        uint32_t                      address;
        ^
/Applications/Xcode.app/Contents/Developer/Platforms/MacOSX.platform/Developer/SDKs/MacOSX11.1.sdk/usr/include/mach/message.h:309:2: error: unknown type name 'uint64_t'
        uint64_t                      address;
        ^
/Applications/Xcode.app/Contents/Developer/Platforms/MacOSX.platform/Developer/SDKs/MacOSX11.1.sdk/usr/include/mach/message.h:332:2: error: unknown type name 'uint32_t'
        uint32_t                      address;
        ^
/Applications/Xcode.app/Contents/Developer/Platforms/MacOSX.platform/Developer/SDKs/MacOSX11.1.sdk/usr/include/mach/message.h:341:2: error: unknown type name 'uint64_t'
        uint64_t                      address;
        ^
/Applications/Xcode.app/Contents/Developer/Platforms/MacOSX.platform/Developer/SDKs/MacOSX11.1.sdk/usr/include/mach/message.h:364:2: error: unknown type name 'uint32_t'
        uint32_t                      context;
        ^
/Applications/Xcode.app/Contents/Developer/Platforms/MacOSX.platform/Developer/SDKs/MacOSX11.1.sdk/usr/include/mach/message.h:372:2: error: unknown type name 'uint64_t'
        uint64_t                      context;
        ^
In file included from /Users/buildslave/jenkins/workspace/lldb-cmake-matrix/llvm-project/lldb/test/API/macosx/lc-note/multiple-binary-corefile/create-multibin-corefile.cpp:4:
In file included from /Applications/Xcode.app/Contents/Developer/Platforms/MacOSX.platform/Developer/SDKs/MacOSX11.1.sdk/usr/include/mach-o/loader.h:47:
In file included from /Applications/Xcode.app/Contents/Developer/Platforms/MacOSX.platform/Developer/SDKs/MacOSX11.1.sdk/usr/include/mach/machine/thread_status.h:33:
/Applications/Xcode.app/Contents/Developer/Platforms/MacOSX.platform/Developer/SDKs/MacOSX11.1.sdk/usr/include/mach/i386/thread_status.h:165:2: error: unknown type name 'uint32_t'
        uint32_t        flavor;
        ^
/Applications/Xcode.app/Contents/Developer/Platforms/MacOSX.platform/Developer/SDKs/MacOSX11.1.sdk/usr/include/mach/i386/thread_status.h:166:2: error: unknown type name 'uint32_t'
        uint32_t        count;
        ^
In file included from /Users/buildslave/jenkins/workspace/lldb-cmake-matrix/llvm-project/lldb/test/API/macosx/lc-note/multiple-binary-corefile/create-multibin-corefile.cpp:4:
In file included from /Applications/Xcode.app/Contents/Developer/Platforms/MacOSX.platform/Developer/SDKs/MacOSX11.1.sdk/usr/include/mach-o/loader.h:48:
In file included from /Applications/Xcode.app/Contents/Developer/Platforms/MacOSX.platform/Developer/SDKs/MacOSX11.1.sdk/usr/include/architecture/byte_order.h:38:
In file included from /Applications/Xcode.app/Contents/Developer/Platforms/MacOSX.platform/Developer/SDKs/MacOSX11.1.sdk/usr/include/libkern/OSByteOrder.h:53:
/Applications/Xcode.app/Contents/Developer/Platforms/MacOSX.platform/Developer/SDKs/MacOSX11.1.sdk/usr/include/libkern/i386/OSByteOrder.h:39:1: error: unknown type name 'uint16_t'
uint16_t
^
/Applications/Xcode.app/Contents/Developer/Platforms/MacOSX.platform/Developer/SDKs/MacOSX11.1.sdk/usr/include/libkern/i386/OSByteOrder.h:45:2: error: unknown type name 'uint16_t'
        uint16_t result;
        ^
fatal error: too many errors emitted, stopping now [-ferror-limit=]
20 errors generated.
make[1]: *** [create-multibin-corefile.o] Error 1
make: *** [create-empty-corefile] Error 2

Test Directory:
/Users/buildslave/jenkins/workspace/lldb-cmake-matrix/llvm-project/lldb/test/API/macosx/lc-note/multiple-binary-corefile
======================================================================
ERROR: test_corefile_binaries_preloaded (TestMultipleBinaryCorefile.TestMultipleBinaryCorefile)
----------------------------------------------------------------------
Error when building test subject.

Build Command:
make VPATH=/Users/buildslave/jenkins/workspace/lldb-cmake-matrix/llvm-project/lldb/test/API/macosx/lc-note/multiple-binary-corefile -C /Users/buildslave/jenkins/workspace/lldb-cmake-matrix/lldb-build/lldb-test-build.noindex/macosx/lc-note/multiple-binary-corefile/TestMultipleBinaryCorefile.test_corefile_binaries_preloaded -I /Users/buildslave/jenkins/workspace/lldb-cmake-matrix/llvm-project/lldb/test/API/macosx/lc-note/multiple-binary-corefile -I /Users/buildslave/jenkins/workspace/lldb-cmake-matrix/llvm-project/lldb/packages/Python/lldbsuite/test/make -f /Users/buildslave/jenkins/workspace/lldb-cmake-matrix/llvm-project/lldb/test/API/macosx/lc-note/multiple-binary-corefile/Makefile all ARCH=x86_64 'CC="/Users/buildslave/jenkins/workspace/lldb-cmake-matrix/clang_1101_build/bin/clang"' DSYMUTIL=/Users/buildslave/jenkins/workspace/lldb-cmake-matrix/lldb-build/./bin/dsymutil CODESIGN=codesign CLANG_MODULE_CACHE_DIR=/Users/buildslave/jenkins/workspace/lldb-cmake-matrix/lldb-build/lldb-test-build.noindex/module-cache-clang/lldb-api USE_HERMETIC_LIBCPP=1

Build Command Output:
/Applications/Xcode.app/Contents/Developer/usr/bin/make -f /Users/buildslave/jenkins/workspace/lldb-cmake-matrix/llvm-project/lldb/packages/Python/lldbsuite/test/make/Makefile.rules \
		DYLIB_ONLY=YES DYLIB_NAME=one DYLIB_C_SOURCES=one.c
"/Users/buildslave/jenkins/workspace/lldb-cmake-matrix/clang_1101_build/bin/clang" -g -O0 -isysroot "/Applications/Xcode.app/Contents/Developer/Platforms/MacOSX.platform/Developer/SDKs/MacOSX11.1.sdk" -arch x86_64  -I/Users/buildslave/jenkins/workspace/lldb-cmake-matrix/llvm-project/lldb/packages/Python/lldbsuite/test/make/../../../../../include -I/Users/buildslave/jenkins/workspace/lldb-cmake-matrix/llvm-project/lldb/packages/Python/lldbsuite/test/make -I/Users/buildslave/jenkins/workspace/lldb-cmake-matrix/llvm-project/lldb/packages/Python/lldbsuite/test/make -include /Users/buildslave/jenkins/workspace/lldb-cmake-matrix/llvm-project/lldb/packages/Python/lldbsuite/test/make/test_common.h  -fno-limit-debug-info   -DCOMPILING_LLDB_TEST_DLL -fPIC -MT one.o -MD -MP -MF one.d -c -o one.o /Users/buildslave/jenkins/workspace/lldb-cmake-matrix/llvm-project/lldb/test/API/macosx/lc-note/multiple-binary-corefile/one.c
"/Users/buildslave/jenkins/workspace/lldb-cmake-matrix/clang_1101_build/bin/clang" one.o  -g -O0 -isysroot "/Applications/Xcode.app/Contents/Developer/Platforms/MacOSX.platform/Developer/SDKs/MacOSX11.1.sdk" -arch x86_64  -I/Users/buildslave/jenkins/workspace/lldb-cmake-matrix/llvm-project/lldb/packages/Python/lldbsuite/test/make/../../../../../include -I/Users/buildslave/jenkins/workspace/lldb-cmake-matrix/llvm-project/lldb/packages/Python/lldbsuite/test/make -I/Users/buildslave/jenkins/workspace/lldb-cmake-matrix/llvm-project/lldb/packages/Python/lldbsuite/test/make -include /Users/buildslave/jenkins/workspace/lldb-cmake-matrix/llvm-project/lldb/packages/Python/lldbsuite/test/make/test_common.h  -fno-limit-debug-info     --driver-mode=g++ -install_name "@executable_path/libone.dylib" -dynamiclib -o "libone.dylib"
codesign -s - "libone.dylib"
"/Users/buildslave/jenkins/workspace/lldb-cmake-matrix/lldb-build/./bin/dsymutil"  "libone.dylib"
/Applications/Xcode.app/Contents/Developer/usr/bin/make -f /Users/buildslave/jenkins/workspace/lldb-cmake-matrix/llvm-project/lldb/packages/Python/lldbsuite/test/make/Makefile.rules \
		DYLIB_ONLY=YES DYLIB_NAME=two DYLIB_C_SOURCES=two.c
"/Users/buildslave/jenkins/workspace/lldb-cmake-matrix/clang_1101_build/bin/clang" -g -O0 -isysroot "/Applications/Xcode.app/Contents/Developer/Platforms/MacOSX.platform/Developer/SDKs/MacOSX11.1.sdk" -arch x86_64  -I/Users/buildslave/jenkins/workspace/lldb-cmake-matrix/llvm-project/lldb/packages/Python/lldbsuite/test/make/../../../../../include -I/Users/buildslave/jenkins/workspace/lldb-cmake-matrix/llvm-project/lldb/packages/Python/lldbsuite/test/make -I/Users/buildslave/jenkins/workspace/lldb-cmake-matrix/llvm-project/lldb/packages/Python/lldbsuite/test/make -include /Users/buildslave/jenkins/workspace/lldb-cmake-matrix/llvm-project/lldb/packages/Python/lldbsuite/test/make/test_common.h  -fno-limit-debug-info   -DCOMPILING_LLDB_TEST_DLL -fPIC -MT two.o -MD -MP -MF two.d -c -o two.o /Users/buildslave/jenkins/workspace/lldb-cmake-matrix/llvm-project/lldb/test/API/macosx/lc-note/multiple-binary-corefile/two.c
"/Users/buildslave/jenkins/workspace/lldb-cmake-matrix/clang_1101_build/bin/clang" two.o  -g -O0 -isysroot "/Applications/Xcode.app/Contents/Developer/Platforms/MacOSX.platform/Developer/SDKs/MacOSX11.1.sdk" -arch x86_64  -I/Users/buildslave/jenkins/workspace/lldb-cmake-matrix/llvm-project/lldb/packages/Python/lldbsuite/test/make/../../../../../include -I/Users/buildslave/jenkins/workspace/lldb-cmake-matrix/llvm-project/lldb/packages/Python/lldbsuite/test/make -I/Users/buildslave/jenkins/workspace/lldb-cmake-matrix/llvm-project/lldb/packages/Python/lldbsuite/test/make -include /Users/buildslave/jenkins/workspace/lldb-cmake-matrix/llvm-project/lldb/packages/Python/lldbsuite/test/make/test_common.h  -fno-limit-debug-info     --driver-mode=g++ -install_name "@executable_path/libtwo.dylib" -dynamiclib -o "libtwo.dylib"
codesign -s - "libtwo.dylib"
"/Users/buildslave/jenkins/workspace/lldb-cmake-matrix/lldb-build/./bin/dsymutil"  "libtwo.dylib"
"/Users/buildslave/jenkins/workspace/lldb-cmake-matrix/clang_1101_build/bin/clang" -g -O0 -isysroot "/Applications/Xcode.app/Contents/Developer/Platforms/MacOSX.platform/Developer/SDKs/MacOSX11.1.sdk" -arch x86_64  -I/Users/buildslave/jenkins/workspace/lldb-cmake-matrix/llvm-project/lldb/packages/Python/lldbsuite/test/make/../../../../../include -I/Users/buildslave/jenkins/workspace/lldb-cmake-matrix/llvm-project/lldb/test/API/macosx/lc-note/multiple-binary-corefile -I/Users/buildslave/jenkins/workspace/lldb-cmake-matrix/llvm-project/lldb/packages/Python/lldbsuite/test/make -include /Users/buildslave/jenkins/workspace/lldb-cmake-matrix/llvm-project/lldb/packages/Python/lldbsuite/test/make/test_common.h  -fno-limit-debug-info   -MT main.o -MD -MP -MF main.d -c -o main.o /Users/buildslave/jenkins/workspace/lldb-cmake-matrix/llvm-project/lldb/test/API/macosx/lc-note/multiple-binary-corefile/main.c
"/Users/buildslave/jenkins/workspace/lldb-cmake-matrix/clang_1101_build/bin/clang"  main.o -g -O0 -isysroot "/Applications/Xcode.app/Contents/Developer/Platforms/MacOSX.platform/Developer/SDKs/MacOSX11.1.sdk" -arch x86_64  -I/Users/buildslave/jenkins/workspace/lldb-cmake-matrix/llvm-project/lldb/packages/Python/lldbsuite/test/make/../../../../../include -I/Users/buildslave/jenkins/workspace/lldb-cmake-matrix/llvm-project/lldb/test/API/macosx/lc-note/multiple-binary-corefile -I/Users/buildslave/jenkins/workspace/lldb-cmake-matrix/llvm-project/lldb/packages/Python/lldbsuite/test/make -include /Users/buildslave/jenkins/workspace/lldb-cmake-matrix/llvm-project/lldb/packages/Python/lldbsuite/test/make/test_common.h  -fno-limit-debug-info   -L. -lone -ltwo  --driver-mode=g++ -o "a.out"
codesign -s - "a.out"
"/Applications/Xcode.app/Contents/Developer/usr/bin/make" -f "/Users/buildslave/jenkins/workspace/lldb-cmake-matrix/llvm-project/lldb/packages/Python/lldbsuite/test/make/Makefile.rules" EXE=create-multibin-corefile \
		CXX_SOURCES=create-multibin-corefile.cpp
"/Users/buildslave/jenkins/workspace/lldb-cmake-matrix/clang_1101_build/bin/clang"  -std=c++11 -g -O0 -isysroot "/Applications/Xcode.app/Contents/Developer/Platforms/MacOSX.platform/Developer/SDKs/MacOSX11.1.sdk" -arch x86_64  -I/Users/buildslave/jenkins/workspace/lldb-cmake-matrix/llvm-project/lldb/packages/Python/lldbsuite/test/make/../../../../../include -I/Users/buildslave/jenkins/workspace/lldb-cmake-matrix/llvm-project/lldb/packages/Python/lldbsuite/test/make -I/Users/buildslave/jenkins/workspace/lldb-cmake-matrix/llvm-project/lldb/packages/Python/lldbsuite/test/make -include /Users/buildslave/jenkins/workspace/lldb-cmake-matrix/llvm-project/lldb/packages/Python/lldbsuite/test/make/test_common.h  -fno-limit-debug-info     --driver-mode=g++ -MT create-multibin-corefile.o -MD -MP -MF create-multibin-corefile.d -c -o create-multibin-corefile.o /Users/buildslave/jenkins/workspace/lldb-cmake-matrix/llvm-project/lldb/test/API/macosx/lc-note/multiple-binary-corefile/create-multibin-corefile.cpp
In file included from /Users/buildslave/jenkins/workspace/lldb-cmake-matrix/llvm-project/lldb/test/API/macosx/lc-note/multiple-binary-corefile/create-multibin-corefile.cpp:4:
In file included from /Applications/Xcode.app/Contents/Developer/Platforms/MacOSX.platform/Developer/SDKs/MacOSX11.1.sdk/usr/include/mach-o/loader.h:35:
In file included from /Applications/Xcode.app/Contents/Developer/Platforms/MacOSX.platform/Developer/SDKs/MacOSX11.1.sdk/usr/include/mach/machine.h:67:
In file included from /Applications/Xcode.app/Contents/Developer/Platforms/MacOSX.platform/Developer/SDKs/MacOSX11.1.sdk/usr/include/mach/machine/vm_types.h:33:
/Applications/Xcode.app/Contents/Developer/Platforms/MacOSX.platform/Developer/SDKs/MacOSX11.1.sdk/usr/include/mach/i386/vm_types.h:123:9: error: unknown type name 'uint64_t'
typedef uint64_t                mach_vm_address_t;
        ^
/Applications/Xcode.app/Contents/Developer/Platforms/MacOSX.platform/Developer/SDKs/MacOSX11.1.sdk/usr/include/mach/i386/vm_types.h:124:9: error: unknown type name 'uint64_t'
typedef uint64_t                mach_vm_offset_t;
        ^
/Applications/Xcode.app/Contents/Developer/Platforms/MacOSX.platform/Developer/SDKs/MacOSX11.1.sdk/usr/include/mach/i386/vm_types.h:125:9: error: unknown type name 'uint64_t'
typedef uint64_t                mach_vm_size_t;
        ^
/Applications/Xcode.app/Contents/Developer/Platforms/MacOSX.platform/Developer/SDKs/MacOSX11.1.sdk/usr/include/mach/i386/vm_types.h:127:9: error: unknown type name 'uint64_t'
typedef uint64_t                vm_map_offset_t;
        ^
/Applications/Xcode.app/Contents/Developer/Platforms/MacOSX.platform/Developer/SDKs/MacOSX11.1.sdk/usr/include/mach/i386/vm_types.h:128:9: error: unknown type name 'uint64_t'
typedef uint64_t                vm_map_address_t;
        ^
/Applications/Xcode.app/Contents/Developer/Platforms/MacOSX.platform/Developer/SDKs/MacOSX11.1.sdk/usr/include/mach/i386/vm_types.h:129:9: error: unknown type name 'uint64_t'
typedef uint64_t                vm_map_size_t;
        ^
In file included from /Users/buildslave/jenkins/workspace/lldb-cmake-matrix/llvm-project/lldb/test/API/macosx/lc-note/multiple-binary-corefile/create-multibin-corefile.cpp:4:
In file included from /Applications/Xcode.app/Contents/Developer/Platforms/MacOSX.platform/Developer/SDKs/MacOSX11.1.sdk/usr/include/mach-o/loader.h:47:
In file included from /Applications/Xcode.app/Contents/Developer/Platforms/MacOSX.platform/Developer/SDKs/MacOSX11.1.sdk/usr/include/mach/machine/thread_status.h:33:
In file included from /Applications/Xcode.app/Contents/Developer/Platforms/MacOSX.platform/Developer/SDKs/MacOSX11.1.sdk/usr/include/mach/i386/thread_status.h:71:
In file included from /Applications/Xcode.app/Contents/Developer/Platforms/MacOSX.platform/Developer/SDKs/MacOSX11.1.sdk/usr/include/mach/message.h:75:
/Applications/Xcode.app/Contents/Developer/Platforms/MacOSX.platform/Developer/SDKs/MacOSX11.1.sdk/usr/include/mach/port.h:293:2: error: unknown type name 'uint32_t'
        uint32_t                reserved[6];
        ^
/Applications/Xcode.app/Contents/Developer/Platforms/MacOSX.platform/Developer/SDKs/MacOSX11.1.sdk/usr/include/mach/port.h:350:2: error: unknown type name 'uint32_t'
        uint32_t                flags;          /* Flags defining attributes for port */
        ^
/Applications/Xcode.app/Contents/Developer/Platforms/MacOSX.platform/Developer/SDKs/MacOSX11.1.sdk/usr/include/mach/port.h:353:3: error: unknown type name 'uint64_t'
                uint64_t                reserved[2];           /* Reserved */
                ^
In file included from /Users/buildslave/jenkins/workspace/lldb-cmake-matrix/llvm-project/lldb/test/API/macosx/lc-note/multiple-binary-corefile/create-multibin-corefile.cpp:4:
In file included from /Applications/Xcode.app/Contents/Developer/Platforms/MacOSX.platform/Developer/SDKs/MacOSX11.1.sdk/usr/include/mach-o/loader.h:47:
In file included from /Applications/Xcode.app/Contents/Developer/Platforms/MacOSX.platform/Developer/SDKs/MacOSX11.1.sdk/usr/include/mach/machine/thread_status.h:33:
In file included from /Applications/Xcode.app/Contents/Developer/Platforms/MacOSX.platform/Developer/SDKs/MacOSX11.1.sdk/usr/include/mach/i386/thread_status.h:71:
/Applications/Xcode.app/Contents/Developer/Platforms/MacOSX.platform/Developer/SDKs/MacOSX11.1.sdk/usr/include/mach/message.h:300:2: error: unknown type name 'uint32_t'
        uint32_t                      address;
        ^
/Applications/Xcode.app/Contents/Developer/Platforms/MacOSX.platform/Developer/SDKs/MacOSX11.1.sdk/usr/include/mach/message.h:309:2: error: unknown type name 'uint64_t'
        uint64_t                      address;
        ^
/Applications/Xcode.app/Contents/Developer/Platforms/MacOSX.platform/Developer/SDKs/MacOSX11.1.sdk/usr/include/mach/message.h:332:2: error: unknown type name 'uint32_t'
        uint32_t                      address;
        ^
/Applications/Xcode.app/Contents/Developer/Platforms/MacOSX.platform/Developer/SDKs/MacOSX11.1.sdk/usr/include/mach/message.h:341:2: error: unknown type name 'uint64_t'
        uint64_t                      address;
        ^
/Applications/Xcode.app/Contents/Developer/Platforms/MacOSX.platform/Developer/SDKs/MacOSX11.1.sdk/usr/include/mach/message.h:364:2: error: unknown type name 'uint32_t'
        uint32_t                      context;
        ^
/Applications/Xcode.app/Contents/Developer/Platforms/MacOSX.platform/Developer/SDKs/MacOSX11.1.sdk/usr/include/mach/message.h:372:2: error: unknown type name 'uint64_t'
        uint64_t                      context;
        ^
In file included from /Users/buildslave/jenkins/workspace/lldb-cmake-matrix/llvm-project/lldb/test/API/macosx/lc-note/multiple-binary-corefile/create-multibin-corefile.cpp:4:
In file included from /Applications/Xcode.app/Contents/Developer/Platforms/MacOSX.platform/Developer/SDKs/MacOSX11.1.sdk/usr/include/mach-o/loader.h:47:
In file included from /Applications/Xcode.app/Contents/Developer/Platforms/MacOSX.platform/Developer/SDKs/MacOSX11.1.sdk/usr/include/mach/machine/thread_status.h:33:
/Applications/Xcode.app/Contents/Developer/Platforms/MacOSX.platform/Developer/SDKs/MacOSX11.1.sdk/usr/include/mach/i386/thread_status.h:165:2: error: unknown type name 'uint32_t'
        uint32_t        flavor;
        ^
/Applications/Xcode.app/Contents/Developer/Platforms/MacOSX.platform/Developer/SDKs/MacOSX11.1.sdk/usr/include/mach/i386/thread_status.h:166:2: error: unknown type name 'uint32_t'
        uint32_t        count;
        ^
In file included from /Users/buildslave/jenkins/workspace/lldb-cmake-matrix/llvm-project/lldb/test/API/macosx/lc-note/multiple-binary-corefile/create-multibin-corefile.cpp:4:
In file included from /Applications/Xcode.app/Contents/Developer/Platforms/MacOSX.platform/Developer/SDKs/MacOSX11.1.sdk/usr/include/mach-o/loader.h:48:
In file included from /Applications/Xcode.app/Contents/Developer/Platforms/MacOSX.platform/Developer/SDKs/MacOSX11.1.sdk/usr/include/architecture/byte_order.h:38:
In file included from /Applications/Xcode.app/Contents/Developer/Platforms/MacOSX.platform/Developer/SDKs/MacOSX11.1.sdk/usr/include/libkern/OSByteOrder.h:53:
/Applications/Xcode.app/Contents/Developer/Platforms/MacOSX.platform/Developer/SDKs/MacOSX11.1.sdk/usr/include/libkern/i386/OSByteOrder.h:39:1: error: unknown type name 'uint16_t'
uint16_t
^
/Applications/Xcode.app/Contents/Developer/Platforms/MacOSX.platform/Developer/SDKs/MacOSX11.1.sdk/usr/include/libkern/i386/OSByteOrder.h:45:2: error: unknown type name 'uint16_t'
        uint16_t result;
        ^
fatal error: too many errors emitted, stopping now [-ferror-limit=]
20 errors generated.
make[1]: *** [create-multibin-corefile.o] Error 1
make: *** [create-empty-corefile] Error 2

Test Directory:
/Users/buildslave/jenkins/workspace/lldb-cmake-matrix/llvm-project/lldb/test/API/macosx/lc-note/multiple-binary-corefile
----------------------------------------------------------------------
Ran 2 tests in 3.593s

RESULT: FAILED (0 passes, 0 failures, 2 errors, 0 skipped, 0 expected failures, 0 unexpected successes)

--