Regression

Test Clang 5.0.2 / lldb-api.commands/expression/import-std-module/vector-bool.TestVectorBoolFromStdModule.py (from lldb-api)

Failing for the past 1 build (Since #5041 )
Took 3.1 sec.

Stacktrace

Script:
--
/Applications/Xcode.app/Contents/Developer/Library/Frameworks/Python3.framework/Versions/3.8/bin/python3.8 /Users/buildslave/jenkins/workspace/lldb-cmake-matrix/llvm-project/lldb/test/API/dotest.py -u CXXFLAGS -u CFLAGS --codesign-identity lldb_codesign --arch x86_64 --build-dir /Users/buildslave/jenkins/workspace/lldb-cmake-matrix/lldb-build/lldb-test-build.noindex -t --env TERM=vt100 --skip-category gmodules --skip-category watchpoint --skip-category llgs --skip-category debugserver --arch=x86_64 --env LLVM_LIBS_DIR=/Users/buildslave/jenkins/workspace/lldb-cmake-matrix/lldb-build/./lib --env LLVM_INCLUDE_DIR=/Users/buildslave/jenkins/workspace/lldb-cmake-matrix/lldb-build/include --env LLVM_TOOLS_DIR=/Users/buildslave/jenkins/workspace/lldb-cmake-matrix/lldb-build/./bin --hermetic-libcxx --arch x86_64 --build-dir /Users/buildslave/jenkins/workspace/lldb-cmake-matrix/lldb-build/lldb-test-build.noindex --lldb-module-cache-dir /Users/buildslave/jenkins/workspace/lldb-cmake-matrix/lldb-build/lldb-test-build.noindex/module-cache-lldb/lldb-api --clang-module-cache-dir /Users/buildslave/jenkins/workspace/lldb-cmake-matrix/lldb-build/lldb-test-build.noindex/module-cache-clang/lldb-api --executable /Users/buildslave/jenkins/workspace/lldb-cmake-matrix/lldb-build/./bin/lldb --compiler /Users/buildslave/jenkins/workspace/lldb-cmake-matrix/clang_502_build/bin/clang --dsymutil /Users/buildslave/jenkins/workspace/lldb-cmake-matrix/lldb-build/./bin/dsymutil --llvm-tools-dir /Users/buildslave/jenkins/workspace/lldb-cmake-matrix/lldb-build/./bin --lldb-libs-dir /Users/buildslave/jenkins/workspace/lldb-cmake-matrix/lldb-build/./lib /Users/buildslave/jenkins/workspace/lldb-cmake-matrix/llvm-project/lldb/test/API/commands/expression/import-std-module/vector-bool -p TestVectorBoolFromStdModule.py
--
Exit Code: 1

Command Output (stdout):
--
lldb version 16.0.99git (http://labmaster3.local/git/llvm-project.git revision 807b8cb06ca05228f3ecb4709f4f4141748d2ca9)
  clang revision 807b8cb06ca05228f3ecb4709f4f4141748d2ca9
  llvm revision 807b8cb06ca05228f3ecb4709f4f4141748d2ca9
Skipping the following test categories: ['gmodules', 'watchpoint', 'llgs', 'debugserver', 'libstdcxx', 'dwo', 'llgs', 'fork']

--
Command Output (stderr):
--
Change dir to: /Users/buildslave/jenkins/workspace/lldb-cmake-matrix/llvm-project/lldb/test/API/commands/expression/import-std-module/vector-bool
runCmd: settings clear -all
output: 

runCmd: settings set symbols.enable-external-lookup false
output: 

runCmd: settings set target.inherit-tcc true
output: 

runCmd: settings set target.detach-on-error false
output: 

runCmd: settings set target.auto-apply-fixits false
output: 

runCmd: settings set plugin.process.gdb-remote.packet-timeout 60
output: 

runCmd: settings set symbols.clang-modules-cache-path "/Users/buildslave/jenkins/workspace/lldb-cmake-matrix/lldb-build/lldb-test-build.noindex/module-cache-lldb/lldb-api"
output: 

runCmd: settings set use-color false
output: 

runCmd: setting set target.prefer-dynamic-value no-dynamic-values
output: 

make VPATH=/Users/buildslave/jenkins/workspace/lldb-cmake-matrix/llvm-project/lldb/test/API/commands/expression/import-std-module/vector-bool -C /Users/buildslave/jenkins/workspace/lldb-cmake-matrix/lldb-build/lldb-test-build.noindex/commands/expression/import-std-module/vector-bool/TestVectorBoolFromStdModule.test_dsym -I /Users/buildslave/jenkins/workspace/lldb-cmake-matrix/llvm-project/lldb/test/API/commands/expression/import-std-module/vector-bool -I /Users/buildslave/jenkins/workspace/lldb-cmake-matrix/llvm-project/lldb/packages/Python/lldbsuite/test/make -f /Users/buildslave/jenkins/workspace/lldb-cmake-matrix/llvm-project/lldb/test/API/commands/expression/import-std-module/vector-bool/Makefile MAKE_DSYM=YES all ARCH=x86_64 'CC="/Users/buildslave/jenkins/workspace/lldb-cmake-matrix/clang_502_build/bin/clang"' DSYMUTIL=/Users/buildslave/jenkins/workspace/lldb-cmake-matrix/lldb-build/./bin/dsymutil CODESIGN=codesign CLANG_MODULE_CACHE_DIR=/Users/buildslave/jenkins/workspace/lldb-cmake-matrix/lldb-build/lldb-test-build.noindex/module-cache-clang/lldb-api USE_HERMETIC_LIBCPP=1

FAIL: LLDB (/Users/buildslave/jenkins/workspace/lldb-cmake-matrix/clang_502_build/bin/clang-x86_64) :: test_dsym (TestVectorBoolFromStdModule.TestBoolVector)
runCmd: settings clear -all
output: 

runCmd: settings set symbols.enable-external-lookup false
output: 

runCmd: settings set target.inherit-tcc true
output: 

runCmd: settings set target.detach-on-error false
output: 

runCmd: settings set target.auto-apply-fixits false
output: 

runCmd: settings set plugin.process.gdb-remote.packet-timeout 60
output: 

runCmd: settings set symbols.clang-modules-cache-path "/Users/buildslave/jenkins/workspace/lldb-cmake-matrix/lldb-build/lldb-test-build.noindex/module-cache-lldb/lldb-api"
output: 

runCmd: settings set use-color false
output: 

runCmd: setting set target.prefer-dynamic-value no-dynamic-values
output: 

make VPATH=/Users/buildslave/jenkins/workspace/lldb-cmake-matrix/llvm-project/lldb/test/API/commands/expression/import-std-module/vector-bool -C /Users/buildslave/jenkins/workspace/lldb-cmake-matrix/lldb-build/lldb-test-build.noindex/commands/expression/import-std-module/vector-bool/TestVectorBoolFromStdModule.test_dwarf -I /Users/buildslave/jenkins/workspace/lldb-cmake-matrix/llvm-project/lldb/test/API/commands/expression/import-std-module/vector-bool -I /Users/buildslave/jenkins/workspace/lldb-cmake-matrix/llvm-project/lldb/packages/Python/lldbsuite/test/make -f /Users/buildslave/jenkins/workspace/lldb-cmake-matrix/llvm-project/lldb/test/API/commands/expression/import-std-module/vector-bool/Makefile MAKE_DSYM=NO all ARCH=x86_64 'CC="/Users/buildslave/jenkins/workspace/lldb-cmake-matrix/clang_502_build/bin/clang"' DSYMUTIL=/Users/buildslave/jenkins/workspace/lldb-cmake-matrix/lldb-build/./bin/dsymutil CODESIGN=codesign CLANG_MODULE_CACHE_DIR=/Users/buildslave/jenkins/workspace/lldb-cmake-matrix/lldb-build/lldb-test-build.noindex/module-cache-clang/lldb-api USE_HERMETIC_LIBCPP=1

FAIL: LLDB (/Users/buildslave/jenkins/workspace/lldb-cmake-matrix/clang_502_build/bin/clang-x86_64) :: test_dwarf (TestVectorBoolFromStdModule.TestBoolVector)
UNSUPPORTED: LLDB (/Users/buildslave/jenkins/workspace/lldb-cmake-matrix/clang_502_build/bin/clang-x86_64) :: test_dwo (TestVectorBoolFromStdModule.TestBoolVector) (test case does not fall in any category of interest for this run) 
UNSUPPORTED: LLDB (/Users/buildslave/jenkins/workspace/lldb-cmake-matrix/clang_502_build/bin/clang-x86_64) :: test_gmodules (TestVectorBoolFromStdModule.TestBoolVector) (test case does not fall in any category of interest for this run) 
Restore dir to: /Users/buildslave/jenkins/workspace/lldb-cmake-matrix/lldb-build/tools/lldb/test
======================================================================
ERROR: test_dsym (TestVectorBoolFromStdModule.TestBoolVector)
----------------------------------------------------------------------
Error when building test subject.

Build Command:
make VPATH=/Users/buildslave/jenkins/workspace/lldb-cmake-matrix/llvm-project/lldb/test/API/commands/expression/import-std-module/vector-bool -C /Users/buildslave/jenkins/workspace/lldb-cmake-matrix/lldb-build/lldb-test-build.noindex/commands/expression/import-std-module/vector-bool/TestVectorBoolFromStdModule.test_dsym -I /Users/buildslave/jenkins/workspace/lldb-cmake-matrix/llvm-project/lldb/test/API/commands/expression/import-std-module/vector-bool -I /Users/buildslave/jenkins/workspace/lldb-cmake-matrix/llvm-project/lldb/packages/Python/lldbsuite/test/make -f /Users/buildslave/jenkins/workspace/lldb-cmake-matrix/llvm-project/lldb/test/API/commands/expression/import-std-module/vector-bool/Makefile MAKE_DSYM=YES all ARCH=x86_64 'CC="/Users/buildslave/jenkins/workspace/lldb-cmake-matrix/clang_502_build/bin/clang"' DSYMUTIL=/Users/buildslave/jenkins/workspace/lldb-cmake-matrix/lldb-build/./bin/dsymutil CODESIGN=codesign CLANG_MODULE_CACHE_DIR=/Users/buildslave/jenkins/workspace/lldb-cmake-matrix/lldb-build/lldb-test-build.noindex/module-cache-clang/lldb-api USE_HERMETIC_LIBCPP=1

Build Command Output:
"/Users/buildslave/jenkins/workspace/lldb-cmake-matrix/clang_502_build/bin/clang"  -std=c++11 -g -O0 -isysroot "/Applications/Xcode.app/Contents/Developer/Platforms/MacOSX.platform/Developer/SDKs/MacOSX11.1.sdk" -arch x86_64  -I/Users/buildslave/jenkins/workspace/lldb-cmake-matrix/llvm-project/lldb/packages/Python/lldbsuite/test/make/../../../../../include -I/Users/buildslave/jenkins/workspace/lldb-cmake-matrix/llvm-project/lldb/test/API/commands/expression/import-std-module/vector-bool -I/Users/buildslave/jenkins/workspace/lldb-cmake-matrix/llvm-project/lldb/packages/Python/lldbsuite/test/make -include /Users/buildslave/jenkins/workspace/lldb-cmake-matrix/llvm-project/lldb/packages/Python/lldbsuite/test/make/test_common.h  -fno-limit-debug-info    -DLLDB_USING_LIBCPP -D_LIBCPP_NO_ABI_TAG -stdlib=libc++  --driver-mode=g++ -MT main.o -MD -MP -MF main.d -c -o main.o /Users/buildslave/jenkins/workspace/lldb-cmake-matrix/llvm-project/lldb/test/API/commands/expression/import-std-module/vector-bool/main.cpp
In file included from /Users/buildslave/jenkins/workspace/lldb-cmake-matrix/llvm-project/lldb/test/API/commands/expression/import-std-module/vector-bool/main.cpp:1:
In file included from /Users/buildslave/jenkins/workspace/lldb-cmake-matrix/clang_502_build/include/c++/v1/vector:265:
In file included from /Users/buildslave/jenkins/workspace/lldb-cmake-matrix/clang_502_build/include/c++/v1/iosfwd:90:
/Users/buildslave/jenkins/workspace/lldb-cmake-matrix/clang_502_build/include/c++/v1/wchar.h:133:77: error: use of undeclared identifier 'wcschr'
wchar_t* __libcpp_wcschr(const wchar_t* __s, wchar_t __c) {return (wchar_t*)wcschr(__s, __c);}
                                                                            ^
/Users/buildslave/jenkins/workspace/lldb-cmake-matrix/clang_502_build/include/c++/v1/wchar.h:140:87: error: use of undeclared identifier 'wcspbrk'
wchar_t* __libcpp_wcspbrk(const wchar_t* __s1, const wchar_t* __s2) {return (wchar_t*)wcspbrk(__s1, __s2);}
                                                                                      ^
/Users/buildslave/jenkins/workspace/lldb-cmake-matrix/clang_502_build/include/c++/v1/wchar.h:147:78: error: use of undeclared identifier 'wcsrchr'; did you mean 'wcschr'?
wchar_t* __libcpp_wcsrchr(const wchar_t* __s, wchar_t __c) {return (wchar_t*)wcsrchr(__s, __c);}
                                                                             ^
/Users/buildslave/jenkins/workspace/lldb-cmake-matrix/clang_502_build/include/c++/v1/wchar.h:135:16: note: 'wcschr' declared here
const wchar_t* wcschr(const wchar_t* __s, wchar_t __c) {return __libcpp_wcschr(__s, __c);}
               ^
/Users/buildslave/jenkins/workspace/lldb-cmake-matrix/clang_502_build/include/c++/v1/wchar.h:154:86: error: use of undeclared identifier 'wcsstr'; did you mean 'wcschr'?
wchar_t* __libcpp_wcsstr(const wchar_t* __s1, const wchar_t* __s2) {return (wchar_t*)wcsstr(__s1, __s2);}
                                                                                     ^
/Users/buildslave/jenkins/workspace/lldb-cmake-matrix/clang_502_build/include/c++/v1/wchar.h:137:16: note: 'wcschr' declared here
      wchar_t* wcschr(      wchar_t* __s, wchar_t __c) {return __libcpp_wcschr(__s, __c);}
               ^
/Users/buildslave/jenkins/workspace/lldb-cmake-matrix/clang_502_build/include/c++/v1/wchar.h:154:86: error: no matching function for call to 'wcschr'
wchar_t* __libcpp_wcsstr(const wchar_t* __s1, const wchar_t* __s2) {return (wchar_t*)wcsstr(__s1, __s2);}
                                                                                     ^
/Users/buildslave/jenkins/workspace/lldb-cmake-matrix/clang_502_build/include/c++/v1/wchar.h:137:16: note: candidate disabled: <no message provided>
      wchar_t* wcschr(      wchar_t* __s, wchar_t __c) {return __libcpp_wcschr(__s, __c);}
               ^
/Users/buildslave/jenkins/workspace/lldb-cmake-matrix/clang_502_build/include/c++/v1/wchar.h:154:93: error: cannot initialize a parameter of type 'wchar_t *' with an lvalue of type 'const wchar_t *'
wchar_t* __libcpp_wcsstr(const wchar_t* __s1, const wchar_t* __s2) {return (wchar_t*)wcsstr(__s1, __s2);}
                                                                                            ^~~~
/Users/buildslave/jenkins/workspace/lldb-cmake-matrix/clang_502_build/include/c++/v1/wchar.h:137:38: note: passing argument to parameter '__s' here
      wchar_t* wcschr(      wchar_t* __s, wchar_t __c) {return __libcpp_wcschr(__s, __c);}
                                     ^
/Users/buildslave/jenkins/workspace/lldb-cmake-matrix/clang_502_build/include/c++/v1/wchar.h:161:60: error: unknown type name 'size_t'
wchar_t* __libcpp_wmemchr(const wchar_t* __s, wchar_t __c, size_t __n) {return (wchar_t*)wmemchr(__s, __c, __n);}
                                                           ^
/Users/buildslave/jenkins/workspace/lldb-cmake-matrix/clang_502_build/include/c++/v1/wchar.h:163:57: error: unknown type name 'size_t'
const wchar_t* wmemchr(const wchar_t* __s, wchar_t __c, size_t __n) {return __libcpp_wmemchr(__s, __c, __n);}
                                                        ^
/Users/buildslave/jenkins/workspace/lldb-cmake-matrix/clang_502_build/include/c++/v1/wchar.h:165:57: error: unknown type name 'size_t'
      wchar_t* wmemchr(      wchar_t* __s, wchar_t __c, size_t __n) {return __libcpp_wmemchr(__s, __c, __n);}
                                                        ^
In file included from /Users/buildslave/jenkins/workspace/lldb-cmake-matrix/llvm-project/lldb/test/API/commands/expression/import-std-module/vector-bool/main.cpp:1:
In file included from /Users/buildslave/jenkins/workspace/lldb-cmake-matrix/clang_502_build/include/c++/v1/vector:265:
/Users/buildslave/jenkins/workspace/lldb-cmake-matrix/clang_502_build/include/c++/v1/iosfwd:176:14: error: use of undeclared identifier 'mbstate_t'
typedef fpos<mbstate_t>    streampos;
             ^
/Users/buildslave/jenkins/workspace/lldb-cmake-matrix/clang_502_build/include/c++/v1/iosfwd:177:14: error: use of undeclared identifier 'mbstate_t'
typedef fpos<mbstate_t>    wstreampos;
             ^
/Users/buildslave/jenkins/workspace/lldb-cmake-matrix/clang_502_build/include/c++/v1/iosfwd:179:14: error: use of undeclared identifier 'mbstate_t'
typedef fpos<mbstate_t>    u16streampos;
             ^
/Users/buildslave/jenkins/workspace/lldb-cmake-matrix/clang_502_build/include/c++/v1/iosfwd:180:14: error: use of undeclared identifier 'mbstate_t'
typedef fpos<mbstate_t>    u32streampos;
             ^
In file included from /Users/buildslave/jenkins/workspace/lldb-cmake-matrix/llvm-project/lldb/test/API/commands/expression/import-std-module/vector-bool/main.cpp:1:
In file included from /Users/buildslave/jenkins/workspace/lldb-cmake-matrix/clang_502_build/include/c++/v1/vector:266:
In file included from /Users/buildslave/jenkins/workspace/lldb-cmake-matrix/clang_502_build/include/c++/v1/__bit_reference:15:
In file included from /Users/buildslave/jenkins/workspace/lldb-cmake-matrix/clang_502_build/include/c++/v1/algorithm:641:
In file included from /Users/buildslave/jenkins/workspace/lldb-cmake-matrix/clang_502_build/include/c++/v1/cstring:61:
/Users/buildslave/jenkins/workspace/lldb-cmake-matrix/clang_502_build/include/c++/v1/string.h:74:64: error: use of undeclared identifier 'strchr'
char* __libcpp_strchr(const char* __s, int __c) {return (char*)strchr(__s, __c);}
                                                               ^
/Users/buildslave/jenkins/workspace/lldb-cmake-matrix/clang_502_build/include/c++/v1/string.h:81:75: error: use of undeclared identifier 'strpbrk'
char* __libcpp_strpbrk(const char* __s1, const char* __s2) {return (char*)strpbrk(__s1, __s2);}
                                                                          ^
/Users/buildslave/jenkins/workspace/lldb-cmake-matrix/clang_502_build/include/c++/v1/string.h:88:65: error: use of undeclared identifier 'strrchr'; did you mean 'strchr'?
char* __libcpp_strrchr(const char* __s, int __c) {return (char*)strrchr(__s, __c);}
                                                                ^
/Users/buildslave/jenkins/workspace/lldb-cmake-matrix/clang_502_build/include/c++/v1/string.h:76:13: note: 'strchr' declared here
const char* strchr(const char* __s, int __c) {return __libcpp_strchr(__s, __c);}
            ^
/Users/buildslave/jenkins/workspace/lldb-cmake-matrix/clang_502_build/include/c++/v1/string.h:95:76: error: use of undeclared identifier 'memchr'; did you mean 'wmemchr'?
void* __libcpp_memchr(const void* __s, int __c, size_t __n) {return (void*)memchr(__s, __c, __n);}
                                                                           ^
/Users/buildslave/jenkins/workspace/lldb-cmake-matrix/clang_502_build/include/c++/v1/wchar.h:163:16: note: 'wmemchr' declared here
const wchar_t* wmemchr(const wchar_t* __s, wchar_t __c, size_t __n) {return __libcpp_wmemchr(__s, __c, __n);}
               ^
In file included from /Users/buildslave/jenkins/workspace/lldb-cmake-matrix/llvm-project/lldb/test/API/commands/expression/import-std-module/vector-bool/main.cpp:1:
In file included from /Users/buildslave/jenkins/workspace/lldb-cmake-matrix/clang_502_build/include/c++/v1/vector:266:
In file included from /Users/buildslave/jenkins/workspace/lldb-cmake-matrix/clang_502_build/include/c++/v1/__bit_reference:15:
In file included from /Users/buildslave/jenkins/workspace/lldb-cmake-matrix/clang_502_build/include/c++/v1/algorithm:641:
In file included from /Users/buildslave/jenkins/workspace/lldb-cmake-matrix/clang_502_build/include/c++/v1/cstring:61:
/Users/buildslave/jenkins/workspace/lldb-cmake-matrix/clang_502_build/include/c++/v1/string.h:102:74: error: use of undeclared identifier 'strstr'; did you mean 'strchr'?
char* __libcpp_strstr(const char* __s1, const char* __s2) {return (char*)strstr(__s1, __s2);}
                                                                         ^
/Users/buildslave/jenkins/workspace/lldb-cmake-matrix/clang_502_build/include/c++/v1/string.h:78:13: note: 'strchr' declared here
      char* strchr(      char* __s, int __c) {return __libcpp_strchr(__s, __c);}
            ^
/Users/buildslave/jenkins/workspace/lldb-cmake-matrix/clang_502_build/include/c++/v1/string.h:102:74: error: no matching function for call to 'strchr'
char* __libcpp_strstr(const char* __s1, const char* __s2) {return (char*)strstr(__s1, __s2);}
                                                                         ^
/Users/buildslave/jenkins/workspace/lldb-cmake-matrix/clang_502_build/include/c++/v1/string.h:78:13: note: candidate disabled: <no message provided>
      char* strchr(      char* __s, int __c) {return __libcpp_strchr(__s, __c);}
            ^
fatal error: too many errors emitted, stopping now [-ferror-limit=]
20 errors generated.
make: *** [main.o] Error 1

Test Directory:
/Users/buildslave/jenkins/workspace/lldb-cmake-matrix/llvm-project/lldb/test/API/commands/expression/import-std-module/vector-bool
======================================================================
ERROR: test_dwarf (TestVectorBoolFromStdModule.TestBoolVector)
----------------------------------------------------------------------
Error when building test subject.

Build Command:
make VPATH=/Users/buildslave/jenkins/workspace/lldb-cmake-matrix/llvm-project/lldb/test/API/commands/expression/import-std-module/vector-bool -C /Users/buildslave/jenkins/workspace/lldb-cmake-matrix/lldb-build/lldb-test-build.noindex/commands/expression/import-std-module/vector-bool/TestVectorBoolFromStdModule.test_dwarf -I /Users/buildslave/jenkins/workspace/lldb-cmake-matrix/llvm-project/lldb/test/API/commands/expression/import-std-module/vector-bool -I /Users/buildslave/jenkins/workspace/lldb-cmake-matrix/llvm-project/lldb/packages/Python/lldbsuite/test/make -f /Users/buildslave/jenkins/workspace/lldb-cmake-matrix/llvm-project/lldb/test/API/commands/expression/import-std-module/vector-bool/Makefile MAKE_DSYM=NO all ARCH=x86_64 'CC="/Users/buildslave/jenkins/workspace/lldb-cmake-matrix/clang_502_build/bin/clang"' DSYMUTIL=/Users/buildslave/jenkins/workspace/lldb-cmake-matrix/lldb-build/./bin/dsymutil CODESIGN=codesign CLANG_MODULE_CACHE_DIR=/Users/buildslave/jenkins/workspace/lldb-cmake-matrix/lldb-build/lldb-test-build.noindex/module-cache-clang/lldb-api USE_HERMETIC_LIBCPP=1

Build Command Output:
"/Users/buildslave/jenkins/workspace/lldb-cmake-matrix/clang_502_build/bin/clang"  -std=c++11 -g -O0 -isysroot "/Applications/Xcode.app/Contents/Developer/Platforms/MacOSX.platform/Developer/SDKs/MacOSX11.1.sdk" -arch x86_64  -I/Users/buildslave/jenkins/workspace/lldb-cmake-matrix/llvm-project/lldb/packages/Python/lldbsuite/test/make/../../../../../include -I/Users/buildslave/jenkins/workspace/lldb-cmake-matrix/llvm-project/lldb/test/API/commands/expression/import-std-module/vector-bool -I/Users/buildslave/jenkins/workspace/lldb-cmake-matrix/llvm-project/lldb/packages/Python/lldbsuite/test/make -include /Users/buildslave/jenkins/workspace/lldb-cmake-matrix/llvm-project/lldb/packages/Python/lldbsuite/test/make/test_common.h  -fno-limit-debug-info    -DLLDB_USING_LIBCPP -D_LIBCPP_NO_ABI_TAG -stdlib=libc++  --driver-mode=g++ -MT main.o -MD -MP -MF main.d -c -o main.o /Users/buildslave/jenkins/workspace/lldb-cmake-matrix/llvm-project/lldb/test/API/commands/expression/import-std-module/vector-bool/main.cpp
In file included from /Users/buildslave/jenkins/workspace/lldb-cmake-matrix/llvm-project/lldb/test/API/commands/expression/import-std-module/vector-bool/main.cpp:1:
In file included from /Users/buildslave/jenkins/workspace/lldb-cmake-matrix/clang_502_build/include/c++/v1/vector:265:
In file included from /Users/buildslave/jenkins/workspace/lldb-cmake-matrix/clang_502_build/include/c++/v1/iosfwd:90:
/Users/buildslave/jenkins/workspace/lldb-cmake-matrix/clang_502_build/include/c++/v1/wchar.h:133:77: error: use of undeclared identifier 'wcschr'
wchar_t* __libcpp_wcschr(const wchar_t* __s, wchar_t __c) {return (wchar_t*)wcschr(__s, __c);}
                                                                            ^
/Users/buildslave/jenkins/workspace/lldb-cmake-matrix/clang_502_build/include/c++/v1/wchar.h:140:87: error: use of undeclared identifier 'wcspbrk'
wchar_t* __libcpp_wcspbrk(const wchar_t* __s1, const wchar_t* __s2) {return (wchar_t*)wcspbrk(__s1, __s2);}
                                                                                      ^
/Users/buildslave/jenkins/workspace/lldb-cmake-matrix/clang_502_build/include/c++/v1/wchar.h:147:78: error: use of undeclared identifier 'wcsrchr'; did you mean 'wcschr'?
wchar_t* __libcpp_wcsrchr(const wchar_t* __s, wchar_t __c) {return (wchar_t*)wcsrchr(__s, __c);}
                                                                             ^
/Users/buildslave/jenkins/workspace/lldb-cmake-matrix/clang_502_build/include/c++/v1/wchar.h:135:16: note: 'wcschr' declared here
const wchar_t* wcschr(const wchar_t* __s, wchar_t __c) {return __libcpp_wcschr(__s, __c);}
               ^
/Users/buildslave/jenkins/workspace/lldb-cmake-matrix/clang_502_build/include/c++/v1/wchar.h:154:86: error: use of undeclared identifier 'wcsstr'; did you mean 'wcschr'?
wchar_t* __libcpp_wcsstr(const wchar_t* __s1, const wchar_t* __s2) {return (wchar_t*)wcsstr(__s1, __s2);}
                                                                                     ^
/Users/buildslave/jenkins/workspace/lldb-cmake-matrix/clang_502_build/include/c++/v1/wchar.h:137:16: note: 'wcschr' declared here
      wchar_t* wcschr(      wchar_t* __s, wchar_t __c) {return __libcpp_wcschr(__s, __c);}
               ^
/Users/buildslave/jenkins/workspace/lldb-cmake-matrix/clang_502_build/include/c++/v1/wchar.h:154:86: error: no matching function for call to 'wcschr'
wchar_t* __libcpp_wcsstr(const wchar_t* __s1, const wchar_t* __s2) {return (wchar_t*)wcsstr(__s1, __s2);}
                                                                                     ^
/Users/buildslave/jenkins/workspace/lldb-cmake-matrix/clang_502_build/include/c++/v1/wchar.h:137:16: note: candidate disabled: <no message provided>
      wchar_t* wcschr(      wchar_t* __s, wchar_t __c) {return __libcpp_wcschr(__s, __c);}
               ^
/Users/buildslave/jenkins/workspace/lldb-cmake-matrix/clang_502_build/include/c++/v1/wchar.h:154:93: error: cannot initialize a parameter of type 'wchar_t *' with an lvalue of type 'const wchar_t *'
wchar_t* __libcpp_wcsstr(const wchar_t* __s1, const wchar_t* __s2) {return (wchar_t*)wcsstr(__s1, __s2);}
                                                                                            ^~~~
/Users/buildslave/jenkins/workspace/lldb-cmake-matrix/clang_502_build/include/c++/v1/wchar.h:137:38: note: passing argument to parameter '__s' here
      wchar_t* wcschr(      wchar_t* __s, wchar_t __c) {return __libcpp_wcschr(__s, __c);}
                                     ^
/Users/buildslave/jenkins/workspace/lldb-cmake-matrix/clang_502_build/include/c++/v1/wchar.h:161:60: error: unknown type name 'size_t'
wchar_t* __libcpp_wmemchr(const wchar_t* __s, wchar_t __c, size_t __n) {return (wchar_t*)wmemchr(__s, __c, __n);}
                                                           ^
/Users/buildslave/jenkins/workspace/lldb-cmake-matrix/clang_502_build/include/c++/v1/wchar.h:163:57: error: unknown type name 'size_t'
const wchar_t* wmemchr(const wchar_t* __s, wchar_t __c, size_t __n) {return __libcpp_wmemchr(__s, __c, __n);}
                                                        ^
/Users/buildslave/jenkins/workspace/lldb-cmake-matrix/clang_502_build/include/c++/v1/wchar.h:165:57: error: unknown type name 'size_t'
      wchar_t* wmemchr(      wchar_t* __s, wchar_t __c, size_t __n) {return __libcpp_wmemchr(__s, __c, __n);}
                                                        ^
In file included from /Users/buildslave/jenkins/workspace/lldb-cmake-matrix/llvm-project/lldb/test/API/commands/expression/import-std-module/vector-bool/main.cpp:1:
In file included from /Users/buildslave/jenkins/workspace/lldb-cmake-matrix/clang_502_build/include/c++/v1/vector:265:
/Users/buildslave/jenkins/workspace/lldb-cmake-matrix/clang_502_build/include/c++/v1/iosfwd:176:14: error: use of undeclared identifier 'mbstate_t'
typedef fpos<mbstate_t>    streampos;
             ^
/Users/buildslave/jenkins/workspace/lldb-cmake-matrix/clang_502_build/include/c++/v1/iosfwd:177:14: error: use of undeclared identifier 'mbstate_t'
typedef fpos<mbstate_t>    wstreampos;
             ^
/Users/buildslave/jenkins/workspace/lldb-cmake-matrix/clang_502_build/include/c++/v1/iosfwd:179:14: error: use of undeclared identifier 'mbstate_t'
typedef fpos<mbstate_t>    u16streampos;
             ^
/Users/buildslave/jenkins/workspace/lldb-cmake-matrix/clang_502_build/include/c++/v1/iosfwd:180:14: error: use of undeclared identifier 'mbstate_t'
typedef fpos<mbstate_t>    u32streampos;
             ^
In file included from /Users/buildslave/jenkins/workspace/lldb-cmake-matrix/llvm-project/lldb/test/API/commands/expression/import-std-module/vector-bool/main.cpp:1:
In file included from /Users/buildslave/jenkins/workspace/lldb-cmake-matrix/clang_502_build/include/c++/v1/vector:266:
In file included from /Users/buildslave/jenkins/workspace/lldb-cmake-matrix/clang_502_build/include/c++/v1/__bit_reference:15:
In file included from /Users/buildslave/jenkins/workspace/lldb-cmake-matrix/clang_502_build/include/c++/v1/algorithm:641:
In file included from /Users/buildslave/jenkins/workspace/lldb-cmake-matrix/clang_502_build/include/c++/v1/cstring:61:
/Users/buildslave/jenkins/workspace/lldb-cmake-matrix/clang_502_build/include/c++/v1/string.h:74:64: error: use of undeclared identifier 'strchr'
char* __libcpp_strchr(const char* __s, int __c) {return (char*)strchr(__s, __c);}
                                                               ^
/Users/buildslave/jenkins/workspace/lldb-cmake-matrix/clang_502_build/include/c++/v1/string.h:81:75: error: use of undeclared identifier 'strpbrk'
char* __libcpp_strpbrk(const char* __s1, const char* __s2) {return (char*)strpbrk(__s1, __s2);}
                                                                          ^
/Users/buildslave/jenkins/workspace/lldb-cmake-matrix/clang_502_build/include/c++/v1/string.h:88:65: error: use of undeclared identifier 'strrchr'; did you mean 'strchr'?
char* __libcpp_strrchr(const char* __s, int __c) {return (char*)strrchr(__s, __c);}
                                                                ^
/Users/buildslave/jenkins/workspace/lldb-cmake-matrix/clang_502_build/include/c++/v1/string.h:76:13: note: 'strchr' declared here
const char* strchr(const char* __s, int __c) {return __libcpp_strchr(__s, __c);}
            ^
/Users/buildslave/jenkins/workspace/lldb-cmake-matrix/clang_502_build/include/c++/v1/string.h:95:76: error: use of undeclared identifier 'memchr'; did you mean 'wmemchr'?
void* __libcpp_memchr(const void* __s, int __c, size_t __n) {return (void*)memchr(__s, __c, __n);}
                                                                           ^
/Users/buildslave/jenkins/workspace/lldb-cmake-matrix/clang_502_build/include/c++/v1/wchar.h:163:16: note: 'wmemchr' declared here
const wchar_t* wmemchr(const wchar_t* __s, wchar_t __c, size_t __n) {return __libcpp_wmemchr(__s, __c, __n);}
               ^
In file included from /Users/buildslave/jenkins/workspace/lldb-cmake-matrix/llvm-project/lldb/test/API/commands/expression/import-std-module/vector-bool/main.cpp:1:
In file included from /Users/buildslave/jenkins/workspace/lldb-cmake-matrix/clang_502_build/include/c++/v1/vector:266:
In file included from /Users/buildslave/jenkins/workspace/lldb-cmake-matrix/clang_502_build/include/c++/v1/__bit_reference:15:
In file included from /Users/buildslave/jenkins/workspace/lldb-cmake-matrix/clang_502_build/include/c++/v1/algorithm:641:
In file included from /Users/buildslave/jenkins/workspace/lldb-cmake-matrix/clang_502_build/include/c++/v1/cstring:61:
/Users/buildslave/jenkins/workspace/lldb-cmake-matrix/clang_502_build/include/c++/v1/string.h:102:74: error: use of undeclared identifier 'strstr'; did you mean 'strchr'?
char* __libcpp_strstr(const char* __s1, const char* __s2) {return (char*)strstr(__s1, __s2);}
                                                                         ^
/Users/buildslave/jenkins/workspace/lldb-cmake-matrix/clang_502_build/include/c++/v1/string.h:78:13: note: 'strchr' declared here
      char* strchr(      char* __s, int __c) {return __libcpp_strchr(__s, __c);}
            ^
/Users/buildslave/jenkins/workspace/lldb-cmake-matrix/clang_502_build/include/c++/v1/string.h:102:74: error: no matching function for call to 'strchr'
char* __libcpp_strstr(const char* __s1, const char* __s2) {return (char*)strstr(__s1, __s2);}
                                                                         ^
/Users/buildslave/jenkins/workspace/lldb-cmake-matrix/clang_502_build/include/c++/v1/string.h:78:13: note: candidate disabled: <no message provided>
      char* strchr(      char* __s, int __c) {return __libcpp_strchr(__s, __c);}
            ^
fatal error: too many errors emitted, stopping now [-ferror-limit=]
20 errors generated.
make: *** [main.o] Error 1

Test Directory:
/Users/buildslave/jenkins/workspace/lldb-cmake-matrix/llvm-project/lldb/test/API/commands/expression/import-std-module/vector-bool
----------------------------------------------------------------------
Ran 4 tests in 1.029s

RESULT: FAILED (0 passes, 0 failures, 2 errors, 2 skipped, 0 expected failures, 0 unexpected successes)

--