Regression

Test Clang 9.0.0 / lldb-api.functionalities/data-formatter/data-formatter-stl/libcxx/string/simulator.TestDataFormatterLibcxxStringSimulator.py (from lldb-api)

Failing for the past 1 build (Since #5041 )
Took 7 sec.

Stacktrace

Script:
--
/Applications/Xcode.app/Contents/Developer/Library/Frameworks/Python3.framework/Versions/3.8/bin/python3.8 /Users/buildslave/jenkins/workspace/lldb-cmake-matrix/llvm-project/lldb/test/API/dotest.py -u CXXFLAGS -u CFLAGS --codesign-identity lldb_codesign --arch x86_64 --build-dir /Users/buildslave/jenkins/workspace/lldb-cmake-matrix/lldb-build/lldb-test-build.noindex -t --env TERM=vt100 --skip-category gmodules --skip-category watchpoint --skip-category llgs --skip-category debugserver --arch=x86_64 --env LLVM_LIBS_DIR=/Users/buildslave/jenkins/workspace/lldb-cmake-matrix/lldb-build/./lib --env LLVM_INCLUDE_DIR=/Users/buildslave/jenkins/workspace/lldb-cmake-matrix/lldb-build/include --env LLVM_TOOLS_DIR=/Users/buildslave/jenkins/workspace/lldb-cmake-matrix/lldb-build/./bin --hermetic-libcxx --arch x86_64 --build-dir /Users/buildslave/jenkins/workspace/lldb-cmake-matrix/lldb-build/lldb-test-build.noindex --lldb-module-cache-dir /Users/buildslave/jenkins/workspace/lldb-cmake-matrix/lldb-build/lldb-test-build.noindex/module-cache-lldb/lldb-api --clang-module-cache-dir /Users/buildslave/jenkins/workspace/lldb-cmake-matrix/lldb-build/lldb-test-build.noindex/module-cache-clang/lldb-api --executable /Users/buildslave/jenkins/workspace/lldb-cmake-matrix/lldb-build/./bin/lldb --compiler /Users/buildslave/jenkins/workspace/lldb-cmake-matrix/clang_900_build/bin/clang --dsymutil /Users/buildslave/jenkins/workspace/lldb-cmake-matrix/lldb-build/./bin/dsymutil --llvm-tools-dir /Users/buildslave/jenkins/workspace/lldb-cmake-matrix/lldb-build/./bin --lldb-libs-dir /Users/buildslave/jenkins/workspace/lldb-cmake-matrix/lldb-build/./lib /Users/buildslave/jenkins/workspace/lldb-cmake-matrix/llvm-project/lldb/test/API/functionalities/data-formatter/data-formatter-stl/libcxx/string/simulator -p TestDataFormatterLibcxxStringSimulator.py
--
Exit Code: 1

Command Output (stdout):
--
lldb version 16.0.99git (http://labmaster3.local/git/llvm-project.git revision 807b8cb06ca05228f3ecb4709f4f4141748d2ca9)
  clang revision 807b8cb06ca05228f3ecb4709f4f4141748d2ca9
  llvm revision 807b8cb06ca05228f3ecb4709f4f4141748d2ca9
Skipping the following test categories: ['gmodules', 'watchpoint', 'llgs', 'debugserver', 'libstdcxx', 'dwo', 'llgs', 'fork']

--
Command Output (stderr):
--
Change dir to: /Users/buildslave/jenkins/workspace/lldb-cmake-matrix/llvm-project/lldb/test/API/functionalities/data-formatter/data-formatter-stl/libcxx/string/simulator
runCmd: settings clear -all
output: 

runCmd: settings set symbols.enable-external-lookup false
output: 

runCmd: settings set target.inherit-tcc true
output: 

runCmd: settings set target.detach-on-error false
output: 

runCmd: settings set target.auto-apply-fixits false
output: 

runCmd: settings set plugin.process.gdb-remote.packet-timeout 60
output: 

runCmd: settings set symbols.clang-modules-cache-path "/Users/buildslave/jenkins/workspace/lldb-cmake-matrix/lldb-build/lldb-test-build.noindex/module-cache-lldb/lldb-api"
output: 

runCmd: settings set use-color false
output: 

runCmd: setting set target.prefer-dynamic-value no-dynamic-values
output: 

make VPATH=/Users/buildslave/jenkins/workspace/lldb-cmake-matrix/llvm-project/lldb/test/API/functionalities/data-formatter/data-formatter-stl/libcxx/string/simulator -C /Users/buildslave/jenkins/workspace/lldb-cmake-matrix/lldb-build/lldb-test-build.noindex/functionalities/data-formatter/data-formatter-stl/libcxx/string/simulator/TestDataFormatterLibcxxStringSimulator.test_r0 -I /Users/buildslave/jenkins/workspace/lldb-cmake-matrix/llvm-project/lldb/test/API/functionalities/data-formatter/data-formatter-stl/libcxx/string/simulator -I /Users/buildslave/jenkins/workspace/lldb-cmake-matrix/llvm-project/lldb/packages/Python/lldbsuite/test/make -f /Users/buildslave/jenkins/workspace/lldb-cmake-matrix/llvm-project/lldb/test/API/functionalities/data-formatter/data-formatter-stl/libcxx/string/simulator/Makefile all ARCH=x86_64 'CC="/Users/buildslave/jenkins/workspace/lldb-cmake-matrix/clang_900_build/bin/clang"' DSYMUTIL=/Users/buildslave/jenkins/workspace/lldb-cmake-matrix/lldb-build/./bin/dsymutil CODESIGN=codesign CLANG_MODULE_CACHE_DIR=/Users/buildslave/jenkins/workspace/lldb-cmake-matrix/lldb-build/lldb-test-build.noindex/module-cache-clang/lldb-api USE_HERMETIC_LIBCPP=1 CXXFLAGS_EXTRAS=-DREVISION=0

FAIL: LLDB (/Users/buildslave/jenkins/workspace/lldb-cmake-matrix/clang_900_build/bin/clang-x86_64) :: test_r0 (TestDataFormatterLibcxxStringSimulator.LibcxxStringDataFormatterSimulatorTestCase)
runCmd: settings clear -all
output: 

runCmd: settings set symbols.enable-external-lookup false
output: 

runCmd: settings set target.inherit-tcc true
output: 

runCmd: settings set target.detach-on-error false
output: 

runCmd: settings set target.auto-apply-fixits false
output: 

runCmd: settings set plugin.process.gdb-remote.packet-timeout 60
output: 

runCmd: settings set symbols.clang-modules-cache-path "/Users/buildslave/jenkins/workspace/lldb-cmake-matrix/lldb-build/lldb-test-build.noindex/module-cache-lldb/lldb-api"
output: 

runCmd: settings set use-color false
output: 

runCmd: setting set target.prefer-dynamic-value no-dynamic-values
output: 

make VPATH=/Users/buildslave/jenkins/workspace/lldb-cmake-matrix/llvm-project/lldb/test/API/functionalities/data-formatter/data-formatter-stl/libcxx/string/simulator -C /Users/buildslave/jenkins/workspace/lldb-cmake-matrix/lldb-build/lldb-test-build.noindex/functionalities/data-formatter/data-formatter-stl/libcxx/string/simulator/TestDataFormatterLibcxxStringSimulator.test_r0_ALTERNATE_LAYOUT -I /Users/buildslave/jenkins/workspace/lldb-cmake-matrix/llvm-project/lldb/test/API/functionalities/data-formatter/data-formatter-stl/libcxx/string/simulator -I /Users/buildslave/jenkins/workspace/lldb-cmake-matrix/llvm-project/lldb/packages/Python/lldbsuite/test/make -f /Users/buildslave/jenkins/workspace/lldb-cmake-matrix/llvm-project/lldb/test/API/functionalities/data-formatter/data-formatter-stl/libcxx/string/simulator/Makefile all ARCH=x86_64 'CC="/Users/buildslave/jenkins/workspace/lldb-cmake-matrix/clang_900_build/bin/clang"' DSYMUTIL=/Users/buildslave/jenkins/workspace/lldb-cmake-matrix/lldb-build/./bin/dsymutil CODESIGN=codesign CLANG_MODULE_CACHE_DIR=/Users/buildslave/jenkins/workspace/lldb-cmake-matrix/lldb-build/lldb-test-build.noindex/module-cache-clang/lldb-api USE_HERMETIC_LIBCPP=1 'CXXFLAGS_EXTRAS=-DREVISION=0 -DALTERNATE_LAYOUT'

FAIL: LLDB (/Users/buildslave/jenkins/workspace/lldb-cmake-matrix/clang_900_build/bin/clang-x86_64) :: test_r0_ALTERNATE_LAYOUT (TestDataFormatterLibcxxStringSimulator.LibcxxStringDataFormatterSimulatorTestCase)
runCmd: settings clear -all
output: 

runCmd: settings set symbols.enable-external-lookup false
output: 

runCmd: settings set target.inherit-tcc true
output: 

runCmd: settings set target.detach-on-error false
output: 

runCmd: settings set target.auto-apply-fixits false
output: 

runCmd: settings set plugin.process.gdb-remote.packet-timeout 60
output: 

runCmd: settings set symbols.clang-modules-cache-path "/Users/buildslave/jenkins/workspace/lldb-cmake-matrix/lldb-build/lldb-test-build.noindex/module-cache-lldb/lldb-api"
output: 

runCmd: settings set use-color false
output: 

runCmd: setting set target.prefer-dynamic-value no-dynamic-values
output: 

make VPATH=/Users/buildslave/jenkins/workspace/lldb-cmake-matrix/llvm-project/lldb/test/API/functionalities/data-formatter/data-formatter-stl/libcxx/string/simulator -C /Users/buildslave/jenkins/workspace/lldb-cmake-matrix/lldb-build/lldb-test-build.noindex/functionalities/data-formatter/data-formatter-stl/libcxx/string/simulator/TestDataFormatterLibcxxStringSimulator.test_r1 -I /Users/buildslave/jenkins/workspace/lldb-cmake-matrix/llvm-project/lldb/test/API/functionalities/data-formatter/data-formatter-stl/libcxx/string/simulator -I /Users/buildslave/jenkins/workspace/lldb-cmake-matrix/llvm-project/lldb/packages/Python/lldbsuite/test/make -f /Users/buildslave/jenkins/workspace/lldb-cmake-matrix/llvm-project/lldb/test/API/functionalities/data-formatter/data-formatter-stl/libcxx/string/simulator/Makefile all ARCH=x86_64 'CC="/Users/buildslave/jenkins/workspace/lldb-cmake-matrix/clang_900_build/bin/clang"' DSYMUTIL=/Users/buildslave/jenkins/workspace/lldb-cmake-matrix/lldb-build/./bin/dsymutil CODESIGN=codesign CLANG_MODULE_CACHE_DIR=/Users/buildslave/jenkins/workspace/lldb-cmake-matrix/lldb-build/lldb-test-build.noindex/module-cache-clang/lldb-api USE_HERMETIC_LIBCPP=1 CXXFLAGS_EXTRAS=-DREVISION=1

FAIL: LLDB (/Users/buildslave/jenkins/workspace/lldb-cmake-matrix/clang_900_build/bin/clang-x86_64) :: test_r1 (TestDataFormatterLibcxxStringSimulator.LibcxxStringDataFormatterSimulatorTestCase)
runCmd: settings clear -all
output: 

runCmd: settings set symbols.enable-external-lookup false
output: 

runCmd: settings set target.inherit-tcc true
output: 

runCmd: settings set target.detach-on-error false
output: 

runCmd: settings set target.auto-apply-fixits false
output: 

runCmd: settings set plugin.process.gdb-remote.packet-timeout 60
output: 

runCmd: settings set symbols.clang-modules-cache-path "/Users/buildslave/jenkins/workspace/lldb-cmake-matrix/lldb-build/lldb-test-build.noindex/module-cache-lldb/lldb-api"
output: 

runCmd: settings set use-color false
output: 

runCmd: setting set target.prefer-dynamic-value no-dynamic-values
output: 

make VPATH=/Users/buildslave/jenkins/workspace/lldb-cmake-matrix/llvm-project/lldb/test/API/functionalities/data-formatter/data-formatter-stl/libcxx/string/simulator -C /Users/buildslave/jenkins/workspace/lldb-cmake-matrix/lldb-build/lldb-test-build.noindex/functionalities/data-formatter/data-formatter-stl/libcxx/string/simulator/TestDataFormatterLibcxxStringSimulator.test_r1_ALTERNATE_LAYOUT -I /Users/buildslave/jenkins/workspace/lldb-cmake-matrix/llvm-project/lldb/test/API/functionalities/data-formatter/data-formatter-stl/libcxx/string/simulator -I /Users/buildslave/jenkins/workspace/lldb-cmake-matrix/llvm-project/lldb/packages/Python/lldbsuite/test/make -f /Users/buildslave/jenkins/workspace/lldb-cmake-matrix/llvm-project/lldb/test/API/functionalities/data-formatter/data-formatter-stl/libcxx/string/simulator/Makefile all ARCH=x86_64 'CC="/Users/buildslave/jenkins/workspace/lldb-cmake-matrix/clang_900_build/bin/clang"' DSYMUTIL=/Users/buildslave/jenkins/workspace/lldb-cmake-matrix/lldb-build/./bin/dsymutil CODESIGN=codesign CLANG_MODULE_CACHE_DIR=/Users/buildslave/jenkins/workspace/lldb-cmake-matrix/lldb-build/lldb-test-build.noindex/module-cache-clang/lldb-api USE_HERMETIC_LIBCPP=1 'CXXFLAGS_EXTRAS=-DREVISION=1 -DALTERNATE_LAYOUT'

FAIL: LLDB (/Users/buildslave/jenkins/workspace/lldb-cmake-matrix/clang_900_build/bin/clang-x86_64) :: test_r1_ALTERNATE_LAYOUT (TestDataFormatterLibcxxStringSimulator.LibcxxStringDataFormatterSimulatorTestCase)
runCmd: settings clear -all
output: 

runCmd: settings set symbols.enable-external-lookup false
output: 

runCmd: settings set target.inherit-tcc true
output: 

runCmd: settings set target.detach-on-error false
output: 

runCmd: settings set target.auto-apply-fixits false
output: 

runCmd: settings set plugin.process.gdb-remote.packet-timeout 60
output: 

runCmd: settings set symbols.clang-modules-cache-path "/Users/buildslave/jenkins/workspace/lldb-cmake-matrix/lldb-build/lldb-test-build.noindex/module-cache-lldb/lldb-api"
output: 

runCmd: settings set use-color false
output: 

runCmd: setting set target.prefer-dynamic-value no-dynamic-values
output: 

make VPATH=/Users/buildslave/jenkins/workspace/lldb-cmake-matrix/llvm-project/lldb/test/API/functionalities/data-formatter/data-formatter-stl/libcxx/string/simulator -C /Users/buildslave/jenkins/workspace/lldb-cmake-matrix/lldb-build/lldb-test-build.noindex/functionalities/data-formatter/data-formatter-stl/libcxx/string/simulator/TestDataFormatterLibcxxStringSimulator.test_r2 -I /Users/buildslave/jenkins/workspace/lldb-cmake-matrix/llvm-project/lldb/test/API/functionalities/data-formatter/data-formatter-stl/libcxx/string/simulator -I /Users/buildslave/jenkins/workspace/lldb-cmake-matrix/llvm-project/lldb/packages/Python/lldbsuite/test/make -f /Users/buildslave/jenkins/workspace/lldb-cmake-matrix/llvm-project/lldb/test/API/functionalities/data-formatter/data-formatter-stl/libcxx/string/simulator/Makefile all ARCH=x86_64 'CC="/Users/buildslave/jenkins/workspace/lldb-cmake-matrix/clang_900_build/bin/clang"' DSYMUTIL=/Users/buildslave/jenkins/workspace/lldb-cmake-matrix/lldb-build/./bin/dsymutil CODESIGN=codesign CLANG_MODULE_CACHE_DIR=/Users/buildslave/jenkins/workspace/lldb-cmake-matrix/lldb-build/lldb-test-build.noindex/module-cache-clang/lldb-api USE_HERMETIC_LIBCPP=1 CXXFLAGS_EXTRAS=-DREVISION=2

FAIL: LLDB (/Users/buildslave/jenkins/workspace/lldb-cmake-matrix/clang_900_build/bin/clang-x86_64) :: test_r2 (TestDataFormatterLibcxxStringSimulator.LibcxxStringDataFormatterSimulatorTestCase)
runCmd: settings clear -all
output: 

runCmd: settings set symbols.enable-external-lookup false
output: 

runCmd: settings set target.inherit-tcc true
output: 

runCmd: settings set target.detach-on-error false
output: 

runCmd: settings set target.auto-apply-fixits false
output: 

runCmd: settings set plugin.process.gdb-remote.packet-timeout 60
output: 

runCmd: settings set symbols.clang-modules-cache-path "/Users/buildslave/jenkins/workspace/lldb-cmake-matrix/lldb-build/lldb-test-build.noindex/module-cache-lldb/lldb-api"
output: 

runCmd: settings set use-color false
output: 

runCmd: setting set target.prefer-dynamic-value no-dynamic-values
output: 

make VPATH=/Users/buildslave/jenkins/workspace/lldb-cmake-matrix/llvm-project/lldb/test/API/functionalities/data-formatter/data-formatter-stl/libcxx/string/simulator -C /Users/buildslave/jenkins/workspace/lldb-cmake-matrix/lldb-build/lldb-test-build.noindex/functionalities/data-formatter/data-formatter-stl/libcxx/string/simulator/TestDataFormatterLibcxxStringSimulator.test_r2_ALTERNATE_LAYOUT -I /Users/buildslave/jenkins/workspace/lldb-cmake-matrix/llvm-project/lldb/test/API/functionalities/data-formatter/data-formatter-stl/libcxx/string/simulator -I /Users/buildslave/jenkins/workspace/lldb-cmake-matrix/llvm-project/lldb/packages/Python/lldbsuite/test/make -f /Users/buildslave/jenkins/workspace/lldb-cmake-matrix/llvm-project/lldb/test/API/functionalities/data-formatter/data-formatter-stl/libcxx/string/simulator/Makefile all ARCH=x86_64 'CC="/Users/buildslave/jenkins/workspace/lldb-cmake-matrix/clang_900_build/bin/clang"' DSYMUTIL=/Users/buildslave/jenkins/workspace/lldb-cmake-matrix/lldb-build/./bin/dsymutil CODESIGN=codesign CLANG_MODULE_CACHE_DIR=/Users/buildslave/jenkins/workspace/lldb-cmake-matrix/lldb-build/lldb-test-build.noindex/module-cache-clang/lldb-api USE_HERMETIC_LIBCPP=1 'CXXFLAGS_EXTRAS=-DREVISION=2 -DALTERNATE_LAYOUT'

FAIL: LLDB (/Users/buildslave/jenkins/workspace/lldb-cmake-matrix/clang_900_build/bin/clang-x86_64) :: test_r2_ALTERNATE_LAYOUT (TestDataFormatterLibcxxStringSimulator.LibcxxStringDataFormatterSimulatorTestCase)
runCmd: settings clear -all
output: 

runCmd: settings set symbols.enable-external-lookup false
output: 

runCmd: settings set target.inherit-tcc true
output: 

runCmd: settings set target.detach-on-error false
output: 

runCmd: settings set target.auto-apply-fixits false
output: 

runCmd: settings set plugin.process.gdb-remote.packet-timeout 60
output: 

runCmd: settings set symbols.clang-modules-cache-path "/Users/buildslave/jenkins/workspace/lldb-cmake-matrix/lldb-build/lldb-test-build.noindex/module-cache-lldb/lldb-api"
output: 

runCmd: settings set use-color false
output: 

runCmd: setting set target.prefer-dynamic-value no-dynamic-values
output: 

make VPATH=/Users/buildslave/jenkins/workspace/lldb-cmake-matrix/llvm-project/lldb/test/API/functionalities/data-formatter/data-formatter-stl/libcxx/string/simulator -C /Users/buildslave/jenkins/workspace/lldb-cmake-matrix/lldb-build/lldb-test-build.noindex/functionalities/data-formatter/data-formatter-stl/libcxx/string/simulator/TestDataFormatterLibcxxStringSimulator.test_r3 -I /Users/buildslave/jenkins/workspace/lldb-cmake-matrix/llvm-project/lldb/test/API/functionalities/data-formatter/data-formatter-stl/libcxx/string/simulator -I /Users/buildslave/jenkins/workspace/lldb-cmake-matrix/llvm-project/lldb/packages/Python/lldbsuite/test/make -f /Users/buildslave/jenkins/workspace/lldb-cmake-matrix/llvm-project/lldb/test/API/functionalities/data-formatter/data-formatter-stl/libcxx/string/simulator/Makefile all ARCH=x86_64 'CC="/Users/buildslave/jenkins/workspace/lldb-cmake-matrix/clang_900_build/bin/clang"' DSYMUTIL=/Users/buildslave/jenkins/workspace/lldb-cmake-matrix/lldb-build/./bin/dsymutil CODESIGN=codesign CLANG_MODULE_CACHE_DIR=/Users/buildslave/jenkins/workspace/lldb-cmake-matrix/lldb-build/lldb-test-build.noindex/module-cache-clang/lldb-api USE_HERMETIC_LIBCPP=1 CXXFLAGS_EXTRAS=-DREVISION=3

FAIL: LLDB (/Users/buildslave/jenkins/workspace/lldb-cmake-matrix/clang_900_build/bin/clang-x86_64) :: test_r3 (TestDataFormatterLibcxxStringSimulator.LibcxxStringDataFormatterSimulatorTestCase)
runCmd: settings clear -all
output: 

runCmd: settings set symbols.enable-external-lookup false
output: 

runCmd: settings set target.inherit-tcc true
output: 

runCmd: settings set target.detach-on-error false
output: 

runCmd: settings set target.auto-apply-fixits false
output: 

runCmd: settings set plugin.process.gdb-remote.packet-timeout 60
output: 

runCmd: settings set symbols.clang-modules-cache-path "/Users/buildslave/jenkins/workspace/lldb-cmake-matrix/lldb-build/lldb-test-build.noindex/module-cache-lldb/lldb-api"
output: 

runCmd: settings set use-color false
output: 

runCmd: setting set target.prefer-dynamic-value no-dynamic-values
output: 

make VPATH=/Users/buildslave/jenkins/workspace/lldb-cmake-matrix/llvm-project/lldb/test/API/functionalities/data-formatter/data-formatter-stl/libcxx/string/simulator -C /Users/buildslave/jenkins/workspace/lldb-cmake-matrix/lldb-build/lldb-test-build.noindex/functionalities/data-formatter/data-formatter-stl/libcxx/string/simulator/TestDataFormatterLibcxxStringSimulator.test_r3_ALTERNATE_LAYOUT -I /Users/buildslave/jenkins/workspace/lldb-cmake-matrix/llvm-project/lldb/test/API/functionalities/data-formatter/data-formatter-stl/libcxx/string/simulator -I /Users/buildslave/jenkins/workspace/lldb-cmake-matrix/llvm-project/lldb/packages/Python/lldbsuite/test/make -f /Users/buildslave/jenkins/workspace/lldb-cmake-matrix/llvm-project/lldb/test/API/functionalities/data-formatter/data-formatter-stl/libcxx/string/simulator/Makefile all ARCH=x86_64 'CC="/Users/buildslave/jenkins/workspace/lldb-cmake-matrix/clang_900_build/bin/clang"' DSYMUTIL=/Users/buildslave/jenkins/workspace/lldb-cmake-matrix/lldb-build/./bin/dsymutil CODESIGN=codesign CLANG_MODULE_CACHE_DIR=/Users/buildslave/jenkins/workspace/lldb-cmake-matrix/lldb-build/lldb-test-build.noindex/module-cache-clang/lldb-api USE_HERMETIC_LIBCPP=1 'CXXFLAGS_EXTRAS=-DREVISION=3 -DALTERNATE_LAYOUT'

FAIL: LLDB (/Users/buildslave/jenkins/workspace/lldb-cmake-matrix/clang_900_build/bin/clang-x86_64) :: test_r3_ALTERNATE_LAYOUT (TestDataFormatterLibcxxStringSimulator.LibcxxStringDataFormatterSimulatorTestCase)
runCmd: settings clear -all
output: 

runCmd: settings set symbols.enable-external-lookup false
output: 

runCmd: settings set target.inherit-tcc true
output: 

runCmd: settings set target.detach-on-error false
output: 

runCmd: settings set target.auto-apply-fixits false
output: 

runCmd: settings set plugin.process.gdb-remote.packet-timeout 60
output: 

runCmd: settings set symbols.clang-modules-cache-path "/Users/buildslave/jenkins/workspace/lldb-cmake-matrix/lldb-build/lldb-test-build.noindex/module-cache-lldb/lldb-api"
output: 

runCmd: settings set use-color false
output: 

runCmd: setting set target.prefer-dynamic-value no-dynamic-values
output: 

make VPATH=/Users/buildslave/jenkins/workspace/lldb-cmake-matrix/llvm-project/lldb/test/API/functionalities/data-formatter/data-formatter-stl/libcxx/string/simulator -C /Users/buildslave/jenkins/workspace/lldb-cmake-matrix/lldb-build/lldb-test-build.noindex/functionalities/data-formatter/data-formatter-stl/libcxx/string/simulator/TestDataFormatterLibcxxStringSimulator.test_r4 -I /Users/buildslave/jenkins/workspace/lldb-cmake-matrix/llvm-project/lldb/test/API/functionalities/data-formatter/data-formatter-stl/libcxx/string/simulator -I /Users/buildslave/jenkins/workspace/lldb-cmake-matrix/llvm-project/lldb/packages/Python/lldbsuite/test/make -f /Users/buildslave/jenkins/workspace/lldb-cmake-matrix/llvm-project/lldb/test/API/functionalities/data-formatter/data-formatter-stl/libcxx/string/simulator/Makefile all ARCH=x86_64 'CC="/Users/buildslave/jenkins/workspace/lldb-cmake-matrix/clang_900_build/bin/clang"' DSYMUTIL=/Users/buildslave/jenkins/workspace/lldb-cmake-matrix/lldb-build/./bin/dsymutil CODESIGN=codesign CLANG_MODULE_CACHE_DIR=/Users/buildslave/jenkins/workspace/lldb-cmake-matrix/lldb-build/lldb-test-build.noindex/module-cache-clang/lldb-api USE_HERMETIC_LIBCPP=1 CXXFLAGS_EXTRAS=-DREVISION=4

FAIL: LLDB (/Users/buildslave/jenkins/workspace/lldb-cmake-matrix/clang_900_build/bin/clang-x86_64) :: test_r4 (TestDataFormatterLibcxxStringSimulator.LibcxxStringDataFormatterSimulatorTestCase)
runCmd: settings clear -all
output: 

runCmd: settings set symbols.enable-external-lookup false
output: 

runCmd: settings set target.inherit-tcc true
output: 

runCmd: settings set target.detach-on-error false
output: 

runCmd: settings set target.auto-apply-fixits false
output: 

runCmd: settings set plugin.process.gdb-remote.packet-timeout 60
output: 

runCmd: settings set symbols.clang-modules-cache-path "/Users/buildslave/jenkins/workspace/lldb-cmake-matrix/lldb-build/lldb-test-build.noindex/module-cache-lldb/lldb-api"
output: 

runCmd: settings set use-color false
output: 

runCmd: setting set target.prefer-dynamic-value no-dynamic-values
output: 

make VPATH=/Users/buildslave/jenkins/workspace/lldb-cmake-matrix/llvm-project/lldb/test/API/functionalities/data-formatter/data-formatter-stl/libcxx/string/simulator -C /Users/buildslave/jenkins/workspace/lldb-cmake-matrix/lldb-build/lldb-test-build.noindex/functionalities/data-formatter/data-formatter-stl/libcxx/string/simulator/TestDataFormatterLibcxxStringSimulator.test_r4_ALTERNATE_LAYOUT -I /Users/buildslave/jenkins/workspace/lldb-cmake-matrix/llvm-project/lldb/test/API/functionalities/data-formatter/data-formatter-stl/libcxx/string/simulator -I /Users/buildslave/jenkins/workspace/lldb-cmake-matrix/llvm-project/lldb/packages/Python/lldbsuite/test/make -f /Users/buildslave/jenkins/workspace/lldb-cmake-matrix/llvm-project/lldb/test/API/functionalities/data-formatter/data-formatter-stl/libcxx/string/simulator/Makefile all ARCH=x86_64 'CC="/Users/buildslave/jenkins/workspace/lldb-cmake-matrix/clang_900_build/bin/clang"' DSYMUTIL=/Users/buildslave/jenkins/workspace/lldb-cmake-matrix/lldb-build/./bin/dsymutil CODESIGN=codesign CLANG_MODULE_CACHE_DIR=/Users/buildslave/jenkins/workspace/lldb-cmake-matrix/lldb-build/lldb-test-build.noindex/module-cache-clang/lldb-api USE_HERMETIC_LIBCPP=1 'CXXFLAGS_EXTRAS=-DREVISION=4 -DALTERNATE_LAYOUT'

FAIL: LLDB (/Users/buildslave/jenkins/workspace/lldb-cmake-matrix/clang_900_build/bin/clang-x86_64) :: test_r4_ALTERNATE_LAYOUT (TestDataFormatterLibcxxStringSimulator.LibcxxStringDataFormatterSimulatorTestCase)
Restore dir to: /Users/buildslave/jenkins/workspace/lldb-cmake-matrix/lldb-build/tools/lldb/test
======================================================================
ERROR: test_r0 (TestDataFormatterLibcxxStringSimulator.LibcxxStringDataFormatterSimulatorTestCase)
    partial(func, *args, **keywords) - new function with partial application
----------------------------------------------------------------------
Error when building test subject.

Build Command:
make VPATH=/Users/buildslave/jenkins/workspace/lldb-cmake-matrix/llvm-project/lldb/test/API/functionalities/data-formatter/data-formatter-stl/libcxx/string/simulator -C /Users/buildslave/jenkins/workspace/lldb-cmake-matrix/lldb-build/lldb-test-build.noindex/functionalities/data-formatter/data-formatter-stl/libcxx/string/simulator/TestDataFormatterLibcxxStringSimulator.test_r0 -I /Users/buildslave/jenkins/workspace/lldb-cmake-matrix/llvm-project/lldb/test/API/functionalities/data-formatter/data-formatter-stl/libcxx/string/simulator -I /Users/buildslave/jenkins/workspace/lldb-cmake-matrix/llvm-project/lldb/packages/Python/lldbsuite/test/make -f /Users/buildslave/jenkins/workspace/lldb-cmake-matrix/llvm-project/lldb/test/API/functionalities/data-formatter/data-formatter-stl/libcxx/string/simulator/Makefile all ARCH=x86_64 'CC="/Users/buildslave/jenkins/workspace/lldb-cmake-matrix/clang_900_build/bin/clang"' DSYMUTIL=/Users/buildslave/jenkins/workspace/lldb-cmake-matrix/lldb-build/./bin/dsymutil CODESIGN=codesign CLANG_MODULE_CACHE_DIR=/Users/buildslave/jenkins/workspace/lldb-cmake-matrix/lldb-build/lldb-test-build.noindex/module-cache-clang/lldb-api USE_HERMETIC_LIBCPP=1 CXXFLAGS_EXTRAS=-DREVISION=0

Build Command Output:
"/Users/buildslave/jenkins/workspace/lldb-cmake-matrix/clang_900_build/bin/clang"  -std=c++11 -g -O0 -isysroot "/Applications/Xcode.app/Contents/Developer/Platforms/MacOSX.platform/Developer/SDKs/MacOSX11.1.sdk" -arch x86_64  -I/Users/buildslave/jenkins/workspace/lldb-cmake-matrix/llvm-project/lldb/packages/Python/lldbsuite/test/make/../../../../../include -I/Users/buildslave/jenkins/workspace/lldb-cmake-matrix/llvm-project/lldb/test/API/functionalities/data-formatter/data-formatter-stl/libcxx/string/simulator -I/Users/buildslave/jenkins/workspace/lldb-cmake-matrix/llvm-project/lldb/packages/Python/lldbsuite/test/make -include /Users/buildslave/jenkins/workspace/lldb-cmake-matrix/llvm-project/lldb/packages/Python/lldbsuite/test/make/test_common.h  -fno-limit-debug-info    -DREVISION=0 -std=c++14 --driver-mode=g++ -MT main.o -MD -MP -MF main.d -c -o main.o /Users/buildslave/jenkins/workspace/lldb-cmake-matrix/llvm-project/lldb/test/API/functionalities/data-formatter/data-formatter-stl/libcxx/string/simulator/main.cpp
In file included from /Users/buildslave/jenkins/workspace/lldb-cmake-matrix/llvm-project/lldb/test/API/functionalities/data-formatter/data-formatter-stl/libcxx/string/simulator/main.cpp:2:
In file included from /Users/buildslave/jenkins/workspace/lldb-cmake-matrix/clang_900_build/bin/../include/c++/v1/memory:653:
In file included from /Users/buildslave/jenkins/workspace/lldb-cmake-matrix/clang_900_build/bin/../include/c++/v1/typeinfo:60:
In file included from /Users/buildslave/jenkins/workspace/lldb-cmake-matrix/clang_900_build/bin/../include/c++/v1/exception:81:
In file included from /Users/buildslave/jenkins/workspace/lldb-cmake-matrix/clang_900_build/bin/../include/c++/v1/cstdlib:85:
In file included from /Users/buildslave/jenkins/workspace/lldb-cmake-matrix/clang_900_build/bin/../include/c++/v1/stdlib.h:100:
/Users/buildslave/jenkins/workspace/lldb-cmake-matrix/clang_900_build/bin/../include/c++/v1/math.h:769:12: error: no member named 'labs' in the global namespace; did you mean 'abs'?
  return ::labs(__x);
         ~~^
/Users/buildslave/jenkins/workspace/lldb-cmake-matrix/clang_900_build/bin/../include/c++/v1/math.h:768:39: note: 'abs' declared here
inline _LIBCPP_INLINE_VISIBILITY long abs(long __x) _NOEXCEPT {
                                      ^
/Users/buildslave/jenkins/workspace/lldb-cmake-matrix/clang_900_build/bin/../include/c++/v1/math.h:773:12: error: no member named 'llabs' in the global namespace
  return ::llabs(__x);
         ~~^
/Users/buildslave/jenkins/workspace/lldb-cmake-matrix/clang_900_build/bin/../include/c++/v1/math.h:781:12: error: no member named 'fabsf' in the global namespace
  return ::fabsf(__lcpp_x);
         ~~^
/Users/buildslave/jenkins/workspace/lldb-cmake-matrix/clang_900_build/bin/../include/c++/v1/math.h:785:12: error: no member named 'fabs' in the global namespace; did you mean 'abs'?
  return ::fabs(__lcpp_x);
         ~~^
/Users/buildslave/jenkins/workspace/lldb-cmake-matrix/clang_900_build/bin/../include/c++/v1/math.h:768:39: note: 'abs' declared here
inline _LIBCPP_INLINE_VISIBILITY long abs(long __x) _NOEXCEPT {
                                      ^
/Users/buildslave/jenkins/workspace/lldb-cmake-matrix/clang_900_build/bin/../include/c++/v1/math.h:790:12: error: no member named 'fabsl' in the global namespace
  return ::fabsl(__lcpp_x);
         ~~^
/Users/buildslave/jenkins/workspace/lldb-cmake-matrix/clang_900_build/bin/../include/c++/v1/math.h:804:34: error: unknown type name 'ldiv_t'
inline _LIBCPP_INLINE_VISIBILITY ldiv_t div(long __x, long __y) _NOEXCEPT {
                                 ^
/Users/buildslave/jenkins/workspace/lldb-cmake-matrix/clang_900_build/bin/../include/c++/v1/math.h:805:12: error: no member named 'ldiv' in the global namespace
  return ::ldiv(__x, __y);
         ~~^
/Users/buildslave/jenkins/workspace/lldb-cmake-matrix/clang_900_build/bin/../include/c++/v1/math.h:808:34: error: unknown type name 'lldiv_t'
inline _LIBCPP_INLINE_VISIBILITY lldiv_t div(long long __x,
                                 ^
/Users/buildslave/jenkins/workspace/lldb-cmake-matrix/clang_900_build/bin/../include/c++/v1/math.h:810:12: error: no member named 'lldiv' in the global namespace
  return ::lldiv(__x, __y);
         ~~^
/Users/buildslave/jenkins/workspace/lldb-cmake-matrix/clang_900_build/bin/../include/c++/v1/math.h:818:93: error: no member named 'acosf' in the global namespace; did you mean 'acos'?
inline _LIBCPP_INLINE_VISIBILITY float       acos(float __lcpp_x) _NOEXCEPT       {return ::acosf(__lcpp_x);}
                                                                                          ~~^
/Users/buildslave/jenkins/workspace/lldb-cmake-matrix/clang_900_build/bin/../include/c++/v1/math.h:818:46: note: 'acos' declared here
inline _LIBCPP_INLINE_VISIBILITY float       acos(float __lcpp_x) _NOEXCEPT       {return ::acosf(__lcpp_x);}
                                             ^
/Users/buildslave/jenkins/workspace/lldb-cmake-matrix/clang_900_build/bin/../include/c++/v1/math.h:819:93: error: no member named 'acosl' in the global namespace; did you mean 'acos'?
inline _LIBCPP_INLINE_VISIBILITY long double acos(long double __lcpp_x) _NOEXCEPT {return ::acosl(__lcpp_x);}
                                                                                          ~~^
/Users/buildslave/jenkins/workspace/lldb-cmake-matrix/clang_900_build/bin/../include/c++/v1/math.h:818:46: note: 'acos' declared here
inline _LIBCPP_INLINE_VISIBILITY float       acos(float __lcpp_x) _NOEXCEPT       {return ::acosf(__lcpp_x);}
                                             ^
/Users/buildslave/jenkins/workspace/lldb-cmake-matrix/clang_900_build/bin/../include/c++/v1/math.h:825:38: error: call to 'acos' is ambiguous
acos(_A1 __lcpp_x) _NOEXCEPT {return ::acos((double)__lcpp_x);}
                                     ^~~~~~
/Users/buildslave/jenkins/workspace/lldb-cmake-matrix/clang_900_build/bin/../include/c++/v1/math.h:818:46: note: candidate function
inline _LIBCPP_INLINE_VISIBILITY float       acos(float __lcpp_x) _NOEXCEPT       {return ::acosf(__lcpp_x);}
                                             ^
/Users/buildslave/jenkins/workspace/lldb-cmake-matrix/clang_900_build/bin/../include/c++/v1/math.h:819:46: note: candidate function
inline _LIBCPP_INLINE_VISIBILITY long double acos(long double __lcpp_x) _NOEXCEPT {return ::acosl(__lcpp_x);}
                                             ^
/Users/buildslave/jenkins/workspace/lldb-cmake-matrix/clang_900_build/bin/../include/c++/v1/math.h:830:93: error: no member named 'asinf' in the global namespace; did you mean 'asin'?
inline _LIBCPP_INLINE_VISIBILITY float       asin(float __lcpp_x) _NOEXCEPT       {return ::asinf(__lcpp_x);}
                                                                                          ~~^
/Users/buildslave/jenkins/workspace/lldb-cmake-matrix/clang_900_build/bin/../include/c++/v1/math.h:830:46: note: 'asin' declared here
inline _LIBCPP_INLINE_VISIBILITY float       asin(float __lcpp_x) _NOEXCEPT       {return ::asinf(__lcpp_x);}
                                             ^
/Users/buildslave/jenkins/workspace/lldb-cmake-matrix/clang_900_build/bin/../include/c++/v1/math.h:831:93: error: no member named 'asinl' in the global namespace; did you mean 'asin'?
inline _LIBCPP_INLINE_VISIBILITY long double asin(long double __lcpp_x) _NOEXCEPT {return ::asinl(__lcpp_x);}
                                                                                          ~~^
/Users/buildslave/jenkins/workspace/lldb-cmake-matrix/clang_900_build/bin/../include/c++/v1/math.h:830:46: note: 'asin' declared here
inline _LIBCPP_INLINE_VISIBILITY float       asin(float __lcpp_x) _NOEXCEPT       {return ::asinf(__lcpp_x);}
                                             ^
/Users/buildslave/jenkins/workspace/lldb-cmake-matrix/clang_900_build/bin/../include/c++/v1/math.h:837:38: error: call to 'asin' is ambiguous
asin(_A1 __lcpp_x) _NOEXCEPT {return ::asin((double)__lcpp_x);}
                                     ^~~~~~
/Users/buildslave/jenkins/workspace/lldb-cmake-matrix/clang_900_build/bin/../include/c++/v1/math.h:830:46: note: candidate function
inline _LIBCPP_INLINE_VISIBILITY float       asin(float __lcpp_x) _NOEXCEPT       {return ::asinf(__lcpp_x);}
                                             ^
/Users/buildslave/jenkins/workspace/lldb-cmake-matrix/clang_900_build/bin/../include/c++/v1/math.h:831:46: note: candidate function
inline _LIBCPP_INLINE_VISIBILITY long double asin(long double __lcpp_x) _NOEXCEPT {return ::asinl(__lcpp_x);}
                                             ^
/Users/buildslave/jenkins/workspace/lldb-cmake-matrix/clang_900_build/bin/../include/c++/v1/math.h:842:93: error: no member named 'atanf' in the global namespace; did you mean 'atan'?
inline _LIBCPP_INLINE_VISIBILITY float       atan(float __lcpp_x) _NOEXCEPT       {return ::atanf(__lcpp_x);}
                                                                                          ~~^
/Users/buildslave/jenkins/workspace/lldb-cmake-matrix/clang_900_build/bin/../include/c++/v1/math.h:842:46: note: 'atan' declared here
inline _LIBCPP_INLINE_VISIBILITY float       atan(float __lcpp_x) _NOEXCEPT       {return ::atanf(__lcpp_x);}
                                             ^
/Users/buildslave/jenkins/workspace/lldb-cmake-matrix/clang_900_build/bin/../include/c++/v1/math.h:843:93: error: no member named 'atanl' in the global namespace; did you mean 'atan'?
inline _LIBCPP_INLINE_VISIBILITY long double atan(long double __lcpp_x) _NOEXCEPT {return ::atanl(__lcpp_x);}
                                                                                          ~~^
/Users/buildslave/jenkins/workspace/lldb-cmake-matrix/clang_900_build/bin/../include/c++/v1/math.h:842:46: note: 'atan' declared here
inline _LIBCPP_INLINE_VISIBILITY float       atan(float __lcpp_x) _NOEXCEPT       {return ::atanf(__lcpp_x);}
                                             ^
/Users/buildslave/jenkins/workspace/lldb-cmake-matrix/clang_900_build/bin/../include/c++/v1/math.h:849:38: error: call to 'atan' is ambiguous
atan(_A1 __lcpp_x) _NOEXCEPT {return ::atan((double)__lcpp_x);}
                                     ^~~~~~
/Users/buildslave/jenkins/workspace/lldb-cmake-matrix/clang_900_build/bin/../include/c++/v1/math.h:842:46: note: candidate function
inline _LIBCPP_INLINE_VISIBILITY float       atan(float __lcpp_x) _NOEXCEPT       {return ::atanf(__lcpp_x);}
                                             ^
/Users/buildslave/jenkins/workspace/lldb-cmake-matrix/clang_900_build/bin/../include/c++/v1/math.h:843:46: note: candidate function
inline _LIBCPP_INLINE_VISIBILITY long double atan(long double __lcpp_x) _NOEXCEPT {return ::atanl(__lcpp_x);}
                                             ^
/Users/buildslave/jenkins/workspace/lldb-cmake-matrix/clang_900_build/bin/../include/c++/v1/math.h:854:116: error: no member named 'atan2f' in the global namespace; did you mean 'atan2'?
inline _LIBCPP_INLINE_VISIBILITY float       atan2(float __lcpp_y, float __lcpp_x) _NOEXCEPT             {return ::atan2f(__lcpp_y, __lcpp_x);}
                                                                                                                 ~~^
/Users/buildslave/jenkins/workspace/lldb-cmake-matrix/clang_900_build/bin/../include/c++/v1/math.h:854:46: note: 'atan2' declared here
inline _LIBCPP_INLINE_VISIBILITY float       atan2(float __lcpp_y, float __lcpp_x) _NOEXCEPT             {return ::atan2f(__lcpp_y, __lcpp_x);}
                                             ^
fatal error: too many errors emitted, stopping now [-ferror-limit=]
20 errors generated.
make: *** [main.o] Error 1

Test Directory:
/Users/buildslave/jenkins/workspace/lldb-cmake-matrix/llvm-project/lldb/test/API/functionalities/data-formatter/data-formatter-stl/libcxx/string/simulator
======================================================================
ERROR: test_r0_ALTERNATE_LAYOUT (TestDataFormatterLibcxxStringSimulator.LibcxxStringDataFormatterSimulatorTestCase)
    partial(func, *args, **keywords) - new function with partial application
----------------------------------------------------------------------
Error when building test subject.

Build Command:
make VPATH=/Users/buildslave/jenkins/workspace/lldb-cmake-matrix/llvm-project/lldb/test/API/functionalities/data-formatter/data-formatter-stl/libcxx/string/simulator -C /Users/buildslave/jenkins/workspace/lldb-cmake-matrix/lldb-build/lldb-test-build.noindex/functionalities/data-formatter/data-formatter-stl/libcxx/string/simulator/TestDataFormatterLibcxxStringSimulator.test_r0_ALTERNATE_LAYOUT -I /Users/buildslave/jenkins/workspace/lldb-cmake-matrix/llvm-project/lldb/test/API/functionalities/data-formatter/data-formatter-stl/libcxx/string/simulator -I /Users/buildslave/jenkins/workspace/lldb-cmake-matrix/llvm-project/lldb/packages/Python/lldbsuite/test/make -f /Users/buildslave/jenkins/workspace/lldb-cmake-matrix/llvm-project/lldb/test/API/functionalities/data-formatter/data-formatter-stl/libcxx/string/simulator/Makefile all ARCH=x86_64 'CC="/Users/buildslave/jenkins/workspace/lldb-cmake-matrix/clang_900_build/bin/clang"' DSYMUTIL=/Users/buildslave/jenkins/workspace/lldb-cmake-matrix/lldb-build/./bin/dsymutil CODESIGN=codesign CLANG_MODULE_CACHE_DIR=/Users/buildslave/jenkins/workspace/lldb-cmake-matrix/lldb-build/lldb-test-build.noindex/module-cache-clang/lldb-api USE_HERMETIC_LIBCPP=1 'CXXFLAGS_EXTRAS=-DREVISION=0 -DALTERNATE_LAYOUT'

Build Command Output:
"/Users/buildslave/jenkins/workspace/lldb-cmake-matrix/clang_900_build/bin/clang"  -std=c++11 -g -O0 -isysroot "/Applications/Xcode.app/Contents/Developer/Platforms/MacOSX.platform/Developer/SDKs/MacOSX11.1.sdk" -arch x86_64  -I/Users/buildslave/jenkins/workspace/lldb-cmake-matrix/llvm-project/lldb/packages/Python/lldbsuite/test/make/../../../../../include -I/Users/buildslave/jenkins/workspace/lldb-cmake-matrix/llvm-project/lldb/test/API/functionalities/data-formatter/data-formatter-stl/libcxx/string/simulator -I/Users/buildslave/jenkins/workspace/lldb-cmake-matrix/llvm-project/lldb/packages/Python/lldbsuite/test/make -include /Users/buildslave/jenkins/workspace/lldb-cmake-matrix/llvm-project/lldb/packages/Python/lldbsuite/test/make/test_common.h  -fno-limit-debug-info    -DREVISION=0 -DALTERNATE_LAYOUT -std=c++14 --driver-mode=g++ -MT main.o -MD -MP -MF main.d -c -o main.o /Users/buildslave/jenkins/workspace/lldb-cmake-matrix/llvm-project/lldb/test/API/functionalities/data-formatter/data-formatter-stl/libcxx/string/simulator/main.cpp
In file included from /Users/buildslave/jenkins/workspace/lldb-cmake-matrix/llvm-project/lldb/test/API/functionalities/data-formatter/data-formatter-stl/libcxx/string/simulator/main.cpp:2:
In file included from /Users/buildslave/jenkins/workspace/lldb-cmake-matrix/clang_900_build/bin/../include/c++/v1/memory:653:
In file included from /Users/buildslave/jenkins/workspace/lldb-cmake-matrix/clang_900_build/bin/../include/c++/v1/typeinfo:60:
In file included from /Users/buildslave/jenkins/workspace/lldb-cmake-matrix/clang_900_build/bin/../include/c++/v1/exception:81:
In file included from /Users/buildslave/jenkins/workspace/lldb-cmake-matrix/clang_900_build/bin/../include/c++/v1/cstdlib:85:
In file included from /Users/buildslave/jenkins/workspace/lldb-cmake-matrix/clang_900_build/bin/../include/c++/v1/stdlib.h:100:
/Users/buildslave/jenkins/workspace/lldb-cmake-matrix/clang_900_build/bin/../include/c++/v1/math.h:769:12: error: no member named 'labs' in the global namespace; did you mean 'abs'?
  return ::labs(__x);
         ~~^
/Users/buildslave/jenkins/workspace/lldb-cmake-matrix/clang_900_build/bin/../include/c++/v1/math.h:768:39: note: 'abs' declared here
inline _LIBCPP_INLINE_VISIBILITY long abs(long __x) _NOEXCEPT {
                                      ^
/Users/buildslave/jenkins/workspace/lldb-cmake-matrix/clang_900_build/bin/../include/c++/v1/math.h:773:12: error: no member named 'llabs' in the global namespace
  return ::llabs(__x);
         ~~^
/Users/buildslave/jenkins/workspace/lldb-cmake-matrix/clang_900_build/bin/../include/c++/v1/math.h:781:12: error: no member named 'fabsf' in the global namespace
  return ::fabsf(__lcpp_x);
         ~~^
/Users/buildslave/jenkins/workspace/lldb-cmake-matrix/clang_900_build/bin/../include/c++/v1/math.h:785:12: error: no member named 'fabs' in the global namespace; did you mean 'abs'?
  return ::fabs(__lcpp_x);
         ~~^
/Users/buildslave/jenkins/workspace/lldb-cmake-matrix/clang_900_build/bin/../include/c++/v1/math.h:768:39: note: 'abs' declared here
inline _LIBCPP_INLINE_VISIBILITY long abs(long __x) _NOEXCEPT {
                                      ^
/Users/buildslave/jenkins/workspace/lldb-cmake-matrix/clang_900_build/bin/../include/c++/v1/math.h:790:12: error: no member named 'fabsl' in the global namespace
  return ::fabsl(__lcpp_x);
         ~~^
/Users/buildslave/jenkins/workspace/lldb-cmake-matrix/clang_900_build/bin/../include/c++/v1/math.h:804:34: error: unknown type name 'ldiv_t'
inline _LIBCPP_INLINE_VISIBILITY ldiv_t div(long __x, long __y) _NOEXCEPT {
                                 ^
/Users/buildslave/jenkins/workspace/lldb-cmake-matrix/clang_900_build/bin/../include/c++/v1/math.h:805:12: error: no member named 'ldiv' in the global namespace
  return ::ldiv(__x, __y);
         ~~^
/Users/buildslave/jenkins/workspace/lldb-cmake-matrix/clang_900_build/bin/../include/c++/v1/math.h:808:34: error: unknown type name 'lldiv_t'
inline _LIBCPP_INLINE_VISIBILITY lldiv_t div(long long __x,
                                 ^
/Users/buildslave/jenkins/workspace/lldb-cmake-matrix/clang_900_build/bin/../include/c++/v1/math.h:810:12: error: no member named 'lldiv' in the global namespace
  return ::lldiv(__x, __y);
         ~~^
/Users/buildslave/jenkins/workspace/lldb-cmake-matrix/clang_900_build/bin/../include/c++/v1/math.h:818:93: error: no member named 'acosf' in the global namespace; did you mean 'acos'?
inline _LIBCPP_INLINE_VISIBILITY float       acos(float __lcpp_x) _NOEXCEPT       {return ::acosf(__lcpp_x);}
                                                                                          ~~^
/Users/buildslave/jenkins/workspace/lldb-cmake-matrix/clang_900_build/bin/../include/c++/v1/math.h:818:46: note: 'acos' declared here
inline _LIBCPP_INLINE_VISIBILITY float       acos(float __lcpp_x) _NOEXCEPT       {return ::acosf(__lcpp_x);}
                                             ^
/Users/buildslave/jenkins/workspace/lldb-cmake-matrix/clang_900_build/bin/../include/c++/v1/math.h:819:93: error: no member named 'acosl' in the global namespace; did you mean 'acos'?
inline _LIBCPP_INLINE_VISIBILITY long double acos(long double __lcpp_x) _NOEXCEPT {return ::acosl(__lcpp_x);}
                                                                                          ~~^
/Users/buildslave/jenkins/workspace/lldb-cmake-matrix/clang_900_build/bin/../include/c++/v1/math.h:818:46: note: 'acos' declared here
inline _LIBCPP_INLINE_VISIBILITY float       acos(float __lcpp_x) _NOEXCEPT       {return ::acosf(__lcpp_x);}
                                             ^
/Users/buildslave/jenkins/workspace/lldb-cmake-matrix/clang_900_build/bin/../include/c++/v1/math.h:825:38: error: call to 'acos' is ambiguous
acos(_A1 __lcpp_x) _NOEXCEPT {return ::acos((double)__lcpp_x);}
                                     ^~~~~~
/Users/buildslave/jenkins/workspace/lldb-cmake-matrix/clang_900_build/bin/../include/c++/v1/math.h:818:46: note: candidate function
inline _LIBCPP_INLINE_VISIBILITY float       acos(float __lcpp_x) _NOEXCEPT       {return ::acosf(__lcpp_x);}
                                             ^
/Users/buildslave/jenkins/workspace/lldb-cmake-matrix/clang_900_build/bin/../include/c++/v1/math.h:819:46: note: candidate function
inline _LIBCPP_INLINE_VISIBILITY long double acos(long double __lcpp_x) _NOEXCEPT {return ::acosl(__lcpp_x);}
                                             ^
/Users/buildslave/jenkins/workspace/lldb-cmake-matrix/clang_900_build/bin/../include/c++/v1/math.h:830:93: error: no member named 'asinf' in the global namespace; did you mean 'asin'?
inline _LIBCPP_INLINE_VISIBILITY float       asin(float __lcpp_x) _NOEXCEPT       {return ::asinf(__lcpp_x);}
                                                                                          ~~^
/Users/buildslave/jenkins/workspace/lldb-cmake-matrix/clang_900_build/bin/../include/c++/v1/math.h:830:46: note: 'asin' declared here
inline _LIBCPP_INLINE_VISIBILITY float       asin(float __lcpp_x) _NOEXCEPT       {return ::asinf(__lcpp_x);}
                                             ^
/Users/buildslave/jenkins/workspace/lldb-cmake-matrix/clang_900_build/bin/../include/c++/v1/math.h:831:93: error: no member named 'asinl' in the global namespace; did you mean 'asin'?
inline _LIBCPP_INLINE_VISIBILITY long double asin(long double __lcpp_x) _NOEXCEPT {return ::asinl(__lcpp_x);}
                                                                                          ~~^
/Users/buildslave/jenkins/workspace/lldb-cmake-matrix/clang_900_build/bin/../include/c++/v1/math.h:830:46: note: 'asin' declared here
inline _LIBCPP_INLINE_VISIBILITY float       asin(float __lcpp_x) _NOEXCEPT       {return ::asinf(__lcpp_x);}
                                             ^
/Users/buildslave/jenkins/workspace/lldb-cmake-matrix/clang_900_build/bin/../include/c++/v1/math.h:837:38: error: call to 'asin' is ambiguous
asin(_A1 __lcpp_x) _NOEXCEPT {return ::asin((double)__lcpp_x);}
                                     ^~~~~~
/Users/buildslave/jenkins/workspace/lldb-cmake-matrix/clang_900_build/bin/../include/c++/v1/math.h:830:46: note: candidate function
inline _LIBCPP_INLINE_VISIBILITY float       asin(float __lcpp_x) _NOEXCEPT       {return ::asinf(__lcpp_x);}
                                             ^
/Users/buildslave/jenkins/workspace/lldb-cmake-matrix/clang_900_build/bin/../include/c++/v1/math.h:831:46: note: candidate function
inline _LIBCPP_INLINE_VISIBILITY long double asin(long double __lcpp_x) _NOEXCEPT {return ::asinl(__lcpp_x);}
                                             ^
/Users/buildslave/jenkins/workspace/lldb-cmake-matrix/clang_900_build/bin/../include/c++/v1/math.h:842:93: error: no member named 'atanf' in the global namespace; did you mean 'atan'?
inline _LIBCPP_INLINE_VISIBILITY float       atan(float __lcpp_x) _NOEXCEPT       {return ::atanf(__lcpp_x);}
                                                                                          ~~^
/Users/buildslave/jenkins/workspace/lldb-cmake-matrix/clang_900_build/bin/../include/c++/v1/math.h:842:46: note: 'atan' declared here
inline _LIBCPP_INLINE_VISIBILITY float       atan(float __lcpp_x) _NOEXCEPT       {return ::atanf(__lcpp_x);}
                                             ^
/Users/buildslave/jenkins/workspace/lldb-cmake-matrix/clang_900_build/bin/../include/c++/v1/math.h:843:93: error: no member named 'atanl' in the global namespace; did you mean 'atan'?
inline _LIBCPP_INLINE_VISIBILITY long double atan(long double __lcpp_x) _NOEXCEPT {return ::atanl(__lcpp_x);}
                                                                                          ~~^
/Users/buildslave/jenkins/workspace/lldb-cmake-matrix/clang_900_build/bin/../include/c++/v1/math.h:842:46: note: 'atan' declared here
inline _LIBCPP_INLINE_VISIBILITY float       atan(float __lcpp_x) _NOEXCEPT       {return ::atanf(__lcpp_x);}
                                             ^
/Users/buildslave/jenkins/workspace/lldb-cmake-matrix/clang_900_build/bin/../include/c++/v1/math.h:849:38: error: call to 'atan' is ambiguous
atan(_A1 __lcpp_x) _NOEXCEPT {return ::atan((double)__lcpp_x);}
                                     ^~~~~~
/Users/buildslave/jenkins/workspace/lldb-cmake-matrix/clang_900_build/bin/../include/c++/v1/math.h:842:46: note: candidate function
inline _LIBCPP_INLINE_VISIBILITY float       atan(float __lcpp_x) _NOEXCEPT       {return ::atanf(__lcpp_x);}
                                             ^
/Users/buildslave/jenkins/workspace/lldb-cmake-matrix/clang_900_build/bin/../include/c++/v1/math.h:843:46: note: candidate function
inline _LIBCPP_INLINE_VISIBILITY long double atan(long double __lcpp_x) _NOEXCEPT {return ::atanl(__lcpp_x);}
                                             ^
/Users/buildslave/jenkins/workspace/lldb-cmake-matrix/clang_900_build/bin/../include/c++/v1/math.h:854:116: error: no member named 'atan2f' in the global namespace; did you mean 'atan2'?
inline _LIBCPP_INLINE_VISIBILITY float       atan2(float __lcpp_y, float __lcpp_x) _NOEXCEPT             {return ::atan2f(__lcpp_y, __lcpp_x);}
                                                                                                                 ~~^
/Users/buildslave/jenkins/workspace/lldb-cmake-matrix/clang_900_build/bin/../include/c++/v1/math.h:854:46: note: 'atan2' declared here
inline _LIBCPP_INLINE_VISIBILITY float       atan2(float __lcpp_y, float __lcpp_x) _NOEXCEPT             {return ::atan2f(__lcpp_y, __lcpp_x);}
                                             ^
fatal error: too many errors emitted, stopping now [-ferror-limit=]
20 errors generated.
make: *** [main.o] Error 1

Test Directory:
/Users/buildslave/jenkins/workspace/lldb-cmake-matrix/llvm-project/lldb/test/API/functionalities/data-formatter/data-formatter-stl/libcxx/string/simulator
======================================================================
ERROR: test_r1 (TestDataFormatterLibcxxStringSimulator.LibcxxStringDataFormatterSimulatorTestCase)
    partial(func, *args, **keywords) - new function with partial application
----------------------------------------------------------------------
Error when building test subject.

Build Command:
make VPATH=/Users/buildslave/jenkins/workspace/lldb-cmake-matrix/llvm-project/lldb/test/API/functionalities/data-formatter/data-formatter-stl/libcxx/string/simulator -C /Users/buildslave/jenkins/workspace/lldb-cmake-matrix/lldb-build/lldb-test-build.noindex/functionalities/data-formatter/data-formatter-stl/libcxx/string/simulator/TestDataFormatterLibcxxStringSimulator.test_r1 -I /Users/buildslave/jenkins/workspace/lldb-cmake-matrix/llvm-project/lldb/test/API/functionalities/data-formatter/data-formatter-stl/libcxx/string/simulator -I /Users/buildslave/jenkins/workspace/lldb-cmake-matrix/llvm-project/lldb/packages/Python/lldbsuite/test/make -f /Users/buildslave/jenkins/workspace/lldb-cmake-matrix/llvm-project/lldb/test/API/functionalities/data-formatter/data-formatter-stl/libcxx/string/simulator/Makefile all ARCH=x86_64 'CC="/Users/buildslave/jenkins/workspace/lldb-cmake-matrix/clang_900_build/bin/clang"' DSYMUTIL=/Users/buildslave/jenkins/workspace/lldb-cmake-matrix/lldb-build/./bin/dsymutil CODESIGN=codesign CLANG_MODULE_CACHE_DIR=/Users/buildslave/jenkins/workspace/lldb-cmake-matrix/lldb-build/lldb-test-build.noindex/module-cache-clang/lldb-api USE_HERMETIC_LIBCPP=1 CXXFLAGS_EXTRAS=-DREVISION=1

Build Command Output:
"/Users/buildslave/jenkins/workspace/lldb-cmake-matrix/clang_900_build/bin/clang"  -std=c++11 -g -O0 -isysroot "/Applications/Xcode.app/Contents/Developer/Platforms/MacOSX.platform/Developer/SDKs/MacOSX11.1.sdk" -arch x86_64  -I/Users/buildslave/jenkins/workspace/lldb-cmake-matrix/llvm-project/lldb/packages/Python/lldbsuite/test/make/../../../../../include -I/Users/buildslave/jenkins/workspace/lldb-cmake-matrix/llvm-project/lldb/test/API/functionalities/data-formatter/data-formatter-stl/libcxx/string/simulator -I/Users/buildslave/jenkins/workspace/lldb-cmake-matrix/llvm-project/lldb/packages/Python/lldbsuite/test/make -include /Users/buildslave/jenkins/workspace/lldb-cmake-matrix/llvm-project/lldb/packages/Python/lldbsuite/test/make/test_common.h  -fno-limit-debug-info    -DREVISION=1 -std=c++14 --driver-mode=g++ -MT main.o -MD -MP -MF main.d -c -o main.o /Users/buildslave/jenkins/workspace/lldb-cmake-matrix/llvm-project/lldb/test/API/functionalities/data-formatter/data-formatter-stl/libcxx/string/simulator/main.cpp
In file included from /Users/buildslave/jenkins/workspace/lldb-cmake-matrix/llvm-project/lldb/test/API/functionalities/data-formatter/data-formatter-stl/libcxx/string/simulator/main.cpp:2:
In file included from /Users/buildslave/jenkins/workspace/lldb-cmake-matrix/clang_900_build/bin/../include/c++/v1/memory:653:
In file included from /Users/buildslave/jenkins/workspace/lldb-cmake-matrix/clang_900_build/bin/../include/c++/v1/typeinfo:60:
In file included from /Users/buildslave/jenkins/workspace/lldb-cmake-matrix/clang_900_build/bin/../include/c++/v1/exception:81:
In file included from /Users/buildslave/jenkins/workspace/lldb-cmake-matrix/clang_900_build/bin/../include/c++/v1/cstdlib:85:
In file included from /Users/buildslave/jenkins/workspace/lldb-cmake-matrix/clang_900_build/bin/../include/c++/v1/stdlib.h:100:
/Users/buildslave/jenkins/workspace/lldb-cmake-matrix/clang_900_build/bin/../include/c++/v1/math.h:769:12: error: no member named 'labs' in the global namespace; did you mean 'abs'?
  return ::labs(__x);
         ~~^
/Users/buildslave/jenkins/workspace/lldb-cmake-matrix/clang_900_build/bin/../include/c++/v1/math.h:768:39: note: 'abs' declared here
inline _LIBCPP_INLINE_VISIBILITY long abs(long __x) _NOEXCEPT {
                                      ^
/Users/buildslave/jenkins/workspace/lldb-cmake-matrix/clang_900_build/bin/../include/c++/v1/math.h:773:12: error: no member named 'llabs' in the global namespace
  return ::llabs(__x);
         ~~^
/Users/buildslave/jenkins/workspace/lldb-cmake-matrix/clang_900_build/bin/../include/c++/v1/math.h:781:12: error: no member named 'fabsf' in the global namespace
  return ::fabsf(__lcpp_x);
         ~~^
/Users/buildslave/jenkins/workspace/lldb-cmake-matrix/clang_900_build/bin/../include/c++/v1/math.h:785:12: error: no member named 'fabs' in the global namespace; did you mean 'abs'?
  return ::fabs(__lcpp_x);
         ~~^
/Users/buildslave/jenkins/workspace/lldb-cmake-matrix/clang_900_build/bin/../include/c++/v1/math.h:768:39: note: 'abs' declared here
inline _LIBCPP_INLINE_VISIBILITY long abs(long __x) _NOEXCEPT {
                                      ^
/Users/buildslave/jenkins/workspace/lldb-cmake-matrix/clang_900_build/bin/../include/c++/v1/math.h:790:12: error: no member named 'fabsl' in the global namespace
  return ::fabsl(__lcpp_x);
         ~~^
/Users/buildslave/jenkins/workspace/lldb-cmake-matrix/clang_900_build/bin/../include/c++/v1/math.h:804:34: error: unknown type name 'ldiv_t'
inline _LIBCPP_INLINE_VISIBILITY ldiv_t div(long __x, long __y) _NOEXCEPT {
                                 ^
/Users/buildslave/jenkins/workspace/lldb-cmake-matrix/clang_900_build/bin/../include/c++/v1/math.h:805:12: error: no member named 'ldiv' in the global namespace
  return ::ldiv(__x, __y);
         ~~^
/Users/buildslave/jenkins/workspace/lldb-cmake-matrix/clang_900_build/bin/../include/c++/v1/math.h:808:34: error: unknown type name 'lldiv_t'
inline _LIBCPP_INLINE_VISIBILITY lldiv_t div(long long __x,
                                 ^
/Users/buildslave/jenkins/workspace/lldb-cmake-matrix/clang_900_build/bin/../include/c++/v1/math.h:810:12: error: no member named 'lldiv' in the global namespace
  return ::lldiv(__x, __y);
         ~~^
/Users/buildslave/jenkins/workspace/lldb-cmake-matrix/clang_900_build/bin/../include/c++/v1/math.h:818:93: error: no member named 'acosf' in the global namespace; did you mean 'acos'?
inline _LIBCPP_INLINE_VISIBILITY float       acos(float __lcpp_x) _NOEXCEPT       {return ::acosf(__lcpp_x);}
                                                                                          ~~^
/Users/buildslave/jenkins/workspace/lldb-cmake-matrix/clang_900_build/bin/../include/c++/v1/math.h:818:46: note: 'acos' declared here
inline _LIBCPP_INLINE_VISIBILITY float       acos(float __lcpp_x) _NOEXCEPT       {return ::acosf(__lcpp_x);}
                                             ^
/Users/buildslave/jenkins/workspace/lldb-cmake-matrix/clang_900_build/bin/../include/c++/v1/math.h:819:93: error: no member named 'acosl' in the global namespace; did you mean 'acos'?
inline _LIBCPP_INLINE_VISIBILITY long double acos(long double __lcpp_x) _NOEXCEPT {return ::acosl(__lcpp_x);}
                                                                                          ~~^
/Users/buildslave/jenkins/workspace/lldb-cmake-matrix/clang_900_build/bin/../include/c++/v1/math.h:818:46: note: 'acos' declared here
inline _LIBCPP_INLINE_VISIBILITY float       acos(float __lcpp_x) _NOEXCEPT       {return ::acosf(__lcpp_x);}
                                             ^
/Users/buildslave/jenkins/workspace/lldb-cmake-matrix/clang_900_build/bin/../include/c++/v1/math.h:825:38: error: call to 'acos' is ambiguous
acos(_A1 __lcpp_x) _NOEXCEPT {return ::acos((double)__lcpp_x);}
                                     ^~~~~~
/Users/buildslave/jenkins/workspace/lldb-cmake-matrix/clang_900_build/bin/../include/c++/v1/math.h:818:46: note: candidate function
inline _LIBCPP_INLINE_VISIBILITY float       acos(float __lcpp_x) _NOEXCEPT       {return ::acosf(__lcpp_x);}
                                             ^
/Users/buildslave/jenkins/workspace/lldb-cmake-matrix/clang_900_build/bin/../include/c++/v1/math.h:819:46: note: candidate function
inline _LIBCPP_INLINE_VISIBILITY long double acos(long double __lcpp_x) _NOEXCEPT {return ::acosl(__lcpp_x);}
                                             ^
/Users/buildslave/jenkins/workspace/lldb-cmake-matrix/clang_900_build/bin/../include/c++/v1/math.h:830:93: error: no member named 'asinf' in the global namespace; did you mean 'asin'?
inline _LIBCPP_INLINE_VISIBILITY float       asin(float __lcpp_x) _NOEXCEPT       {return ::asinf(__lcpp_x);}
                                                                                          ~~^
/Users/buildslave/jenkins/workspace/lldb-cmake-matrix/clang_900_build/bin/../include/c++/v1/math.h:830:46: note: 'asin' declared here
inline _LIBCPP_INLINE_VISIBILITY float       asin(float __lcpp_x) _NOEXCEPT       {return ::asinf(__lcpp_x);}
                                             ^
/Users/buildslave/jenkins/workspace/lldb-cmake-matrix/clang_900_build/bin/../include/c++/v1/math.h:831:93: error: no member named 'asinl' in the global namespace; did you mean 'asin'?
inline _LIBCPP_INLINE_VISIBILITY long double asin(long double __lcpp_x) _NOEXCEPT {return ::asinl(__lcpp_x);}
                                                                                          ~~^
/Users/buildslave/jenkins/workspace/lldb-cmake-matrix/clang_900_build/bin/../include/c++/v1/math.h:830:46: note: 'asin' declared here
inline _LIBCPP_INLINE_VISIBILITY float       asin(float __lcpp_x) _NOEXCEPT       {return ::asinf(__lcpp_x);}
                                             ^
/Users/buildslave/jenkins/workspace/lldb-cmake-matrix/clang_900_build/bin/../include/c++/v1/math.h:837:38: error: call to 'asin' is ambiguous
asin(_A1 __lcpp_x) _NOEXCEPT {return ::asin((double)__lcpp_x);}
                                     ^~~~~~
/Users/buildslave/jenkins/workspace/lldb-cmake-matrix/clang_900_build/bin/../include/c++/v1/math.h:830:46: note: candidate function
inline _LIBCPP_INLINE_VISIBILITY float       asin(float __lcpp_x) _NOEXCEPT       {return ::asinf(__lcpp_x);}
                                             ^
/Users/buildslave/jenkins/workspace/lldb-cmake-matrix/clang_900_build/bin/../include/c++/v1/math.h:831:46: note: candidate function
inline _LIBCPP_INLINE_VISIBILITY long double asin(long double __lcpp_x) _NOEXCEPT {return ::asinl(__lcpp_x);}
                                             ^
/Users/buildslave/jenkins/workspace/lldb-cmake-matrix/clang_900_build/bin/../include/c++/v1/math.h:842:93: error: no member named 'atanf' in the global namespace; did you mean 'atan'?
inline _LIBCPP_INLINE_VISIBILITY float       atan(float __lcpp_x) _NOEXCEPT       {return ::atanf(__lcpp_x);}
                                                                                          ~~^
/Users/buildslave/jenkins/workspace/lldb-cmake-matrix/clang_900_build/bin/../include/c++/v1/math.h:842:46: note: 'atan' declared here
inline _LIBCPP_INLINE_VISIBILITY float       atan(float __lcpp_x) _NOEXCEPT       {return ::atanf(__lcpp_x);}
                                             ^
/Users/buildslave/jenkins/workspace/lldb-cmake-matrix/clang_900_build/bin/../include/c++/v1/math.h:843:93: error: no member named 'atanl' in the global namespace; did you mean 'atan'?
inline _LIBCPP_INLINE_VISIBILITY long double atan(long double __lcpp_x) _NOEXCEPT {return ::atanl(__lcpp_x);}
                                                                                          ~~^
/Users/buildslave/jenkins/workspace/lldb-cmake-matrix/clang_900_build/bin/../include/c++/v1/math.h:842:46: note: 'atan' declared here
inline _LIBCPP_INLINE_VISIBILITY float       atan(float __lcpp_x) _NOEXCEPT       {return ::atanf(__lcpp_x);}
                                             ^
/Users/buildslave/jenkins/workspace/lldb-cmake-matrix/clang_900_build/bin/../include/c++/v1/math.h:849:38: error: call to 'atan' is ambiguous
atan(_A1 __lcpp_x) _NOEXCEPT {return ::atan((double)__lcpp_x);}
                                     ^~~~~~
/Users/buildslave/jenkins/workspace/lldb-cmake-matrix/clang_900_build/bin/../include/c++/v1/math.h:842:46: note: candidate function
inline _LIBCPP_INLINE_VISIBILITY float       atan(float __lcpp_x) _NOEXCEPT       {return ::atanf(__lcpp_x);}
                                             ^
/Users/buildslave/jenkins/workspace/lldb-cmake-matrix/clang_900_build/bin/../include/c++/v1/math.h:843:46: note: candidate function
inline _LIBCPP_INLINE_VISIBILITY long double atan(long double __lcpp_x) _NOEXCEPT {return ::atanl(__lcpp_x);}
                                             ^
/Users/buildslave/jenkins/workspace/lldb-cmake-matrix/clang_900_build/bin/../include/c++/v1/math.h:854:116: error: no member named 'atan2f' in the global namespace; did you mean 'atan2'?
inline _LIBCPP_INLINE_VISIBILITY float       atan2(float __lcpp_y, float __lcpp_x) _NOEXCEPT             {return ::atan2f(__lcpp_y, __lcpp_x);}
                                                                                                                 ~~^
/Users/buildslave/jenkins/workspace/lldb-cmake-matrix/clang_900_build/bin/../include/c++/v1/math.h:854:46: note: 'atan2' declared here
inline _LIBCPP_INLINE_VISIBILITY float       atan2(float __lcpp_y, float __lcpp_x) _NOEXCEPT             {return ::atan2f(__lcpp_y, __lcpp_x);}
                                             ^
fatal error: too many errors emitted, stopping now [-ferror-limit=]
20 errors generated.
make: *** [main.o] Error 1

Test Directory:
/Users/buildslave/jenkins/workspace/lldb-cmake-matrix/llvm-project/lldb/test/API/functionalities/data-formatter/data-formatter-stl/libcxx/string/simulator
======================================================================
ERROR: test_r1_ALTERNATE_LAYOUT (TestDataFormatterLibcxxStringSimulator.LibcxxStringDataFormatterSimulatorTestCase)
    partial(func, *args, **keywords) - new function with partial application
----------------------------------------------------------------------
Error when building test subject.

Build Command:
make VPATH=/Users/buildslave/jenkins/workspace/lldb-cmake-matrix/llvm-project/lldb/test/API/functionalities/data-formatter/data-formatter-stl/libcxx/string/simulator -C /Users/buildslave/jenkins/workspace/lldb-cmake-matrix/lldb-build/lldb-test-build.noindex/functionalities/data-formatter/data-formatter-stl/libcxx/string/simulator/TestDataFormatterLibcxxStringSimulator.test_r1_ALTERNATE_LAYOUT -I /Users/buildslave/jenkins/workspace/lldb-cmake-matrix/llvm-project/lldb/test/API/functionalities/data-formatter/data-formatter-stl/libcxx/string/simulator -I /Users/buildslave/jenkins/workspace/lldb-cmake-matrix/llvm-project/lldb/packages/Python/lldbsuite/test/make -f /Users/buildslave/jenkins/workspace/lldb-cmake-matrix/llvm-project/lldb/test/API/functionalities/data-formatter/data-formatter-stl/libcxx/string/simulator/Makefile all ARCH=x86_64 'CC="/Users/buildslave/jenkins/workspace/lldb-cmake-matrix/clang_900_build/bin/clang"' DSYMUTIL=/Users/buildslave/jenkins/workspace/lldb-cmake-matrix/lldb-build/./bin/dsymutil CODESIGN=codesign CLANG_MODULE_CACHE_DIR=/Users/buildslave/jenkins/workspace/lldb-cmake-matrix/lldb-build/lldb-test-build.noindex/module-cache-clang/lldb-api USE_HERMETIC_LIBCPP=1 'CXXFLAGS_EXTRAS=-DREVISION=1 -DALTERNATE_LAYOUT'

Build Command Output:
"/Users/buildslave/jenkins/workspace/lldb-cmake-matrix/clang_900_build/bin/clang"  -std=c++11 -g -O0 -isysroot "/Applications/Xcode.app/Contents/Developer/Platforms/MacOSX.platform/Developer/SDKs/MacOSX11.1.sdk" -arch x86_64  -I/Users/buildslave/jenkins/workspace/lldb-cmake-matrix/llvm-project/lldb/packages/Python/lldbsuite/test/make/../../../../../include -I/Users/buildslave/jenkins/workspace/lldb-cmake-matrix/llvm-project/lldb/test/API/functionalities/data-formatter/data-formatter-stl/libcxx/string/simulator -I/Users/buildslave/jenkins/workspace/lldb-cmake-matrix/llvm-project/lldb/packages/Python/lldbsuite/test/make -include /Users/buildslave/jenkins/workspace/lldb-cmake-matrix/llvm-project/lldb/packages/Python/lldbsuite/test/make/test_common.h  -fno-limit-debug-info    -DREVISION=1 -DALTERNATE_LAYOUT -std=c++14 --driver-mode=g++ -MT main.o -MD -MP -MF main.d -c -o main.o /Users/buildslave/jenkins/workspace/lldb-cmake-matrix/llvm-project/lldb/test/API/functionalities/data-formatter/data-formatter-stl/libcxx/string/simulator/main.cpp
In file included from /Users/buildslave/jenkins/workspace/lldb-cmake-matrix/llvm-project/lldb/test/API/functionalities/data-formatter/data-formatter-stl/libcxx/string/simulator/main.cpp:2:
In file included from /Users/buildslave/jenkins/workspace/lldb-cmake-matrix/clang_900_build/bin/../include/c++/v1/memory:653:
In file included from /Users/buildslave/jenkins/workspace/lldb-cmake-matrix/clang_900_build/bin/../include/c++/v1/typeinfo:60:
In file included from /Users/buildslave/jenkins/workspace/lldb-cmake-matrix/clang_900_build/bin/../include/c++/v1/exception:81:
In file included from /Users/buildslave/jenkins/workspace/lldb-cmake-matrix/clang_900_build/bin/../include/c++/v1/cstdlib:85:
In file included from /Users/buildslave/jenkins/workspace/lldb-cmake-matrix/clang_900_build/bin/../include/c++/v1/stdlib.h:100:
/Users/buildslave/jenkins/workspace/lldb-cmake-matrix/clang_900_build/bin/../include/c++/v1/math.h:769:12: error: no member named 'labs' in the global namespace; did you mean 'abs'?
  return ::labs(__x);
         ~~^
/Users/buildslave/jenkins/workspace/lldb-cmake-matrix/clang_900_build/bin/../include/c++/v1/math.h:768:39: note: 'abs' declared here
inline _LIBCPP_INLINE_VISIBILITY long abs(long __x) _NOEXCEPT {
                                      ^
/Users/buildslave/jenkins/workspace/lldb-cmake-matrix/clang_900_build/bin/../include/c++/v1/math.h:773:12: error: no member named 'llabs' in the global namespace
  return ::llabs(__x);
         ~~^
/Users/buildslave/jenkins/workspace/lldb-cmake-matrix/clang_900_build/bin/../include/c++/v1/math.h:781:12: error: no member named 'fabsf' in the global namespace
  return ::fabsf(__lcpp_x);
         ~~^
/Users/buildslave/jenkins/workspace/lldb-cmake-matrix/clang_900_build/bin/../include/c++/v1/math.h:785:12: error: no member named 'fabs' in the global namespace; did you mean 'abs'?
  return ::fabs(__lcpp_x);
         ~~^
/Users/buildslave/jenkins/workspace/lldb-cmake-matrix/clang_900_build/bin/../include/c++/v1/math.h:768:39: note: 'abs' declared here
inline _LIBCPP_INLINE_VISIBILITY long abs(long __x) _NOEXCEPT {
                                      ^
/Users/buildslave/jenkins/workspace/lldb-cmake-matrix/clang_900_build/bin/../include/c++/v1/math.h:790:12: error: no member named 'fabsl' in the global namespace
  return ::fabsl(__lcpp_x);
         ~~^
/Users/buildslave/jenkins/workspace/lldb-cmake-matrix/clang_900_build/bin/../include/c++/v1/math.h:804:34: error: unknown type name 'ldiv_t'
inline _LIBCPP_INLINE_VISIBILITY ldiv_t div(long __x, long __y) _NOEXCEPT {
                                 ^
/Users/buildslave/jenkins/workspace/lldb-cmake-matrix/clang_900_build/bin/../include/c++/v1/math.h:805:12: error: no member named 'ldiv' in the global namespace
  return ::ldiv(__x, __y);
         ~~^
/Users/buildslave/jenkins/workspace/lldb-cmake-matrix/clang_900_build/bin/../include/c++/v1/math.h:808:34: error: unknown type name 'lldiv_t'
inline _LIBCPP_INLINE_VISIBILITY lldiv_t div(long long __x,
                                 ^
/Users/buildslave/jenkins/workspace/lldb-cmake-matrix/clang_900_build/bin/../include/c++/v1/math.h:810:12: error: no member named 'lldiv' in the global namespace
  return ::lldiv(__x, __y);
         ~~^
/Users/buildslave/jenkins/workspace/lldb-cmake-matrix/clang_900_build/bin/../include/c++/v1/math.h:818:93: error: no member named 'acosf' in the global namespace; did you mean 'acos'?
inline _LIBCPP_INLINE_VISIBILITY float       acos(float __lcpp_x) _NOEXCEPT       {return ::acosf(__lcpp_x);}
                                                                                          ~~^
/Users/buildslave/jenkins/workspace/lldb-cmake-matrix/clang_900_build/bin/../include/c++/v1/math.h:818:46: note: 'acos' declared here
inline _LIBCPP_INLINE_VISIBILITY float       acos(float __lcpp_x) _NOEXCEPT       {return ::acosf(__lcpp_x);}
                                             ^
/Users/buildslave/jenkins/workspace/lldb-cmake-matrix/clang_900_build/bin/../include/c++/v1/math.h:819:93: error: no member named 'acosl' in the global namespace; did you mean 'acos'?
inline _LIBCPP_INLINE_VISIBILITY long double acos(long double __lcpp_x) _NOEXCEPT {return ::acosl(__lcpp_x);}
                                                                                          ~~^
/Users/buildslave/jenkins/workspace/lldb-cmake-matrix/clang_900_build/bin/../include/c++/v1/math.h:818:46: note: 'acos' declared here
inline _LIBCPP_INLINE_VISIBILITY float       acos(float __lcpp_x) _NOEXCEPT       {return ::acosf(__lcpp_x);}
                                             ^
/Users/buildslave/jenkins/workspace/lldb-cmake-matrix/clang_900_build/bin/../include/c++/v1/math.h:825:38: error: call to 'acos' is ambiguous
acos(_A1 __lcpp_x) _NOEXCEPT {return ::acos((double)__lcpp_x);}
                                     ^~~~~~
/Users/buildslave/jenkins/workspace/lldb-cmake-matrix/clang_900_build/bin/../include/c++/v1/math.h:818:46: note: candidate function
inline _LIBCPP_INLINE_VISIBILITY float       acos(float __lcpp_x) _NOEXCEPT       {return ::acosf(__lcpp_x);}
                                             ^
/Users/buildslave/jenkins/workspace/lldb-cmake-matrix/clang_900_build/bin/../include/c++/v1/math.h:819:46: note: candidate function
inline _LIBCPP_INLINE_VISIBILITY long double acos(long double __lcpp_x) _NOEXCEPT {return ::acosl(__lcpp_x);}
                                             ^
/Users/buildslave/jenkins/workspace/lldb-cmake-matrix/clang_900_build/bin/../include/c++/v1/math.h:830:93: error: no member named 'asinf' in the global namespace; did you mean 'asin'?
inline _LIBCPP_INLINE_VISIBILITY float       asin(float __lcpp_x) _NOEXCEPT       {return ::asinf(__lcpp_x);}
                                                                                          ~~^
/Users/buildslave/jenkins/workspace/lldb-cmake-matrix/clang_900_build/bin/../include/c++/v1/math.h:830:46: note: 'asin' declared here
inline _LIBCPP_INLINE_VISIBILITY float       asin(float __lcpp_x) _NOEXCEPT       {return ::asinf(__lcpp_x);}
                                             ^
/Users/buildslave/jenkins/workspace/lldb-cmake-matrix/clang_900_build/bin/../include/c++/v1/math.h:831:93: error: no member named 'asinl' in the global namespace; did you mean 'asin'?
inline _LIBCPP_INLINE_VISIBILITY long double asin(long double __lcpp_x) _NOEXCEPT {return ::asinl(__lcpp_x);}
                                                                                          ~~^
/Users/buildslave/jenkins/workspace/lldb-cmake-matrix/clang_900_build/bin/../include/c++/v1/math.h:830:46: note: 'asin' declared here
inline _LIBCPP_INLINE_VISIBILITY float       asin(float __lcpp_x) _NOEXCEPT       {return ::asinf(__lcpp_x);}
                                             ^
/Users/buildslave/jenkins/workspace/lldb-cmake-matrix/clang_900_build/bin/../include/c++/v1/math.h:837:38: error: call to 'asin' is ambiguous
asin(_A1 __lcpp_x) _NOEXCEPT {return ::asin((double)__lcpp_x);}
                                     ^~~~~~
/Users/buildslave/jenkins/workspace/lldb-cmake-matrix/clang_900_build/bin/../include/c++/v1/math.h:830:46: note: candidate function
inline _LIBCPP_INLINE_VISIBILITY float       asin(float __lcpp_x) _NOEXCEPT       {return ::asinf(__lcpp_x);}
                                             ^
/Users/buildslave/jenkins/workspace/lldb-cmake-matrix/clang_900_build/bin/../include/c++/v1/math.h:831:46: note: candidate function
inline _LIBCPP_INLINE_VISIBILITY long double asin(long double __lcpp_x) _NOEXCEPT {return ::asinl(__lcpp_x);}
                                             ^
/Users/buildslave/jenkins/workspace/lldb-cmake-matrix/clang_900_build/bin/../include/c++/v1/math.h:842:93: error: no member named 'atanf' in the global namespace; did you mean 'atan'?
inline _LIBCPP_INLINE_VISIBILITY float       atan(float __lcpp_x) _NOEXCEPT       {return ::atanf(__lcpp_x);}
                                                                                          ~~^
/Users/buildslave/jenkins/workspace/lldb-cmake-matrix/clang_900_build/bin/../include/c++/v1/math.h:842:46: note: 'atan' declared here
inline _LIBCPP_INLINE_VISIBILITY float       atan(float __lcpp_x) _NOEXCEPT       {return ::atanf(__lcpp_x);}
                                             ^
/Users/buildslave/jenkins/workspace/lldb-cmake-matrix/clang_900_build/bin/../include/c++/v1/math.h:843:93: error: no member named 'atanl' in the global namespace; did you mean 'atan'?
inline _LIBCPP_INLINE_VISIBILITY long double atan(long double __lcpp_x) _NOEXCEPT {return ::atanl(__lcpp_x);}
                                                                                          ~~^
/Users/buildslave/jenkins/workspace/lldb-cmake-matrix/clang_900_build/bin/../include/c++/v1/math.h:842:46: note: 'atan' declared here
inline _LIBCPP_INLINE_VISIBILITY float       atan(float __lcpp_x) _NOEXCEPT       {return ::atanf(__lcpp_x);}
                                             ^
/Users/buildslave/jenkins/workspace/lldb-cmake-matrix/clang_900_build/bin/../include/c++/v1/math.h:849:38: error: call to 'atan' is ambiguous
atan(_A1 __lcpp_x) _NOEXCEPT {return ::atan((double)__lcpp_x);}
                                     ^~~~~~
/Users/buildslave/jenkins/workspace/lldb-cmake-matrix/clang_900_build/bin/../include/c++/v1/math.h:842:46: note: candidate function
inline _LIBCPP_INLINE_VISIBILITY float       atan(float __lcpp_x) _NOEXCEPT       {return ::atanf(__lcpp_x);}
                                             ^
/Users/buildslave/jenkins/workspace/lldb-cmake-matrix/clang_900_build/bin/../include/c++/v1/math.h:843:46: note: candidate function
inline _LIBCPP_INLINE_VISIBILITY long double atan(long double __lcpp_x) _NOEXCEPT {return ::atanl(__lcpp_x);}
                                             ^
/Users/buildslave/jenkins/workspace/lldb-cmake-matrix/clang_900_build/bin/../include/c++/v1/math.h:854:116: error: no member named 'atan2f' in the global namespace; did you mean 'atan2'?
inline _LIBCPP_INLINE_VISIBILITY float       atan2(float __lcpp_y, float __lcpp_x) _NOEXCEPT             {return ::atan2f(__lcpp_y, __lcpp_x);}
                                                                                                                 ~~^
/Users/buildslave/jenkins/workspace/lldb-cmake-matrix/clang_900_build/bin/../include/c++/v1/math.h:854:46: note: 'atan2' declared here
inline _LIBCPP_INLINE_VISIBILITY float       atan2(float __lcpp_y, float __lcpp_x) _NOEXCEPT             {return ::atan2f(__lcpp_y, __lcpp_x);}
                                             ^
fatal error: too many errors emitted, stopping now [-ferror-limit=]
20 errors generated.
make: *** [main.o] Error 1

Test Directory:
/Users/buildslave/jenkins/workspace/lldb-cmake-matrix/llvm-project/lldb/test/API/functionalities/data-formatter/data-formatter-stl/libcxx/string/simulator
======================================================================
ERROR: test_r2 (TestDataFormatterLibcxxStringSimulator.LibcxxStringDataFormatterSimulatorTestCase)
    partial(func, *args, **keywords) - new function with partial application
----------------------------------------------------------------------
Error when building test subject.

Build Command:
make VPATH=/Users/buildslave/jenkins/workspace/lldb-cmake-matrix/llvm-project/lldb/test/API/functionalities/data-formatter/data-formatter-stl/libcxx/string/simulator -C /Users/buildslave/jenkins/workspace/lldb-cmake-matrix/lldb-build/lldb-test-build.noindex/functionalities/data-formatter/data-formatter-stl/libcxx/string/simulator/TestDataFormatterLibcxxStringSimulator.test_r2 -I /Users/buildslave/jenkins/workspace/lldb-cmake-matrix/llvm-project/lldb/test/API/functionalities/data-formatter/data-formatter-stl/libcxx/string/simulator -I /Users/buildslave/jenkins/workspace/lldb-cmake-matrix/llvm-project/lldb/packages/Python/lldbsuite/test/make -f /Users/buildslave/jenkins/workspace/lldb-cmake-matrix/llvm-project/lldb/test/API/functionalities/data-formatter/data-formatter-stl/libcxx/string/simulator/Makefile all ARCH=x86_64 'CC="/Users/buildslave/jenkins/workspace/lldb-cmake-matrix/clang_900_build/bin/clang"' DSYMUTIL=/Users/buildslave/jenkins/workspace/lldb-cmake-matrix/lldb-build/./bin/dsymutil CODESIGN=codesign CLANG_MODULE_CACHE_DIR=/Users/buildslave/jenkins/workspace/lldb-cmake-matrix/lldb-build/lldb-test-build.noindex/module-cache-clang/lldb-api USE_HERMETIC_LIBCPP=1 CXXFLAGS_EXTRAS=-DREVISION=2

Build Command Output:
"/Users/buildslave/jenkins/workspace/lldb-cmake-matrix/clang_900_build/bin/clang"  -std=c++11 -g -O0 -isysroot "/Applications/Xcode.app/Contents/Developer/Platforms/MacOSX.platform/Developer/SDKs/MacOSX11.1.sdk" -arch x86_64  -I/Users/buildslave/jenkins/workspace/lldb-cmake-matrix/llvm-project/lldb/packages/Python/lldbsuite/test/make/../../../../../include -I/Users/buildslave/jenkins/workspace/lldb-cmake-matrix/llvm-project/lldb/test/API/functionalities/data-formatter/data-formatter-stl/libcxx/string/simulator -I/Users/buildslave/jenkins/workspace/lldb-cmake-matrix/llvm-project/lldb/packages/Python/lldbsuite/test/make -include /Users/buildslave/jenkins/workspace/lldb-cmake-matrix/llvm-project/lldb/packages/Python/lldbsuite/test/make/test_common.h  -fno-limit-debug-info    -DREVISION=2 -std=c++14 --driver-mode=g++ -MT main.o -MD -MP -MF main.d -c -o main.o /Users/buildslave/jenkins/workspace/lldb-cmake-matrix/llvm-project/lldb/test/API/functionalities/data-formatter/data-formatter-stl/libcxx/string/simulator/main.cpp
In file included from /Users/buildslave/jenkins/workspace/lldb-cmake-matrix/llvm-project/lldb/test/API/functionalities/data-formatter/data-formatter-stl/libcxx/string/simulator/main.cpp:2:
In file included from /Users/buildslave/jenkins/workspace/lldb-cmake-matrix/clang_900_build/bin/../include/c++/v1/memory:653:
In file included from /Users/buildslave/jenkins/workspace/lldb-cmake-matrix/clang_900_build/bin/../include/c++/v1/typeinfo:60:
In file included from /Users/buildslave/jenkins/workspace/lldb-cmake-matrix/clang_900_build/bin/../include/c++/v1/exception:81:
In file included from /Users/buildslave/jenkins/workspace/lldb-cmake-matrix/clang_900_build/bin/../include/c++/v1/cstdlib:85:
In file included from /Users/buildslave/jenkins/workspace/lldb-cmake-matrix/clang_900_build/bin/../include/c++/v1/stdlib.h:100:
/Users/buildslave/jenkins/workspace/lldb-cmake-matrix/clang_900_build/bin/../include/c++/v1/math.h:769:12: error: no member named 'labs' in the global namespace; did you mean 'abs'?
  return ::labs(__x);
         ~~^
/Users/buildslave/jenkins/workspace/lldb-cmake-matrix/clang_900_build/bin/../include/c++/v1/math.h:768:39: note: 'abs' declared here
inline _LIBCPP_INLINE_VISIBILITY long abs(long __x) _NOEXCEPT {
                                      ^
/Users/buildslave/jenkins/workspace/lldb-cmake-matrix/clang_900_build/bin/../include/c++/v1/math.h:773:12: error: no member named 'llabs' in the global namespace
  return ::llabs(__x);
         ~~^
/Users/buildslave/jenkins/workspace/lldb-cmake-matrix/clang_900_build/bin/../include/c++/v1/math.h:781:12: error: no member named 'fabsf' in the global namespace
  return ::fabsf(__lcpp_x);
         ~~^
/Users/buildslave/jenkins/workspace/lldb-cmake-matrix/clang_900_build/bin/../include/c++/v1/math.h:785:12: error: no member named 'fabs' in the global namespace; did you mean 'abs'?
  return ::fabs(__lcpp_x);
         ~~^
/Users/buildslave/jenkins/workspace/lldb-cmake-matrix/clang_900_build/bin/../include/c++/v1/math.h:768:39: note: 'abs' declared here
inline _LIBCPP_INLINE_VISIBILITY long abs(long __x) _NOEXCEPT {
                                      ^
/Users/buildslave/jenkins/workspace/lldb-cmake-matrix/clang_900_build/bin/../include/c++/v1/math.h:790:12: error: no member named 'fabsl' in the global namespace
  return ::fabsl(__lcpp_x);
         ~~^
/Users/buildslave/jenkins/workspace/lldb-cmake-matrix/clang_900_build/bin/../include/c++/v1/math.h:804:34: error: unknown type name 'ldiv_t'
inline _LIBCPP_INLINE_VISIBILITY ldiv_t div(long __x, long __y) _NOEXCEPT {
                                 ^
/Users/buildslave/jenkins/workspace/lldb-cmake-matrix/clang_900_build/bin/../include/c++/v1/math.h:805:12: error: no member named 'ldiv' in the global namespace
  return ::ldiv(__x, __y);
         ~~^
/Users/buildslave/jenkins/workspace/lldb-cmake-matrix/clang_900_build/bin/../include/c++/v1/math.h:808:34: error: unknown type name 'lldiv_t'
inline _LIBCPP_INLINE_VISIBILITY lldiv_t div(long long __x,
                                 ^
/Users/buildslave/jenkins/workspace/lldb-cmake-matrix/clang_900_build/bin/../include/c++/v1/math.h:810:12: error: no member named 'lldiv' in the global namespace
  return ::lldiv(__x, __y);
         ~~^
/Users/buildslave/jenkins/workspace/lldb-cmake-matrix/clang_900_build/bin/../include/c++/v1/math.h:818:93: error: no member named 'acosf' in the global namespace; did you mean 'acos'?
inline _LIBCPP_INLINE_VISIBILITY float       acos(float __lcpp_x) _NOEXCEPT       {return ::acosf(__lcpp_x);}
                                                                                          ~~^
/Users/buildslave/jenkins/workspace/lldb-cmake-matrix/clang_900_build/bin/../include/c++/v1/math.h:818:46: note: 'acos' declared here
inline _LIBCPP_INLINE_VISIBILITY float       acos(float __lcpp_x) _NOEXCEPT       {return ::acosf(__lcpp_x);}
                                             ^
/Users/buildslave/jenkins/workspace/lldb-cmake-matrix/clang_900_build/bin/../include/c++/v1/math.h:819:93: error: no member named 'acosl' in the global namespace; did you mean 'acos'?
inline _LIBCPP_INLINE_VISIBILITY long double acos(long double __lcpp_x) _NOEXCEPT {return ::acosl(__lcpp_x);}
                                                                                          ~~^
/Users/buildslave/jenkins/workspace/lldb-cmake-matrix/clang_900_build/bin/../include/c++/v1/math.h:818:46: note: 'acos' declared here
inline _LIBCPP_INLINE_VISIBILITY float       acos(float __lcpp_x) _NOEXCEPT       {return ::acosf(__lcpp_x);}
                                             ^
/Users/buildslave/jenkins/workspace/lldb-cmake-matrix/clang_900_build/bin/../include/c++/v1/math.h:825:38: error: call to 'acos' is ambiguous
acos(_A1 __lcpp_x) _NOEXCEPT {return ::acos((double)__lcpp_x);}
                                     ^~~~~~
/Users/buildslave/jenkins/workspace/lldb-cmake-matrix/clang_900_build/bin/../include/c++/v1/math.h:818:46: note: candidate function
inline _LIBCPP_INLINE_VISIBILITY float       acos(float __lcpp_x) _NOEXCEPT       {return ::acosf(__lcpp_x);}
                                             ^
/Users/buildslave/jenkins/workspace/lldb-cmake-matrix/clang_900_build/bin/../include/c++/v1/math.h:819:46: note: candidate function
inline _LIBCPP_INLINE_VISIBILITY long double acos(long double __lcpp_x) _NOEXCEPT {return ::acosl(__lcpp_x);}
                                             ^
/Users/buildslave/jenkins/workspace/lldb-cmake-matrix/clang_900_build/bin/../include/c++/v1/math.h:830:93: error: no member named 'asinf' in the global namespace; did you mean 'asin'?
inline _LIBCPP_INLINE_VISIBILITY float       asin(float __lcpp_x) _NOEXCEPT       {return ::asinf(__lcpp_x);}
                                                                                          ~~^
/Users/buildslave/jenkins/workspace/lldb-cmake-matrix/clang_900_build/bin/../include/c++/v1/math.h:830:46: note: 'asin' declared here
inline _LIBCPP_INLINE_VISIBILITY float       asin(float __lcpp_x) _NOEXCEPT       {return ::asinf(__lcpp_x);}
                                             ^
/Users/buildslave/jenkins/workspace/lldb-cmake-matrix/clang_900_build/bin/../include/c++/v1/math.h:831:93: error: no member named 'asinl' in the global namespace; did you mean 'asin'?
inline _LIBCPP_INLINE_VISIBILITY long double asin(long double __lcpp_x) _NOEXCEPT {return ::asinl(__lcpp_x);}
                                                                                          ~~^
/Users/buildslave/jenkins/workspace/lldb-cmake-matrix/clang_900_build/bin/../include/c++/v1/math.h:830:46: note: 'asin' declared here
inline _LIBCPP_INLINE_VISIBILITY float       asin(float __lcpp_x) _NOEXCEPT       {return ::asinf(__lcpp_x);}
                                             ^
/Users/buildslave/jenkins/workspace/lldb-cmake-matrix/clang_900_build/bin/../include/c++/v1/math.h:837:38: error: call to 'asin' is ambiguous
asin(_A1 __lcpp_x) _NOEXCEPT {return ::asin((double)__lcpp_x);}
                                     ^~~~~~
/Users/buildslave/jenkins/workspace/lldb-cmake-matrix/clang_900_build/bin/../include/c++/v1/math.h:830:46: note: candidate function
inline _LIBCPP_INLINE_VISIBILITY float       asin(float __lcpp_x) _NOEXCEPT       {return ::asinf(__lcpp_x);}
                                             ^
/Users/buildslave/jenkins/workspace/lldb-cmake-matrix/clang_900_build/bin/../include/c++/v1/math.h:831:46: note: candidate function
inline _LIBCPP_INLINE_VISIBILITY long double asin(long double __lcpp_x) _NOEXCEPT {return ::asinl(__lcpp_x);}
                                             ^
/Users/buildslave/jenkins/workspace/lldb-cmake-matrix/clang_900_build/bin/../include/c++/v1/math.h:842:93: error: no member named 'atanf' in the global namespace; did you mean 'atan'?
inline _LIBCPP_INLINE_VISIBILITY float       atan(float __lcpp_x) _NOEXCEPT       {return ::atanf(__lcpp_x);}
                                                                                          ~~^
/Users/buildslave/jenkins/workspace/lldb-cmake-matrix/clang_900_build/bin/../include/c++/v1/math.h:842:46: note: 'atan' declared here
inline _LIBCPP_INLINE_VISIBILITY float       atan(float __lcpp_x) _NOEXCEPT       {return ::atanf(__lcpp_x);}
                                             ^
/Users/buildslave/jenkins/workspace/lldb-cmake-matrix/clang_900_build/bin/../include/c++/v1/math.h:843:93: error: no member named 'atanl' in the global namespace; did you mean 'atan'?
inline _LIBCPP_INLINE_VISIBILITY long double atan(long double __lcpp_x) _NOEXCEPT {return ::atanl(__lcpp_x);}
                                                                                          ~~^
/Users/buildslave/jenkins/workspace/lldb-cmake-matrix/clang_900_build/bin/../include/c++/v1/math.h:842:46: note: 'atan' declared here
inline _LIBCPP_INLINE_VISIBILITY float       atan(float __lcpp_x) _NOEXCEPT       {return ::atanf(__lcpp_x);}
                                             ^
/Users/buildslave/jenkins/workspace/lldb-cmake-matrix/clang_900_build/bin/../include/c++/v1/math.h:849:38: error: call to 'atan' is ambiguous
atan(_A1 __lcpp_x) _NOEXCEPT {return ::atan((double)__lcpp_x);}
                                     ^~~~~~
/Users/buildslave/jenkins/workspace/lldb-cmake-matrix/clang_900_build/bin/../include/c++/v1/math.h:842:46: note: candidate function
inline _LIBCPP_INLINE_VISIBILITY float       atan(float __lcpp_x) _NOEXCEPT       {return ::atanf(__lcpp_x);}
                                             ^
/Users/buildslave/jenkins/workspace/lldb-cmake-matrix/clang_900_build/bin/../include/c++/v1/math.h:843:46: note: candidate function
inline _LIBCPP_INLINE_VISIBILITY long double atan(long double __lcpp_x) _NOEXCEPT {return ::atanl(__lcpp_x);}
                                             ^
/Users/buildslave/jenkins/workspace/lldb-cmake-matrix/clang_900_build/bin/../include/c++/v1/math.h:854:116: error: no member named 'atan2f' in the global namespace; did you mean 'atan2'?
inline _LIBCPP_INLINE_VISIBILITY float       atan2(float __lcpp_y, float __lcpp_x) _NOEXCEPT             {return ::atan2f(__lcpp_y, __lcpp_x);}
                                                                                                                 ~~^
/Users/buildslave/jenkins/workspace/lldb-cmake-matrix/clang_900_build/bin/../include/c++/v1/math.h:854:46: note: 'atan2' declared here
inline _LIBCPP_INLINE_VISIBILITY float       atan2(float __lcpp_y, float __lcpp_x) _NOEXCEPT             {return ::atan2f(__lcpp_y, __lcpp_x);}
                                             ^
fatal error: too many errors emitted, stopping now [-ferror-limit=]
20 errors generated.
make: *** [main.o] Error 1

Test Directory:
/Users/buildslave/jenkins/workspace/lldb-cmake-matrix/llvm-project/lldb/test/API/functionalities/data-formatter/data-formatter-stl/libcxx/string/simulator
======================================================================
ERROR: test_r2_ALTERNATE_LAYOUT (TestDataFormatterLibcxxStringSimulator.LibcxxStringDataFormatterSimulatorTestCase)
    partial(func, *args, **keywords) - new function with partial application
----------------------------------------------------------------------
Error when building test subject.

Build Command:
make VPATH=/Users/buildslave/jenkins/workspace/lldb-cmake-matrix/llvm-project/lldb/test/API/functionalities/data-formatter/data-formatter-stl/libcxx/string/simulator -C /Users/buildslave/jenkins/workspace/lldb-cmake-matrix/lldb-build/lldb-test-build.noindex/functionalities/data-formatter/data-formatter-stl/libcxx/string/simulator/TestDataFormatterLibcxxStringSimulator.test_r2_ALTERNATE_LAYOUT -I /Users/buildslave/jenkins/workspace/lldb-cmake-matrix/llvm-project/lldb/test/API/functionalities/data-formatter/data-formatter-stl/libcxx/string/simulator -I /Users/buildslave/jenkins/workspace/lldb-cmake-matrix/llvm-project/lldb/packages/Python/lldbsuite/test/make -f /Users/buildslave/jenkins/workspace/lldb-cmake-matrix/llvm-project/lldb/test/API/functionalities/data-formatter/data-formatter-stl/libcxx/string/simulator/Makefile all ARCH=x86_64 'CC="/Users/buildslave/jenkins/workspace/lldb-cmake-matrix/clang_900_build/bin/clang"' DSYMUTIL=/Users/buildslave/jenkins/workspace/lldb-cmake-matrix/lldb-build/./bin/dsymutil CODESIGN=codesign CLANG_MODULE_CACHE_DIR=/Users/buildslave/jenkins/workspace/lldb-cmake-matrix/lldb-build/lldb-test-build.noindex/module-cache-clang/lldb-api USE_HERMETIC_LIBCPP=1 'CXXFLAGS_EXTRAS=-DREVISION=2 -DALTERNATE_LAYOUT'

Build Command Output:
"/Users/buildslave/jenkins/workspace/lldb-cmake-matrix/clang_900_build/bin/clang"  -std=c++11 -g -O0 -isysroot "/Applications/Xcode.app/Contents/Developer/Platforms/MacOSX.platform/Developer/SDKs/MacOSX11.1.sdk" -arch x86_64  -I/Users/buildslave/jenkins/workspace/lldb-cmake-matrix/llvm-project/lldb/packages/Python/lldbsuite/test/make/../../../../../include -I/Users/buildslave/jenkins/workspace/lldb-cmake-matrix/llvm-project/lldb/test/API/functionalities/data-formatter/data-formatter-stl/libcxx/string/simulator -I/Users/buildslave/jenkins/workspace/lldb-cmake-matrix/llvm-project/lldb/packages/Python/lldbsuite/test/make -include /Users/buildslave/jenkins/workspace/lldb-cmake-matrix/llvm-project/lldb/packages/Python/lldbsuite/test/make/test_common.h  -fno-limit-debug-info    -DREVISION=2 -DALTERNATE_LAYOUT -std=c++14 --driver-mode=g++ -MT main.o -MD -MP -MF main.d -c -o main.o /Users/buildslave/jenkins/workspace/lldb-cmake-matrix/llvm-project/lldb/test/API/functionalities/data-formatter/data-formatter-stl/libcxx/string/simulator/main.cpp
In file included from /Users/buildslave/jenkins/workspace/lldb-cmake-matrix/llvm-project/lldb/test/API/functionalities/data-formatter/data-formatter-stl/libcxx/string/simulator/main.cpp:2:
In file included from /Users/buildslave/jenkins/workspace/lldb-cmake-matrix/clang_900_build/bin/../include/c++/v1/memory:653:
In file included from /Users/buildslave/jenkins/workspace/lldb-cmake-matrix/clang_900_build/bin/../include/c++/v1/typeinfo:60:
In file included from /Users/buildslave/jenkins/workspace/lldb-cmake-matrix/clang_900_build/bin/../include/c++/v1/exception:81:
In file included from /Users/buildslave/jenkins/workspace/lldb-cmake-matrix/clang_900_build/bin/../include/c++/v1/cstdlib:85:
In file included from /Users/buildslave/jenkins/workspace/lldb-cmake-matrix/clang_900_build/bin/../include/c++/v1/stdlib.h:100:
/Users/buildslave/jenkins/workspace/lldb-cmake-matrix/clang_900_build/bin/../include/c++/v1/math.h:769:12: error: no member named 'labs' in the global namespace; did you mean 'abs'?
  return ::labs(__x);
         ~~^
/Users/buildslave/jenkins/workspace/lldb-cmake-matrix/clang_900_build/bin/../include/c++/v1/math.h:768:39: note: 'abs' declared here
inline _LIBCPP_INLINE_VISIBILITY long abs(long __x) _NOEXCEPT {
                                      ^
/Users/buildslave/jenkins/workspace/lldb-cmake-matrix/clang_900_build/bin/../include/c++/v1/math.h:773:12: error: no member named 'llabs' in the global namespace
  return ::llabs(__x);
         ~~^
/Users/buildslave/jenkins/workspace/lldb-cmake-matrix/clang_900_build/bin/../include/c++/v1/math.h:781:12: error: no member named 'fabsf' in the global namespace
  return ::fabsf(__lcpp_x);
         ~~^
/Users/buildslave/jenkins/workspace/lldb-cmake-matrix/clang_900_build/bin/../include/c++/v1/math.h:785:12: error: no member named 'fabs' in the global namespace; did you mean 'abs'?
  return ::fabs(__lcpp_x);
         ~~^
/Users/buildslave/jenkins/workspace/lldb-cmake-matrix/clang_900_build/bin/../include/c++/v1/math.h:768:39: note: 'abs' declared here
inline _LIBCPP_INLINE_VISIBILITY long abs(long __x) _NOEXCEPT {
                                      ^
/Users/buildslave/jenkins/workspace/lldb-cmake-matrix/clang_900_build/bin/../include/c++/v1/math.h:790:12: error: no member named 'fabsl' in the global namespace
  return ::fabsl(__lcpp_x);
         ~~^
/Users/buildslave/jenkins/workspace/lldb-cmake-matrix/clang_900_build/bin/../include/c++/v1/math.h:804:34: error: unknown type name 'ldiv_t'
inline _LIBCPP_INLINE_VISIBILITY ldiv_t div(long __x, long __y) _NOEXCEPT {
                                 ^
/Users/buildslave/jenkins/workspace/lldb-cmake-matrix/clang_900_build/bin/../include/c++/v1/math.h:805:12: error: no member named 'ldiv' in the global namespace
  return ::ldiv(__x, __y);
         ~~^
/Users/buildslave/jenkins/workspace/lldb-cmake-matrix/clang_900_build/bin/../include/c++/v1/math.h:808:34: error: unknown type name 'lldiv_t'
inline _LIBCPP_INLINE_VISIBILITY lldiv_t div(long long __x,
                                 ^
/Users/buildslave/jenkins/workspace/lldb-cmake-matrix/clang_900_build/bin/../include/c++/v1/math.h:810:12: error: no member named 'lldiv' in the global namespace
  return ::lldiv(__x, __y);
         ~~^
/Users/buildslave/jenkins/workspace/lldb-cmake-matrix/clang_900_build/bin/../include/c++/v1/math.h:818:93: error: no member named 'acosf' in the global namespace; did you mean 'acos'?
inline _LIBCPP_INLINE_VISIBILITY float       acos(float __lcpp_x) _NOEXCEPT       {return ::acosf(__lcpp_x);}
                                                                                          ~~^
/Users/buildslave/jenkins/workspace/lldb-cmake-matrix/clang_900_build/bin/../include/c++/v1/math.h:818:46: note: 'acos' declared here
inline _LIBCPP_INLINE_VISIBILITY float       acos(float __lcpp_x) _NOEXCEPT       {return ::acosf(__lcpp_x);}
                                             ^
/Users/buildslave/jenkins/workspace/lldb-cmake-matrix/clang_900_build/bin/../include/c++/v1/math.h:819:93: error: no member named 'acosl' in the global namespace; did you mean 'acos'?
inline _LIBCPP_INLINE_VISIBILITY long double acos(long double __lcpp_x) _NOEXCEPT {return ::acosl(__lcpp_x);}
                                                                                          ~~^
/Users/buildslave/jenkins/workspace/lldb-cmake-matrix/clang_900_build/bin/../include/c++/v1/math.h:818:46: note: 'acos' declared here
inline _LIBCPP_INLINE_VISIBILITY float       acos(float __lcpp_x) _NOEXCEPT       {return ::acosf(__lcpp_x);}
                                             ^
/Users/buildslave/jenkins/workspace/lldb-cmake-matrix/clang_900_build/bin/../include/c++/v1/math.h:825:38: error: call to 'acos' is ambiguous
acos(_A1 __lcpp_x) _NOEXCEPT {return ::acos((double)__lcpp_x);}
                                     ^~~~~~
/Users/buildslave/jenkins/workspace/lldb-cmake-matrix/clang_900_build/bin/../include/c++/v1/math.h:818:46: note: candidate function
inline _LIBCPP_INLINE_VISIBILITY float       acos(float __lcpp_x) _NOEXCEPT       {return ::acosf(__lcpp_x);}
                                             ^
/Users/buildslave/jenkins/workspace/lldb-cmake-matrix/clang_900_build/bin/../include/c++/v1/math.h:819:46: note: candidate function
inline _LIBCPP_INLINE_VISIBILITY long double acos(long double __lcpp_x) _NOEXCEPT {return ::acosl(__lcpp_x);}
                                             ^
/Users/buildslave/jenkins/workspace/lldb-cmake-matrix/clang_900_build/bin/../include/c++/v1/math.h:830:93: error: no member named 'asinf' in the global namespace; did you mean 'asin'?
inline _LIBCPP_INLINE_VISIBILITY float       asin(float __lcpp_x) _NOEXCEPT       {return ::asinf(__lcpp_x);}
                                                                                          ~~^
/Users/buildslave/jenkins/workspace/lldb-cmake-matrix/clang_900_build/bin/../include/c++/v1/math.h:830:46: note: 'asin' declared here
inline _LIBCPP_INLINE_VISIBILITY float       asin(float __lcpp_x) _NOEXCEPT       {return ::asinf(__lcpp_x);}
                                             ^
/Users/buildslave/jenkins/workspace/lldb-cmake-matrix/clang_900_build/bin/../include/c++/v1/math.h:831:93: error: no member named 'asinl' in the global namespace; did you mean 'asin'?
inline _LIBCPP_INLINE_VISIBILITY long double asin(long double __lcpp_x) _NOEXCEPT {return ::asinl(__lcpp_x);}
                                                                                          ~~^
/Users/buildslave/jenkins/workspace/lldb-cmake-matrix/clang_900_build/bin/../include/c++/v1/math.h:830:46: note: 'asin' declared here
inline _LIBCPP_INLINE_VISIBILITY float       asin(float __lcpp_x) _NOEXCEPT       {return ::asinf(__lcpp_x);}
                                             ^
/Users/buildslave/jenkins/workspace/lldb-cmake-matrix/clang_900_build/bin/../include/c++/v1/math.h:837:38: error: call to 'asin' is ambiguous
asin(_A1 __lcpp_x) _NOEXCEPT {return ::asin((double)__lcpp_x);}
                                     ^~~~~~
/Users/buildslave/jenkins/workspace/lldb-cmake-matrix/clang_900_build/bin/../include/c++/v1/math.h:830:46: note: candidate function
inline _LIBCPP_INLINE_VISIBILITY float       asin(float __lcpp_x) _NOEXCEPT       {return ::asinf(__lcpp_x);}
                                             ^
/Users/buildslave/jenkins/workspace/lldb-cmake-matrix/clang_900_build/bin/../include/c++/v1/math.h:831:46: note: candidate function
inline _LIBCPP_INLINE_VISIBILITY long double asin(long double __lcpp_x) _NOEXCEPT {return ::asinl(__lcpp_x);}
                                             ^
/Users/buildslave/jenkins/workspace/lldb-cmake-matrix/clang_900_build/bin/../include/c++/v1/math.h:842:93: error: no member named 'atanf' in the global namespace; did you mean 'atan'?
inline _LIBCPP_INLINE_VISIBILITY float       atan(float __lcpp_x) _NOEXCEPT       {return ::atanf(__lcpp_x);}
                                                                                          ~~^
/Users/buildslave/jenkins/workspace/lldb-cmake-matrix/clang_900_build/bin/../include/c++/v1/math.h:842:46: note: 'atan' declared here
inline _LIBCPP_INLINE_VISIBILITY float       atan(float __lcpp_x) _NOEXCEPT       {return ::atanf(__lcpp_x);}
                                             ^
/Users/buildslave/jenkins/workspace/lldb-cmake-matrix/clang_900_build/bin/../include/c++/v1/math.h:843:93: error: no member named 'atanl' in the global namespace; did you mean 'atan'?
inline _LIBCPP_INLINE_VISIBILITY long double atan(long double __lcpp_x) _NOEXCEPT {return ::atanl(__lcpp_x);}
                                                                                          ~~^
/Users/buildslave/jenkins/workspace/lldb-cmake-matrix/clang_900_build/bin/../include/c++/v1/math.h:842:46: note: 'atan' declared here
inline _LIBCPP_INLINE_VISIBILITY float       atan(float __lcpp_x) _NOEXCEPT       {return ::atanf(__lcpp_x);}
                                             ^
/Users/buildslave/jenkins/workspace/lldb-cmake-matrix/clang_900_build/bin/../include/c++/v1/math.h:849:38: error: call to 'atan' is ambiguous
atan(_A1 __lcpp_x) _NOEXCEPT {return ::atan((double)__lcpp_x);}
                                     ^~~~~~
/Users/buildslave/jenkins/workspace/lldb-cmake-matrix/clang_900_build/bin/../include/c++/v1/math.h:842:46: note: candidate function
inline _LIBCPP_INLINE_VISIBILITY float       atan(float __lcpp_x) _NOEXCEPT       {return ::atanf(__lcpp_x);}
                                             ^
/Users/buildslave/jenkins/workspace/lldb-cmake-matrix/clang_900_build/bin/../include/c++/v1/math.h:843:46: note: candidate function
inline _LIBCPP_INLINE_VISIBILITY long double atan(long double __lcpp_x) _NOEXCEPT {return ::atanl(__lcpp_x);}
                                             ^
/Users/buildslave/jenkins/workspace/lldb-cmake-matrix/clang_900_build/bin/../include/c++/v1/math.h:854:116: error: no member named 'atan2f' in the global namespace; did you mean 'atan2'?
inline _LIBCPP_INLINE_VISIBILITY float       atan2(float __lcpp_y, float __lcpp_x) _NOEXCEPT             {return ::atan2f(__lcpp_y, __lcpp_x);}
                                                                                                                 ~~^
/Users/buildslave/jenkins/workspace/lldb-cmake-matrix/clang_900_build/bin/../include/c++/v1/math.h:854:46: note: 'atan2' declared here
inline _LIBCPP_INLINE_VISIBILITY float       atan2(float __lcpp_y, float __lcpp_x) _NOEXCEPT             {return ::atan2f(__lcpp_y, __lcpp_x);}
                                             ^
fatal error: too many errors emitted, stopping now [-ferror-limit=]
20 errors generated.
make: *** [main.o] Error 1

Test Directory:
/Users/buildslave/jenkins/workspace/lldb-cmake-matrix/llvm-project/lldb/test/API/functionalities/data-formatter/data-formatter-stl/libcxx/string/simulator
======================================================================
ERROR: test_r3 (TestDataFormatterLibcxxStringSimulator.LibcxxStringDataFormatterSimulatorTestCase)
    partial(func, *args, **keywords) - new function with partial application
----------------------------------------------------------------------
Error when building test subject.

Build Command:
make VPATH=/Users/buildslave/jenkins/workspace/lldb-cmake-matrix/llvm-project/lldb/test/API/functionalities/data-formatter/data-formatter-stl/libcxx/string/simulator -C /Users/buildslave/jenkins/workspace/lldb-cmake-matrix/lldb-build/lldb-test-build.noindex/functionalities/data-formatter/data-formatter-stl/libcxx/string/simulator/TestDataFormatterLibcxxStringSimulator.test_r3 -I /Users/buildslave/jenkins/workspace/lldb-cmake-matrix/llvm-project/lldb/test/API/functionalities/data-formatter/data-formatter-stl/libcxx/string/simulator -I /Users/buildslave/jenkins/workspace/lldb-cmake-matrix/llvm-project/lldb/packages/Python/lldbsuite/test/make -f /Users/buildslave/jenkins/workspace/lldb-cmake-matrix/llvm-project/lldb/test/API/functionalities/data-formatter/data-formatter-stl/libcxx/string/simulator/Makefile all ARCH=x86_64 'CC="/Users/buildslave/jenkins/workspace/lldb-cmake-matrix/clang_900_build/bin/clang"' DSYMUTIL=/Users/buildslave/jenkins/workspace/lldb-cmake-matrix/lldb-build/./bin/dsymutil CODESIGN=codesign CLANG_MODULE_CACHE_DIR=/Users/buildslave/jenkins/workspace/lldb-cmake-matrix/lldb-build/lldb-test-build.noindex/module-cache-clang/lldb-api USE_HERMETIC_LIBCPP=1 CXXFLAGS_EXTRAS=-DREVISION=3

Build Command Output:
"/Users/buildslave/jenkins/workspace/lldb-cmake-matrix/clang_900_build/bin/clang"  -std=c++11 -g -O0 -isysroot "/Applications/Xcode.app/Contents/Developer/Platforms/MacOSX.platform/Developer/SDKs/MacOSX11.1.sdk" -arch x86_64  -I/Users/buildslave/jenkins/workspace/lldb-cmake-matrix/llvm-project/lldb/packages/Python/lldbsuite/test/make/../../../../../include -I/Users/buildslave/jenkins/workspace/lldb-cmake-matrix/llvm-project/lldb/test/API/functionalities/data-formatter/data-formatter-stl/libcxx/string/simulator -I/Users/buildslave/jenkins/workspace/lldb-cmake-matrix/llvm-project/lldb/packages/Python/lldbsuite/test/make -include /Users/buildslave/jenkins/workspace/lldb-cmake-matrix/llvm-project/lldb/packages/Python/lldbsuite/test/make/test_common.h  -fno-limit-debug-info    -DREVISION=3 -std=c++14 --driver-mode=g++ -MT main.o -MD -MP -MF main.d -c -o main.o /Users/buildslave/jenkins/workspace/lldb-cmake-matrix/llvm-project/lldb/test/API/functionalities/data-formatter/data-formatter-stl/libcxx/string/simulator/main.cpp
In file included from /Users/buildslave/jenkins/workspace/lldb-cmake-matrix/llvm-project/lldb/test/API/functionalities/data-formatter/data-formatter-stl/libcxx/string/simulator/main.cpp:2:
In file included from /Users/buildslave/jenkins/workspace/lldb-cmake-matrix/clang_900_build/bin/../include/c++/v1/memory:653:
In file included from /Users/buildslave/jenkins/workspace/lldb-cmake-matrix/clang_900_build/bin/../include/c++/v1/typeinfo:60:
In file included from /Users/buildslave/jenkins/workspace/lldb-cmake-matrix/clang_900_build/bin/../include/c++/v1/exception:81:
In file included from /Users/buildslave/jenkins/workspace/lldb-cmake-matrix/clang_900_build/bin/../include/c++/v1/cstdlib:85:
In file included from /Users/buildslave/jenkins/workspace/lldb-cmake-matrix/clang_900_build/bin/../include/c++/v1/stdlib.h:100:
/Users/buildslave/jenkins/workspace/lldb-cmake-matrix/clang_900_build/bin/../include/c++/v1/math.h:769:12: error: no member named 'labs' in the global namespace; did you mean 'abs'?
  return ::labs(__x);
         ~~^
/Users/buildslave/jenkins/workspace/lldb-cmake-matrix/clang_900_build/bin/../include/c++/v1/math.h:768:39: note: 'abs' declared here
inline _LIBCPP_INLINE_VISIBILITY long abs(long __x) _NOEXCEPT {
                                      ^
/Users/buildslave/jenkins/workspace/lldb-cmake-matrix/clang_900_build/bin/../include/c++/v1/math.h:773:12: error: no member named 'llabs' in the global namespace
  return ::llabs(__x);
         ~~^
/Users/buildslave/jenkins/workspace/lldb-cmake-matrix/clang_900_build/bin/../include/c++/v1/math.h:781:12: error: no member named 'fabsf' in the global namespace
  return ::fabsf(__lcpp_x);
         ~~^
/Users/buildslave/jenkins/workspace/lldb-cmake-matrix/clang_900_build/bin/../include/c++/v1/math.h:785:12: error: no member named 'fabs' in the global namespace; did you mean 'abs'?
  return ::fabs(__lcpp_x);
         ~~^
/Users/buildslave/jenkins/workspace/lldb-cmake-matrix/clang_900_build/bin/../include/c++/v1/math.h:768:39: note: 'abs' declared here
inline _LIBCPP_INLINE_VISIBILITY long abs(long __x) _NOEXCEPT {
                                      ^
/Users/buildslave/jenkins/workspace/lldb-cmake-matrix/clang_900_build/bin/../include/c++/v1/math.h:790:12: error: no member named 'fabsl' in the global namespace
  return ::fabsl(__lcpp_x);
         ~~^
/Users/buildslave/jenkins/workspace/lldb-cmake-matrix/clang_900_build/bin/../include/c++/v1/math.h:804:34: error: unknown type name 'ldiv_t'
inline _LIBCPP_INLINE_VISIBILITY ldiv_t div(long __x, long __y) _NOEXCEPT {
                                 ^
/Users/buildslave/jenkins/workspace/lldb-cmake-matrix/clang_900_build/bin/../include/c++/v1/math.h:805:12: error: no member named 'ldiv' in the global namespace
  return ::ldiv(__x, __y);
         ~~^
/Users/buildslave/jenkins/workspace/lldb-cmake-matrix/clang_900_build/bin/../include/c++/v1/math.h:808:34: error: unknown type name 'lldiv_t'
inline _LIBCPP_INLINE_VISIBILITY lldiv_t div(long long __x,
                                 ^
/Users/buildslave/jenkins/workspace/lldb-cmake-matrix/clang_900_build/bin/../include/c++/v1/math.h:810:12: error: no member named 'lldiv' in the global namespace
  return ::lldiv(__x, __y);
         ~~^
/Users/buildslave/jenkins/workspace/lldb-cmake-matrix/clang_900_build/bin/../include/c++/v1/math.h:818:93: error: no member named 'acosf' in the global namespace; did you mean 'acos'?
inline _LIBCPP_INLINE_VISIBILITY float       acos(float __lcpp_x) _NOEXCEPT       {return ::acosf(__lcpp_x);}
                                                                                          ~~^
/Users/buildslave/jenkins/workspace/lldb-cmake-matrix/clang_900_build/bin/../include/c++/v1/math.h:818:46: note: 'acos' declared here
inline _LIBCPP_INLINE_VISIBILITY float       acos(float __lcpp_x) _NOEXCEPT       {return ::acosf(__lcpp_x);}
                                             ^
/Users/buildslave/jenkins/workspace/lldb-cmake-matrix/clang_900_build/bin/../include/c++/v1/math.h:819:93: error: no member named 'acosl' in the global namespace; did you mean 'acos'?
inline _LIBCPP_INLINE_VISIBILITY long double acos(long double __lcpp_x) _NOEXCEPT {return ::acosl(__lcpp_x);}
                                                                                          ~~^
/Users/buildslave/jenkins/workspace/lldb-cmake-matrix/clang_900_build/bin/../include/c++/v1/math.h:818:46: note: 'acos' declared here
inline _LIBCPP_INLINE_VISIBILITY float       acos(float __lcpp_x) _NOEXCEPT       {return ::acosf(__lcpp_x);}
                                             ^
/Users/buildslave/jenkins/workspace/lldb-cmake-matrix/clang_900_build/bin/../include/c++/v1/math.h:825:38: error: call to 'acos' is ambiguous
acos(_A1 __lcpp_x) _NOEXCEPT {return ::acos((double)__lcpp_x);}
                                     ^~~~~~
/Users/buildslave/jenkins/workspace/lldb-cmake-matrix/clang_900_build/bin/../include/c++/v1/math.h:818:46: note: candidate function
inline _LIBCPP_INLINE_VISIBILITY float       acos(float __lcpp_x) _NOEXCEPT       {return ::acosf(__lcpp_x);}
                                             ^
/Users/buildslave/jenkins/workspace/lldb-cmake-matrix/clang_900_build/bin/../include/c++/v1/math.h:819:46: note: candidate function
inline _LIBCPP_INLINE_VISIBILITY long double acos(long double __lcpp_x) _NOEXCEPT {return ::acosl(__lcpp_x);}
                                             ^
/Users/buildslave/jenkins/workspace/lldb-cmake-matrix/clang_900_build/bin/../include/c++/v1/math.h:830:93: error: no member named 'asinf' in the global namespace; did you mean 'asin'?
inline _LIBCPP_INLINE_VISIBILITY float       asin(float __lcpp_x) _NOEXCEPT       {return ::asinf(__lcpp_x);}
                                                                                          ~~^
/Users/buildslave/jenkins/workspace/lldb-cmake-matrix/clang_900_build/bin/../include/c++/v1/math.h:830:46: note: 'asin' declared here
inline _LIBCPP_INLINE_VISIBILITY float       asin(float __lcpp_x) _NOEXCEPT       {return ::asinf(__lcpp_x);}
                                             ^
/Users/buildslave/jenkins/workspace/lldb-cmake-matrix/clang_900_build/bin/../include/c++/v1/math.h:831:93: error: no member named 'asinl' in the global namespace; did you mean 'asin'?
inline _LIBCPP_INLINE_VISIBILITY long double asin(long double __lcpp_x) _NOEXCEPT {return ::asinl(__lcpp_x);}
                                                                                          ~~^
/Users/buildslave/jenkins/workspace/lldb-cmake-matrix/clang_900_build/bin/../include/c++/v1/math.h:830:46: note: 'asin' declared here
inline _LIBCPP_INLINE_VISIBILITY float       asin(float __lcpp_x) _NOEXCEPT       {return ::asinf(__lcpp_x);}
                                             ^
/Users/buildslave/jenkins/workspace/lldb-cmake-matrix/clang_900_build/bin/../include/c++/v1/math.h:837:38: error: call to 'asin' is ambiguous
asin(_A1 __lcpp_x) _NOEXCEPT {return ::asin((double)__lcpp_x);}
                                     ^~~~~~
/Users/buildslave/jenkins/workspace/lldb-cmake-matrix/clang_900_build/bin/../include/c++/v1/math.h:830:46: note: candidate function
inline _LIBCPP_INLINE_VISIBILITY float       asin(float __lcpp_x) _NOEXCEPT       {return ::asinf(__lcpp_x);}
                                             ^
/Users/buildslave/jenkins/workspace/lldb-cmake-matrix/clang_900_build/bin/../include/c++/v1/math.h:831:46: note: candidate function
inline _LIBCPP_INLINE_VISIBILITY long double asin(long double __lcpp_x) _NOEXCEPT {return ::asinl(__lcpp_x);}
                                             ^
/Users/buildslave/jenkins/workspace/lldb-cmake-matrix/clang_900_build/bin/../include/c++/v1/math.h:842:93: error: no member named 'atanf' in the global namespace; did you mean 'atan'?
inline _LIBCPP_INLINE_VISIBILITY float       atan(float __lcpp_x) _NOEXCEPT       {return ::atanf(__lcpp_x);}
                                                                                          ~~^
/Users/buildslave/jenkins/workspace/lldb-cmake-matrix/clang_900_build/bin/../include/c++/v1/math.h:842:46: note: 'atan' declared here
inline _LIBCPP_INLINE_VISIBILITY float       atan(float __lcpp_x) _NOEXCEPT       {return ::atanf(__lcpp_x);}
                                             ^
/Users/buildslave/jenkins/workspace/lldb-cmake-matrix/clang_900_build/bin/../include/c++/v1/math.h:843:93: error: no member named 'atanl' in the global namespace; did you mean 'atan'?
inline _LIBCPP_INLINE_VISIBILITY long double atan(long double __lcpp_x) _NOEXCEPT {return ::atanl(__lcpp_x);}
                                                                                          ~~^
/Users/buildslave/jenkins/workspace/lldb-cmake-matrix/clang_900_build/bin/../include/c++/v1/math.h:842:46: note: 'atan' declared here
inline _LIBCPP_INLINE_VISIBILITY float       atan(float __lcpp_x) _NOEXCEPT       {return ::atanf(__lcpp_x);}
                                             ^
/Users/buildslave/jenkins/workspace/lldb-cmake-matrix/clang_900_build/bin/../include/c++/v1/math.h:849:38: error: call to 'atan' is ambiguous
atan(_A1 __lcpp_x) _NOEXCEPT {return ::atan((double)__lcpp_x);}
                                     ^~~~~~
/Users/buildslave/jenkins/workspace/lldb-cmake-matrix/clang_900_build/bin/../include/c++/v1/math.h:842:46: note: candidate function
inline _LIBCPP_INLINE_VISIBILITY float       atan(float __lcpp_x) _NOEXCEPT       {return ::atanf(__lcpp_x);}
                                             ^
/Users/buildslave/jenkins/workspace/lldb-cmake-matrix/clang_900_build/bin/../include/c++/v1/math.h:843:46: note: candidate function
inline _LIBCPP_INLINE_VISIBILITY long double atan(long double __lcpp_x) _NOEXCEPT {return ::atanl(__lcpp_x);}
                                             ^
/Users/buildslave/jenkins/workspace/lldb-cmake-matrix/clang_900_build/bin/../include/c++/v1/math.h:854:116: error: no member named 'atan2f' in the global namespace; did you mean 'atan2'?
inline _LIBCPP_INLINE_VISIBILITY float       atan2(float __lcpp_y, float __lcpp_x) _NOEXCEPT             {return ::atan2f(__lcpp_y, __lcpp_x);}
                                                                                                                 ~~^
/Users/buildslave/jenkins/workspace/lldb-cmake-matrix/clang_900_build/bin/../include/c++/v1/math.h:854:46: note: 'atan2' declared here
inline _LIBCPP_INLINE_VISIBILITY float       atan2(float __lcpp_y, float __lcpp_x) _NOEXCEPT             {return ::atan2f(__lcpp_y, __lcpp_x);}
                                             ^
fatal error: too many errors emitted, stopping now [-ferror-limit=]
20 errors generated.
make: *** [main.o] Error 1

Test Directory:
/Users/buildslave/jenkins/workspace/lldb-cmake-matrix/llvm-project/lldb/test/API/functionalities/data-formatter/data-formatter-stl/libcxx/string/simulator
======================================================================
ERROR: test_r3_ALTERNATE_LAYOUT (TestDataFormatterLibcxxStringSimulator.LibcxxStringDataFormatterSimulatorTestCase)
    partial(func, *args, **keywords) - new function with partial application
----------------------------------------------------------------------
Error when building test subject.

Build Command:
make VPATH=/Users/buildslave/jenkins/workspace/lldb-cmake-matrix/llvm-project/lldb/test/API/functionalities/data-formatter/data-formatter-stl/libcxx/string/simulator -C /Users/buildslave/jenkins/workspace/lldb-cmake-matrix/lldb-build/lldb-test-build.noindex/functionalities/data-formatter/data-formatter-stl/libcxx/string/simulator/TestDataFormatterLibcxxStringSimulator.test_r3_ALTERNATE_LAYOUT -I /Users/buildslave/jenkins/workspace/lldb-cmake-matrix/llvm-project/lldb/test/API/functionalities/data-formatter/data-formatter-stl/libcxx/string/simulator -I /Users/buildslave/jenkins/workspace/lldb-cmake-matrix/llvm-project/lldb/packages/Python/lldbsuite/test/make -f /Users/buildslave/jenkins/workspace/lldb-cmake-matrix/llvm-project/lldb/test/API/functionalities/data-formatter/data-formatter-stl/libcxx/string/simulator/Makefile all ARCH=x86_64 'CC="/Users/buildslave/jenkins/workspace/lldb-cmake-matrix/clang_900_build/bin/clang"' DSYMUTIL=/Users/buildslave/jenkins/workspace/lldb-cmake-matrix/lldb-build/./bin/dsymutil CODESIGN=codesign CLANG_MODULE_CACHE_DIR=/Users/buildslave/jenkins/workspace/lldb-cmake-matrix/lldb-build/lldb-test-build.noindex/module-cache-clang/lldb-api USE_HERMETIC_LIBCPP=1 'CXXFLAGS_EXTRAS=-DREVISION=3 -DALTERNATE_LAYOUT'

Build Command Output:
"/Users/buildslave/jenkins/workspace/lldb-cmake-matrix/clang_900_build/bin/clang"  -std=c++11 -g -O0 -isysroot "/Applications/Xcode.app/Contents/Developer/Platforms/MacOSX.platform/Developer/SDKs/MacOSX11.1.sdk" -arch x86_64  -I/Users/buildslave/jenkins/workspace/lldb-cmake-matrix/llvm-project/lldb/packages/Python/lldbsuite/test/make/../../../../../include -I/Users/buildslave/jenkins/workspace/lldb-cmake-matrix/llvm-project/lldb/test/API/functionalities/data-formatter/data-formatter-stl/libcxx/string/simulator -I/Users/buildslave/jenkins/workspace/lldb-cmake-matrix/llvm-project/lldb/packages/Python/lldbsuite/test/make -include /Users/buildslave/jenkins/workspace/lldb-cmake-matrix/llvm-project/lldb/packages/Python/lldbsuite/test/make/test_common.h  -fno-limit-debug-info    -DREVISION=3 -DALTERNATE_LAYOUT -std=c++14 --driver-mode=g++ -MT main.o -MD -MP -MF main.d -c -o main.o /Users/buildslave/jenkins/workspace/lldb-cmake-matrix/llvm-project/lldb/test/API/functionalities/data-formatter/data-formatter-stl/libcxx/string/simulator/main.cpp
In file included from /Users/buildslave/jenkins/workspace/lldb-cmake-matrix/llvm-project/lldb/test/API/functionalities/data-formatter/data-formatter-stl/libcxx/string/simulator/main.cpp:2:
In file included from /Users/buildslave/jenkins/workspace/lldb-cmake-matrix/clang_900_build/bin/../include/c++/v1/memory:653:
In file included from /Users/buildslave/jenkins/workspace/lldb-cmake-matrix/clang_900_build/bin/../include/c++/v1/typeinfo:60:
In file included from /Users/buildslave/jenkins/workspace/lldb-cmake-matrix/clang_900_build/bin/../include/c++/v1/exception:81:
In file included from /Users/buildslave/jenkins/workspace/lldb-cmake-matrix/clang_900_build/bin/../include/c++/v1/cstdlib:85:
In file included from /Users/buildslave/jenkins/workspace/lldb-cmake-matrix/clang_900_build/bin/../include/c++/v1/stdlib.h:100:
/Users/buildslave/jenkins/workspace/lldb-cmake-matrix/clang_900_build/bin/../include/c++/v1/math.h:769:12: error: no member named 'labs' in the global namespace; did you mean 'abs'?
  return ::labs(__x);
         ~~^
/Users/buildslave/jenkins/workspace/lldb-cmake-matrix/clang_900_build/bin/../include/c++/v1/math.h:768:39: note: 'abs' declared here
inline _LIBCPP_INLINE_VISIBILITY long abs(long __x) _NOEXCEPT {
                                      ^
/Users/buildslave/jenkins/workspace/lldb-cmake-matrix/clang_900_build/bin/../include/c++/v1/math.h:773:12: error: no member named 'llabs' in the global namespace
  return ::llabs(__x);
         ~~^
/Users/buildslave/jenkins/workspace/lldb-cmake-matrix/clang_900_build/bin/../include/c++/v1/math.h:781:12: error: no member named 'fabsf' in the global namespace
  return ::fabsf(__lcpp_x);
         ~~^
/Users/buildslave/jenkins/workspace/lldb-cmake-matrix/clang_900_build/bin/../include/c++/v1/math.h:785:12: error: no member named 'fabs' in the global namespace; did you mean 'abs'?
  return ::fabs(__lcpp_x);
         ~~^
/Users/buildslave/jenkins/workspace/lldb-cmake-matrix/clang_900_build/bin/../include/c++/v1/math.h:768:39: note: 'abs' declared here
inline _LIBCPP_INLINE_VISIBILITY long abs(long __x) _NOEXCEPT {
                                      ^
/Users/buildslave/jenkins/workspace/lldb-cmake-matrix/clang_900_build/bin/../include/c++/v1/math.h:790:12: error: no member named 'fabsl' in the global namespace
  return ::fabsl(__lcpp_x);
         ~~^
/Users/buildslave/jenkins/workspace/lldb-cmake-matrix/clang_900_build/bin/../include/c++/v1/math.h:804:34: error: unknown type name 'ldiv_t'
inline _LIBCPP_INLINE_VISIBILITY ldiv_t div(long __x, long __y) _NOEXCEPT {
                                 ^
/Users/buildslave/jenkins/workspace/lldb-cmake-matrix/clang_900_build/bin/../include/c++/v1/math.h:805:12: error: no member named 'ldiv' in the global namespace
  return ::ldiv(__x, __y);
         ~~^
/Users/buildslave/jenkins/workspace/lldb-cmake-matrix/clang_900_build/bin/../include/c++/v1/math.h:808:34: error: unknown type name 'lldiv_t'
inline _LIBCPP_INLINE_VISIBILITY lldiv_t div(long long __x,
                                 ^
/Users/buildslave/jenkins/workspace/lldb-cmake-matrix/clang_900_build/bin/../include/c++/v1/math.h:810:12: error: no member named 'lldiv' in the global namespace
  return ::lldiv(__x, __y);
         ~~^
/Users/buildslave/jenkins/workspace/lldb-cmake-matrix/clang_900_build/bin/../include/c++/v1/math.h:818:93: error: no member named 'acosf' in the global namespace; did you mean 'acos'?
inline _LIBCPP_INLINE_VISIBILITY float       acos(float __lcpp_x) _NOEXCEPT       {return ::acosf(__lcpp_x);}
                                                                                          ~~^
/Users/buildslave/jenkins/workspace/lldb-cmake-matrix/clang_900_build/bin/../include/c++/v1/math.h:818:46: note: 'acos' declared here
inline _LIBCPP_INLINE_VISIBILITY float       acos(float __lcpp_x) _NOEXCEPT       {return ::acosf(__lcpp_x);}
                                             ^
/Users/buildslave/jenkins/workspace/lldb-cmake-matrix/clang_900_build/bin/../include/c++/v1/math.h:819:93: error: no member named 'acosl' in the global namespace; did you mean 'acos'?
inline _LIBCPP_INLINE_VISIBILITY long double acos(long double __lcpp_x) _NOEXCEPT {return ::acosl(__lcpp_x);}
                                                                                          ~~^
/Users/buildslave/jenkins/workspace/lldb-cmake-matrix/clang_900_build/bin/../include/c++/v1/math.h:818:46: note: 'acos' declared here
inline _LIBCPP_INLINE_VISIBILITY float       acos(float __lcpp_x) _NOEXCEPT       {return ::acosf(__lcpp_x);}
                                             ^
/Users/buildslave/jenkins/workspace/lldb-cmake-matrix/clang_900_build/bin/../include/c++/v1/math.h:825:38: error: call to 'acos' is ambiguous
acos(_A1 __lcpp_x) _NOEXCEPT {return ::acos((double)__lcpp_x);}
                                     ^~~~~~
/Users/buildslave/jenkins/workspace/lldb-cmake-matrix/clang_900_build/bin/../include/c++/v1/math.h:818:46: note: candidate function
inline _LIBCPP_INLINE_VISIBILITY float       acos(float __lcpp_x) _NOEXCEPT       {return ::acosf(__lcpp_x);}
                                             ^
/Users/buildslave/jenkins/workspace/lldb-cmake-matrix/clang_900_build/bin/../include/c++/v1/math.h:819:46: note: candidate function
inline _LIBCPP_INLINE_VISIBILITY long double acos(long double __lcpp_x) _NOEXCEPT {return ::acosl(__lcpp_x);}
                                             ^
/Users/buildslave/jenkins/workspace/lldb-cmake-matrix/clang_900_build/bin/../include/c++/v1/math.h:830:93: error: no member named 'asinf' in the global namespace; did you mean 'asin'?
inline _LIBCPP_INLINE_VISIBILITY float       asin(float __lcpp_x) _NOEXCEPT       {return ::asinf(__lcpp_x);}
                                                                                          ~~^
/Users/buildslave/jenkins/workspace/lldb-cmake-matrix/clang_900_build/bin/../include/c++/v1/math.h:830:46: note: 'asin' declared here
inline _LIBCPP_INLINE_VISIBILITY float       asin(float __lcpp_x) _NOEXCEPT       {return ::asinf(__lcpp_x);}
                                             ^
/Users/buildslave/jenkins/workspace/lldb-cmake-matrix/clang_900_build/bin/../include/c++/v1/math.h:831:93: error: no member named 'asinl' in the global namespace; did you mean 'asin'?
inline _LIBCPP_INLINE_VISIBILITY long double asin(long double __lcpp_x) _NOEXCEPT {return ::asinl(__lcpp_x);}
                                                                                          ~~^
/Users/buildslave/jenkins/workspace/lldb-cmake-matrix/clang_900_build/bin/../include/c++/v1/math.h:830:46: note: 'asin' declared here
inline _LIBCPP_INLINE_VISIBILITY float       asin(float __lcpp_x) _NOEXCEPT       {return ::asinf(__lcpp_x);}
                                             ^
/Users/buildslave/jenkins/workspace/lldb-cmake-matrix/clang_900_build/bin/../include/c++/v1/math.h:837:38: error: call to 'asin' is ambiguous
asin(_A1 __lcpp_x) _NOEXCEPT {return ::asin((double)__lcpp_x);}
                                     ^~~~~~
/Users/buildslave/jenkins/workspace/lldb-cmake-matrix/clang_900_build/bin/../include/c++/v1/math.h:830:46: note: candidate function
inline _LIBCPP_INLINE_VISIBILITY float       asin(float __lcpp_x) _NOEXCEPT       {return ::asinf(__lcpp_x);}
                                             ^
/Users/buildslave/jenkins/workspace/lldb-cmake-matrix/clang_900_build/bin/../include/c++/v1/math.h:831:46: note: candidate function
inline _LIBCPP_INLINE_VISIBILITY long double asin(long double __lcpp_x) _NOEXCEPT {return ::asinl(__lcpp_x);}
                                             ^
/Users/buildslave/jenkins/workspace/lldb-cmake-matrix/clang_900_build/bin/../include/c++/v1/math.h:842:93: error: no member named 'atanf' in the global namespace; did you mean 'atan'?
inline _LIBCPP_INLINE_VISIBILITY float       atan(float __lcpp_x) _NOEXCEPT       {return ::atanf(__lcpp_x);}
                                                                                          ~~^
/Users/buildslave/jenkins/workspace/lldb-cmake-matrix/clang_900_build/bin/../include/c++/v1/math.h:842:46: note: 'atan' declared here
inline _LIBCPP_INLINE_VISIBILITY float       atan(float __lcpp_x) _NOEXCEPT       {return ::atanf(__lcpp_x);}
                                             ^
/Users/buildslave/jenkins/workspace/lldb-cmake-matrix/clang_900_build/bin/../include/c++/v1/math.h:843:93: error: no member named 'atanl' in the global namespace; did you mean 'atan'?
inline _LIBCPP_INLINE_VISIBILITY long double atan(long double __lcpp_x) _NOEXCEPT {return ::atanl(__lcpp_x);}
                                                                                          ~~^
/Users/buildslave/jenkins/workspace/lldb-cmake-matrix/clang_900_build/bin/../include/c++/v1/math.h:842:46: note: 'atan' declared here
inline _LIBCPP_INLINE_VISIBILITY float       atan(float __lcpp_x) _NOEXCEPT       {return ::atanf(__lcpp_x);}
                                             ^
/Users/buildslave/jenkins/workspace/lldb-cmake-matrix/clang_900_build/bin/../include/c++/v1/math.h:849:38: error: call to 'atan' is ambiguous
atan(_A1 __lcpp_x) _NOEXCEPT {return ::atan((double)__lcpp_x);}
                                     ^~~~~~
/Users/buildslave/jenkins/workspace/lldb-cmake-matrix/clang_900_build/bin/../include/c++/v1/math.h:842:46: note: candidate function
inline _LIBCPP_INLINE_VISIBILITY float       atan(float __lcpp_x) _NOEXCEPT       {return ::atanf(__lcpp_x);}
                                             ^
/Users/buildslave/jenkins/workspace/lldb-cmake-matrix/clang_900_build/bin/../include/c++/v1/math.h:843:46: note: candidate function
inline _LIBCPP_INLINE_VISIBILITY long double atan(long double __lcpp_x) _NOEXCEPT {return ::atanl(__lcpp_x);}
                                             ^
/Users/buildslave/jenkins/workspace/lldb-cmake-matrix/clang_900_build/bin/../include/c++/v1/math.h:854:116: error: no member named 'atan2f' in the global namespace; did you mean 'atan2'?
inline _LIBCPP_INLINE_VISIBILITY float       atan2(float __lcpp_y, float __lcpp_x) _NOEXCEPT             {return ::atan2f(__lcpp_y, __lcpp_x);}
                                                                                                                 ~~^
/Users/buildslave/jenkins/workspace/lldb-cmake-matrix/clang_900_build/bin/../include/c++/v1/math.h:854:46: note: 'atan2' declared here
inline _LIBCPP_INLINE_VISIBILITY float       atan2(float __lcpp_y, float __lcpp_x) _NOEXCEPT             {return ::atan2f(__lcpp_y, __lcpp_x);}
                                             ^
fatal error: too many errors emitted, stopping now [-ferror-limit=]
20 errors generated.
make: *** [main.o] Error 1

Test Directory:
/Users/buildslave/jenkins/workspace/lldb-cmake-matrix/llvm-project/lldb/test/API/functionalities/data-formatter/data-formatter-stl/libcxx/string/simulator
======================================================================
ERROR: test_r4 (TestDataFormatterLibcxxStringSimulator.LibcxxStringDataFormatterSimulatorTestCase)
    partial(func, *args, **keywords) - new function with partial application
----------------------------------------------------------------------
Error when building test subject.

Build Command:
make VPATH=/Users/buildslave/jenkins/workspace/lldb-cmake-matrix/llvm-project/lldb/test/API/functionalities/data-formatter/data-formatter-stl/libcxx/string/simulator -C /Users/buildslave/jenkins/workspace/lldb-cmake-matrix/lldb-build/lldb-test-build.noindex/functionalities/data-formatter/data-formatter-stl/libcxx/string/simulator/TestDataFormatterLibcxxStringSimulator.test_r4 -I /Users/buildslave/jenkins/workspace/lldb-cmake-matrix/llvm-project/lldb/test/API/functionalities/data-formatter/data-formatter-stl/libcxx/string/simulator -I /Users/buildslave/jenkins/workspace/lldb-cmake-matrix/llvm-project/lldb/packages/Python/lldbsuite/test/make -f /Users/buildslave/jenkins/workspace/lldb-cmake-matrix/llvm-project/lldb/test/API/functionalities/data-formatter/data-formatter-stl/libcxx/string/simulator/Makefile all ARCH=x86_64 'CC="/Users/buildslave/jenkins/workspace/lldb-cmake-matrix/clang_900_build/bin/clang"' DSYMUTIL=/Users/buildslave/jenkins/workspace/lldb-cmake-matrix/lldb-build/./bin/dsymutil CODESIGN=codesign CLANG_MODULE_CACHE_DIR=/Users/buildslave/jenkins/workspace/lldb-cmake-matrix/lldb-build/lldb-test-build.noindex/module-cache-clang/lldb-api USE_HERMETIC_LIBCPP=1 CXXFLAGS_EXTRAS=-DREVISION=4

Build Command Output:
"/Users/buildslave/jenkins/workspace/lldb-cmake-matrix/clang_900_build/bin/clang"  -std=c++11 -g -O0 -isysroot "/Applications/Xcode.app/Contents/Developer/Platforms/MacOSX.platform/Developer/SDKs/MacOSX11.1.sdk" -arch x86_64  -I/Users/buildslave/jenkins/workspace/lldb-cmake-matrix/llvm-project/lldb/packages/Python/lldbsuite/test/make/../../../../../include -I/Users/buildslave/jenkins/workspace/lldb-cmake-matrix/llvm-project/lldb/test/API/functionalities/data-formatter/data-formatter-stl/libcxx/string/simulator -I/Users/buildslave/jenkins/workspace/lldb-cmake-matrix/llvm-project/lldb/packages/Python/lldbsuite/test/make -include /Users/buildslave/jenkins/workspace/lldb-cmake-matrix/llvm-project/lldb/packages/Python/lldbsuite/test/make/test_common.h  -fno-limit-debug-info    -DREVISION=4 -std=c++14 --driver-mode=g++ -MT main.o -MD -MP -MF main.d -c -o main.o /Users/buildslave/jenkins/workspace/lldb-cmake-matrix/llvm-project/lldb/test/API/functionalities/data-formatter/data-formatter-stl/libcxx/string/simulator/main.cpp
In file included from /Users/buildslave/jenkins/workspace/lldb-cmake-matrix/llvm-project/lldb/test/API/functionalities/data-formatter/data-formatter-stl/libcxx/string/simulator/main.cpp:2:
In file included from /Users/buildslave/jenkins/workspace/lldb-cmake-matrix/clang_900_build/bin/../include/c++/v1/memory:653:
In file included from /Users/buildslave/jenkins/workspace/lldb-cmake-matrix/clang_900_build/bin/../include/c++/v1/typeinfo:60:
In file included from /Users/buildslave/jenkins/workspace/lldb-cmake-matrix/clang_900_build/bin/../include/c++/v1/exception:81:
In file included from /Users/buildslave/jenkins/workspace/lldb-cmake-matrix/clang_900_build/bin/../include/c++/v1/cstdlib:85:
In file included from /Users/buildslave/jenkins/workspace/lldb-cmake-matrix/clang_900_build/bin/../include/c++/v1/stdlib.h:100:
/Users/buildslave/jenkins/workspace/lldb-cmake-matrix/clang_900_build/bin/../include/c++/v1/math.h:769:12: error: no member named 'labs' in the global namespace; did you mean 'abs'?
  return ::labs(__x);
         ~~^
/Users/buildslave/jenkins/workspace/lldb-cmake-matrix/clang_900_build/bin/../include/c++/v1/math.h:768:39: note: 'abs' declared here
inline _LIBCPP_INLINE_VISIBILITY long abs(long __x) _NOEXCEPT {
                                      ^
/Users/buildslave/jenkins/workspace/lldb-cmake-matrix/clang_900_build/bin/../include/c++/v1/math.h:773:12: error: no member named 'llabs' in the global namespace
  return ::llabs(__x);
         ~~^
/Users/buildslave/jenkins/workspace/lldb-cmake-matrix/clang_900_build/bin/../include/c++/v1/math.h:781:12: error: no member named 'fabsf' in the global namespace
  return ::fabsf(__lcpp_x);
         ~~^
/Users/buildslave/jenkins/workspace/lldb-cmake-matrix/clang_900_build/bin/../include/c++/v1/math.h:785:12: error: no member named 'fabs' in the global namespace; did you mean 'abs'?
  return ::fabs(__lcpp_x);
         ~~^
/Users/buildslave/jenkins/workspace/lldb-cmake-matrix/clang_900_build/bin/../include/c++/v1/math.h:768:39: note: 'abs' declared here
inline _LIBCPP_INLINE_VISIBILITY long abs(long __x) _NOEXCEPT {
                                      ^
/Users/buildslave/jenkins/workspace/lldb-cmake-matrix/clang_900_build/bin/../include/c++/v1/math.h:790:12: error: no member named 'fabsl' in the global namespace
  return ::fabsl(__lcpp_x);
         ~~^
/Users/buildslave/jenkins/workspace/lldb-cmake-matrix/clang_900_build/bin/../include/c++/v1/math.h:804:34: error: unknown type name 'ldiv_t'
inline _LIBCPP_INLINE_VISIBILITY ldiv_t div(long __x, long __y) _NOEXCEPT {
                                 ^
/Users/buildslave/jenkins/workspace/lldb-cmake-matrix/clang_900_build/bin/../include/c++/v1/math.h:805:12: error: no member named 'ldiv' in the global namespace
  return ::ldiv(__x, __y);
         ~~^
/Users/buildslave/jenkins/workspace/lldb-cmake-matrix/clang_900_build/bin/../include/c++/v1/math.h:808:34: error: unknown type name 'lldiv_t'
inline _LIBCPP_INLINE_VISIBILITY lldiv_t div(long long __x,
                                 ^
/Users/buildslave/jenkins/workspace/lldb-cmake-matrix/clang_900_build/bin/../include/c++/v1/math.h:810:12: error: no member named 'lldiv' in the global namespace
  return ::lldiv(__x, __y);
         ~~^
/Users/buildslave/jenkins/workspace/lldb-cmake-matrix/clang_900_build/bin/../include/c++/v1/math.h:818:93: error: no member named 'acosf' in the global namespace; did you mean 'acos'?
inline _LIBCPP_INLINE_VISIBILITY float       acos(float __lcpp_x) _NOEXCEPT       {return ::acosf(__lcpp_x);}
                                                                                          ~~^
/Users/buildslave/jenkins/workspace/lldb-cmake-matrix/clang_900_build/bin/../include/c++/v1/math.h:818:46: note: 'acos' declared here
inline _LIBCPP_INLINE_VISIBILITY float       acos(float __lcpp_x) _NOEXCEPT       {return ::acosf(__lcpp_x);}
                                             ^
/Users/buildslave/jenkins/workspace/lldb-cmake-matrix/clang_900_build/bin/../include/c++/v1/math.h:819:93: error: no member named 'acosl' in the global namespace; did you mean 'acos'?
inline _LIBCPP_INLINE_VISIBILITY long double acos(long double __lcpp_x) _NOEXCEPT {return ::acosl(__lcpp_x);}
                                                                                          ~~^
/Users/buildslave/jenkins/workspace/lldb-cmake-matrix/clang_900_build/bin/../include/c++/v1/math.h:818:46: note: 'acos' declared here
inline _LIBCPP_INLINE_VISIBILITY float       acos(float __lcpp_x) _NOEXCEPT       {return ::acosf(__lcpp_x);}
                                             ^
/Users/buildslave/jenkins/workspace/lldb-cmake-matrix/clang_900_build/bin/../include/c++/v1/math.h:825:38: error: call to 'acos' is ambiguous
acos(_A1 __lcpp_x) _NOEXCEPT {return ::acos((double)__lcpp_x);}
                                     ^~~~~~
/Users/buildslave/jenkins/workspace/lldb-cmake-matrix/clang_900_build/bin/../include/c++/v1/math.h:818:46: note: candidate function
inline _LIBCPP_INLINE_VISIBILITY float       acos(float __lcpp_x) _NOEXCEPT       {return ::acosf(__lcpp_x);}
                                             ^
/Users/buildslave/jenkins/workspace/lldb-cmake-matrix/clang_900_build/bin/../include/c++/v1/math.h:819:46: note: candidate function
inline _LIBCPP_INLINE_VISIBILITY long double acos(long double __lcpp_x) _NOEXCEPT {return ::acosl(__lcpp_x);}
                                             ^
/Users/buildslave/jenkins/workspace/lldb-cmake-matrix/clang_900_build/bin/../include/c++/v1/math.h:830:93: error: no member named 'asinf' in the global namespace; did you mean 'asin'?
inline _LIBCPP_INLINE_VISIBILITY float       asin(float __lcpp_x) _NOEXCEPT       {return ::asinf(__lcpp_x);}
                                                                                          ~~^
/Users/buildslave/jenkins/workspace/lldb-cmake-matrix/clang_900_build/bin/../include/c++/v1/math.h:830:46: note: 'asin' declared here
inline _LIBCPP_INLINE_VISIBILITY float       asin(float __lcpp_x) _NOEXCEPT       {return ::asinf(__lcpp_x);}
                                             ^
/Users/buildslave/jenkins/workspace/lldb-cmake-matrix/clang_900_build/bin/../include/c++/v1/math.h:831:93: error: no member named 'asinl' in the global namespace; did you mean 'asin'?
inline _LIBCPP_INLINE_VISIBILITY long double asin(long double __lcpp_x) _NOEXCEPT {return ::asinl(__lcpp_x);}
                                                                                          ~~^
/Users/buildslave/jenkins/workspace/lldb-cmake-matrix/clang_900_build/bin/../include/c++/v1/math.h:830:46: note: 'asin' declared here
inline _LIBCPP_INLINE_VISIBILITY float       asin(float __lcpp_x) _NOEXCEPT       {return ::asinf(__lcpp_x);}
                                             ^
/Users/buildslave/jenkins/workspace/lldb-cmake-matrix/clang_900_build/bin/../include/c++/v1/math.h:837:38: error: call to 'asin' is ambiguous
asin(_A1 __lcpp_x) _NOEXCEPT {return ::asin((double)__lcpp_x);}
                                     ^~~~~~
/Users/buildslave/jenkins/workspace/lldb-cmake-matrix/clang_900_build/bin/../include/c++/v1/math.h:830:46: note: candidate function
inline _LIBCPP_INLINE_VISIBILITY float       asin(float __lcpp_x) _NOEXCEPT       {return ::asinf(__lcpp_x);}
                                             ^
/Users/buildslave/jenkins/workspace/lldb-cmake-matrix/clang_900_build/bin/../include/c++/v1/math.h:831:46: note: candidate function
inline _LIBCPP_INLINE_VISIBILITY long double asin(long double __lcpp_x) _NOEXCEPT {return ::asinl(__lcpp_x);}
                                             ^
/Users/buildslave/jenkins/workspace/lldb-cmake-matrix/clang_900_build/bin/../include/c++/v1/math.h:842:93: error: no member named 'atanf' in the global namespace; did you mean 'atan'?
inline _LIBCPP_INLINE_VISIBILITY float       atan(float __lcpp_x) _NOEXCEPT       {return ::atanf(__lcpp_x);}
                                                                                          ~~^
/Users/buildslave/jenkins/workspace/lldb-cmake-matrix/clang_900_build/bin/../include/c++/v1/math.h:842:46: note: 'atan' declared here
inline _LIBCPP_INLINE_VISIBILITY float       atan(float __lcpp_x) _NOEXCEPT       {return ::atanf(__lcpp_x);}
                                             ^
/Users/buildslave/jenkins/workspace/lldb-cmake-matrix/clang_900_build/bin/../include/c++/v1/math.h:843:93: error: no member named 'atanl' in the global namespace; did you mean 'atan'?
inline _LIBCPP_INLINE_VISIBILITY long double atan(long double __lcpp_x) _NOEXCEPT {return ::atanl(__lcpp_x);}
                                                                                          ~~^
/Users/buildslave/jenkins/workspace/lldb-cmake-matrix/clang_900_build/bin/../include/c++/v1/math.h:842:46: note: 'atan' declared here
inline _LIBCPP_INLINE_VISIBILITY float       atan(float __lcpp_x) _NOEXCEPT       {return ::atanf(__lcpp_x);}
                                             ^
/Users/buildslave/jenkins/workspace/lldb-cmake-matrix/clang_900_build/bin/../include/c++/v1/math.h:849:38: error: call to 'atan' is ambiguous
atan(_A1 __lcpp_x) _NOEXCEPT {return ::atan((double)__lcpp_x);}
                                     ^~~~~~
/Users/buildslave/jenkins/workspace/lldb-cmake-matrix/clang_900_build/bin/../include/c++/v1/math.h:842:46: note: candidate function
inline _LIBCPP_INLINE_VISIBILITY float       atan(float __lcpp_x) _NOEXCEPT       {return ::atanf(__lcpp_x);}
                                             ^
/Users/buildslave/jenkins/workspace/lldb-cmake-matrix/clang_900_build/bin/../include/c++/v1/math.h:843:46: note: candidate function
inline _LIBCPP_INLINE_VISIBILITY long double atan(long double __lcpp_x) _NOEXCEPT {return ::atanl(__lcpp_x);}
                                             ^
/Users/buildslave/jenkins/workspace/lldb-cmake-matrix/clang_900_build/bin/../include/c++/v1/math.h:854:116: error: no member named 'atan2f' in the global namespace; did you mean 'atan2'?
inline _LIBCPP_INLINE_VISIBILITY float       atan2(float __lcpp_y, float __lcpp_x) _NOEXCEPT             {return ::atan2f(__lcpp_y, __lcpp_x);}
                                                                                                                 ~~^
/Users/buildslave/jenkins/workspace/lldb-cmake-matrix/clang_900_build/bin/../include/c++/v1/math.h:854:46: note: 'atan2' declared here
inline _LIBCPP_INLINE_VISIBILITY float       atan2(float __lcpp_y, float __lcpp_x) _NOEXCEPT             {return ::atan2f(__lcpp_y, __lcpp_x);}
                                             ^
fatal error: too many errors emitted, stopping now [-ferror-limit=]
20 errors generated.
make: *** [main.o] Error 1

Test Directory:
/Users/buildslave/jenkins/workspace/lldb-cmake-matrix/llvm-project/lldb/test/API/functionalities/data-formatter/data-formatter-stl/libcxx/string/simulator
======================================================================
ERROR: test_r4_ALTERNATE_LAYOUT (TestDataFormatterLibcxxStringSimulator.LibcxxStringDataFormatterSimulatorTestCase)
    partial(func, *args, **keywords) - new function with partial application
----------------------------------------------------------------------
Error when building test subject.

Build Command:
make VPATH=/Users/buildslave/jenkins/workspace/lldb-cmake-matrix/llvm-project/lldb/test/API/functionalities/data-formatter/data-formatter-stl/libcxx/string/simulator -C /Users/buildslave/jenkins/workspace/lldb-cmake-matrix/lldb-build/lldb-test-build.noindex/functionalities/data-formatter/data-formatter-stl/libcxx/string/simulator/TestDataFormatterLibcxxStringSimulator.test_r4_ALTERNATE_LAYOUT -I /Users/buildslave/jenkins/workspace/lldb-cmake-matrix/llvm-project/lldb/test/API/functionalities/data-formatter/data-formatter-stl/libcxx/string/simulator -I /Users/buildslave/jenkins/workspace/lldb-cmake-matrix/llvm-project/lldb/packages/Python/lldbsuite/test/make -f /Users/buildslave/jenkins/workspace/lldb-cmake-matrix/llvm-project/lldb/test/API/functionalities/data-formatter/data-formatter-stl/libcxx/string/simulator/Makefile all ARCH=x86_64 'CC="/Users/buildslave/jenkins/workspace/lldb-cmake-matrix/clang_900_build/bin/clang"' DSYMUTIL=/Users/buildslave/jenkins/workspace/lldb-cmake-matrix/lldb-build/./bin/dsymutil CODESIGN=codesign CLANG_MODULE_CACHE_DIR=/Users/buildslave/jenkins/workspace/lldb-cmake-matrix/lldb-build/lldb-test-build.noindex/module-cache-clang/lldb-api USE_HERMETIC_LIBCPP=1 'CXXFLAGS_EXTRAS=-DREVISION=4 -DALTERNATE_LAYOUT'

Build Command Output:
"/Users/buildslave/jenkins/workspace/lldb-cmake-matrix/clang_900_build/bin/clang"  -std=c++11 -g -O0 -isysroot "/Applications/Xcode.app/Contents/Developer/Platforms/MacOSX.platform/Developer/SDKs/MacOSX11.1.sdk" -arch x86_64  -I/Users/buildslave/jenkins/workspace/lldb-cmake-matrix/llvm-project/lldb/packages/Python/lldbsuite/test/make/../../../../../include -I/Users/buildslave/jenkins/workspace/lldb-cmake-matrix/llvm-project/lldb/test/API/functionalities/data-formatter/data-formatter-stl/libcxx/string/simulator -I/Users/buildslave/jenkins/workspace/lldb-cmake-matrix/llvm-project/lldb/packages/Python/lldbsuite/test/make -include /Users/buildslave/jenkins/workspace/lldb-cmake-matrix/llvm-project/lldb/packages/Python/lldbsuite/test/make/test_common.h  -fno-limit-debug-info    -DREVISION=4 -DALTERNATE_LAYOUT -std=c++14 --driver-mode=g++ -MT main.o -MD -MP -MF main.d -c -o main.o /Users/buildslave/jenkins/workspace/lldb-cmake-matrix/llvm-project/lldb/test/API/functionalities/data-formatter/data-formatter-stl/libcxx/string/simulator/main.cpp
In file included from /Users/buildslave/jenkins/workspace/lldb-cmake-matrix/llvm-project/lldb/test/API/functionalities/data-formatter/data-formatter-stl/libcxx/string/simulator/main.cpp:2:
In file included from /Users/buildslave/jenkins/workspace/lldb-cmake-matrix/clang_900_build/bin/../include/c++/v1/memory:653:
In file included from /Users/buildslave/jenkins/workspace/lldb-cmake-matrix/clang_900_build/bin/../include/c++/v1/typeinfo:60:
In file included from /Users/buildslave/jenkins/workspace/lldb-cmake-matrix/clang_900_build/bin/../include/c++/v1/exception:81:
In file included from /Users/buildslave/jenkins/workspace/lldb-cmake-matrix/clang_900_build/bin/../include/c++/v1/cstdlib:85:
In file included from /Users/buildslave/jenkins/workspace/lldb-cmake-matrix/clang_900_build/bin/../include/c++/v1/stdlib.h:100:
/Users/buildslave/jenkins/workspace/lldb-cmake-matrix/clang_900_build/bin/../include/c++/v1/math.h:769:12: error: no member named 'labs' in the global namespace; did you mean 'abs'?
  return ::labs(__x);
         ~~^
/Users/buildslave/jenkins/workspace/lldb-cmake-matrix/clang_900_build/bin/../include/c++/v1/math.h:768:39: note: 'abs' declared here
inline _LIBCPP_INLINE_VISIBILITY long abs(long __x) _NOEXCEPT {
                                      ^
/Users/buildslave/jenkins/workspace/lldb-cmake-matrix/clang_900_build/bin/../include/c++/v1/math.h:773:12: error: no member named 'llabs' in the global namespace
  return ::llabs(__x);
         ~~^
/Users/buildslave/jenkins/workspace/lldb-cmake-matrix/clang_900_build/bin/../include/c++/v1/math.h:781:12: error: no member named 'fabsf' in the global namespace
  return ::fabsf(__lcpp_x);
         ~~^
/Users/buildslave/jenkins/workspace/lldb-cmake-matrix/clang_900_build/bin/../include/c++/v1/math.h:785:12: error: no member named 'fabs' in the global namespace; did you mean 'abs'?
  return ::fabs(__lcpp_x);
         ~~^
/Users/buildslave/jenkins/workspace/lldb-cmake-matrix/clang_900_build/bin/../include/c++/v1/math.h:768:39: note: 'abs' declared here
inline _LIBCPP_INLINE_VISIBILITY long abs(long __x) _NOEXCEPT {
                                      ^
/Users/buildslave/jenkins/workspace/lldb-cmake-matrix/clang_900_build/bin/../include/c++/v1/math.h:790:12: error: no member named 'fabsl' in the global namespace
  return ::fabsl(__lcpp_x);
         ~~^
/Users/buildslave/jenkins/workspace/lldb-cmake-matrix/clang_900_build/bin/../include/c++/v1/math.h:804:34: error: unknown type name 'ldiv_t'
inline _LIBCPP_INLINE_VISIBILITY ldiv_t div(long __x, long __y) _NOEXCEPT {
                                 ^
/Users/buildslave/jenkins/workspace/lldb-cmake-matrix/clang_900_build/bin/../include/c++/v1/math.h:805:12: error: no member named 'ldiv' in the global namespace
  return ::ldiv(__x, __y);
         ~~^
/Users/buildslave/jenkins/workspace/lldb-cmake-matrix/clang_900_build/bin/../include/c++/v1/math.h:808:34: error: unknown type name 'lldiv_t'
inline _LIBCPP_INLINE_VISIBILITY lldiv_t div(long long __x,
                                 ^
/Users/buildslave/jenkins/workspace/lldb-cmake-matrix/clang_900_build/bin/../include/c++/v1/math.h:810:12: error: no member named 'lldiv' in the global namespace
  return ::lldiv(__x, __y);
         ~~^
/Users/buildslave/jenkins/workspace/lldb-cmake-matrix/clang_900_build/bin/../include/c++/v1/math.h:818:93: error: no member named 'acosf' in the global namespace; did you mean 'acos'?
inline _LIBCPP_INLINE_VISIBILITY float       acos(float __lcpp_x) _NOEXCEPT       {return ::acosf(__lcpp_x);}
                                                                                          ~~^
/Users/buildslave/jenkins/workspace/lldb-cmake-matrix/clang_900_build/bin/../include/c++/v1/math.h:818:46: note: 'acos' declared here
inline _LIBCPP_INLINE_VISIBILITY float       acos(float __lcpp_x) _NOEXCEPT       {return ::acosf(__lcpp_x);}
                                             ^
/Users/buildslave/jenkins/workspace/lldb-cmake-matrix/clang_900_build/bin/../include/c++/v1/math.h:819:93: error: no member named 'acosl' in the global namespace; did you mean 'acos'?
inline _LIBCPP_INLINE_VISIBILITY long double acos(long double __lcpp_x) _NOEXCEPT {return ::acosl(__lcpp_x);}
                                                                                          ~~^
/Users/buildslave/jenkins/workspace/lldb-cmake-matrix/clang_900_build/bin/../include/c++/v1/math.h:818:46: note: 'acos' declared here
inline _LIBCPP_INLINE_VISIBILITY float       acos(float __lcpp_x) _NOEXCEPT       {return ::acosf(__lcpp_x);}
                                             ^
/Users/buildslave/jenkins/workspace/lldb-cmake-matrix/clang_900_build/bin/../include/c++/v1/math.h:825:38: error: call to 'acos' is ambiguous
acos(_A1 __lcpp_x) _NOEXCEPT {return ::acos((double)__lcpp_x);}
                                     ^~~~~~
/Users/buildslave/jenkins/workspace/lldb-cmake-matrix/clang_900_build/bin/../include/c++/v1/math.h:818:46: note: candidate function
inline _LIBCPP_INLINE_VISIBILITY float       acos(float __lcpp_x) _NOEXCEPT       {return ::acosf(__lcpp_x);}
                                             ^
/Users/buildslave/jenkins/workspace/lldb-cmake-matrix/clang_900_build/bin/../include/c++/v1/math.h:819:46: note: candidate function
inline _LIBCPP_INLINE_VISIBILITY long double acos(long double __lcpp_x) _NOEXCEPT {return ::acosl(__lcpp_x);}
                                             ^
/Users/buildslave/jenkins/workspace/lldb-cmake-matrix/clang_900_build/bin/../include/c++/v1/math.h:830:93: error: no member named 'asinf' in the global namespace; did you mean 'asin'?
inline _LIBCPP_INLINE_VISIBILITY float       asin(float __lcpp_x) _NOEXCEPT       {return ::asinf(__lcpp_x);}
                                                                                          ~~^
/Users/buildslave/jenkins/workspace/lldb-cmake-matrix/clang_900_build/bin/../include/c++/v1/math.h:830:46: note: 'asin' declared here
inline _LIBCPP_INLINE_VISIBILITY float       asin(float __lcpp_x) _NOEXCEPT       {return ::asinf(__lcpp_x);}
                                             ^
/Users/buildslave/jenkins/workspace/lldb-cmake-matrix/clang_900_build/bin/../include/c++/v1/math.h:831:93: error: no member named 'asinl' in the global namespace; did you mean 'asin'?
inline _LIBCPP_INLINE_VISIBILITY long double asin(long double __lcpp_x) _NOEXCEPT {return ::asinl(__lcpp_x);}
                                                                                          ~~^
/Users/buildslave/jenkins/workspace/lldb-cmake-matrix/clang_900_build/bin/../include/c++/v1/math.h:830:46: note: 'asin' declared here
inline _LIBCPP_INLINE_VISIBILITY float       asin(float __lcpp_x) _NOEXCEPT       {return ::asinf(__lcpp_x);}
                                             ^
/Users/buildslave/jenkins/workspace/lldb-cmake-matrix/clang_900_build/bin/../include/c++/v1/math.h:837:38: error: call to 'asin' is ambiguous
asin(_A1 __lcpp_x) _NOEXCEPT {return ::asin((double)__lcpp_x);}
                                     ^~~~~~
/Users/buildslave/jenkins/workspace/lldb-cmake-matrix/clang_900_build/bin/../include/c++/v1/math.h:830:46: note: candidate function
inline _LIBCPP_INLINE_VISIBILITY float       asin(float __lcpp_x) _NOEXCEPT       {return ::asinf(__lcpp_x);}
                                             ^
/Users/buildslave/jenkins/workspace/lldb-cmake-matrix/clang_900_build/bin/../include/c++/v1/math.h:831:46: note: candidate function
inline _LIBCPP_INLINE_VISIBILITY long double asin(long double __lcpp_x) _NOEXCEPT {return ::asinl(__lcpp_x);}
                                             ^
/Users/buildslave/jenkins/workspace/lldb-cmake-matrix/clang_900_build/bin/../include/c++/v1/math.h:842:93: error: no member named 'atanf' in the global namespace; did you mean 'atan'?
inline _LIBCPP_INLINE_VISIBILITY float       atan(float __lcpp_x) _NOEXCEPT       {return ::atanf(__lcpp_x);}
                                                                                          ~~^
/Users/buildslave/jenkins/workspace/lldb-cmake-matrix/clang_900_build/bin/../include/c++/v1/math.h:842:46: note: 'atan' declared here
inline _LIBCPP_INLINE_VISIBILITY float       atan(float __lcpp_x) _NOEXCEPT       {return ::atanf(__lcpp_x);}
                                             ^
/Users/buildslave/jenkins/workspace/lldb-cmake-matrix/clang_900_build/bin/../include/c++/v1/math.h:843:93: error: no member named 'atanl' in the global namespace; did you mean 'atan'?
inline _LIBCPP_INLINE_VISIBILITY long double atan(long double __lcpp_x) _NOEXCEPT {return ::atanl(__lcpp_x);}
                                                                                          ~~^
/Users/buildslave/jenkins/workspace/lldb-cmake-matrix/clang_900_build/bin/../include/c++/v1/math.h:842:46: note: 'atan' declared here
inline _LIBCPP_INLINE_VISIBILITY float       atan(float __lcpp_x) _NOEXCEPT       {return ::atanf(__lcpp_x);}
                                             ^
/Users/buildslave/jenkins/workspace/lldb-cmake-matrix/clang_900_build/bin/../include/c++/v1/math.h:849:38: error: call to 'atan' is ambiguous
atan(_A1 __lcpp_x) _NOEXCEPT {return ::atan((double)__lcpp_x);}
                                     ^~~~~~
/Users/buildslave/jenkins/workspace/lldb-cmake-matrix/clang_900_build/bin/../include/c++/v1/math.h:842:46: note: candidate function
inline _LIBCPP_INLINE_VISIBILITY float       atan(float __lcpp_x) _NOEXCEPT       {return ::atanf(__lcpp_x);}
                                             ^
/Users/buildslave/jenkins/workspace/lldb-cmake-matrix/clang_900_build/bin/../include/c++/v1/math.h:843:46: note: candidate function
inline _LIBCPP_INLINE_VISIBILITY long double atan(long double __lcpp_x) _NOEXCEPT {return ::atanl(__lcpp_x);}
                                             ^
/Users/buildslave/jenkins/workspace/lldb-cmake-matrix/clang_900_build/bin/../include/c++/v1/math.h:854:116: error: no member named 'atan2f' in the global namespace; did you mean 'atan2'?
inline _LIBCPP_INLINE_VISIBILITY float       atan2(float __lcpp_y, float __lcpp_x) _NOEXCEPT             {return ::atan2f(__lcpp_y, __lcpp_x);}
                                                                                                                 ~~^
/Users/buildslave/jenkins/workspace/lldb-cmake-matrix/clang_900_build/bin/../include/c++/v1/math.h:854:46: note: 'atan2' declared here
inline _LIBCPP_INLINE_VISIBILITY float       atan2(float __lcpp_y, float __lcpp_x) _NOEXCEPT             {return ::atan2f(__lcpp_y, __lcpp_x);}
                                             ^
fatal error: too many errors emitted, stopping now [-ferror-limit=]
20 errors generated.
make: *** [main.o] Error 1

Test Directory:
/Users/buildslave/jenkins/workspace/lldb-cmake-matrix/llvm-project/lldb/test/API/functionalities/data-formatter/data-formatter-stl/libcxx/string/simulator
----------------------------------------------------------------------
Ran 10 tests in 4.861s

RESULT: FAILED (0 passes, 0 failures, 10 errors, 0 skipped, 0 expected failures, 0 unexpected successes)

--