Regression

Test Clang 11.0.1 / lldb-api.functionalities/data-formatter/poarray.TestPrintObjectArray.py (from lldb-api)

Failing for the past 1 build (Since #5041 )
Took 15 sec.

Stacktrace

Script:
--
/Applications/Xcode.app/Contents/Developer/Library/Frameworks/Python3.framework/Versions/3.8/bin/python3.8 /Users/buildslave/jenkins/workspace/lldb-cmake-matrix/llvm-project/lldb/test/API/dotest.py -u CXXFLAGS -u CFLAGS --codesign-identity lldb_codesign --arch x86_64 --build-dir /Users/buildslave/jenkins/workspace/lldb-cmake-matrix/lldb-build/lldb-test-build.noindex -t --env TERM=vt100 --skip-category gmodules --skip-category watchpoint --skip-category llgs --skip-category debugserver --arch=x86_64 --env LLVM_LIBS_DIR=/Users/buildslave/jenkins/workspace/lldb-cmake-matrix/lldb-build/./lib --env LLVM_INCLUDE_DIR=/Users/buildslave/jenkins/workspace/lldb-cmake-matrix/lldb-build/include --env LLVM_TOOLS_DIR=/Users/buildslave/jenkins/workspace/lldb-cmake-matrix/lldb-build/./bin --hermetic-libcxx --arch x86_64 --build-dir /Users/buildslave/jenkins/workspace/lldb-cmake-matrix/lldb-build/lldb-test-build.noindex --lldb-module-cache-dir /Users/buildslave/jenkins/workspace/lldb-cmake-matrix/lldb-build/lldb-test-build.noindex/module-cache-lldb/lldb-api --clang-module-cache-dir /Users/buildslave/jenkins/workspace/lldb-cmake-matrix/lldb-build/lldb-test-build.noindex/module-cache-clang/lldb-api --executable /Users/buildslave/jenkins/workspace/lldb-cmake-matrix/lldb-build/./bin/lldb --compiler /Users/buildslave/jenkins/workspace/lldb-cmake-matrix/clang_1101_build/bin/clang --dsymutil /Users/buildslave/jenkins/workspace/lldb-cmake-matrix/lldb-build/./bin/dsymutil --llvm-tools-dir /Users/buildslave/jenkins/workspace/lldb-cmake-matrix/lldb-build/./bin --lldb-libs-dir /Users/buildslave/jenkins/workspace/lldb-cmake-matrix/lldb-build/./lib /Users/buildslave/jenkins/workspace/lldb-cmake-matrix/llvm-project/lldb/test/API/functionalities/data-formatter/poarray -p TestPrintObjectArray.py
--
Exit Code: 1

Command Output (stdout):
--
lldb version 16.0.99git (http://labmaster3.local/git/llvm-project.git revision 807b8cb06ca05228f3ecb4709f4f4141748d2ca9)
  clang revision 807b8cb06ca05228f3ecb4709f4f4141748d2ca9
  llvm revision 807b8cb06ca05228f3ecb4709f4f4141748d2ca9
Skipping the following test categories: ['gmodules', 'watchpoint', 'llgs', 'debugserver', 'libstdcxx', 'dwo', 'llgs', 'fork']

--
Command Output (stderr):
--
Change dir to: /Users/buildslave/jenkins/workspace/lldb-cmake-matrix/llvm-project/lldb/test/API/functionalities/data-formatter/poarray
runCmd: settings clear -all
output: 

runCmd: settings set symbols.enable-external-lookup false
output: 

runCmd: settings set target.inherit-tcc true
output: 

runCmd: settings set target.detach-on-error false
output: 

runCmd: settings set target.auto-apply-fixits false
output: 

runCmd: settings set plugin.process.gdb-remote.packet-timeout 60
output: 

runCmd: settings set symbols.clang-modules-cache-path "/Users/buildslave/jenkins/workspace/lldb-cmake-matrix/lldb-build/lldb-test-build.noindex/module-cache-lldb/lldb-api"
output: 

runCmd: settings set use-color false
output: 

runCmd: setting set target.prefer-dynamic-value no-dynamic-values
output: 

make VPATH=/Users/buildslave/jenkins/workspace/lldb-cmake-matrix/llvm-project/lldb/test/API/functionalities/data-formatter/poarray -C /Users/buildslave/jenkins/workspace/lldb-cmake-matrix/lldb-build/lldb-test-build.noindex/functionalities/data-formatter/poarray/TestPrintObjectArray.test_print_array_dsym -I /Users/buildslave/jenkins/workspace/lldb-cmake-matrix/llvm-project/lldb/test/API/functionalities/data-formatter/poarray -I /Users/buildslave/jenkins/workspace/lldb-cmake-matrix/llvm-project/lldb/packages/Python/lldbsuite/test/make -f /Users/buildslave/jenkins/workspace/lldb-cmake-matrix/llvm-project/lldb/test/API/functionalities/data-formatter/poarray/Makefile MAKE_DSYM=YES all ARCH=x86_64 'CC="/Users/buildslave/jenkins/workspace/lldb-cmake-matrix/clang_1101_build/bin/clang"' DSYMUTIL=/Users/buildslave/jenkins/workspace/lldb-cmake-matrix/lldb-build/./bin/dsymutil CODESIGN=codesign CLANG_MODULE_CACHE_DIR=/Users/buildslave/jenkins/workspace/lldb-cmake-matrix/lldb-build/lldb-test-build.noindex/module-cache-clang/lldb-api USE_HERMETIC_LIBCPP=1

FAIL: LLDB (/Users/buildslave/jenkins/workspace/lldb-cmake-matrix/clang_1101_build/bin/clang-x86_64) :: test_print_array_dsym (TestPrintObjectArray.PrintObjectArrayTestCase)
runCmd: settings clear -all
output: 

runCmd: settings set symbols.enable-external-lookup false
output: 

runCmd: settings set target.inherit-tcc true
output: 

runCmd: settings set target.detach-on-error false
output: 

runCmd: settings set target.auto-apply-fixits false
output: 

runCmd: settings set plugin.process.gdb-remote.packet-timeout 60
output: 

runCmd: settings set symbols.clang-modules-cache-path "/Users/buildslave/jenkins/workspace/lldb-cmake-matrix/lldb-build/lldb-test-build.noindex/module-cache-lldb/lldb-api"
output: 

runCmd: settings set use-color false
output: 

runCmd: setting set target.prefer-dynamic-value no-dynamic-values
output: 

make VPATH=/Users/buildslave/jenkins/workspace/lldb-cmake-matrix/llvm-project/lldb/test/API/functionalities/data-formatter/poarray -C /Users/buildslave/jenkins/workspace/lldb-cmake-matrix/lldb-build/lldb-test-build.noindex/functionalities/data-formatter/poarray/TestPrintObjectArray.test_print_array_dwarf -I /Users/buildslave/jenkins/workspace/lldb-cmake-matrix/llvm-project/lldb/test/API/functionalities/data-formatter/poarray -I /Users/buildslave/jenkins/workspace/lldb-cmake-matrix/llvm-project/lldb/packages/Python/lldbsuite/test/make -f /Users/buildslave/jenkins/workspace/lldb-cmake-matrix/llvm-project/lldb/test/API/functionalities/data-formatter/poarray/Makefile MAKE_DSYM=NO all ARCH=x86_64 'CC="/Users/buildslave/jenkins/workspace/lldb-cmake-matrix/clang_1101_build/bin/clang"' DSYMUTIL=/Users/buildslave/jenkins/workspace/lldb-cmake-matrix/lldb-build/./bin/dsymutil CODESIGN=codesign CLANG_MODULE_CACHE_DIR=/Users/buildslave/jenkins/workspace/lldb-cmake-matrix/lldb-build/lldb-test-build.noindex/module-cache-clang/lldb-api USE_HERMETIC_LIBCPP=1

FAIL: LLDB (/Users/buildslave/jenkins/workspace/lldb-cmake-matrix/clang_1101_build/bin/clang-x86_64) :: test_print_array_dwarf (TestPrintObjectArray.PrintObjectArrayTestCase)
UNSUPPORTED: LLDB (/Users/buildslave/jenkins/workspace/lldb-cmake-matrix/clang_1101_build/bin/clang-x86_64) :: test_print_array_dwo (TestPrintObjectArray.PrintObjectArrayTestCase) (test case does not fall in any category of interest for this run) 
UNSUPPORTED: LLDB (/Users/buildslave/jenkins/workspace/lldb-cmake-matrix/clang_1101_build/bin/clang-x86_64) :: test_print_array_gmodules (TestPrintObjectArray.PrintObjectArrayTestCase) (test case does not fall in any category of interest for this run) 
runCmd: settings clear -all
output: 

runCmd: settings set symbols.enable-external-lookup false
output: 

runCmd: settings set target.inherit-tcc true
output: 

runCmd: settings set target.detach-on-error false
output: 

runCmd: settings set target.auto-apply-fixits false
output: 

runCmd: settings set plugin.process.gdb-remote.packet-timeout 60
output: 

runCmd: settings set symbols.clang-modules-cache-path "/Users/buildslave/jenkins/workspace/lldb-cmake-matrix/lldb-build/lldb-test-build.noindex/module-cache-lldb/lldb-api"
output: 

runCmd: settings set use-color false
output: 

runCmd: setting set target.prefer-dynamic-value no-dynamic-values
output: 

make VPATH=/Users/buildslave/jenkins/workspace/lldb-cmake-matrix/llvm-project/lldb/test/API/functionalities/data-formatter/poarray -C /Users/buildslave/jenkins/workspace/lldb-cmake-matrix/lldb-build/lldb-test-build.noindex/functionalities/data-formatter/poarray/TestPrintObjectArray.test_print_array_no_const_dsym -I /Users/buildslave/jenkins/workspace/lldb-cmake-matrix/llvm-project/lldb/test/API/functionalities/data-formatter/poarray -I /Users/buildslave/jenkins/workspace/lldb-cmake-matrix/llvm-project/lldb/packages/Python/lldbsuite/test/make -f /Users/buildslave/jenkins/workspace/lldb-cmake-matrix/llvm-project/lldb/test/API/functionalities/data-formatter/poarray/Makefile MAKE_DSYM=YES all ARCH=x86_64 'CC="/Users/buildslave/jenkins/workspace/lldb-cmake-matrix/clang_1101_build/bin/clang"' DSYMUTIL=/Users/buildslave/jenkins/workspace/lldb-cmake-matrix/lldb-build/./bin/dsymutil CODESIGN=codesign CLANG_MODULE_CACHE_DIR=/Users/buildslave/jenkins/workspace/lldb-cmake-matrix/lldb-build/lldb-test-build.noindex/module-cache-clang/lldb-api USE_HERMETIC_LIBCPP=1 'CC=xcrun clang' 'CFLAGS_EXTRAS=-fno-constant-nsnumber-literals -fno-constant-nsarray-literals -fno-constant-nsdictionary-literals'

xcrun clang -std=c++11 -g -O0 -isysroot "/Applications/Xcode.app/Contents/Developer/Platforms/MacOSX.platform/Developer/SDKs/MacOSX11.1.sdk" -arch x86_64  -I/Users/buildslave/jenkins/workspace/lldb-cmake-matrix/llvm-project/lldb/packages/Python/lldbsuite/test/make/../../../../../include -I/Users/buildslave/jenkins/workspace/lldb-cmake-matrix/llvm-project/lldb/test/API/functionalities/data-formatter/poarray -I/Users/buildslave/jenkins/workspace/lldb-cmake-matrix/llvm-project/lldb/packages/Python/lldbsuite/test/make -include /Users/buildslave/jenkins/workspace/lldb-cmake-matrix/llvm-project/lldb/packages/Python/lldbsuite/test/make/test_common.h  -fno-limit-debug-info  -fno-constant-nsnumber-literals -fno-constant-nsarray-literals -fno-constant-nsdictionary-literals   --driver-mode=g++ -MT main.o -MD -MP -MF main.d -c -o main.o /Users/buildslave/jenkins/workspace/lldb-cmake-matrix/llvm-project/lldb/test/API/functionalities/data-formatter/poarray/main.mm
clang: warning: argument unused during compilation: '-fno-constant-nsnumber-literals' [-Wunused-command-line-argument]
clang: warning: argument unused during compilation: '-fno-constant-nsarray-literals' [-Wunused-command-line-argument]
clang: warning: argument unused during compilation: '-fno-constant-nsdictionary-literals' [-Wunused-command-line-argument]
xcrun clang  main.o -g -O0 -isysroot "/Applications/Xcode.app/Contents/Developer/Platforms/MacOSX.platform/Developer/SDKs/MacOSX11.1.sdk" -arch x86_64  -I/Users/buildslave/jenkins/workspace/lldb-cmake-matrix/llvm-project/lldb/packages/Python/lldbsuite/test/make/../../../../../include -I/Users/buildslave/jenkins/workspace/lldb-cmake-matrix/llvm-project/lldb/test/API/functionalities/data-formatter/poarray -I/Users/buildslave/jenkins/workspace/lldb-cmake-matrix/llvm-project/lldb/packages/Python/lldbsuite/test/make -include /Users/buildslave/jenkins/workspace/lldb-cmake-matrix/llvm-project/lldb/packages/Python/lldbsuite/test/make/test_common.h  -fno-limit-debug-info  -fno-constant-nsnumber-literals -fno-constant-nsarray-literals -fno-constant-nsdictionary-literals -framework Foundation  -lobjc --driver-mode=g++ -o "a.out"
codesign -s - "a.out"
"/Users/buildslave/jenkins/workspace/lldb-cmake-matrix/lldb-build/./bin/dsymutil"  -o "a.out.dSYM" "a.out"


runCmd: file /Users/buildslave/jenkins/workspace/lldb-cmake-matrix/lldb-build/lldb-test-build.noindex/functionalities/data-formatter/poarray/TestPrintObjectArray.test_print_array_no_const_dsym/a.out
output: Current executable set to '/Users/buildslave/jenkins/workspace/lldb-cmake-matrix/lldb-build/lldb-test-build.noindex/functionalities/data-formatter/poarray/TestPrintObjectArray.test_print_array_no_const_dsym/a.out' (x86_64).


runCmd: breakpoint set -f "main.mm" -l 20
output: Breakpoint 1: where = a.out`main + 459 at main.mm:20:3, address = 0x0000000100003efb


Expecting pattern: ^Breakpoint (?P<bpno>[0-9]+): (?P<num_locations>[0-9]+) locations\.$
Not matched

Expecting pattern: ^Breakpoint (?P<bpno>[0-9]+): (?P<num_locations>no) locations \(pending\)\.
Not matched

Expecting pattern: ^Breakpoint (?P<bpno>[0-9]+): where = (?P<module>.*)`(?P<symbol>[+\-]{0,1}[^+]+)( \+ (?P<offset>[0-9]+)){0,1}( \[inlined\] (?P<inline_symbol>.*)){0,1} at (?P<file>[^:]+):(?P<line_no>[0-9]+)(?P<column>(:[0-9]+)?), address = (?P<address>0x[0-9a-fA-F]+)$
Matched

runCmd: run
output: Process 6542 stopped
* thread #1, queue = 'com.apple.main-thread', stop reason = breakpoint 1.1
    frame #0: 0x0000000100003efb a.out`main at main.mm:20:3
   17  	  tobjects->two = array2;
   18  	  tobjects->three = dictionary;
   19  	  id* objects = (id*)tobjects;
-> 20  	  return 0; // break here
    	  ^
   21  	}
Process 6542 launched: '/Users/buildslave/jenkins/workspace/lldb-cmake-matrix/lldb-build/lldb-test-build.noindex/functionalities/data-formatter/poarray/TestPrintObjectArray.test_print_array_no_const_dsym/a.out' (x86_64)


runCmd: thread list
output: Process 6542 stopped
* thread #1: tid = 0x3bb020, 0x0000000100003efb a.out`main at main.mm:20:3, queue = 'com.apple.main-thread', stop reason = breakpoint 1.1


Ran command:
"thread list"

Got output:
Process 6542 stopped
* thread #1: tid = 0x3bb020, 0x0000000100003efb a.out`main at main.mm:20:3, queue = 'com.apple.main-thread', stop reason = breakpoint 1.1

Expecting sub string: "stopped" (was found)
Expecting sub string: "stop reason = breakpoint" (was found)

Adding tearDown hook:         def cleanup():
            self.runCmd('type format clear', check=False)
            self.runCmd('type summary clear', check=False)
            self.runCmd('type synth clear', check=False)


runCmd: expr --element-count 3 --object-description -- objects
output:  {
  <__NSArrayI 0x100208ae0>(
3735928559,
4276993775,
3203398366
)

  <__NSArrayI 0x100208b10>(
Hello,
World
)

  {
    Two =     (
        Hello,
        World
    );
    1 =     (
        Hello,
        World
    );
}

}


Ran command:
"expr --element-count 3 --object-description -- objects"

Got output:
 {
  <__NSArrayI 0x100208ae0>(
3735928559,
4276993775,
3203398366
)

  <__NSArrayI 0x100208b10>(
Hello,
World
)

  {
    Two =     (
        Hello,
        World
    );
    1 =     (
        Hello,
        World
    );
}

}

Expecting sub string: "3735928559" (was found)
Expecting sub string: "4276993775" (was found)
Expecting sub string: "3203398366" (was found)
Expecting sub string: "Hello" (was found)
Expecting sub string: "World" (was found)
Expecting sub string: "Two =" (was found)
Expecting sub string: "1 =" (was found)

runCmd: poarray 3 objects
output:  {
  <__NSArrayI 0x100208ae0>(
3735928559,
4276993775,
3203398366
)

  <__NSArrayI 0x100208b10>(
Hello,
World
)

  {
    Two =     (
        Hello,
        World
    );
    1 =     (
        Hello,
        World
    );
}

}


Ran command:
"poarray 3 objects"

Got output:
 {
  <__NSArrayI 0x100208ae0>(
3735928559,
4276993775,
3203398366
)

  <__NSArrayI 0x100208b10>(
Hello,
World
)

  {
    Two =     (
        Hello,
        World
    );
    1 =     (
        Hello,
        World
    );
}

}

Expecting sub string: "3735928559" (was found)
Expecting sub string: "4276993775" (was found)
Expecting sub string: "3203398366" (was found)
Expecting sub string: "Hello" (was found)
Expecting sub string: "World" (was found)
Expecting sub string: "Two =" (was found)
Expecting sub string: "1 =" (was found)

runCmd: expr --element-count 3 --object-description --description-verbosity=full -- objects
output: (id *) $2 = 0x0000000100208c70 {
  (id) [0] = 0x0000000100208ae0 <__NSArrayI 0x100208ae0>(
3735928559,
4276993775,
3203398366
)

  (id) [1] = 0x0000000100208b10 <__NSArrayI 0x100208b10>(
Hello,
World
)

  (id) [2] = 0x0000000100208dd0 {
    Two =     (
        Hello,
        World
    );
    1 =     (
        Hello,
        World
    );
}

}


Ran command:
"expr --element-count 3 --object-description --description-verbosity=full -- objects"

Got output:
(id *) $2 = 0x0000000100208c70 {
  (id) [0] = 0x0000000100208ae0 <__NSArrayI 0x100208ae0>(
3735928559,
4276993775,
3203398366
)

  (id) [1] = 0x0000000100208b10 <__NSArrayI 0x100208b10>(
Hello,
World
)

  (id) [2] = 0x0000000100208dd0 {
    Two =     (
        Hello,
        World
    );
    1 =     (
        Hello,
        World
    );
}

}

Expecting sub string: "[0] =" (was found)
Expecting sub string: "3735928559" (was found)
Expecting sub string: "4276993775" (was found)
Expecting sub string: "3203398366" (was found)
Expecting sub string: "[1] =" (was found)
Expecting sub string: "Hello" (was found)
Expecting sub string: "World" (was found)
Expecting sub string: "[2] =" (was found)
Expecting sub string: "Two =" (was found)
Expecting sub string: "1 =" (was found)

runCmd: parray 3 objects
output: (id *) $3 = 0x0000000100208c70 {
  (id) [0] = 0x0000000100208ae0
  (id) [1] = 0x0000000100208b10
  (id) [2] = 0x0000000100208dd0
}


Ran command:
"parray 3 objects"

Got output:
(id *) $3 = 0x0000000100208c70 {
  (id) [0] = 0x0000000100208ae0
  (id) [1] = 0x0000000100208b10
  (id) [2] = 0x0000000100208dd0
}

Expecting sub string: "[0] = 0x" (was found)
Expecting sub string: "[1] = 0x" (was found)
Expecting sub string: "[2] = 0x" (was found)

runCmd: expr --element-count 3 -d run -- objects
output: (id *) $4 = 0x0000000100208c70 {
  (__NSArrayI *) [0] = 0x0000000100208ae0 3 elements
  (__NSArrayI *) [1] = 0x0000000100208b10 2 elements
  (__NSDictionaryI *) [2] = 0x0000000100208dd0 2 key/value pairs
}


Ran command:
"expr --element-count 3 -d run -- objects"

Got output:
(id *) $4 = 0x0000000100208c70 {
  (__NSArrayI *) [0] = 0x0000000100208ae0 3 elements
  (__NSArrayI *) [1] = 0x0000000100208b10 2 elements
  (__NSDictionaryI *) [2] = 0x0000000100208dd0 2 key/value pairs
}

Expecting sub string: "3 elements" (was found)
Expecting sub string: "2 elements" (was found)
Expecting sub string: "2 key/value pairs" (was found)

runCmd: expr --element-count 3 -d run --ptr-depth=1 -- objects
output: (id *) $5 = 0x0000000100208c70 {
  (__NSArrayI *) [0] = 0x0000000100208ae0 3 elements {
    [0] = 0xa59cc09a235b5be5 3735928559
    [1] = 0xa59cc0ba635b5be5 4276993775
    [2] = 0xa59cc0fa611f6ae5 3203398366
  }
  (__NSArrayI *) [1] = 0x0000000100208b10 2 elements {
    [0] = 0x0000000100004018 "Hello"
    [1] = 0x0000000100004038 "World"
  }
  (__NSDictionaryI *) [2] = 0x0000000100208dd0 2 key/value pairs {
    [0] = {
      key = 0x0000000100004058 "Two"
      value = 0x0000000100208b10 2 elements
    }
    [1] = {
      key = 0xa59cc0448ee5b5f5 1
      value = 0x0000000100208b10 2 elements
    }
  }
}


Ran command:
"expr --element-count 3 -d run --ptr-depth=1 -- objects"

Got output:
(id *) $5 = 0x0000000100208c70 {
  (__NSArrayI *) [0] = 0x0000000100208ae0 3 elements {
    [0] = 0xa59cc09a235b5be5 3735928559
    [1] = 0xa59cc0ba635b5be5 4276993775
    [2] = 0xa59cc0fa611f6ae5 3203398366
  }
  (__NSArrayI *) [1] = 0x0000000100208b10 2 elements {
    [0] = 0x0000000100004018 "Hello"
    [1] = 0x0000000100004038 "World"
  }
  (__NSDictionaryI *) [2] = 0x0000000100208dd0 2 key/value pairs {
    [0] = {
      key = 0x0000000100004058 "Two"
      value = 0x0000000100208b10 2 elements
    }
    [1] = {
      key = 0xa59cc0448ee5b5f5 1
      value = 0x0000000100208b10 2 elements
    }
  }
}

Expecting sub string: "3 elements" (was found)
Expecting sub string: "3735928559" (was found)
Expecting sub string: "4276993775" (was found)
Expecting sub string: "3203398366" (was found)
Expecting sub string: "2 elements" (was found)
Expecting sub string: ""Hello"" (was found)
Expecting sub string: ""World"" (was found)
Expecting sub string: "2 key/value pairs" (was found)

<bound method SBProcess.Kill of SBProcess: pid = 6542, state = stopped, threads = 1, executable = a.out>: success

Executing tearDown hook:         def cleanup():
            self.runCmd('type format clear', check=False)
            self.runCmd('type summary clear', check=False)
            self.runCmd('type synth clear', check=False)


runCmd: type format clear
check of return status not required
output: 

runCmd: type summary clear
check of return status not required
output: 

runCmd: type synth clear
check of return status not required
output: 

PASS: LLDB (/Users/buildslave/jenkins/workspace/lldb-cmake-matrix/clang_1101_build/bin/clang-x86_64) :: test_print_array_no_const_dsym (TestPrintObjectArray.PrintObjectArrayTestCase)
runCmd: settings clear -all
output: 

runCmd: settings set symbols.enable-external-lookup false
output: 

runCmd: settings set target.inherit-tcc true
output: 

runCmd: settings set target.detach-on-error false
output: 

runCmd: settings set target.auto-apply-fixits false
output: 

runCmd: settings set plugin.process.gdb-remote.packet-timeout 60
output: 

runCmd: settings set symbols.clang-modules-cache-path "/Users/buildslave/jenkins/workspace/lldb-cmake-matrix/lldb-build/lldb-test-build.noindex/module-cache-lldb/lldb-api"
output: 

runCmd: settings set use-color false
output: 

runCmd: setting set target.prefer-dynamic-value no-dynamic-values
output: 

make VPATH=/Users/buildslave/jenkins/workspace/lldb-cmake-matrix/llvm-project/lldb/test/API/functionalities/data-formatter/poarray -C /Users/buildslave/jenkins/workspace/lldb-cmake-matrix/lldb-build/lldb-test-build.noindex/functionalities/data-formatter/poarray/TestPrintObjectArray.test_print_array_no_const_dwarf -I /Users/buildslave/jenkins/workspace/lldb-cmake-matrix/llvm-project/lldb/test/API/functionalities/data-formatter/poarray -I /Users/buildslave/jenkins/workspace/lldb-cmake-matrix/llvm-project/lldb/packages/Python/lldbsuite/test/make -f /Users/buildslave/jenkins/workspace/lldb-cmake-matrix/llvm-project/lldb/test/API/functionalities/data-formatter/poarray/Makefile MAKE_DSYM=NO all ARCH=x86_64 'CC="/Users/buildslave/jenkins/workspace/lldb-cmake-matrix/clang_1101_build/bin/clang"' DSYMUTIL=/Users/buildslave/jenkins/workspace/lldb-cmake-matrix/lldb-build/./bin/dsymutil CODESIGN=codesign CLANG_MODULE_CACHE_DIR=/Users/buildslave/jenkins/workspace/lldb-cmake-matrix/lldb-build/lldb-test-build.noindex/module-cache-clang/lldb-api USE_HERMETIC_LIBCPP=1 'CC=xcrun clang' 'CFLAGS_EXTRAS=-fno-constant-nsnumber-literals -fno-constant-nsarray-literals -fno-constant-nsdictionary-literals'

xcrun clang -std=c++11 -g -O0 -isysroot "/Applications/Xcode.app/Contents/Developer/Platforms/MacOSX.platform/Developer/SDKs/MacOSX11.1.sdk" -arch x86_64  -I/Users/buildslave/jenkins/workspace/lldb-cmake-matrix/llvm-project/lldb/packages/Python/lldbsuite/test/make/../../../../../include -I/Users/buildslave/jenkins/workspace/lldb-cmake-matrix/llvm-project/lldb/test/API/functionalities/data-formatter/poarray -I/Users/buildslave/jenkins/workspace/lldb-cmake-matrix/llvm-project/lldb/packages/Python/lldbsuite/test/make -include /Users/buildslave/jenkins/workspace/lldb-cmake-matrix/llvm-project/lldb/packages/Python/lldbsuite/test/make/test_common.h  -fno-limit-debug-info  -fno-constant-nsnumber-literals -fno-constant-nsarray-literals -fno-constant-nsdictionary-literals   --driver-mode=g++ -MT main.o -MD -MP -MF main.d -c -o main.o /Users/buildslave/jenkins/workspace/lldb-cmake-matrix/llvm-project/lldb/test/API/functionalities/data-formatter/poarray/main.mm
clang: warning: argument unused during compilation: '-fno-constant-nsnumber-literals' [-Wunused-command-line-argument]
clang: warning: argument unused during compilation: '-fno-constant-nsarray-literals' [-Wunused-command-line-argument]
clang: warning: argument unused during compilation: '-fno-constant-nsdictionary-literals' [-Wunused-command-line-argument]
xcrun clang  main.o -g -O0 -isysroot "/Applications/Xcode.app/Contents/Developer/Platforms/MacOSX.platform/Developer/SDKs/MacOSX11.1.sdk" -arch x86_64  -I/Users/buildslave/jenkins/workspace/lldb-cmake-matrix/llvm-project/lldb/packages/Python/lldbsuite/test/make/../../../../../include -I/Users/buildslave/jenkins/workspace/lldb-cmake-matrix/llvm-project/lldb/test/API/functionalities/data-formatter/poarray -I/Users/buildslave/jenkins/workspace/lldb-cmake-matrix/llvm-project/lldb/packages/Python/lldbsuite/test/make -include /Users/buildslave/jenkins/workspace/lldb-cmake-matrix/llvm-project/lldb/packages/Python/lldbsuite/test/make/test_common.h  -fno-limit-debug-info  -fno-constant-nsnumber-literals -fno-constant-nsarray-literals -fno-constant-nsdictionary-literals -framework Foundation  -lobjc --driver-mode=g++ -o "a.out"
codesign -s - "a.out"


runCmd: file /Users/buildslave/jenkins/workspace/lldb-cmake-matrix/lldb-build/lldb-test-build.noindex/functionalities/data-formatter/poarray/TestPrintObjectArray.test_print_array_no_const_dwarf/a.out
output: Current executable set to '/Users/buildslave/jenkins/workspace/lldb-cmake-matrix/lldb-build/lldb-test-build.noindex/functionalities/data-formatter/poarray/TestPrintObjectArray.test_print_array_no_const_dwarf/a.out' (x86_64).


runCmd: breakpoint set -f "main.mm" -l 20
output: Breakpoint 1: where = a.out`main + 459 at main.mm:20:3, address = 0x0000000100003efb


Expecting pattern: ^Breakpoint (?P<bpno>[0-9]+): (?P<num_locations>[0-9]+) locations\.$
Not matched

Expecting pattern: ^Breakpoint (?P<bpno>[0-9]+): (?P<num_locations>no) locations \(pending\)\.
Not matched

Expecting pattern: ^Breakpoint (?P<bpno>[0-9]+): where = (?P<module>.*)`(?P<symbol>[+\-]{0,1}[^+]+)( \+ (?P<offset>[0-9]+)){0,1}( \[inlined\] (?P<inline_symbol>.*)){0,1} at (?P<file>[^:]+):(?P<line_no>[0-9]+)(?P<column>(:[0-9]+)?), address = (?P<address>0x[0-9a-fA-F]+)$
Matched

runCmd: run
output: Process 6938 stopped
* thread #1, queue = 'com.apple.main-thread', stop reason = breakpoint 1.1
    frame #0: 0x0000000100003efb a.out`main at main.mm:20:3
   17  	  tobjects->two = array2;
   18  	  tobjects->three = dictionary;
   19  	  id* objects = (id*)tobjects;
-> 20  	  return 0; // break here
    	  ^
   21  	}
Process 6938 launched: '/Users/buildslave/jenkins/workspace/lldb-cmake-matrix/lldb-build/lldb-test-build.noindex/functionalities/data-formatter/poarray/TestPrintObjectArray.test_print_array_no_const_dwarf/a.out' (x86_64)


runCmd: thread list
output: Process 6938 stopped
* thread #1: tid = 0x3bb82e, 0x0000000100003efb a.out`main at main.mm:20:3, queue = 'com.apple.main-thread', stop reason = breakpoint 1.1


Ran command:
"thread list"

Got output:
Process 6938 stopped
* thread #1: tid = 0x3bb82e, 0x0000000100003efb a.out`main at main.mm:20:3, queue = 'com.apple.main-thread', stop reason = breakpoint 1.1

Expecting sub string: "stopped" (was found)
Expecting sub string: "stop reason = breakpoint" (was found)

Adding tearDown hook:         def cleanup():
            self.runCmd('type format clear', check=False)
            self.runCmd('type summary clear', check=False)
            self.runCmd('type synth clear', check=False)


runCmd: expr --element-count 3 --object-description -- objects
output:  {
  <__NSArrayI 0x100407040>(
3735928559,
4276993775,
3203398366
)

  <__NSArrayI 0x100407070>(
Hello,
World
)

  {
    Two =     (
        Hello,
        World
    );
    1 =     (
        Hello,
        World
    );
}

}


Ran command:
"expr --element-count 3 --object-description -- objects"

Got output:
 {
  <__NSArrayI 0x100407040>(
3735928559,
4276993775,
3203398366
)

  <__NSArrayI 0x100407070>(
Hello,
World
)

  {
    Two =     (
        Hello,
        World
    );
    1 =     (
        Hello,
        World
    );
}

}

Expecting sub string: "3735928559" (was found)
Expecting sub string: "4276993775" (was found)
Expecting sub string: "3203398366" (was found)
Expecting sub string: "Hello" (was found)
Expecting sub string: "World" (was found)
Expecting sub string: "Two =" (was found)
Expecting sub string: "1 =" (was found)

runCmd: poarray 3 objects
output:  {
  <__NSArrayI 0x100407040>(
3735928559,
4276993775,
3203398366
)

  <__NSArrayI 0x100407070>(
Hello,
World
)

  {
    Two =     (
        Hello,
        World
    );
    1 =     (
        Hello,
        World
    );
}

}


Ran command:
"poarray 3 objects"

Got output:
 {
  <__NSArrayI 0x100407040>(
3735928559,
4276993775,
3203398366
)

  <__NSArrayI 0x100407070>(
Hello,
World
)

  {
    Two =     (
        Hello,
        World
    );
    1 =     (
        Hello,
        World
    );
}

}

Expecting sub string: "3735928559" (was found)
Expecting sub string: "4276993775" (was found)
Expecting sub string: "3203398366" (was found)
Expecting sub string: "Hello" (was found)
Expecting sub string: "World" (was found)
Expecting sub string: "Two =" (was found)
Expecting sub string: "1 =" (was found)

runCmd: expr --element-count 3 --object-description --description-verbosity=full -- objects
output: (id *) $2 = 0x00000001004071d0 {
  (id) [0] = 0x0000000100407040 <__NSArrayI 0x100407040>(
3735928559,
4276993775,
3203398366
)

  (id) [1] = 0x0000000100407070 <__NSArrayI 0x100407070>(
Hello,
World
)

  (id) [2] = 0x0000000100407330 {
    Two =     (
        Hello,
        World
    );
    1 =     (
        Hello,
        World
    );
}

}


Ran command:
"expr --element-count 3 --object-description --description-verbosity=full -- objects"

Got output:
(id *) $2 = 0x00000001004071d0 {
  (id) [0] = 0x0000000100407040 <__NSArrayI 0x100407040>(
3735928559,
4276993775,
3203398366
)

  (id) [1] = 0x0000000100407070 <__NSArrayI 0x100407070>(
Hello,
World
)

  (id) [2] = 0x0000000100407330 {
    Two =     (
        Hello,
        World
    );
    1 =     (
        Hello,
        World
    );
}

}

Expecting sub string: "[0] =" (was found)
Expecting sub string: "3735928559" (was found)
Expecting sub string: "4276993775" (was found)
Expecting sub string: "3203398366" (was found)
Expecting sub string: "[1] =" (was found)
Expecting sub string: "Hello" (was found)
Expecting sub string: "World" (was found)
Expecting sub string: "[2] =" (was found)
Expecting sub string: "Two =" (was found)
Expecting sub string: "1 =" (was found)

runCmd: parray 3 objects
output: (id *) $3 = 0x00000001004071d0 {
  (id) [0] = 0x0000000100407040
  (id) [1] = 0x0000000100407070
  (id) [2] = 0x0000000100407330
}


Ran command:
"parray 3 objects"

Got output:
(id *) $3 = 0x00000001004071d0 {
  (id) [0] = 0x0000000100407040
  (id) [1] = 0x0000000100407070
  (id) [2] = 0x0000000100407330
}

Expecting sub string: "[0] = 0x" (was found)
Expecting sub string: "[1] = 0x" (was found)
Expecting sub string: "[2] = 0x" (was found)

runCmd: expr --element-count 3 -d run -- objects
output: (id *) $4 = 0x00000001004071d0 {
  (__NSArrayI *) [0] = 0x0000000100407040 3 elements
  (__NSArrayI *) [1] = 0x0000000100407070 2 elements
  (__NSDictionaryI *) [2] = 0x0000000100407330 2 key/value pairs
}


Ran command:
"expr --element-count 3 -d run -- objects"

Got output:
(id *) $4 = 0x00000001004071d0 {
  (__NSArrayI *) [0] = 0x0000000100407040 3 elements
  (__NSArrayI *) [1] = 0x0000000100407070 2 elements
  (__NSDictionaryI *) [2] = 0x0000000100407330 2 key/value pairs
}

Expecting sub string: "3 elements" (was found)
Expecting sub string: "2 elements" (was found)
Expecting sub string: "2 key/value pairs" (was found)

runCmd: expr --element-count 3 -d run --ptr-depth=1 -- objects
output: (id *) $5 = 0x00000001004071d0 {
  (__NSArrayI *) [0] = 0x0000000100407040 3 elements {
    [0] = 0x074691bbc7253913 3735928559
    [1] = 0x0746919b87253913 4276993775
    [2] = 0x074691db85610813 3203398366
  }
  (__NSArrayI *) [1] = 0x0000000100407070 2 elements {
    [0] = 0x0000000100004018 "Hello"
    [1] = 0x0000000100004038 "World"
  }
  (__NSDictionaryI *) [2] = 0x0000000100407330 2 key/value pairs {
    [0] = {
      key = 0x0000000100004058 "Two"
      value = 0x0000000100407070 2 elements
    }
    [1] = {
      key = 0x074691656a9bd703 1
      value = 0x0000000100407070 2 elements
    }
  }
}


Ran command:
"expr --element-count 3 -d run --ptr-depth=1 -- objects"

Got output:
(id *) $5 = 0x00000001004071d0 {
  (__NSArrayI *) [0] = 0x0000000100407040 3 elements {
    [0] = 0x074691bbc7253913 3735928559
    [1] = 0x0746919b87253913 4276993775
    [2] = 0x074691db85610813 3203398366
  }
  (__NSArrayI *) [1] = 0x0000000100407070 2 elements {
    [0] = 0x0000000100004018 "Hello"
    [1] = 0x0000000100004038 "World"
  }
  (__NSDictionaryI *) [2] = 0x0000000100407330 2 key/value pairs {
    [0] = {
      key = 0x0000000100004058 "Two"
      value = 0x0000000100407070 2 elements
    }
    [1] = {
      key = 0x074691656a9bd703 1
      value = 0x0000000100407070 2 elements
    }
  }
}

Expecting sub string: "3 elements" (was found)
Expecting sub string: "3735928559" (was found)
Expecting sub string: "4276993775" (was found)
Expecting sub string: "3203398366" (was found)
Expecting sub string: "2 elements" (was found)
Expecting sub string: ""Hello"" (was found)
Expecting sub string: ""World"" (was found)
Expecting sub string: "2 key/value pairs" (was found)

<bound method SBProcess.Kill of SBProcess: pid = 6938, state = stopped, threads = 1, executable = a.out>: success

Executing tearDown hook:         def cleanup():
            self.runCmd('type format clear', check=False)
            self.runCmd('type summary clear', check=False)
            self.runCmd('type synth clear', check=False)


runCmd: type format clear
check of return status not required
output: 

runCmd: type summary clear
check of return status not required
output: 

runCmd: type synth clear
check of return status not required
output: 

PASS: LLDB (/Users/buildslave/jenkins/workspace/lldb-cmake-matrix/clang_1101_build/bin/clang-x86_64) :: test_print_array_no_const_dwarf (TestPrintObjectArray.PrintObjectArrayTestCase)
UNSUPPORTED: LLDB (/Users/buildslave/jenkins/workspace/lldb-cmake-matrix/clang_1101_build/bin/clang-x86_64) :: test_print_array_no_const_dwo (TestPrintObjectArray.PrintObjectArrayTestCase) (test case does not fall in any category of interest for this run) 
UNSUPPORTED: LLDB (/Users/buildslave/jenkins/workspace/lldb-cmake-matrix/clang_1101_build/bin/clang-x86_64) :: test_print_array_no_const_gmodules (TestPrintObjectArray.PrintObjectArrayTestCase) (test case does not fall in any category of interest for this run) 
Restore dir to: /Users/buildslave/jenkins/workspace/lldb-cmake-matrix/lldb-build/tools/lldb/test
======================================================================
ERROR: test_print_array_dsym (TestPrintObjectArray.PrintObjectArrayTestCase)
   Test that expr -O -Z works
----------------------------------------------------------------------
Error when building test subject.

Build Command:
make VPATH=/Users/buildslave/jenkins/workspace/lldb-cmake-matrix/llvm-project/lldb/test/API/functionalities/data-formatter/poarray -C /Users/buildslave/jenkins/workspace/lldb-cmake-matrix/lldb-build/lldb-test-build.noindex/functionalities/data-formatter/poarray/TestPrintObjectArray.test_print_array_dsym -I /Users/buildslave/jenkins/workspace/lldb-cmake-matrix/llvm-project/lldb/test/API/functionalities/data-formatter/poarray -I /Users/buildslave/jenkins/workspace/lldb-cmake-matrix/llvm-project/lldb/packages/Python/lldbsuite/test/make -f /Users/buildslave/jenkins/workspace/lldb-cmake-matrix/llvm-project/lldb/test/API/functionalities/data-formatter/poarray/Makefile MAKE_DSYM=YES all ARCH=x86_64 'CC="/Users/buildslave/jenkins/workspace/lldb-cmake-matrix/clang_1101_build/bin/clang"' DSYMUTIL=/Users/buildslave/jenkins/workspace/lldb-cmake-matrix/lldb-build/./bin/dsymutil CODESIGN=codesign CLANG_MODULE_CACHE_DIR=/Users/buildslave/jenkins/workspace/lldb-cmake-matrix/lldb-build/lldb-test-build.noindex/module-cache-clang/lldb-api USE_HERMETIC_LIBCPP=1

Build Command Output:
"/Users/buildslave/jenkins/workspace/lldb-cmake-matrix/clang_1101_build/bin/clang" -std=c++11 -g -O0 -isysroot "/Applications/Xcode.app/Contents/Developer/Platforms/MacOSX.platform/Developer/SDKs/MacOSX11.1.sdk" -arch x86_64  -I/Users/buildslave/jenkins/workspace/lldb-cmake-matrix/llvm-project/lldb/packages/Python/lldbsuite/test/make/../../../../../include -I/Users/buildslave/jenkins/workspace/lldb-cmake-matrix/llvm-project/lldb/test/API/functionalities/data-formatter/poarray -I/Users/buildslave/jenkins/workspace/lldb-cmake-matrix/llvm-project/lldb/packages/Python/lldbsuite/test/make -include /Users/buildslave/jenkins/workspace/lldb-cmake-matrix/llvm-project/lldb/packages/Python/lldbsuite/test/make/test_common.h  -fno-limit-debug-info  -w   --driver-mode=g++ -MT main.o -MD -MP -MF main.d -c -o main.o /Users/buildslave/jenkins/workspace/lldb-cmake-matrix/llvm-project/lldb/test/API/functionalities/data-formatter/poarray/main.mm
In file included from /Users/buildslave/jenkins/workspace/lldb-cmake-matrix/llvm-project/lldb/test/API/functionalities/data-formatter/poarray/main.mm:1:
In file included from /Applications/Xcode.app/Contents/Developer/Platforms/MacOSX.platform/Developer/SDKs/MacOSX11.1.sdk/System/Library/Frameworks/Foundation.framework/Headers/Foundation.h:6:
In file included from /Applications/Xcode.app/Contents/Developer/Platforms/MacOSX.platform/Developer/SDKs/MacOSX11.1.sdk/System/Library/Frameworks/CoreFoundation.framework/Headers/CoreFoundation.h:18:
In file included from /Applications/Xcode.app/Contents/Developer/Platforms/MacOSX.platform/Developer/SDKs/MacOSX11.1.sdk/usr/include/assert.h:44:
/Users/buildslave/jenkins/workspace/lldb-cmake-matrix/clang_1101_build/bin/../include/c++/v1/stdlib.h:142:34: error: unknown type name 'ldiv_t'; did you mean 'dev_t'?
inline _LIBCPP_INLINE_VISIBILITY ldiv_t div(long __x, long __y) _NOEXCEPT {
                                 ^
/Applications/Xcode.app/Contents/Developer/Platforms/MacOSX.platform/Developer/SDKs/MacOSX11.1.sdk/usr/include/sys/_types/_dev_t.h:31:31: note: 'dev_t' declared here
typedef __darwin_dev_t        dev_t;    /* device number */
                              ^
In file included from /Users/buildslave/jenkins/workspace/lldb-cmake-matrix/llvm-project/lldb/test/API/functionalities/data-formatter/poarray/main.mm:1:
In file included from /Applications/Xcode.app/Contents/Developer/Platforms/MacOSX.platform/Developer/SDKs/MacOSX11.1.sdk/System/Library/Frameworks/Foundation.framework/Headers/Foundation.h:6:
In file included from /Applications/Xcode.app/Contents/Developer/Platforms/MacOSX.platform/Developer/SDKs/MacOSX11.1.sdk/System/Library/Frameworks/CoreFoundation.framework/Headers/CoreFoundation.h:18:
In file included from /Applications/Xcode.app/Contents/Developer/Platforms/MacOSX.platform/Developer/SDKs/MacOSX11.1.sdk/usr/include/assert.h:44:
/Users/buildslave/jenkins/workspace/lldb-cmake-matrix/clang_1101_build/bin/../include/c++/v1/stdlib.h:143:12: error: no member named 'ldiv' in the global namespace; did you mean 'div'?
  return ::ldiv(__x, __y);
         ~~^
/Users/buildslave/jenkins/workspace/lldb-cmake-matrix/clang_1101_build/bin/../include/c++/v1/stdlib.h:142:41: note: 'div' declared here
inline _LIBCPP_INLINE_VISIBILITY ldiv_t div(long __x, long __y) _NOEXCEPT {
                                        ^
/Users/buildslave/jenkins/workspace/lldb-cmake-matrix/clang_1101_build/bin/../include/c++/v1/stdlib.h:146:34: error: unknown type name 'lldiv_t'
inline _LIBCPP_INLINE_VISIBILITY lldiv_t div(long long __x,
                                 ^
/Users/buildslave/jenkins/workspace/lldb-cmake-matrix/clang_1101_build/bin/../include/c++/v1/stdlib.h:148:12: error: no member named 'lldiv' in the global namespace
  return ::lldiv(__x, __y);
         ~~^
In file included from /Users/buildslave/jenkins/workspace/lldb-cmake-matrix/llvm-project/lldb/test/API/functionalities/data-formatter/poarray/main.mm:1:
In file included from /Applications/Xcode.app/Contents/Developer/Platforms/MacOSX.platform/Developer/SDKs/MacOSX11.1.sdk/System/Library/Frameworks/Foundation.framework/Headers/Foundation.h:6:
In file included from /Applications/Xcode.app/Contents/Developer/Platforms/MacOSX.platform/Developer/SDKs/MacOSX11.1.sdk/System/Library/Frameworks/CoreFoundation.framework/Headers/CoreFoundation.h:24:
/Users/buildslave/jenkins/workspace/lldb-cmake-matrix/clang_1101_build/bin/../include/c++/v1/math.h:771:93: error: no member named 'acosf' in the global namespace; did you mean 'acos'?
inline _LIBCPP_INLINE_VISIBILITY float       acos(float __lcpp_x) _NOEXCEPT       {return ::acosf(__lcpp_x);}
                                                                                          ~~^
/Users/buildslave/jenkins/workspace/lldb-cmake-matrix/clang_1101_build/bin/../include/c++/v1/math.h:771:46: note: 'acos' declared here
inline _LIBCPP_INLINE_VISIBILITY float       acos(float __lcpp_x) _NOEXCEPT       {return ::acosf(__lcpp_x);}
                                             ^
/Users/buildslave/jenkins/workspace/lldb-cmake-matrix/clang_1101_build/bin/../include/c++/v1/math.h:772:93: error: no member named 'acosl' in the global namespace; did you mean 'acos'?
inline _LIBCPP_INLINE_VISIBILITY long double acos(long double __lcpp_x) _NOEXCEPT {return ::acosl(__lcpp_x);}
                                                                                          ~~^
/Users/buildslave/jenkins/workspace/lldb-cmake-matrix/clang_1101_build/bin/../include/c++/v1/math.h:771:46: note: 'acos' declared here
inline _LIBCPP_INLINE_VISIBILITY float       acos(float __lcpp_x) _NOEXCEPT       {return ::acosf(__lcpp_x);}
                                             ^
/Users/buildslave/jenkins/workspace/lldb-cmake-matrix/clang_1101_build/bin/../include/c++/v1/math.h:778:38: error: call to 'acos' is ambiguous
acos(_A1 __lcpp_x) _NOEXCEPT {return ::acos((double)__lcpp_x);}
                                     ^~~~~~
/Users/buildslave/jenkins/workspace/lldb-cmake-matrix/clang_1101_build/bin/../include/c++/v1/math.h:771:46: note: candidate function
inline _LIBCPP_INLINE_VISIBILITY float       acos(float __lcpp_x) _NOEXCEPT       {return ::acosf(__lcpp_x);}
                                             ^
/Users/buildslave/jenkins/workspace/lldb-cmake-matrix/clang_1101_build/bin/../include/c++/v1/math.h:772:46: note: candidate function
inline _LIBCPP_INLINE_VISIBILITY long double acos(long double __lcpp_x) _NOEXCEPT {return ::acosl(__lcpp_x);}
                                             ^
/Users/buildslave/jenkins/workspace/lldb-cmake-matrix/clang_1101_build/bin/../include/c++/v1/math.h:783:93: error: no member named 'asinf' in the global namespace; did you mean 'asin'?
inline _LIBCPP_INLINE_VISIBILITY float       asin(float __lcpp_x) _NOEXCEPT       {return ::asinf(__lcpp_x);}
                                                                                          ~~^
/Users/buildslave/jenkins/workspace/lldb-cmake-matrix/clang_1101_build/bin/../include/c++/v1/math.h:783:46: note: 'asin' declared here
inline _LIBCPP_INLINE_VISIBILITY float       asin(float __lcpp_x) _NOEXCEPT       {return ::asinf(__lcpp_x);}
                                             ^
/Users/buildslave/jenkins/workspace/lldb-cmake-matrix/clang_1101_build/bin/../include/c++/v1/math.h:784:93: error: no member named 'asinl' in the global namespace; did you mean 'asin'?
inline _LIBCPP_INLINE_VISIBILITY long double asin(long double __lcpp_x) _NOEXCEPT {return ::asinl(__lcpp_x);}
                                                                                          ~~^
/Users/buildslave/jenkins/workspace/lldb-cmake-matrix/clang_1101_build/bin/../include/c++/v1/math.h:783:46: note: 'asin' declared here
inline _LIBCPP_INLINE_VISIBILITY float       asin(float __lcpp_x) _NOEXCEPT       {return ::asinf(__lcpp_x);}
                                             ^
/Users/buildslave/jenkins/workspace/lldb-cmake-matrix/clang_1101_build/bin/../include/c++/v1/math.h:790:38: error: call to 'asin' is ambiguous
asin(_A1 __lcpp_x) _NOEXCEPT {return ::asin((double)__lcpp_x);}
                                     ^~~~~~
/Users/buildslave/jenkins/workspace/lldb-cmake-matrix/clang_1101_build/bin/../include/c++/v1/math.h:783:46: note: candidate function
inline _LIBCPP_INLINE_VISIBILITY float       asin(float __lcpp_x) _NOEXCEPT       {return ::asinf(__lcpp_x);}
                                             ^
/Users/buildslave/jenkins/workspace/lldb-cmake-matrix/clang_1101_build/bin/../include/c++/v1/math.h:784:46: note: candidate function
inline _LIBCPP_INLINE_VISIBILITY long double asin(long double __lcpp_x) _NOEXCEPT {return ::asinl(__lcpp_x);}
                                             ^
/Users/buildslave/jenkins/workspace/lldb-cmake-matrix/clang_1101_build/bin/../include/c++/v1/math.h:795:93: error: no member named 'atanf' in the global namespace; did you mean 'atan'?
inline _LIBCPP_INLINE_VISIBILITY float       atan(float __lcpp_x) _NOEXCEPT       {return ::atanf(__lcpp_x);}
                                                                                          ~~^
/Users/buildslave/jenkins/workspace/lldb-cmake-matrix/clang_1101_build/bin/../include/c++/v1/math.h:795:46: note: 'atan' declared here
inline _LIBCPP_INLINE_VISIBILITY float       atan(float __lcpp_x) _NOEXCEPT       {return ::atanf(__lcpp_x);}
                                             ^
/Users/buildslave/jenkins/workspace/lldb-cmake-matrix/clang_1101_build/bin/../include/c++/v1/math.h:796:93: error: no member named 'atanl' in the global namespace; did you mean 'atan'?
inline _LIBCPP_INLINE_VISIBILITY long double atan(long double __lcpp_x) _NOEXCEPT {return ::atanl(__lcpp_x);}
                                                                                          ~~^
/Users/buildslave/jenkins/workspace/lldb-cmake-matrix/clang_1101_build/bin/../include/c++/v1/math.h:795:46: note: 'atan' declared here
inline _LIBCPP_INLINE_VISIBILITY float       atan(float __lcpp_x) _NOEXCEPT       {return ::atanf(__lcpp_x);}
                                             ^
/Users/buildslave/jenkins/workspace/lldb-cmake-matrix/clang_1101_build/bin/../include/c++/v1/math.h:802:38: error: call to 'atan' is ambiguous
atan(_A1 __lcpp_x) _NOEXCEPT {return ::atan((double)__lcpp_x);}
                                     ^~~~~~
/Users/buildslave/jenkins/workspace/lldb-cmake-matrix/clang_1101_build/bin/../include/c++/v1/math.h:795:46: note: candidate function
inline _LIBCPP_INLINE_VISIBILITY float       atan(float __lcpp_x) _NOEXCEPT       {return ::atanf(__lcpp_x);}
                                             ^
/Users/buildslave/jenkins/workspace/lldb-cmake-matrix/clang_1101_build/bin/../include/c++/v1/math.h:796:46: note: candidate function
inline _LIBCPP_INLINE_VISIBILITY long double atan(long double __lcpp_x) _NOEXCEPT {return ::atanl(__lcpp_x);}
                                             ^
/Users/buildslave/jenkins/workspace/lldb-cmake-matrix/clang_1101_build/bin/../include/c++/v1/math.h:807:116: error: no member named 'atan2f' in the global namespace; did you mean 'atan2'?
inline _LIBCPP_INLINE_VISIBILITY float       atan2(float __lcpp_y, float __lcpp_x) _NOEXCEPT             {return ::atan2f(__lcpp_y, __lcpp_x);}
                                                                                                                 ~~^
/Users/buildslave/jenkins/workspace/lldb-cmake-matrix/clang_1101_build/bin/../include/c++/v1/math.h:807:46: note: 'atan2' declared here
inline _LIBCPP_INLINE_VISIBILITY float       atan2(float __lcpp_y, float __lcpp_x) _NOEXCEPT             {return ::atan2f(__lcpp_y, __lcpp_x);}
                                             ^
/Users/buildslave/jenkins/workspace/lldb-cmake-matrix/clang_1101_build/bin/../include/c++/v1/math.h:808:116: error: no member named 'atan2l' in the global namespace; did you mean 'atan2'?
inline _LIBCPP_INLINE_VISIBILITY long double atan2(long double __lcpp_y, long double __lcpp_x) _NOEXCEPT {return ::atan2l(__lcpp_y, __lcpp_x);}
                                                                                                                 ~~^
/Users/buildslave/jenkins/workspace/lldb-cmake-matrix/clang_1101_build/bin/../include/c++/v1/math.h:807:46: note: 'atan2' declared here
inline _LIBCPP_INLINE_VISIBILITY float       atan2(float __lcpp_y, float __lcpp_x) _NOEXCEPT             {return ::atan2f(__lcpp_y, __lcpp_x);}
                                             ^
/Users/buildslave/jenkins/workspace/lldb-cmake-matrix/clang_1101_build/bin/../include/c++/v1/math.h:830:93: error: no member named 'ceilf' in the global namespace; did you mean 'ceil'?
inline _LIBCPP_INLINE_VISIBILITY float       ceil(float __lcpp_x) _NOEXCEPT       {return ::ceilf(__lcpp_x);}
                                                                                          ~~^
/Users/buildslave/jenkins/workspace/lldb-cmake-matrix/clang_1101_build/bin/../include/c++/v1/math.h:830:46: note: 'ceil' declared here
inline _LIBCPP_INLINE_VISIBILITY float       ceil(float __lcpp_x) _NOEXCEPT       {return ::ceilf(__lcpp_x);}
                                             ^
/Users/buildslave/jenkins/workspace/lldb-cmake-matrix/clang_1101_build/bin/../include/c++/v1/math.h:831:93: error: no member named 'ceill' in the global namespace; did you mean 'ceil'?
inline _LIBCPP_INLINE_VISIBILITY long double ceil(long double __lcpp_x) _NOEXCEPT {return ::ceill(__lcpp_x);}
                                                                                          ~~^
/Users/buildslave/jenkins/workspace/lldb-cmake-matrix/clang_1101_build/bin/../include/c++/v1/math.h:830:46: note: 'ceil' declared here
inline _LIBCPP_INLINE_VISIBILITY float       ceil(float __lcpp_x) _NOEXCEPT       {return ::ceilf(__lcpp_x);}
                                             ^
/Users/buildslave/jenkins/workspace/lldb-cmake-matrix/clang_1101_build/bin/../include/c++/v1/math.h:837:38: error: call to 'ceil' is ambiguous
ceil(_A1 __lcpp_x) _NOEXCEPT {return ::ceil((double)__lcpp_x);}
                                     ^~~~~~
/Users/buildslave/jenkins/workspace/lldb-cmake-matrix/clang_1101_build/bin/../include/c++/v1/math.h:830:46: note: candidate function
inline _LIBCPP_INLINE_VISIBILITY float       ceil(float __lcpp_x) _NOEXCEPT       {return ::ceilf(__lcpp_x);}
                                             ^
/Users/buildslave/jenkins/workspace/lldb-cmake-matrix/clang_1101_build/bin/../include/c++/v1/math.h:831:46: note: candidate function
inline _LIBCPP_INLINE_VISIBILITY long double ceil(long double __lcpp_x) _NOEXCEPT {return ::ceill(__lcpp_x);}
                                             ^
/Users/buildslave/jenkins/workspace/lldb-cmake-matrix/clang_1101_build/bin/../include/c++/v1/math.h:842:92: error: no member named 'cosf' in the global namespace; did you mean 'cos'?
inline _LIBCPP_INLINE_VISIBILITY float       cos(float __lcpp_x) _NOEXCEPT       {return ::cosf(__lcpp_x);}
                                                                                         ~~^
/Users/buildslave/jenkins/workspace/lldb-cmake-matrix/clang_1101_build/bin/../include/c++/v1/math.h:842:46: note: 'cos' declared here
inline _LIBCPP_INLINE_VISIBILITY float       cos(float __lcpp_x) _NOEXCEPT       {return ::cosf(__lcpp_x);}
                                             ^
fatal error: too many errors emitted, stopping now [-ferror-limit=]
20 errors generated.
make: *** [main.o] Error 1

Test Directory:
/Users/buildslave/jenkins/workspace/lldb-cmake-matrix/llvm-project/lldb/test/API/functionalities/data-formatter/poarray
======================================================================
ERROR: test_print_array_dwarf (TestPrintObjectArray.PrintObjectArrayTestCase)
   Test that expr -O -Z works
----------------------------------------------------------------------
Error when building test subject.

Build Command:
make VPATH=/Users/buildslave/jenkins/workspace/lldb-cmake-matrix/llvm-project/lldb/test/API/functionalities/data-formatter/poarray -C /Users/buildslave/jenkins/workspace/lldb-cmake-matrix/lldb-build/lldb-test-build.noindex/functionalities/data-formatter/poarray/TestPrintObjectArray.test_print_array_dwarf -I /Users/buildslave/jenkins/workspace/lldb-cmake-matrix/llvm-project/lldb/test/API/functionalities/data-formatter/poarray -I /Users/buildslave/jenkins/workspace/lldb-cmake-matrix/llvm-project/lldb/packages/Python/lldbsuite/test/make -f /Users/buildslave/jenkins/workspace/lldb-cmake-matrix/llvm-project/lldb/test/API/functionalities/data-formatter/poarray/Makefile MAKE_DSYM=NO all ARCH=x86_64 'CC="/Users/buildslave/jenkins/workspace/lldb-cmake-matrix/clang_1101_build/bin/clang"' DSYMUTIL=/Users/buildslave/jenkins/workspace/lldb-cmake-matrix/lldb-build/./bin/dsymutil CODESIGN=codesign CLANG_MODULE_CACHE_DIR=/Users/buildslave/jenkins/workspace/lldb-cmake-matrix/lldb-build/lldb-test-build.noindex/module-cache-clang/lldb-api USE_HERMETIC_LIBCPP=1

Build Command Output:
"/Users/buildslave/jenkins/workspace/lldb-cmake-matrix/clang_1101_build/bin/clang" -std=c++11 -g -O0 -isysroot "/Applications/Xcode.app/Contents/Developer/Platforms/MacOSX.platform/Developer/SDKs/MacOSX11.1.sdk" -arch x86_64  -I/Users/buildslave/jenkins/workspace/lldb-cmake-matrix/llvm-project/lldb/packages/Python/lldbsuite/test/make/../../../../../include -I/Users/buildslave/jenkins/workspace/lldb-cmake-matrix/llvm-project/lldb/test/API/functionalities/data-formatter/poarray -I/Users/buildslave/jenkins/workspace/lldb-cmake-matrix/llvm-project/lldb/packages/Python/lldbsuite/test/make -include /Users/buildslave/jenkins/workspace/lldb-cmake-matrix/llvm-project/lldb/packages/Python/lldbsuite/test/make/test_common.h  -fno-limit-debug-info  -w   --driver-mode=g++ -MT main.o -MD -MP -MF main.d -c -o main.o /Users/buildslave/jenkins/workspace/lldb-cmake-matrix/llvm-project/lldb/test/API/functionalities/data-formatter/poarray/main.mm
In file included from /Users/buildslave/jenkins/workspace/lldb-cmake-matrix/llvm-project/lldb/test/API/functionalities/data-formatter/poarray/main.mm:1:
In file included from /Applications/Xcode.app/Contents/Developer/Platforms/MacOSX.platform/Developer/SDKs/MacOSX11.1.sdk/System/Library/Frameworks/Foundation.framework/Headers/Foundation.h:6:
In file included from /Applications/Xcode.app/Contents/Developer/Platforms/MacOSX.platform/Developer/SDKs/MacOSX11.1.sdk/System/Library/Frameworks/CoreFoundation.framework/Headers/CoreFoundation.h:18:
In file included from /Applications/Xcode.app/Contents/Developer/Platforms/MacOSX.platform/Developer/SDKs/MacOSX11.1.sdk/usr/include/assert.h:44:
/Users/buildslave/jenkins/workspace/lldb-cmake-matrix/clang_1101_build/bin/../include/c++/v1/stdlib.h:142:34: error: unknown type name 'ldiv_t'; did you mean 'dev_t'?
inline _LIBCPP_INLINE_VISIBILITY ldiv_t div(long __x, long __y) _NOEXCEPT {
                                 ^
/Applications/Xcode.app/Contents/Developer/Platforms/MacOSX.platform/Developer/SDKs/MacOSX11.1.sdk/usr/include/sys/_types/_dev_t.h:31:31: note: 'dev_t' declared here
typedef __darwin_dev_t        dev_t;    /* device number */
                              ^
In file included from /Users/buildslave/jenkins/workspace/lldb-cmake-matrix/llvm-project/lldb/test/API/functionalities/data-formatter/poarray/main.mm:1:
In file included from /Applications/Xcode.app/Contents/Developer/Platforms/MacOSX.platform/Developer/SDKs/MacOSX11.1.sdk/System/Library/Frameworks/Foundation.framework/Headers/Foundation.h:6:
In file included from /Applications/Xcode.app/Contents/Developer/Platforms/MacOSX.platform/Developer/SDKs/MacOSX11.1.sdk/System/Library/Frameworks/CoreFoundation.framework/Headers/CoreFoundation.h:18:
In file included from /Applications/Xcode.app/Contents/Developer/Platforms/MacOSX.platform/Developer/SDKs/MacOSX11.1.sdk/usr/include/assert.h:44:
/Users/buildslave/jenkins/workspace/lldb-cmake-matrix/clang_1101_build/bin/../include/c++/v1/stdlib.h:143:12: error: no member named 'ldiv' in the global namespace; did you mean 'div'?
  return ::ldiv(__x, __y);
         ~~^
/Users/buildslave/jenkins/workspace/lldb-cmake-matrix/clang_1101_build/bin/../include/c++/v1/stdlib.h:142:41: note: 'div' declared here
inline _LIBCPP_INLINE_VISIBILITY ldiv_t div(long __x, long __y) _NOEXCEPT {
                                        ^
/Users/buildslave/jenkins/workspace/lldb-cmake-matrix/clang_1101_build/bin/../include/c++/v1/stdlib.h:146:34: error: unknown type name 'lldiv_t'
inline _LIBCPP_INLINE_VISIBILITY lldiv_t div(long long __x,
                                 ^
/Users/buildslave/jenkins/workspace/lldb-cmake-matrix/clang_1101_build/bin/../include/c++/v1/stdlib.h:148:12: error: no member named 'lldiv' in the global namespace
  return ::lldiv(__x, __y);
         ~~^
In file included from /Users/buildslave/jenkins/workspace/lldb-cmake-matrix/llvm-project/lldb/test/API/functionalities/data-formatter/poarray/main.mm:1:
In file included from /Applications/Xcode.app/Contents/Developer/Platforms/MacOSX.platform/Developer/SDKs/MacOSX11.1.sdk/System/Library/Frameworks/Foundation.framework/Headers/Foundation.h:6:
In file included from /Applications/Xcode.app/Contents/Developer/Platforms/MacOSX.platform/Developer/SDKs/MacOSX11.1.sdk/System/Library/Frameworks/CoreFoundation.framework/Headers/CoreFoundation.h:24:
/Users/buildslave/jenkins/workspace/lldb-cmake-matrix/clang_1101_build/bin/../include/c++/v1/math.h:771:93: error: no member named 'acosf' in the global namespace; did you mean 'acos'?
inline _LIBCPP_INLINE_VISIBILITY float       acos(float __lcpp_x) _NOEXCEPT       {return ::acosf(__lcpp_x);}
                                                                                          ~~^
/Users/buildslave/jenkins/workspace/lldb-cmake-matrix/clang_1101_build/bin/../include/c++/v1/math.h:771:46: note: 'acos' declared here
inline _LIBCPP_INLINE_VISIBILITY float       acos(float __lcpp_x) _NOEXCEPT       {return ::acosf(__lcpp_x);}
                                             ^
/Users/buildslave/jenkins/workspace/lldb-cmake-matrix/clang_1101_build/bin/../include/c++/v1/math.h:772:93: error: no member named 'acosl' in the global namespace; did you mean 'acos'?
inline _LIBCPP_INLINE_VISIBILITY long double acos(long double __lcpp_x) _NOEXCEPT {return ::acosl(__lcpp_x);}
                                                                                          ~~^
/Users/buildslave/jenkins/workspace/lldb-cmake-matrix/clang_1101_build/bin/../include/c++/v1/math.h:771:46: note: 'acos' declared here
inline _LIBCPP_INLINE_VISIBILITY float       acos(float __lcpp_x) _NOEXCEPT       {return ::acosf(__lcpp_x);}
                                             ^
/Users/buildslave/jenkins/workspace/lldb-cmake-matrix/clang_1101_build/bin/../include/c++/v1/math.h:778:38: error: call to 'acos' is ambiguous
acos(_A1 __lcpp_x) _NOEXCEPT {return ::acos((double)__lcpp_x);}
                                     ^~~~~~
/Users/buildslave/jenkins/workspace/lldb-cmake-matrix/clang_1101_build/bin/../include/c++/v1/math.h:771:46: note: candidate function
inline _LIBCPP_INLINE_VISIBILITY float       acos(float __lcpp_x) _NOEXCEPT       {return ::acosf(__lcpp_x);}
                                             ^
/Users/buildslave/jenkins/workspace/lldb-cmake-matrix/clang_1101_build/bin/../include/c++/v1/math.h:772:46: note: candidate function
inline _LIBCPP_INLINE_VISIBILITY long double acos(long double __lcpp_x) _NOEXCEPT {return ::acosl(__lcpp_x);}
                                             ^
/Users/buildslave/jenkins/workspace/lldb-cmake-matrix/clang_1101_build/bin/../include/c++/v1/math.h:783:93: error: no member named 'asinf' in the global namespace; did you mean 'asin'?
inline _LIBCPP_INLINE_VISIBILITY float       asin(float __lcpp_x) _NOEXCEPT       {return ::asinf(__lcpp_x);}
                                                                                          ~~^
/Users/buildslave/jenkins/workspace/lldb-cmake-matrix/clang_1101_build/bin/../include/c++/v1/math.h:783:46: note: 'asin' declared here
inline _LIBCPP_INLINE_VISIBILITY float       asin(float __lcpp_x) _NOEXCEPT       {return ::asinf(__lcpp_x);}
                                             ^
/Users/buildslave/jenkins/workspace/lldb-cmake-matrix/clang_1101_build/bin/../include/c++/v1/math.h:784:93: error: no member named 'asinl' in the global namespace; did you mean 'asin'?
inline _LIBCPP_INLINE_VISIBILITY long double asin(long double __lcpp_x) _NOEXCEPT {return ::asinl(__lcpp_x);}
                                                                                          ~~^
/Users/buildslave/jenkins/workspace/lldb-cmake-matrix/clang_1101_build/bin/../include/c++/v1/math.h:783:46: note: 'asin' declared here
inline _LIBCPP_INLINE_VISIBILITY float       asin(float __lcpp_x) _NOEXCEPT       {return ::asinf(__lcpp_x);}
                                             ^
/Users/buildslave/jenkins/workspace/lldb-cmake-matrix/clang_1101_build/bin/../include/c++/v1/math.h:790:38: error: call to 'asin' is ambiguous
asin(_A1 __lcpp_x) _NOEXCEPT {return ::asin((double)__lcpp_x);}
                                     ^~~~~~
/Users/buildslave/jenkins/workspace/lldb-cmake-matrix/clang_1101_build/bin/../include/c++/v1/math.h:783:46: note: candidate function
inline _LIBCPP_INLINE_VISIBILITY float       asin(float __lcpp_x) _NOEXCEPT       {return ::asinf(__lcpp_x);}
                                             ^
/Users/buildslave/jenkins/workspace/lldb-cmake-matrix/clang_1101_build/bin/../include/c++/v1/math.h:784:46: note: candidate function
inline _LIBCPP_INLINE_VISIBILITY long double asin(long double __lcpp_x) _NOEXCEPT {return ::asinl(__lcpp_x);}
                                             ^
/Users/buildslave/jenkins/workspace/lldb-cmake-matrix/clang_1101_build/bin/../include/c++/v1/math.h:795:93: error: no member named 'atanf' in the global namespace; did you mean 'atan'?
inline _LIBCPP_INLINE_VISIBILITY float       atan(float __lcpp_x) _NOEXCEPT       {return ::atanf(__lcpp_x);}
                                                                                          ~~^
/Users/buildslave/jenkins/workspace/lldb-cmake-matrix/clang_1101_build/bin/../include/c++/v1/math.h:795:46: note: 'atan' declared here
inline _LIBCPP_INLINE_VISIBILITY float       atan(float __lcpp_x) _NOEXCEPT       {return ::atanf(__lcpp_x);}
                                             ^
/Users/buildslave/jenkins/workspace/lldb-cmake-matrix/clang_1101_build/bin/../include/c++/v1/math.h:796:93: error: no member named 'atanl' in the global namespace; did you mean 'atan'?
inline _LIBCPP_INLINE_VISIBILITY long double atan(long double __lcpp_x) _NOEXCEPT {return ::atanl(__lcpp_x);}
                                                                                          ~~^
/Users/buildslave/jenkins/workspace/lldb-cmake-matrix/clang_1101_build/bin/../include/c++/v1/math.h:795:46: note: 'atan' declared here
inline _LIBCPP_INLINE_VISIBILITY float       atan(float __lcpp_x) _NOEXCEPT       {return ::atanf(__lcpp_x);}
                                             ^
/Users/buildslave/jenkins/workspace/lldb-cmake-matrix/clang_1101_build/bin/../include/c++/v1/math.h:802:38: error: call to 'atan' is ambiguous
atan(_A1 __lcpp_x) _NOEXCEPT {return ::atan((double)__lcpp_x);}
                                     ^~~~~~
/Users/buildslave/jenkins/workspace/lldb-cmake-matrix/clang_1101_build/bin/../include/c++/v1/math.h:795:46: note: candidate function
inline _LIBCPP_INLINE_VISIBILITY float       atan(float __lcpp_x) _NOEXCEPT       {return ::atanf(__lcpp_x);}
                                             ^
/Users/buildslave/jenkins/workspace/lldb-cmake-matrix/clang_1101_build/bin/../include/c++/v1/math.h:796:46: note: candidate function
inline _LIBCPP_INLINE_VISIBILITY long double atan(long double __lcpp_x) _NOEXCEPT {return ::atanl(__lcpp_x);}
                                             ^
/Users/buildslave/jenkins/workspace/lldb-cmake-matrix/clang_1101_build/bin/../include/c++/v1/math.h:807:116: error: no member named 'atan2f' in the global namespace; did you mean 'atan2'?
inline _LIBCPP_INLINE_VISIBILITY float       atan2(float __lcpp_y, float __lcpp_x) _NOEXCEPT             {return ::atan2f(__lcpp_y, __lcpp_x);}
                                                                                                                 ~~^
/Users/buildslave/jenkins/workspace/lldb-cmake-matrix/clang_1101_build/bin/../include/c++/v1/math.h:807:46: note: 'atan2' declared here
inline _LIBCPP_INLINE_VISIBILITY float       atan2(float __lcpp_y, float __lcpp_x) _NOEXCEPT             {return ::atan2f(__lcpp_y, __lcpp_x);}
                                             ^
/Users/buildslave/jenkins/workspace/lldb-cmake-matrix/clang_1101_build/bin/../include/c++/v1/math.h:808:116: error: no member named 'atan2l' in the global namespace; did you mean 'atan2'?
inline _LIBCPP_INLINE_VISIBILITY long double atan2(long double __lcpp_y, long double __lcpp_x) _NOEXCEPT {return ::atan2l(__lcpp_y, __lcpp_x);}
                                                                                                                 ~~^
/Users/buildslave/jenkins/workspace/lldb-cmake-matrix/clang_1101_build/bin/../include/c++/v1/math.h:807:46: note: 'atan2' declared here
inline _LIBCPP_INLINE_VISIBILITY float       atan2(float __lcpp_y, float __lcpp_x) _NOEXCEPT             {return ::atan2f(__lcpp_y, __lcpp_x);}
                                             ^
/Users/buildslave/jenkins/workspace/lldb-cmake-matrix/clang_1101_build/bin/../include/c++/v1/math.h:830:93: error: no member named 'ceilf' in the global namespace; did you mean 'ceil'?
inline _LIBCPP_INLINE_VISIBILITY float       ceil(float __lcpp_x) _NOEXCEPT       {return ::ceilf(__lcpp_x);}
                                                                                          ~~^
/Users/buildslave/jenkins/workspace/lldb-cmake-matrix/clang_1101_build/bin/../include/c++/v1/math.h:830:46: note: 'ceil' declared here
inline _LIBCPP_INLINE_VISIBILITY float       ceil(float __lcpp_x) _NOEXCEPT       {return ::ceilf(__lcpp_x);}
                                             ^
/Users/buildslave/jenkins/workspace/lldb-cmake-matrix/clang_1101_build/bin/../include/c++/v1/math.h:831:93: error: no member named 'ceill' in the global namespace; did you mean 'ceil'?
inline _LIBCPP_INLINE_VISIBILITY long double ceil(long double __lcpp_x) _NOEXCEPT {return ::ceill(__lcpp_x);}
                                                                                          ~~^
/Users/buildslave/jenkins/workspace/lldb-cmake-matrix/clang_1101_build/bin/../include/c++/v1/math.h:830:46: note: 'ceil' declared here
inline _LIBCPP_INLINE_VISIBILITY float       ceil(float __lcpp_x) _NOEXCEPT       {return ::ceilf(__lcpp_x);}
                                             ^
/Users/buildslave/jenkins/workspace/lldb-cmake-matrix/clang_1101_build/bin/../include/c++/v1/math.h:837:38: error: call to 'ceil' is ambiguous
ceil(_A1 __lcpp_x) _NOEXCEPT {return ::ceil((double)__lcpp_x);}
                                     ^~~~~~
/Users/buildslave/jenkins/workspace/lldb-cmake-matrix/clang_1101_build/bin/../include/c++/v1/math.h:830:46: note: candidate function
inline _LIBCPP_INLINE_VISIBILITY float       ceil(float __lcpp_x) _NOEXCEPT       {return ::ceilf(__lcpp_x);}
                                             ^
/Users/buildslave/jenkins/workspace/lldb-cmake-matrix/clang_1101_build/bin/../include/c++/v1/math.h:831:46: note: candidate function
inline _LIBCPP_INLINE_VISIBILITY long double ceil(long double __lcpp_x) _NOEXCEPT {return ::ceill(__lcpp_x);}
                                             ^
/Users/buildslave/jenkins/workspace/lldb-cmake-matrix/clang_1101_build/bin/../include/c++/v1/math.h:842:92: error: no member named 'cosf' in the global namespace; did you mean 'cos'?
inline _LIBCPP_INLINE_VISIBILITY float       cos(float __lcpp_x) _NOEXCEPT       {return ::cosf(__lcpp_x);}
                                                                                         ~~^
/Users/buildslave/jenkins/workspace/lldb-cmake-matrix/clang_1101_build/bin/../include/c++/v1/math.h:842:46: note: 'cos' declared here
inline _LIBCPP_INLINE_VISIBILITY float       cos(float __lcpp_x) _NOEXCEPT       {return ::cosf(__lcpp_x);}
                                             ^
fatal error: too many errors emitted, stopping now [-ferror-limit=]
20 errors generated.
make: *** [main.o] Error 1

Test Directory:
/Users/buildslave/jenkins/workspace/lldb-cmake-matrix/llvm-project/lldb/test/API/functionalities/data-formatter/poarray
----------------------------------------------------------------------
Ran 8 tests in 12.978s

RESULT: FAILED (2 passes, 0 failures, 2 errors, 4 skipped, 0 expected failures, 0 unexpected successes)

--