FailedConsole Output

Skipping 525 KB.. Full Log
PASS: lldb-shell :: ObjectFile/ELF/section-addresses.yaml (869 of 2338)
PASS: lldb-unit :: Platform/./LLDBPlatformTests/PlatformDarwinTest.FindComponentInPath (870 of 2338)
PASS: lldb-unit :: Host/./HostTests/FileSystemTest.OpenErrno (871 of 2338)
UNSUPPORTED: lldb-api :: lang/cpp/printf/TestPrintf.py (872 of 2338)
PASS: lldb-unit :: Utility/./UtilityTests/StringExtractorTest.GetHexU8_InvalidHex_NoEof (873 of 2338)
PASS: lldb-unit :: UnwindAssembly/x86/./UnwindAssemblyx86Tests/Testx86AssemblyInspectionEngine.TestSubRSP (874 of 2338)
PASS: lldb-api :: tools/lldb-server/register-reading/TestGdbRemoteGPacket.py (875 of 2338)
PASS: lldb-api :: sample_test/TestSampleInlineTest.py (876 of 2338)
PASS: lldb-api :: commands/expression/multiline-navigation/TestMultilineNavigation.py (877 of 2338)
PASS: lldb-shell :: Settings/TestLineMarkerColor.test (878 of 2338)
PASS: lldb-shell :: SymbolFile/DWARF/x86/static_scope.s (879 of 2338)
PASS: lldb-unit :: Host/./HostTests/NativeProcessProtocolTest.ReadCStringFromMemory_CrossPageBoundary (880 of 2338)
PASS: lldb-unit :: SymbolFile/NativePDB/./SymbolFileNativePDBTests/PDBFPOProgramToDWARFExpressionTests.UnresolvedRegisterReference (881 of 2338)
PASS: lldb-api :: functionalities/gdb_remote_client/TestStopPCs.py (882 of 2338)
PASS: lldb-unit :: SymbolFile/NativePDB/./SymbolFileNativePDBTests/PDBFPOProgramToDWARFExpressionTests.UnresolvedRegisterAssignmentReference (883 of 2338)
PASS: lldb-shell :: ScriptInterpreter/None/import_module.test (884 of 2338)
PASS: lldb-shell :: Unwind/trap_frame_sym_ctx.test (885 of 2338)
PASS: lldb-unit :: Host/./HostTests/SocketTests/SocketTest.UDPGetConnectURI/ipv6 (886 of 2338)
PASS: lldb-api :: lang/cpp/function-qualifiers/TestCppFunctionQualifiers.py (887 of 2338)
PASS: lldb-unit :: Symbol/./SymbolTests/TestTypeSystemClang.TestRecordHasFields (888 of 2338)
PASS: lldb-unit :: Utility/./UtilityTests/RangeTest.Clear (889 of 2338)
PASS: lldb-unit :: UnwindAssembly/x86/./UnwindAssemblyx86Tests/Testx86AssemblyInspectionEngine.TestPushImm (890 of 2338)
PASS: lldb-api :: commands/watchpoints/watchpoint_events/TestWatchpointEvents.py (891 of 2338)
PASS: lldb-api :: python_api/lldbutil/iter/TestRegistersIterator.py (892 of 2338)
PASS: lldb-api :: lang/cpp/auto/TestCPPAuto.py (893 of 2338)
UNSUPPORTED: lldb-api :: tools/lldb-server/TestGdbRemoteCompletion.py (894 of 2338)
PASS: lldb-unit :: Utility/./UtilityTests/StringListTest.ShiftCString (895 of 2338)
PASS: lldb-shell :: SymbolFile/DWARF/x86/debug-names-compressed.cpp (896 of 2338)
PASS: lldb-shell :: Register/Core/x86-64-linux-gp.test (897 of 2338)
PASS: lldb-unit :: Utility/./UtilityTests/FileSpecTest.CopyByAppendingPathComponent (898 of 2338)
PASS: lldb-api :: macosx/find-dsym/deep-bundle/TestDeepBundle.py (899 of 2338)
PASS: lldb-unit :: Process/minidump/./LLDBMinidumpTests/MinidumpParserTest.GetExceptionStream (900 of 2338)
UNSUPPORTED: lldb-shell :: ScriptInterpreter/Lua/partial_statements.test (901 of 2338)
PASS: lldb-api :: lang/cpp/static_methods/TestCPPStaticMethods.py (902 of 2338)
PASS: lldb-shell :: BuildScript/toolchain-clang.test (903 of 2338)
PASS: lldb-unit :: Expression/./ExpressionTests/DWARFExpression.DW_OP_unknown (904 of 2338)
PASS: lldb-unit :: Process/minidump/./LLDBMinidumpTests/MinidumpParserTest.FindMemoryRange (905 of 2338)
UNSUPPORTED: lldb-api :: linux/aarch64/mte_memory_region/TestAArch64LinuxMTEMemoryRegion.py (906 of 2338)
PASS: lldb-api :: commands/expression/options/TestExprOptions.py (907 of 2338)
PASS: lldb-unit :: Language/Highlighting/./HighlighterTests/HighlighterTest.ClangIdentifiers (908 of 2338)
UNSUPPORTED: lldb-shell :: SymbolFile/DWARF/split-dwarf-expression-eval-bug.cpp (909 of 2338)
PASS: lldb-api :: functionalities/breakpoint/cpp_exception/TestCPPExceptionBreakpoint.py (910 of 2338)
PASS: lldb-api :: tools/lldb-server/commandline/TestGdbRemoteConnection.py (911 of 2338)
PASS: lldb-unit :: Utility/./UtilityTests/RecordReplayTest.InvalidSequence (912 of 2338)
PASS: lldb-unit :: Utility/./UtilityTests/OptionsWithRawTest.MultiWordSuffix (913 of 2338)
PASS: lldb-api :: python_api/disassemble-raw-data/TestDisassemble_VST1_64.py (914 of 2338)
PASS: lldb-api :: commands/gui/breakpoints/TestGuiBreakpoints.py (915 of 2338)
PASS: lldb-shell :: Driver/TestCore.test (916 of 2338)
PASS: lldb-unit :: ObjectFile/PECOFF/./ObjectFilePECOFFTests/PECallFrameInfoTest.Basic_eh (917 of 2338)
PASS: lldb-api :: functionalities/gdb_remote_client/TestRemoteRegNums.py (918 of 2338)
PASS: lldb-api :: functionalities/fat_archives/TestFatArchives.py (919 of 2338)
PASS: lldb-shell :: SymbolFile/DWARF/x86/inline-function-address.ll (920 of 2338)
PASS: lldb-shell :: Minidump/Windows/find-module.test (921 of 2338)
PASS: lldb-api :: lang/cpp/thread_local/TestThreadLocal.py (922 of 2338)
PASS: lldb-api :: tools/lldb-server/TestGdbRemoteAttachWait.py (923 of 2338)
PASS: lldb-api :: commands/gui/basic/TestGuiBasic.py (924 of 2338)
PASS: lldb-shell :: Commands/command-image-lookup.yaml (925 of 2338)
PASS: lldb-api :: commands/source/info/TestSourceInfo.py (926 of 2338)
PASS: lldb-api :: commands/watchpoints/multiple_hits/TestMultipleHits.py (927 of 2338)
UNSUPPORTED: lldb-api :: functionalities/process_save_core/TestProcessSaveCore.py (928 of 2338)
UNSUPPORTED: lldb-api :: functionalities/darwin_log/filter/exact_match/subsystem/TestDarwinLogFilterMatchSubsystem.py (929 of 2338)
PASS: lldb-api :: commands/expression/argument_passing_restrictions/TestArgumentPassingRestrictions.py (930 of 2338)
PASS: lldb-api :: functionalities/thread/concurrent_events/TestConcurrentTwoWatchpointsOneSignal.py (931 of 2338)
PASS: lldb-api :: commands/frame/diagnose/virtual-method-call/TestDiagnoseDereferenceVirtualMethodCall.py (932 of 2338)
PASS: lldb-shell :: SymbolFile/DWARF/x86/dwarf5-split.s (933 of 2338)
PASS: lldb-shell :: Reproducer/TestDebugSymbols.test (934 of 2338)
PASS: lldb-api :: lang/c/register_variables/TestRegisterVariables.py (935 of 2338)
UNSUPPORTED: lldb-shell :: ScriptInterpreter/Lua/watchpoint_callback.test (936 of 2338)
PASS: lldb-unit :: Utility/./UtilityTests/StateTest.Formatv (937 of 2338)
PASS: lldb-api :: lang/cpp/wchar_t/TestCxxWCharT.py (938 of 2338)
PASS: lldb-shell :: ScriptInterpreter/None/none.test (939 of 2338)
PASS: lldb-api :: tools/lldb-server/TestGdbRemoteThreadsInStopReply.py (940 of 2338)
PASS: lldb-unit :: Symbol/./SymbolTests/TestClangASTImporter.RecordLayout (941 of 2338)
PASS: lldb-unit :: SymbolFile/NativePDB/./SymbolFileNativePDBTests/PDBFPOProgramToDWARFExpressionTests.MultipleDependentAssignments (942 of 2338)
PASS: lldb-api :: functionalities/breakpoint/auto_continue/TestBreakpointAutoContinue.py (943 of 2338)
PASS: lldb-api :: functionalities/unwind/noreturn/TestNoreturnUnwind.py (944 of 2338)
PASS: lldb-unit :: Core/./LLDBCoreTests/MangledTest.ResultForValidName (945 of 2338)
PASS: lldb-api :: commands/expression/import-std-module/list/TestListFromStdModule.py (946 of 2338)
PASS: lldb-unit :: SymbolFile/DWARF/./SymbolFileDWARFTests/SymbolFileDWARFTests.ParseArangesSkipErrors (947 of 2338)
UNSUPPORTED: lldb-shell :: Register/x86-fp-read.test (948 of 2338)
UNSUPPORTED: lldb-shell :: SymbolFile/PDB/class-layout.test (949 of 2338)
PASS: lldb-api :: python_api/default-constructor/TestDefaultConstructorForAPIObjects.py (950 of 2338)
PASS: lldb-unit :: Utility/./UtilityTests/ProcessInstanceInfo.DumpTable (951 of 2338)
PASS: lldb-api :: commands/expression/regression-access-function-template-in-record/TestRegressionAccessFunctionTemplateInRecord.py (952 of 2338)
PASS: lldb-api :: lang/cpp/overloaded-functions/TestOverloadedFunctions.py (953 of 2338)
PASS: lldb-api :: python_api/value_var_update/TestValueVarUpdate.py (954 of 2338)
UNSUPPORTED: lldb-shell :: Register/x86-gp-write.test (955 of 2338)
PASS: lldb-shell :: Minidump/memory-region-from-module.yaml (956 of 2338)
PASS: lldb-api :: functionalities/gdb_remote_client/TestThreadSelectionBug.py (957 of 2338)
UNSUPPORTED: lldb-shell :: Register/x86-64-zmm-read.test (958 of 2338)
PASS: lldb-api :: commands/quit/TestQuit.py (959 of 2338)
PASS: lldb-shell :: SymbolFile/DWARF/x86/find-basic-type.cpp (960 of 2338)
PASS: lldb-unit :: UnwindAssembly/x86/./UnwindAssemblyx86Tests/Testx86AssemblyInspectionEngine.TestStackRealignMSVC_i386 (961 of 2338)
PASS: lldb-unit :: Utility/./UtilityTests/CompletionRequest.ShiftArguments (962 of 2338)
PASS: lldb-shell :: ObjectFile/PECOFF/symbol.yaml (963 of 2338)
PASS: lldb-api :: commands/expression/import-std-module/pair/TestPairFromStdModule.py (964 of 2338)
PASS: lldb-api :: lang/c/stepping/TestStepAndBreakpoints.py (965 of 2338)
PASS: lldb-unit :: ScriptInterpreter/Python/./ScriptInterpreterPythonTests/PythonDataObjectsTest.TestPythonDictionaryManipulation (966 of 2338)
PASS: lldb-shell :: ObjectFile/ELF/build-id-case.yaml (967 of 2338)
PASS: lldb-unit :: Process/gdb-remote/./ProcessGdbRemoteTests/GDBRemoteCommunicationServerTest.SendErrorResponse_StringError (968 of 2338)
PASS: lldb-unit :: Process/gdb-remote/./ProcessGdbRemoteTests/GDBRemoteCommunicationClientTest.WriteRegister (969 of 2338)
PASS: lldb-api :: commands/expression/function_template_specialization_temp_args/TestFunctionTemplateSpecializationTempArgs.py (970 of 2338)
PASS: lldb-api :: commands/gui/viewlarge/TestGuiViewLarge.py (971 of 2338)
PASS: lldb-api :: functionalities/gdb_remote_client/TestRegDefinitionInParts.py (972 of 2338)
PASS: lldb-unit :: Process/minidump/./LLDBMinidumpTests/MinidumpParserTest.GetThreadsAndGetThreadContext (973 of 2338)
UNSUPPORTED: lldb-api :: functionalities/thread/concurrent_events/TestConcurrentManySignals.py (974 of 2338)
PASS: lldb-api :: functionalities/data-formatter/data-formatter-globals/TestDataFormatterGlobals.py (975 of 2338)
PASS: lldb-shell :: Reproducer/TestDriverOptions.test (976 of 2338)
XFAIL: lldb-shell :: SymbolFile/DWARF/find-type-in-function.cpp (977 of 2338)
PASS: lldb-unit :: Utility/./UtilityTests/OptionsWithRawTest.SingleWhitespaceInput (978 of 2338)
PASS: lldb-api :: api/listeners/TestListener.py (979 of 2338)
PASS: lldb-unit :: SymbolFile/DWARF/./SymbolFileDWARFTests/DWARFUnitTest.NullUnitDie (980 of 2338)
PASS: lldb-api :: tools/lldb-vscode/step/TestVSCode_step.py (981 of 2338)
PASS: lldb-unit :: Utility/./UtilityTests/StreamTest.PutBytesAsRawHex8ToBigEndian (982 of 2338)
PASS: lldb-shell :: ObjectFile/ELF/minidebuginfo-find-symbols.yaml (983 of 2338)
PASS: lldb-unit :: Utility/./UtilityTests/ArgsTest.TestSingleArg (984 of 2338)
PASS: lldb-unit :: Expression/./ExpressionTests/DiagnosticManagerTest.GetStringNoDiags (985 of 2338)
PASS: lldb-shell :: Register/Core/x86-64-netbsd-addr.test (986 of 2338)
PASS: lldb-unit :: Utility/./UtilityTests/RegularExpression.Empty (987 of 2338)
PASS: lldb-api :: functionalities/ptr_refs/TestPtrRefs.py (988 of 2338)
PASS: lldb-api :: commands/expression/namespace_local_var_same_name_cpp_and_c/TestNamespaceLocalVarSameNameCppAndC.py (989 of 2338)
PASS: lldb-unit :: Process/minidump/./LLDBMinidumpTests/MinidumpParserTest.GetThreadContext_x86_64 (990 of 2338)
PASS: lldb-api :: functionalities/tail_call_frames/thread_step_out_message/TestArtificialFrameStepOutMessage.py (991 of 2338)
PASS: lldb-unit :: Core/./LLDBCoreTests/DumpDataExtractorTest.Formats (992 of 2338)
PASS: lldb-api :: functionalities/plugins/command_plugin/TestPluginCommands.py (993 of 2338)
PASS: lldb-unit :: Process/gdb-remote/./ProcessGdbRemoteTests/PortMapTest.AllowPort (994 of 2338)
PASS: lldb-unit :: Utility/./UtilityTests/OptionsWithRawTest.EmptyArgsOnlySuffix (995 of 2338)
PASS: lldb-shell :: SymbolFile/NativePDB/load-pdb.cpp (996 of 2338)
PASS: lldb-unit :: Symbol/./SymbolTests/PostfixExpression.ToDWARF (997 of 2338)
PASS: lldb-api :: functionalities/gdb_remote_client/TestArmRegisterDefinition.py (998 of 2338)
PASS: lldb-api :: lang/cpp/unique-types/TestUniqueTypes.py (999 of 2338)
UNSUPPORTED: lldb-api :: functionalities/tty/TestTerminal.py (1000 of 2338)
PASS: lldb-unit :: Process/Utility/./ProcessUtilityTests/ProcSMapTests/LinuxProcSMapsTestFixture.ParseSMapRegions/6 (1001 of 2338)
PASS: lldb-api :: commands/disassemble/basic/TestDisassembleBreakpoint.py (1002 of 2338)
PASS: lldb-unit :: Host/./HostTests/FileActionTest.Open (1003 of 2338)
PASS: lldb-shell :: SymbolFile/DWARF/x86/debug_loc_and_loclists.s (1004 of 2338)
UNSUPPORTED: lldb-api :: functionalities/breakpoint/breakpoint_in_delayslot/TestAvoidBreakpointInDelaySlot.py (1005 of 2338)
PASS: lldb-api :: tools/lldb-server/memory-allocation/TestGdbRemoteMemoryAllocation.py (1006 of 2338)
PASS: lldb-unit :: Process/minidump/./LLDBMinidumpTests/MinidumpParserTest.MinidumpDuplicateModuleMappedFirst (1007 of 2338)
PASS: lldb-unit :: Utility/./UtilityTests/LogChannelEnabledTest.log_options (1008 of 2338)
PASS: lldb-unit :: Symbol/./SymbolTests/Type.CompilerContextPattern (1009 of 2338)
PASS: lldb-api :: functionalities/breakpoint/breakpoint_command/TestRegexpBreakCommand.py (1010 of 2338)
PASS: lldb-unit :: Utility/./UtilityTests/UriParserTest.Minimal (1011 of 2338)
PASS: lldb-api :: functionalities/tail_call_frames/sbapi_support/TestTailCallFrameSBAPI.py (1012 of 2338)
PASS: lldb-unit :: Core/./LLDBCoreTests/FormatEntityTest.DefinitionConstructionNameTypeData (1013 of 2338)
PASS: lldb-api :: functionalities/float-display/TestFloatDisplay.py (1014 of 2338)
PASS: lldb-api :: commands/gui/invalid-args/TestInvalidArgsGui.py (1015 of 2338)
UNSUPPORTED: lldb-shell :: SymbolFile/DWARF/x86/DW_TAG_variable-DW_AT_decl_file-DW_AT_abstract_origin-crosscu1.s (1016 of 2338)
PASS: lldb-unit :: Symbol/./SymbolTests/TestTypeSystemClang.TestOwningModule (1017 of 2338)
PASS: lldb-unit :: Utility/./UtilityTests/StringExtractorTest.GetHexBytesAvail_FullString (1018 of 2338)
PASS: lldb-unit :: ScriptInterpreter/Python/./ScriptInterpreterPythonTests/PythonDataObjectsTest.TestTypeNameResolutionNoDot (1019 of 2338)
PASS: lldb-api :: functionalities/memory/read/TestMemoryRead.py (1020 of 2338)
PASS: lldb-api :: python_api/function_symbol/TestSymbolAPI.py (1021 of 2338)
PASS: lldb-unit :: Utility/./UtilityTests/StreamTeeTest.SetStreamAtIndexOutOfBounds (1022 of 2338)
PASS: lldb-unit :: Language/Highlighting/./HighlighterTests/HighlighterTest.ClangOperators (1023 of 2338)
PASS: lldb-unit :: DataFormatter/./LLDBFormatterTests/TypeMatcherTests.CreatedBySameMatchStringExactNamePrefixes (1024 of 2338)
PASS: lldb-unit :: Utility/./UtilityTests/ConstStringTest.YAML (1025 of 2338)
PASS: lldb-api :: tools/lldb-vscode/variables/TestVSCode_variables.py (1026 of 2338)
PASS: lldb-api :: functionalities/gdb_remote_client/TestQemuAArch64TargetXml.py (1027 of 2338)
PASS: lldb-api :: functionalities/unwind/noreturn/module-end/TestNoReturnModuleEnd.py (1028 of 2338)
PASS: lldb-unit :: Utility/./UtilityTests/ArgsTest.TestInsertArg (1029 of 2338)
PASS: lldb-api :: functionalities/process_group/TestChangeProcessGroup.py (1030 of 2338)
PASS: lldb-unit :: Utility/./UtilityTests/NameMatchesTest.Equals (1031 of 2338)
PASS: lldb-unit :: Interpreter/./InterpreterTests/OptionValueArgs.DeepCopy (1032 of 2338)
PASS: lldb-api :: lang/c/vla/TestVLA.py (1033 of 2338)
PASS: lldb-unit :: Process/Utility/./ProcessUtilityTests/ProcMapTests/LinuxProcMapsTestFixture.ParseMapRegions/3 (1034 of 2338)
PASS: lldb-api :: lang/objc/objc++/TestObjCXX.py (1035 of 2338)
PASS: lldb-unit :: Utility/./UtilityTests/StreamTeeTest.Write (1036 of 2338)
PASS: lldb-api :: functionalities/thread/concurrent_events/TestConcurrentDelayedCrashWithBreakpointWatchpoint.py (1037 of 2338)
PASS: lldb-api :: functionalities/data-formatter/data-formatter-proper-plurals/TestFormattersOneIsSingular.py (1038 of 2338)
PASS: lldb-api :: functionalities/tail_call_frames/disambiguate_tail_call_seq/TestDisambiguateTailCallSeq.py (1039 of 2338)
PASS: lldb-unit :: Utility/./UtilityTests/StringListTest.LongestCommonPrefixNoPrefix (1040 of 2338)
PASS: lldb-api :: lang/cpp/unicode-literals/TestUnicodeLiterals.py (1041 of 2338)
PASS: lldb-api :: functionalities/data-formatter/data-formatter-objc/TestDataFormatterObjCNSData.py (1042 of 2338)
UNSUPPORTED: lldb-api :: functionalities/darwin_log/filter/exact_match/category/TestDarwinLogFilterMatchCategory.py (1043 of 2338)
PASS: lldb-api :: functionalities/thread/concurrent_events/TestConcurrentTwoBreakpointsOneSignal.py (1044 of 2338)
PASS: lldb-unit :: UnwindAssembly/x86/./UnwindAssemblyx86Tests/Testx86AssemblyInspectionEngine.Test64bitFramelessSmallStackFrame (1045 of 2338)
UNSUPPORTED: lldb-api :: tools/lldb-vscode/disconnect/TestVSCode_disconnect.py (1046 of 2338)
PASS: lldb-api :: commands/platform/basic/TestPlatformPython.py (1047 of 2338)
PASS: lldb-unit :: Utility/./UtilityTests/FileSpecTest.Match (1048 of 2338)
PASS: lldb-unit :: Utility/./UtilityTests/StringExtractorTest.DecodeHexU8_InvalidHex (1049 of 2338)
UNSUPPORTED: lldb-api :: benchmarks/stepping/TestSteppingSpeed.py (1050 of 2338)
PASS: lldb-api :: commands/expression/radar_9531204/TestPrintfAfterUp.py (1051 of 2338)
PASS: lldb-api :: lang/objc/forward-decl/TestForwardDecl.py (1052 of 2338)
PASS: lldb-shell :: ObjectFile/Breakpad/uuid-matching-mac.test (1053 of 2338)
PASS: lldb-shell :: ScriptInterpreter/Python/Crashlog/parser_json.test (1054 of 2338)
UNSUPPORTED: lldb-api :: tools/lldb-server/TestGdbRemoteModuleInfo.py (1055 of 2338)
PASS: lldb-api :: functionalities/memory-region/TestMemoryRegion.py (1056 of 2338)
PASS: lldb-unit :: Utility/./UtilityTests/ScalarTest.TruncOrExtendTo (1057 of 2338)
PASS: lldb-api :: python_api/value/linked_list/TestValueAPILinkedList.py (1058 of 2338)
PASS: lldb-api :: lang/objcxx/hide-runtime-values/TestObjCXXHideRuntimeValues.py (1059 of 2338)
PASS: lldb-unit :: Expression/./ExpressionTests/DiagnosticManagerTest.GetStringMultipleDiags (1060 of 2338)
PASS: lldb-unit :: Host/./HostTests/SocketTests/SocketTest.TCPListen0ConnectAccept/ipv6 (1061 of 2338)
PASS: lldb-unit :: Host/./HostTests/FileSystemTest.MakeAbsolute (1062 of 2338)
PASS: lldb-unit :: ScriptInterpreter/Python/./ScriptInterpreterPythonTests/PythonDataObjectsTest.TestPythonTupleInitializerList2 (1063 of 2338)
PASS: lldb-unit :: SymbolFile/DWARF/./SymbolFileDWARFTests/XcodeSDKModuleTests.TestModuleGetXcodeSDK (1064 of 2338)
PASS: lldb-shell :: SymbolFile/DWARF/x86/debug_rnglists.s (1065 of 2338)
PASS: lldb-unit :: Utility/./UtilityTests/OptionsWithRawTest.EmptyInput (1066 of 2338)
PASS: lldb-shell :: SymbolFile/DWARF/x86/dwarf5_tu_index_abbrev_offset.s (1067 of 2338)
PASS: lldb-api :: lang/c/anonymous/TestAnonymous.py (1068 of 2338)
PASS: lldb-unit :: Process/minidump/./LLDBMinidumpTests/MinidumpParserTest.MinidumpModuleOrder (1069 of 2338)
PASS: lldb-api :: functionalities/pointer_num_children/TestPointerNumChildren.py (1070 of 2338)
PASS: lldb-api :: commands/log/invalid-args/TestInvalidArgsLog.py (1071 of 2338)
PASS: lldb-unit :: tools/lldb-server/tests/./LLDBServerTests/StandardStartupTest.TestStopReplyContainsThreadPcs (1072 of 2338)
PASS: lldb-unit :: Utility/./UtilityTests/StringExtractorTest.GetHexU8_Exact_NoEof (1073 of 2338)
PASS: lldb-unit :: UnwindAssembly/ARM64/./Arm64InstEmulationTests/TestArm64InstEmulation.TestRegisterSavedTwice (1074 of 2338)
UNSUPPORTED: lldb-api :: commands/trace/TestTraceStartStop.py (1075 of 2338)
PASS: lldb-unit :: Core/./LLDBCoreTests/RichManglingContextTest.IPDRealloc (1076 of 2338)
PASS: lldb-api :: functionalities/data-formatter/data-formatter-stl/libcxx/map/TestDataFormatterLibccMap.py (1077 of 2338)
PASS: lldb-api :: iohandler/unicode/TestUnicode.py (1078 of 2338)
PASS: lldb-api :: lang/cpp/elaborated-types/TestElaboratedTypes.py (1079 of 2338)
PASS: lldb-unit :: Host/./HostTests/FileSystemTest.Exists (1080 of 2338)
PASS: lldb-api :: functionalities/breakpoint/breakpoint_names/TestBreakpointNames.py (1081 of 2338)
PASS: lldb-unit :: Utility/./UtilityTests/StreamTest.PutBytesAsRawHex8ToMixedEndian (1082 of 2338)
PASS: lldb-api :: tools/lldb-vscode/breakpoint/TestVSCode_setBreakpoints.py (1083 of 2338)
PASS: lldb-unit :: Utility/./UtilityTests/UriParserTest.SchemeHostSeparator2 (1084 of 2338)
PASS: lldb-shell :: SymbolFile/DWARF/x86/dwp-debug-types.s (1085 of 2338)
PASS: lldb-api :: commands/expression/cast_int_to_anonymous_enum/TestCastIntToAnonymousEnum.py (1086 of 2338)
PASS: lldb-api :: lang/objcxx/cpp_keywords_enabled/TestObjCppKeywordsEnabled.py (1087 of 2338)
PASS: lldb-unit :: UnwindAssembly/x86/./UnwindAssemblyx86Tests/Testx86AssemblyInspectionEngine.TestPushEAX (1088 of 2338)
PASS: lldb-api :: commands/target/stop-hooks/TestStopHookScripted.py (1089 of 2338)
PASS: lldb-shell :: SymbolFile/NativePDB/function-types-classes.cpp (1090 of 2338)
UNSUPPORTED: lldb-api :: functionalities/thread/thread_specific_break_plus_condition/TestThreadSpecificBpPlusCondition.py (1091 of 2338)
PASS: lldb-shell :: SymbolFile/DWARF/x86/debug-types-line-tables.s (1092 of 2338)
PASS: lldb-api :: commands/target/select/TestTargetSelect.py (1093 of 2338)
PASS: lldb-unit :: Utility/./UtilityTests/BroadcasterTest.EventTypeHasListeners (1094 of 2338)
PASS: lldb-api :: tools/lldb-vscode/console/TestVSCode_redirection_to_console.py (1095 of 2338)
PASS: lldb-unit :: Utility/./UtilityTests/RangeDataVector.FindEntryIndexesThatContain_Overlap (1096 of 2338)
PASS: lldb-unit :: Language/Highlighting/./HighlighterTests/HighlighterTest.ClangCursorPosAfterOtherToken (1097 of 2338)
PASS: lldb-api :: functionalities/breakpoint/breakpoint_conditions/TestBreakpointConditions.py (1098 of 2338)
PASS: lldb-unit :: UnwindAssembly/x86/./UnwindAssemblyx86Tests/Testx86AssemblyInspectionEngine.TestPushR14 (1099 of 2338)
PASS: lldb-api :: types/TestDoubleTypes.py (1100 of 2338)
PASS: lldb-unit :: Utility/./UtilityTests/ArgsTest.TestTrailingBackslash (1101 of 2338)
PASS: lldb-api :: functionalities/data-formatter/data-formatter-stl/libcxx/vector/TestDataFormatterLibcxxVector.py (1102 of 2338)
PASS: lldb-unit :: Utility/./UtilityTests/StreamTest.ShiftOperatorChars (1103 of 2338)
PASS: lldb-api :: functionalities/postmortem/minidump/TestMiniDump.py (1104 of 2338)
UNSUPPORTED: lldb-api :: arm/breakpoint-it/TestBreakpointIt.py (1105 of 2338)
PASS: lldb-shell :: SymbolFile/DWARF/x86/debug-line-basic.s (1106 of 2338)
PASS: lldb-shell :: SymbolFile/DWARF/x86/DW_OP_piece-struct.s (1107 of 2338)
PASS: lldb-api :: functionalities/exec/TestExec.py (1108 of 2338)
PASS: lldb-unit :: Language/Highlighting/./HighlighterTests/HighlighterTest.ClangCursorPos (1109 of 2338)
PASS: lldb-shell :: ObjectFile/ELF/avr-basic-info.yaml (1110 of 2338)
PASS: lldb-api :: commands/expression/static-initializers/TestStaticInitializers.py (1111 of 2338)
PASS: lldb-unit :: Utility/./UtilityTests/StringListTest.GetMaxStringLengthEqualSize (1112 of 2338)
PASS: lldb-shell :: SymbolFile/DWARF/x86/dir-separator-no-comp-dir-relative-name.s (1113 of 2338)
PASS: lldb-unit :: Utility/./UtilityTests/Flags.AnyClear (1114 of 2338)
PASS: lldb-shell :: Commands/command-target-modules-dump-sections.yaml (1115 of 2338)
PASS: lldb-shell :: Minidump/Windows/broken-unwind.test (1116 of 2338)
PASS: lldb-unit :: Utility/./UtilityTests/UriParserTest.TypicalPortPathIPv4 (1117 of 2338)
PASS: lldb-unit :: Utility/./UtilityTests/StreamTest.PutCString (1118 of 2338)
PASS: lldb-api :: functionalities/data-formatter/poarray/TestPrintObjectArray.py (1119 of 2338)
PASS: lldb-api :: lang/objc/foundation/TestObjCMethods2.py (1120 of 2338)
UNSUPPORTED: lldb-api :: functionalities/darwin_log/filter/exact_match/activity-chain/TestDarwinLogFilterMatchActivityChain.py (1121 of 2338)
PASS: lldb-unit :: Expression/./ExpressionTests/DiagnosticManagerTest.AppendMessageNoDiag (1122 of 2338)
PASS: lldb-unit :: Utility/./UtilityTests/XcodeSDKTest.SDKSupportsModules (1123 of 2338)
PASS: lldb-unit :: Target/./TargetTests/ExecutionContextTest.GetByteOrderProcess (1124 of 2338)
PASS: lldb-unit :: Symbol/./SymbolTests/TestClangASTImporter.ImportInvalidType (1125 of 2338)
PASS: lldb-unit :: Expression/./ExpressionTests/CppModuleConfigurationTest.LibCppV2 (1126 of 2338)
PASS: lldb-unit :: Utility/./UtilityTests/StreamTest.PutRawBytesToLittleEndian (1127 of 2338)
PASS: lldb-api :: functionalities/thread/exit_during_expression/TestExitDuringExpression.py (1128 of 2338)
PASS: lldb-shell :: ScriptInterpreter/Python/command_import.test (1129 of 2338)
PASS: lldb-unit :: Expression/./ExpressionTests/DiagnosticManagerTest.GetStringSeverityLabels (1130 of 2338)
PASS: lldb-unit :: UnwindAssembly/x86/./UnwindAssemblyx86Tests/Testx86AssemblyInspectionEngine.Test32bitFramelessSmallStackFrame (1131 of 2338)
PASS: lldb-unit :: Utility/./UtilityTests/RangeTest.Copy (1132 of 2338)
PASS: lldb-api :: functionalities/data-formatter/data-formatter-stl/libcxx/list/loop/TestDataFormatterLibcxxListLoop.py (1133 of 2338)
PASS: lldb-unit :: ObjectFile/Breakpad/./ObjectFileBreakpadTests/FuncRecord.parse (1134 of 2338)
PASS: lldb-unit :: Utility/./UtilityTests/RangeTest.Union (1135 of 2338)
PASS: lldb-unit :: Utility/./UtilityTests/CompletionRequest.DuplicateFilteringWithComments (1136 of 2338)
PASS: lldb-unit :: ScriptInterpreter/Python/./ScriptInterpreterPythonTests/PythonDataObjectsTest.TestBorrowedReferences (1137 of 2338)
PASS: lldb-api :: commands/expression/context-object-objc/TestContextObjectObjc.py (1138 of 2338)
PASS: lldb-unit :: ScriptInterpreter/Python/./ScriptInterpreterPythonTests/PythonDataObjectsTest.TestPythonFile (1139 of 2338)
PASS: lldb-api :: functionalities/backticks/TestBackticksWithoutATarget.py (1140 of 2338)
PASS: lldb-api :: functionalities/jitloader_gdb/TestJITLoaderGDB.py (1141 of 2338)
PASS: lldb-unit :: Utility/./UtilityTests/StringExtractorTest.GetHexBytes_OddPair (1142 of 2338)
PASS: lldb-unit :: Utility/./UtilityTests/StreamTest.AddressEmptyPrefix (1143 of 2338)
PASS: lldb-unit :: UnwindAssembly/x86/./UnwindAssemblyx86Tests/Testx86AssemblyInspectionEngine.TestSimplei386ugmented (1144 of 2338)
PASS: lldb-api :: tools/lldb-server/TestGdbRemoteAttach.py (1145 of 2338)
PASS: lldb-shell :: SymbolFile/DWARF/x86/find-basic-namespace.cpp (1146 of 2338)
PASS: lldb-unit :: UnwindAssembly/x86/./UnwindAssemblyx86Tests/Testx86AssemblyInspectionEngine.TestPushEDI (1147 of 2338)
PASS: lldb-unit :: Utility/./UtilityTests/ConstStringTest.CompareConstString (1148 of 2338)
PASS: lldb-unit :: Language/Highlighting/./HighlighterTests/HighlighterTest.ClangTrailingBackslashBeforeNewline (1149 of 2338)
PASS: lldb-unit :: Utility/./UtilityTests/GeneratorTest.GetOrCreate (1150 of 2338)
PASS: lldb-shell :: SymbolFile/DWARF/x86/DW_AT_const_value.s (1151 of 2338)
PASS: lldb-shell :: Reproducer/TestProcessList.test (1152 of 2338)
UNSUPPORTED: lldb-shell :: SymbolFile/PDB/pointers.test (1153 of 2338)
PASS: lldb-api :: functionalities/data-formatter/nsdictionarysynth/TestNSDictionarySynthetic.py (1154 of 2338)
PASS: lldb-unit :: Host/./HostTests/NativeProcessProtocolTest.SetBreakpointFailRead (1155 of 2338)
PASS: lldb-unit :: Process/minidump/./LLDBMinidumpTests/MinidumpParserTest.MinidumpDuplicateModuleMappedSecond (1156 of 2338)
PASS: lldb-unit :: Utility/./UtilityTests/StringExtractorTest.GetHexU8_Underflow (1157 of 2338)
PASS: lldb-unit :: Process/Utility/./ProcessUtilityTests/ProcSMapTests/LinuxProcSMapsTestFixture.ParseSMapRegions/0 (1158 of 2338)
PASS: lldb-api :: lang/cpp/extern_c/TestExternCSymbols.py (1159 of 2338)
PASS: lldb-shell :: ScriptInterpreter/Python/python.test (1160 of 2338)
PASS: lldb-unit :: Expression/./ExpressionTests/CppModuleConfigurationTest.AmbiguousCLib (1161 of 2338)
PASS: lldb-unit :: Utility/./UtilityTests/NameMatchesTest.StartsWith (1162 of 2338)
PASS: lldb-unit :: UnwindAssembly/x86/./UnwindAssemblyx86Tests/Testx86AssemblyInspectionEngine.TestPushESI (1163 of 2338)
PASS: lldb-unit :: Utility/./UtilityTests/StringListTest.ForRange (1164 of 2338)
PASS: lldb-shell :: ObjectFile/PECOFF/basic-info.yaml (1165 of 2338)
PASS: lldb-unit :: Utility/./UtilityTests/VMRange.Comparison (1166 of 2338)
PASS: lldb-shell :: Breakpoint/jit-loader_jitlink_elf.test (1167 of 2338)
UNSUPPORTED: lldb-api :: functionalities/darwin_log/source/debug/TestDarwinLogSourceDebug.py (1168 of 2338)
PASS: lldb-unit :: Utility/./UtilityTests/ArchSpecTest.TripleComponentsWereSpecified (1169 of 2338)
PASS: lldb-api :: functionalities/data-formatter/hexcaps/TestDataFormatterHexCaps.py (1170 of 2338)
PASS: lldb-unit :: Interpreter/./InterpreterTests/CompletionTest.FileCompletionAbsolute (1171 of 2338)
PASS: lldb-unit :: Target/./TargetTests/PathMappingListTest.RemapRoot (1172 of 2338)
UNSUPPORTED: lldb-api :: benchmarks/libcxxlist/TestBenchmarkLibcxxList.py (1173 of 2338)
PASS: lldb-shell :: Minidump/Windows/arm-fp-unwind.test (1174 of 2338)
PASS: lldb-unit :: Utility/./UtilityTests/RegularExpression.Match (1175 of 2338)
PASS: lldb-shell :: SymbolFile/NativePDB/ast-types.cpp (1176 of 2338)
PASS: lldb-shell :: ObjectFile/ELF/PT_LOAD-overlap-PT_INTERP.yaml (1177 of 2338)
PASS: lldb-unit :: Utility/./UtilityTests/BinaryStreamTest.PutULEB128EightBytes (1178 of 2338)
PASS: lldb-unit :: DataFormatter/./LLDBFormatterTests/TypeMatcherTests.RegexMatchPart (1179 of 2338)
PASS: lldb-api :: tools/lldb-server/TestGdbRemoteExitCode.py (1180 of 2338)
PASS: lldb-api :: functionalities/data-formatter/data-formatter-objc/TestDataFormatterObjCNSError.py (1181 of 2338)
PASS: lldb-api :: functionalities/thread/concurrent_events/TestConcurrentDelayedCrashWithBreakpointSignal.py (1182 of 2338)
PASS: lldb-api :: functionalities/tail_call_frames/disambiguate_call_site/TestDisambiguateCallSite.py (1183 of 2338)
PASS: lldb-unit :: Utility/./UtilityTests/DataExtractorTest.GetCStr (1184 of 2338)
PASS: lldb-unit :: Host/./HostTests/FileSystemTest.EnumerateDirectory (1185 of 2338)
PASS: lldb-api :: functionalities/inferior-crashing/TestInferiorCrashingStep.py (1186 of 2338)
PASS: lldb-shell :: Minidump/breakpad-symbols.test (1187 of 2338)
PASS: lldb-shell :: ObjectFile/ELF/PT_LOAD-overlap-section.yaml (1188 of 2338)
PASS: lldb-unit :: Utility/./UtilityTests/RangeTest.ContainsAddrInvalid (1189 of 2338)
PASS: lldb-shell :: ObjectFile/ELF/section-overlap.yaml (1190 of 2338)
PASS: lldb-unit :: ObjectFile/PECOFF/./ObjectFilePECOFFTests/PECallFrameInfoTest.Frame_reg_eh (1191 of 2338)
PASS: lldb-unit :: Utility/./UtilityTests/StreamTest.PutHex16ByteOrderBig (1192 of 2338)
PASS: lldb-api :: lang/c/local_variables/TestLocalVariables.py (1193 of 2338)
PASS: lldb-shell :: Commands/command-source.test (1194 of 2338)
PASS: lldb-unit :: Utility/./UtilityTests/VMRange.Ordering (1195 of 2338)
PASS: lldb-unit :: Utility/./UtilityTests/BinaryStreamTest.PutSLEB128SevenBytes (1196 of 2338)
PASS: lldb-unit :: Utility/./UtilityTests/StringExtractorTest.GetNameColonValueContainsColon (1197 of 2338)
PASS: lldb-api :: lang/c/conflicting-symbol/TestConflictingSymbol.py (1198 of 2338)
PASS: lldb-unit :: Expression/./ExpressionTests/CppModuleConfigurationTest.MissingUsrInclude (1199 of 2338)
PASS: lldb-unit :: Expression/./ExpressionTests/DiagnosticManagerTest.HasFixits (1200 of 2338)
PASS: lldb-unit :: Platform/./LLDBPlatformTests/PlatformDarwinTest.TestParseVersionBuildDir (1201 of 2338)
PASS: lldb-unit :: Language/Highlighting/./HighlighterTests/HighlighterTest.FallbackHighlighter (1202 of 2338)
PASS: lldb-api :: lang/cpp/typedef/TestCppTypedef.py (1203 of 2338)
UNSUPPORTED: lldb-shell :: SymbolFile/PDB/calling-conventions.test (1204 of 2338)
PASS: lldb-unit :: Host/./HostTests/NativeProcessProtocolTest.ReadCStringFromMemory_MaxSize (1205 of 2338)
PASS: lldb-unit :: Utility/./UtilityTests/StreamTest.AddressSize (1206 of 2338)
PASS: lldb-api :: functionalities/thread/concurrent_events/TestConcurrentTwoBreakpointThreads.py (1207 of 2338)
UNSUPPORTED: lldb-shell :: Register/x86-zmm-write.test (1208 of 2338)
PASS: lldb-unit :: Symbol/./SymbolTests/DWARFCallFrameInfoTest.Basic_dwarf4 (1209 of 2338)
PASS: lldb-api :: functionalities/postmortem/mach-core/TestMachCore.py (1210 of 2338)
PASS: lldb-api :: tools/lldb-server/TestGdbRemote_vCont.py (1211 of 2338)
PASS: lldb-unit :: Utility/./UtilityTests/UriParserTest.BadPort2 (1212 of 2338)
PASS: lldb-unit :: UnwindAssembly/x86/./UnwindAssemblyx86Tests/Testx86AssemblyInspectionEngine.TestStackRealign8BitDisp_i386 (1213 of 2338)
PASS: lldb-unit :: Core/./LLDBCoreTests/FormatEntityTest.DefinitionConstructionNameAndString (1214 of 2338)
PASS: lldb-shell :: SymbolFile/DWARF/x86/DW_TAG_variable-invalid_location.s (1215 of 2338)
PASS: lldb-api :: commands/expression/import-std-module/sysroot/TestStdModuleSysroot.py (1216 of 2338)
PASS: lldb-shell :: Heap/heap-cstr.test (1217 of 2338)
PASS: lldb-unit :: Interpreter/./InterpreterTests/CompletionTest.DirCompletionAbsolute (1218 of 2338)
PASS: lldb-api :: lang/objc/objc-new-syntax/TestObjCNewSyntaxLiteral.py (1219 of 2338)
PASS: lldb-unit :: Process/Utility/./ProcessUtilityTests/ProcMapTests/LinuxProcMapsTestFixture.ParseMapRegions/1 (1220 of 2338)
PASS: lldb-unit :: Interpreter/./InterpreterTests/TestProperties.DeepCopy (1221 of 2338)
PASS: lldb-shell :: SymbolFile/DWARF/x86/debug_line-relative_path.s (1222 of 2338)
PASS: lldb-api :: lang/cpp/nested-class-other-compilation-unit/TestNestedClassWithParentInAnotherCU.py (1223 of 2338)
PASS: lldb-api :: functionalities/tail_call_frames/unambiguous_sequence/TestUnambiguousTailCalls.py (1224 of 2338)
PASS: lldb-unit :: ScriptInterpreter/Python/./ScriptInterpreterPythonTests/PythonDataObjectsTest.TestExtractingUInt64ThroughStructuredData (1225 of 2338)
PASS: lldb-shell :: SymbolFile/DWARF/x86/find-variable-file.cpp (1226 of 2338)
PASS: lldb-api :: functionalities/breakpoint/breakpoint_ids/TestBreakpointIDs.py (1227 of 2338)
PASS: lldb-api :: functionalities/completion/TestCompletion.py (1228 of 2338)
PASS: lldb-unit :: Utility/./UtilityTests/ArchSpecTest.MergeFrom (1229 of 2338)
PASS: lldb-api :: functionalities/gdb_remote_client/TestNoGPacketSupported.py (1230 of 2338)
PASS: lldb-api :: functionalities/data-formatter/data-formatter-stl/libcxx/iterator/TestDataFormatterLibccIterator.py (1231 of 2338)
PASS: lldb-api :: functionalities/load_lazy/TestLoadUsingLazyBind.py (1232 of 2338)
PASS: lldb-unit :: UnwindAssembly/x86/./UnwindAssemblyx86Tests/Testx86AssemblyInspectionEngine.TestPopRBPWithREX (1233 of 2338)
PASS: lldb-shell :: ObjectFile/ELF/netbsd-core-amd64.test (1234 of 2338)
PASS: lldb-api :: linux/builtin_trap/TestBuiltinTrap.py (1235 of 2338)
PASS: lldb-api :: functionalities/dead-strip/TestDeadStrip.py (1236 of 2338)
PASS: lldb-shell :: Commands/command-disassemble-process.yaml (1237 of 2338)
PASS: lldb-api :: functionalities/tsan/cpp_global_location/TestTsanCPPGlobalLocation.py (1238 of 2338)
PASS: lldb-shell :: Driver/TestRepl.test (1239 of 2338)
PASS: lldb-api :: functionalities/data-formatter/summary-string-onfail/Test-rdar-9974002.py (1240 of 2338)
PASS: lldb-unit :: Host/./HostTests/SocketTests/SocketTest.UDPConnect/ipv4 (1241 of 2338)
PASS: lldb-api :: arm/emulation/TestEmulations.py (1242 of 2338)
PASS: lldb-api :: functionalities/data-formatter/data-formatter-objc/TestDataFormatterObjCExpr.py (1243 of 2338)
PASS: lldb-api :: lang/objc/objc-foundation-dictionary-empty/TestNSDictionary0.py (1244 of 2338)
PASS: lldb-unit :: Symbol/./SymbolTests/PostfixExpression.ParseFPOProgram (1245 of 2338)
PASS: lldb-unit :: SymbolFile/DWARF/./SymbolFileDWARFTests/SymbolFileDWARFTests.TestAbbrevOutOfOrder (1246 of 2338)
PASS: lldb-api :: lang/objc/unicode-string/TestUnicodeString.py (1247 of 2338)
PASS: lldb-unit :: Utility/./UtilityTests/AnsiTerminal.KnownPrefix (1248 of 2338)
PASS: lldb-api :: tools/lldb-vscode/breakpoint/TestVSCode_setFunctionBreakpoints.py (1249 of 2338)
PASS: lldb-api :: macosx/find-dsym/bundle-with-dot-in-filename/TestBundleWithDotInFilename.py (1250 of 2338)
PASS: lldb-unit :: Core/./LLDBCoreTests/UniqueCStringMap.NoDefaultConstructor (1251 of 2338)
UNSUPPORTED: lldb-shell :: Unwind/unwind-plan-dwarf-dump.test (1252 of 2338)
PASS: lldb-api :: commands/statistics/basic/TestStats.py (1253 of 2338)
PASS: lldb-unit :: Utility/./UtilityTests/RangeTest.DoesAdjoinOrIntersect (1254 of 2338)
PASS: lldb-unit :: Process/Utility/./ProcessUtilityTests/ProcSMapTests/LinuxProcSMapsTestFixture.ParseSMapRegions/1 (1255 of 2338)
PASS: lldb-api :: functionalities/gdb_remote_client/TestRecognizeBreakpoint.py (1256 of 2338)
PASS: lldb-unit :: DataFormatter/./LLDBFormatterTests/TypeMatcherTests.ExactName (1257 of 2338)
PASS: lldb-api :: lang/objc/objc-struct-argument/TestObjCStructArgument.py (1258 of 2338)
PASS: lldb-shell :: Minidump/dump-all.test (1259 of 2338)
PASS: lldb-shell :: Register/x86-64-ymm-read.test (1260 of 2338)
PASS: lldb-api :: tools/lldb-server/thread-name/TestGdbRemoteThreadName.py (1261 of 2338)
PASS: lldb-api :: commands/expression/import-std-module/iterator/TestIteratorFromStdModule.py (1262 of 2338)
PASS: lldb-unit :: Utility/./UtilityTests/UriParserTest.BracketedHostnameWithPortIPv4 (1263 of 2338)
PASS: lldb-shell :: SymbolFile/DWARF/x86/subprogram_ranges.test (1264 of 2338)
PASS: lldb-api :: functionalities/data-formatter/data-formatter-python-synth/TestDataFormatterPythonSynth.py (1265 of 2338)
PASS: lldb-api :: functionalities/data-formatter/data-formatter-ptr-to-array/TestPtrToArrayFormatting.py (1266 of 2338)
PASS: lldb-api :: commands/watchpoints/watchpoint_on_vectors/TestValueOfVectorVariable.py (1267 of 2338)
PASS: lldb-unit :: Utility/./UtilityTests/DataExtractorTest.PeekData (1268 of 2338)
PASS: lldb-api :: functionalities/data-formatter/parray/TestPrintArray.py (1269 of 2338)
PASS: lldb-unit :: Core/./LLDBCoreTests/SourceFileCache.FindSourceFileFound (1270 of 2338)
PASS: lldb-api :: lang/cpp/template-specialization-type/TestTemplateSpecializationType.py (1271 of 2338)
PASS: lldb-unit :: SymbolFile/DWARF/./SymbolFileDWARFTests/SymbolFileDWARFTests.TestAbbrevOrder1Start5 (1272 of 2338)
PASS: lldb-unit :: debugserver/./debugserverTests/JSON.Parse (1273 of 2338)
PASS: lldb-api :: functionalities/breakpoint/comp_dir_symlink/TestCompDirSymLink.py (1274 of 2338)
PASS: lldb-api :: lang/objc/foundation/TestFoundationDisassembly.py (1275 of 2338)
PASS: lldb-api :: lang/cpp/function_refs/TestFunctionRefs.py (1276 of 2338)
PASS: lldb-unit :: Utility/./UtilityTests/OptionsWithRawTest.UnterminatedQuote (1277 of 2338)
PASS: lldb-unit :: Utility/./UtilityTests/ArchSpecTest.TestSetTriple (1278 of 2338)
PASS: lldb-api :: functionalities/thread/concurrent_events/TestConcurrentCrashWithWatchpoint.py (1279 of 2338)
UNSUPPORTED: lldb-api :: tools/intel-features/intel-pt/test/TestIntelPTSimpleBinary.py (1280 of 2338)
PASS: lldb-unit :: Language/Highlighting/./HighlighterTests/HighlighterTest.ClangStringLiterals (1281 of 2338)
PASS: lldb-unit :: Thread/./ThreadTests/ThreadTest.SetStopInfo (1282 of 2338)
PASS: lldb-unit :: Utility/./UtilityTests/StringLexerTest.Next (1283 of 2338)
PASS: lldb-unit :: ObjectFile/Breakpad/./ObjectFileBreakpadTests/FileRecord.parse (1284 of 2338)
UNSUPPORTED: lldb-shell :: Subprocess/clone-follow-parent-wp.test (1285 of 2338)
PASS: lldb-shell :: Reproducer/TestFileRepro.test (1286 of 2338)
PASS: lldb-unit :: Utility/./UtilityTests/Predicate.WaitForValueNotEqualTo (1287 of 2338)
PASS: lldb-unit :: Symbol/./SymbolTests/TestTypeSystemClang.TestConvertAccessTypeToAccessSpecifier (1288 of 2338)
PASS: lldb-unit :: Utility/./UtilityTests/DeserializerTest.HasData (1289 of 2338)
PASS: lldb-api :: commands/expression/completion/TestExprCompletion.py (1290 of 2338)
PASS: lldb-unit :: SymbolFile/DWARF/./SymbolFileDWARFTests/SymbolFileDWARFTests.ParseArangesIgnoreEmpty (1291 of 2338)
PASS: lldb-shell :: Commands/command-breakpoint-col.test (1292 of 2338)
PASS: lldb-unit :: ObjectFile/ELF/./ObjectFileELFTests/ObjectFileELFTest.GetSymtab_NoSymEntryPointArmAddressClass (1293 of 2338)
PASS: lldb-api :: commands/expression/calculator_mode/TestCalculatorMode.py (1294 of 2338)
PASS: lldb-api :: commands/command/source/TestCommandSource.py (1295 of 2338)
PASS: lldb-shell :: SymbolFile/DWARF/x86/debug_line-tombstone.s (1296 of 2338)
PASS: lldb-unit :: Symbol/./SymbolTests/TestClangASTImporter.DeportDeclTagDecl (1297 of 2338)
PASS: lldb-unit :: Utility/./UtilityTests/Flags.Clear (1298 of 2338)
PASS: lldb-unit :: Host/./HostTests/SocketTests/SocketTest.UDPConnect/ipv6 (1299 of 2338)
PASS: lldb-unit :: Process/gdb-remote/./ProcessGdbRemoteTests/GDBRemoteClientBaseTest.SendContinueAndInterrupt (1300 of 2338)
PASS: lldb-api :: python_api/sbdata/TestSBData.py (1301 of 2338)
PASS: lldb-unit :: Utility/./UtilityTests/RegisterValueTest.GetScalarValue (1302 of 2338)
UNSUPPORTED: lldb-api :: functionalities/darwin_log/source/info/TestDarwinLogSourceInfo.py (1303 of 2338)
PASS: lldb-unit :: UnwindAssembly/x86/./UnwindAssemblyx86Tests/Testx86AssemblyInspectionEngine.TestSimplex86_64Augmented (1304 of 2338)
PASS: lldb-shell :: ObjectFile/MachO/subsections.yaml (1305 of 2338)
PASS: lldb-shell :: ObjectFile/wasm/unified-debug-sections.yaml (1306 of 2338)
PASS: lldb-api :: lang/cpp/stopped_in_static_member_function/TestStoppedInStaticMemberFunction.py (1307 of 2338)
PASS: lldb-unit :: UnwindAssembly/x86/./UnwindAssemblyx86Tests/Testx86AssemblyInspectionEngine.TestPushEBP (1308 of 2338)
PASS: lldb-api :: functionalities/data-formatter/data-formatter-cpp/TestDataFormatterCpp.py (1309 of 2338)
PASS: lldb-api :: functionalities/data-formatter/data-formatter-objc/nsindexpath/TestDataFormatterNSIndexPath.py (1310 of 2338)
PASS: lldb-shell :: Commands/command-thread-select.test (1311 of 2338)
PASS: lldb-api :: functionalities/signal/handle-abrt/TestHandleAbort.py (1312 of 2338)
PASS: lldb-unit :: Utility/./UtilityTests/OptionsWithRawTest.LeadingSpaceArgs (1313 of 2338)
PASS: lldb-shell :: SymbolFile/DWARF/x86/split-dwarf-inlining.cpp (1314 of 2338)
PASS: lldb-api :: lang/objc/modules-objc-property/TestModulesObjCProperty.py (1315 of 2338)
PASS: lldb-api :: commands/reproducer/invalid-args/TestInvalidArgsReproducer.py (1316 of 2338)
PASS: lldb-shell :: Register/Core/x86-32-freebsd-gp.test (1317 of 2338)
PASS: lldb-api :: source-manager/TestSourceManager.py (1318 of 2338)
PASS: lldb-shell :: SymbolFile/NativePDB/bitfields.cpp (1319 of 2338)
PASS: lldb-unit :: SymbolFile/NativePDB/./SymbolFileNativePDBTests/PDBFPOProgramToDWARFExpressionTests.InvalidOpBinary (1320 of 2338)
PASS: lldb-unit :: Utility/./UtilityTests/StringExtractorTest.GetU64LittleEndian (1321 of 2338)
PASS: lldb-unit :: Expression/./ExpressionTests/DiagnosticManagerTest.AddDiagnostic (1322 of 2338)
PASS: lldb-unit :: Utility/./UtilityTests/StringListTest.InsertStringAtIndexEnd (1323 of 2338)
PASS: lldb-api :: lang/cpp/const_this/TestConstThis.py (1324 of 2338)
PASS: lldb-shell :: SymbolFile/DWARF/x86/find-inline-method.s (1325 of 2338)
PASS: lldb-api :: commands/target/basic/TestTargetCommand.py (1326 of 2338)
PASS: lldb-api :: macosx/universal/TestUniversal.py (1327 of 2338)
PASS: lldb-shell :: ObjectFile/wasm/basic.yaml (1328 of 2338)
PASS: lldb-shell :: SymbolFile/DWARF/x86/debug_loc.s (1329 of 2338)
PASS: lldb-unit :: Symbol/./SymbolTests/TestTypeSystemClang.GetExeModuleWhenMissingSymbolFile (1330 of 2338)
PASS: lldb-api :: functionalities/non-overlapping-index-variable-i/TestIndexVariable.py (1331 of 2338)
UNSUPPORTED: lldb-shell :: ScriptInterpreter/Lua/independent_state.test (1332 of 2338)
PASS: lldb-shell :: Commands/command-regex-delete.test (1333 of 2338)
UNSUPPORTED: lldb-api :: benchmarks/frame_variable/TestFrameVariableResponse.py (1334 of 2338)
XFAIL: lldb-shell :: Register/x86-64-write.test (1335 of 2338)
PASS: lldb-unit :: Language/Highlighting/./HighlighterTests/HighlighterTest.ClangCursorOutOfBounds (1336 of 2338)
PASS: lldb-api :: commands/expression/expr-in-syscall/TestExpressionInSyscall.py (1337 of 2338)
PASS: lldb-api :: lang/c/record_decl_in_expr/TestRecordDeclInExpr.py (1338 of 2338)
PASS: lldb-api :: python_api/process/TestProcessAPI.py (1339 of 2338)
PASS: lldb-unit :: Utility/./UtilityTests/CompletionRequest.TestCompletionOwnership (1340 of 2338)
PASS: lldb-shell :: SymbolFile/DWARF/x86/dwp.s (1341 of 2338)
PASS: lldb-unit :: Utility/./UtilityTests/StringExtractorTest.GetHexBytesAvail_OddPair (1342 of 2338)
PASS: lldb-unit :: UnwindAssembly/x86/./UnwindAssemblyx86Tests/Testx86AssemblyInspectionEngine.TestPushR15 (1343 of 2338)
PASS: lldb-shell :: SymbolFile/DWARF/x86/debug-types-dwarf5.s (1344 of 2338)
PASS: lldb-shell :: ObjectFile/Breakpad/sections.test (1345 of 2338)
PASS: lldb-shell :: Breakpoint/dummy-target.test (1346 of 2338)
PASS: lldb-shell :: Reproducer/Functionalities/TestImageList.test (1347 of 2338)
PASS: lldb-unit :: Process/gdb-remote/./ProcessGdbRemoteTests/GDBRemoteClientBaseTest.SendContinueAndWait (1348 of 2338)
PASS: lldb-unit :: Process/minidump/./LLDBMinidumpTests/MinidumpParserTest.GetArchitectureWindows (1349 of 2338)
PASS: lldb-unit :: Utility/./UtilityTests/StringListTest.AppendStringCString (1350 of 2338)
PASS: lldb-shell :: Quit/TestQuitExitCodeImplicit0.test (1351 of 2338)
PASS: lldb-api :: functionalities/breakpoint/hardware_breakpoints/require_hw_breakpoints/TestRequireHWBreakpoints.py (1352 of 2338)
PASS: lldb-api :: functionalities/unwind/zeroth_frame/TestZerothFrame.py (1353 of 2338)
PASS: lldb-api :: functionalities/gdb_remote_client/TestWasm.py (1354 of 2338)
PASS: lldb-shell :: Unwind/eh-frame-dwarf-unwind.test (1355 of 2338)
PASS: lldb-shell :: Expr/TestMultilineExpr.test (1356 of 2338)
PASS: lldb-unit :: Process/Utility/./ProcessUtilityTests/RegisterContext_x86Test.FullToAbridgedTagWord (1357 of 2338)
PASS: lldb-unit :: Host/./HostTests/PipeTest.OpenAsReader (1358 of 2338)
PASS: lldb-unit :: Core/./LLDBCoreTests/DumpDataExtractorTest.NullStream (1359 of 2338)
PASS: lldb-api :: functionalities/data-formatter/data-formatter-stl/libcxx/set/TestDataFormatterLibcxxSet.py (1360 of 2338)
PASS: lldb-unit :: ObjectFile/MachO/./ObjectFileMachOTests/ObjectFileMachOTest.ModuleFromSharedCacheInfo (1361 of 2338)
PASS: lldb-shell :: SymbolFile/symbol-binding.test (1362 of 2338)
PASS: lldb-unit :: SymbolFile/DWARF/./SymbolFileDWARFTests/SymbolFileDWARFTests.TestAbilitiesForDWARF (1363 of 2338)
PASS: lldb-unit :: Utility/./UtilityTests/ArgsTest.AppendArguments (1364 of 2338)
PASS: lldb-api :: python_api/sbstructureddata/TestStructuredDataAPI.py (1365 of 2338)
PASS: lldb-unit :: Core/./LLDBCoreTests/FormatEntityTest.DefinitionConstructionNameTypeChildren (1366 of 2338)
PASS: lldb-unit :: Utility/./UtilityTests/StringListTest.DefaultConstructor (1367 of 2338)
PASS: lldb-unit :: Utility/./UtilityTests/StringExtractorTest.GetHexU8_Exact (1368 of 2338)
UNSUPPORTED: lldb-api :: commands/expression/completion-crash-invalid-iterator/TestInvalidIteratorCompletionCrash.py (1369 of 2338)
PASS: lldb-shell :: SymbolFile/Breakpad/line-table-missing-file.test (1370 of 2338)
UNSUPPORTED: lldb-shell :: SymbolFile/PDB/enums-layout.test (1371 of 2338)
PASS: lldb-unit :: Utility/./UtilityTests/DataExtractorTest.GetFloat (1372 of 2338)
PASS: lldb-unit :: Language/Highlighting/./HighlighterTests/HighlighterTest.Colons (1373 of 2338)
PASS: lldb-shell :: Settings/TestModuleCacheSanity.test (1374 of 2338)
PASS: lldb-api :: terminal/TestEditline.py (1375 of 2338)
PASS: lldb-shell :: Minidump/disassemble-no-module.yaml (1376 of 2338)
PASS: lldb-unit :: UnwindAssembly/x86/./UnwindAssemblyx86Tests/Testx86AssemblyInspectionEngine.Test32bitFramelessBigStackFrame (1377 of 2338)
UNSUPPORTED: lldb-shell :: SymbolFile/DWARF/x86/dwarf5-line-strp.s (1378 of 2338)
PASS: lldb-api :: functionalities/thread/step_out/TestThreadStepOut.py (1379 of 2338)
PASS: lldb-unit :: Host/./HostTests/SocketTests/SocketTest.DecodeHostAndPort/ipv6 (1380 of 2338)
PASS: lldb-shell :: SymbolFile/DWARF/x86/find-method-local-struct.cpp (1381 of 2338)
PASS: lldb-shell :: SymbolFile/DWARF/x86/debug_loc-aslr.s (1382 of 2338)
PASS: lldb-unit :: SymbolFile/DWARF/./SymbolFileDWARFTests/SymbolFileDWARFTests.TestAbbrevNullAttrValidForm (1383 of 2338)
PASS: lldb-api :: functionalities/gdb_remote_client/TestGDBRemoteClient.py (1384 of 2338)
PASS: lldb-unit :: Utility/./UtilityTests/RangeTest.ContainsAddr (1385 of 2338)
UNSUPPORTED: lldb-shell :: Register/x86-64-xmm16-write.test (1386 of 2338)
PASS: lldb-unit :: tools/lldb-server/tests/./LLDBServerTests/TestBase.LaunchModePreservesEnvironment (1387 of 2338)
PASS: lldb-shell :: Breakpoint/split-dwarf-5-addrbase.test (1388 of 2338)
PASS: lldb-api :: functionalities/rerun/TestRerun.py (1389 of 2338)
PASS: lldb-api :: functionalities/gdb_remote_client/TestJLink6Armv7RegisterDefinition.py (1390 of 2338)
PASS: lldb-shell :: Reproducer/TestVerify.test (1391 of 2338)
PASS: lldb-unit :: Utility/./UtilityTests/GeneratorTest.Get (1392 of 2338)
UNSUPPORTED: lldb-api :: functionalities/data-formatter/data-formatter-stl/libstdcpp/smart_ptr/TestDataFormatterStdSmartPtr.py (1393 of 2338)
PASS: lldb-unit :: Process/minidump/./LLDBMinidumpTests/RegisterContextMinidump.CheckRegisterContextMinidump_ARM (1394 of 2338)
PASS: lldb-unit :: Process/gdb-remote/./ProcessGdbRemoteTests/GDBRemoteCommunicationTest.ReadPacket_checksum (1395 of 2338)
PASS: lldb-api :: lang/objc/objc_direct-methods/TestObjCDirectMethods.py (1396 of 2338)
PASS: lldb-api :: functionalities/tail_call_frames/cross_object/TestCrossObjectTailCalls.py (1397 of 2338)
PASS: lldb-shell :: ObjectFile/ELF/PT_LOAD-empty.yaml (1398 of 2338)
PASS: lldb-unit :: Utility/./UtilityTests/GeneratorTest.Create (1399 of 2338)
PASS: lldb-api :: functionalities/breakpoint/global_constructor/TestBreakpointInGlobalConstructor.py (1400 of 2338)
PASS: lldb-shell :: SymbolFile/Breakpad/line-table-discontinuous-file-ids.test (1401 of 2338)
PASS: lldb-unit :: Process/Utility/./ProcessUtilityTests/ProcSMapTests/LinuxProcSMapsTestFixture.ParseSMapRegions/5 (1402 of 2338)
PASS: lldb-shell :: ObjectFile/ELF/aarch64-relocations.yaml (1403 of 2338)
PASS: lldb-api :: lang/c/function_types/TestFunctionTypes.py (1404 of 2338)
PASS: lldb-api :: lang/objc/foundation/TestObjectDescriptionAPI.py (1405 of 2338)
PASS: lldb-api :: functionalities/thread/concurrent_events/TestConcurrentWatchpointWithDelayWatchpointThreads.py (1406 of 2338)
PASS: lldb-api :: commands/expression/import_builtin_fileid/TestImportBuiltinFileID.py (1407 of 2338)
PASS: lldb-api :: functionalities/gdb_remote_client/TestMultiprocess.py (1408 of 2338)
UNSUPPORTED: lldb-shell :: ScriptInterpreter/Lua/breakpoint_oneline_callback.test (1409 of 2338)
PASS: lldb-unit :: Utility/./UtilityTests/VMRange.ContainsRange (1410 of 2338)
PASS: lldb-unit :: Expression/./ExpressionTests/CppModuleConfigurationTest.IgnoreLibStdCpp (1411 of 2338)
PASS: lldb-unit :: Utility/./UtilityTests/EnvironmentTest.EnvpConversion (1412 of 2338)
PASS: lldb-unit :: Process/gdb-remote/./ProcessGdbRemoteTests/GDBRemoteCommunicationClientTest.TestPacketSpeedJSON (1413 of 2338)
PASS: lldb-api :: functionalities/breakpoint/breakpoint_command/TestBreakpointCommand.py (1414 of 2338)
UNSUPPORTED: lldb-api :: benchmarks/continue/TestBenchmarkContinue.py (1415 of 2338)
PASS: lldb-unit :: ScriptInterpreter/Python/./ScriptInterpreterPythonTests/PythonDataObjectsTest.TestPythonByteArray (1416 of 2338)
PASS: lldb-api :: functionalities/type_get_module/TestTypeGetModule.py (1417 of 2338)
PASS: lldb-shell :: SymbolFile/DWARF/x86/DW_TAG_variable-DW_AT_const_value.s (1418 of 2338)
PASS: lldb-unit :: DataFormatter/./LLDBFormatterTests/StringPrinterTests.SwiftUTF8 (1419 of 2338)
PASS: lldb-unit :: Utility/./UtilityTests/ArchSpecTest.MergeFromMachOUnknown (1420 of 2338)
PASS: lldb-unit :: Utility/./UtilityTests/BinaryStreamTest.PutULEB128Zero (1421 of 2338)
PASS: lldb-api :: commands/platform/sdk/TestPlatformSDK.py (1422 of 2338)
PASS: lldb-api :: lang/cpp/class_static/TestStaticVariables.py (1423 of 2338)
PASS: lldb-api :: commands/breakpoint/command/list/TestBreakpointCommandList.py (1424 of 2338)
PASS: lldb-api :: lang/objc/modules-compile-error/TestModulesCompileError.py (1425 of 2338)
PASS: lldb-unit :: Utility/./UtilityTests/CompletionRequest.TryCompleteCurrentArgBad (1426 of 2338)
PASS: lldb-api :: commands/expression/save_jit_objects/TestSaveJITObjects.py (1427 of 2338)
PASS: lldb-api :: commands/settings/TestSettings.py (1428 of 2338)
UNSUPPORTED: lldb-shell :: Unwind/split-machine-functions.test (1429 of 2338)
PASS: lldb-unit :: Target/./TargetTests/ExecutionContextTest.GetByteOrderTarget (1430 of 2338)
PASS: lldb-api :: lang/objc/orderedset/TestOrderedSet.py (1431 of 2338)
PASS: lldb-api :: macosx/version_zero/TestGetVersionZeroVersion.py (1432 of 2338)
PASS: lldb-api :: commands/expression/import-std-module/stack/TestStackFromStdModule.py (1433 of 2338)
PASS: lldb-api :: commands/expression/timeout/TestCallWithTimeout.py (1434 of 2338)
PASS: lldb-api :: functionalities/postmortem/wow64_minidump/TestWow64MiniDump.py (1435 of 2338)
PASS: lldb-unit :: UnwindAssembly/x86/./UnwindAssemblyx86Tests/Testx86AssemblyInspectionEngine.TestPopR15 (1436 of 2338)
PASS: lldb-unit :: Expression/./ExpressionTests/DiagnosticManagerTest.PutStringSeverities (1437 of 2338)
PASS: lldb-shell :: SymbolFile/NativePDB/disassembly.cpp (1438 of 2338)
PASS: lldb-api :: commands/expression/top-level/TestTopLevelExprs.py (1439 of 2338)
UNSUPPORTED: lldb-api :: functionalities/darwin_log/filter/regex/message/TestDarwinLogFilterRegexMessage.py (1440 of 2338)
PASS: lldb-unit :: ScriptInterpreter/Python/./ScriptInterpreterPythonTests/PythonDataObjectsTest.TestPythonCallableCheck (1441 of 2338)
PASS: lldb-unit :: Utility/./UtilityTests/BinaryStreamTest.PutULEB128One (1442 of 2338)
PASS: lldb-api :: functionalities/postmortem/elf-core/gcore/TestGCore.py (1443 of 2338)
PASS: lldb-shell :: ObjectFile/ELF/null-jmprel.yaml (1444 of 2338)
UNSUPPORTED: lldb-api :: lang/objc/rdar-12408181/TestRdar12408181.py (1445 of 2338)
PASS: lldb-api :: commands/target/stop-hooks/TestStopHooks.py (1446 of 2338)
PASS: lldb-unit :: Symbol/./SymbolTests/TestTypeSystemClang.TestDeletingImplicitCopyCstrDueToMoveCStr (1447 of 2338)
PASS: lldb-unit :: Process/gdb-remote/./ProcessGdbRemoteTests/GDBRemoteCommunicationClientTest.GetMemoryRegionInfo (1448 of 2338)
PASS: lldb-api :: commands/expression/call-function/TestCallBuiltinFunction.py (1449 of 2338)
PASS: lldb-api :: tools/lldb-vscode/breakpoint-events/TestVSCode_breakpointEvents.py (1450 of 2338)
PASS: lldb-unit :: Utility/./UtilityTests/UserIDResolver.GetUserName (1451 of 2338)
PASS: lldb-unit :: SymbolFile/DWARF/./SymbolFileDWARFTests/SymbolFileDWARFTests.TestAbbrevValidAttrNullForm (1452 of 2338)
PASS: lldb-api :: lang/cpp/trivial_abi/TestTrivialABI.py (1453 of 2338)
PASS: lldb-shell :: Register/Core/x86-32-linux-gp.test (1454 of 2338)
PASS: lldb-unit :: Utility/./UtilityTests/ConstStringTest.CompareStringRef (1455 of 2338)
PASS: lldb-unit :: Utility/./UtilityTests/StringLexerTest.AdvanceIf (1456 of 2338)
PASS: lldb-api :: tools/lldb-vscode/evaluate/TestVSCode_evaluate.py (1457 of 2338)
PASS: lldb-unit :: Utility/./UtilityTests/DataExtractorTest.GetCStrAtNullOffset (1458 of 2338)
PASS: lldb-shell :: SymbolFile/DWARF/x86/find-basic-variable.cpp (1459 of 2338)
PASS: lldb-unit :: Utility/./UtilityTests/DataExtractorTest.GetCStrEmpty (1460 of 2338)
PASS: lldb-unit :: Host/./HostTests/FileSystemTest.EmptyTest (1461 of 2338)
PASS: lldb-unit :: Utility/./UtilityTests/StreamTeeTest.CopyConstructor (1462 of 2338)
PASS: lldb-unit :: Utility/./UtilityTests/ArgsTest.ReplaceArgumentAtIndexFarOutOfRange (1463 of 2338)
PASS: lldb-api :: types/TestIntegerType.py (1464 of 2338)
PASS: lldb-unit :: Utility/./UtilityTests/LogChannelEnabledTest.LogThread (1465 of 2338)
PASS: lldb-unit :: DataFormatter/./LLDBFormatterTests/StringPrinterTests.CxxASCII (1466 of 2338)
PASS: lldb-api :: functionalities/data-formatter/data-formatter-stl/libcxx/multiset/TestDataFormatterLibcxxMultiSet.py (1467 of 2338)
PASS: lldb-unit :: Utility/./UtilityTests/TimerTest.CategoryTimes2 (1468 of 2338)
PASS: lldb-api :: functionalities/data-formatter/data-formatter-objc/TestDataFormatterObjCKVO.py (1469 of 2338)
PASS: lldb-api :: lang/cpp/dynamic-value/TestCppValueCast.py (1470 of 2338)
PASS: lldb-unit :: Utility/./UtilityTests/StreamTest.AddressRange (1471 of 2338)
PASS: lldb-api :: functionalities/thread/jump/TestThreadJump.py (1472 of 2338)
PASS: lldb-unit :: Utility/./UtilityTests/StreamTeeTest.AppendStream (1473 of 2338)
PASS: lldb-shell :: Settings/TestFrameFormatNoColor.test (1474 of 2338)
UNSUPPORTED: lldb-api :: functionalities/unwind/standard/TestStandardUnwind.py (1475 of 2338)
PASS: lldb-unit :: Utility/./UtilityTests/DataExtractorTest.GetDouble (1476 of 2338)
PASS: lldb-unit :: Utility/./UtilityTests/ArgsTest.TestQuotedUnknownEscape (1477 of 2338)
PASS: lldb-unit :: Utility/./UtilityTests/StringListTest.AppendStringMove (1478 of 2338)
PASS: lldb-api :: functionalities/thread/concurrent_events/TestConcurrentSignalNWatchNBreak.py (1479 of 2338)
PASS: lldb-api :: functionalities/reproducers/attach/TestReproducerAttach.py (1480 of 2338)
UNSUPPORTED: lldb-api :: lang/c/typedef/Testtypedef.py (1481 of 2338)
PASS: lldb-unit :: Host/./HostTests/SocketTests/SocketTest.TCPGetConnectURI/ipv6 (1482 of 2338)
PASS: lldb-unit :: ScriptInterpreter/Python/./ScriptInterpreterPythonTests/PythonDataObjectsTest.TestPythonTupleSize (1483 of 2338)
PASS: lldb-shell :: ObjectFile/PECOFF/invalid-export-table.yaml (1484 of 2338)
PASS: lldb-shell :: Breakpoint/case-sensitive.test (1485 of 2338)
PASS: lldb-unit :: Utility/./UtilityTests/PassiveReplayTest.InstrumentedBarPtr (1486 of 2338)
PASS: lldb-api :: functionalities/data-formatter/data-formatter-stl/libcxx/string/TestDataFormatterLibcxxString.py (1487 of 2338)
PASS: lldb-unit :: Symbol/./SymbolTests/TestTypeSystemClang.TestGetTypeClassDeclType (1488 of 2338)
PASS: lldb-shell :: SymbolFile/NativePDB/ast-methods.cpp (1489 of 2338)
PASS: lldb-unit :: Utility/./UtilityTests/XcodeSDKTest.GetCanonicalNameAndConstruct (1490 of 2338)
PASS: lldb-api :: tools/lldb-server/TestGdbRemoteProcessInfo.py (1491 of 2338)
PASS: lldb-api :: functionalities/data-formatter/data-formatter-objc/TestDataFormatterObjCNSURL.py (1492 of 2338)
PASS: lldb-api :: functionalities/data-formatter/data-formatter-skip-summary/TestDataFormatterSkipSummary.py (1493 of 2338)
PASS: lldb-api :: functionalities/thread/concurrent_events/TestConcurrentSignalDelayBreak.py (1494 of 2338)
PASS: lldb-api :: lang/cpp/rvalue-references/TestRvalueReferences.py (1495 of 2338)
PASS: lldb-api :: commands/register/register/register_command/TestRegisters.py (1496 of 2338)
PASS: lldb-unit :: Symbol/./SymbolTests/TestTypeSystemClang.TestGetEnumIntegerTypeUnexpectedType (1497 of 2338)
PASS: lldb-api :: lang/cpp/exceptions/TestCPPExceptionBreakpoints.py (1498 of 2338)
PASS: lldb-shell :: SymbolFile/NativePDB/locate-pdb.cpp (1499 of 2338)
UNSUPPORTED: lldb-api :: linux/thread/create_during_instruction_step/TestCreateDuringInstructionStep.py (1500 of 2338)
PASS: lldb-api :: lang/c/tls_globals/TestTlsGlobals.py (1501 of 2338)
PASS: lldb-api :: functionalities/data-formatter/pyobjsynthprovider/TestPyObjSynthProvider.py (1502 of 2338)
PASS: lldb-shell :: ObjectFile/ELF/section-types.yaml (1503 of 2338)
PASS: lldb-shell :: ObjectFile/PECOFF/export-dllfunc.yaml (1504 of 2338)
PASS: lldb-api :: tools/lldb-vscode/attach/TestVSCode_attach.py (1505 of 2338)
PASS: lldb-api :: commands/expression/codegen-crash-typedefdecl-not-in_declcontext/TestCodegenCrashTypedefDeclNotInDeclContext.py (1506 of 2338)
PASS: lldb-api :: functionalities/tsan/global_location/TestTsanGlobalLocation.py (1507 of 2338)
PASS: lldb-unit :: Symbol/./SymbolTests/TestClangASTImporter.CopyTypeTagDecl (1508 of 2338)
PASS: lldb-unit :: Utility/./UtilityTests/StringListTest.CopyListEmpty (1509 of 2338)
PASS: lldb-unit :: DataFormatter/./LLDBFormatterTests/StringPrinterTests.CxxUTF8 (1510 of 2338)
PASS: lldb-api :: lang/objc/global_ptrs/TestGlobalObjects.py (1511 of 2338)
PASS: lldb-shell :: SymbolFile/Breakpad/unwind-via-stack-win-no-memory-info.yaml (1512 of 2338)
PASS: lldb-shell :: SymbolFile/DWARF/x86/DW_AT_decl_file-DW_AT_specification-crosscu.s (1513 of 2338)
PASS: lldb-unit :: tools/lldb-server/tests/./LLDBServerTests/TestBase.DebugserverEnv (1514 of 2338)
PASS: lldb-api :: functionalities/source-map/TestTargetSourceMap.py (1515 of 2338)
PASS: lldb-api :: lang/cpp/subst_template_type_param/TestSubstTemplateTypeParam.py (1516 of 2338)
PASS: lldb-api :: lang/cpp/virtual-functions/TestCppVirtualFunctions.py (1517 of 2338)
PASS: lldb-shell :: Settings/TestStopCommandSourceOnError.test (1518 of 2338)
PASS: lldb-unit :: Utility/./UtilityTests/ArgsTest.TestSingleArgWithQuotedSpace (1519 of 2338)
PASS: lldb-unit :: ObjectFile/PECOFF/./ObjectFilePECOFFTests/PECallFrameInfoTest.Chained_eh (1520 of 2338)
PASS: lldb-unit :: Utility/./UtilityTests/StringExtractorTest.GetHexU8_Extra_NoEof (1521 of 2338)
PASS: lldb-api :: functionalities/thread_plan/TestThreadPlanCommands.py (1522 of 2338)
UNSUPPORTED: lldb-shell :: ObjectFile/ELF/minidebuginfo-set-and-hit-breakpoint.test (1523 of 2338)
PASS: lldb-shell :: ScriptInterpreter/Python/eof.test (1524 of 2338)
PASS: lldb-unit :: Utility/./UtilityTests/ScalarTest.Equality (1525 of 2338)
PASS: lldb-api :: functionalities/data-formatter/data-formatter-synthtype/TestDataFormatterSynthType.py (1526 of 2338)
PASS: lldb-api :: functionalities/data-formatter/data-formatter-stl/libcxx/optional/TestDataFormatterLibcxxOptional.py (1527 of 2338)
PASS: lldb-api :: python_api/sbtype_typeclass/TestSBTypeTypeClass.py (1528 of 2338)
PASS: lldb-api :: commands/expression/import-std-module/forward_list/TestForwardListFromStdModule.py (1529 of 2338)
PASS: lldb-api :: lang/objc/objc-optimized/TestObjcOptimized.py (1530 of 2338)
PASS: lldb-shell :: SymbolFile/NativePDB/globals-bss.cpp (1531 of 2338)
PASS: lldb-shell :: SymbolFile/NativePDB/global-classes.cpp (1532 of 2338)
PASS: lldb-shell :: Process/Optimization.test (1533 of 2338)
PASS: lldb-unit :: Process/minidump/./LLDBMinidumpTests/MinidumpParserTest.GetThreadContext_x86_32 (1534 of 2338)
PASS: lldb-unit :: Utility/./UtilityTests/ListenerTest.GetEventWait (1535 of 2338)
PASS: lldb-unit :: Utility/./UtilityTests/StreamTeeTest.Assignment (1536 of 2338)
PASS: lldb-shell :: Breakpoint/debug_addrx.test (1537 of 2338)
PASS: lldb-api :: commands/frame/recognizer/TestFrameRecognizer.py (1538 of 2338)
PASS: lldb-unit :: Host/./HostTests/SocketTests/SocketTest.TCPListen0ConnectAccept/ipv4 (1539 of 2338)
UNSUPPORTED: lldb-api :: functionalities/data-formatter/data-formatter-stl/libstdcpp/tuple/TestDataFormatterStdTuple.py (1540 of 2338)
PASS: lldb-api :: lang/cpp/type_lookup/TestCppTypeLookup.py (1541 of 2338)
PASS: lldb-api :: lang/cpp/member-and-local-vars-with-same-name/TestMembersAndLocalsWithSameName.py (1542 of 2338)
PASS: lldb-shell :: Register/Core/x86-64-linux-fp.test (1543 of 2338)
PASS: lldb-unit :: Host/./HostTests/SocketTests/SocketTest.UDPGetConnectURI/ipv4 (1544 of 2338)
PASS: lldb-shell :: SymbolFile/DWARF/x86/DW_AT_declaration-with-children.s (1545 of 2338)
PASS: lldb-shell :: ObjectFile/PECOFF/dep-modules.yaml (1546 of 2338)
PASS: lldb-unit :: Utility/./UtilityTests/NameMatchesTest.Ignore (1547 of 2338)
PASS: lldb-unit :: SymbolFile/DWARF/./SymbolFileDWARFTests/SymbolFileDWARFTests.TestAbbrevMissingTerminator (1548 of 2338)
PASS: lldb-shell :: Breakpoint/debug_rnglist_rlestartend.test (1549 of 2338)
PASS: lldb-api :: macosx/dyld-trie-symbols/TestDyldTrieSymbols.py (1550 of 2338)
PASS: lldb-unit :: UnwindAssembly/x86/./UnwindAssemblyx86Tests/Testx86AssemblyInspectionEngine.TestPushExtended (1551 of 2338)
PASS: lldb-unit :: Symbol/./SymbolTests/TestTypeSystemClang.TestGetBasicTypeFromName (1552 of 2338)
PASS: lldb-api :: functionalities/wrong_commands/TestWrongCommands.py (1553 of 2338)
PASS: lldb-api :: lang/c/strings/TestCStrings.py (1554 of 2338)
PASS: lldb-api :: functionalities/data-formatter/data-formatter-named-summaries/TestDataFormatterNamedSummaries.py (1555 of 2338)
PASS: lldb-unit :: Utility/./UtilityTests/StreamTeeTest.Constructor2Streams (1556 of 2338)
PASS: lldb-unit :: Utility/./UtilityTests/ScalarTest.Comparison (1557 of 2338)
PASS: lldb-unit :: Utility/./UtilityTests/ProcessInstanceInfo.DumpTable_invalidUID (1558 of 2338)
PASS: lldb-unit :: UnwindAssembly/x86/./UnwindAssemblyx86Tests/Testx86AssemblyInspectionEngine.TestPopR13 (1559 of 2338)
PASS: lldb-unit :: Utility/./UtilityTests/StreamTest.PutMaxHex64ByteOrderLittle (1560 of 2338)
PASS: lldb-shell :: ObjectFile/ELF/gnu-debuglink.yaml (1561 of 2338)
PASS: lldb-api :: python_api/value/empty_class/TestValueAPIEmptyClass.py (1562 of 2338)
PASS: lldb-unit :: UnwindAssembly/x86/./UnwindAssemblyx86Tests/Testx86AssemblyInspectionEngine.TestDisassemblyMidFunctionEpilogues (1563 of 2338)
PASS: lldb-unit :: Language/CPlusPlus/./LanguageCPlusPlusTests/CPlusPlusLanguage.CPlusPlusNameParser (1564 of 2338)
PASS: lldb-shell :: Reproducer/TestFinalize.test (1565 of 2338)
PASS: lldb-shell :: Driver/TestProcessAttach.test (1566 of 2338)
PASS: lldb-unit :: Host/./HostTests/SocketTests/SocketTest.DecodeHostAndPort/ipv4 (1567 of 2338)
UNSUPPORTED: lldb-api :: linux/mix-dwo-and-regular-objects/TestMixedDwarfBinary.py (1568 of 2338)
PASS: lldb-unit :: Utility/./UtilityTests/DataExtractorTest.GetMaxU64_unchecked (1569 of 2338)
PASS: lldb-api :: lang/c/const_variables/TestConstVariables.py (1570 of 2338)
PASS: lldb-unit :: Utility/./UtilityTests/FileSpecTest.FormatFileSpec (1571 of 2338)
PASS: lldb-unit :: Host/./HostTests/FileSystemTest.Resolve (1572 of 2338)
PASS: lldb-shell :: ObjectFile/ELF/minidebuginfo-corrupt-xz.yaml (1573 of 2338)
PASS: lldb-api :: commands/expression/codegen-crash-import-def-arraytype-element/TestImportDefinitionArrayType.py (1574 of 2338)
PASS: lldb-api :: commands/expression/import-std-module/retry-with-std-module/TestRetryWithStdModule.py (1575 of 2338)
PASS: lldb-api :: lang/objc/warnings-in-expr-parser/TestObjCWarningsInExprParser.py (1576 of 2338)
PASS: lldb-api :: commands/settings/quoting/TestQuoting.py (1577 of 2338)
PASS: lldb-unit :: ScriptInterpreter/Python/./ScriptInterpreterPythonTests/PythonDataObjectsTest.TestPythonDictionaryToStructuredDictionary (1578 of 2338)
PASS: lldb-unit :: Utility/./UtilityTests/RangeTest.ContainsRangeStartingFromZero (1579 of 2338)
UNSUPPORTED: lldb-api :: commands/watchpoints/hello_watchlocation/TestWatchLocation.py (1580 of 2338)
PASS: lldb-api :: lang/cpp/gmodules-templates/TestGModules.py (1581 of 2338)
PASS: lldb-unit :: Utility/./UtilityTests/StringLexerTest.NextIf (1582 of 2338)
PASS: lldb-unit :: Expression/./ExpressionTests/CppModuleConfigurationTest.MissingLibCpp (1583 of 2338)
PASS: lldb-unit :: Utility/./UtilityTests/ArgsTest.ReplaceArgumentAtIndexOutOfRange (1584 of 2338)
PASS: lldb-shell :: Reproducer/TestSynchronous.test (1585 of 2338)
PASS: lldb-unit :: Utility/./UtilityTests/UriParserTest.BracketedHostnameWithPortIPv6 (1586 of 2338)
PASS: lldb-unit :: Utility/./UtilityTests/OptionsWithRawTest.TerminatedQuote (1587 of 2338)
PASS: lldb-unit :: Process/minidump/./LLDBMinidumpTests/MinidumpParserTest.GetMemoryRegionInfoLinuxMapsError (1588 of 2338)
PASS: lldb-api :: api/check_public_api_headers/TestPublicAPIHeaders.py (1589 of 2338)
PASS: lldb-api :: python_api/lldbutil/TestSwigVersion.py (1590 of 2338)
PASS: lldb-unit :: Utility/./UtilityTests/ScalarTest.Scalar_512 (1591 of 2338)
PASS: lldb-api :: lang/cpp/call-function/TestCallCPPFunction.py (1592 of 2338)
PASS: lldb-unit :: Utility/./UtilityTests/FileSpecTest.GuessPathStyle (1593 of 2338)
PASS: lldb-unit :: Utility/./UtilityTests/StringExtractorTest.GetU64BigEndian (1594 of 2338)
PASS: lldb-unit :: SymbolFile/NativePDB/./SymbolFileNativePDBTests/PDBFPOProgramToDWARFExpressionTests.MissingTargetRegister (1595 of 2338)
PASS: lldb-unit :: Language/Highlighting/./HighlighterTests/HighlighterTest.DefaultHighlighterWithCursor (1596 of 2338)
PASS: lldb-shell :: Unwind/thread-step-out-ret-addr-check.test (1597 of 2338)
UNSUPPORTED: lldb-shell :: Register/x86-db-read.test (1598 of 2338)
PASS: lldb-api :: commands/watchpoints/watchpoint_disable/TestWatchpointDisable.py (1599 of 2338)
PASS: lldb-unit :: ScriptInterpreter/Python/./ScriptInterpreterPythonTests/PythonDataObjectsTest.TestPythonStringToStr (1600 of 2338)
PASS: lldb-unit :: ScriptInterpreter/Python/./ScriptInterpreterPythonTests/PythonDataObjectsTest.TestPythonTupleToStructuredList (1601 of 2338)
PASS: lldb-unit :: Core/./LLDBCoreTests/FormatEntity.LookupAllEntriesInTree (1602 of 2338)
UNSUPPORTED: lldb-api :: functionalities/thread/break_after_join/TestBreakAfterJoin.py (1603 of 2338)
PASS: lldb-unit :: Utility/./UtilityTests/EventTest.DumpEventDataBytes (1604 of 2338)
PASS: lldb-api :: lang/objc/modules-cache/TestClangModulesCache.py (1605 of 2338)
PASS: lldb-unit :: Utility/./UtilityTests/RangeTest.ContainsRange (1606 of 2338)
PASS: lldb-api :: lang/c/inlines/TestRedefinitionsInInlines.py (1607 of 2338)
PASS: lldb-api :: lang/c/modules/TestCModules.py (1608 of 2338)
PASS: lldb-unit :: Utility/./UtilityTests/StringLexerTest.PutBack (1609 of 2338)
PASS: lldb-unit :: Utility/./UtilityTests/StringExtractorTest.DecodeHexU8_Underflow (1610 of 2338)
PASS: lldb-api :: commands/expression/ignore-artificial-constructors/TestIgnoreArtificialConstructors.py (1611 of 2338)
PASS: lldb-unit :: Utility/./UtilityTests/TimerTest.CategoryTimesNested (1612 of 2338)
PASS: lldb-api :: commands/expression/import-std-module/vector/TestVectorFromStdModule.py (1613 of 2338)
PASS: lldb-unit :: Utility/./UtilityTests/ArgsTest.TestAppendArg (1614 of 2338)
PASS: lldb-api :: functionalities/thread/backtrace_limit/TestBacktraceLimit.py (1615 of 2338)
PASS: lldb-api :: python_api/sbplatform/TestSBPlatform.py (1616 of 2338)
PASS: lldb-unit :: Utility/./UtilityTests/BinaryStreamTest.PutULEB128FourBytes (1617 of 2338)
PASS: lldb-unit :: Process/minidump/./LLDBMinidumpTests/MinidumpParserTest.FindMemoryRangeWithFullMemoryMinidump (1618 of 2338)
UNSUPPORTED: lldb-api :: functionalities/data-formatter/data-formatter-stl/libstdcpp/map/TestDataFormatterStdMap.py (1619 of 2338)
PASS: lldb-unit :: Utility/./UtilityTests/RangeTest.Equal (1620 of 2338)
PASS: lldb-unit :: Utility/./UtilityTests/RecordReplayTest.InstrumentedFoo (1621 of 2338)
PASS: lldb-unit :: Expression/./ExpressionTests/DWARFExpressionMockProcessTest.DW_OP_deref (1622 of 2338)
PASS: lldb-unit :: Utility/./UtilityTests/UserIDResolver.GetGroupName (1623 of 2338)
PASS: lldb-api :: types/TestFloatTypes.py (1624 of 2338)
PASS: lldb-unit :: UnwindAssembly/x86/./UnwindAssemblyx86Tests/Testx86AssemblyInspectionEngine.TestMovRSPtoRBP (1625 of 2338)
PASS: lldb-unit :: Process/Utility/./ProcessUtilityTests/ProcMapTests/LinuxProcMapsTestFixture.ParseMapRegions/4 (1626 of 2338)
PASS: lldb-api :: functionalities/data-formatter/data-formatter-disabling/TestDataFormatterDisabling.py (1627 of 2338)
PASS: lldb-api :: commands/target/create-no-such-arch/TestNoSuchArch.py (1628 of 2338)
PASS: lldb-unit :: Host/./HostTests/FileSystemTest.FileAndDirectoryComponents (1629 of 2338)
PASS: lldb-shell :: SymbolFile/DWARF/dwo-relative-path.s (1630 of 2338)
UNSUPPORTED: lldb-api :: functionalities/thread/create_during_step/TestCreateDuringStep.py (1631 of 2338)
PASS: lldb-unit :: Utility/./UtilityTests/SerializationRountripTest.SerializeDeserializeObjectPointer (1632 of 2338)
PASS: lldb-api :: functionalities/breakpoint/breakpoint_command/TestBreakpointCommandsFromPython.py (1633 of 2338)
PASS: lldb-api :: commands/gui/basicdebug/TestGuiBasicDebug.py (1634 of 2338)
PASS: lldb-unit :: Utility/./UtilityTests/StreamTeeTest.GetStreamAtIndexOutOfBounds (1635 of 2338)
PASS: lldb-api :: lang/cpp/chained-calls/TestCppChainedCalls.py (1636 of 2338)
PASS: lldb-unit :: Utility/./UtilityTests/AnsiTerminal.WhiteSpace (1637 of 2338)
PASS: lldb-unit :: Utility/./UtilityTests/BinaryStreamTest.PutULEB128TwoBytes (1638 of 2338)
PASS: lldb-unit :: Host/./HostTests/FileSystemTest.GetByteSize (1639 of 2338)
PASS: lldb-unit :: Utility/./UtilityTests/RegularExpression.Invalid (1640 of 2338)
PASS: lldb-shell :: Register/Core/x86-64-freebsd-gp.test (1641 of 2338)
PASS: lldb-shell :: ObjectFile/PDB/object.test (1642 of 2338)
PASS: lldb-api :: macosx/profile_vrs_detach/TestDetachVrsProfile.py (1643 of 2338)
PASS: lldb-unit :: Utility/./UtilityTests/StringListTest.ForRangeEmpty (1644 of 2338)
PASS: lldb-unit :: Process/minidump/./LLDBMinidumpTests/RegisterContextMinidump.ConvertMinidumpContext_x86_32 (1645 of 2338)
PASS: lldb-unit :: Utility/./UtilityTests/StringListTest.InsertStringAtIndexStart (1646 of 2338)
PASS: lldb-api :: functionalities/gdb_remote_client/TestPlatformClient.py (1647 of 2338)
PASS: lldb-unit :: Host/./HostTests/File.GetWaitableHandleFileno (1648 of 2338)
PASS: lldb-api :: lang/objc/modules-hash-mismatch/TestClangModulesHashMismatch.py (1649 of 2338)
PASS: lldb-unit :: Target/./TargetTests/PathMappingListTest.AbsoluteTests (1650 of 2338)
PASS: lldb-api :: commands/expression/import-std-module/unique_ptr/TestUniquePtrFromStdModule.py (1651 of 2338)
PASS: lldb-api :: commands/target/auto-install-main-executable/TestAutoInstallMainExecutable.py (1652 of 2338)
PASS: lldb-unit :: Process/Utility/./ProcessUtilityTests/ProcSMapTests/LinuxProcSMapsTestFixture.ParseSMapRegions/2 (1653 of 2338)
PASS: lldb-api :: types/TestIntegerTypeExpr.py (1654 of 2338)
PASS: lldb-unit :: Target/./TargetTests/StackFrameRecognizerTest.NullModuleRegex (1655 of 2338)
PASS: lldb-api :: functionalities/data-formatter/data-formatter-stl/libcxx/initializerlist/TestInitializerList.py (1656 of 2338)
PASS: lldb-unit :: Utility/./UtilityTests/BinaryStreamTest.PutSLEB128MaxValue (1657 of 2338)
PASS: lldb-shell :: SymbolFile/NativePDB/globals-fundamental.cpp (1658 of 2338)
PASS: lldb-unit :: debugserver/./debugserverTests/RNBSocket.LoopBackConnectIPv4 (1659 of 2338)
PASS: lldb-shell :: Settings/TestSettingsSet.test (1660 of 2338)
UNSUPPORTED: lldb-api :: functionalities/data-formatter/data-formatter-stl/libstdcpp/iterator/TestDataFormatterStdIterator.py (1661 of 2338)
PASS: lldb-api :: functionalities/data-formatter/nssetsynth/TestNSSetSynthetic.py (1662 of 2338)
PASS: lldb-api :: functionalities/inferior-changed/TestInferiorChanged.py (1663 of 2338)
PASS: lldb-api :: commands/expression/import-std-module/unique_ptr-dbg-info-content/TestUniquePtrDbgInfoContent.py (1664 of 2338)
PASS: lldb-api :: commands/target/stop-hook/disable/TestTargetStopHookDisable.py (1665 of 2338)
PASS: lldb-unit :: ScriptInterpreter/Python/./ScriptInterpreterPythonTests/PythonDataObjectsTest.TestPythonListToStructuredList (1666 of 2338)
PASS: lldb-api :: python_api/debugger/TestDebuggerAPI.py (1667 of 2338)
PASS: lldb-unit :: Host/./HostTests/Host.GetEnvironment (1668 of 2338)
PASS: lldb-unit :: Process/gdb-remote/./ProcessGdbRemoteTests/GDBRemoteCommunicationClientTest.SendSignalsToIgnore (1669 of 2338)
PASS: lldb-api :: lang/objcxx/objcxx-ivar-vector/TestIvarVector.py (1670 of 2338)
PASS: lldb-unit :: SymbolFile/NativePDB/./SymbolFileNativePDBTests/PDBFPOProgramToDWARFExpressionTests.DependencyChain (1671 of 2338)
UNSUPPORTED: lldb-api :: commands/trace/TestTraceLoad.py (1672 of 2338)
PASS: lldb-unit :: Thread/./ThreadTests/ThreadTest.GetPrivateStopInfo (1673 of 2338)
PASS: lldb-api :: commands/disassemble/basic/TestFrameDisassemble.py (1674 of 2338)
PASS: lldb-shell :: ScriptInterpreter/Python/Crashlog/text.test (1675 of 2338)
PASS: lldb-unit :: Editline/./EditlineTests/EditlineTestFixture.EditlineReceivesMultiLineText (1676 of 2338)
PASS: lldb-api :: lang/cpp/dynamic-value/TestDynamicValue.py (1677 of 2338)
PASS: lldb-shell :: SymbolFile/Breakpad/line-table-edgecases.test (1678 of 2338)
PASS: lldb-shell :: SymbolFile/DWARF/x86/dir-separator-windows.s (1679 of 2338)
PASS: lldb-api :: functionalities/data-formatter/data-formatter-caching/TestDataFormatterCaching.py (1680 of 2338)
PASS: lldb-unit :: Utility/./UtilityTests/BinaryStreamTest.PutULEB128SixBytes (1681 of 2338)
UNSUPPORTED: lldb-api :: commands/register/register/intel_xtended_registers/mpx_bound_violation/TestBoundViolation.py (1682 of 2338)
PASS: lldb-api :: functionalities/breakpoint/consecutive_breakpoints/TestConsecutiveBreakpoints.py (1683 of 2338)
PASS: lldb-unit :: Utility/./UtilityTests/StringListTest.JoinMultiCharSeparator (1684 of 2338)
PASS: lldb-api :: functionalities/pre_run_dylibs/TestPreRunDylibs.py (1685 of 2338)
UNSUPPORTED: lldb-shell :: Register/x86-gp-read.test (1686 of 2338)
PASS: lldb-shell :: ObjectFile/ELF/basic-info.yaml (1687 of 2338)
UNSUPPORTED: lldb-shell :: BuildScript/toolchain-clang-cl.test (1688 of 2338)
PASS: lldb-unit :: Utility/./UtilityTests/StringListTest.SplitIntoLines (1689 of 2338)
PASS: lldb-api :: commands/expression/persistent_types/TestNestedPersistentTypes.py (1690 of 2338)
PASS: lldb-api :: commands/expression/multiline-completion/TestMultilineCompletion.py (1691 of 2338)
PASS: lldb-unit :: Process/minidump/./LLDBMinidumpTests/MinidumpParserTest.GetMemory (1692 of 2338)
PASS: lldb-unit :: Language/Highlighting/./HighlighterTests/HighlighterTest.ClangCursorPosInOtherToken (1693 of 2338)
PASS: lldb-unit :: ScriptInterpreter/Python/./ScriptInterpreterPythonTests/PythonDataObjectsTest.TestPythonBytes (1694 of 2338)
PASS: lldb-api :: python_api/sbvalue_persist/TestSBValuePersist.py (1695 of 2338)
PASS: lldb-api :: commands/frame/diagnose/inheritance/TestDiagnoseInheritance.py (1696 of 2338)
PASS: lldb-unit :: Language/Highlighting/./HighlighterTests/HighlighterTest.ClangCursorPosBeforeOtherToken (1697 of 2338)
PASS: lldb-api :: tools/lldb-vscode/stackTrace/TestVSCode_stackTrace.py (1698 of 2338)
PASS: lldb-shell :: SymbolFile/DWARF/x86/debug-types-dwo-cross-reference.cpp (1699 of 2338)
PASS: lldb-unit :: UnwindAssembly/x86/./UnwindAssemblyx86Tests/Testx86AssemblyInspectionEngine.TestPopEBX (1700 of 2338)
PASS: lldb-shell :: Quit/TestQuitExitCodeHexA.test (1701 of 2338)
PASS: lldb-unit :: Utility/./UtilityTests/StringExtractorTest.GetHexBytesAvail_OddPair2 (1702 of 2338)
PASS: lldb-api :: functionalities/data-formatter/data-formatter-objc/TestDataFormatterObjCNSDate.py (1703 of 2338)
PASS: lldb-api :: lang/objc/cpp_keyword_identifiers/TestCppKeywordsAsObjCIdentifiers.py (1704 of 2338)
PASS: lldb-api :: commands/frame/diagnose/array/TestArray.py (1705 of 2338)
UNSUPPORTED: lldb-shell :: Register/x86-zmm-read.test (1706 of 2338)
PASS: lldb-api :: commands/watchpoints/watchpoint_commands/TestWatchpointCommands.py (1707 of 2338)
PASS: lldb-unit :: Core/./LLDBCoreTests/SourceFileCache.FindSourceFileNotFound (1708 of 2338)
PASS: lldb-api :: commands/frame/diagnose/bad-reference/TestBadReference.py (1709 of 2338)
UNSUPPORTED: lldb-api :: tools/lldb-vscode/completions/TestVSCode_completions.py (1710 of 2338)
PASS: lldb-api :: python_api/file_handle/TestFileHandle.py (1711 of 2338)
PASS: lldb-unit :: Signals/./SignalsTests/UnixSignalsTest.GetFilteredSignals (1712 of 2338)
PASS: lldb-api :: lang/objc/conflicting-definition/TestConflictingDefinition.py (1713 of 2338)
UNSUPPORTED: lldb-shell :: Register/arm-fp-read.test (1714 of 2338)
PASS: lldb-shell :: Settings/TestFrameFormatMangling.test (1715 of 2338)
PASS: lldb-shell :: Commands/command-regex-unalias.test (1716 of 2338)
PASS: lldb-unit :: Utility/./UtilityTests/ScalarTest.ComparisonFloat (1717 of 2338)
PASS: lldb-unit :: Host/./HostTests/File.GetStreamFromDescriptor (1718 of 2338)
PASS: lldb-unit :: Core/./LLDBCoreTests/FormatEntityTest.DefinitionConstructionNameAndType (1719 of 2338)
PASS: lldb-api :: functionalities/gdb_remote_client/TestGDBRemoteLoad.py (1720 of 2338)
UNSUPPORTED: lldb-api :: tools/lldb-server/vCont-threads/TestGdbRemote_vContThreads.py (1721 of 2338)
PASS: lldb-shell :: ObjectFile/wasm/stripped-debug-sections.yaml (1722 of 2338)
PASS: lldb-api :: functionalities/data-formatter/data-formatter-stl/libcxx/deque/TestDataFormatterLibcxxDeque.py (1723 of 2338)
PASS: lldb-api :: lang/c/set_values/TestSetValues.py (1724 of 2338)
PASS: lldb-api :: lang/cpp/template-function/TestTemplateFunctions.py (1725 of 2338)
PASS: lldb-api :: macosx/thread_suspend/TestInternalThreadSuspension.py (1726 of 2338)
PASS: lldb-api :: lang/cpp/multiple-inheritance/TestCppMultipleInheritance.py (1727 of 2338)
PASS: lldb-unit :: Utility/./UtilityTests/StringExtractorTest.GetHexU8_Extra (1728 of 2338)
PASS: lldb-api :: lang/cpp/this/TestCPPThis.py (1729 of 2338)
PASS: lldb-shell :: Driver/TestTarget.test (1730 of 2338)
PASS: lldb-api :: functionalities/gdb_remote_client/TestqOffsets.py (1731 of 2338)
PASS: lldb-unit :: Utility/./UtilityTests/ScalarTest.ExtractBitfield (1732 of 2338)
UNSUPPORTED: lldb-api :: lang/cpp/function-template-parameter-pack/TestFunctionTemplateParameterPack.py (1733 of 2338)
UNSUPPORTED: lldb-shell :: ScriptInterpreter/Lua/lua-python.test (1734 of 2338)
PASS: lldb-unit :: Symbol/./SymbolTests/TestClangASTImporter.CopyDeclTagDecl (1735 of 2338)
PASS: lldb-api :: functionalities/breakpoint/breakpoint_callback_command_source/TestBreakpointCallbackCommandSource.py (1736 of 2338)
UNSUPPORTED: lldb-shell :: Breakpoint/case-insensitive.test (1737 of 2338)
PASS: lldb-unit :: Utility/./UtilityTests/RangeDataVector.FindEntryThatContains (1738 of 2338)
PASS: lldb-unit :: Host/./HostTests/ProcessLaunchInfoTest.Constructor (1739 of 2338)
PASS: lldb-unit :: Utility/./UtilityTests/AnsiTerminal.AtStart (1740 of 2338)
PASS: lldb-unit :: Language/CPlusPlus/./LanguageCPlusPlusTests/CPlusPlusLanguage.FindAlternateFunctionManglings (1741 of 2338)
PASS: lldb-unit :: Utility/./UtilityTests/ConstStringTest.format_provider (1742 of 2338)
PASS: lldb-unit :: Utility/./UtilityTests/RangeDataVector.CustomSort (1743 of 2338)
PASS: lldb-unit :: ScriptInterpreter/Python/./ScriptInterpreterPythonTests/PythonDataObjectsTest.TestPythonBoolean (1744 of 2338)
PASS: lldb-api :: python_api/lldbutil/process/TestPrintStackTraces.py (1745 of 2338)
PASS: lldb-shell :: ObjectFile/ELF/compressed-sections.yaml (1746 of 2338)
PASS: lldb-unit :: Interpreter/./InterpreterTests/OptionArgParserTest.toChar (1747 of 2338)
PASS: lldb-api :: functionalities/data-formatter/data-formatter-script/TestDataFormatterScript.py (1748 of 2338)
PASS: lldb-api :: functionalities/set-data/TestSetData.py (1749 of 2338)
PASS: lldb-unit :: Utility/./UtilityTests/StringListTest.GetMaxStringLengthMixed (1750 of 2338)
PASS: lldb-unit :: Utility/./UtilityTests/UriParserTest.MinimalPort (1751 of 2338)
PASS: lldb-api :: lang/cpp/non-type-template-param/TestCppNonTypeTemplateParam.py (1752 of 2338)
PASS: lldb-shell :: Process/TestEnvironment.test (1753 of 2338)
PASS: lldb-unit :: ScriptInterpreter/Python/./ScriptInterpreterPythonTests/PythonDataObjectsTest.TestPythonInteger (1754 of 2338)
PASS: lldb-api :: commands/platform/basic/TestPlatformCommand.py (1755 of 2338)
PASS: lldb-unit :: Utility/./UtilityTests/StreamTest.PutCStringWithStringRef (1756 of 2338)
PASS: lldb-shell :: lldb-server/TestErrorMessages.test (1757 of 2338)
PASS: lldb-shell :: SymbolFile/NativePDB/tag-types.cpp (1758 of 2338)
PASS: lldb-api :: macosx/macCatalyst/TestMacCatalyst.py (1759 of 2338)
PASS: lldb-api :: lang/c/shared_lib_stripped_symbols/TestSharedLibStrippedSymbols.py (1760 of 2338)
PASS: lldb-unit :: Utility/./UtilityTests/ArgsTest.Yaml (1761 of 2338)
PASS: lldb-unit :: SymbolFile/DWARF/./SymbolFileDWARFTests/SymbolFileDWARFTests.ParseArangesNonzeroSegmentSize (1762 of 2338)
PASS: lldb-api :: commands/watchpoints/step_over_watchpoint/TestStepOverWatchpoint.py (1763 of 2338)
PASS: lldb-unit :: Process/gdb-remote/./ProcessGdbRemoteTests/GDBRemoteCommunicationClientTest.GetModulesInfo_UUID20 (1764 of 2338)
PASS: lldb-unit :: Language/Highlighting/./HighlighterTests/HighlighterTest.ClangPPDirectives (1765 of 2338)
PASS: lldb-shell :: Reproducer/TestGDBRemoteRepro.test (1766 of 2338)
UNSUPPORTED: lldb-api :: macosx/posix_spawn/TestLaunchProcessPosixSpawn.py (1767 of 2338)
PASS: lldb-unit :: Utility/./UtilityTests/StreamTest.PutHex64ByteOrderLittle (1768 of 2338)
PASS: lldb-unit :: ScriptInterpreter/Python/./ScriptInterpreterPythonTests/PythonDataObjectsTest.TestPythonTupleInitializerList (1769 of 2338)
PASS: lldb-api :: functionalities/paths/TestPaths.py (1770 of 2338)
PASS: lldb-unit :: debugserver/./debugserverTests/RNBSocket.AnyListen (1771 of 2338)
PASS: lldb-api :: functionalities/thread/exit_during_break/TestExitDuringBreak.py (1772 of 2338)
UNSUPPORTED: lldb-shell :: SymbolFile/PDB/function-nested-block.test (1773 of 2338)
PASS: lldb-api :: functionalities/dlopen_other_executable/TestDlopenOtherExecutable.py (1774 of 2338)
PASS: lldb-unit :: ScriptInterpreter/Python/./ScriptInterpreterPythonTests/PythonDataObjectsTest.TestDictionaryResolutionWithDot (1775 of 2338)
PASS: lldb-shell :: ObjectFile/ELF/section-permissions.yaml (1776 of 2338)
PASS: lldb-api :: sanity/TestSettingSkipping.py (1777 of 2338)
PASS: lldb-api :: lang/objc/ptr_refs/TestPtrRefsObjC.py (1778 of 2338)
PASS: lldb-unit :: Host/./HostTests/HostInfoTest.GetXcodeSDK (1779 of 2338)
PASS: lldb-api :: python_api/symbol-context/TestSymbolContext.py (1780 of 2338)
UNSUPPORTED: lldb-shell :: ExecControl/StopHook/stop-hook-threads.test (1781 of 2338)
PASS: lldb-api :: lang/cpp/incomplete-types/TestCppIncompleteTypes.py (1782 of 2338)
PASS: lldb-api :: lang/cpp/namespace_conflicts/TestNamespaceConflicts.py (1783 of 2338)
PASS: lldb-api :: functionalities/stats_api/TestStatisticsAPI.py (1784 of 2338)
PASS: lldb-unit :: Host/./HostTests/NativeProcessProtocolTest.ReadMemoryWithoutTrap (1785 of 2338)
PASS: lldb-unit :: Utility/./UtilityTests/RangeTest.NotEqual (1786 of 2338)
PASS: lldb-api :: functionalities/tsan/basic/TestTsanBasic.py (1787 of 2338)
PASS: lldb-api :: commands/expression/call-function/TestCallUserDefinedFunction.py (1788 of 2338)
PASS: lldb-api :: functionalities/target_var/no_vars/TestTargetVarNoVars.py (1789 of 2338)
PASS: lldb-unit :: Process/minidump/./LLDBMinidumpTests/MinidumpParserTest.GetPid (1790 of 2338)
PASS: lldb-shell :: Register/Core/x86-64-freebsd-addr.test (1791 of 2338)
PASS: lldb-unit :: Core/./LLDBCoreTests/MangledTest.NameIndexes_FindFunctionSymbols (1792 of 2338)
PASS: lldb-api :: commands/expression/import-std-module/non-module-type-separation/TestNonModuleTypeSeparation.py (1793 of 2338)
PASS: lldb-unit :: Core/./LLDBCoreTests/DumpDataExtractorTest.ItemByteSizeErrors (1794 of 2338)
PASS: lldb-api :: commands/expression/import-std-module/deque-basic/TestDequeFromStdModule.py (1795 of 2338)
PASS: lldb-api :: commands/expression/dont_allow_jit/TestAllowJIT.py (1796 of 2338)
PASS: lldb-shell :: Reproducer/TestDump.test (1797 of 2338)
PASS: lldb-unit :: UnwindAssembly/x86/./UnwindAssemblyx86Tests/Testx86AssemblyInspectionEngine.TestSimple32bitFrameFunction (1798 of 2338)
UNSUPPORTED: lldb-shell :: Subprocess/vfork-follow-parent-wp.test (1799 of 2338)
UNSUPPORTED: lldb-api :: commands/register/register/aarch64_dynamic_regset/TestArm64DynamicRegsets.py (1800 of 2338)
PASS: lldb-api :: lang/cpp/covariant-return-types/TestCovariantReturnTypes.py (1801 of 2338)
PASS: lldb-api :: commands/breakpoint/set/func-regex/TestBreakpointRegexError.py (1802 of 2338)
PASS: lldb-unit :: Utility/./UtilityTests/StringListTest.Assignment (1803 of 2338)
PASS: lldb-unit :: Process/gdb-remote/./ProcessGdbRemoteTests/GDBRemoteCommunicationServerTest.SendErrorResponse_ErrorNumber (1804 of 2338)
PASS: lldb-unit :: UnwindAssembly/x86/./UnwindAssemblyx86Tests/Testx86AssemblyInspectionEngine.TestPushRBX (1805 of 2338)
UNSUPPORTED: lldb-shell :: SymbolFile/PDB/variables-locations.test (1806 of 2338)
PASS: lldb-api :: macosx/lc-note/kern-ver-str/TestKernVerStrLCNOTE.py (1807 of 2338)
PASS: lldb-api :: lang/cpp/scope/TestCppScope.py (1808 of 2338)
PASS: lldb-unit :: Utility/./UtilityTests/StreamTest.AddressSuffix (1809 of 2338)
PASS: lldb-shell :: ObjectFile/ELF/riscv-arch.yaml (1810 of 2338)
PASS: lldb-unit :: Expression/./ExpressionTests/DiagnosticManagerTest.GetStringMultiline (1811 of 2338)
PASS: lldb-unit :: Utility/./UtilityTests/StreamTest.Indent (1812 of 2338)
PASS: lldb-api :: functionalities/data-formatter/data-formatter-stl/libcxx/forward_list/TestDataFormatterLibcxxForwardList.py (1813 of 2338)
PASS: lldb-unit :: Utility/./UtilityTests/BinaryStreamTest.PutULEB128ThreeBytes (1814 of 2338)
PASS: lldb-api :: commands/expression/po_verbosity/TestPoVerbosity.py (1815 of 2338)
PASS: lldb-api :: lang/c/cpp_keyword_identifiers/TestCppKeywordsAsCIdentifiers.py (1816 of 2338)
PASS: lldb-unit :: Utility/./UtilityTests/SerializationRountripTest.SerializeDeserializePodPointers (1817 of 2338)
PASS: lldb-api :: functionalities/breakpoint/breakpoint_ignore_count/TestBreakpointIgnoreCount.py (1818 of 2338)
PASS: lldb-unit :: Utility/./UtilityTests/RecordReplayTest.InstrumentedBarRef (1819 of 2338)
PASS: lldb-unit :: ScriptInterpreter/Python/./ScriptInterpreterPythonTests/PythonDataObjectsTest.TestPythonString (1820 of 2338)
PASS: lldb-shell :: Driver/TestSingleQuote.test (1821 of 2338)
PASS: lldb-unit :: ScriptInterpreter/Python/./ScriptInterpreterPythonTests/PythonDataObjectsTest.TestPythonDictionaryValueEquality (1822 of 2338)
PASS: lldb-api :: functionalities/inferior-crashing/recursive-inferior/TestRecursiveInferior.py (1823 of 2338)
PASS: lldb-api :: functionalities/thread/concurrent_events/TestConcurrentBreakpointDelayBreakpointOneSignal.py (1824 of 2338)
PASS: lldb-shell :: Reproducer/TestCrash.test (1825 of 2338)
PASS: lldb-unit :: Utility/./UtilityTests/SerializationRountripTest.SerializeDeserializeObjectReference (1826 of 2338)
UNSUPPORTED: lldb-api :: functionalities/thread/state/TestThreadStates.py (1827 of 2338)
PASS: lldb-unit :: Utility/./UtilityTests/VMRange.ContainsAddr (1828 of 2338)
PASS: lldb-api :: commands/expression/completion-crash-incomplete-record/TestCompletionCrashIncompleteRecord.py (1829 of 2338)
PASS: lldb-api :: functionalities/gdb_remote_client/TestAArch64XMLRegOffsets.py (1830 of 2338)
PASS: lldb-unit :: Process/gdb-remote/./ProcessGdbRemoteTests/GDBRemoteCommunicationClientTest.GetMemoryRegionInfoInvalidResponse (1831 of 2338)
PASS: lldb-unit :: Symbol/./SymbolTests/TestTypeSystemClang.TestDisplayNameEmpty (1832 of 2338)
PASS: lldb-unit :: Utility/./UtilityTests/IndexToObjectTest.ObjectForIndex (1833 of 2338)
PASS: lldb-api :: commands/expression/import-std-module/conflicts/TestStdModuleWithConflicts.py (1834 of 2338)
PASS: lldb-unit :: Utility/./UtilityTests/VMRange.Clear (1835 of 2338)
UNSUPPORTED: lldb-api :: commands/register/register/intel_xtended_registers/mpx_offset_intersection/TestMPXOffsetIntersection.py (1836 of 2338)
PASS: lldb-unit :: Utility/./UtilityTests/LogChannelEnabledTest.LogVerboseThread (1837 of 2338)
PASS: lldb-api :: tools/lldb-vscode/console/TestVSCode_console.py (1838 of 2338)
PASS: lldb-unit :: Utility/./UtilityTests/RangeTest.ContainsEndInclusiveInvalid (1839 of 2338)
PASS: lldb-unit :: Utility/./UtilityTests/TimeoutTest.Construction (1840 of 2338)
PASS: lldb-api :: functionalities/data-formatter/varscript_formatting/TestDataFormatterVarScriptFormatting.py (1841 of 2338)
XFAIL: lldb-shell :: Register/x86-64-fp-write.test (1842 of 2338)
PASS: lldb-shell :: Breakpoint/debug_rnglist_basic.test (1843 of 2338)
PASS: lldb-unit :: Utility/./UtilityTests/Flags.AllSet (1844 of 2338)
PASS: lldb-unit :: UnwindAssembly/x86/./UnwindAssemblyx86Tests/Testx86AssemblyInspectionEngine.TestPushECX (1845 of 2338)
PASS: lldb-api :: functionalities/data-formatter/typedef_array/TestTypedefArray.py (1846 of 2338)
PASS: lldb-api :: commands/target/stop-hook/enable/TestTargetStopHookEnable.py (1847 of 2338)
PASS: lldb-api :: commands/expression/import-std-module/empty-module/TestEmptyStdModule.py (1848 of 2338)
PASS: lldb-unit :: ScriptInterpreter/Python/./ScriptInterpreterPythonTests/PythonDataObjectsTest.TestOwnedReferences (1849 of 2338)
UNSUPPORTED: lldb-api :: functionalities/thread/multi_break/TestMultipleBreakpoints.py (1850 of 2338)
PASS: lldb-api :: macosx/find-app-in-bundle/TestFindAppInBundle.py (1851 of 2338)
PASS: lldb-shell :: SymbolFile/DWARF/x86/debug_ranges-missing-section.s (1852 of 2338)
PASS: lldb-shell :: SymbolFile/DWARF/x86/DW_OP_piece-smaller-than-struct.s (1853 of 2338)
PASS: lldb-unit :: Utility/./UtilityTests/TimerTest.CategoryTimesStats (1854 of 2338)
PASS: lldb-shell :: ScriptInterpreter/Python/command_relative_import.test (1855 of 2338)
PASS: lldb-shell :: Quit/TestQuitExitCodeNonInt.test (1856 of 2338)
PASS: lldb-unit :: Host/./HostTests/MainLoopTest.UnmonitoredSignal (1857 of 2338)
PASS: lldb-api :: lang/objc/objc-runtime-ivars/TestRuntimeIvars.py (1858 of 2338)
PASS: lldb-unit :: Utility/./UtilityTests/ArgsTest.StringListConstructor (1859 of 2338)
PASS: lldb-api :: functionalities/signal/raise/TestRaise.py (1860 of 2338)
PASS: lldb-api :: functionalities/data-formatter/data-formatter-objc/TestDataFormatterObjCNSBundle.py (1861 of 2338)
PASS: lldb-api :: lang/cpp/struct_with_keyword_name/TestStructWithKeywordName.py (1862 of 2338)
PASS: lldb-unit :: Utility/./UtilityTests/TildeExpressionResolver.ResolveFullPath (1863 of 2338)
PASS: lldb-unit :: Host/./HostTests/ConnectionFileDescriptorTest.TCPGetURIv4 (1864 of 2338)
PASS: lldb-shell :: Register/Core/x86-64-netbsd-fp.test (1865 of 2338)
UNSUPPORTED: lldb-api :: functionalities/darwin_log/filter/regex/category/TestDarwinLogFilterRegexCategory.py (1866 of 2338)
PASS: lldb-api :: functionalities/data-formatter/user-format-vs-summary/TestUserFormatVsSummary.py (1867 of 2338)
PASS: lldb-unit :: Utility/./UtilityTests/StatusTest.ErrorConstructor (1868 of 2338)
PASS: lldb-unit :: ScriptInterpreter/Python/./ScriptInterpreterPythonTests/PythonDataObjectsTest.TestPythonTupleValues (1869 of 2338)
UNSUPPORTED: lldb-shell :: Register/x86-64-ymm16-read.test (1870 of 2338)
PASS: lldb-unit :: Utility/./UtilityTests/StreamTest.PutCharWhitespace (1871 of 2338)
PASS: lldb-api :: lang/cpp/namespace_definitions/TestNamespaceDefinitions.py (1872 of 2338)
PASS: lldb-unit :: UnwindAssembly/x86/./UnwindAssemblyx86Tests/Testx86AssemblyInspectionEngine.TestPopEDI (1873 of 2338)
PASS: lldb-api :: lang/cpp/char8_t/TestCxxChar8_t.py (1874 of 2338)
PASS: lldb-api :: lang/cpp/pointer_to_member_type_depending_on_parent_size/TestPointerToMemberTypeDependingOnParentSize.py (1875 of 2338)
PASS: lldb-unit :: Utility/./UtilityTests/UUIDTest.SetFromStringRef (1876 of 2338)
PASS: lldb-api :: functionalities/tsan/thread_leak/TestTsanThreadLeak.py (1877 of 2338)
PASS: lldb-unit :: Symbol/./SymbolTests/TestTypeSystemClang.TestBuiltinTypeForEncodingAndBitSize (1878 of 2338)
PASS: lldb-api :: lang/objc/foundation/TestObjCMethodsNSError.py (1879 of 2338)
PASS: lldb-unit :: Utility/./UtilityTests/ArgsTest.ReplaceArgumentAtIndexEqual (1880 of 2338)
PASS: lldb-unit :: Utility/./UtilityTests/VMRange.SetEndAddress (1881 of 2338)
PASS: lldb-unit :: Symbol/./SymbolTests/DWARFCallFrameInfoTest.Basic_dwarf3 (1882 of 2338)
PASS: lldb-unit :: Utility/./UtilityTests/BinaryStreamTest.PutSLEB128One (1883 of 2338)
PASS: lldb-unit :: Utility/./UtilityTests/FileSpecTest.OperatorBool (1884 of 2338)
UNSUPPORTED: lldb-shell :: ScriptInterpreter/Lua/fail_breakpoint_oneline.test (1885 of 2338)
PASS: lldb-api :: functionalities/thread/ignore_suspended/TestIgnoreSuspendedThread.py (1886 of 2338)
PASS: lldb-unit :: Utility/./UtilityTests/FileSpecTest.IsRelative (1887 of 2338)
PASS: lldb-api :: commands/expression/ir-interpreter-phi-nodes/TestIRInterpreterPHINodes.py (1888 of 2338)
PASS: lldb-api :: macosx/load-kext/TestLoadKext.py (1889 of 2338)
PASS: lldb-unit :: Utility/./UtilityTests/StreamTest.SetIndentLevel (1890 of 2338)
PASS: lldb-api :: functionalities/archives/TestBSDArchives.py (1891 of 2338)
PASS: lldb-unit :: Signals/./SignalsTests/UnixSignalsTest.VersionChange (1892 of 2338)
PASS: lldb-unit :: Utility/./UtilityTests/StreamTest.PutStringAsRawHex8 (1893 of 2338)
UNSUPPORTED: lldb-api :: linux/add-symbols/TestTargetSymbolsAddCommand.py (1894 of 2338)
PASS: lldb-unit :: Process/minidump/./LLDBMinidumpTests/MinidumpParserTest.GetMemoryRegionInfoFromMemory64List (1895 of 2338)
PASS: lldb-api :: lang/objc/real-definition/TestRealDefinition.py (1896 of 2338)
XFAIL: lldb-shell :: Register/x86-mm-xmm-read.test (1897 of 2338)
PASS: lldb-unit :: Utility/./UtilityTests/StringExtractorTest.InitMisc (1898 of 2338)
PASS: lldb-unit :: Utility/./UtilityTests/StreamTest.PutHex32ByteOrderLittle (1899 of 2338)
PASS: lldb-api :: functionalities/breakpoint/cpp/TestCPPBreakpointLocations.py (1900 of 2338)
PASS: lldb-api :: functionalities/data-formatter/data-formatter-objc/cmtime/TestDataFormatterCMTime.py (1901 of 2338)
PASS: lldb-api :: commands/expression/formatters/TestFormatters.py (1902 of 2338)
PASS: lldb-api :: functionalities/postmortem/minidump-new/TestMiniDumpNew.py (1903 of 2338)
PASS: lldb-unit :: Utility/./UtilityTests/BinaryStreamTest.PutSLEB128ThreeBytes (1904 of 2338)
UNSUPPORTED: lldb-shell :: SymbolFile/DWARF/x86/DW_TAG_GNU_call_site-DW_AT_low_pc.s (1905 of 2338)
PASS: lldb-shell :: SymbolFile/DWARF/x86/dwarf5-implicit-const.s (1906 of 2338)
PASS: lldb-shell :: ObjectFile/PECOFF/uuid.yaml (1907 of 2338)
PASS: lldb-unit :: Process/gdb-remote/./ProcessGdbRemoteTests/PortMapTest.FreePort (1908 of 2338)
UNSUPPORTED: lldb-api :: commands/register/register/aarch64_sve_registers/rw_access_dynamic_resize/TestSVEThreadedDynamic.py (1909 of 2338)
PASS: lldb-unit :: UnwindAssembly/x86/./UnwindAssemblyx86Tests/Testx86AssemblyInspectionEngine.TestPushRBPWithREX (1910 of 2338)
PASS: lldb-unit :: Process/minidump/./LLDBMinidumpTests/MinidumpParserTest.GetMiscInfo_no_stream (1911 of 2338)
PASS: lldb-unit :: Utility/./UtilityTests/FileSpecTest.FileAndDirectoryComponents (1912 of 2338)
PASS: lldb-unit :: Language/Highlighting/./HighlighterTests/HighlighterTest.ClangCommas (1913 of 2338)
PASS: lldb-unit :: SymbolFile/NativePDB/./SymbolFileNativePDBTests/PDBFPOProgramToDWARFExpressionTests.UnresolvedCyclicRegisterAssignmentReference (1914 of 2338)
PASS: lldb-shell :: ObjectFile/Breakpad/sections-trailing-func.test (1915 of 2338)
PASS: lldb-unit :: Utility/./UtilityTests/OptionsWithRawTest.SingleWordSuffix (1916 of 2338)
PASS: lldb-unit :: Utility/./UtilityTests/RangeTest.ContainsEndInclusive (1917 of 2338)
PASS: lldb-shell :: Commands/CommandScriptImmediateOutput/CommandScriptImmediateOutputFile.test (1918 of 2338)
PASS: lldb-unit :: Core/./LLDBCoreTests/MangledTest.EmptyForInvalidName (1919 of 2338)
PASS: lldb-unit :: Host/./HostTests/Host.WaitStatusFormat (1920 of 2338)
PASS: lldb-api :: functionalities/data-formatter/type_summary_list_arg/TestTypeSummaryListArg.py (1921 of 2338)
PASS: lldb-unit :: Utility/./UtilityTests/UriParserTest.BracketedHostnamePort (1922 of 2338)
PASS: lldb-unit :: Utility/./UtilityTests/UUIDTest.RelationalOperators (1923 of 2338)
PASS: lldb-api :: commands/expression/deleting-implicit-copy-constructor/TestDeletingImplicitCopyConstructor.py (1924 of 2338)
PASS: lldb-api :: commands/expression/completion-in-lambda-and-unnamed-class/TestCompletionInLambdaAndUnnamedClass.py (1925 of 2338)
PASS: lldb-api :: commands/help/TestHelp.py (1926 of 2338)
PASS: lldb-unit :: Utility/./UtilityTests/UriParserTest.SchemeHostSeparator3 (1927 of 2338)
PASS: lldb-shell :: ObjectFile/Breakpad/discontiguous-sections.test (1928 of 2338)
PASS: lldb-api :: lang/objc/foundation/TestRuntimeTypes.py (1929 of 2338)
PASS: lldb-unit :: Utility/./UtilityTests/ScalarTest.Getters (1930 of 2338)
UNSUPPORTED: lldb-api :: commands/expression/call-restarts/TestCallThatRestarts.py (1931 of 2338)
PASS: lldb-unit :: Host/./HostTests/SocketAddressTest.GetAddressInfo (1932 of 2338)
UNSUPPORTED: lldb-api :: functionalities/longjmp/TestLongjmp.py (1933 of 2338)
PASS: lldb-unit :: Symbol/./SymbolTests/TestTypeSystemClang.TestGetTypeClassTypeOfExpr (1934 of 2338)
PASS: lldb-unit :: Host/./HostTests/NativeProcessProtocolTest.SetBreakpointFailWrite (1935 of 2338)
PASS: lldb-unit :: Process/minidump/./LLDBMinidumpTests/MinidumpParserTest.GetLinuxProcStatus (1936 of 2338)
PASS: lldb-api :: functionalities/data-formatter/data-formatter-categories/TestDataFormatterCategories.py (1937 of 2338)
PASS: lldb-shell :: ObjectFile/ELF/short-build-id.yaml (1938 of 2338)
PASS: lldb-unit :: Utility/./UtilityTests/RangeTest.LessThanInvalid (1939 of 2338)
PASS: lldb-unit :: Utility/./UtilityTests/ProcessInstanceInfo.Dump (1940 of 2338)
PASS: lldb-unit :: Process/gdb-remote/./ProcessGdbRemoteTests/GDBRemoteCommunicationServerTest.SendErrorResponse_Status (1941 of 2338)
PASS: lldb-unit :: Process/Utility/./ProcessUtilityTests/RegisterContext_x86Test.AbridgedToFullTagWord (1942 of 2338)
PASS: lldb-unit :: Utility/./UtilityTests/StringListTest.ShiftMove (1943 of 2338)
PASS: lldb-unit :: ObjectFile/Breakpad/./ObjectFileBreakpadTests/StackWinRecord.parse (1944 of 2338)
PASS: lldb-api :: python_api/get-value-32bit-int/TestGetValue32BitInt.py (1945 of 2338)
PASS: lldb-api :: commands/expression/import-std-module/vector-dbg-info-content/TestDbgInfoContentVectorFromStdModule.py (1946 of 2338)
PASS: lldb-unit :: Host/./HostTests/PipeTest.CreateWithUniqueName (1947 of 2338)
PASS: lldb-unit :: UnwindAssembly/x86/./UnwindAssemblyx86Tests/Testx86AssemblyInspectionEngine.TestAddESP (1948 of 2338)
PASS: lldb-shell :: Reproducer/TestRelativePath.test (1949 of 2338)
PASS: lldb-unit :: Utility/./UtilityTests/UriParserTest.BracketedHostname (1950 of 2338)
PASS: lldb-unit :: Host/./HostTests/SocketTests/SocketTest.DomainListenConnectAccept/ipv4 (1951 of 2338)
PASS: lldb-unit :: Utility/./UtilityTests/StringListTest.GetMaxStringLengthIncreasingSize (1952 of 2338)
PASS: lldb-unit :: Utility/./UtilityTests/OptionsWithRawTest.EmptySuffix (1953 of 2338)
PASS: lldb-shell :: SymbolFile/DWARF/x86/find-qualified-variable.cpp (1954 of 2338)
PASS: lldb-unit :: UnwindAssembly/x86/./UnwindAssemblyx86Tests/Testx86AssemblyInspectionEngine.Test32BitOnlyInstruction (1955 of 2338)
PASS: lldb-unit :: Host/./HostTests/SocketTests/SocketTest.DomainGetConnectURI/ipv6 (1956 of 2338)
PASS: lldb-api :: lang/objc/objc-property/TestObjCProperty.py (1957 of 2338)
PASS: lldb-shell :: SymbolFile/DWARF/clang-ast-from-dwarf-objc-property.m (1958 of 2338)
PASS: lldb-api :: commands/expression/import-std-module/shared_ptr/TestSharedPtrFromStdModule.py (1959 of 2338)
PASS: lldb-api :: commands/expression/import-std-module/deque-dbg-info-content/TestDbgInfoContentDequeFromStdModule.py (1960 of 2338)
PASS: lldb-unit :: Utility/./UtilityTests/ScalarTest.Promotion (1961 of 2338)
PASS: lldb-unit :: ScriptInterpreter/Python/./ScriptInterpreterPythonTests/PythonDataObjectsTest.TestPythonCallableInvoke (1962 of 2338)
PASS: lldb-unit :: Utility/./UtilityTests/LogTest.Register (1963 of 2338)
PASS: lldb-shell :: Quit/TestQuitExitCodeTooManyArgs.test (1964 of 2338)
PASS: lldb-unit :: Utility/./UtilityTests/VASprintfTest.BufferResize (1965 of 2338)
PASS: lldb-unit :: Utility/./UtilityTests/BinaryStreamTest.PutSLEB128EightBytes (1966 of 2338)
PASS: lldb-unit :: UnwindAssembly/x86/./UnwindAssemblyx86Tests/Testx86AssemblyInspectionEngine.TestSpillRegToStackViaMOVx86_64 (1967 of 2338)
PASS: lldb-unit :: UnwindAssembly/PPC64/./PPC64InstEmulationTests/TestPPC64InstEmulation.TestMediumFunction (1968 of 2338)
PASS: lldb-unit :: Language/Highlighting/./HighlighterTests/HighlighterTest.ClangCursorPosEndOfLine (1969 of 2338)
PASS: lldb-api :: lang/objc/objc-ivar-offsets/TestObjCIvarOffsets.py (1970 of 2338)
PASS: lldb-api :: iohandler/resize/TestIOHandlerResizeNoEditline.py (1971 of 2338)
PASS: lldb-api :: lang/objc/objc-ivar-stripped/TestObjCIvarStripped.py (1972 of 2338)
PASS: lldb-api :: functionalities/breakpoint/breakpoint_hit_count/TestBreakpointHitCount.py (1973 of 2338)
PASS: lldb-shell :: Register/Core/x86-64-freebsd-fp.test (1974 of 2338)
PASS: lldb-unit :: Expression/./ExpressionTests/DiagnosticManagerTest.GetStringPreserveOrder (1975 of 2338)
PASS: lldb-api :: functionalities/tail_call_frames/thread_step_out_or_return/TestSteppingOutWithArtificialFrames.py (1976 of 2338)
PASS: lldb-unit :: Utility/./UtilityTests/StatusTest.ErrorConversion (1977 of 2338)
PASS: lldb-api :: lang/objc/modules-auto-import/TestModulesAutoImport.py (1978 of 2338)
PASS: lldb-unit :: ScriptInterpreter/Python/./ScriptInterpreterPythonTests/PythonDataObjectsTest.TestResetting (1979 of 2338)
PASS: lldb-api :: lang/cpp/stl/TestStdCXXDisassembly.py (1980 of 2338)
PASS: lldb-api :: functionalities/thread/exit_during_step/TestExitDuringStep.py (1981 of 2338)
PASS: lldb-unit :: Utility/./UtilityTests/Predicate.WaitForValueEqualTo (1982 of 2338)
PASS: lldb-unit :: Utility/./UtilityTests/FileSpecTest.EqualDotsWindows (1983 of 2338)
PASS: lldb-unit :: Expression/./ExpressionTests/DWARFExpression.DW_OP_stack_value (1984 of 2338)
PASS: lldb-api :: commands/target/dump-symtab-demangle/TestDumpSymtabDemangle.py (1985 of 2338)
PASS: lldb-api :: macosx/indirect_symbol/TestIndirectSymbols.py (1986 of 2338)
PASS: lldb-shell :: SymbolFile/DWARF/x86/debug-types-missing-signature.test (1987 of 2338)
PASS: lldb-unit :: Process/gdb-remote/./ProcessGdbRemoteTests/GDBRemoteCommunicationServerTest.SendErrorResponse_UnimplementedError (1988 of 2338)
PASS: lldb-unit :: Expression/./ExpressionTests/ClangExpressionDeclMapTest.TestUnknownIdentifierLookup (1989 of 2338)
PASS: lldb-unit :: Utility/./UtilityTests/ScalarTest.APIntConstructor (1990 of 2338)
PASS: lldb-unit :: Utility/./UtilityTests/StreamTest.PutCharNull (1991 of 2338)
PASS: lldb-api :: commands/watchpoints/watchpoint_count/TestWatchpointCount.py (1992 of 2338)
PASS: lldb-unit :: Utility/./UtilityTests/RangeTest.ClearWithStarAddress (1993 of 2338)
PASS: lldb-unit :: Host/./HostTests/MainLoopTest.ReadObject (1994 of 2338)
PASS: lldb-unit :: Process/Utility/./ProcessUtilityTests/ProcMapTests/LinuxProcMapsTestFixture.ParseMapRegions/6 (1995 of 2338)
PASS: lldb-shell :: Reproducer/TestMultipleTargets.test (1996 of 2338)
PASS: lldb-api :: lang/cpp/break-on-initializers/TestBreakOnCPP11Initializers.py (1997 of 2338)
PASS: lldb-unit :: Utility/./UtilityTests/ArchSpecTest.Compatibility (1998 of 2338)
PASS: lldb-api :: lang/c/step-target/TestStepTarget.py (1999 of 2338)
PASS: lldb-api :: functionalities/breakpoint/move_nearest/TestMoveNearest.py (2000 of 2338)
PASS: lldb-api :: python_api/disassemble-raw-data/TestDisassembleRawData.py (2001 of 2338)
PASS: lldb-shell :: Reproducer/TestReuseDirectory.test (2002 of 2338)
PASS: lldb-unit :: Utility/./UtilityTests/ConstStringTest.MangledCounterpart (2003 of 2338)
PASS: lldb-unit :: Process/gdb-remote/./ProcessGdbRemoteTests/GDBRemoteCommunicationServerTest.SendErrorResponse_ErrorList (2004 of 2338)
UNSUPPORTED: lldb-api :: lang/objc/modules-update/TestClangModulesUpdate.py (2005 of 2338)
PASS: lldb-unit :: Target/./TargetTests/MemoryRegionInfoTest.Formatv (2006 of 2338)
PASS: lldb-unit :: SymbolFile/NativePDB/./SymbolFileNativePDBTests/PDBFPOProgramToDWARFExpressionTests.InvalidAssignmentMultiple (2007 of 2338)
PASS: lldb-unit :: Utility/./UtilityTests/AnsiTerminal.AtEnd (2008 of 2338)
PASS: lldb-unit :: Utility/./UtilityTests/RecordReplayTest.InstrumentedBarPtr (2009 of 2338)
PASS: lldb-api :: lang/cpp/accelerator-table/TestCPPAccelerator.py (2010 of 2338)
PASS: lldb-api :: python_api/frame/inlines/TestInlinedFrame.py (2011 of 2338)
UNSUPPORTED: lldb-shell :: SymbolFile/PDB/function-level-linking.test (2012 of 2338)
PASS: lldb-shell :: BuildScript/modes.test (2013 of 2338)
PASS: lldb-shell :: Register/Core/x86-32-linux-addr.test (2014 of 2338)
PASS: lldb-unit :: Utility/./UtilityTests/StringListTest.InsertStringAtIndexOutOfBounds (2015 of 2338)
PASS: lldb-shell :: SymbolFile/NativePDB/break-by-line.cpp (2016 of 2338)
UNSUPPORTED: lldb-shell :: SymbolFile/NativePDB/local-variables.cpp (2017 of 2338)
PASS: lldb-api :: functionalities/tail_call_frames/inlining_and_tail_calls/TestInliningAndTailCalls.py (2018 of 2338)
PASS: lldb-api :: functionalities/thread/concurrent_events/TestConcurrentSignalWatchBreak.py (2019 of 2338)
PASS: lldb-api :: lang/objc/objc-new-syntax/TestObjCNewSyntaxArray.py (2020 of 2338)
UNSUPPORTED: lldb-shell :: Register/aarch64-gp-read.test (2021 of 2338)
PASS: lldb-unit :: Utility/./UtilityTests/StringListTest.LongestCommonPrefixDuplicateElement (2022 of 2338)
UNSUPPORTED: lldb-api :: tools/lldb-server/TestGdbRemoteAuxvSupport.py (2023 of 2338)
PASS: lldb-unit :: Signals/./SignalsTests/UnixSignalsTest.Iteration (2024 of 2338)
PASS: lldb-unit :: Process/minidump/./LLDBMinidumpTests/MinidumpParserTest.GetLinuxProcStatus_no_stream (2025 of 2338)
PASS: lldb-api :: commands/expression/call-throws/TestCallThatThrows.py (2026 of 2338)
PASS: lldb-unit :: debugserver/./debugserverTests/RNBSocket.LoopBackListenIPv6 (2027 of 2338)
PASS: lldb-api :: lang/objc/objc-checker/TestObjCCheckers.py (2028 of 2338)
PASS: lldb-api :: commands/expression/anonymous-struct/TestCallUserAnonTypedef.py (2029 of 2338)
PASS: lldb-unit :: Process/gdb-remote/./ProcessGdbRemoteTests/GDBRemoteClientBaseTest.SendContinueAndLateInterrupt (2030 of 2338)
PASS: lldb-api :: lang/cpp/default-template-args/TestDefaultTemplateArgs.py (2031 of 2338)
PASS: lldb-unit :: UnwindAssembly/x86/./UnwindAssemblyx86Tests/Testx86AssemblyInspectionEngine.TestPopESI (2032 of 2338)
PASS: lldb-api :: functionalities/type_lookup/TestTypeLookup.py (2033 of 2338)
PASS: lldb-api :: functionalities/data-formatter/data-formatter-stl/libcxx/function/TestLibCxxFunction.py (2034 of 2338)
PASS: lldb-unit :: Utility/./UtilityTests/StreamTest.PutMaxHex64ByteOrderBig (2035 of 2338)
PASS: lldb-unit :: SymbolFile/NativePDB/./SymbolFileNativePDBTests/PDBFPOProgramToDWARFExpressionTests.MultipleIndependentAssignments (2036 of 2338)
PASS: lldb-unit :: Target/./TargetTests/ModuleCacheTest.GetAndPut (2037 of 2338)
UNSUPPORTED: lldb-shell :: Register/arm-gp-read.test (2038 of 2338)
PASS: lldb-api :: functionalities/data-formatter/ptr_ref_typedef/TestPtrRef2Typedef.py (2039 of 2338)
PASS: lldb-api :: functionalities/thread/concurrent_events/TestConcurrentTwoBreakpointsOneDelaySignal.py (2040 of 2338)
PASS: lldb-api :: functionalities/data-formatter/data-formatter-stl/libstdcpp/unique_ptr/invalid/TestDataFormatterInvalidStdUniquePtr.py (2041 of 2338)
PASS: lldb-unit :: Utility/./UtilityTests/StreamTest.PutBytesAsRawHex8ToLittleEndian (2042 of 2338)
PASS: lldb-unit :: Process/gdb-remote/./ProcessGdbRemoteTests/GDBRemoteClientBaseTest.SendContinueAndAsyncPacket (2043 of 2338)
PASS: lldb-api :: functionalities/reproducers/fs-case-sensitivity/TestReproducerFSCaseSensitivity.py (2044 of 2338)
UNSUPPORTED: lldb-shell :: SymbolFile/PDB/variables.test (2045 of 2338)
PASS: lldb-api :: python_api/watchpoint/watchlocation/TestSetWatchlocation.py (2046 of 2338)
PASS: lldb-shell :: Commands/command-script-import.test (2047 of 2338)
PASS: lldb-api :: commands/expression/weak_symbols/TestWeakSymbols.py (2048 of 2338)
FAIL: lldb-api :: api/multiple-targets/TestMultipleTargets.py (2049 of 2338)
******************** TEST 'lldb-api :: api/multiple-targets/TestMultipleTargets.py' FAILED ********************
Script:
--
/usr/local/Frameworks/Python.framework/Versions/3.7/bin/python3.7 /Users/buildslave/jenkins/workspace/lldb-cmake/llvm-project/lldb/test/API/dotest.py -u CXXFLAGS -u CFLAGS --codesign-identity - --arch x86_64 --build-dir /Users/buildslave/jenkins/workspace/lldb-cmake/lldb-build/lldb-test-build.noindex -t --env TERM=vt100 --env LLVM_LIBS_DIR=/Users/buildslave/jenkins/workspace/lldb-cmake/lldb-build/./lib --arch x86_64 --build-dir /Users/buildslave/jenkins/workspace/lldb-cmake/lldb-build/lldb-test-build.noindex --lldb-module-cache-dir /Users/buildslave/jenkins/workspace/lldb-cmake/lldb-build/lldb-test-build.noindex/module-cache-lldb/lldb-api --clang-module-cache-dir /Users/buildslave/jenkins/workspace/lldb-cmake/lldb-build/lldb-test-build.noindex/module-cache-clang/lldb-api --executable /Users/buildslave/jenkins/workspace/lldb-cmake/lldb-build/./bin/lldb --compiler /Users/buildslave/jenkins/workspace/lldb-cmake/lldb-build/./bin/clang --dsymutil /Users/buildslave/jenkins/workspace/lldb-cmake/lldb-build/./bin/dsymutil --llvm-tools-dir /Users/buildslave/jenkins/workspace/lldb-cmake/lldb-build/./bin --lldb-libs-dir /Users/buildslave/jenkins/workspace/lldb-cmake/lldb-build/./lib /Users/buildslave/jenkins/workspace/lldb-cmake/llvm-project/lldb/test/API/api/multiple-targets -p TestMultipleTargets.py
--
Exit Code: 1

Hide Details

Command Output (stdout): -- lldb version 13.0.99 (http://labmaster3.local/git/llvm-project.git revision 0cd33fa4bac2f5696c63f687467a987b008367ad) clang revision 0cd33fa4bac2f5696c63f687467a987b008367ad llvm revision 0cd33fa4bac2f5696c63f687467a987b008367ad Skipping the following test categories: ['darwin-log', 'libstdcxx', 'dwo', 'llgs', 'fork'] Building LLDB Driver (/Users/buildslave/jenkins/workspace/lldb-cmake/lldb-build/lldb-test-build.noindex/api/multiple-targets/TestMultipleTargets.test_multiple_targets/multi-target) from sources main.cpp Running test /Users/buildslave/jenkins/workspace/lldb-cmake/lldb-build/lldb-test-build.noindex/api/multiple-targets/TestMultipleTargets.test_multiple_targets/multi-target

Hide Details

-- Command Output (stderr): -- Change dir to: /Users/buildslave/jenkins/workspace/lldb-cmake/llvm-project/lldb/test/API/api/multiple-targets runCmd: settings clear -all output:

Hide Details

runCmd: settings set symbols.enable-external-lookup false output:

Hide Details

runCmd: settings set target.inherit-tcc true output:

Hide Details

runCmd: settings set target.detach-on-error false output:

Hide Details

runCmd: settings set target.auto-apply-fixits false output:

Hide Details

runCmd: settings set plugin.process.gdb-remote.packet-timeout 60 output:

Hide Details

runCmd: settings set symbols.clang-modules-cache-path "/Users/buildslave/jenkins/workspace/lldb-cmake/lldb-build/lldb-test-build.noindex/module-cache-lldb/lldb-api" output:

Hide Details

runCmd: settings set use-color false output:

Hide Details

runCmd: setting set target.prefer-dynamic-value no-dynamic-values output:

Hide Details

Adding tearDown hook: self.addTearDownHook(lambda: os.remove(self.driver_exe))

Hide Details

Hide Details

FAIL: LLDB (/Users/buildslave/jenkins/workspace/lldb-cmake/lldb-build/bin/clang-x86_64) :: test_multiple_targets (TestMultipleTargets.TestMultipleTargets) Executing tearDown hook: self.addTearDownHook(lambda: os.remove(self.driver_exe))

Hide Details

Hide Details

Restore dir to: /Users/buildslave/jenkins/workspace/lldb-cmake/lldb-build/tools/lldb/test ====================================================================== ERROR: test_multiple_targets (TestMultipleTargets.TestMultipleTargets) ---------------------------------------------------------------------- Traceback (most recent call last): File "/Users/buildslave/jenkins/workspace/lldb-cmake/llvm-project/lldb/packages/Python/lldbsuite/test/decorators.py", line 149, in wrapper return func(*args, **kwargs) File "/Users/buildslave/jenkins/workspace/lldb-cmake/llvm-project/lldb/packages/Python/lldbsuite/test/decorators.py", line 149, in wrapper return func(*args, **kwargs) File "/Users/buildslave/jenkins/workspace/lldb-cmake/llvm-project/lldb/packages/Python/lldbsuite/test/decorators.py", line 149, in wrapper return func(*args, **kwargs) File "/Users/buildslave/jenkins/workspace/lldb-cmake/llvm-project/lldb/packages/Python/lldbsuite/test/decorators.py", line 119, in wrapper func(*args, **kwargs) File "/Users/buildslave/jenkins/workspace/lldb-cmake/llvm-project/lldb/packages/Python/lldbsuite/test/decorators.py", line 451, in wrapper func(*args, **kwargs) File "/Users/buildslave/jenkins/workspace/lldb-cmake/llvm-project/lldb/test/API/api/multiple-targets/TestMultipleTargets.py", line 40, in test_multiple_targets check_call([self.driver_exe, self.driver_exe], env=env) File "/usr/local/Cellar/python/3.7.1/Frameworks/Python.framework/Versions/3.7/lib/python3.7/subprocess.py", line 341, in check_call raise CalledProcessError(retcode, cmd) subprocess.CalledProcessError: Command '['/Users/buildslave/jenkins/workspace/lldb-cmake/lldb-build/lldb-test-build.noindex/api/multiple-targets/TestMultipleTargets.test_multiple_targets/multi-target', '/Users/buildslave/jenkins/workspace/lldb-cmake/lldb-build/lldb-test-build.noindex/api/multiple-targets/TestMultipleTargets.test_multiple_targets/multi-target']' died with <Signals.SIGABRT: 6>. Config=x86_64-/Users/buildslave/jenkins/workspace/lldb-cmake/lldb-build/bin/clang ---------------------------------------------------------------------- Ran 1 test in 5.197s

Hide Details

RESULT: FAILED (0 passes, 0 failures, 1 errors, 0 skipped, 0 expected failures, 0 unexpected successes)

Hide Details

--

Hide Details

******************** PASS: lldb-api :: lang/cpp/global_variables/TestCPPGlobalVariables.py (2050 of 2338) PASS: lldb-unit :: Utility/./UtilityTests/UriParserTest.Empty (2051 of 2338) PASS: lldb-unit :: Utility/./UtilityTests/StreamTest.ShiftOperatorStrings (2052 of 2338) PASS: lldb-api :: functionalities/breakpoint/source_regexp/TestSourceRegexBreakpoints.py (2053 of 2338) PASS: lldb-api :: functionalities/data-formatter/data-formatter-stl/libcxx/unique_ptr/TestDataFormatterLibcxxUniquePtr.py (2054 of 2338) PASS: lldb-api :: functionalities/mtc/simple/TestMTCSimple.py (2055 of 2338) PASS: lldb-api :: commands/expression/rdar44436068/Test128BitsInteger.py (2056 of 2338) PASS: lldb-unit :: Utility/./UtilityTests/Flags.Test (2057 of 2338) PASS: lldb-unit :: Platform/Android/./AdbClientTests/AdbClientTest.CreateByDeviceId_ByEnvVar (2058 of 2338) PASS: lldb-shell :: Breakpoint/debug_rnglistx_rlex.test (2059 of 2338) PASS: lldb-unit :: Utility/./UtilityTests/StatusTest.Formatv (2060 of 2338) PASS: lldb-api :: functionalities/thread/concurrent_events/TestConcurrentTwoWatchpointsOneDelayBreakpoint.py (2061 of 2338) PASS: lldb-unit :: UnwindAssembly/x86/./UnwindAssemblyx86Tests/Testx86AssemblyInspectionEngine.TestPopR14 (2062 of 2338) PASS: lldb-api :: tools/lldb-server/TestGdbRemoteKill.py (2063 of 2338) PASS: lldb-unit :: Process/gdb-remote/./ProcessGdbRemoteTests/GDBRemoteCommunicationClientTest.GetQOffsets (2064 of 2338) PASS: lldb-api :: commands/expression/class_template_specialization_empty_pack/TestClassTemplateSpecializationParametersHandling.py (2065 of 2338) PASS: lldb-shell :: SymbolFile/DWARF/x86/module-ownership.mm (2066 of 2338) PASS: lldb-api :: commands/expression/import-std-module/list-dbg-info-content/TestDbgInfoContentListFromStdModule.py (2067 of 2338) PASS: lldb-unit :: Utility/./UtilityTests/StringExtractorTest.GetHexU8_Underflow2 (2068 of 2338) PASS: lldb-shell :: lldb-server/TestGdbserverPort.test (2069 of 2338) PASS: lldb-unit :: Utility/./UtilityTests/StreamTest.ShiftOperatorPtr (2070 of 2338) PASS: lldb-api :: functionalities/load_unload/TestLoadUnload.py (2071 of 2338) PASS: lldb-api :: python_api/interpreter/TestRunCommandInterpreterAPI.py (2072 of 2338) PASS: lldb-api :: lang/c/stepping/TestThreadStepInAvoidRegexp.py (2073 of 2338) PASS: lldb-api :: types/TestLongTypes.py (2074 of 2338) PASS: lldb-unit :: Utility/./UtilityTests/UUIDTest.StringConverion (2075 of 2338) PASS: lldb-api :: functionalities/tail_call_frames/disambiguate_paths_to_common_sink/TestDisambiguatePathsToCommonSink.py (2076 of 2338) PASS: lldb-shell :: Reproducer/TestVersionCheck.test (2077 of 2338) PASS: lldb-unit :: Utility/./UtilityTests/UUIDTest.Validity (2078 of 2338) XFAIL: lldb-shell :: Register/x86-fp-write.test (2079 of 2338) PASS: lldb-shell :: SymbolFile/DWARF/x86/dir-separator-no-comp-dir.s (2080 of 2338) PASS: lldb-api :: commands/target/create-deps/TestTargetCreateDeps.py (2081 of 2338) PASS: lldb-unit :: SymbolFile/DWARF/./SymbolFileDWARFTests/SymbolFileDWARFTests.ParseAranges (2082 of 2338) PASS: lldb-api :: lang/cpp/bool/TestCPPBool.py (2083 of 2338) PASS: lldb-shell :: SymbolFile/NativePDB/ast-functions.cpp (2084 of 2338) UNSUPPORTED: lldb-shell :: SymbolFile/NativePDB/ast-functions-msvc.cpp (2085 of 2338) PASS: lldb-unit :: Process/Utility/./ProcessUtilityTests/ProcSMapTests/LinuxProcSMapsTestFixture.ParseSMapRegions/7 (2086 of 2338) PASS: lldb-api :: macosx/queues/TestQueues.py (2087 of 2338) PASS: lldb-unit :: Utility/./UtilityTests/RecordReplayTest.ValidSequence (2088 of 2338) PASS: lldb-api :: functionalities/data-formatter/format-propagation/TestFormatPropagation.py (2089 of 2338) PASS: lldb-unit :: Expression/./ExpressionTests/DWARFExpression.DW_OP_piece (2090 of 2338) PASS: lldb-unit :: Utility/./UtilityTests/FileSpecTest.GetPath (2091 of 2338) PASS: lldb-unit :: SymbolFile/DWARF/./SymbolFileDWARFTests/SymbolFileDWARFTests.ParseArangesWithMultipleTerminators (2092 of 2338) PASS: lldb-api :: lang/cpp/llvm-style/TestLLVMStyle.py (2093 of 2338) PASS: lldb-api :: lang/c/stepping/TestThreadStepping.py (2094 of 2338) PASS: lldb-shell :: SymbolFile/DWARF/deterministic-build.cpp (2095 of 2338) PASS: lldb-api :: commands/frame/diagnose/complicated-expression/TestComplicatedExpression.py (2096 of 2338) PASS: lldb-api :: functionalities/data-formatter/type_summary_list_script/TestTypeSummaryListScript.py (2097 of 2338) UNSUPPORTED: lldb-api :: functionalities/data-formatter/data-formatter-stl/libstdcpp/list/TestDataFormatterStdList.py (2098 of 2338) PASS: lldb-unit :: Process/gdb-remote/./ProcessGdbRemoteTests/GDBRemoteCommunicationClientTest.SyncThreadState (2099 of 2338) PASS: lldb-unit :: Utility/./UtilityTests/ArgsTest.TestOverwriteArgs (2100 of 2338) PASS: lldb-unit :: SymbolFile/NativePDB/./SymbolFileNativePDBTests/PDBFPOProgramToDWARFExpressionTests.InvalidOpUnary (2101 of 2338) PASS: lldb-unit :: ObjectFile/ELF/./ObjectFileELFTests/ObjectFileELFTest.SectionsResolveConsistently (2102 of 2338) UNSUPPORTED: lldb-api :: tools/lldb-server/registers-target-xml-reading/TestGdbRemoteTargetXmlPacket.py (2103 of 2338) UNSUPPORTED: lldb-api :: lang/objc/objc-dynamic-value/TestObjCDynamicValue.py (2104 of 2338) PASS: lldb-api :: lang/objcxx/cxx-bridged-po/TestObjCXXBridgedPO.py (2105 of 2338) PASS: lldb-api :: commands/expression/import-std-module/forward_list-dbg-info-content/TestDbgInfoContentForwardListFromStdModule.py (2106 of 2338) PASS: lldb-api :: commands/expression/test/TestExprs2.py (2107 of 2338) UNSUPPORTED: lldb-shell :: ScriptInterpreter/Lua/breakpoint_function_callback.test (2108 of 2338) PASS: lldb-shell :: SymbolFile/NativePDB/break-by-function.cpp (2109 of 2338) PASS: lldb-unit :: Utility/./UtilityTests/BinaryStreamTest.PutSLEB128FourBytes (2110 of 2338) PASS: lldb-api :: python_api/target/TestTargetAPI.py (2111 of 2338) PASS: lldb-shell :: Commands/command-stop-hook-output.test (2112 of 2338) PASS: lldb-unit :: Utility/./UtilityTests/ReproducerTest.SetCapture (2113 of 2338) PASS: lldb-unit :: DataFormatter/./LLDBFormatterTests/TypeMatcherTests.GetMatchStringRegex (2114 of 2338) PASS: lldb-unit :: Process/minidump/./LLDBMinidumpTests/MinidumpParserTest.MinidumpDuplicateModuleMappedSecondHigh (2115 of 2338) PASS: lldb-api :: functionalities/data-formatter/ostypeformatting/TestFormattersOsType.py (2116 of 2338) PASS: lldb-api :: lang/objcxx/objc-builtin-types/TestObjCBuiltinTypes.py (2117 of 2338) PASS: lldb-unit :: Process/gdb-remote/./ProcessGdbRemoteTests/GDBRemoteClientBaseTest.SendContinueDelegateStructuredDataReceipt (2118 of 2338) PASS: lldb-api :: functionalities/history/TestHistoryRecall.py (2119 of 2338) PASS: lldb-api :: functionalities/data-formatter/data-formatter-enum-format/TestDataFormatterEnumFormat.py (2120 of 2338) UNSUPPORTED: lldb-shell :: SymbolFile/PDB/type-quals.test (2121 of 2338) PASS: lldb-unit :: Instruction/./EmulatorTests/TestAArch64Emulator.TestOverflow (2122 of 2338) PASS: lldb-unit :: Language/Highlighting/./HighlighterTests/HighlighterTest.Keywords (2123 of 2338) PASS: lldb-unit :: Process/minidump/./LLDBMinidumpTests/MinidumpParserTest.GetMemoryRegionInfoLinuxMaps (2124 of 2338) PASS: lldb-shell :: Register/Core/x86-32-freebsd-fp.test (2125 of 2338) PASS: lldb-unit :: Process/minidump/./LLDBMinidumpTests/MinidumpParserTest.GetPidWindows (2126 of 2338) PASS: lldb-api :: commands/expression/scoped_enums/TestScopedEnumType.py (2127 of 2338) PASS: lldb-api :: functionalities/inferior-crashing/recursive-inferior/TestRecursiveInferiorStep.py (2128 of 2338) PASS: lldb-shell :: Settings/TestEchoCommands.test (2129 of 2338) PASS: lldb-unit :: Utility/./UtilityTests/StringExtractorTest.DecodeHexU8_Extra (2130 of 2338) PASS: lldb-unit :: Utility/./UtilityTests/Flags.AllClear (2131 of 2338) PASS: lldb-api :: functionalities/value_md5_crash/TestValueMD5Crash.py (2132 of 2338) PASS: lldb-api :: functionalities/data-formatter/data-formatter-stl/libcxx/shared_ptr/TestDataFormatterLibcxxSharedPtr.py (2133 of 2338) PASS: lldb-unit :: Utility/./UtilityTests/StreamTest.PutHex32ByteOrderBig (2134 of 2338) PASS: lldb-unit :: Language/Highlighting/./HighlighterTests/HighlighterTest.ClangTrailingBackslashMissingNewLine (2135 of 2338) PASS: lldb-shell :: ScriptInterpreter/Python/fail_breakpoint_oneline.test (2136 of 2338) PASS: lldb-unit :: Utility/./UtilityTests/BinaryStreamTest.PutSLEB128OneByte (2137 of 2338) UNSUPPORTED: lldb-shell :: Register/x86-ymm-read.test (2138 of 2338) PASS: lldb-unit :: Utility/./UtilityTests/RangeTest.LessThan (2139 of 2338) PASS: lldb-unit :: Language/Highlighting/./HighlighterTests/HighlighterTest.ClangSquareBrackets (2140 of 2338) UNSUPPORTED: lldb-api :: functionalities/breakpoint/hardware_breakpoints/write_memory_with_hw_breakpoint/TestWriteMemoryWithHWBreakpoint.py (2141 of 2338) PASS: lldb-unit :: Language/Highlighting/./HighlighterTests/HighlighterTest.ClangBraces (2142 of 2338) UNSUPPORTED: lldb-shell :: Register/x86-ymm-write.test (2143 of 2338) UNSUPPORTED: lldb-api :: android/platform/TestDefaultCacheLineSize.py (2144 of 2338) PASS: lldb-shell :: SymbolFile/DWARF/x86/debug_aranges-empty-section.s (2145 of 2338) PASS: lldb-unit :: Process/gdb-remote/./ProcessGdbRemoteTests/GDBRemoteClientBaseTest.SendContinueAndInterrupt2PacketBug (2146 of 2338) PASS: lldb-unit :: Host/./HostTests/SocketTests/SocketTest.TCPGetAddress/ipv4 (2147 of 2338) PASS: lldb-api :: functionalities/breakpoint/address_breakpoints/TestAddressBreakpoints.py (2148 of 2338) PASS: lldb-api :: functionalities/data-formatter/data-formatter-stl/libcxx/list/TestDataFormatterLibcxxList.py (2149 of 2338) PASS: lldb-unit :: Utility/./UtilityTests/ArgsTest.GetArgumentArrayRef (2150 of 2338) PASS: lldb-api :: functionalities/unwind/sigtramp/TestSigtrampUnwind.py (2151 of 2338) PASS: lldb-shell :: ObjectFile/PECOFF/disassemble-thumb.yaml (2152 of 2338) PASS: lldb-unit :: UnwindAssembly/x86/./UnwindAssemblyx86Tests/Testx86AssemblyInspectionEngine.TestPushEDX (2153 of 2338) PASS: lldb-unit :: Utility/./UtilityTests/StreamTest.PutRawBytesToMixedEndian (2154 of 2338) PASS: lldb-shell :: Minidump/Windows/Sigsegv/sigsegv.test (2155 of 2338) PASS: lldb-api :: commands/command/nested_alias/TestNestedAlias.py (2156 of 2338) PASS: lldb-unit :: Utility/./UtilityTests/StringListTest.InsertStringAtIndexMove (2157 of 2338) PASS: lldb-shell :: ScriptInterpreter/Python/Crashlog/parser_text.test (2158 of 2338) PASS: lldb-shell :: SymbolFile/DWARF/x86/DW_TAG_basic_type_DW_ATE_UTF_nonC.ll (2159 of 2338) PASS: lldb-unit :: Process/gdb-remote/./ProcessGdbRemoteTests/GDBRemoteCommunicationClientTest.SendTraceSupportedPacket (2160 of 2338) PASS: lldb-api :: functionalities/data-formatter/refpointer-recursion/TestDataFormatterRefPtrRecursion.py (2161 of 2338) PASS: lldb-unit :: Symbol/./SymbolTests/SymbolsTest.TerminateLocateExecutableSymbolFileForUnknownExecutableAndUnknownSymbolFile (2162 of 2338) PASS: lldb-unit :: SymbolFile/NativePDB/./SymbolFileNativePDBTests/PDBFPOProgramToDWARFExpressionTests.UnresolvedDependentCyclicRegisterAssignmentReference (2163 of 2338) PASS: lldb-api :: functionalities/multidebugger_commands/TestMultipleDebuggersCommands.py (2164 of 2338) PASS: lldb-unit :: Utility/./UtilityTests/BroadcasterTest.BroadcastEvent (2165 of 2338) PASS: lldb-unit :: Target/./TargetTests/ModuleCacheTest.GetAndPutUuidExists (2166 of 2338) PASS: lldb-api :: lang/objc/objc-stepping/TestObjCStepping.py (2167 of 2338) PASS: lldb-api :: terminal/TestSTTYBeforeAndAfter.py (2168 of 2338) PASS: lldb-unit :: Utility/./UtilityTests/ScalarTest.GetBytes (2169 of 2338) PASS: lldb-unit :: Utility/./UtilityTests/RangeTest.SizeTypes (2170 of 2338) PASS: lldb-shell :: Commands/CommandScriptImmediateOutput/CommandScriptImmediateOutputConsole.test (2171 of 2338) PASS: lldb-api :: functionalities/thread/state_after_expression/TestStateAfterExpression.py (2172 of 2338) PASS: lldb-api :: commands/command/script/TestCommandScript.py (2173 of 2338) PASS: lldb-unit :: Core/./LLDBCoreTests/CommunicationTest.SynchronizeWhileClosing (2174 of 2338) PASS: lldb-unit :: Utility/./UtilityTests/XcodeSDKTest.FindXcodeContentsDirectoryInPath (2175 of 2338) PASS: lldb-api :: commands/expression/persistent_types/TestPersistentTypes.py (2176 of 2338) PASS: lldb-unit :: Utility/./UtilityTests/ScalarTest.SetValueFromCString (2177 of 2338) PASS: lldb-shell :: Subprocess/fork-follow-parent.test (2178 of 2338) PASS: lldb-unit :: Host/./HostTests/FileSystemTest.GetPermissions (2179 of 2338) PASS: lldb-api :: python_api/sbvalue_const_addrof/TestSBValueConstAddrOf.py (2180 of 2338) PASS: lldb-api :: driver/batch_mode/TestBatchMode.py (2181 of 2338) PASS: lldb-unit :: Utility/./UtilityTests/LogChannelTest.List (2182 of 2338) PASS: lldb-shell :: Reproducer/TestDSYM.test (2183 of 2338) PASS: lldb-api :: python_api/function_symbol/TestDisasmAPI.py (2184 of 2338) PASS: lldb-api :: functionalities/data-formatter/data-formatter-stl/libcxx/vbool/TestDataFormatterLibcxxVBool.py (2185 of 2338) PASS: lldb-unit :: Utility/./UtilityTests/ArgsTest.TestSingleQuotedArgWithSpace (2186 of 2338) PASS: lldb-api :: lang/c/unions/TestUnionMembers.py (2187 of 2338) PASS: lldb-api :: commands/expression/namespace_local_var_same_name_obj_c/TestNamespaceLocalVarSameNameObjC.py (2188 of 2338) PASS: lldb-api :: functionalities/thread/concurrent_events/TestConcurrentManyCrash.py (2189 of 2338) PASS: lldb-api :: commands/command/script/import/TestImport.py (2190 of 2338) PASS: lldb-unit :: Utility/./UtilityTests/NameMatchesTest.RegularExpression (2191 of 2338) UNSUPPORTED: lldb-api :: functionalities/breakpoint/hardware_breakpoints/hardware_breakpoint_on_multiple_threads/TestHWBreakMultiThread.py (2192 of 2338) PASS: lldb-shell :: SymbolFile/DWARF/x86/win-i386-line-table.s (2193 of 2338) PASS: lldb-unit :: DataFormatter/./LLDBFormatterTests/TypeMatcherTests.CreatedBySameMatchString (2194 of 2338) UNSUPPORTED: lldb-api :: arm/breakpoint-thumb-codesection/TestBreakpointThumbCodesection.py (2195 of 2338) UNSUPPORTED: lldb-api :: functionalities/darwin_log/format/TestDarwinLogMessageFormat.py (2196 of 2338) PASS: lldb-api :: lang/cpp/unsigned_types/TestUnsignedTypes.py (2197 of 2338) PASS: lldb-api :: commands/expression/import-std-module/array/TestArrayFromStdModule.py (2198 of 2338) PASS: lldb-unit :: Process/gdb-remote/./ProcessGdbRemoteTests/GDBRemoteClientBaseTest.SendContinueAndAsyncSignal (2199 of 2338) PASS: lldb-unit :: Process/Utility/./ProcessUtilityTests/ProcSMapTests/LinuxProcSMapsTestFixture.ParseSMapRegions/8 (2200 of 2338) UNSUPPORTED: lldb-api :: tools/lldb-server/TestGdbRemoteFork.py (2201 of 2338) PASS: lldb-api :: functionalities/thread/backtrace_all/TestBacktraceAll.py (2202 of 2338) PASS: lldb-api :: functionalities/signal/TestSendSignal.py (2203 of 2338) UNSUPPORTED: lldb-api :: functionalities/data-formatter/data-formatter-stl/libstdcpp/string/TestDataFormatterStdString.py (2204 of 2338) PASS: lldb-unit :: Utility/./UtilityTests/StringListTest.PopBack (2205 of 2338) PASS: lldb-api :: python_api/value/TestValueAPI.py (2206 of 2338) PASS: lldb-unit :: Process/Utility/./ProcessUtilityTests/ProcSMapTests/LinuxProcSMapsTestFixture.ParseSMapRegions/3 (2207 of 2338) PASS: lldb-api :: functionalities/data-formatter/data-formatter-stl/libcxx/atomic/TestLibCxxAtomic.py (2208 of 2338) PASS: lldb-unit :: Symbol/./SymbolTests/TestClangASTImporter.DeportTypeTagDecl (2209 of 2338) PASS: lldb-unit :: UnwindAssembly/x86/./UnwindAssemblyx86Tests/Testx86AssemblyInspectionEngine.TestPopEBP (2210 of 2338) PASS: lldb-unit :: Utility/./UtilityTests/ArgsTest.ReplaceArgumentAtIndexLonger (2211 of 2338) PASS: lldb-api :: commands/expression/radar_8638051/Test8638051.py (2212 of 2338) PASS: lldb-api :: functionalities/data-formatter/cstring-utf8-summary/TestCstringUnicode.py (2213 of 2338) PASS: lldb-api :: tools/lldb-vscode/runInTerminal/TestVSCode_runInTerminal.py (2214 of 2338) PASS: lldb-unit :: Process/./ProcessEventDataTests/ProcessEventDataTest.ShouldStop (2215 of 2338) PASS: lldb-shell :: SymbolFile/DWARF/x86/debug_loclists-dwo.s (2216 of 2338) PASS: lldb-unit :: Utility/./UtilityTests/OptionsWithRawTest.ArgsButNoDelimiter (2217 of 2338) PASS: lldb-unit :: Utility/./UtilityTests/ConstStringTest.NullAndEmptyStates (2218 of 2338) PASS: lldb-unit :: Utility/./UtilityTests/SerializationRountripTest.SerializeDeserializeCStringArray (2219 of 2338) UNSUPPORTED: lldb-shell :: Register/x86-64-gp-write.test (2220 of 2338) PASS: lldb-unit :: Host/./HostTests/MainLoopTest.TwoSignalCallbacks (2221 of 2338) PASS: lldb-unit :: Process/minidump/./LLDBMinidumpTests/MinidumpParserTest.GetPidWow64 (2222 of 2338) PASS: lldb-unit :: ScriptInterpreter/Python/./ScriptInterpreterPythonTests/PythonDataObjectsTest.TestCallable (2223 of 2338) PASS: lldb-unit :: Utility/./UtilityTests/StringLexerTest.HasAtLeast (2224 of 2338) PASS: lldb-shell :: Reproducer/Modules/TestModuleCXX.test (2225 of 2338) UNSUPPORTED: lldb-shell :: Unwind/eh-frame-small-fde.test (2226 of 2338) PASS: lldb-api :: functionalities/avoids-fd-leak/TestFdLeak.py (2227 of 2338) PASS: lldb-unit :: Utility/./UtilityTests/StreamTeeTest.Flush (2228 of 2338) PASS: lldb-api :: lang/cpp/template-arguments/TestCppTemplateArguments.py (2229 of 2338) PASS: lldb-api :: functionalities/thread/num_threads/TestNumThreads.py (2230 of 2338) PASS: lldb-api :: lang/c/shared_lib/TestSharedLib.py (2231 of 2338) PASS: lldb-unit :: Host/./HostTests/SocketTests/SocketTest.TCPGetAddress/ipv6 (2232 of 2338) PASS: lldb-api :: functionalities/data-formatter/language_category_updates/TestDataFormatterLanguageCategoryUpdates.py (2233 of 2338) PASS: lldb-unit :: UnwindAssembly/x86/./UnwindAssemblyx86Tests/Testx86AssemblyInspectionEngine.TestPopR12 (2234 of 2338) PASS: lldb-unit :: Symbol/./SymbolTests/TestClangASTImporter.CompleteFwdDeclWithOtherOrigin (2235 of 2338) PASS: lldb-unit :: Symbol/./SymbolTests/TestTypeSystemClang.TestDisplayName (2236 of 2338) PASS: lldb-shell :: ObjectFile/ELF/netbsd-exec-8.99.30-amd64.yaml (2237 of 2338) PASS: lldb-unit :: Utility/./UtilityTests/StringListTest.RemoveBlankLines (2238 of 2338) PASS: lldb-unit :: Core/./LLDBCoreTests/SourceLocationSpecTest.OperatorBool (2239 of 2338) PASS: lldb-api :: commands/watchpoints/multiple_threads/TestWatchpointMultipleThreads.py (2240 of 2338) PASS: lldb-api :: commands/command/script_alias/TestCommandScriptAlias.py (2241 of 2338) PASS: lldb-shell :: SymbolFile/DWARF/x86/DW_AT_const_value-bitfields.s (2242 of 2338) PASS: lldb-api :: lang/objc/bitfield_ivars/TestBitfieldIvars.py (2243 of 2338) PASS: lldb-api :: functionalities/breakpoint/address_breakpoints/TestBadAddressBreakpoints.py (2244 of 2338) PASS: lldb-api :: tools/lldb-server/TestAppleSimulatorOSType.py (2245 of 2338) PASS: lldb-unit :: SymbolFile/DWARF/./SymbolFileDWARFTests/DWARFUnitTest.MissingSentinel (2246 of 2338) PASS: lldb-unit :: ObjectFile/Breakpad/./ObjectFileBreakpadTests/StackCFIRecord.parse (2247 of 2338) PASS: lldb-api :: commands/expression/import-std-module/weak_ptr-dbg-info-content/TestDbgInfoContentWeakPtrFromStdModule.py (2248 of 2338) PASS: lldb-unit :: Utility/./UtilityTests/StringListTest.JoinThree (2249 of 2338) PASS: lldb-api :: functionalities/thread/concurrent_events/TestConcurrentNWatchNBreak.py (2250 of 2338) PASS: lldb-unit :: ScriptInterpreter/Python/./ScriptInterpreterPythonTests/PythonDataObjectsTest.TestObjectAttributes (2251 of 2338) PASS: lldb-api :: lang/c/blocks/TestBlocks.py (2252 of 2338) PASS: lldb-shell :: Minidump/no-process-id.yaml (2253 of 2338) PASS: lldb-unit :: Utility/./UtilityTests/StreamTest.AddressRangeSize (2254 of 2338) PASS: lldb-shell :: Breakpoint/debug_rnglist_offset_pair.test (2255 of 2338) UNSUPPORTED: lldb-shell :: ScriptInterpreter/Lua/bindings.test (2256 of 2338) PASS: lldb-api :: functionalities/testid/TestTestId.py (2257 of 2338) PASS: lldb-unit :: ObjectFile/Breakpad/./ObjectFileBreakpadTests/PublicRecord.parse (2258 of 2338) PASS: lldb-api :: functionalities/gdb_remote_client/TestNoWatchpointSupportInfo.py (2259 of 2338) PASS: lldb-unit :: UnwindAssembly/x86/./UnwindAssemblyx86Tests/Testx86AssemblyInspectionEngine.TestCALLNextInsn (2260 of 2338) PASS: lldb-unit :: Core/./LLDBCoreTests/SourceLocationSpecTest.Equal (2261 of 2338) PASS: lldb-unit :: ObjectFile/ELF/./ObjectFileELFTests/ObjectFileELFTest.GetSymtab_NoSymEntryPointArmThumbAddressClass (2262 of 2338) PASS: lldb-api :: lang/objc/modules-app-update/TestClangModulesAppUpdate.py (2263 of 2338) PASS: lldb-unit :: Breakpoint/./LLDBBreakpointTests/BreakpointIDTest.StringIsBreakpointName (2264 of 2338) PASS: lldb-api :: commands/expression/result_numbering/TestResultNumbering.py (2265 of 2338) UNSUPPORTED: lldb-api :: functionalities/darwin_log/filter/regex/activity/TestDarwinLogFilterRegexActivity.py (2266 of 2338) PASS: lldb-api :: functionalities/data-formatter/data-formatter-stl/libcxx/variant/TestDataFormatterLibcxxVariant.py (2267 of 2338) PASS: lldb-shell :: ObjectFile/PECOFF/basic-info-arm64.yaml (2268 of 2338) PASS: lldb-shell :: Register/x86-multithread-read.test (2269 of 2338) PASS: lldb-api :: functionalities/thread/concurrent_events/TestConcurrentCrashWithSignal.py (2270 of 2338) PASS: lldb-api :: functionalities/gdb_remote_client/TestRestartBug.py (2271 of 2338) PASS: lldb-unit :: Process/minidump/./LLDBMinidumpTests/MinidumpParserTest.GetThreadContext_x86_32_wow64 (2272 of 2338) PASS: lldb-shell :: ObjectFile/ELF/eh_frame-symbols.yaml (2273 of 2338) PASS: lldb-api :: python_api/formatters/TestFormattersSBAPI.py (2274 of 2338) PASS: lldb-api :: commands/expression/import-std-module/weak_ptr/TestWeakPtrFromStdModule.py (2275 of 2338) PASS: lldb-unit :: Platform/./LLDBPlatformTests/PlatformAppleSimulatorTest.TestSimHasSimEnvionament (2276 of 2338) UNSUPPORTED: lldb-shell :: SymbolFile/NativePDB/stack_unwinding01.cpp (2277 of 2338) PASS: lldb-unit :: Utility/./UtilityTests/ScalarTest.LongLongAssigmentOperator (2278 of 2338) PASS: lldb-shell :: SymbolFile/DWARF/x86/limit-debug-info.s (2279 of 2338) PASS: lldb-unit :: Symbol/./SymbolTests/SymbolsTest.LocateExecutableSymbolFileForUnknownExecutableAndMissingSymbolFile (2280 of 2338) PASS: lldb-unit :: Utility/./UtilityTests/CompletionRequest.TryCompleteCurrentArgGood (2281 of 2338) PASS: lldb-unit :: Utility/./UtilityTests/StringExtractorGDBRemoteTest.GetPidTid (2282 of 2338) PASS: lldb-api :: lang/c/local_types/TestUseClosestType.py (2283 of 2338) PASS: lldb-unit :: Disassembler/./DisassemblerTests/TestArm64Disassembly.TestArmv81Instruction (2284 of 2338) PASS: lldb-unit :: Utility/./UtilityTests/ArgsTest.TestUnknownEscape (2285 of 2338) PASS: lldb-api :: lang/cpp/operator-overload/TestOperatorOverload.py (2286 of 2338) PASS: lldb-shell :: Settings/TestFrameFormatColor.test (2287 of 2338) PASS: lldb-shell :: SymbolFile/NativePDB/function-types-calling-conv.cpp (2288 of 2338) PASS: lldb-api :: commands/process/attach/attach_denied/TestAttachDenied.py (2289 of 2338) PASS: lldb-unit :: Process/gdb-remote/./ProcessGdbRemoteTests/GDBRemoteCommunicationClientTest.ReadRegister (2290 of 2338) PASS: lldb-unit :: Utility/./UtilityTests/SerializationRountripTest.SerializeDeserializeCStringArrayNullptrElem (2291 of 2338) PASS: lldb-api :: functionalities/asan/TestReportData.py (2292 of 2338) PASS: lldb-unit :: Utility/./UtilityTests/StringListTest.GetMaxStringLengthEmpty (2293 of 2338) PASS: lldb-unit :: Utility/./UtilityTests/StringExtractorTest.GetHexU8_InvalidHex (2294 of 2338) PASS: lldb-unit :: Utility/./UtilityTests/UriParserTest.BracketedHostnameWithColon (2295 of 2338) PASS: lldb-unit :: Core/./LLDBCoreTests/DumpDataExtractorTest.StartOffset (2296 of 2338) PASS: lldb-unit :: Core/./LLDBCoreTests/ModuleSpecTest.TestELFFile (2297 of 2338) PASS: lldb-api :: lang/objc/print-obj/TestPrintObj.py (2298 of 2338) PASS: lldb-api :: commands/expression/two-files/TestObjCTypeQueryFromOtherCompileUnit.py (2299 of 2338) PASS: lldb-unit :: Expression/./ExpressionTests/CppModuleConfigurationTest.Linux (2300 of 2338) PASS: lldb-api :: commands/expression/call-function/TestCallStopAndContinue.py (2301 of 2338) UNSUPPORTED: lldb-shell :: ScriptInterpreter/Lua/lua.test (2302 of 2338) PASS: lldb-unit :: Host/./HostTests/HostInfoTest.GetAugmentedArchSpec (2303 of 2338) PASS: lldb-unit :: Utility/./UtilityTests/BinaryStreamTest.PutSLEB128TwoBytes (2304 of 2338) UNSUPPORTED: lldb-api :: functionalities/darwin_log/filter/exact_match/activity/TestDarwinLogFilterMatchActivity.py (2305 of 2338) UNSUPPORTED: lldb-shell :: SymbolFile/PDB/compilands.test (2306 of 2338) PASS: lldb-api :: api/log/TestAPILog.py (2307 of 2338) PASS: lldb-api :: commands/frame/select/TestFrameSelect.py (2308 of 2338) PASS: lldb-unit :: Utility/./UtilityTests/StreamTeeTest.Constructor1Stream (2309 of 2338) PASS: lldb-api :: commands/expression/vector_of_enums/TestVectorOfEnums.py (2310 of 2338) PASS: lldb-unit :: Host/./HostTests/NativeProcessProtocolTest.ReadCStringFromMemory (2311 of 2338) PASS: lldb-unit :: Host/./HostTests/FileSystemTest.Readable (2312 of 2338) PASS: lldb-api :: tools/lldb-server/TestGdbRemoteRegisterState.py (2313 of 2338) PASS: lldb-unit :: Utility/./UtilityTests/StreamTest.PutHex16ByteOrderLittle (2314 of 2338) PASS: lldb-api :: lang/cpp/dynamic-value-same-basename/TestDynamicValueSameBase.py (2315 of 2338) PASS: lldb-api :: functionalities/asan/TestMemoryHistory.py (2316 of 2338) PASS: lldb-unit :: Utility/./UtilityTests/RecordReplayTest.InstrumentedBar (2317 of 2338) PASS: lldb-api :: lang/cpp/template/TestTemplateArgs.py (2318 of 2338) PASS: lldb-unit :: Process/Utility/./ProcessUtilityTests/ProcMapTests/LinuxProcMapsTestFixture.ParseMapRegions/8 (2319 of 2338) PASS: lldb-shell :: SymbolFile/DWARF/x86/debug-types-basic.test (2320 of 2338) PASS: lldb-api :: lang/cpp/limit-debug-info/TestWithLimitDebugInfo.py (2321 of 2338) PASS: lldb-api :: lang/cpp/global_operators/TestCppGlobalOperators.py (2322 of 2338) PASS: lldb-api :: lang/cpp/operators/TestCppOperators.py (2323 of 2338) PASS: lldb-api :: functionalities/breakpoint/step_over_breakpoint/TestStepOverBreakpoint.py (2324 of 2338) PASS: lldb-api :: commands/frame/var/TestFrameVar.py (2325 of 2338) PASS: lldb-shell :: ObjectFile/ELF/section-types-edgecases.yaml (2326 of 2338) PASS: lldb-api :: python_api/interpreter/TestCommandInterpreterAPI.py (2327 of 2338) PASS: lldb-shell :: Driver/TestCommands.test (2328 of 2338) PASS: lldb-unit :: Symbol/./SymbolTests/LineEntryTest.GetSameLineContiguousAddressRangeOneInline (2329 of 2338) PASS: lldb-unit :: Utility/./UtilityTests/VMRange.IsValid (2330 of 2338) PASS: lldb-unit :: UnwindAssembly/x86/./UnwindAssemblyx86Tests/Testx86AssemblyInspectionEngine.TestPushR12 (2331 of 2338) PASS: lldb-api :: commands/thread/select/TestThreadSelect.py (2332 of 2338) PASS: lldb-unit :: Symbol/./SymbolTests/TestTypeSystemClang.TestNotDeletingUserCopyCstrDueToMoveCStr (2333 of 2338) PASS: lldb-api :: python_api/watchpoint/condition/TestWatchpointConditionAPI.py (2334 of 2338) PASS: lldb-unit :: Utility/./UtilityTests/StringListTest.LongestCommonPrefixSingleElement (2335 of 2338) PASS: lldb-api :: tools/lldb-server/commandline/TestStubSetSID.py (2336 of 2338) PASS: lldb-api :: lang/cpp/class-template-parameter-pack/TestClassTemplateParameterPack.py (2337 of 2338) PASS: lldb-api :: lang/objc/hidden-ivars/TestHiddenIvars.py (2338 of 2338) Slowest Tests: -------------------------------------------------------------------------- 83.12s: lldb-api :: tools/lldb-server/TestLldbGdbServer.py 75.22s: lldb-api :: api/multithreaded/TestMultithreaded.py 69.52s: lldb-api :: lang/objc/foundation/TestFoundationDisassembly.py 48.29s: lldb-api :: lang/objc/exceptions/TestObjCExceptions.py 45.96s: lldb-api :: functionalities/gdb_remote_client/TestIOSSimulator.py 45.02s: lldb-api :: lang/objc/objc-new-syntax/TestObjCNewSyntaxLiteral.py 44.13s: lldb-api :: tools/lldb-server/vCont-threads/TestGdbRemote_vContThreads.py 44.09s: lldb-api :: types/TestLongTypesExpr.py 38.54s: lldb-api :: functionalities/completion/TestCompletion.py 38.26s: lldb-api :: lang/objc/hidden-ivars/TestHiddenIvars.py 34.90s: lldb-api :: types/TestDoubleTypesExpr.py 34.07s: lldb-api :: functionalities/tsan/multiple/TestTsanMultiple.py 33.94s: lldb-api :: lang/cpp/namespace/TestNamespaceLookup.py 33.83s: lldb-api :: python_api/target/TestTargetAPI.py 33.67s: lldb-api :: tools/lldb-server/TestAppleSimulatorOSType.py 33.00s: lldb-api :: lang/objc/foundation/TestObjCMethods.py 32.98s: lldb-api :: lang/cpp/bitfields/TestCppBitfields.py 30.82s: lldb-api :: commands/target/basic/TestTargetCommand.py 29.59s: lldb-api :: tools/lldb-server/TestGdbRemoteThreadsInStopReply.py 27.55s: lldb-api :: functionalities/postmortem/mach-core/TestMachCore.py

Hide Details

Tests Times: -------------------------------------------------------------------------- [ Range ] :: [ Percentage ] :: [ Count ] -------------------------------------------------------------------------- [80.0s,85.0s) :: [ ] :: [ 1/2338] [75.0s,80.0s) :: [ ] :: [ 1/2338] [70.0s,75.0s) :: [ ] :: [ 1/2338] [65.0s,70.0s) :: [ ] :: [ 0/2338] [60.0s,65.0s) :: [ ] :: [ 0/2338] [55.0s,60.0s) :: [ ] :: [ 0/2338] [50.0s,55.0s) :: [ ] :: [ 0/2338] [45.0s,50.0s) :: [ ] :: [ 5/2338] [40.0s,45.0s) :: [ ] :: [ 0/2338] [35.0s,40.0s) :: [ ] :: [ 3/2338] [30.0s,35.0s) :: [ ] :: [ 8/2338] [25.0s,30.0s) :: [ ] :: [ 7/2338] [20.0s,25.0s) :: [ ] :: [ 14/2338] [15.0s,20.0s) :: [ ] :: [ 26/2338] [10.0s,15.0s) :: [* ] :: [ 83/2338] [ 5.0s,10.0s) :: [*** ] :: [ 192/2338] [ 0.0s, 5.0s) :: [********************************** ] :: [1997/2338] -------------------------------------------------------------------------- ******************** Failed Tests (1): lldb-api :: api/multiple-targets/TestMultipleTargets.py

Hide Details

Hide Details

Testing Time: 1428.22s Unsupported : 176 Passed : 2151 Expectedly Failed: 10 Failed : 1 FAILED: tools/lldb/test/CMakeFiles/check-lldb cd /Users/buildslave/jenkins/workspace/lldb-cmake/lldb-build/tools/lldb/test && /usr/local/Frameworks/Python.framework/Versions/3.7/bin/python3.7 /Users/buildslave/jenkins/workspace/lldb-cmake/lldb-build/./bin/llvm-lit -v --time-tests --shuffle --xunit-xml-output=/Users/buildslave/jenkins/workspace/lldb-cmake/test/results.xml -v -j 4 /Users/buildslave/jenkins/workspace/lldb-cmake/lldb-build/tools/lldb/test ninja: build stopped: cannot make progress due to previous errors. Command failed: Command '['/usr/bin/env', 'TERM=vt100', '/usr/local/bin/ninja', '-v', 'check-debuginfo', 'check-lldb', '-k2']' returned non-zero exit status 1 Command: ['/usr/bin/env', 'TERM=vt100', '/usr/local/bin/ninja', '-v', 'check-debuginfo', 'check-lldb', '-k2'] [Pipeline] } [Pipeline] // timeout [Pipeline] } [Pipeline] // stage [Pipeline] stage [Pipeline] { (Declarative: Post Actions) [Pipeline] scanForIssues [Clang (LLVM based)] Sleeping for 5 seconds due to JENKINS-32191... [Clang (LLVM based)] Parsing console log (workspace: '/Users/buildslave/jenkins/workspace/lldb-cmake') [Clang (LLVM based)] Successfully parsed console log [Clang (LLVM based)] -> found 0 issues (skipped 0 duplicates) [Clang (LLVM based)] Skipping post processing [Clang (LLVM based)] No filter has been set, publishing all 0 issues [Clang (LLVM based)] Repository miner is not configured, skipping repository mining [Pipeline] junit Recording test results [Checks API] No suitable checks publisher found. [Pipeline] emailext Warning: llvm-dev@redking.me.uk is not a recognized user, but sending mail anyway Warning: flo@fhahn.com is not a recognized user, but sending mail anyway Warning: llvm-dev@redking.me.uk is not a recognized user, but sending mail anyway Warning: flo@fhahn.com is not a recognized user, but sending mail anyway

Hide Details

Begin Pre-Send Script... Sending email to: llvm-dev@redking.me.uk flo@fhahn.com Akira Hatanaka <ahatanaka@apple.com> Azhar Mohammed <azhar@apple.com>
[Pipeline] } [Pipeline] // stage [Pipeline] } [Pipeline] // withEnv [Pipeline] } [Pipeline] // node [Pipeline] End of Pipeline ERROR: script returned exit code 1 Finished: FAILURE