FailedConsole Output

Skipping 6,998 KB.. Full Log
error: process exited with status -1 (tried to attach to process already being debugged)

Hide Details

Hide Details

Command 'run' failed!

Hide Details

FAIL: LLDB (/Users/buildslave/jenkins/workspace/lldb-cmake/lldb-build/bin/clang-x86_64) :: test_with_run_command_dsym (TestNamespace.NamespaceTestCase) <bound method SBProcess.Kill of <lldb.SBProcess; proxy of <Swig Object of type 'lldb::SBProcess *' at 0x104687b40> >>: success

Hide Details

runCmd: settings clear -all output:

Hide Details

runCmd: settings set symbols.enable-external-lookup false output:

Hide Details

runCmd: settings set target.inherit-tcc true output:

Hide Details

runCmd: settings set target.detach-on-error false output:

Hide Details

runCmd: settings set target.auto-apply-fixits false output:

Hide Details

runCmd: settings set plugin.process.gdb-remote.packet-timeout 60 output:

Hide Details

runCmd: settings set symbols.clang-modules-cache-path "/Users/buildslave/jenkins/workspace/lldb-cmake/lldb-build/lldb-test-build.noindex/module-cache-lldb/lldb-api" output:

Hide Details

runCmd: settings set use-color false output:

Hide Details

runCmd: setting set target.prefer-dynamic-value no-dynamic-values output:

Hide Details

runCmd: file /Users/buildslave/jenkins/workspace/lldb-cmake/lldb-build/lldb-test-build.noindex/lang/cpp/namespace/TestNamespace.test_with_run_command_dwarf/a.out output: Current executable set to '/Users/buildslave/jenkins/workspace/lldb-cmake/lldb-build/lldb-test-build.noindex/lang/cpp/namespace/TestNamespace.test_with_run_command_dwarf/a.out' (x86_64).

Hide Details

Hide Details

runCmd: breakpoint set -f "main.cpp" -l 79 output: Breakpoint 1: where = a.out`test_namespace_scopes() + 9 at main.cpp:79:37, address = 0x0000000100000789

Hide Details

Hide Details

Expecting pattern: ^Breakpoint (?P<bpno>[0-9]+): (?P<num_locations>[0-9]+) locations\.$ Not matched

Hide Details

Expecting pattern: ^Breakpoint (?P<bpno>[0-9]+): (?P<num_locations>no) locations \(pending\)\. Not matched

Hide Details

Expecting pattern: ^Breakpoint (?P<bpno>[0-9]+): where = (?P<module>.*)`(?P<symbol>[+\-]{0,1}[^+]+)( \+ (?P<offset>[0-9]+)){0,1}( \[inlined\] (?P<inline_symbol>.*)){0,1} at (?P<file>[^:]+):(?P<line_no>[0-9]+)(?P<column>(:[0-9]+)?), address = (?P<address>0x[0-9a-fA-F]+)$ Matched

Hide Details

runCmd: breakpoint set -f "main.cpp" -l 84 output: Breakpoint 2: where = a.out`test_namespace_scopes() + 34 at main.cpp:84:37, address = 0x00000001000007a2

Hide Details

Hide Details

Expecting pattern: ^Breakpoint (?P<bpno>[0-9]+): (?P<num_locations>[0-9]+) locations\.$ Not matched

Hide Details

Expecting pattern: ^Breakpoint (?P<bpno>[0-9]+): (?P<num_locations>no) locations \(pending\)\. Not matched

Hide Details

Expecting pattern: ^Breakpoint (?P<bpno>[0-9]+): where = (?P<module>.*)`(?P<symbol>[+\-]{0,1}[^+]+)( \+ (?P<offset>[0-9]+)){0,1}( \[inlined\] (?P<inline_symbol>.*)){0,1} at (?P<file>[^:]+):(?P<line_no>[0-9]+)(?P<column>(:[0-9]+)?), address = (?P<address>0x[0-9a-fA-F]+)$ Matched

Hide Details

runCmd: breakpoint set -f "main.cpp" -l 102 output: Breakpoint 3: where = a.out`A::B::myfunc(int) + 154 at main.cpp:102:12, address = 0x000000010000085a

Hide Details

Hide Details

Expecting pattern: ^Breakpoint (?P<bpno>[0-9]+): (?P<num_locations>[0-9]+) locations\.$ Not matched

Hide Details

Expecting pattern: ^Breakpoint (?P<bpno>[0-9]+): (?P<num_locations>no) locations \(pending\)\. Not matched

Hide Details

Expecting pattern: ^Breakpoint (?P<bpno>[0-9]+): where = (?P<module>.*)`(?P<symbol>[+\-]{0,1}[^+]+)( \+ (?P<offset>[0-9]+)){0,1}( \[inlined\] (?P<inline_symbol>.*)){0,1} at (?P<file>[^:]+):(?P<line_no>[0-9]+)(?P<column>(:[0-9]+)?), address = (?P<address>0x[0-9a-fA-F]+)$ Matched

Hide Details

runCmd: run runCmd failed! error: process exited with status -1 (tried to attach to process already being debugged)

Hide Details

Hide Details

Command 'run' failed!

Hide Details

FAIL: LLDB (/Users/buildslave/jenkins/workspace/lldb-cmake/lldb-build/bin/clang-x86_64) :: test_with_run_command_dwarf (TestNamespace.NamespaceTestCase) <bound method SBProcess.Kill of <lldb.SBProcess; proxy of <Swig Object of type 'lldb::SBProcess *' at 0x1043cf900> >>: success

Hide Details

UNSUPPORTED: LLDB (/Users/buildslave/jenkins/workspace/lldb-cmake/lldb-build/bin/clang-x86_64) :: test_with_run_command_dwo (TestNamespace.NamespaceTestCase) (test case does not fall in any category of interest for this run) runCmd: settings clear -all output:

Hide Details

runCmd: settings set symbols.enable-external-lookup false output:

Hide Details

runCmd: settings set target.inherit-tcc true output:

Hide Details

runCmd: settings set target.detach-on-error false output:

Hide Details

runCmd: settings set target.auto-apply-fixits false output:

Hide Details

runCmd: settings set plugin.process.gdb-remote.packet-timeout 60 output:

Hide Details

runCmd: settings set symbols.clang-modules-cache-path "/Users/buildslave/jenkins/workspace/lldb-cmake/lldb-build/lldb-test-build.noindex/module-cache-lldb/lldb-api" output:

Hide Details

runCmd: settings set use-color false output:

Hide Details

runCmd: setting set target.prefer-dynamic-value no-dynamic-values output:

Hide Details

runCmd: file /Users/buildslave/jenkins/workspace/lldb-cmake/lldb-build/lldb-test-build.noindex/lang/cpp/namespace/TestNamespace.test_with_run_command_gmodules/a.out output: Current executable set to '/Users/buildslave/jenkins/workspace/lldb-cmake/lldb-build/lldb-test-build.noindex/lang/cpp/namespace/TestNamespace.test_with_run_command_gmodules/a.out' (x86_64).

Hide Details

Hide Details

runCmd: breakpoint set -f "main.cpp" -l 79 output: Breakpoint 1: where = a.out`test_namespace_scopes() + 9 at main.cpp:79:37, address = 0x0000000100000789

Hide Details

Hide Details

Expecting pattern: ^Breakpoint (?P<bpno>[0-9]+): (?P<num_locations>[0-9]+) locations\.$ Not matched

Hide Details

Expecting pattern: ^Breakpoint (?P<bpno>[0-9]+): (?P<num_locations>no) locations \(pending\)\. Not matched

Hide Details

Expecting pattern: ^Breakpoint (?P<bpno>[0-9]+): where = (?P<module>.*)`(?P<symbol>[+\-]{0,1}[^+]+)( \+ (?P<offset>[0-9]+)){0,1}( \[inlined\] (?P<inline_symbol>.*)){0,1} at (?P<file>[^:]+):(?P<line_no>[0-9]+)(?P<column>(:[0-9]+)?), address = (?P<address>0x[0-9a-fA-F]+)$ Matched

Hide Details

runCmd: breakpoint set -f "main.cpp" -l 84 output: Breakpoint 2: where = a.out`test_namespace_scopes() + 34 at main.cpp:84:37, address = 0x00000001000007a2

Hide Details

Hide Details

Expecting pattern: ^Breakpoint (?P<bpno>[0-9]+): (?P<num_locations>[0-9]+) locations\.$ Not matched

Hide Details

Expecting pattern: ^Breakpoint (?P<bpno>[0-9]+): (?P<num_locations>no) locations \(pending\)\. Not matched

Hide Details

Expecting pattern: ^Breakpoint (?P<bpno>[0-9]+): where = (?P<module>.*)`(?P<symbol>[+\-]{0,1}[^+]+)( \+ (?P<offset>[0-9]+)){0,1}( \[inlined\] (?P<inline_symbol>.*)){0,1} at (?P<file>[^:]+):(?P<line_no>[0-9]+)(?P<column>(:[0-9]+)?), address = (?P<address>0x[0-9a-fA-F]+)$ Matched

Hide Details

runCmd: breakpoint set -f "main.cpp" -l 102 output: Breakpoint 3: where = a.out`A::B::myfunc(int) + 154 at main.cpp:102:12, address = 0x000000010000085a

Hide Details

Hide Details

Expecting pattern: ^Breakpoint (?P<bpno>[0-9]+): (?P<num_locations>[0-9]+) locations\.$ Not matched

Hide Details

Expecting pattern: ^Breakpoint (?P<bpno>[0-9]+): (?P<num_locations>no) locations \(pending\)\. Not matched

Hide Details

Expecting pattern: ^Breakpoint (?P<bpno>[0-9]+): where = (?P<module>.*)`(?P<symbol>[+\-]{0,1}[^+]+)( \+ (?P<offset>[0-9]+)){0,1}( \[inlined\] (?P<inline_symbol>.*)){0,1} at (?P<file>[^:]+):(?P<line_no>[0-9]+)(?P<column>(:[0-9]+)?), address = (?P<address>0x[0-9a-fA-F]+)$ Matched

Hide Details

runCmd: run runCmd failed! error: process exited with status -1 (tried to attach to process already being debugged)

Hide Details

Hide Details

Command 'run' failed!

Hide Details

FAIL: LLDB (/Users/buildslave/jenkins/workspace/lldb-cmake/lldb-build/bin/clang-x86_64) :: test_with_run_command_gmodules (TestNamespace.NamespaceTestCase) <bound method SBProcess.Kill of <lldb.SBProcess; proxy of <Swig Object of type 'lldb::SBProcess *' at 0x104687a50> >>: success

Hide Details

Restore dir to: /Users/buildslave/jenkins/workspace/lldb-cmake/lldb-build/tools/lldb/test ====================================================================== FAIL: test_with_run_command_dsym (TestNamespace.NamespaceTestCase) Test that anonymous and named namespace variables display correctly. ---------------------------------------------------------------------- Traceback (most recent call last): File "/Users/buildslave/jenkins/workspace/lldb-cmake/llvm-project/lldb/packages/Python/lldbsuite/test/lldbtest.py", line 1834, in test_method return attrvalue(self) File "/Users/buildslave/jenkins/workspace/lldb-cmake/llvm-project/lldb/packages/Python/lldbsuite/test/decorators.py", line 119, in wrapper func(*args, **kwargs) File "/Users/buildslave/jenkins/workspace/lldb-cmake/llvm-project/lldb/test/API/lang/cpp/namespace/TestNamespace.py", line 153, in test_with_run_command self.runToBkpt("run") File "/Users/buildslave/jenkins/workspace/lldb-cmake/llvm-project/lldb/test/API/lang/cpp/namespace/TestNamespace.py", line 121, in runToBkpt self.runCmd(command, RUN_SUCCEEDED) File "/Users/buildslave/jenkins/workspace/lldb-cmake/llvm-project/lldb/packages/Python/lldbsuite/test/lldbtest.py", line 2165, in runCmd msg if (msg) else CMD_MSG(cmd)) AssertionError: False is not True : Process is launched successfully Error output: error: process exited with status -1 (tried to attach to process already being debugged)

Hide Details

Config=x86_64-/Users/buildslave/jenkins/workspace/lldb-cmake/lldb-build/bin/clang ====================================================================== FAIL: test_with_run_command_dwarf (TestNamespace.NamespaceTestCase) Test that anonymous and named namespace variables display correctly. ---------------------------------------------------------------------- Traceback (most recent call last): File "/Users/buildslave/jenkins/workspace/lldb-cmake/llvm-project/lldb/packages/Python/lldbsuite/test/lldbtest.py", line 1834, in test_method return attrvalue(self) File "/Users/buildslave/jenkins/workspace/lldb-cmake/llvm-project/lldb/packages/Python/lldbsuite/test/decorators.py", line 119, in wrapper func(*args, **kwargs) File "/Users/buildslave/jenkins/workspace/lldb-cmake/llvm-project/lldb/test/API/lang/cpp/namespace/TestNamespace.py", line 153, in test_with_run_command self.runToBkpt("run") File "/Users/buildslave/jenkins/workspace/lldb-cmake/llvm-project/lldb/test/API/lang/cpp/namespace/TestNamespace.py", line 121, in runToBkpt self.runCmd(command, RUN_SUCCEEDED) File "/Users/buildslave/jenkins/workspace/lldb-cmake/llvm-project/lldb/packages/Python/lldbsuite/test/lldbtest.py", line 2165, in runCmd msg if (msg) else CMD_MSG(cmd)) AssertionError: False is not True : Process is launched successfully Error output: error: process exited with status -1 (tried to attach to process already being debugged)

Hide Details

Config=x86_64-/Users/buildslave/jenkins/workspace/lldb-cmake/lldb-build/bin/clang ====================================================================== FAIL: test_with_run_command_gmodules (TestNamespace.NamespaceTestCase) Test that anonymous and named namespace variables display correctly. ---------------------------------------------------------------------- Traceback (most recent call last): File "/Users/buildslave/jenkins/workspace/lldb-cmake/llvm-project/lldb/packages/Python/lldbsuite/test/lldbtest.py", line 1834, in test_method return attrvalue(self) File "/Users/buildslave/jenkins/workspace/lldb-cmake/llvm-project/lldb/packages/Python/lldbsuite/test/decorators.py", line 119, in wrapper func(*args, **kwargs) File "/Users/buildslave/jenkins/workspace/lldb-cmake/llvm-project/lldb/test/API/lang/cpp/namespace/TestNamespace.py", line 153, in test_with_run_command self.runToBkpt("run") File "/Users/buildslave/jenkins/workspace/lldb-cmake/llvm-project/lldb/test/API/lang/cpp/namespace/TestNamespace.py", line 121, in runToBkpt self.runCmd(command, RUN_SUCCEEDED) File "/Users/buildslave/jenkins/workspace/lldb-cmake/llvm-project/lldb/packages/Python/lldbsuite/test/lldbtest.py", line 2165, in runCmd msg if (msg) else CMD_MSG(cmd)) AssertionError: False is not True : Process is launched successfully Error output: error: process exited with status -1 (tried to attach to process already being debugged)

Hide Details

Config=x86_64-/Users/buildslave/jenkins/workspace/lldb-cmake/lldb-build/bin/clang ---------------------------------------------------------------------- Ran 16 tests in 102.239s

Hide Details

RESULT: FAILED (9 passes, 3 failures, 0 errors, 4 skipped, 0 expected failures, 0 unexpected successes)

Hide Details

--

Hide Details

******************** PASS: lldb-unit :: Process/minidump/./LLDBMinidumpTests/MinidumpParserTest.GetMemoryRegionInfoLinuxMaps (1214 of 2363) PASS: lldb-shell :: ObjectFile/ELF/gnu-debuglink.yaml (1215 of 2363) FAIL: lldb-api :: commands/expression/codegen-crash-import-def-arraytype-element/TestImportDefinitionArrayType.py (1216 of 2363) ******************** TEST 'lldb-api :: commands/expression/codegen-crash-import-def-arraytype-element/TestImportDefinitionArrayType.py' FAILED ******************** Script: -- /usr/local/Frameworks/Python.framework/Versions/3.7/bin/python3.7 /Users/buildslave/jenkins/workspace/lldb-cmake/llvm-project/lldb/test/API/dotest.py -u CXXFLAGS -u CFLAGS --codesign-identity - --arch x86_64 --build-dir /Users/buildslave/jenkins/workspace/lldb-cmake/lldb-build/lldb-test-build.noindex -t --env TERM=vt100 --env LLVM_LIBS_DIR=/Users/buildslave/jenkins/workspace/lldb-cmake/lldb-build/./lib --arch x86_64 --build-dir /Users/buildslave/jenkins/workspace/lldb-cmake/lldb-build/lldb-test-build.noindex --lldb-module-cache-dir /Users/buildslave/jenkins/workspace/lldb-cmake/lldb-build/lldb-test-build.noindex/module-cache-lldb/lldb-api --clang-module-cache-dir /Users/buildslave/jenkins/workspace/lldb-cmake/lldb-build/lldb-test-build.noindex/module-cache-clang/lldb-api --executable /Users/buildslave/jenkins/workspace/lldb-cmake/lldb-build/./bin/lldb --compiler /Users/buildslave/jenkins/workspace/lldb-cmake/lldb-build/./bin/clang --dsymutil /Users/buildslave/jenkins/workspace/lldb-cmake/lldb-build/./bin/dsymutil --llvm-tools-dir /Users/buildslave/jenkins/workspace/lldb-cmake/lldb-build/./bin --lldb-libs-dir /Users/buildslave/jenkins/workspace/lldb-cmake/lldb-build/./lib /Users/buildslave/jenkins/workspace/lldb-cmake/llvm-project/lldb/test/API/commands/expression/codegen-crash-import-def-arraytype-element -p TestImportDefinitionArrayType.py -- Exit Code: 1

Hide Details

Command Output (stdout): -- lldb version 13.0.99 (http://labmaster3.local/git/llvm-project.git revision ffb3277b0036909a8e622d5758a1e2850eabfd19) clang revision ffb3277b0036909a8e622d5758a1e2850eabfd19 llvm revision ffb3277b0036909a8e622d5758a1e2850eabfd19 Skipping the following test categories: ['libstdcxx', 'dwo', 'llgs', 'fork']

Hide Details

-- Command Output (stderr): -- Change dir to: /Users/buildslave/jenkins/workspace/lldb-cmake/llvm-project/lldb/test/API/commands/expression/codegen-crash-import-def-arraytype-element runCmd: settings clear -all output:

Hide Details

runCmd: settings set symbols.enable-external-lookup false output:

Hide Details

runCmd: settings set target.inherit-tcc true output:

Hide Details

runCmd: settings set target.detach-on-error false output:

Hide Details

runCmd: settings set target.auto-apply-fixits false output:

Hide Details

runCmd: settings set plugin.process.gdb-remote.packet-timeout 60 output:

Hide Details

runCmd: settings set symbols.clang-modules-cache-path "/Users/buildslave/jenkins/workspace/lldb-cmake/lldb-build/lldb-test-build.noindex/module-cache-lldb/lldb-api" output:

Hide Details

runCmd: settings set use-color false output:

Hide Details

runCmd: setting set target.prefer-dynamic-value no-dynamic-values output:

Hide Details

FAIL: LLDB (/Users/buildslave/jenkins/workspace/lldb-cmake/lldb-build/bin/clang-x86_64) :: test_dsym (TestImportDefinitionArrayType.TestImportDefinitionArrayType) <bound method SBProcess.Kill of <lldb.SBProcess; proxy of <Swig Object of type 'lldb::SBProcess *' at 0x10e63bd50> >>: success

Hide Details

runCmd: settings clear -all output:

Hide Details

runCmd: settings set symbols.enable-external-lookup false output:

Hide Details

runCmd: settings set target.inherit-tcc true output:

Hide Details

runCmd: settings set target.detach-on-error false output:

Hide Details

runCmd: settings set target.auto-apply-fixits false output:

Hide Details

runCmd: settings set plugin.process.gdb-remote.packet-timeout 60 output:

Hide Details

runCmd: settings set symbols.clang-modules-cache-path "/Users/buildslave/jenkins/workspace/lldb-cmake/lldb-build/lldb-test-build.noindex/module-cache-lldb/lldb-api" output:

Hide Details

runCmd: settings set use-color false output:

Hide Details

runCmd: setting set target.prefer-dynamic-value no-dynamic-values output:

Hide Details

FAIL: LLDB (/Users/buildslave/jenkins/workspace/lldb-cmake/lldb-build/bin/clang-x86_64) :: test_dwarf (TestImportDefinitionArrayType.TestImportDefinitionArrayType) <bound method SBProcess.Kill of <lldb.SBProcess; proxy of <Swig Object of type 'lldb::SBProcess *' at 0x105a909c0> >>: success

Hide Details

UNSUPPORTED: LLDB (/Users/buildslave/jenkins/workspace/lldb-cmake/lldb-build/bin/clang-x86_64) :: test_dwo (TestImportDefinitionArrayType.TestImportDefinitionArrayType) (test case does not fall in any category of interest for this run) runCmd: settings clear -all output:

Hide Details

runCmd: settings set symbols.enable-external-lookup false output:

Hide Details

runCmd: settings set target.inherit-tcc true output:

Hide Details

runCmd: settings set target.detach-on-error false output:

Hide Details

runCmd: settings set target.auto-apply-fixits false output:

Hide Details

runCmd: settings set plugin.process.gdb-remote.packet-timeout 60 output:

Hide Details

runCmd: settings set symbols.clang-modules-cache-path "/Users/buildslave/jenkins/workspace/lldb-cmake/lldb-build/lldb-test-build.noindex/module-cache-lldb/lldb-api" output:

Hide Details

runCmd: settings set use-color false output:

Hide Details

runCmd: setting set target.prefer-dynamic-value no-dynamic-values output:

Hide Details

<bound method SBProcess.Kill of <lldb.SBProcess; proxy of <Swig Object of type 'lldb::SBProcess *' at 0x10e08c480> >>: success

Hide Details

PASS: LLDB (/Users/buildslave/jenkins/workspace/lldb-cmake/lldb-build/bin/clang-x86_64) :: test_gmodules (TestImportDefinitionArrayType.TestImportDefinitionArrayType) Restore dir to: /Users/buildslave/jenkins/workspace/lldb-cmake/lldb-build/tools/lldb/test ====================================================================== FAIL: test_dsym (TestImportDefinitionArrayType.TestImportDefinitionArrayType) ---------------------------------------------------------------------- Traceback (most recent call last): File "/Users/buildslave/jenkins/workspace/lldb-cmake/llvm-project/lldb/packages/Python/lldbsuite/test/lldbtest.py", line 1834, in test_method return attrvalue(self) File "/Users/buildslave/jenkins/workspace/lldb-cmake/llvm-project/lldb/test/API/commands/expression/codegen-crash-import-def-arraytype-element/TestImportDefinitionArrayType.py", line 12, in test lldbutil.run_to_source_breakpoint(self, "// break here", lldb.SBFileSpec("main.cpp")) File "/Users/buildslave/jenkins/workspace/lldb-cmake/llvm-project/lldb/packages/Python/lldbsuite/test/lldbutil.py", line 971, in run_to_source_breakpoint only_one_thread, extra_images) File "/Users/buildslave/jenkins/workspace/lldb-cmake/llvm-project/lldb/packages/Python/lldbsuite/test/lldbutil.py", line 890, in run_to_breakpoint_do_run "Process launch failed: %s" % (error.GetCString())) AssertionError: True is not False : Process launch failed: process exited with status -1 (tried to attach to process already being debugged) Config=x86_64-/Users/buildslave/jenkins/workspace/lldb-cmake/lldb-build/bin/clang ====================================================================== FAIL: test_dwarf (TestImportDefinitionArrayType.TestImportDefinitionArrayType) ---------------------------------------------------------------------- Traceback (most recent call last): File "/Users/buildslave/jenkins/workspace/lldb-cmake/llvm-project/lldb/packages/Python/lldbsuite/test/lldbtest.py", line 1834, in test_method return attrvalue(self) File "/Users/buildslave/jenkins/workspace/lldb-cmake/llvm-project/lldb/test/API/commands/expression/codegen-crash-import-def-arraytype-element/TestImportDefinitionArrayType.py", line 12, in test lldbutil.run_to_source_breakpoint(self, "// break here", lldb.SBFileSpec("main.cpp")) File "/Users/buildslave/jenkins/workspace/lldb-cmake/llvm-project/lldb/packages/Python/lldbsuite/test/lldbutil.py", line 971, in run_to_source_breakpoint only_one_thread, extra_images) File "/Users/buildslave/jenkins/workspace/lldb-cmake/llvm-project/lldb/packages/Python/lldbsuite/test/lldbutil.py", line 890, in run_to_breakpoint_do_run "Process launch failed: %s" % (error.GetCString())) AssertionError: True is not False : Process launch failed: process exited with status -1 (tried to attach to process already being debugged) Config=x86_64-/Users/buildslave/jenkins/workspace/lldb-cmake/lldb-build/bin/clang ---------------------------------------------------------------------- Ran 4 tests in 86.423s

Hide Details

RESULT: FAILED (1 passes, 2 failures, 0 errors, 1 skipped, 0 expected failures, 0 unexpected successes)

Hide Details

--

Hide Details

******************** UNSUPPORTED: lldb-shell :: ObjectFile/ELF/minidebuginfo-no-lzma.yaml (1217 of 2363) FAIL: lldb-api :: functionalities/data-formatter/stringprinter/TestStringPrinter.py (1218 of 2363) ******************** TEST 'lldb-api :: functionalities/data-formatter/stringprinter/TestStringPrinter.py' FAILED ******************** Script: -- /usr/local/Frameworks/Python.framework/Versions/3.7/bin/python3.7 /Users/buildslave/jenkins/workspace/lldb-cmake/llvm-project/lldb/test/API/dotest.py -u CXXFLAGS -u CFLAGS --codesign-identity - --arch x86_64 --build-dir /Users/buildslave/jenkins/workspace/lldb-cmake/lldb-build/lldb-test-build.noindex -t --env TERM=vt100 --env LLVM_LIBS_DIR=/Users/buildslave/jenkins/workspace/lldb-cmake/lldb-build/./lib --arch x86_64 --build-dir /Users/buildslave/jenkins/workspace/lldb-cmake/lldb-build/lldb-test-build.noindex --lldb-module-cache-dir /Users/buildslave/jenkins/workspace/lldb-cmake/lldb-build/lldb-test-build.noindex/module-cache-lldb/lldb-api --clang-module-cache-dir /Users/buildslave/jenkins/workspace/lldb-cmake/lldb-build/lldb-test-build.noindex/module-cache-clang/lldb-api --executable /Users/buildslave/jenkins/workspace/lldb-cmake/lldb-build/./bin/lldb --compiler /Users/buildslave/jenkins/workspace/lldb-cmake/lldb-build/./bin/clang --dsymutil /Users/buildslave/jenkins/workspace/lldb-cmake/lldb-build/./bin/dsymutil --llvm-tools-dir /Users/buildslave/jenkins/workspace/lldb-cmake/lldb-build/./bin --lldb-libs-dir /Users/buildslave/jenkins/workspace/lldb-cmake/lldb-build/./lib /Users/buildslave/jenkins/workspace/lldb-cmake/llvm-project/lldb/test/API/functionalities/data-formatter/stringprinter -p TestStringPrinter.py -- Exit Code: 1

Hide Details

Command Output (stdout): -- lldb version 13.0.99 (http://labmaster3.local/git/llvm-project.git revision ffb3277b0036909a8e622d5758a1e2850eabfd19) clang revision ffb3277b0036909a8e622d5758a1e2850eabfd19 llvm revision ffb3277b0036909a8e622d5758a1e2850eabfd19 Skipping the following test categories: ['libstdcxx', 'dwo', 'llgs', 'fork']

Hide Details

-- Command Output (stderr): -- Change dir to: /Users/buildslave/jenkins/workspace/lldb-cmake/llvm-project/lldb/test/API/functionalities/data-formatter/stringprinter runCmd: settings clear -all output:

Hide Details

runCmd: settings set symbols.enable-external-lookup false output:

Hide Details

runCmd: settings set target.inherit-tcc true output:

Hide Details

runCmd: settings set target.detach-on-error false output:

Hide Details

runCmd: settings set target.auto-apply-fixits false output:

Hide Details

runCmd: settings set plugin.process.gdb-remote.packet-timeout 60 output:

Hide Details

runCmd: settings set symbols.clang-modules-cache-path "/Users/buildslave/jenkins/workspace/lldb-cmake/lldb-build/lldb-test-build.noindex/module-cache-lldb/lldb-api" output:

Hide Details

runCmd: settings set use-color false output:

Hide Details

runCmd: setting set target.prefer-dynamic-value no-dynamic-values output:

Hide Details

FAIL: LLDB (/Users/buildslave/jenkins/workspace/lldb-cmake/lldb-build/bin/clang-x86_64) :: test_dsym (lldbsuite.test.lldbtest.TestStringPrinter) <bound method SBProcess.Kill of <lldb.SBProcess; proxy of <Swig Object of type 'lldb::SBProcess *' at 0x10ec86270> >>: success

Hide Details

runCmd: settings clear -all output:

Hide Details

runCmd: settings set symbols.enable-external-lookup false output:

Hide Details

runCmd: settings set target.inherit-tcc true output:

Hide Details

runCmd: settings set target.detach-on-error false output:

Hide Details

runCmd: settings set target.auto-apply-fixits false output:

Hide Details

runCmd: settings set plugin.process.gdb-remote.packet-timeout 60 output:

Hide Details

runCmd: settings set symbols.clang-modules-cache-path "/Users/buildslave/jenkins/workspace/lldb-cmake/lldb-build/lldb-test-build.noindex/module-cache-lldb/lldb-api" output:

Hide Details

runCmd: settings set use-color false output:

Hide Details

runCmd: setting set target.prefer-dynamic-value no-dynamic-values output:

Hide Details

FAIL: LLDB (/Users/buildslave/jenkins/workspace/lldb-cmake/lldb-build/bin/clang-x86_64) :: test_dwarf (lldbsuite.test.lldbtest.TestStringPrinter) <bound method SBProcess.Kill of <lldb.SBProcess; proxy of <Swig Object of type 'lldb::SBProcess *' at 0x10e90e9c0> >>: success

Hide Details

UNSUPPORTED: LLDB (/Users/buildslave/jenkins/workspace/lldb-cmake/lldb-build/bin/clang-x86_64) :: test_dwo (lldbsuite.test.lldbtest.TestStringPrinter) (test case does not fall in any category of interest for this run) runCmd: settings clear -all output:

Hide Details

runCmd: settings set symbols.enable-external-lookup false output:

Hide Details

runCmd: settings set target.inherit-tcc true output:

Hide Details

runCmd: settings set target.detach-on-error false output:

Hide Details

runCmd: settings set target.auto-apply-fixits false output:

Hide Details

runCmd: settings set plugin.process.gdb-remote.packet-timeout 60 output:

Hide Details

runCmd: settings set symbols.clang-modules-cache-path "/Users/buildslave/jenkins/workspace/lldb-cmake/lldb-build/lldb-test-build.noindex/module-cache-lldb/lldb-api" output:

Hide Details

runCmd: settings set use-color false output:

Hide Details

runCmd: setting set target.prefer-dynamic-value no-dynamic-values output:

Hide Details

Adding tearDown hook: <function <lambda> at 0x1175fa378>

Hide Details

runCmd: frame variable output: (int) argc = 1 (const char **) argv = 0x00007ffeefbff960 (std::string) stdstring = "Hello\t\tWorld\nI am here\t\tto say hello\n" (const char *) constcharstar = 0x0000000100304080 "Hello\t\tWorld\nI am here\t\tto say hello\n" (std::string) longstring = "I am a very long string; in fact I am longer than any reasonable length that a string should be; quite long indeed; oh my, so many words; so many letters; this is kind of like writing a poem; except in real life all that is happening is just me producing a very very long set of words; there is text here, text there, text everywhere; it fills me with glee to see so much text; all around me it's just letters, and symbols, and other pleasant drawings that cause me a large amount of joy upon visually seeing them with my eyes; well, this is now a lot of letters, but it is still not enough for the purpose of the test I want to test, so maybe I should copy and paste this a few times, you know.. for science, or somethingI am a very long string; in fact I am longer than any reasonable length that a string should be; quite long indeed; oh my, so many words; so many letters; this is kind of like writing a poem; except in real life all that is happening is just me producing a very very long set of words; there is text he"... (const char *) longconstcharstar = 0x0000000101008200 "I am a very long string; in fact I am longer than any reasonable length that a string should be; quite long indeed; oh my, so many words; so many letters; this is kind of like writing a poem; except in real life all that is happening is just me producing a very very long set of words; there is text here, text there, text everywhere; it fills me with glee to see so much text; all around me it's just letters, and symbols, and other pleasant drawings that cause me a large amount of joy upon visually seeing them with my eyes; well, this is now a lot of letters, but it is still not enough for the purpose of the test I want to test, so maybe I should copy and paste this a few times, you know.. for science, or somethingI am a very long string; in fact I am longer than any reasonable length that a string should be; quite long indeed; oh my, so many words; so many letters; this is kind of like writing a poem; except in real life all that is happening is just me producing a very very long set of words; there is text he"...

Hide Details

Hide Details

runCmd: setting set escape-non-printables false output:

Hide Details

<bound method SBProcess.Kill of <lldb.SBProcess; proxy of <Swig Object of type 'lldb::SBProcess *' at 0x10ec86360> >>: success

Hide Details

Executing tearDown hook: <function <lambda> at 0x1175fa378>

Hide Details

runCmd: setting set escape-non-printables true output:

Hide Details

PASS: LLDB (/Users/buildslave/jenkins/workspace/lldb-cmake/lldb-build/bin/clang-x86_64) :: test_gmodules (lldbsuite.test.lldbtest.TestStringPrinter) Restore dir to: /Users/buildslave/jenkins/workspace/lldb-cmake/lldb-build/tools/lldb/test ====================================================================== FAIL: test_dsym (lldbsuite.test.lldbtest.TestStringPrinter) ---------------------------------------------------------------------- Traceback (most recent call last): File "/Users/buildslave/jenkins/workspace/lldb-cmake/llvm-project/lldb/packages/Python/lldbsuite/test/lldbtest.py", line 1834, in test_method return attrvalue(self) File "/Users/buildslave/jenkins/workspace/lldb-cmake/llvm-project/lldb/packages/Python/lldbsuite/test/decorators.py", line 119, in wrapper func(*args, **kwargs) File "/Users/buildslave/jenkins/workspace/lldb-cmake/llvm-project/lldb/packages/Python/lldbsuite/test/lldbinline.py", line 121, in _test self.do_test() File "/Users/buildslave/jenkins/workspace/lldb-cmake/llvm-project/lldb/packages/Python/lldbsuite/test/lldbinline.py", line 157, in do_test "inline test did not hit a single breakpoint") AssertionError: False is not True : inline test did not hit a single breakpoint Config=x86_64-/Users/buildslave/jenkins/workspace/lldb-cmake/lldb-build/bin/clang ====================================================================== FAIL: test_dwarf (lldbsuite.test.lldbtest.TestStringPrinter) ---------------------------------------------------------------------- Traceback (most recent call last): File "/Users/buildslave/jenkins/workspace/lldb-cmake/llvm-project/lldb/packages/Python/lldbsuite/test/lldbtest.py", line 1834, in test_method return attrvalue(self) File "/Users/buildslave/jenkins/workspace/lldb-cmake/llvm-project/lldb/packages/Python/lldbsuite/test/decorators.py", line 119, in wrapper func(*args, **kwargs) File "/Users/buildslave/jenkins/workspace/lldb-cmake/llvm-project/lldb/packages/Python/lldbsuite/test/lldbinline.py", line 121, in _test self.do_test() File "/Users/buildslave/jenkins/workspace/lldb-cmake/llvm-project/lldb/packages/Python/lldbsuite/test/lldbinline.py", line 157, in do_test "inline test did not hit a single breakpoint") AssertionError: False is not True : inline test did not hit a single breakpoint Config=x86_64-/Users/buildslave/jenkins/workspace/lldb-cmake/lldb-build/bin/clang ---------------------------------------------------------------------- Ran 4 tests in 72.127s

Hide Details

RESULT: FAILED (1 passes, 2 failures, 0 errors, 1 skipped, 0 expected failures, 0 unexpected successes)

Hide Details

--

Hide Details

******************** PASS: lldb-api :: macosx/lc-note/kern-ver-str/TestKernVerStrLCNOTE.py (1219 of 2363) UNSUPPORTED: lldb-api :: benchmarks/continue/TestBenchmarkContinue.py (1220 of 2363) UNSUPPORTED: lldb-api :: benchmarks/turnaround/TestCompileRunToBreakpointTurnaround.py (1221 of 2363) PASS: lldb-unit :: Process/Utility/./ProcessUtilityTests/ProcMapTests/LinuxProcMapsTestFixture.ParseMapRegions/7 (1222 of 2363) UNSUPPORTED: lldb-shell :: Register/x86-64-xmm16-read.test (1223 of 2363) PASS: lldb-shell :: SymbolFile/DWARF/x86/split-dwarf-inlining.cpp (1224 of 2363) PASS: lldb-unit :: Utility/./UtilityTests/StringListTest.LongestCommonPrefixSingleElement (1225 of 2363) PASS: lldb-unit :: Utility/./UtilityTests/UUIDTest.Validity (1226 of 2363) PASS: lldb-unit :: Utility/./UtilityTests/BroadcasterTest.BroadcastEvent (1227 of 2363) PASS: lldb-unit :: Utility/./UtilityTests/ArgsTest.Yaml (1228 of 2363) PASS: lldb-unit :: Process/gdb-remote/./ProcessGdbRemoteTests/GDBRemoteCommunicationClientTest.GetMemoryRegionInfo (1229 of 2363) UNSUPPORTED: lldb-shell :: ExecControl/StopHook/stop-hook-threads.test (1230 of 2363) PASS: lldb-unit :: Host/./HostTests/NativeProcessProtocolTest.SetBreakpointFailRead (1231 of 2363) PASS: lldb-unit :: Utility/./UtilityTests/ScalarTest.TruncOrExtendTo (1232 of 2363) PASS: lldb-unit :: Process/Utility/./ProcessUtilityTests/ProcSMapTests/LinuxProcSMapsTestFixture.ParseSMapRegions/9 (1233 of 2363) PASS: lldb-unit :: Utility/./UtilityTests/StreamTest.PutRawBytesToBigEndian (1234 of 2363) PASS: lldb-unit :: UnwindAssembly/x86/./UnwindAssemblyx86Tests/Testx86AssemblyInspectionEngine.Test32bitFramelessBigStackFrame (1235 of 2363) PASS: lldb-unit :: UnwindAssembly/x86/./UnwindAssemblyx86Tests/Testx86AssemblyInspectionEngine.TestPushEBX (1236 of 2363) PASS: lldb-api :: lang/objc/warnings-in-expr-parser/TestObjCWarningsInExprParser.py (1237 of 2363) PASS: lldb-unit :: Utility/./UtilityTests/AnsiTerminal.KnownPrefix (1238 of 2363) PASS: lldb-unit :: Utility/./UtilityTests/StringListTest.SplitIntoLines (1239 of 2363) PASS: lldb-api :: functionalities/load_lazy/TestLoadUsingLazyBind.py (1240 of 2363) PASS: lldb-api :: commands/expression/xvalue/TestXValuePrinting.py (1241 of 2363) PASS: lldb-api :: lang/objc/print-obj/TestPrintObj.py (1242 of 2363) PASS: lldb-unit :: Utility/./UtilityTests/StringExtractorTest.GetHexU8_Exact (1243 of 2363) PASS: lldb-unit :: DataFormatter/./LLDBFormatterTests/TypeMatcherTests.ExactName (1244 of 2363) PASS: lldb-unit :: Process/Utility/./ProcessUtilityTests/ProcMapTests/LinuxProcMapsTestFixture.ParseMapRegions/1 (1245 of 2363) PASS: lldb-unit :: UnwindAssembly/x86/./UnwindAssemblyx86Tests/Testx86AssemblyInspectionEngine.TestPopR15 (1246 of 2363) PASS: lldb-api :: lang/cpp/reference-to-outer-type/TestCppReferenceToOuterClass.py (1247 of 2363) PASS: lldb-unit :: Utility/./UtilityTests/StreamTest.PutHex64ByteOrderLittle (1248 of 2363) PASS: lldb-shell :: Breakpoint/dummy-target.test (1249 of 2363) PASS: lldb-unit :: ScriptInterpreter/Python/./ScriptInterpreterPythonTests/PythonDataObjectsTest.TestPythonIntegerToStr (1250 of 2363) PASS: lldb-unit :: Utility/./UtilityTests/BinaryStreamTest.PutULEB128SixBytes (1251 of 2363) UNSUPPORTED: lldb-api :: benchmarks/startup/TestStartupDelays.py (1252 of 2363) PASS: lldb-shell :: ObjectFile/PECOFF/section-types.yaml (1253 of 2363) PASS: lldb-api :: functionalities/thread/concurrent_events/TestConcurrentWatchpointWithDelayWatchpointThreads.py (1254 of 2363) PASS: lldb-api :: lang/cpp/auto/TestCPPAuto.py (1255 of 2363) PASS: lldb-api :: functionalities/data-formatter/data-formatter-skip-summary/TestDataFormatterSkipSummary.py (1256 of 2363) PASS: lldb-api :: lang/cpp/offsetof/TestOffsetofCpp.py (1257 of 2363) PASS: lldb-unit :: Utility/./UtilityTests/UUIDTest.SetFromStringRef (1258 of 2363) PASS: lldb-api :: functionalities/tail_call_frames/ambiguous_tail_call_seq2/TestAmbiguousTailCallSeq2.py (1259 of 2363) PASS: lldb-unit :: Symbol/./SymbolTests/Type.CompilerContextPattern (1260 of 2363) PASS: lldb-api :: functionalities/memory/read/TestMemoryRead.py (1261 of 2363) PASS: lldb-unit :: Process/minidump/./LLDBMinidumpTests/MinidumpParserTest.GetMiscInfo_no_stream (1262 of 2363) PASS: lldb-unit :: Utility/./UtilityTests/ScalarTest.Division (1263 of 2363) PASS: lldb-api :: functionalities/data-formatter/data-formatter-stl/libcxx/deque/TestDataFormatterLibcxxDeque.py (1264 of 2363) PASS: lldb-api :: functionalities/signal/handle-abrt/TestHandleAbort.py (1265 of 2363) PASS: lldb-unit :: Utility/./UtilityTests/StringListTest.AppendStringMove (1266 of 2363) PASS: lldb-api :: functionalities/inferior-crashing/recursive-inferior/TestRecursiveInferiorStep.py (1267 of 2363) UNSUPPORTED: lldb-api :: linux/aarch64/mte_tag_read/TestAArch64LinuxMTEMemoryTagRead.py (1268 of 2363) PASS: lldb-unit :: Utility/./UtilityTests/AnsiTerminal.Twice (1269 of 2363) PASS: lldb-unit :: Utility/./UtilityTests/UriParserTest.SchemeHostSeparator2 (1270 of 2363) PASS: lldb-unit :: Utility/./UtilityTests/Flags.GetBitSize (1271 of 2363) PASS: lldb-api :: lang/objc/foundation/TestObjCMethodsString.py (1272 of 2363) PASS: lldb-unit :: Utility/./UtilityTests/StringExtractorTest.DecodeHexU8_InvalidHex (1273 of 2363) PASS: lldb-api :: commands/expression/import-std-module/array/TestArrayFromStdModule.py (1274 of 2363) PASS: lldb-api :: commands/target/stop-hook/delete/TestTargetStopHookDelete.py (1275 of 2363) PASS: lldb-unit :: Utility/./UtilityTests/StatusTest.Formatv (1276 of 2363) PASS: lldb-unit :: Utility/./UtilityTests/StreamTest.PutCStringWithStringRef (1277 of 2363) PASS: lldb-api :: commands/expression/import-std-module/non-module-type-separation/TestNonModuleTypeSeparation.py (1278 of 2363) PASS: lldb-unit :: Utility/./UtilityTests/ArgsTest.TestArgv (1279 of 2363) PASS: lldb-shell :: SymbolFile/DWARF/x86/limit-debug-info.s (1280 of 2363) PASS: lldb-shell :: SymbolFile/DWARF/x86/DW_AT_location-DW_AT_const_value.s (1281 of 2363) PASS: lldb-api :: lang/cpp/non-type-template-param/TestCppNonTypeTemplateParam.py (1282 of 2363) PASS: lldb-unit :: Utility/./UtilityTests/ArchSpecTest.MergeFromMachOUnknown (1283 of 2363) PASS: lldb-api :: lang/cpp/member-and-local-vars-with-same-name/TestMembersAndLocalsWithSameName.py (1284 of 2363) PASS: lldb-unit :: Host/./HostTests/FileSystemTest.GetPermissions (1285 of 2363) PASS: lldb-unit :: ScriptInterpreter/Python/./ScriptInterpreterPythonTests/PythonDataObjectsTest.TestExceptions (1286 of 2363) PASS: lldb-unit :: debugserver/./debugserverTests/RNBSocket.LoopBackListenIPv6 (1287 of 2363) PASS: lldb-api :: functionalities/thread/concurrent_events/TestConcurrentDelaySignalBreak.py (1288 of 2363) UNSUPPORTED: lldb-api :: functionalities/thread/multi_break/TestMultipleBreakpoints.py (1289 of 2363) PASS: lldb-shell :: Quit/TestQuitExitCodeHexA.test (1290 of 2363) PASS: lldb-unit :: Utility/./UtilityTests/StreamTeeTest.Flush (1291 of 2363) PASS: lldb-unit :: Disassembler/./DisassemblerTests/TestArmv7Disassembly.TestCortexFPDisass (1292 of 2363) PASS: lldb-unit :: Utility/./UtilityTests/VMRange.IsValid (1293 of 2363) PASS: lldb-unit :: Host/./HostTests/ProcessLaunchInfoTest.Constructor (1294 of 2363) PASS: lldb-shell :: ObjectFile/ELF/section-types-edgecases.yaml (1295 of 2363) PASS: lldb-shell :: SymbolFile/DWARF/dwo-relative-path.s (1296 of 2363) PASS: lldb-api :: functionalities/data-formatter/data-formatter-stl/libcxx/set/TestDataFormatterLibcxxSet.py (1297 of 2363) PASS: lldb-api :: lang/cpp/pointer_to_member_type_depending_on_parent_size/TestPointerToMemberTypeDependingOnParentSize.py (1298 of 2363) PASS: lldb-api :: functionalities/optimized_code/TestNoASanExceptionAfterEvalOP_piece.py (1299 of 2363) PASS: lldb-shell :: ObjectFile/ELF/PT_LOAD-overlap-PT_INTERP.yaml (1300 of 2363) PASS: lldb-unit :: Utility/./UtilityTests/RangeTest.ContainsAddrInvalid (1301 of 2363) PASS: lldb-unit :: Utility/./UtilityTests/VMRange.Ordering (1302 of 2363) PASS: lldb-api :: lang/cpp/template/TestTemplateArgs.py (1303 of 2363) PASS: lldb-shell :: Reproducer/TestPythonImport.test (1304 of 2363) PASS: lldb-api :: lang/cpp/class-template-parameter-pack/TestClassTemplateParameterPack.py (1305 of 2363) PASS: lldb-api :: commands/log/basic/TestLogging.py (1306 of 2363) PASS: lldb-unit :: ScriptInterpreter/Python/./ScriptInterpreterPythonTests/PythonDataObjectsTest.TestTypeNameResolutionNoDot (1307 of 2363) PASS: lldb-unit :: Utility/./UtilityTests/StreamTest.PutULEB128 (1308 of 2363) PASS: lldb-unit :: Host/./HostTests/NativeProcessProtocolTest.SetBreakpointFailVerify (1309 of 2363) PASS: lldb-unit :: Process/Utility/./ProcessUtilityTests/ProcSMapTests/LinuxProcSMapsTestFixture.ParseSMapRegions/8 (1310 of 2363) PASS: lldb-api :: functionalities/step-avoids-no-debug/TestStepNoDebug.py (1311 of 2363) PASS: lldb-api :: python_api/disassemble-raw-data/TestDisassembleRawData.py (1312 of 2363) PASS: lldb-api :: commands/expression/import-std-module/forward_list/TestForwardListFromStdModule.py (1313 of 2363) PASS: lldb-unit :: Utility/./UtilityTests/ArgsTest.DoubleQuotedItem (1314 of 2363) PASS: lldb-api :: lang/c/anonymous/TestAnonymous.py (1315 of 2363) PASS: lldb-unit :: Utility/./UtilityTests/DataExtractorTest.GetCStrAtNullOffset (1316 of 2363) PASS: lldb-unit :: Symbol/./SymbolTests/TestClangASTImporter.RecordLayout (1317 of 2363) PASS: lldb-unit :: Utility/./UtilityTests/SerializationRountripTest.SerializeDeserializePodReferences (1318 of 2363) PASS: lldb-api :: functionalities/plugins/python_os_plugin/TestPythonOSPlugin.py (1319 of 2363) PASS: lldb-unit :: UnwindAssembly/ARM64/./Arm64InstEmulationTests/TestArm64InstEmulation.TestFramelessThreeEpilogueFunction (1320 of 2363) PASS: lldb-api :: commands/expression/import-std-module/forward_decl_from_module/TestForwardDeclFromStdModule.py (1321 of 2363) PASS: lldb-api :: commands/expression/test/TestExprs2.py (1322 of 2363) PASS: lldb-unit :: Utility/./UtilityTests/PassiveReplayTest.InstrumentedFooInvalid (1323 of 2363) PASS: lldb-unit :: SymbolFile/NativePDB/./SymbolFileNativePDBTests/PDBFPOProgramToDWARFExpressionTests.UnresolvedRegisterReference (1324 of 2363) PASS: lldb-api :: lang/c/modules/TestCModules.py (1325 of 2363) PASS: lldb-unit :: Symbol/./SymbolTests/TestTypeSystemClang.TestNotDeletingUserCopyCstrDueToMoveCStr (1326 of 2363) PASS: lldb-unit :: Utility/./UtilityTests/StreamTeeTest.GetStreamAtIndexOutOfBounds (1327 of 2363) PASS: lldb-api :: lang/objc/variadic_methods/TestVariadicMethods.py (1328 of 2363) PASS: lldb-api :: functionalities/data-formatter/poarray/TestPrintObjectArray.py (1329 of 2363) PASS: lldb-unit :: Utility/./UtilityTests/UriParserTest.BadPort (1330 of 2363) PASS: lldb-unit :: Utility/./UtilityTests/DataExtractorTest.GetFloat (1331 of 2363) PASS: lldb-unit :: Core/./LLDBCoreTests/RichManglingContextTest.SwitchProvider (1332 of 2363) PASS: lldb-api :: python_api/file_handle/TestFileHandle.py (1333 of 2363) PASS: lldb-unit :: tools/lldb-server/tests/./LLDBServerTests/TestBase.DebugserverEnv (1334 of 2363) PASS: lldb-unit :: Signals/./SignalsTests/UnixSignalsTest.GetFilteredSignals (1335 of 2363) PASS: lldb-api :: lang/c/const_variables/TestConstVariables.py (1336 of 2363) PASS: lldb-unit :: Process/minidump/./LLDBMinidumpTests/MinidumpParserTest.InvalidMinidump (1337 of 2363) PASS: lldb-unit :: Utility/./UtilityTests/BinaryStreamTest.PutSLEB128SevenBytes (1338 of 2363) UNSUPPORTED: lldb-api :: lang/c/typedef/Testtypedef.py (1339 of 2363) PASS: lldb-api :: functionalities/data-formatter/data-formatter-python-synth/TestDataFormatterPythonSynth.py (1340 of 2363) PASS: lldb-api :: commands/watchpoints/watchpoint_commands/command/TestWatchpointCommandPython.py (1341 of 2363) PASS: lldb-shell :: Commands/command-backtrace-parser-1.test (1342 of 2363) PASS: lldb-unit :: Utility/./UtilityTests/StringExtractorTest.InitEmpty (1343 of 2363) PASS: lldb-unit :: Utility/./UtilityTests/OptionsWithRawTest.ArgsButNoLeadingDash (1344 of 2363) PASS: lldb-api :: commands/expression/call-throws/TestCallThatThrows.py (1345 of 2363) PASS: lldb-unit :: Utility/./UtilityTests/StreamTest.ShiftOperatorStrings (1346 of 2363) PASS: lldb-api :: commands/expression/import-std-module/sysroot/TestStdModuleSysroot.py (1347 of 2363) PASS: lldb-unit :: Core/./LLDBCoreTests/DumpDataExtractorTest.NullStream (1348 of 2363) PASS: lldb-shell :: Minidump/memory-region.yaml (1349 of 2363) PASS: lldb-api :: lang/cpp/sizeof/TestCPPSizeof.py (1350 of 2363) PASS: lldb-api :: commands/platform/file/close/TestPlatformFileClose.py (1351 of 2363) PASS: lldb-api :: commands/apropos/with-process/TestAproposWithProcess.py (1352 of 2363) PASS: lldb-unit :: Utility/./UtilityTests/StringExtractorTest.GetNameColonValueSuccess (1353 of 2363) PASS: lldb-unit :: Utility/./UtilityTests/ProcessInfoTest.Constructor (1354 of 2363) PASS: lldb-shell :: ObjectFile/ELF/section-permissions.yaml (1355 of 2363) PASS: lldb-api :: commands/command/script_alias/TestCommandScriptAlias.py (1356 of 2363) PASS: lldb-api :: lang/objcxx/objc-builtin-types/TestObjCBuiltinTypes.py (1357 of 2363) PASS: lldb-unit :: Process/minidump/./LLDBMinidumpTests/MinidumpParserTest.FindMemoryRangeWithFullMemoryMinidump (1358 of 2363) PASS: lldb-api :: lang/cpp/nested-class-other-compilation-unit/TestNestedClassWithParentInAnotherCU.py (1359 of 2363) PASS: lldb-api :: functionalities/conditional_break/TestConditionalBreak.py (1360 of 2363) PASS: lldb-unit :: Utility/./UtilityTests/FileSpecTest.EqualSeparator (1361 of 2363) UNSUPPORTED: lldb-shell :: Register/x86-ymm-write.test (1362 of 2363) PASS: lldb-api :: commands/expression/context-object-objc/TestContextObjectObjc.py (1363 of 2363) PASS: lldb-unit :: Utility/./UtilityTests/StringListTest.SetSize (1364 of 2363) PASS: lldb-shell :: ObjectFile/ELF/short-build-id.yaml (1365 of 2363) PASS: lldb-api :: lang/objc/modules/TestObjCModules.py (1366 of 2363) PASS: lldb-api :: driver/batch_mode/TestBatchMode.py (1367 of 2363) PASS: lldb-unit :: Host/./HostTests/SocketTests/SocketTest.TCPGetConnectURI/ipv4 (1368 of 2363) PASS: lldb-unit :: Utility/./UtilityTests/BinaryStreamTest.PutULEB128OneByte (1369 of 2363) PASS: lldb-api :: lang/cpp/breakpoint_in_member_func_w_non_primitive_params/TestBreakpointInMemberFuncWNonPrimitiveParams.py (1370 of 2363) PASS: lldb-unit :: Utility/./UtilityTests/RangeDataVector.FindEntryIndexesThatContain (1371 of 2363) PASS: lldb-unit :: Platform/./LLDBPlatformTests/PlatformAppleSimulatorTest.TestHostPlatformToSim (1372 of 2363) PASS: lldb-api :: lang/cpp/function_refs/TestFunctionRefs.py (1373 of 2363) PASS: lldb-api :: functionalities/thread/concurrent_events/TestConcurrentWatchpointDelayWatchpointOneBreakpoint.py (1374 of 2363) PASS: lldb-unit :: UnwindAssembly/x86/./UnwindAssemblyx86Tests/Testx86AssemblyInspectionEngine.TestPushImm (1375 of 2363) PASS: lldb-shell :: Register/x86-64-gp-read.test (1376 of 2363) PASS: lldb-unit :: Utility/./UtilityTests/OptionsWithRawTest.TerminatedQuote (1377 of 2363) PASS: lldb-api :: functionalities/tsan/cpp_global_location/TestTsanCPPGlobalLocation.py (1378 of 2363) PASS: lldb-shell :: Settings/TestSettingsSet.test (1379 of 2363) PASS: lldb-api :: lang/objc/foundation/TestObjCMethods.py (1380 of 2363) PASS: lldb-api :: lang/c/record_decl_in_expr/TestRecordDeclInExpr.py (1381 of 2363) PASS: lldb-unit :: Utility/./UtilityTests/ArgsTest.GetQuotedCommandString (1382 of 2363) PASS: lldb-api :: functionalities/unwind/zeroth_frame/TestZerothFrame.py (1383 of 2363) PASS: lldb-unit :: Utility/./UtilityTests/StreamTest.AddressRangeEmptyRange (1384 of 2363) PASS: lldb-unit :: UnwindAssembly/PPC64/./PPC64InstEmulationTests/TestPPC64InstEmulation.TestMediumFunction (1385 of 2363) PASS: lldb-unit :: UnwindAssembly/PPC64/./PPC64InstEmulationTests/TestPPC64InstEmulation.TestSimpleFunction (1386 of 2363) PASS: lldb-unit :: Core/./LLDBCoreTests/MangledTest.NameIndexes_FindFunctionSymbols (1387 of 2363) PASS: lldb-unit :: Target/./TargetTests/ModuleCacheTest.GetAndPutStrangeHostname (1388 of 2363) PASS: lldb-api :: tools/lldb-server/TestGdbRemoteHostInfo.py (1389 of 2363) PASS: lldb-unit :: API/./APITests/SBCommandInterpreterTest.SingleWordCommand (1390 of 2363) PASS: lldb-unit :: Utility/./UtilityTests/RecordReplayTest.InvalidSequence (1391 of 2363) PASS: lldb-unit :: Utility/./UtilityTests/OptionsWithRawTest.MultiWordSuffix (1392 of 2363) PASS: lldb-unit :: Utility/./UtilityTests/ScalarTest.Comparison (1393 of 2363) PASS: lldb-unit :: ScriptInterpreter/Python/./ScriptInterpreterPythonTests/PythonDataObjectsTest.TestPythonDictionaryValueEquality (1394 of 2363) PASS: lldb-shell :: SymbolFile/DWARF/x86/find-qualified-variable.cpp (1395 of 2363) PASS: lldb-api :: commands/gui/basic/TestGuiBasic.py (1396 of 2363) PASS: lldb-unit :: Utility/./UtilityTests/StringExtractorTest.GetHexU8_Underflow2_NoEof (1397 of 2363) PASS: lldb-shell :: Expr/TestIRMemoryMap.test (1398 of 2363) PASS: lldb-api :: lang/cpp/virtual-overload/TestVirtualOverload.py (1399 of 2363) PASS: lldb-api :: functionalities/load_using_paths/TestLoadUsingPaths.py (1400 of 2363) PASS: lldb-unit :: Target/./TargetTests/PathMappingListTest.RemapRoot (1401 of 2363) PASS: lldb-api :: tools/lldb-vscode/variables/TestVSCode_variables.py (1402 of 2363) PASS: lldb-unit :: UnwindAssembly/x86/./UnwindAssemblyx86Tests/Testx86AssemblyInspectionEngine.TestPopRBX (1403 of 2363) PASS: lldb-api :: functionalities/find-line-entry/TestFindLineEntry.py (1404 of 2363) UNSUPPORTED: lldb-shell :: ScriptInterpreter/Lua/breakpoint_oneline_callback.test (1405 of 2363) PASS: lldb-unit :: Utility/./UtilityTests/BinaryStreamTest.PutULEB128MaxValue (1406 of 2363) PASS: lldb-api :: commands/expression/persistent_types/TestPersistentTypes.py (1407 of 2363) PASS: lldb-shell :: SymbolFile/NativePDB/ast-types.cpp (1408 of 2363) PASS: lldb-unit :: Utility/./UtilityTests/StringExtractorTest.DecodeHexU8_Exact (1409 of 2363) PASS: lldb-unit :: Utility/./UtilityTests/XcodeSDKTest.FindXcodeContentsDirectoryInPath (1410 of 2363) PASS: lldb-unit :: ScriptInterpreter/Python/./ScriptInterpreterPythonTests/PythonDataObjectsTest.TestPythonIntegerToStructuredInteger (1411 of 2363) PASS: lldb-api :: types/TestShortType.py (1412 of 2363) PASS: lldb-api :: tools/lldb-server/register-reading/TestGdbRemoteGPacket.py (1413 of 2363) PASS: lldb-unit :: Core/./LLDBCoreTests/RichManglingContextTest.IPDRealloc (1414 of 2363) PASS: lldb-shell :: SymbolFile/NativePDB/break-by-line.cpp (1415 of 2363) PASS: lldb-api :: lang/cpp/dynamic-value/TestDynamicValue.py (1416 of 2363) PASS: lldb-unit :: Host/./HostTests/SocketTests/SocketTest.UDPGetConnectURI/ipv6 (1417 of 2363) PASS: lldb-api :: lang/cpp/class_static/TestStaticVariables.py (1418 of 2363) PASS: lldb-shell :: ObjectFile/ELF/aarch64-relocations.yaml (1419 of 2363) UNSUPPORTED: lldb-shell :: SymbolFile/PDB/compilands.test (1420 of 2363) PASS: lldb-shell :: ObjectFile/wasm/unified-debug-sections.yaml (1421 of 2363) PASS: lldb-api :: lang/objc/global_ptrs/TestGlobalObjects.py (1422 of 2363) PASS: lldb-unit :: Host/./HostTests/SocketTests/SocketTest.TCPGetAddress/ipv6 (1423 of 2363) PASS: lldb-shell :: Breakpoint/single-file-split-dwarf.test (1424 of 2363) PASS: lldb-unit :: Interpreter/./InterpreterTests/CompletionTest.FileCompletionAbsolute (1425 of 2363) PASS: lldb-unit :: Utility/./UtilityTests/ScalarTest.GetBytes (1426 of 2363) PASS: lldb-api :: lang/objc/objc-static-method-stripped/TestObjCStaticMethodStripped.py (1427 of 2363) PASS: lldb-api :: functionalities/stop-on-sharedlibrary-load/TestStopOnSharedlibraryEvents.py (1428 of 2363) PASS: lldb-shell :: Register/Core/x86-32-freebsd-fp.test (1429 of 2363) PASS: lldb-shell :: Recognizer/assert.test (1430 of 2363) PASS: lldb-api :: lang/c/offsetof/TestOffsetof.py (1431 of 2363) PASS: lldb-unit :: Utility/./UtilityTests/SubsystemRAIITest.NormalSubsystem (1432 of 2363) PASS: lldb-api :: tools/lldb-server/inferior-crash/TestGdbRemoteSegFault.py (1433 of 2363) UNSUPPORTED: lldb-shell :: SymbolFile/DWARF/x86/DW_TAG_variable-DW_AT_decl_file-DW_AT_abstract_origin-crosscu1.s (1434 of 2363) PASS: lldb-shell :: Subprocess/fork-follow-parent.test (1435 of 2363) PASS: lldb-api :: commands/settings/quoting/TestQuoting.py (1436 of 2363) PASS: lldb-shell :: Minidump/Windows/broken-unwind.test (1437 of 2363) PASS: lldb-unit :: Host/./HostTests/MainLoopTest.UnmonitoredSignal (1438 of 2363) PASS: lldb-unit :: SymbolFile/DWARF/./SymbolFileDWARFTests/SymbolFileDWARFTests.TestAbbrevInvalidNULLTag (1439 of 2363) PASS: lldb-unit :: Process/minidump/./LLDBMinidumpTests/MinidumpParserTest.GetThreadsAndGetThreadContext (1440 of 2363) PASS: lldb-api :: sample_test/TestSampleTest.py (1441 of 2363) PASS: lldb-unit :: Symbol/./SymbolTests/TestTypeSystemClang.TestGetTypeClassDeclType (1442 of 2363) PASS: lldb-unit :: Expression/./ExpressionTests/CppModuleConfigurationTest.MissingLibCpp (1443 of 2363) PASS: lldb-unit :: Utility/./UtilityTests/RegularExpression.Match (1444 of 2363) PASS: lldb-api :: lang/c/complex_int/TestComplexInt.py (1445 of 2363) PASS: lldb-api :: functionalities/breakpoint/debugbreak/TestDebugBreak.py (1446 of 2363) PASS: lldb-shell :: ScriptInterpreter/Python/fail_breakpoint_oneline.test (1447 of 2363) PASS: lldb-unit :: Utility/./UtilityTests/SerializationRountripTest.SerializeDeserializeCStringArray (1448 of 2363) PASS: lldb-api :: python_api/frame/get-variables/TestGetVariables.py (1449 of 2363) PASS: lldb-shell :: ObjectFile/ELF/eh_frame-symbols.yaml (1450 of 2363) PASS: lldb-unit :: Utility/./UtilityTests/StringExtractorTest.GetHexBytesAvail_FullString (1451 of 2363) PASS: lldb-unit :: Utility/./UtilityTests/ListenerTest.GetEventWait (1452 of 2363) PASS: lldb-unit :: Core/./LLDBCoreTests/SourceLocationSpecTest.Equal (1453 of 2363) PASS: lldb-unit :: Utility/./UtilityTests/UriParserTest.BracketedHostname (1454 of 2363) PASS: lldb-unit :: Expression/./ExpressionTests/CppModuleConfigurationTest.UnrelatedLibrary (1455 of 2363) PASS: lldb-unit :: Utility/./UtilityTests/StreamTest.AddressRangeSize (1456 of 2363) PASS: lldb-unit :: Process/minidump/./LLDBMinidumpTests/MinidumpParserTest.GetMiscInfoWindows (1457 of 2363) PASS: lldb-unit :: Utility/./UtilityTests/StreamTest.PutHex16ByteOrderBig (1458 of 2363) PASS: lldb-shell :: ObjectFile/ELF/compressed-sections.yaml (1459 of 2363) PASS: lldb-unit :: Utility/./UtilityTests/DataExtractorTest.GetCStrEmpty (1460 of 2363) PASS: lldb-unit :: Host/./HostTests/ConnectionFileDescriptorTest.TCPGetURIv6 (1461 of 2363) PASS: lldb-unit :: Utility/./UtilityTests/ConstStringTest.CompareStringRef (1462 of 2363) PASS: lldb-unit :: Utility/./UtilityTests/CompletionRequest.ShiftArguments (1463 of 2363) PASS: lldb-api :: lang/cpp/diamond/TestDiamond.py (1464 of 2363) PASS: lldb-api :: functionalities/non-overlapping-index-variable-i/TestIndexVariable.py (1465 of 2363) PASS: lldb-unit :: debugserver/./debugserverTests/JSON.Parse (1466 of 2363) PASS: lldb-api :: functionalities/object-file/TestImageListMultiArchitecture.py (1467 of 2363) PASS: lldb-unit :: Utility/./UtilityTests/DataExtractorTest.GetMaxU64 (1468 of 2363) PASS: lldb-unit :: Symbol/./SymbolTests/TestTypeSystemClang.TestGetEnumIntegerTypeBasicTypes (1469 of 2363) PASS: lldb-unit :: Utility/./UtilityTests/GeneratorTest.YamlMultiProvider (1470 of 2363) PASS: lldb-shell :: Commands/command-script-import.test (1471 of 2363) PASS: lldb-api :: functionalities/data-formatter/refpointer-recursion/TestDataFormatterRefPtrRecursion.py (1472 of 2363) PASS: lldb-api :: lang/objc/modules-hash-mismatch/TestClangModulesHashMismatch.py (1473 of 2363) PASS: lldb-unit :: Host/./HostTests/HostInfoTest.GetHostname (1474 of 2363) PASS: lldb-unit :: UnwindAssembly/x86/./UnwindAssemblyx86Tests/Testx86AssemblyInspectionEngine.TestPopRBP (1475 of 2363) PASS: lldb-unit :: UnwindAssembly/x86/./UnwindAssemblyx86Tests/Testx86AssemblyInspectionEngine.TestPushR13 (1476 of 2363) PASS: lldb-unit :: Process/Utility/./ProcessUtilityTests/ProcSMapTests/LinuxProcSMapsTestFixture.ParseSMapRegions/7 (1477 of 2363) PASS: lldb-api :: functionalities/breakpoint/comp_dir_symlink/TestCompDirSymLink.py (1478 of 2363) PASS: lldb-api :: lang/objc/objc-baseclass-sbtype/TestObjCBaseClassSBType.py (1479 of 2363) PASS: lldb-api :: lang/objc/objc-foundation-dictionary-empty/TestNSDictionary0.py (1480 of 2363) PASS: lldb-shell :: SymbolFile/DWARF/x86/array-sizes.s (1481 of 2363) UNSUPPORTED: lldb-api :: commands/trace/TestTraceStartStop.py (1482 of 2363) PASS: lldb-unit :: Utility/./UtilityTests/StringExtractorTest.GetNameColonValueNoColon (1483 of 2363) PASS: lldb-unit :: Process/minidump/./LLDBMinidumpTests/MinidumpParserTest.GetMemoryRegionInfo (1484 of 2363) PASS: lldb-unit :: Utility/./UtilityTests/RecordReplayTest.ValidSequence (1485 of 2363) PASS: lldb-api :: functionalities/data-formatter/boolreference/TestFormattersBoolRefPtr.py (1486 of 2363) PASS: lldb-unit :: Utility/./UtilityTests/RangeTest.ClearWithStarAddress (1487 of 2363) PASS: lldb-unit :: Utility/./UtilityTests/RangeDataVector.CustomSort (1488 of 2363) UNSUPPORTED: lldb-shell :: ScriptInterpreter/Lua/nested_sessions.test (1489 of 2363) PASS: lldb-api :: iohandler/unicode/TestUnicode.py (1490 of 2363) PASS: lldb-shell :: Register/Core/x86-32-freebsd-gp.test (1491 of 2363) PASS: lldb-unit :: Expression/./ExpressionTests/DiagnosticManagerTest.FixedExpression (1492 of 2363) PASS: lldb-api :: tools/lldb-vscode/breakpoint-events/TestVSCode_breakpointEvents.py (1493 of 2363) PASS: lldb-unit :: Process/gdb-remote/./ProcessGdbRemoteTests/GDBRemoteClientBaseTest.SendContinueAndInterrupt (1494 of 2363) PASS: lldb-api :: python_api/sbvalue_persist/TestSBValuePersist.py (1495 of 2363) PASS: lldb-unit :: Symbol/./SymbolTests/TestTypeSystemClang.TestGetTypeClassTypeOfExpr (1496 of 2363) PASS: lldb-unit :: Utility/./UtilityTests/StringListTest.AppendList (1497 of 2363) PASS: lldb-api :: lang/cpp/gmodules-templates/TestGModules.py (1498 of 2363) PASS: lldb-shell :: ObjectFile/ELF/minidebuginfo-find-symbols.yaml (1499 of 2363) PASS: lldb-unit :: Utility/./UtilityTests/ScalarTest.CastOperations (1500 of 2363) PASS: lldb-unit :: Utility/./UtilityTests/ConstStringTest.MangledCounterpart (1501 of 2363) PASS: lldb-unit :: Target/./TargetTests/PathMappingListTest.RelativeTests (1502 of 2363) PASS: lldb-unit :: Platform/Android/./AdbClientTests/AdbClientTest.CreateByDeviceId_ByEnvVar (1503 of 2363) PASS: lldb-api :: lang/objc/foundation/TestConstStrings.py (1504 of 2363) PASS: lldb-shell :: Driver/TestFile.test (1505 of 2363) PASS: lldb-unit :: Utility/./UtilityTests/OptionsWithRawTest.EmptyInput (1506 of 2363) PASS: lldb-shell :: ObjectFile/ELF/base-address.yaml (1507 of 2363) PASS: lldb-api :: functionalities/target_var/no_vars/TestTargetVarNoVars.py (1508 of 2363) UNSUPPORTED: lldb-api :: benchmarks/expression/TestRepeatedExprs.py (1509 of 2363) PASS: lldb-unit :: Process/minidump/./LLDBMinidumpTests/MinidumpParserTest.GetMemory (1510 of 2363) PASS: lldb-shell :: SymbolFile/NativePDB/function-types-builtins.cpp (1511 of 2363) PASS: lldb-api :: functionalities/tail_call_frames/ambiguous_tail_call_seq1/TestAmbiguousTailCallSeq1.py (1512 of 2363) PASS: lldb-unit :: UnwindAssembly/x86/./UnwindAssemblyx86Tests/Testx86AssemblyInspectionEngine.TestPopR12 (1513 of 2363) PASS: lldb-api :: macosx/lc-note/firmware-corefile/TestFirmwareCorefiles.py (1514 of 2363) UNSUPPORTED: lldb-api :: functionalities/breakpoint/hardware_breakpoints/write_memory_with_hw_breakpoint/TestWriteMemoryWithHWBreakpoint.py (1515 of 2363) PASS: lldb-api :: functionalities/breakpoint/serialize/TestBreakpointSerialization.py (1516 of 2363) PASS: lldb-unit :: Utility/./UtilityTests/UriParserTest.Empty (1517 of 2363) PASS: lldb-api :: commands/expression/multiline-navigation/TestMultilineNavigation.py (1518 of 2363) PASS: lldb-unit :: UnwindAssembly/x86/./UnwindAssemblyx86Tests/Testx86AssemblyInspectionEngine.TestReturnDetect (1519 of 2363) PASS: lldb-unit :: Host/./HostTests/FileSystemTest.MakeAbsolute (1520 of 2363) PASS: lldb-unit :: Host/./HostTests/MainLoopTest.DetectsEOF (1521 of 2363) PASS: lldb-unit :: Utility/./UtilityTests/StringExtractorTest.GetHexBytes (1522 of 2363) PASS: lldb-api :: functionalities/thread/concurrent_events/TestConcurrentTwoBreakpointsOneWatchpoint.py (1523 of 2363) PASS: lldb-unit :: Utility/./UtilityTests/SubsystemRAIITest.SubsystemWithErrorFailure (1524 of 2363) PASS: lldb-shell :: ObjectFile/wasm/basic.yaml (1525 of 2363) PASS: lldb-api :: tools/lldb-server/thread-name/TestGdbRemoteThreadName.py (1526 of 2363) PASS: lldb-shell :: ObjectFile/PECOFF/sections.yaml (1527 of 2363) UNSUPPORTED: lldb-api :: benchmarks/libcxxlist/TestBenchmarkLibcxxList.py (1528 of 2363) PASS: lldb-api :: python_api/sbtype_typeclass/TestSBTypeTypeClass.py (1529 of 2363) PASS: lldb-shell :: Settings/TestDisableColor.test (1530 of 2363) PASS: lldb-api :: functionalities/thread/concurrent_events/TestConcurrentBreakpointsDelayedBreakpointOneWatchpoint.py (1531 of 2363) PASS: lldb-shell :: ObjectFile/PECOFF/basic-info.yaml (1532 of 2363) PASS: lldb-unit :: Utility/./UtilityTests/AnsiTerminal.WhiteSpace (1533 of 2363) PASS: lldb-unit :: Host/./HostTests/SocketTests/SocketTest.TCPGetAddress/ipv4 (1534 of 2363) PASS: lldb-shell :: SymbolFile/DWARF/x86/dir-separator-posix.s (1535 of 2363) PASS: lldb-api :: types/TestIntegerTypeExpr.py (1536 of 2363) PASS: lldb-api :: functionalities/data-formatter/synthupdate/TestSyntheticFilterRecompute.py (1537 of 2363) PASS: lldb-unit :: Host/./HostTests/MainLoopTest.TwoSignalCallbacks (1538 of 2363) PASS: lldb-unit :: Process/gdb-remote/./ProcessGdbRemoteTests/GDBRemoteCommunicationClientTest.ReadMemoryTags (1539 of 2363) PASS: lldb-api :: functionalities/deleted-executable/TestDeletedExecutable.py (1540 of 2363) PASS: lldb-shell :: Reproducer/TestSynchronous.test (1541 of 2363) PASS: lldb-api :: functionalities/thread/step_until/TestStepUntil.py (1542 of 2363) PASS: lldb-api :: functionalities/tsan/thread_numbers/TestTsanThreadNumbers.py (1543 of 2363) PASS: lldb-api :: commands/expression/argument_passing_restrictions/TestArgumentPassingRestrictions.py (1544 of 2363) PASS: lldb-api :: commands/expression/import-std-module/stack/TestStackFromStdModule.py (1545 of 2363) PASS: lldb-unit :: Utility/./UtilityTests/CompletionRequest.Constructor (1546 of 2363) PASS: lldb-unit :: Interpreter/./InterpreterTests/CompletionTest.DirCompletionAbsolute (1547 of 2363) PASS: lldb-shell :: Settings/TestFrameFormatMangling.test (1548 of 2363) PASS: lldb-shell :: SymbolFile/DWARF/x86/find-basic-namespace.cpp (1549 of 2363) PASS: lldb-shell :: Commands/command-source.test (1550 of 2363) PASS: lldb-unit :: Utility/./UtilityTests/UriParserTest.SchemeHostSeparator3 (1551 of 2363) UNSUPPORTED: lldb-api :: commands/expression/completion-crash-invalid-iterator/TestInvalidIteratorCompletionCrash.py (1552 of 2363) UNSUPPORTED: lldb-api :: android/platform/TestDefaultCacheLineSize.py (1553 of 2363) PASS: lldb-api :: functionalities/data-formatter/data-formatter-objc/TestDataFormatterObjCNSContainer.py (1554 of 2363) PASS: lldb-api :: commands/frame/diagnose/dereference-this/TestDiagnoseDereferenceThis.py (1555 of 2363) PASS: lldb-unit :: Utility/./UtilityTests/ConstStringTest.format_provider (1556 of 2363) PASS: lldb-unit :: Host/./HostTests/FileSystemTest.Resolve (1557 of 2363) PASS: lldb-unit :: Expression/./ExpressionTests/CppModuleConfigurationTest.AmbiguousCLib (1558 of 2363) PASS: lldb-api :: functionalities/gdb_remote_client/TestGDBRemoteDiskFileCompletion.py (1559 of 2363) PASS: lldb-shell :: ScriptInterpreter/Python/command_relative_import.test (1560 of 2363) PASS: lldb-shell :: Breakpoint/debug_addrx.test (1561 of 2363) PASS: lldb-unit :: ScriptInterpreter/Python/./ScriptInterpreterPythonTests/PythonDataObjectsTest.TestRun (1562 of 2363) PASS: lldb-api :: commands/target/auto-install-main-executable/TestAutoInstallMainExecutable.py (1563 of 2363) PASS: lldb-shell :: SymbolFile/DWARF/x86/dir-separator-windows.s (1564 of 2363) PASS: lldb-shell :: SymbolFile/Breakpad/unwind-via-raSearch.test (1565 of 2363) PASS: lldb-api :: functionalities/thread/concurrent_events/TestConcurrentWatchBreakDelay.py (1566 of 2363) PASS: lldb-api :: functionalities/data-formatter/data-formatter-stl/libcxx/iterator/TestDataFormatterLibccIterator.py (1567 of 2363) PASS: lldb-api :: api/multiple-debuggers/TestMultipleDebuggers.py (1568 of 2363) PASS: lldb-api :: functionalities/unwind/noreturn/module-end/TestNoReturnModuleEnd.py (1569 of 2363) PASS: lldb-shell :: Unwind/thread-step-out-ret-addr-check.test (1570 of 2363) UNSUPPORTED: lldb-api :: commands/trace/TestTraceLoad.py (1571 of 2363) PASS: lldb-api :: functionalities/type_lookup/TestTypeLookup.py (1572 of 2363) PASS: lldb-api :: functionalities/gdb_remote_client/TestStopPCs.py (1573 of 2363) PASS: lldb-api :: terminal/TestEditline.py (1574 of 2363) PASS: lldb-api :: macosx/find-dsym/bundle-with-dot-in-filename/TestBundleWithDotInFilename.py (1575 of 2363) PASS: lldb-shell :: Register/Core/x86-64-linux-gp.test (1576 of 2363) PASS: lldb-api :: lang/objc/forward-decl/TestForwardDecl.py (1577 of 2363) PASS: lldb-api :: functionalities/thread/concurrent_events/TestConcurrentWatchBreak.py (1578 of 2363) PASS: lldb-api :: commands/expression/class_template_specialization_empty_pack/TestClassTemplateSpecializationParametersHandling.py (1579 of 2363) PASS: lldb-api :: lang/objc/objc-optimized/TestObjcOptimized.py (1580 of 2363) PASS: lldb-unit :: Utility/./UtilityTests/TimerTest.CategoryTimes (1581 of 2363) UNSUPPORTED: lldb-shell :: SymbolFile/DWARF/split-dwarf-expression-eval-bug.cpp (1582 of 2363) PASS: lldb-unit :: Expression/./ExpressionTests/DiagnosticManagerTest.AppendMessageAttachToLastDiag (1583 of 2363) PASS: lldb-shell :: ObjectFile/PECOFF/disassemble-thumb.yaml (1584 of 2363) PASS: lldb-unit :: Utility/./UtilityTests/StreamTest.PutHex16ByteOrderLittle (1585 of 2363) PASS: lldb-api :: lang/cpp/default-template-args/TestDefaultTemplateArgs.py (1586 of 2363) UNSUPPORTED: lldb-shell :: ScriptInterpreter/Lua/command_script_import.test (1587 of 2363) PASS: lldb-shell :: Settings/TestSettingsWrite.test (1588 of 2363) PASS: lldb-unit :: Utility/./UtilityTests/OptionsWithRawTest.SingleWordSuffix (1589 of 2363) PASS: lldb-unit :: Host/./HostTests/SocketTests/SocketTest.UDPConnect/ipv4 (1590 of 2363) PASS: lldb-unit :: Language/Highlighting/./HighlighterTests/HighlighterTest.Keywords (1591 of 2363) PASS: lldb-api :: commands/process/attach-resume/TestAttachResume.py (1592 of 2363) PASS: lldb-unit :: Utility/./UtilityTests/DataExtractorTest.GetCStrUnterminated (1593 of 2363) PASS: lldb-api :: functionalities/inferior-crashing/TestInferiorCrashingStep.py (1594 of 2363) PASS: lldb-api :: api/log/TestAPILog.py (1595 of 2363) PASS: lldb-api :: python_api/function_symbol/TestSymbolAPI.py (1596 of 2363) PASS: lldb-unit :: Process/Utility/./ProcessUtilityTests/MemoryTagManagerAArch64MTETest.GetLogicalTag (1597 of 2363) PASS: lldb-unit :: Host/./HostTests/PipeTest.OpenAsReader (1598 of 2363) PASS: lldb-unit :: Utility/./UtilityTests/ScalarTest.ComparisonFloat (1599 of 2363) PASS: lldb-unit :: Process/gdb-remote/./ProcessGdbRemoteTests/GDBRemoteCommunicationClientTest.TestPacketSpeedJSON (1600 of 2363) UNSUPPORTED: lldb-shell :: ScriptInterpreter/Lua/convenience_variables.test (1601 of 2363) PASS: lldb-api :: lang/objcxx/objcxx-ivar-vector/TestIvarVector.py (1602 of 2363) PASS: lldb-api :: commands/expression/scoped_enums/TestScopedEnumType.py (1603 of 2363) PASS: lldb-api :: functionalities/data-formatter/data-formatter-objc/TestDataFormatterObjCKVO.py (1604 of 2363) PASS: lldb-unit :: Utility/./UtilityTests/RangeTest.ContainsEndInclusiveInvalid (1605 of 2363) PASS: lldb-shell :: ObjectFile/PDB/object.test (1606 of 2363) PASS: lldb-unit :: Process/gdb-remote/./ProcessGdbRemoteTests/PortMapTest.FreePortForProcess (1607 of 2363) PASS: lldb-unit :: Interpreter/./InterpreterTests/OptionArgParserTest.toChar (1608 of 2363) PASS: lldb-unit :: DataFormatter/./LLDBFormatterTests/FormatManagerTests.CompatibleLangs (1609 of 2363) PASS: lldb-api :: functionalities/data-formatter/ostypeformatting/TestFormattersOsType.py (1610 of 2363) PASS: lldb-api :: functionalities/memory/cache/TestMemoryCache.py (1611 of 2363) PASS: lldb-unit :: Utility/./UtilityTests/StreamTest.PutBytesAsRawHex8ToLittleEndian (1612 of 2363) PASS: lldb-api :: lang/cpp/char8_t/TestCxxChar8_t.py (1613 of 2363) PASS: lldb-api :: functionalities/thread/concurrent_events/TestConcurrentDelayedCrashWithBreakpointSignal.py (1614 of 2363) PASS: lldb-api :: functionalities/breakpoint/breakpoint_command/TestBreakpointCommandsFromPython.py (1615 of 2363) PASS: lldb-api :: functionalities/unwind/noreturn/TestNoreturnUnwind.py (1616 of 2363) PASS: lldb-unit :: Utility/./UtilityTests/StreamTest.AddressSize (1617 of 2363) PASS: lldb-unit :: Utility/./UtilityTests/BinaryStreamTest.PutULEB128FiveBytes (1618 of 2363) PASS: lldb-shell :: Unwind/eh-frame-dwarf-unwind.test (1619 of 2363) PASS: lldb-shell :: SymbolFile/dissassemble-entry-point.s (1620 of 2363) PASS: lldb-unit :: ScriptInterpreter/Python/./ScriptInterpreterPythonTests/PythonDataObjectsTest.TestPythonListManipulation (1621 of 2363) PASS: lldb-unit :: Utility/./UtilityTests/StringLexerTest.PutBack (1622 of 2363) PASS: lldb-api :: sanity/TestSettingSkipping.py (1623 of 2363) PASS: lldb-api :: lang/cpp/global_operators/TestCppGlobalOperators.py (1624 of 2363) PASS: lldb-shell :: SymbolFile/DWARF/x86/static_scope.s (1625 of 2363) PASS: lldb-unit :: SymbolFile/NativePDB/./SymbolFileNativePDBTests/PDBFPOProgramToDWARFExpressionTests.MissingTargetRegister (1626 of 2363) PASS: lldb-unit :: Utility/./UtilityTests/StringExtractorGDBRemoteTest.GetPidTidMultipleValues (1627 of 2363) PASS: lldb-unit :: Utility/./UtilityTests/DataExtractorTest.GetMaxS64 (1628 of 2363) PASS: lldb-shell :: SymbolFile/Breakpad/line-table-missing-file.test (1629 of 2363) PASS: lldb-api :: commands/command/delete/TestCommandDelete.py (1630 of 2363) UNSUPPORTED: lldb-shell :: Watchpoint/netbsd-nouserdbregs.test (1631 of 2363) PASS: lldb-api :: functionalities/thread/concurrent_events/TestConcurrentCrashWithWatchpointBreakpointSignal.py (1632 of 2363) PASS: lldb-unit :: Process/gdb-remote/./ProcessGdbRemoteTests/GDBRemoteCommunicationServerTest.SendErrorResponse_UnimplementedError (1633 of 2363) PASS: lldb-api :: functionalities/tail_call_frames/disambiguate_call_site/TestDisambiguateCallSite.py (1634 of 2363) PASS: lldb-api :: commands/expression/two-files/TestObjCTypeQueryFromOtherCompileUnit.py (1635 of 2363) PASS: lldb-api :: lang/objc/objc-ivar-protocols/TestIvarProtocols.py (1636 of 2363) PASS: lldb-api :: python_api/target/TestTargetAPI.py (1637 of 2363) PASS: lldb-api :: python_api/breakpoint/TestBreakpointAPI.py (1638 of 2363) PASS: lldb-unit :: Process/Utility/./ProcessUtilityTests/MemoryTagManagerAArch64MTETest.RepeatTagsForRange (1639 of 2363) PASS: lldb-shell :: Process/TestEnvironment.test (1640 of 2363) PASS: lldb-shell :: ObjectFile/ELF/basic-info.yaml (1641 of 2363) PASS: lldb-unit :: Expression/./ExpressionTests/DiagnosticManagerTest.PutStringSeverities (1642 of 2363) PASS: lldb-api :: lang/cpp/dynamic-value-same-basename/TestDynamicValueSameBase.py (1643 of 2363) UNSUPPORTED: lldb-api :: functionalities/data-formatter/data-formatter-stl/libstdcpp/iterator/TestDataFormatterStdIterator.py (1644 of 2363) UNSUPPORTED: lldb-shell :: Register/x86-64-zmm-read.test (1645 of 2363) PASS: lldb-api :: lang/cpp/overloaded-functions/TestOverloadedFunctions.py (1646 of 2363) PASS: lldb-unit :: Utility/./UtilityTests/ListenerTest.GetEventImmediate (1647 of 2363) PASS: lldb-api :: functionalities/var_path/TestVarPath.py (1648 of 2363) UNSUPPORTED: lldb-shell :: Unwind/eh-frame-augment-noop.test (1649 of 2363) PASS: lldb-api :: commands/expression/save_jit_objects/TestSaveJITObjects.py (1650 of 2363) PASS: lldb-api :: lang/c/register_variables/TestRegisterVariables.py (1651 of 2363) UNSUPPORTED: lldb-shell :: SymbolFile/PDB/func-symbols.test (1652 of 2363) PASS: lldb-api :: commands/settings/use_source_cache/TestUseSourceCache.py (1653 of 2363) PASS: lldb-api :: commands/expression/persistent_variables/TestPersistentVariables.py (1654 of 2363) PASS: lldb-api :: functionalities/scripted_process/TestScriptedProcess.py (1655 of 2363) UNSUPPORTED: lldb-shell :: Reproducer/TestLuaImport.test (1656 of 2363) PASS: lldb-unit :: Host/./HostTests/SocketTests/SocketTest.TCPListen0GetPort/ipv6 (1657 of 2363) PASS: lldb-shell :: SymbolFile/NativePDB/function-types-calling-conv.cpp (1658 of 2363) PASS: lldb-unit :: Utility/./UtilityTests/BroadcasterTest.EventTypeHasListeners (1659 of 2363) UNSUPPORTED: lldb-api :: commands/trace/TestTraceDumpInfo.py (1660 of 2363) PASS: lldb-unit :: UnwindAssembly/x86/./UnwindAssemblyx86Tests/Testx86AssemblyInspectionEngine.TestPushESI (1661 of 2363) PASS: lldb-unit :: ScriptInterpreter/Python/./ScriptInterpreterPythonTests/PythonDataObjectsTest.TestPythonTupleSize (1662 of 2363) PASS: lldb-unit :: Utility/./UtilityTests/UriParserTest.MinimalPath (1663 of 2363) PASS: lldb-unit :: Host/./HostTests/FileSystemTest.GetByteSize (1664 of 2363) PASS: lldb-unit :: ScriptInterpreter/Python/./ScriptInterpreterPythonTests/PythonDataObjectsTest.TestPythonTupleInitializerList (1665 of 2363) PASS: lldb-unit :: Utility/./UtilityTests/LogChannelTest.EnableOptions (1666 of 2363) PASS: lldb-unit :: Utility/./UtilityTests/AnsiTerminal.AtEnd (1667 of 2363) PASS: lldb-unit :: ScriptInterpreter/Python/./ScriptInterpreterPythonTests/PythonDataObjectsTest.TestBorrowedReferences (1668 of 2363) PASS: lldb-unit :: Utility/./UtilityTests/LogChannelTest.Enable (1669 of 2363) PASS: lldb-api :: lang/cpp/incomplete-types/TestCppIncompleteTypes.py (1670 of 2363) PASS: lldb-unit :: UnwindAssembly/x86/./UnwindAssemblyx86Tests/Testx86AssemblyInspectionEngine.TestPushRBP (1671 of 2363) PASS: lldb-shell :: SymbolFile/Breakpad/stack-cfi-arm.yaml (1672 of 2363) PASS: lldb-api :: python_api/thread/TestThreadAPI.py (1673 of 2363) PASS: lldb-api :: functionalities/completion/TestCompletion.py (1674 of 2363) PASS: lldb-unit :: Process/minidump/./LLDBMinidumpTests/RegisterContextMinidump.CheckRegisterContextMinidump_ARM (1675 of 2363) PASS: lldb-unit :: Core/./LLDBCoreTests/CommunicationTest.SynchronizeWhileClosing (1676 of 2363) PASS: lldb-unit :: Utility/./UtilityTests/SerializationRountripTest.SerializeDeserializePodPointers (1677 of 2363) PASS: lldb-unit :: Expression/./ExpressionTests/CppModuleConfigurationTest.LinuxLocalLibCpp (1678 of 2363) PASS: lldb-unit :: Utility/./UtilityTests/ArgsTest.TestAppendArg (1679 of 2363) PASS: lldb-shell :: Commands/command-disassemble-process.yaml (1680 of 2363) PASS: lldb-unit :: Utility/./UtilityTests/DataExtractorTest.GetBitfield (1681 of 2363) PASS: lldb-unit :: Process/Utility/./ProcessUtilityTests/ProcSMapTests/LinuxProcSMapsTestFixture.ParseSMapRegions/6 (1682 of 2363) PASS: lldb-api :: functionalities/data-formatter/nsarraysynth/TestNSArraySynthetic.py (1683 of 2363) PASS: lldb-api :: functionalities/unwind/sigtramp/TestSigtrampUnwind.py (1684 of 2363) PASS: lldb-shell :: Breakpoint/split-dwarf-5-addrbase.test (1685 of 2363) PASS: lldb-api :: functionalities/data-formatter/parray/TestPrintArray.py (1686 of 2363) PASS: lldb-unit :: Process/Utility/./ProcessUtilityTests/ProcMapTests/LinuxProcMapsTestFixture.ParseMapRegions/2 (1687 of 2363) PASS: lldb-api :: commands/source/info/TestSourceInfo.py (1688 of 2363) PASS: lldb-api :: functionalities/data-formatter/data-formatter-smart-array/TestDataFormatterSmartArray.py (1689 of 2363) PASS: lldb-unit :: Process/Utility/./ProcessUtilityTests/MemoryTagManagerAArch64MTETest.AddressDiff (1690 of 2363) PASS: lldb-api :: functionalities/breakpoint/source_regexp/TestSourceRegexBreakpoints.py (1691 of 2363) PASS: lldb-unit :: Utility/./UtilityTests/CompletionRequest.TryCompleteCurrentArgGood (1692 of 2363) PASS: lldb-api :: functionalities/reproducers/attach/TestReproducerAttach.py (1693 of 2363) PASS: lldb-api :: types/TestDoubleTypesExpr.py (1694 of 2363) PASS: lldb-unit :: Interpreter/./InterpreterTests/OptionValueFileColonLine.setFromString (1695 of 2363) PASS: lldb-unit :: Utility/./UtilityTests/StreamTeeTest.AppendStream (1696 of 2363) PASS: lldb-unit :: Utility/./UtilityTests/StringListTest.GetMaxStringLengthEqualSize (1697 of 2363) PASS: lldb-api :: commands/gui/viewlarge/TestGuiViewLarge.py (1698 of 2363) PASS: lldb-api :: lang/c/forward/TestForwardDeclaration.py (1699 of 2363) PASS: lldb-api :: functionalities/postmortem/netbsd-core/TestNetBSDCore.py (1700 of 2363) PASS: lldb-unit :: Utility/./UtilityTests/ArgsTest.ReplaceArgumentAtIndexLonger (1701 of 2363) PASS: lldb-shell :: ScriptInterpreter/Python/scripted_breakpoint.test (1702 of 2363) PASS: lldb-api :: functionalities/data-formatter/data-formatter-stl/libcxx/queue/TestDataFormatterLibcxxQueue.py (1703 of 2363) UNSUPPORTED: lldb-api :: benchmarks/libcxxmap/TestBenchmarkLibcxxMap.py (1704 of 2363) PASS: lldb-unit :: Utility/./UtilityTests/UriParserTest.BadPort2 (1705 of 2363) PASS: lldb-unit :: Utility/./UtilityTests/RangeTest.LessThanInvalid (1706 of 2363) PASS: lldb-api :: commands/expression/persist_objc_pointeetype/TestPersistObjCPointeeType.py (1707 of 2363) PASS: lldb-shell :: SymbolFile/DWARF/x86/debug_rnglists-dwo.s (1708 of 2363) PASS: lldb-api :: lang/objc/objc-property/TestObjCProperty.py (1709 of 2363) PASS: lldb-unit :: Process/gdb-remote/./ProcessGdbRemoteTests/PortMapTest.AllowPort (1710 of 2363) PASS: lldb-api :: types/TestLongTypesExpr.py (1711 of 2363) PASS: lldb-unit :: Process/gdb-remote/./ProcessGdbRemoteTests/GDBRemoteCommunicationClientTest.GetModulesInfo_UUID20 (1712 of 2363) PASS: lldb-shell :: SymbolFile/NativePDB/source-list.cpp (1713 of 2363) PASS: lldb-unit :: Utility/./UtilityTests/VMRange.CollectionContains (1714 of 2363) PASS: lldb-unit :: Core/./LLDBCoreTests/SourceLocationSpecTest.FileLineColumnComponents (1715 of 2363) PASS: lldb-unit :: Disassembler/./DisassemblerTests/TestArm64Disassembly.TestArmv81Instruction (1716 of 2363) PASS: lldb-api :: lang/c/strings/TestCStrings.py (1717 of 2363) PASS: lldb-api :: functionalities/memory/find/TestMemoryFind.py (1718 of 2363) PASS: lldb-api :: macosx/DBGSourcePathRemapping/TestDSYMSourcePathRemapping.py (1719 of 2363) PASS: lldb-shell :: SymbolFile/NativePDB/load-pdb.cpp (1720 of 2363) PASS: lldb-api :: functionalities/target_var/TestTargetVar.py (1721 of 2363) PASS: lldb-unit :: Utility/./UtilityTests/RangeDataVector.FindEntryThatContains (1722 of 2363) PASS: lldb-api :: commands/expression/persistent_ptr_update/TestPersistentPtrUpdate.py (1723 of 2363) PASS: lldb-unit :: UnwindAssembly/x86/./UnwindAssemblyx86Tests/Testx86AssemblyInspectionEngine.TestCALLNextInsn (1724 of 2363) PASS: lldb-api :: lang/objc/rdar-11355592/TestRdar11355592.py (1725 of 2363) PASS: lldb-shell :: SymbolFile/DWARF/x86/debug_loc.s (1726 of 2363) PASS: lldb-shell :: SymbolFile/DWARF/x86/debug-types-dwarf5.s (1727 of 2363) PASS: lldb-unit :: Utility/./UtilityTests/RangeDataVector.FindEntryThatContains_Overlap (1728 of 2363) PASS: lldb-unit :: Thread/./ThreadTests/ThreadTest.SetStopInfo (1729 of 2363) PASS: lldb-api :: functionalities/data-formatter/data-formatter-proper-plurals/TestFormattersOneIsSingular.py (1730 of 2363) PASS: lldb-unit :: Utility/./UtilityTests/SerializationRountripTest.SerializeDeserializeCStringArrayNullptr (1731 of 2363) PASS: lldb-api :: lang/cpp/break-on-initializers/TestBreakOnCPP11Initializers.py (1732 of 2363) PASS: lldb-unit :: Host/./HostTests/NativeProcessProtocolTest.ReadCStringFromMemory (1733 of 2363) PASS: lldb-api :: commands/expression/function_template_specialization_temp_args/TestFunctionTemplateSpecializationTempArgs.py (1734 of 2363) PASS: lldb-unit :: Symbol/./SymbolTests/TestTypeSystemClang.TestDisplayName (1735 of 2363) PASS: lldb-shell :: SymbolFile/DWARF/x86/dwarf5_tu_index_abbrev_offset.s (1736 of 2363) PASS: lldb-api :: tools/lldb-server/TestGdbRemoteExitCode.py (1737 of 2363) PASS: lldb-api :: lang/c/array_types/TestArrayTypes.py (1738 of 2363) PASS: lldb-unit :: Symbol/./SymbolTests/TestClangASTImporter.CanImportInvalidType (1739 of 2363) PASS: lldb-unit :: Language/Highlighting/./HighlighterTests/HighlighterTest.Colons (1740 of 2363) PASS: lldb-api :: lang/objc/conflicting-definition/TestConflictingDefinition.py (1741 of 2363) PASS: lldb-unit :: Utility/./UtilityTests/ScalarTest.SetValueFromCString (1742 of 2363) PASS: lldb-unit :: Utility/./UtilityTests/CompletionRequest.TryCompleteCurrentArgMode (1743 of 2363) UNSUPPORTED: lldb-api :: arm/breakpoint-it/TestBreakpointIt.py (1744 of 2363) PASS: lldb-shell :: SymbolFile/DWARF/x86/dwp.s (1745 of 2363) PASS: lldb-api :: lang/c/complex/TestComplexC99.py (1746 of 2363) PASS: lldb-api :: lang/c/blocks/TestBlocks.py (1747 of 2363) PASS: lldb-unit :: Symbol/./SymbolTests/TestTypeSystemClang.TestGetTypeClassTypeOf (1748 of 2363) PASS: lldb-api :: lang/cpp/modules-import/TestCXXModulesImport.py (1749 of 2363) PASS: lldb-api :: commands/watchpoints/watchpoint_size/TestWatchpointSizes.py (1750 of 2363) PASS: lldb-unit :: SymbolFile/NativePDB/./SymbolFileNativePDBTests/PDBFPOProgramToDWARFExpressionTests.SingleAssignmentRegisterRef (1751 of 2363) PASS: lldb-api :: commands/expression/completion-crash-incomplete-record/TestCompletionCrashIncompleteRecord.py (1752 of 2363) PASS: lldb-api :: commands/expression/entry-bp/TestExprEntryBP.py (1753 of 2363) UNSUPPORTED: lldb-shell :: ScriptInterpreter/Lua/bindings.test (1754 of 2363) PASS: lldb-api :: types/TestShortTypeExpr.py (1755 of 2363) PASS: lldb-unit :: Utility/./UtilityTests/StreamTest.ShiftOperatorPtr (1756 of 2363) PASS: lldb-unit :: Utility/./UtilityTests/UriParserTest.Minimal (1757 of 2363) PASS: lldb-unit :: SymbolFile/DWARF/./SymbolFileDWARFTests/SymbolFileDWARFTests.TestAbbrevNullAttrValidForm (1758 of 2363) PASS: lldb-unit :: Symbol/./SymbolTests/LineEntryTest.GetSameLineContiguousAddressRangeOneInline (1759 of 2363) PASS: lldb-api :: commands/expression/call-function/TestCallUserDefinedFunction.py (1760 of 2363) PASS: lldb-unit :: Utility/./UtilityTests/Flags.Reset (1761 of 2363) PASS: lldb-unit :: Utility/./UtilityTests/StreamTest.Indent (1762 of 2363) PASS: lldb-unit :: Host/./HostTests/HostInfoTestInitialization.InitTwice (1763 of 2363) PASS: lldb-api :: lang/c/vla/TestVLA.py (1764 of 2363) PASS: lldb-shell :: ObjectFile/ELF/PT_LOAD-overlap-section.yaml (1765 of 2363) PASS: lldb-api :: commands/thread/select/TestThreadSelect.py (1766 of 2363) PASS: lldb-shell :: SymbolFile/DWARF/x86/inline-function-address-shared.test (1767 of 2363) PASS: lldb-shell :: Driver/TestUseColor.test (1768 of 2363) PASS: lldb-api :: functionalities/breakpoint/breakpoint_set_restart/TestBreakpointSetRestart.py (1769 of 2363) PASS: lldb-unit :: Utility/./UtilityTests/Flags.AnySet (1770 of 2363) PASS: lldb-unit :: Utility/./UtilityTests/StringListTest.GetMaxStringLengthDecreasingSize (1771 of 2363) PASS: lldb-api :: functionalities/data-formatter/data-formatter-stl/libcxx/list/loop/TestDataFormatterLibcxxListLoop.py (1772 of 2363) PASS: lldb-api :: functionalities/breakpoint/scripted_bkpt/TestScriptedResolver.py (1773 of 2363) UNSUPPORTED: lldb-api :: tools/intel-features/intel-pt/test/TestIntelPTSimpleBinary.py (1774 of 2363) PASS: lldb-api :: python_api/watchpoint/watchlocation/TestTargetWatchAddress.py (1775 of 2363) PASS: lldb-unit :: DataFormatter/./LLDBFormatterTests/StringPrinterTests.SwiftUTF8 (1776 of 2363) PASS: lldb-shell :: Commands/command-breakpoint-col.test (1777 of 2363) PASS: lldb-api :: macosx/thread-names/TestInterruptThreadNames.py (1778 of 2363) PASS: lldb-api :: commands/expression/dollar-in-variable/TestDollarInVariable.py (1779 of 2363) PASS: lldb-api :: functionalities/breakpoint/move_nearest/TestMoveNearest.py (1780 of 2363) PASS: lldb-unit :: Utility/./UtilityTests/LogTest.Register (1781 of 2363) PASS: lldb-unit :: Utility/./UtilityTests/ArgsTest.ReplaceArgumentAtIndexFarOutOfRange (1782 of 2363) PASS: lldb-unit :: Utility/./UtilityTests/UriParserTest.TypicalPortPathIPv6 (1783 of 2363) PASS: lldb-unit :: Host/./HostTests/NativeProcessProtocolTest.SetBreakpoint (1784 of 2363) PASS: lldb-shell :: Breakpoint/jit-loader_rtdyld_elf.test (1785 of 2363) XFAIL: lldb-shell :: Register/x86-64-fp-write.test (1786 of 2363) XFAIL: lldb-shell :: Unwind/prefer-debug-over-eh-frame.test (1787 of 2363) PASS: lldb-unit :: Language/Highlighting/./HighlighterTests/HighlighterTest.ClangTrailingBackslashWithWhitespace (1788 of 2363) PASS: lldb-shell :: SymbolFile/DWARF/x86/debug-types-line-tables.s (1789 of 2363) PASS: lldb-unit :: Language/Highlighting/./HighlighterTests/HighlighterTest.ClangStringLiterals (1790 of 2363) PASS: lldb-shell :: Breakpoint/jit-loader_jitlink_elf.test (1791 of 2363) PASS: lldb-shell :: SymbolFile/DWARF/x86/find-basic-type.cpp (1792 of 2363) PASS: lldb-api :: tools/lldb-vscode/breakpoint/TestVSCode_setBreakpoints.py (1793 of 2363) PASS: lldb-unit :: Utility/./UtilityTests/ScalarTest.GetValue (1794 of 2363) PASS: lldb-unit :: Symbol/./SymbolTests/TestClangASTImporter.CopyTypeTagDecl (1795 of 2363) PASS: lldb-unit :: Process/minidump/./LLDBMinidumpTests/MinidumpParserTest.MinidumpDuplicateModuleMappedSecondHigh (1796 of 2363) PASS: lldb-shell :: Breakpoint/case-sensitive.test (1797 of 2363) PASS: lldb-shell :: SymbolFile/NativePDB/ast-functions.cpp (1798 of 2363) PASS: lldb-api :: python_api/sblaunchinfo/TestSBLaunchInfo.py (1799 of 2363) PASS: lldb-api :: api/multiple-targets/TestMultipleTargets.py (1800 of 2363) PASS: lldb-unit :: Utility/./UtilityTests/DataExtractorTest.GetSLEB128_bit63 (1801 of 2363) PASS: lldb-unit :: Core/./LLDBCoreTests/FormatEntityTest.DefinitionConstructionNameAndType (1802 of 2363) PASS: lldb-api :: commands/expression/namespace_local_var_same_name_cpp_and_c/TestNamespaceLocalVarSameNameCppAndC.py (1803 of 2363) PASS: lldb-shell :: Quit/TestQuitExitCode-30.test (1804 of 2363) PASS: lldb-unit :: Expression/./ExpressionTests/CppModuleConfigurationTest.UnknownLibCppFile (1805 of 2363) PASS: lldb-api :: commands/frame/diagnose/dereference-argument/TestDiagnoseDereferenceArgument.py (1806 of 2363) PASS: lldb-unit :: ObjectFile/PECOFF/./ObjectFilePECOFFTests/PECallFrameInfoTest.Chained_eh (1807 of 2363) PASS: lldb-shell :: Settings/TestFrameFormatColor.test (1808 of 2363) PASS: lldb-unit :: Utility/./UtilityTests/BinaryStreamTest.PutSLEB128OneByte (1809 of 2363) PASS: lldb-api :: commands/expression/import-std-module/vector-bool/TestVectorBoolFromStdModule.py (1810 of 2363) PASS: lldb-api :: functionalities/wrong_commands/TestWrongCommands.py (1811 of 2363) PASS: lldb-api :: functionalities/thread/concurrent_events/TestConcurrentCrashWithWatchpoint.py (1812 of 2363) PASS: lldb-unit :: Utility/./UtilityTests/UUIDTest.StringConverion (1813 of 2363) PASS: lldb-api :: commands/expression/radar_9673664/TestExprHelpExamples.py (1814 of 2363) PASS: lldb-unit :: Host/./HostTests/File.GetWaitableHandleFileno (1815 of 2363) PASS: lldb-unit :: Utility/./UtilityTests/StreamTest.PutChar (1816 of 2363) PASS: lldb-unit :: Utility/./UtilityTests/StringExtractorTest.GetHexU8_Underflow2 (1817 of 2363) PASS: lldb-unit :: ObjectFile/Breakpad/./ObjectFileBreakpadTests/StackCFIRecord.parse (1818 of 2363) PASS: lldb-unit :: Language/CPlusPlus/./LanguageCPlusPlusTests/CPlusPlusLanguage.MethodNameParsing (1819 of 2363) PASS: lldb-shell :: Minidump/fb-dump.test (1820 of 2363) PASS: lldb-unit :: Utility/./UtilityTests/StructuredDataTest.ParseJSONFromFile (1821 of 2363) PASS: lldb-unit :: SymbolFile/NativePDB/./SymbolFileNativePDBTests/PDBFPOProgramToDWARFExpressionTests.InvalidAssignmentSingle (1822 of 2363) PASS: lldb-unit :: Utility/./UtilityTests/VMRange.ContainsAddr (1823 of 2363) PASS: lldb-unit :: Utility/./UtilityTests/StringLexerTest.NextIf (1824 of 2363) PASS: lldb-api :: functionalities/data-formatter/data-formatter-advanced/TestDataFormatterAdv.py (1825 of 2363) PASS: lldb-shell :: Minidump/no-process-id.yaml (1826 of 2363) PASS: lldb-unit :: Process/Utility/./ProcessUtilityTests/ProcSMapTests/LinuxProcSMapsTestFixture.ParseSMapRegions/1 (1827 of 2363) PASS: lldb-api :: commands/platform/basic/TestPlatformPython.py (1828 of 2363) PASS: lldb-unit :: Utility/./UtilityTests/StringExtractorTest.DecodeHexU8_Extra (1829 of 2363) PASS: lldb-api :: functionalities/data-formatter/data-formatter-categories/TestDataFormatterCategories.py (1830 of 2363) XFAIL: lldb-shell :: SymbolFile/DWARF/find-type-in-function.cpp (1831 of 2363) UNSUPPORTED: lldb-shell :: ScriptInterpreter/Lua/breakpoint_function_callback.test (1832 of 2363) PASS: lldb-unit :: ScriptInterpreter/Python/./ScriptInterpreterPythonTests/PythonDataObjectsTest.TestDictionaryResolutionWithDot (1833 of 2363) PASS: lldb-api :: functionalities/type_get_module/TestTypeGetModule.py (1834 of 2363) PASS: lldb-api :: commands/watchpoints/watchpoint_set_command/TestWatchLocationWithWatchSet.py (1835 of 2363) PASS: lldb-unit :: UnwindAssembly/x86/./UnwindAssemblyx86Tests/Testx86AssemblyInspectionEngine.TestStackRealignMSVC_i386 (1836 of 2363) PASS: lldb-api :: python_api/default-constructor/TestDefaultConstructorForAPIObjects.py (1837 of 2363) PASS: lldb-api :: commands/platform/sdk/TestPlatformSDK.py (1838 of 2363) PASS: lldb-unit :: UnwindAssembly/x86/./UnwindAssemblyx86Tests/Testx86AssemblyInspectionEngine.TestPushExtended (1839 of 2363) PASS: lldb-api :: lang/objc/objc-class-method/TestObjCClassMethod.py (1840 of 2363) UNSUPPORTED: lldb-api :: benchmarks/expression/TestExpressionCmd.py (1841 of 2363) PASS: lldb-shell :: Reproducer/TestReuseDirectory.test (1842 of 2363) PASS: lldb-api :: macosx/load-kext/TestLoadKext.py (1843 of 2363) UNSUPPORTED: lldb-api :: lang/cpp/function-template-parameter-pack/TestFunctionTemplateParameterPack.py (1844 of 2363) PASS: lldb-shell :: Watchpoint/SetErrorCases.test (1845 of 2363) PASS: lldb-unit :: SymbolFile/NativePDB/./SymbolFileNativePDBTests/PDBFPOProgramToDWARFExpressionTests.InvalidOpUnary (1846 of 2363) PASS: lldb-unit :: Symbol/./SymbolTests/TestTypeSystemClang.TestGetEnumIntegerTypeInvalid (1847 of 2363) PASS: lldb-api :: lang/objc/foundation/TestRuntimeTypes.py (1848 of 2363) PASS: lldb-api :: functionalities/gdb_remote_client/TestGDBRemoteClient.py (1849 of 2363) PASS: lldb-shell :: BuildScript/toolchain-clang.test (1850 of 2363) PASS: lldb-unit :: Host/./HostTests/FileSystemTest.EnumerateDirectory (1851 of 2363) PASS: lldb-api :: macosx/queues/TestQueues.py (1852 of 2363) PASS: lldb-unit :: Utility/./UtilityTests/LogChannelEnabledTest.log_options (1853 of 2363) PASS: lldb-unit :: Host/./HostTests/SocketTests/SocketTest.DecodeHostAndPort/ipv6 (1854 of 2363) PASS: lldb-unit :: Utility/./UtilityTests/SubsystemRAIITest.SubsystemWithErrorSuccess (1855 of 2363) PASS: lldb-shell :: Commands/command-backtrace-parser-2.test (1856 of 2363) PASS: lldb-api :: commands/platform/basic/TestPlatformCommand.py (1857 of 2363) PASS: lldb-unit :: Process/Utility/./ProcessUtilityTests/MemoryTagManagerAArch64MTETest.UnpackTagsData (1858 of 2363) PASS: lldb-api :: functionalities/float-display/TestFloatDisplay.py (1859 of 2363) PASS: lldb-shell :: Register/Core/x86-64-netbsd-addr.test (1860 of 2363) PASS: lldb-api :: commands/process/launch-with-shellexpand/TestLaunchWithShellExpand.py (1861 of 2363) PASS: lldb-unit :: Symbol/./SymbolTests/TestTypeSystemClang.TestOwningModule (1862 of 2363) PASS: lldb-api :: functionalities/thread/exit_during_break/TestExitDuringBreak.py (1863 of 2363) PASS: lldb-api :: commands/breakpoint/command/list/TestBreakpointCommandList.py (1864 of 2363) PASS: lldb-unit :: SymbolFile/DWARF/./SymbolFileDWARFTests/DWARFDIETest.ChildIteration (1865 of 2363) PASS: lldb-unit :: UnwindAssembly/x86/./UnwindAssemblyx86Tests/Testx86AssemblyInspectionEngine.TestMovRSPtoRBP (1866 of 2363) PASS: lldb-shell :: SymbolFile/DWARF/x86/find-basic-function.cpp (1867 of 2363) PASS: lldb-api :: functionalities/data-formatter/builtin-formats/TestBuiltinFormats.py (1868 of 2363) PASS: lldb-unit :: Utility/./UtilityTests/StatusTest.ErrorConstructor (1869 of 2363) PASS: lldb-unit :: Host/./HostTests/HostInfoTest.GetAugmentedArchSpec (1870 of 2363) PASS: lldb-api :: lang/cpp/stl/TestSTL.py (1871 of 2363) PASS: lldb-shell :: SymbolFile/DWARF/x86/debug-types-signature-loop.s (1872 of 2363) PASS: lldb-unit :: SymbolFile/DWARF/./SymbolFileDWARFTests/DWARFASTParserClangTests.EnsureAllDIEsInDeclContextHaveBeenParsedParsesOnlyMatchingEntries (1873 of 2363) UNSUPPORTED: lldb-api :: functionalities/unwind/ehframe/TestEhFrameUnwind.py (1874 of 2363) UNSUPPORTED: lldb-api :: functionalities/data-formatter/data-formatter-stl/libstdcpp/unique_ptr/TestDataFormatterStdUniquePtr.py (1875 of 2363) PASS: lldb-unit :: Process/gdb-remote/./ProcessGdbRemoteTests/GDBRemoteCommunicationClientTest.SyncThreadState (1876 of 2363) PASS: lldb-api :: functionalities/thread/concurrent_events/TestConcurrentManyBreakpoints.py (1877 of 2363) PASS: lldb-unit :: Utility/./UtilityTests/EnvironmentTest.EnvpConstruction (1878 of 2363) PASS: lldb-unit :: Utility/./UtilityTests/LogChannelEnabledTest.LLDB_LOG_ERROR (1879 of 2363) PASS: lldb-api :: python_api/frame/TestFrames.py (1880 of 2363) PASS: lldb-api :: lang/cpp/unsigned_types/TestUnsignedTypes.py (1881 of 2363) PASS: lldb-api :: commands/target/create-no-such-arch/TestNoSuchArch.py (1882 of 2363) PASS: lldb-unit :: Symbol/./SymbolTests/TestTypeSystemClang.AddMethodToObjCObjectType (1883 of 2363) PASS: lldb-api :: functionalities/thread/num_threads/TestNumThreads.py (1884 of 2363) PASS: lldb-unit :: Utility/./UtilityTests/ScalarTest.SetValueFromData (1885 of 2363) PASS: lldb-api :: functionalities/dlopen_other_executable/TestDlopenOtherExecutable.py (1886 of 2363) PASS: lldb-unit :: Process/minidump/./LLDBMinidumpTests/MinidumpParserTest.GetArchitecture (1887 of 2363) PASS: lldb-shell :: SymbolFile/DWARF/x86/dwarf5-debug_line.s (1888 of 2363) PASS: lldb-unit :: Utility/./UtilityTests/StringLexerTest.Next (1889 of 2363) PASS: lldb-unit :: Language/Highlighting/./HighlighterTests/HighlighterTest.FallbackHighlighter (1890 of 2363) PASS: lldb-api :: functionalities/thread/concurrent_events/TestConcurrentSignalNWatchNBreak.py (1891 of 2363) PASS: lldb-unit :: Expression/./ExpressionTests/DiagnosticManagerTest.PutString (1892 of 2363) PASS: lldb-unit :: Symbol/./SymbolTests/TestTypeSystemClang.GetExeModuleWhenMissingSymbolFile (1893 of 2363) PASS: lldb-unit :: Utility/./UtilityTests/DataExtractorTest.GetCStr (1894 of 2363) PASS: lldb-api :: api/check_public_api_headers/TestPublicAPIHeaders.py (1895 of 2363) PASS: lldb-api :: functionalities/tail_call_frames/disambiguate_tail_call_seq/TestDisambiguateTailCallSeq.py (1896 of 2363) PASS: lldb-unit :: Utility/./UtilityTests/StringListTest.InsertStringAtIndexOutOfBounds (1897 of 2363) UNSUPPORTED: lldb-shell :: ScriptInterpreter/Lua/lua-python.test (1898 of 2363) PASS: lldb-unit :: Utility/./UtilityTests/StringExtractorTest.DecodeHexU8_Underflow (1899 of 2363) PASS: lldb-api :: functionalities/postmortem/minidump-new/TestMiniDumpNew.py (1900 of 2363) PASS: lldb-unit :: Utility/./UtilityTests/RangeDataVector.FindEntryIndexesThatContain_Overlap (1901 of 2363) PASS: lldb-shell :: Settings/TestStopCommandSourceOnError.test (1902 of 2363) PASS: lldb-api :: functionalities/postmortem/mach-core/TestMachCore.py (1903 of 2363) PASS: lldb-api :: commands/frame/var/TestFrameVar.py (1904 of 2363) PASS: lldb-shell :: Host/TestCustomShell.test (1905 of 2363) PASS: lldb-api :: commands/expression/pr35310/TestExprsBug35310.py (1906 of 2363) PASS: lldb-shell :: ScriptInterpreter/Python/command_import.test (1907 of 2363) PASS: lldb-api :: lang/cpp/class_types/TestClassTypes.py (1908 of 2363) PASS: lldb-shell :: SymbolFile/DWARF/x86/debug-types-missing-signature.test (1909 of 2363) PASS: lldb-unit :: Utility/./UtilityTests/StreamTest.PutBytesAsRawHex8ToMixedEndian (1910 of 2363) PASS: lldb-unit :: Signals/./SignalsTests/UnixSignalsTest.GetInfo (1911 of 2363) PASS: lldb-shell :: ObjectFile/Breakpad/discontiguous-sections.test (1912 of 2363) PASS: lldb-api :: tools/lldb-vscode/coreFile/TestVSCode_coreFile.py (1913 of 2363) PASS: lldb-unit :: Target/./TargetTests/StackFrameRecognizerTest.NullModuleRegex (1914 of 2363) PASS: lldb-api :: commands/frame/diagnose/complicated-expression/TestComplicatedExpression.py (1915 of 2363) UNSUPPORTED: lldb-shell :: Unwind/unwind-plan-dwarf-dump.test (1916 of 2363) UNSUPPORTED: lldb-api :: commands/register/register/intel_xtended_registers/mpx_offset_intersection/TestMPXOffsetIntersection.py (1917 of 2363) PASS: lldb-unit :: Utility/./UtilityTests/StreamTest.PutHex32ByteOrderBig (1918 of 2363) PASS: lldb-shell :: ObjectFile/wasm/stripped-debug-sections.yaml (1919 of 2363) PASS: lldb-unit :: Utility/./UtilityTests/OptionsWithRawTest.EmptySuffix (1920 of 2363) PASS: lldb-unit :: Utility/./UtilityTests/ArgsTest.TestOverwriteArgs (1921 of 2363) PASS: lldb-unit :: Utility/./UtilityTests/ArgsTest.AppendArguments (1922 of 2363) PASS: lldb-unit :: Utility/./UtilityTests/DataExtractorTest.UncommonAddressSize (1923 of 2363) PASS: lldb-api :: macosx/profile_vrs_detach/TestDetachVrsProfile.py (1924 of 2363) PASS: lldb-unit :: SymbolFile/DWARF/./SymbolFileDWARFTests/SymbolFileDWARFTests.ParseArangesNonzeroSegmentSize (1925 of 2363) PASS: lldb-api :: functionalities/thread/concurrent_events/TestConcurrentManyCrash.py (1926 of 2363) PASS: lldb-unit :: Utility/./UtilityTests/Flags.Test (1927 of 2363) PASS: lldb-api :: functionalities/data-formatter/vector-types/TestVectorTypesFormatting.py (1928 of 2363) PASS: lldb-api :: commands/platform/process/list/TestProcessList.py (1929 of 2363) PASS: lldb-api :: macosx/order/TestOrderFile.py (1930 of 2363) PASS: lldb-api :: commands/expression/cast_int_to_anonymous_enum/TestCastIntToAnonymousEnum.py (1931 of 2363) PASS: lldb-api :: lang/c/step-target/TestStepTarget.py (1932 of 2363) PASS: lldb-unit :: Utility/./UtilityTests/RangeTest.LessThan (1933 of 2363) PASS: lldb-api :: functionalities/data-formatter/varscript_formatting/TestDataFormatterVarScriptFormatting.py (1934 of 2363) UNSUPPORTED: lldb-shell :: Expr/TestIRMemoryMapWindows.test (1935 of 2363) PASS: lldb-unit :: Utility/./UtilityTests/LogChannelEnabledTest.LogVerboseThread (1936 of 2363) PASS: lldb-api :: functionalities/gdb_remote_client/TestNestedRegDefinitions.py (1937 of 2363) PASS: lldb-unit :: Utility/./UtilityTests/ArgsTest.GetArgumentArrayRef (1938 of 2363) PASS: lldb-shell :: Register/Core/x86-32-linux-fp.test (1939 of 2363) PASS: lldb-unit :: Utility/./UtilityTests/StringExtractorTest.DecodeHexU8_InvalidHex2 (1940 of 2363) PASS: lldb-shell :: Reproducer/TestVerify.test (1941 of 2363) PASS: lldb-unit :: Utility/./UtilityTests/StringExtractorTest.GetHexBytes_Underflow (1942 of 2363) PASS: lldb-unit :: Interpreter/./InterpreterTests/TestProperties.DeepCopy (1943 of 2363) PASS: lldb-unit :: SymbolFile/NativePDB/./SymbolFileNativePDBTests/PDBFPOProgramToDWARFExpressionTests.UnsupportedRASearch (1944 of 2363) UNSUPPORTED: lldb-api :: tools/lldb-server/TestGdbRemoteFork.py (1945 of 2363) PASS: lldb-api :: lang/cpp/bitfields/TestCppBitfields.py (1946 of 2363) PASS: lldb-api :: lang/cpp/char1632_t/TestChar1632T.py (1947 of 2363) PASS: lldb-unit :: Expression/./ExpressionTests/DiagnosticManagerTest.AppendMessageSubsequentDiags (1948 of 2363) PASS: lldb-api :: commands/command/nested_alias/TestNestedAlias.py (1949 of 2363) PASS: lldb-unit :: Symbol/./SymbolTests/PostfixExpression.ParseFPOProgram (1950 of 2363) PASS: lldb-unit :: Process/Utility/./ProcessUtilityTests/RegisterContext_x86Test.FullToAbridgedTagWord (1951 of 2363) PASS: lldb-unit :: Process/minidump/./LLDBMinidumpTests/MinidumpParserTest.GetPidWindows (1952 of 2363) PASS: lldb-unit :: Expression/./ExpressionTests/DWARFExpression.DW_OP_const (1953 of 2363) PASS: lldb-unit :: Expression/./ExpressionTests/DWARFExpression.DW_OP_convert (1954 of 2363) PASS: lldb-unit :: Utility/./UtilityTests/SharedCluster.ClusterManager (1955 of 2363) PASS: lldb-shell :: Driver/TestSingleQuote.test (1956 of 2363) PASS: lldb-unit :: Utility/./UtilityTests/RecordReplayTest.InstrumentedFoo (1957 of 2363) PASS: lldb-api :: lang/objc/objc++/TestObjCXX.py (1958 of 2363) PASS: lldb-unit :: ObjectFile/Breakpad/./ObjectFileBreakpadTests/FileRecord.parse (1959 of 2363) PASS: lldb-shell :: Driver/TestPositionalArgs.test (1960 of 2363) PASS: lldb-unit :: Language/Highlighting/./HighlighterTests/HighlighterTest.ClangCursorPosInOtherToken (1961 of 2363) PASS: lldb-shell :: SymbolFile/DWARF/x86/DW_AT_const_value-bitfields.s (1962 of 2363) PASS: lldb-unit :: ObjectFile/Breakpad/./ObjectFileBreakpadTests/LineRecord.parse (1963 of 2363) PASS: lldb-unit :: Utility/./UtilityTests/DataExtractorTest.GetMaxU64_unchecked (1964 of 2363) PASS: lldb-unit :: Utility/./UtilityTests/RangeTest.DefaultConstructor (1965 of 2363) PASS: lldb-shell :: Settings/TestEchoCommands.test (1966 of 2363) PASS: lldb-unit :: Process/minidump/./LLDBMinidumpTests/MinidumpParserTest.GetPid (1967 of 2363) PASS: lldb-shell :: Register/Core/x86-64-freebsd-addr.test (1968 of 2363) PASS: lldb-unit :: Expression/./ExpressionTests/CppModuleConfigurationTest.LibCppV2 (1969 of 2363) PASS: lldb-api :: commands/command/invalid-args/TestInvalidArgsCommand.py (1970 of 2363) PASS: lldb-api :: lang/objc/objc-new-syntax/TestObjCNewSyntaxLiteral.py (1971 of 2363) PASS: lldb-api :: commands/expression/import-std-module/deque-dbg-info-content/TestDbgInfoContentDequeFromStdModule.py (1972 of 2363) PASS: lldb-unit :: SymbolFile/DWARF/./SymbolFileDWARFTests/DWARFUnitTest.NullUnitDie (1973 of 2363) PASS: lldb-shell :: Reproducer/TestMultipleTargets.test (1974 of 2363) PASS: lldb-api :: functionalities/pre_run_dylibs/TestPreRunDylibs.py (1975 of 2363) PASS: lldb-unit :: Utility/./UtilityTests/StringExtractorTest.GetHexBytes_OddPair (1976 of 2363) PASS: lldb-api :: python_api/watchpoint/TestWatchpointIter.py (1977 of 2363) PASS: lldb-api :: lang/cpp/forward-declared-template-specialization/TestCppForwardDeclaredTemplateSpecialization.py (1978 of 2363) PASS: lldb-unit :: Utility/./UtilityTests/GeneratorTest.Get (1979 of 2363) PASS: lldb-unit :: Utility/./UtilityTests/StreamTest.PutBytesAsRawHex8ToBigEndian (1980 of 2363) PASS: lldb-api :: functionalities/thread/exit_during_step/TestExitDuringStep.py (1981 of 2363) PASS: lldb-unit :: Utility/./UtilityTests/StringListTest.GetSize (1982 of 2363) PASS: lldb-api :: lang/objc/objc-ivar-offsets/TestObjCIvarOffsets.py (1983 of 2363) PASS: lldb-shell :: SymbolFile/DWARF/x86/DW_TAG_basic_type_DW_ATE_UTF_nonC.ll (1984 of 2363) PASS: lldb-api :: lang/objcxx/hide-runtime-values/TestObjCXXHideRuntimeValues.py (1985 of 2363) PASS: lldb-unit :: Utility/./UtilityTests/FileSpecTest.EqualDotsPosixRoot (1986 of 2363) PASS: lldb-api :: commands/expression/inline-namespace/TestInlineNamespace.py (1987 of 2363) UNSUPPORTED: lldb-shell :: BuildScript/toolchain-clang-cl.test (1988 of 2363) PASS: lldb-api :: functionalities/postmortem/wow64_minidump/TestWow64MiniDump.py (1989 of 2363) PASS: lldb-unit :: Process/./ProcessEventDataTests/ProcessEventDataTest.DoOnRemoval (1990 of 2363) PASS: lldb-api :: python_api/signals/TestSignalsAPI.py (1991 of 2363) UNSUPPORTED: lldb-api :: functionalities/thread/create_during_step/TestCreateDuringStep.py (1992 of 2363) PASS: lldb-api :: python_api/watchpoint/condition/TestWatchpointConditionAPI.py (1993 of 2363) PASS: lldb-unit :: Utility/./UtilityTests/StringListTest.JoinThree (1994 of 2363) PASS: lldb-unit :: Utility/./UtilityTests/StreamTest.PutHex64ByteOrderBig (1995 of 2363) PASS: lldb-api :: macosx/safe-to-func-call/TestSafeFuncCalls.py (1996 of 2363) PASS: lldb-shell :: SymbolFile/DWARF/x86/debug_loclists-dwo.s (1997 of 2363) PASS: lldb-api :: commands/expression/issue_11588/Test11588.py (1998 of 2363) PASS: lldb-api :: commands/expression/import-std-module/unique_ptr-dbg-info-content/TestUniquePtrDbgInfoContent.py (1999 of 2363) PASS: lldb-unit :: Host/./HostTests/SocketTests/SocketTest.DecodeHostAndPort/ipv4 (2000 of 2363) PASS: lldb-api :: commands/expression/context-object/TestContextObject.py (2001 of 2363) PASS: lldb-api :: python_api/name_lookup/TestNameLookup.py (2002 of 2363) PASS: lldb-api :: lang/cpp/trivial_abi/TestTrivialABI.py (2003 of 2363) PASS: lldb-shell :: ScriptInterpreter/Python/eof.test (2004 of 2363) PASS: lldb-shell :: ObjectFile/ELF/minidebuginfo-corrupt-xz.yaml (2005 of 2363) PASS: lldb-unit :: Host/./HostTests/SocketTests/SocketTest.DomainGetConnectURI/ipv6 (2006 of 2363) PASS: lldb-unit :: ObjectFile/MachO/./ObjectFileMachOTests/ObjectFileMachOTest.ModuleFromSharedCacheInfo (2007 of 2363) PASS: lldb-api :: functionalities/signal/TestSendSignal.py (2008 of 2363) PASS: lldb-api :: lang/cpp/static_member_type_depending_on_parent_size/TestStaticMemberTypeDependingOnParentSize.py (2009 of 2363) PASS: lldb-api :: tools/lldb-server/TestGdbRemoteKill.py (2010 of 2363) PASS: lldb-shell :: SymbolFile/DWARF/x86/dwarf5-partial-index.cpp (2011 of 2363) PASS: lldb-api :: iohandler/resize/TestIOHandlerResizeNoEditline.py (2012 of 2363) UNSUPPORTED: lldb-api :: macosx/simulator/TestSimulatorPlatform.py (2013 of 2363) PASS: lldb-unit :: Process/gdb-remote/./ProcessGdbRemoteTests/GDBRemoteClientBaseTest.SendContinueAndAsyncPacket (2014 of 2363) PASS: lldb-api :: functionalities/data-formatter/data-formatter-objc/TestDataFormatterObjCNSURL.py (2015 of 2363) PASS: lldb-shell :: SymbolFile/DWARF/x86/dir-separator-no-comp-dir-relative-name.s (2016 of 2363) PASS: lldb-unit :: Utility/./UtilityTests/StringListTest.RemoveBlankLines (2017 of 2363) UNSUPPORTED: lldb-api :: linux/sepdebugsymlink/TestTargetSymbolsSepDebugSymlink.py (2018 of 2363) PASS: lldb-unit :: SymbolFile/DWARF/./SymbolFileDWARFTests/SymbolFileDWARFTests.TestAbbrevValidAttrNullForm (2019 of 2363) PASS: lldb-api :: functionalities/data-formatter/data-formatter-named-summaries/TestDataFormatterNamedSummaries.py (2020 of 2363) PASS: lldb-api :: functionalities/lazy-loading/TestLazyLoading.py (2021 of 2363) PASS: lldb-api :: commands/expression/multiline-completion/TestMultilineCompletion.py (2022 of 2363) PASS: lldb-unit :: Utility/./UtilityTests/Flags.IsClear (2023 of 2363) PASS: lldb-shell :: Commands/command-image-lookup.yaml (2024 of 2363) PASS: lldb-unit :: Utility/./UtilityTests/StatusTest.ErrorConversion (2025 of 2363) PASS: lldb-api :: functionalities/gdb_remote_client/TestWasm.py (2026 of 2363) PASS: lldb-api :: functionalities/data-formatter/data-formatter-stl/libcxx/vector/TestDataFormatterLibcxxVector.py (2027 of 2363) PASS: lldb-api :: sanity/TestModuleCacheSanity.py (2028 of 2363) PASS: lldb-api :: commands/expression/import-std-module/iterator/TestIteratorFromStdModule.py (2029 of 2363) PASS: lldb-unit :: Process/minidump/./LLDBMinidumpTests/RegisterContextMinidump.ConvertMinidumpContext_x86_64 (2030 of 2363) PASS: lldb-unit :: Symbol/./SymbolTests/TestClangASTImporter.DeportTypeTagDecl (2031 of 2363) UNSUPPORTED: lldb-api :: functionalities/tty/TestTerminal.py (2032 of 2363) PASS: lldb-api :: commands/expression/formatters/TestFormatters.py (2033 of 2363) PASS: lldb-unit :: Utility/./UtilityTests/UriParserTest.SchemeHostSeparator4 (2034 of 2363) UNSUPPORTED: lldb-shell :: Unwind/eh-frame-small-fde.test (2035 of 2363) PASS: lldb-api :: functionalities/gdb_remote_client/TestAArch64XMLRegOffsets.py (2036 of 2363) PASS: lldb-api :: tools/lldb-server/TestLldbGdbServer.py (2037 of 2363) PASS: lldb-api :: lang/cpp/wchar_t/TestCxxWCharT.py (2038 of 2363) PASS: lldb-unit :: Utility/./UtilityTests/StringExtractorTest.GetHexBytes_Partial (2039 of 2363) PASS: lldb-unit :: UnwindAssembly/x86/./UnwindAssemblyx86Tests/Testx86AssemblyInspectionEngine.TestPopR13 (2040 of 2363) PASS: lldb-api :: functionalities/gdb_remote_client/TestNoWatchpointSupportInfo.py (2041 of 2363) PASS: lldb-shell :: Commands/command-target-modules-dump-sections.yaml (2042 of 2363) PASS: lldb-api :: functionalities/thread/concurrent_events/TestConcurrentTwoWatchpointsOneDelayBreakpoint.py (2043 of 2363) PASS: lldb-unit :: Process/gdb-remote/./ProcessGdbRemoteTests/GDBRemoteCommunicationClientTest.GetModulesInfoInvalidResponse (2044 of 2363) PASS: lldb-api :: lang/cpp/template-arguments/TestCppTemplateArguments.py (2045 of 2363) PASS: lldb-unit :: Symbol/./SymbolTests/DWARFCallFrameInfoTest.Basic_eh (2046 of 2363) PASS: lldb-shell :: ObjectFile/Breakpad/sections.test (2047 of 2363) PASS: lldb-api :: lang/cpp/extern_c/TestExternCSymbols.py (2048 of 2363) PASS: lldb-unit :: Utility/./UtilityTests/BinaryStreamTest.PutSLEB128SixBytes (2049 of 2363) PASS: lldb-unit :: Expression/./ExpressionTests/CppModuleConfigurationTest.MissingUsrInclude (2050 of 2363) UNSUPPORTED: lldb-shell :: SymbolFile/PDB/pointers.test (2051 of 2363) PASS: lldb-api :: tools/lldb-server/commandline/TestGdbRemoteConnection.py (2052 of 2363) PASS: lldb-unit :: Utility/./UtilityTests/StringListTest.ShiftMove (2053 of 2363) PASS: lldb-unit :: Process/minidump/./LLDBMinidumpTests/MinidumpParserTest.GetFilteredModuleList (2054 of 2363) PASS: lldb-api :: iohandler/completion/TestIOHandlerCompletion.py (2055 of 2363) PASS: lldb-api :: commands/expression/invalid-args/TestInvalidArgsExpression.py (2056 of 2363) UNSUPPORTED: lldb-api :: functionalities/data-formatter/data-formatter-stl/libstdcpp/vector/TestDataFormatterStdVector.py (2057 of 2363) PASS: lldb-unit :: Utility/./UtilityTests/XcodeSDKTest.ParseTest (2058 of 2363) PASS: lldb-unit :: Utility/./UtilityTests/ArchSpecTest.YAML (2059 of 2363) PASS: lldb-unit :: Utility/./UtilityTests/CompletionRequest.DuplicateFilteringWithComments (2060 of 2363) PASS: lldb-unit :: Platform/./LLDBPlatformTests/PlatformDarwinTest.FindComponentInPath (2061 of 2363) PASS: lldb-api :: lang/c/set_values/TestSetValues.py (2062 of 2363) PASS: lldb-shell :: SymbolFile/DWARF/x86/DW_AT_low_pc-addrx.s (2063 of 2363) PASS: lldb-api :: functionalities/breakpoint/objc/TestObjCBreakpoints.py (2064 of 2363) PASS: lldb-unit :: ObjectFile/Breakpad/./ObjectFileBreakpadTests/StackWinRecord.parse (2065 of 2363) PASS: lldb-unit :: UnwindAssembly/x86/./UnwindAssemblyx86Tests/Testx86AssemblyInspectionEngine.TestPushECX (2066 of 2363) PASS: lldb-unit :: Utility/./UtilityTests/PassiveReplayTest.InstrumentedBarRef (2067 of 2363) PASS: lldb-unit :: Utility/./UtilityTests/StringListTest.DefaultConstructor (2068 of 2363) UNSUPPORTED: lldb-shell :: Register/x86-db-read.test (2069 of 2363) PASS: lldb-api :: commands/expression/call-function/TestCallStdStringFunction.py (2070 of 2363) PASS: lldb-unit :: Utility/./UtilityTests/VASprintfTest.NoBufferResize (2071 of 2363) PASS: lldb-unit :: Utility/./UtilityTests/StreamTeeTest.DefaultConstructor (2072 of 2363) PASS: lldb-unit :: Symbol/./SymbolTests/SymbolsTest.TerminateLocateExecutableSymbolFileForUnknownExecutableAndUnknownSymbolFile (2073 of 2363) PASS: lldb-api :: lang/cpp/namespace_definitions/TestNamespaceDefinitions.py (2074 of 2363) PASS: lldb-unit :: Utility/./UtilityTests/XcodeSDKTest.SDKSupportsModules (2075 of 2363) UNSUPPORTED: lldb-shell :: SymbolFile/DWARF/x86/DW_TAG_GNU_call_site-DW_AT_low_pc.s (2076 of 2363) PASS: lldb-api :: lang/c/shared_lib/TestSharedLib.py (2077 of 2363) PASS: lldb-unit :: Language/Highlighting/./HighlighterTests/HighlighterTest.ClangTrailingBackslashMissingNewLine (2078 of 2363) PASS: lldb-api :: commands/expression/expr-in-syscall/TestExpressionInSyscall.py (2079 of 2363) PASS: lldb-shell :: BuildScript/modes.test (2080 of 2363) UNSUPPORTED: lldb-shell :: Subprocess/clone-follow-parent-wp.test (2081 of 2363) PASS: lldb-api :: functionalities/thread/thread_specific_break/TestThreadSpecificBreakpoint.py (2082 of 2363) PASS: lldb-api :: functionalities/data-formatter/data-formatter-disabling/TestDataFormatterDisabling.py (2083 of 2363) PASS: lldb-unit :: UnwindAssembly/x86/./UnwindAssemblyx86Tests/Testx86AssemblyInspectionEngine.TestStackRealign32BitDisp_x86_64 (2084 of 2363) PASS: lldb-unit :: UnwindAssembly/x86/./UnwindAssemblyx86Tests/Testx86AssemblyInspectionEngine.Testi386IgnoredRegisters (2085 of 2363) PASS: lldb-api :: functionalities/data-formatter/frameformat_smallstruct/TestFrameFormatSmallStruct.py (2086 of 2363) PASS: lldb-unit :: Target/./TargetTests/PathMappingListTest.AbsoluteTests (2087 of 2363) PASS: lldb-api :: lang/cpp/template-specialization-type/TestTemplateSpecializationType.py (2088 of 2363) UNSUPPORTED: lldb-shell :: SymbolFile/target-symbols-add-unwind.test (2089 of 2363) PASS: lldb-shell :: ObjectFile/MachO/symtab.yaml (2090 of 2363) PASS: lldb-unit :: Utility/./UtilityTests/FileSpecTest.Yaml (2091 of 2363) PASS: lldb-unit :: Utility/./UtilityTests/NameMatchesTest.RegularExpression (2092 of 2363) PASS: lldb-api :: functionalities/memory-region/TestMemoryRegion.py (2093 of 2363) PASS: lldb-unit :: Utility/./UtilityTests/SerializationRountripTest.SerializeDeserializeObjectReference (2094 of 2363) UNSUPPORTED: lldb-api :: commands/expression/macros/TestMacros.py (2095 of 2363) PASS: lldb-shell :: Reproducer/Functionalities/TestStepping.test (2096 of 2363) PASS: lldb-unit :: Core/./LLDBCoreTests/SourceFileCache.FindSourceFileNotFound (2097 of 2363) PASS: lldb-unit :: Core/./LLDBCoreTests/MangledTest.EmptyForInvalidRustV0Name (2098 of 2363) PASS: lldb-unit :: Process/gdb-remote/./ProcessGdbRemoteTests/GDBRemoteCommunicationServerTest.SendErrorResponse_ErrorList (2099 of 2363) UNSUPPORTED: lldb-shell :: SymbolFile/PDB/enums-layout.test (2100 of 2363) PASS: lldb-api :: functionalities/thread/concurrent_events/TestConcurrentSignalWatch.py (2101 of 2363) PASS: lldb-shell :: SymbolFile/NativePDB/bitfields.cpp (2102 of 2363) PASS: lldb-api :: lang/cpp/namespace_conflicts/TestNamespaceConflicts.py (2103 of 2363) PASS: lldb-api :: lang/objc/direct-dispatch-step/TestObjCDirectDispatchStepping.py (2104 of 2363) PASS: lldb-shell :: Driver/TestCore.test (2105 of 2363) UNSUPPORTED: lldb-shell :: SymbolFile/PDB/typedefs.test (2106 of 2363) PASS: lldb-shell :: ObjectFile/ELF/netbsd-exec-8.99.30-amd64.yaml (2107 of 2363) PASS: lldb-unit :: DataFormatter/./LLDBFormatterTests/TypeMatcherTests.RegexMatchPart (2108 of 2363) PASS: lldb-unit :: Host/./HostTests/SocketTests/SocketTest.TCPListen0GetPort/ipv4 (2109 of 2363) PASS: lldb-api :: functionalities/gdb_remote_client/TestIOSSimulator.py (2110 of 2363) PASS: lldb-unit :: Utility/./UtilityTests/StateTest.Formatv (2111 of 2363) PASS: lldb-unit :: UnwindAssembly/x86/./UnwindAssemblyx86Tests/Testx86AssemblyInspectionEngine.TestPush0 (2112 of 2363) PASS: lldb-api :: functionalities/data-formatter/typedef_array/TestTypedefArray.py (2113 of 2363) PASS: lldb-unit :: UnwindAssembly/x86/./UnwindAssemblyx86Tests/Testx86AssemblyInspectionEngine.TestPushR12 (2114 of 2363) PASS: lldb-api :: lang/objc/objc-checker/TestObjCCheckers.py (2115 of 2363) PASS: lldb-unit :: Utility/./UtilityTests/SerializationRountripTest.SerializeDeserializeCStringNull (2116 of 2363) PASS: lldb-unit :: Utility/./UtilityTests/RegisterValueTest.GetScalarValue (2117 of 2363) PASS: lldb-shell :: SymbolFile/DWARF/x86/debug-types-dwo-cross-reference.cpp (2118 of 2363) PASS: lldb-unit :: Utility/./UtilityTests/RangeTest.Union (2119 of 2363) PASS: lldb-api :: python_api/value_var_update/TestValueVarUpdate.py (2120 of 2363) PASS: lldb-api :: functionalities/tsan/basic/TestTsanBasic.py (2121 of 2363) PASS: lldb-api :: python_api/function_symbol/TestDisasmAPI.py (2122 of 2363) PASS: lldb-api :: commands/reproducer/invalid-args/TestInvalidArgsReproducer.py (2123 of 2363) PASS: lldb-api :: commands/expression/calculator_mode/TestCalculatorMode.py (2124 of 2363) PASS: lldb-api :: functionalities/thread/concurrent_events/TestConcurrentDelayWatchBreak.py (2125 of 2363) PASS: lldb-api :: lang/objc/objc-dyn-sbtype/TestObjCDynamicSBType.py (2126 of 2363) PASS: lldb-unit :: Core/./LLDBCoreTests/FormatEntityTest.DefinitionConstructionNameAndString (2127 of 2363) PASS: lldb-unit :: Utility/./UtilityTests/StreamTeeTest.Write (2128 of 2363) PASS: lldb-api :: lang/objc/foundation/TestObjCMethodsNSError.py (2129 of 2363) PASS: lldb-api :: python_api/sbstructureddata/TestStructuredDataAPI.py (2130 of 2363) PASS: lldb-api :: lang/objc/foundation/TestObjectDescriptionAPI.py (2131 of 2363) PASS: lldb-api :: lang/objc/modules-objc-property/TestModulesObjCProperty.py (2132 of 2363) PASS: lldb-shell :: Heap/heap-cstr.test (2133 of 2363) PASS: lldb-unit :: Host/./HostTests/File.GetStreamFromDescriptor (2134 of 2363) PASS: lldb-api :: functionalities/breakpoint/auto_continue/TestBreakpointAutoContinue.py (2135 of 2363) PASS: lldb-unit :: Utility/./UtilityTests/FileSpecTest.EqualDotsWindows (2136 of 2363) PASS: lldb-unit :: Symbol/./SymbolTests/TestTypeSystemClang.TestFunctionTemplateInRecordConstruction (2137 of 2363) PASS: lldb-api :: lang/cpp/unicode-literals/TestUnicodeLiterals.py (2138 of 2363) PASS: lldb-unit :: SymbolFile/DWARF/./SymbolFileDWARFTests/SymbolFileDWARFTests.TestAbilitiesForDWARF (2139 of 2363) PASS: lldb-unit :: Language/Highlighting/./HighlighterTests/HighlighterTest.ClangTrailingBackslashBeforeNewline (2140 of 2363) PASS: lldb-unit :: Process/gdb-remote/./ProcessGdbRemoteTests/GDBRemoteCommunicationServerTest.SendErrorResponse_Status (2141 of 2363) PASS: lldb-shell :: SymbolFile/DWARF/x86/DW_AT_data_bit_offset-DW_OP_stack_value.s (2142 of 2363) PASS: lldb-api :: lang/cpp/this/TestCPPThis.py (2143 of 2363) PASS: lldb-api :: functionalities/gdb_remote_client/TestRegDefinitionInParts.py (2144 of 2363) PASS: lldb-shell :: Reproducer/TestRelativePath.test (2145 of 2363) PASS: lldb-api :: functionalities/data-formatter/data-formatter-objc/TestDataFormatterObjCNSBundle.py (2146 of 2363) PASS: lldb-api :: functionalities/thread/thread_exit/TestThreadExit.py (2147 of 2363) PASS: lldb-shell :: ObjectFile/Breakpad/breakpad-identification.test (2148 of 2363) PASS: lldb-api :: lang/cpp/breakpoint-commands/TestCPPBreakpointCommands.py (2149 of 2363) PASS: lldb-unit :: Host/./HostTests/Host.WaitStatusFormat (2150 of 2363) PASS: lldb-shell :: Driver/TestTarget.test (2151 of 2363) PASS: lldb-shell :: Settings/TestDefaultModuleCachePath.test (2152 of 2363) PASS: lldb-unit :: Process/minidump/./LLDBMinidumpTests/MinidumpParserTest.MinidumpDuplicateModuleSeparateCode (2153 of 2363) PASS: lldb-api :: functionalities/breakpoint/breakpoint_hit_count/TestBreakpointHitCount.py (2154 of 2363) PASS: lldb-unit :: Utility/./UtilityTests/StreamTest.AddressPrefixAndSuffix (2155 of 2363) PASS: lldb-api :: lang/cpp/thread_local/TestThreadLocal.py (2156 of 2363) PASS: lldb-api :: commands/expression/import-std-module/retry-with-std-module/TestRetryWithStdModule.py (2157 of 2363) PASS: lldb-unit :: Utility/./UtilityTests/StringExtractorTest.InitMisc (2158 of 2363) PASS: lldb-unit :: Utility/./UtilityTests/ArgsTest.TestSingleArgWithQuotedSpace (2159 of 2363) PASS: lldb-unit :: Utility/./UtilityTests/LogTest.LLDB_LOG_nullptr (2160 of 2363) PASS: lldb-api :: commands/process/attach/attach_denied/TestAttachDenied.py (2161 of 2363) PASS: lldb-unit :: Utility/./UtilityTests/CompletionRequest.FakeLastArg (2162 of 2363) PASS: lldb-api :: functionalities/data-formatter/compactvectors/TestCompactVectors.py (2163 of 2363) PASS: lldb-unit :: Process/minidump/./LLDBMinidumpTests/MinidumpParserTest.MinidumpModuleOrder (2164 of 2363) PASS: lldb-unit :: Utility/./UtilityTests/RangeTest.SlideZero (2165 of 2363) PASS: lldb-unit :: ObjectFile/Breakpad/./ObjectFileBreakpadTests/PublicRecord.parse (2166 of 2363) PASS: lldb-unit :: Utility/./UtilityTests/SerializationRountripTest.SerializeDeserializeObjectPointer (2167 of 2363) PASS: lldb-api :: functionalities/breakpoint/breakpoint_conditions/TestBreakpointConditions.py (2168 of 2363) PASS: lldb-api :: functionalities/breakpoint/address_breakpoints/TestAddressBreakpoints.py (2169 of 2363) PASS: lldb-unit :: Core/./LLDBCoreTests/DumpDataExtractorTest.MultiLine (2170 of 2363) PASS: lldb-api :: functionalities/data-formatter/data-formatter-objc/TestDataFormatterObjCExpr.py (2171 of 2363) PASS: lldb-api :: commands/session/history/TestSessionHistory.py (2172 of 2363) PASS: lldb-api :: functionalities/thread/create_after_attach/TestCreateAfterAttach.py (2173 of 2363) PASS: lldb-unit :: Host/./HostTests/FileSystemTest.OpenErrno (2174 of 2363) UNSUPPORTED: lldb-shell :: SymbolFile/PDB/type-quals.test (2175 of 2363) UNSUPPORTED: lldb-api :: linux/aarch64/mte_memory_region/TestAArch64LinuxMTEMemoryRegion.py (2176 of 2363) PASS: lldb-shell :: SymbolFile/DWARF/x86/dwarf5_locations.s (2177 of 2363) PASS: lldb-api :: python_api/value/change_values/TestChangeValueAPI.py (2178 of 2363) PASS: lldb-unit :: Target/./TargetTests/MCBasedABI.MapRegisterName (2179 of 2363) PASS: lldb-api :: functionalities/step_scripted/TestStepScripted.py (2180 of 2363) PASS: lldb-shell :: SymbolFile/DWARF/x86/debug_ranges_and_rnglists.test (2181 of 2363) PASS: lldb-unit :: UnwindAssembly/x86/./UnwindAssemblyx86Tests/Testx86AssemblyInspectionEngine.TestPopRBPWithREX (2182 of 2363) PASS: lldb-unit :: Utility/./UtilityTests/OptionsWithRawTest.WhitespaceInput (2183 of 2363) PASS: lldb-api :: tools/lldb-vscode/evaluate/TestVSCode_evaluate.py (2184 of 2363) PASS: lldb-unit :: UnwindAssembly/x86/./UnwindAssemblyx86Tests/Testx86AssemblyInspectionEngine.TestPopEBX (2185 of 2363) PASS: lldb-api :: python_api/lldbutil/process/TestPrintStackTraces.py (2186 of 2363) PASS: lldb-shell :: lldb-server/TestErrorMessages.test (2187 of 2363) PASS: lldb-unit :: Symbol/./SymbolTests/TestTypeSystemClang.TestFunctionTemplateConstruction (2188 of 2363) PASS: lldb-unit :: Utility/./UtilityTests/AnsiTerminal.AtStart (2189 of 2363) PASS: lldb-api :: lang/cpp/exceptions/TestCPPExceptionBreakpoints.py (2190 of 2363) PASS: lldb-unit :: SymbolFile/DWARF/./SymbolFileDWARFTests/SymbolFileDWARFTests.ParseArangesIgnoreEmpty (2191 of 2363) PASS: lldb-api :: functionalities/data-formatter/data-formatter-stl/libcxx/function/TestLibCxxFunction.py (2192 of 2363) PASS: lldb-api :: commands/expression/import-std-module/conflicts/TestStdModuleWithConflicts.py (2193 of 2363) UNSUPPORTED: lldb-api :: functionalities/data-formatter/data-formatter-stl/libstdcpp/vbool/TestDataFormatterStdVBool.py (2194 of 2363) PASS: lldb-unit :: Utility/./UtilityTests/ScalarTest.APIntConstructor (2195 of 2363) PASS: lldb-unit :: Utility/./UtilityTests/StreamTest.PutSLEB128 (2196 of 2363) PASS: lldb-unit :: ScriptInterpreter/Python/./ScriptInterpreterPythonTests/PythonDataObjectsTest.TestPythonDictionaryToStructuredDictionary (2197 of 2363) PASS: lldb-api :: functionalities/data-formatter/summary-string-onfail/Test-rdar-9974002.py (2198 of 2363) PASS: lldb-unit :: UnwindAssembly/x86/./UnwindAssemblyx86Tests/Testx86AssemblyInspectionEngine.TestPushEDI (2199 of 2363) PASS: lldb-unit :: Utility/./UtilityTests/ScalarTest.Promotion (2200 of 2363) UNSUPPORTED: lldb-shell :: ScriptInterpreter/Lua/watchpoint_callback.test (2201 of 2363) PASS: lldb-shell :: ScriptInterpreter/Python/python.test (2202 of 2363) PASS: lldb-api :: lang/objc/hidden-ivars/TestHiddenIvars.py (2203 of 2363) PASS: lldb-api :: functionalities/data-formatter/data-formatter-stl/libcxx/initializerlist/TestInitializerList.py (2204 of 2363) PASS: lldb-unit :: Utility/./UtilityTests/BinaryStreamTest.PutULEB128ThreeBytes (2205 of 2363) PASS: lldb-shell :: SymbolFile/NativePDB/globals-fundamental.cpp (2206 of 2363) PASS: lldb-api :: functionalities/breakpoint/breakpoint_names/TestBreakpointNames.py (2207 of 2363) PASS: lldb-unit :: Utility/./UtilityTests/RangeTest.NotEqual (2208 of 2363) PASS: lldb-api :: types/TestLongTypes.py (2209 of 2363) PASS: lldb-shell :: Breakpoint/debug_rnglist_rlestartend.test (2210 of 2363) PASS: lldb-api :: functionalities/target-new-solib-notifications/TestModuleLoadedNotifys.py (2211 of 2363) PASS: lldb-api :: commands/expression/radar_9531204/TestPrintfAfterUp.py (2212 of 2363) PASS: lldb-api :: tools/lldb-server/TestGdbRemote_vCont.py (2213 of 2363) PASS: lldb-unit :: Utility/./UtilityTests/StringExtractorTest.GetHexU8_InvalidHex_NoEof (2214 of 2363) PASS: lldb-unit :: Utility/./UtilityTests/ScalarTest.ExtractBitfield (2215 of 2363) PASS: lldb-api :: functionalities/thread/backtrace_limit/TestBacktraceLimit.py (2216 of 2363) PASS: lldb-api :: functionalities/data-formatter/data-formatter-stl/libcxx/unordered/TestDataFormatterUnordered.py (2217 of 2363) UNSUPPORTED: lldb-shell :: SymbolFile/PDB/function-level-linking.test (2218 of 2363) PASS: lldb-unit :: tools/lldb-server/tests/./LLDBServerTests/TestBase.LaunchModePreservesEnvironment (2219 of 2363) PASS: lldb-api :: functionalities/inferior-crashing/recursive-inferior/TestRecursiveInferior.py (2220 of 2363) PASS: lldb-api :: commands/expression/vector_of_enums/TestVectorOfEnums.py (2221 of 2363) PASS: lldb-api :: python_api/lldbutil/TestSwigVersion.py (2222 of 2363) PASS: lldb-api :: commands/process/attach/TestProcessAttach.py (2223 of 2363) PASS: lldb-unit :: Expression/./ExpressionTests/CppModuleConfigurationTest.AmbiguousLibCpp (2224 of 2363) PASS: lldb-unit :: Process/gdb-remote/./ProcessGdbRemoteTests/GDBRemoteCommunicationClientTest.ReadRegister (2225 of 2363) PASS: lldb-unit :: Symbol/./SymbolTests/TestClangASTImporter.CompleteFwdDeclWithOtherOrigin (2226 of 2363) PASS: lldb-unit :: Utility/./UtilityTests/RangeTest.EqualInvalid (2227 of 2363) PASS: lldb-api :: commands/process/signal/TestProcessSignal.py (2228 of 2363) UNSUPPORTED: lldb-api :: functionalities/thread/thread_specific_break_plus_condition/TestThreadSpecificBpPlusCondition.py (2229 of 2363) PASS: lldb-unit :: Utility/./UtilityTests/TimerTest.CategoryTimesStats (2230 of 2363) PASS: lldb-api :: lang/cpp/class-template-type-parameter-pack/TestClassTemplateTypeParameterPack.py (2231 of 2363) PASS: lldb-unit :: Utility/./UtilityTests/PassiveReplayTest.InstrumentedBarPtr (2232 of 2363) PASS: lldb-api :: macosx/nslog/TestDarwinNSLogOutput.py (2233 of 2363) UNSUPPORTED: lldb-shell :: SymbolFile/NativePDB/typedefs.cpp (2234 of 2363) PASS: lldb-api :: macosx/builtin-debugtrap/TestBuiltinDebugTrap.py (2235 of 2363) PASS: lldb-shell :: ObjectFile/ELF/null-jmprel.yaml (2236 of 2363) PASS: lldb-api :: functionalities/gdb_remote_client/TestProcessConnect.py (2237 of 2363) PASS: lldb-unit :: Utility/./UtilityTests/ArgsTest.StringListConstructor (2238 of 2363) PASS: lldb-shell :: SymbolFile/Breakpad/symtab-macho.test (2239 of 2363) PASS: lldb-unit :: Utility/./UtilityTests/XcodeSDKTest.SDKSupportsSwift (2240 of 2363) PASS: lldb-api :: functionalities/data-formatter/type_summary_list_script/TestTypeSummaryListScript.py (2241 of 2363) PASS: lldb-api :: lang/objc/objc-struct-argument/TestObjCStructArgument.py (2242 of 2363) PASS: lldb-api :: functionalities/tail_call_frames/unambiguous_sequence/TestUnambiguousTailCalls.py (2243 of 2363) PASS: lldb-unit :: UnwindAssembly/x86/./UnwindAssemblyx86Tests/Testx86AssemblyInspectionEngine.TestPushEBP (2244 of 2363) PASS: lldb-api :: lang/c/step_over_no_deadlock/TestStepOverDoesntBlock.py (2245 of 2363) PASS: lldb-unit :: Utility/./UtilityTests/ConstStringTest.CompareConstString (2246 of 2363) PASS: lldb-api :: lang/c/tls_globals/TestTlsGlobals.py (2247 of 2363) PASS: lldb-api :: functionalities/data-formatter/data-formatter-objc/nsindexpath/TestDataFormatterNSIndexPath.py (2248 of 2363) PASS: lldb-unit :: UnwindAssembly/x86/./UnwindAssemblyx86Tests/Testx86AssemblyInspectionEngine.TestLEAVE (2249 of 2363) PASS: lldb-api :: python_api/value/linked_list/TestValueAPILinkedList.py (2250 of 2363) PASS: lldb-api :: commands/expression/call-function/TestCallBuiltinFunction.py (2251 of 2363) PASS: lldb-api :: lang/c/shared_lib_stripped_symbols/TestSharedLibStrippedSymbols.py (2252 of 2363) PASS: lldb-api :: functionalities/thread/concurrent_events/TestConcurrentSignalDelayWatch.py (2253 of 2363) PASS: lldb-unit :: Process/minidump/./LLDBMinidumpTests/MinidumpParserTest.MinidumpDuplicateModuleMinAddress (2254 of 2363) PASS: lldb-unit :: ScriptInterpreter/Python/./ScriptInterpreterPythonTests/PythonDataObjectsTest.TestPythonStringToStr (2255 of 2363) PASS: lldb-unit :: Utility/./UtilityTests/NameMatchesTest.Ignore (2256 of 2363) PASS: lldb-unit :: DataFormatter/./LLDBFormatterTests/TypeMatcherTests.CreatedBySameMatchString (2257 of 2363) PASS: lldb-shell :: Driver/TestNoUseColor.test (2258 of 2363) PASS: lldb-api :: commands/expression/import-std-module/weak_ptr-dbg-info-content/TestDbgInfoContentWeakPtrFromStdModule.py (2259 of 2363) PASS: lldb-api :: commands/expression/import-std-module/basic/TestImportStdModule.py (2260 of 2363) PASS: lldb-api :: functionalities/thread/concurrent_events/TestConcurrentBreakpointOneDelayBreakpointThreads.py (2261 of 2363) PASS: lldb-api :: functionalities/data-formatter/data-formatter-enum-format/TestDataFormatterEnumFormat.py (2262 of 2363) PASS: lldb-unit :: Utility/./UtilityTests/StringListTest.CopyListSingle (2263 of 2363) PASS: lldb-api :: functionalities/ptr_refs/TestPtrRefs.py (2264 of 2363) PASS: lldb-api :: functionalities/breakpoint/breakpoint_locations/TestBreakpointLocations.py (2265 of 2363) PASS: lldb-shell :: SymbolFile/DWARF/x86/gnu-style-compression.cpp (2266 of 2363) PASS: lldb-api :: functionalities/data-formatter/data-formatter-objc/nsstring/TestDataFormatterNSString.py (2267 of 2363) PASS: lldb-api :: tools/lldb-server/memory-allocation/TestGdbRemoteMemoryAllocation.py (2268 of 2363) PASS: lldb-unit :: Utility/./UtilityTests/StringListTest.CopyListEmpty (2269 of 2363) PASS: lldb-api :: commands/expression/char/TestExprsChar.py (2270 of 2363) PASS: lldb-unit :: Utility/./UtilityTests/Flags.Clear (2271 of 2363) PASS: lldb-api :: functionalities/abbreviation/TestCommonShortSpellings.py (2272 of 2363) PASS: lldb-api :: macosx/thread_suspend/TestInternalThreadSuspension.py (2273 of 2363) PASS: lldb-unit :: ScriptInterpreter/Python/./ScriptInterpreterPythonTests/PythonDataObjectsTest.TestPythonByteArray (2274 of 2363) PASS: lldb-unit :: ScriptInterpreter/Python/./ScriptInterpreterPythonTests/PythonDataObjectsTest.TestPythonListValueEquality (2275 of 2363) PASS: lldb-unit :: Core/./LLDBCoreTests/MangledTest.ResultForValidRustV0Name (2276 of 2363) PASS: lldb-api :: commands/command/source/TestCommandSource.py (2277 of 2363) UNSUPPORTED: lldb-api :: commands/expression/call-restarts/TestCallThatRestarts.py (2278 of 2363) PASS: lldb-api :: functionalities/rerun/TestRerun.py (2279 of 2363) PASS: lldb-shell :: SymbolFile/DWARF/x86/find-variable-dwo.cpp (2280 of 2363) PASS: lldb-unit :: Utility/./UtilityTests/StreamTest.PutCharWhitespace (2281 of 2363) PASS: lldb-api :: lang/c/unions/TestUnionMembers.py (2282 of 2363) PASS: lldb-unit :: Utility/./UtilityTests/NameMatchesTest.Contains (2283 of 2363) PASS: lldb-unit :: Core/./LLDBCoreTests/DumpDataExtractorTest.ItemByteSizeErrors (2284 of 2363) PASS: lldb-unit :: Symbol/./SymbolTests/SymbolsTest.LocateExecutableSymbolFileForUnknownExecutableAndMissingSymbolFile (2285 of 2363) PASS: lldb-shell :: Register/Core/x86-64-netbsd-gp.test (2286 of 2363) UNSUPPORTED: lldb-shell :: Unwind/split-machine-functions.test (2287 of 2363) PASS: lldb-api :: python_api/sbenvironment/TestSBEnvironment.py (2288 of 2363) PASS: lldb-unit :: Symbol/./SymbolTests/TestTypeSystemClang.TestConvertAccessTypeToAccessSpecifier (2289 of 2363) PASS: lldb-unit :: Utility/./UtilityTests/StringListTest.AppendStringCString (2290 of 2363) PASS: lldb-api :: python_api/section/TestSectionAPI.py (2291 of 2363) PASS: lldb-api :: functionalities/data-formatter/data-formatter-globals/TestDataFormatterGlobals.py (2292 of 2363) UNSUPPORTED: lldb-api :: commands/register/register/aarch64_sve_registers/rw_access_static_config/TestSVERegisters.py (2293 of 2363) PASS: lldb-unit :: Language/CPlusPlus/./LanguageCPlusPlusTests/CPlusPlusLanguage.FindAlternateFunctionManglings (2294 of 2363) PASS: lldb-api :: lang/cpp/struct_with_keyword_name/TestStructWithKeywordName.py (2295 of 2363) PASS: lldb-api :: lang/objc/ptr_refs/TestPtrRefsObjC.py (2296 of 2363) PASS: lldb-api :: functionalities/thread/concurrent_events/TestConcurrentDelayedCrashWithBreakpointWatchpoint.py (2297 of 2363) PASS: lldb-api :: functionalities/data-formatter/cstring-utf8-summary/TestCstringUnicode.py (2298 of 2363) PASS: lldb-unit :: Utility/./UtilityTests/RangeTest.SetRangeBase (2299 of 2363) PASS: lldb-api :: functionalities/data-formatter/data-formatter-stl/libcxx/variant/TestDataFormatterLibcxxVariant.py (2300 of 2363) PASS: lldb-unit :: Utility/./UtilityTests/FileSpecTest.GetPath (2301 of 2363) PASS: lldb-api :: functionalities/recursion/TestValueObjectRecursion.py (2302 of 2363) PASS: lldb-unit :: Utility/./UtilityTests/RangeTest.ContainsRangeStartingFromZero (2303 of 2363) PASS: lldb-api :: lang/cpp/virtual-functions/TestCppVirtualFunctions.py (2304 of 2363) PASS: lldb-unit :: Utility/./UtilityTests/StringListTest.ForRange (2305 of 2363) PASS: lldb-unit :: Expression/./ExpressionTests/DiagnosticManagerTest.GetStringPreserveOrder (2306 of 2363) PASS: lldb-api :: functionalities/thread/exit_during_expression/TestExitDuringExpression.py (2307 of 2363) XFAIL: lldb-shell :: Expr/nodefaultlib.cpp (2308 of 2363) PASS: lldb-api :: functionalities/data-formatter/data-formatter-stl/libcxx/vbool/TestDataFormatterLibcxxVBool.py (2309 of 2363) PASS: lldb-api :: commands/frame/diagnose/virtual-method-call/TestDiagnoseDereferenceVirtualMethodCall.py (2310 of 2363) PASS: lldb-api :: commands/command/script/TestCommandScript.py (2311 of 2363) PASS: lldb-api :: tools/lldb-server/TestGdbRemoteAttachWait.py (2312 of 2363) PASS: lldb-api :: lang/cpp/type_lookup/TestCppTypeLookup.py (2313 of 2363) PASS: lldb-unit :: Utility/./UtilityTests/ArchSpecTest.Compatibility (2314 of 2363) PASS: lldb-api :: functionalities/breakpoint/breakpoint_command/TestBreakpointCommand.py (2315 of 2363) PASS: lldb-unit :: Utility/./UtilityTests/LogTest.Unregister (2316 of 2363) PASS: lldb-unit :: Process/minidump/./LLDBMinidumpTests/MinidumpParserTest.GetMemoryRegionInfoFromMemory64List (2317 of 2363) PASS: lldb-shell :: Reproducer/TestDriverOptions.test (2318 of 2363) PASS: lldb-unit :: Process/./ProcessEventDataTests/ProcessEventDataTest.ShouldStop (2319 of 2363) PASS: lldb-unit :: ScriptInterpreter/Python/./ScriptInterpreterPythonTests/PythonDataObjectsTest.TestInstanceNameResolutionNoDot (2320 of 2363) UNSUPPORTED: lldb-shell :: Register/x86-ymm-read.test (2321 of 2363) PASS: lldb-api :: commands/watchpoints/watchpoint_commands/command/TestWatchpointCommandLLDB.py (2322 of 2363) PASS: lldb-unit :: Utility/./UtilityTests/RangeTest.SizeTypes (2323 of 2363) PASS: lldb-unit :: UnwindAssembly/x86/./UnwindAssemblyx86Tests/Testx86AssemblyInspectionEngine.TestPushEAX (2324 of 2363) PASS: lldb-api :: commands/target/select/TestTargetSelect.py (2325 of 2363) PASS: lldb-shell :: Reproducer/Functionalities/TestExpressionEvaluation.test (2326 of 2363) PASS: lldb-shell :: SymbolFile/NativePDB/locate-pdb.cpp (2327 of 2363) PASS: lldb-api :: functionalities/thread/concurrent_events/TestConcurrentTwoBreakpointThreads.py (2328 of 2363) PASS: lldb-unit :: Utility/./UtilityTests/Flags.AllSet (2329 of 2363) PASS: lldb-unit :: Process/minidump/./LLDBMinidumpTests/MinidumpParserTest.GetThreadContext_x86_32 (2330 of 2363) PASS: lldb-api :: functionalities/archives/TestBSDArchives.py (2331 of 2363) PASS: lldb-unit :: ObjectFile/PECOFF/./ObjectFilePECOFFTests/PECallFrameInfoTest.Basic_eh (2332 of 2363) PASS: lldb-api :: functionalities/tsan/multiple/TestTsanMultiple.py (2333 of 2363) PASS: lldb-api :: lang/cpp/accelerator-table/TestCPPAccelerator.py (2334 of 2363) PASS: lldb-unit :: Utility/./UtilityTests/ArgsTest.ReplaceArgumentAtIndexShort (2335 of 2363) PASS: lldb-unit :: Language/Highlighting/./HighlighterTests/HighlighterTest.ClangCursorPosBeforeOtherToken (2336 of 2363) PASS: lldb-api :: functionalities/breakpoint/breakpoint_command/TestRegexpBreakCommand.py (2337 of 2363) PASS: lldb-unit :: Utility/./UtilityTests/NameMatchesTest.StartsWith (2338 of 2363) PASS: lldb-shell :: Quit/TestQuitExitCodeHex0.test (2339 of 2363) PASS: lldb-api :: tools/lldb-vscode/stackTrace/TestVSCode_stackTrace.py (2340 of 2363) PASS: lldb-unit :: Expression/./ExpressionTests/DiagnosticManagerTest.PutStringMultiple (2341 of 2363) PASS: lldb-api :: functionalities/data-formatter/data-formatter-stl/libcxx/forward_list/TestDataFormatterLibcxxForwardList.py (2342 of 2363) PASS: lldb-unit :: UnwindAssembly/x86/./UnwindAssemblyx86Tests/Testx86AssemblyInspectionEngine.Test64bitFramelessBigStackFrame (2343 of 2363) PASS: lldb-shell :: Settings/TestModuleCacheSanity.test (2344 of 2363) PASS: lldb-api :: lang/c/stepping/TestThreadStepInAvoidRegexp.py (2345 of 2363) PASS: lldb-shell :: SymbolFile/DWARF/x86/DW_TAG_variable-invalid_location.s (2346 of 2363) PASS: lldb-unit :: Utility/./UtilityTests/UriParserTest.BracketedHostnamePort (2347 of 2363) PASS: lldb-unit :: Core/./LLDBCoreTests/ModuleSpecTest.InvalidInMemoryBufferValidFile (2348 of 2363) PASS: lldb-unit :: Utility/./UtilityTests/VMRange.SetEndAddress (2349 of 2363) PASS: lldb-unit :: ScriptInterpreter/Python/./ScriptInterpreterPythonTests/PythonDataObjectsTest.TestPythonCallableCheck (2350 of 2363) UNSUPPORTED: lldb-api :: functionalities/thread/concurrent_events/TestConcurrentManySignals.py (2351 of 2363) PASS: lldb-unit :: Language/Highlighting/./HighlighterTests/HighlighterTest.ClangUnterminatedString (2352 of 2363) PASS: lldb-api :: python_api/sbvalue_const_addrof/TestSBValueConstAddrOf.py (2353 of 2363) PASS: lldb-unit :: Host/./HostTests/PipeTest.CreateWithUniqueName (2354 of 2363) PASS: lldb-api :: lang/cpp/stl/TestStdCXXDisassembly.py (2355 of 2363) PASS: lldb-shell :: Commands/command-regex-unalias.test (2356 of 2363) PASS: lldb-unit :: Utility/./UtilityTests/OptionsWithRawTest.UnterminatedQuote (2357 of 2363) PASS: lldb-unit :: Utility/./UtilityTests/RangeTest.Constructor (2358 of 2363) PASS: lldb-api :: commands/watchpoints/multiple_hits/TestMultipleHits.py (2359 of 2363) PASS: lldb-shell :: Register/x86-multithread-write.test (2360 of 2363) PASS: lldb-api :: commands/target/basic/TestTargetCommand.py (2361 of 2363) PASS: lldb-api :: functionalities/pointer_num_children/TestPointerNumChildren.py (2362 of 2363) PASS: lldb-api :: functionalities/limit-debug-info/TestLimitDebugInfo.py (2363 of 2363) Slowest Tests: -------------------------------------------------------------------------- 600.16s: lldb-api :: tools/lldb-vscode/runInTerminal/TestVSCode_runInTerminal.py 600.01s: lldb-api :: lang/cpp/namespace/TestNamespaceLookup.py 600.01s: lldb-api :: python_api/sbplatform/TestSBPlatform.py 461.47s: lldb-api :: macosx/lc-note/kern-ver-str/TestKernVerStrLCNOTE.py 381.04s: lldb-api :: types/TestCharTypeExpr.py 378.13s: lldb-api :: types/TestCharType.py 292.69s: lldb-api :: lang/objc/exceptions/TestObjCExceptions.py 274.34s: lldb-api :: functionalities/breakpoint/breakpoint_by_line_and_column/TestBreakpointByLineAndColumn.py 183.72s: lldb-api :: lang/cpp/static_members/TestCPPStaticMembers.py 171.29s: lldb-api :: commands/settings/TestSettings.py 158.43s: lldb-api :: functionalities/tail_call_frames/thread_step_out_message/TestArtificialFrameStepOutMessage.py 115.58s: lldb-api :: tools/lldb-server/TestGdbRemoteExpeditedRegisters.py 108.68s: lldb-api :: commands/expression/po_verbosity/TestPoVerbosity.py 106.73s: lldb-api :: functionalities/data-formatter/data-formatter-objc/cmtime/TestDataFormatterCMTime.py 102.72s: lldb-api :: lang/cpp/namespace/TestNamespace.py 102.16s: lldb-api :: lang/objc/self/TestObjCSelf.py 101.11s: lldb-api :: functionalities/data-formatter/data-formatter-stl/libcxx/unique_ptr/TestDataFormatterLibcxxUniquePtr.py 100.99s: lldb-api :: functionalities/data-formatter/data-formatter-objc/TestDataFormatterObjCNSError.py 97.07s: lldb-api :: functionalities/data-formatter/data-formatter-stl/libcxx/string/TestDataFormatterLibcxxString.py 96.72s: lldb-api :: lang/cpp/inlines/TestInlines.py

Hide Details

Tests Times: -------------------------------------------------------------------------- [ Range ] :: [ Percentage ] :: [ Count ] -------------------------------------------------------------------------- [600s,650s) :: [ ] :: [ 3/2363] [550s,600s) :: [ ] :: [ 0/2363] [500s,550s) :: [ ] :: [ 0/2363] [450s,500s) :: [ ] :: [ 1/2363] [400s,450s) :: [ ] :: [ 2/2363] [350s,400s) :: [ ] :: [ 0/2363] [300s,350s) :: [ ] :: [ 1/2363] [250s,300s) :: [ ] :: [ 1/2363] [200s,250s) :: [ ] :: [ 0/2363] [150s,200s) :: [ ] :: [ 3/2363] [100s,150s) :: [ ] :: [ 20/2363] [ 50s,100s) :: [ ] :: [ 14/2363] [ 0s, 50s) :: [*************************************** ] :: [2318/2363] -------------------------------------------------------------------------- ******************** Timed Out Tests (3): lldb-api :: lang/cpp/namespace/TestNamespaceLookup.py lldb-api :: python_api/sbplatform/TestSBPlatform.py lldb-api :: tools/lldb-vscode/runInTerminal/TestVSCode_runInTerminal.py

Hide Details

******************** Failed Tests (58): lldb-api :: commands/expression/codegen-crash-import-def-arraytype-element/TestImportDefinitionArrayType.py lldb-api :: commands/expression/codegen-crash-typedefdecl-not-in_declcontext/TestCodegenCrashTypedefDeclNotInDeclContext.py lldb-api :: commands/expression/completion-in-lambda-and-unnamed-class/TestCompletionInLambdaAndUnnamedClass.py lldb-api :: commands/expression/import-std-module/empty-module/TestEmptyStdModule.py lldb-api :: commands/expression/import-std-module/no-std-module/TestMissingStdModule.py lldb-api :: commands/expression/import-std-module/queue/TestQueueFromStdModule.py lldb-api :: commands/expression/po_verbosity/TestPoVerbosity.py lldb-api :: commands/expression/unicode-in-variable/TestUnicodeInVariable.py lldb-api :: commands/expression/weak_symbols/TestWeakSymbols.py lldb-api :: commands/settings/TestSettings.py lldb-api :: commands/watchpoints/watchpoint_commands/condition/TestWatchpointConditionCmd.py lldb-api :: commands/watchpoints/watchpoint_count/TestWatchpointCount.py lldb-api :: commands/watchpoints/watchpoint_events/TestWatchpointEvents.py lldb-api :: functionalities/breakpoint/breakpoint_by_line_and_column/TestBreakpointByLineAndColumn.py lldb-api :: functionalities/breakpoint/consecutive_breakpoints/TestConsecutiveBreakpoints.py lldb-api :: functionalities/data-formatter/array_typedef/TestArrayTypedef.py lldb-api :: functionalities/data-formatter/data-formatter-objc/TestDataFormatterObjCNSError.py lldb-api :: functionalities/data-formatter/data-formatter-objc/cmtime/TestDataFormatterCMTime.py lldb-api :: functionalities/data-formatter/data-formatter-stl/libcxx/list/TestDataFormatterLibcxxList.py lldb-api :: functionalities/data-formatter/data-formatter-stl/libcxx/shared_ptr/TestDataFormatterLibcxxSharedPtr.py lldb-api :: functionalities/data-formatter/data-formatter-stl/libcxx/string/TestDataFormatterLibcxxString.py lldb-api :: functionalities/data-formatter/data-formatter-stl/libcxx/unique_ptr/TestDataFormatterLibcxxUniquePtr.py lldb-api :: functionalities/data-formatter/stringprinter/TestStringPrinter.py lldb-api :: functionalities/data-formatter/var-in-aggregate-misuse/TestVarInAggregateMisuse.py lldb-api :: functionalities/dead-strip/TestDeadStrip.py lldb-api :: functionalities/tail_call_frames/cross_object/TestCrossObjectTailCalls.py lldb-api :: functionalities/tail_call_frames/thread_step_out_message/TestArtificialFrameStepOutMessage.py lldb-api :: functionalities/thread/concurrent_events/TestConcurrentCrashWithSignal.py lldb-api :: functionalities/thread/concurrent_events/TestConcurrentDelaySignalWatch.py lldb-api :: functionalities/thread/concurrent_events/TestConcurrentTwoWatchpointsOneBreakpoint.py lldb-api :: functionalities/thread_plan/TestThreadPlanCommands.py lldb-api :: lang/cpp/chained-calls/TestCppChainedCalls.py lldb-api :: lang/cpp/const_this/TestConstThis.py lldb-api :: lang/cpp/inlines/TestInlines.py lldb-api :: lang/cpp/namespace/TestNamespace.py lldb-api :: lang/cpp/operator-overload/TestOperatorOverload.py lldb-api :: lang/cpp/scope/TestCppScope.py lldb-api :: lang/cpp/static_members/TestCPPStaticMembers.py lldb-api :: lang/cpp/this_class_type_mixing/TestThisClassTypeMixing.py lldb-api :: lang/objc/exceptions/TestObjCExceptions.py lldb-api :: lang/objc/foundation/TestObjCMethods2.py lldb-api :: lang/objc/self/TestObjCSelf.py lldb-api :: lang/objc/unicode-string/TestUnicodeString.py lldb-api :: macosx/add-dsym/TestAddDsymMidExecutionCommand.py lldb-api :: python_api/process/read-mem-cstring/TestReadMemCString.py lldb-api :: python_api/watchpoint/TestSetWatchpoint.py lldb-api :: python_api/watchpoint/TestWatchpointIgnoreCount.py lldb-api :: tools/lldb-server/TestGdbRemoteAttach.py lldb-api :: tools/lldb-server/TestGdbRemoteAuxvSupport.py lldb-api :: tools/lldb-server/TestGdbRemoteExpeditedRegisters.py lldb-api :: types/TestCharType.py lldb-api :: types/TestCharTypeExpr.py lldb-shell :: Process/UnsupportedLanguage.test lldb-shell :: Register/x86-64-read.test lldb-shell :: Reproducer/TestFileRepro.test lldb-shell :: Reproducer/TestVersionCheck.test lldb-shell :: Settings/TestFrameFormatNoColor.test lldb-shell :: Unwind/trap_frame_sym_ctx.test

Hide Details

Hide Details

Testing Time: 3273.74s Unsupported : 168 Passed : 2124 Expectedly Failed: 10 Timed Out : 3 Failed : 58 FAILED: tools/lldb/test/CMakeFiles/check-lldb cd /Users/buildslave/jenkins/workspace/lldb-cmake/lldb-build/tools/lldb/test && /usr/local/Frameworks/Python.framework/Versions/3.7/bin/python3.7 /Users/buildslave/jenkins/workspace/lldb-cmake/lldb-build/./bin/llvm-lit -v --time-tests --shuffle --xunit-xml-output=/Users/buildslave/jenkins/workspace/lldb-cmake/test/results.xml -v -j 4 /Users/buildslave/jenkins/workspace/lldb-cmake/lldb-build/tools/lldb/test ninja: build stopped: cannot make progress due to previous errors. Command failed: Command '['/usr/bin/env', 'TERM=vt100', '/usr/local/bin/ninja', '-v', 'check-debuginfo', 'check-lldb', '-k2']' returned non-zero exit status 1 Command: ['/usr/bin/env', 'TERM=vt100', '/usr/local/bin/ninja', '-v', 'check-debuginfo', 'check-lldb', '-k2'] [Pipeline] } [Pipeline] // timeout [Pipeline] } [Pipeline] // stage [Pipeline] stage [Pipeline] { (Declarative: Post Actions) [Pipeline] scanForIssues [Clang (LLVM based)] Sleeping for 5 seconds due to JENKINS-32191... [Clang (LLVM based)] Parsing console log (workspace: '/Users/buildslave/jenkins/workspace/lldb-cmake') [Clang (LLVM based)] Successfully parsed console log [Clang (LLVM based)] -> found 19 issues (skipped 34 duplicates) [Clang (LLVM based)] Post processing issues on 'green-dragon-10' with source code encoding 'UTF-8' [Clang (LLVM based)] Creating SCM blamer to obtain author and commit information for affected files [Clang (LLVM based)] -> No blamer installed yet. You need to install the 'git-forensics' plugin to enable blaming for Git. [Clang (LLVM based)] Resolving file names for all issues in source directory '/Users/buildslave/jenkins/workspace/lldb-cmake' [Clang (LLVM based)] -> resolved paths in source directory (15 found, 0 not found) [Clang (LLVM based)] Resolving module names from module definitions (build.xml, pom.xml, or Manifest.mf files) [Clang (LLVM based)] -> resolved module names for 19 issues [Clang (LLVM based)] Resolving package names (or namespaces) by parsing the affected files [Clang (LLVM based)] -> resolved package names of 15 affected files [Clang (LLVM based)] No filter has been set, publishing all 19 issues [Clang (LLVM based)] Creating fingerprints for all affected code blocks to track issues over different builds [Clang (LLVM based)] -> created fingerprints for 19 issues (skipped 0 issues) [Clang (LLVM based)] Copying affected files to Jenkins' build folder '/Users/Shared/Jenkins/Home/jobs/lldb-cmake/builds/33922/files-with-issues' [Clang (LLVM based)] -> 15 copied, 0 not in workspace, 0 not-found, 0 with I/O error [Clang (LLVM based)] Repository miner is not configured, skipping repository mining [Pipeline] junit Recording test results [Checks API] No suitable checks publisher found. [Pipeline] emailext Warning: paul.walker@arm.com is not a recognized user, but sending mail anyway Warning: caroline.concatto@arm.com is not a recognized user, but sending mail anyway Warning: kerry.mclaughlin@arm.com is not a recognized user, but sending mail anyway Warning: nikita.ppv@gmail.com is not a recognized user, but sending mail anyway Warning: tpopp@google.com is not a recognized user, but sending mail anyway Warning: a.bataev@hotmail.com is not a recognized user, but sending mail anyway Warning: paul.walker@arm.com is not a recognized user, but sending mail anyway Warning: caroline.concatto@arm.com is not a recognized user, but sending mail anyway Warning: kerry.mclaughlin@arm.com is not a recognized user, but sending mail anyway Warning: nikita.ppv@gmail.com is not a recognized user, but sending mail anyway Warning: tpopp@google.com is not a recognized user, but sending mail anyway Warning: a.bataev@hotmail.com is not a recognized user, but sending mail anyway

Hide Details

Begin Pre-Send Script... Sending email to: paul.walker@arm.com caroline.concatto@arm.com kerry.mclaughlin@arm.com nikita.ppv@gmail.com tpopp@google.com a.bataev@hotmail.com Michael Spencer <michael_spencer@apple.com> Azhar Mohammed <azhar@apple.com>
[Pipeline] } [Pipeline] // stage [Pipeline] } [Pipeline] // withEnv [Pipeline] } [Pipeline] // node [Pipeline] End of Pipeline ERROR: script returned exit code 1 Finished: FAILURE