Console Output

Skipping 3,007 KB.. Full Log
[2265/2349] /usr/local/bin/sccache /Users/buildslave/jenkins/workspace/clang-stage2-cmake-RgTSan/host-compiler/bin/clang++  -DBUILD_EXAMPLES -DGTEST_HAS_RTTI=0 -D__STDC_CONSTANT_MACROS -D__STDC_FORMAT_MACROS -D__STDC_LIMIT_MACROS -Ilib/Target/X86 -I/Users/buildslave/jenkins/workspace/clang-stage2-cmake-RgTSan/llvm-project/llvm/lib/Target/X86 -Iinclude -I/Users/buildslave/jenkins/workspace/clang-stage2-cmake-RgTSan/llvm-project/llvm/include -fPIC -fvisibility-inlines-hidden -Werror=date-time -Werror=unguarded-availability-new -Wall -Wextra -Wno-unused-parameter -Wwrite-strings -Wcast-qual -Wmissing-field-initializers -pedantic -Wno-long-long -Wc++98-compat-extra-semi -Wimplicit-fallthrough -Wcovered-switch-default -Wno-noexcept-type -Wnon-virtual-dtor -Wdelete-non-virtual-dtor -Wstring-conversion -fno-omit-frame-pointer -fsanitize=thread -fdiagnostics-color -flto=thin -O2 -g -DNDEBUG -isysroot /Applications/Xcode.app/Contents/Developer/Platforms/MacOSX.platform/Developer/SDKs/MacOSX10.15.sdk    -fno-exceptions -fno-rtti -std=c++14 -MD -MT lib/Target/X86/CMakeFiles/LLVMX86CodeGen.dir/X86FixupLEAs.cpp.o -MF lib/Target/X86/CMakeFiles/LLVMX86CodeGen.dir/X86FixupLEAs.cpp.o.d -o lib/Target/X86/CMakeFiles/LLVMX86CodeGen.dir/X86FixupLEAs.cpp.o -c /Users/buildslave/jenkins/workspace/clang-stage2-cmake-RgTSan/llvm-project/llvm/lib/Target/X86/X86FixupLEAs.cpp
[2266/2349] /usr/local/bin/sccache /Users/buildslave/jenkins/workspace/clang-stage2-cmake-RgTSan/host-compiler/bin/clang++  -DBUILD_EXAMPLES -DGTEST_HAS_RTTI=0 -D__STDC_CONSTANT_MACROS -D__STDC_FORMAT_MACROS -D__STDC_LIMIT_MACROS -Ilib/Target/X86 -I/Users/buildslave/jenkins/workspace/clang-stage2-cmake-RgTSan/llvm-project/llvm/lib/Target/X86 -Iinclude -I/Users/buildslave/jenkins/workspace/clang-stage2-cmake-RgTSan/llvm-project/llvm/include -fPIC -fvisibility-inlines-hidden -Werror=date-time -Werror=unguarded-availability-new -Wall -Wextra -Wno-unused-parameter -Wwrite-strings -Wcast-qual -Wmissing-field-initializers -pedantic -Wno-long-long -Wc++98-compat-extra-semi -Wimplicit-fallthrough -Wcovered-switch-default -Wno-noexcept-type -Wnon-virtual-dtor -Wdelete-non-virtual-dtor -Wstring-conversion -fno-omit-frame-pointer -fsanitize=thread -fdiagnostics-color -flto=thin -O2 -g -DNDEBUG -isysroot /Applications/Xcode.app/Contents/Developer/Platforms/MacOSX.platform/Developer/SDKs/MacOSX10.15.sdk    -fno-exceptions -fno-rtti -std=c++14 -MD -MT lib/Target/X86/CMakeFiles/LLVMX86CodeGen.dir/X86AvoidStoreForwardingBlocks.cpp.o -MF lib/Target/X86/CMakeFiles/LLVMX86CodeGen.dir/X86AvoidStoreForwardingBlocks.cpp.o.d -o lib/Target/X86/CMakeFiles/LLVMX86CodeGen.dir/X86AvoidStoreForwardingBlocks.cpp.o -c /Users/buildslave/jenkins/workspace/clang-stage2-cmake-RgTSan/llvm-project/llvm/lib/Target/X86/X86AvoidStoreForwardingBlocks.cpp
[2267/2349] /usr/local/bin/sccache /Users/buildslave/jenkins/workspace/clang-stage2-cmake-RgTSan/host-compiler/bin/clang++  -DBUILD_EXAMPLES -DGTEST_HAS_RTTI=0 -D__STDC_CONSTANT_MACROS -D__STDC_FORMAT_MACROS -D__STDC_LIMIT_MACROS -Ilib/Target/X86 -I/Users/buildslave/jenkins/workspace/clang-stage2-cmake-RgTSan/llvm-project/llvm/lib/Target/X86 -Iinclude -I/Users/buildslave/jenkins/workspace/clang-stage2-cmake-RgTSan/llvm-project/llvm/include -fPIC -fvisibility-inlines-hidden -Werror=date-time -Werror=unguarded-availability-new -Wall -Wextra -Wno-unused-parameter -Wwrite-strings -Wcast-qual -Wmissing-field-initializers -pedantic -Wno-long-long -Wc++98-compat-extra-semi -Wimplicit-fallthrough -Wcovered-switch-default -Wno-noexcept-type -Wnon-virtual-dtor -Wdelete-non-virtual-dtor -Wstring-conversion -fno-omit-frame-pointer -fsanitize=thread -fdiagnostics-color -flto=thin -O2 -g -DNDEBUG -isysroot /Applications/Xcode.app/Contents/Developer/Platforms/MacOSX.platform/Developer/SDKs/MacOSX10.15.sdk    -fno-exceptions -fno-rtti -std=c++14 -MD -MT lib/Target/X86/CMakeFiles/LLVMX86CodeGen.dir/X86FloatingPoint.cpp.o -MF lib/Target/X86/CMakeFiles/LLVMX86CodeGen.dir/X86FloatingPoint.cpp.o.d -o lib/Target/X86/CMakeFiles/LLVMX86CodeGen.dir/X86FloatingPoint.cpp.o -c /Users/buildslave/jenkins/workspace/clang-stage2-cmake-RgTSan/llvm-project/llvm/lib/Target/X86/X86FloatingPoint.cpp
[2268/2349] /usr/local/bin/sccache /Users/buildslave/jenkins/workspace/clang-stage2-cmake-RgTSan/host-compiler/bin/clang++  -DBUILD_EXAMPLES -DGTEST_HAS_RTTI=0 -D__STDC_CONSTANT_MACROS -D__STDC_FORMAT_MACROS -D__STDC_LIMIT_MACROS -Ilib/Target/X86 -I/Users/buildslave/jenkins/workspace/clang-stage2-cmake-RgTSan/llvm-project/llvm/lib/Target/X86 -Iinclude -I/Users/buildslave/jenkins/workspace/clang-stage2-cmake-RgTSan/llvm-project/llvm/include -fPIC -fvisibility-inlines-hidden -Werror=date-time -Werror=unguarded-availability-new -Wall -Wextra -Wno-unused-parameter -Wwrite-strings -Wcast-qual -Wmissing-field-initializers -pedantic -Wno-long-long -Wc++98-compat-extra-semi -Wimplicit-fallthrough -Wcovered-switch-default -Wno-noexcept-type -Wnon-virtual-dtor -Wdelete-non-virtual-dtor -Wstring-conversion -fno-omit-frame-pointer -fsanitize=thread -fdiagnostics-color -flto=thin -O2 -g -DNDEBUG -isysroot /Applications/Xcode.app/Contents/Developer/Platforms/MacOSX.platform/Developer/SDKs/MacOSX10.15.sdk    -fno-exceptions -fno-rtti -std=c++14 -MD -MT lib/Target/X86/CMakeFiles/LLVMX86CodeGen.dir/X86FlagsCopyLowering.cpp.o -MF lib/Target/X86/CMakeFiles/LLVMX86CodeGen.dir/X86FlagsCopyLowering.cpp.o.d -o lib/Target/X86/CMakeFiles/LLVMX86CodeGen.dir/X86FlagsCopyLowering.cpp.o -c /Users/buildslave/jenkins/workspace/clang-stage2-cmake-RgTSan/llvm-project/llvm/lib/Target/X86/X86FlagsCopyLowering.cpp
[2269/2349] /usr/local/bin/sccache /Users/buildslave/jenkins/workspace/clang-stage2-cmake-RgTSan/host-compiler/bin/clang++  -DBUILD_EXAMPLES -DGTEST_HAS_RTTI=0 -D__STDC_CONSTANT_MACROS -D__STDC_FORMAT_MACROS -D__STDC_LIMIT_MACROS -Ilib/Target/X86 -I/Users/buildslave/jenkins/workspace/clang-stage2-cmake-RgTSan/llvm-project/llvm/lib/Target/X86 -Iinclude -I/Users/buildslave/jenkins/workspace/clang-stage2-cmake-RgTSan/llvm-project/llvm/include -fPIC -fvisibility-inlines-hidden -Werror=date-time -Werror=unguarded-availability-new -Wall -Wextra -Wno-unused-parameter -Wwrite-strings -Wcast-qual -Wmissing-field-initializers -pedantic -Wno-long-long -Wc++98-compat-extra-semi -Wimplicit-fallthrough -Wcovered-switch-default -Wno-noexcept-type -Wnon-virtual-dtor -Wdelete-non-virtual-dtor -Wstring-conversion -fno-omit-frame-pointer -fsanitize=thread -fdiagnostics-color -flto=thin -O2 -g -DNDEBUG -isysroot /Applications/Xcode.app/Contents/Developer/Platforms/MacOSX.platform/Developer/SDKs/MacOSX10.15.sdk    -fno-exceptions -fno-rtti -std=c++14 -MD -MT lib/Target/X86/CMakeFiles/LLVMX86CodeGen.dir/X86FastISel.cpp.o -MF lib/Target/X86/CMakeFiles/LLVMX86CodeGen.dir/X86FastISel.cpp.o.d -o lib/Target/X86/CMakeFiles/LLVMX86CodeGen.dir/X86FastISel.cpp.o -c /Users/buildslave/jenkins/workspace/clang-stage2-cmake-RgTSan/llvm-project/llvm/lib/Target/X86/X86FastISel.cpp
[2270/2349] /usr/local/bin/sccache /Users/buildslave/jenkins/workspace/clang-stage2-cmake-RgTSan/host-compiler/bin/clang++  -DBUILD_EXAMPLES -DGTEST_HAS_RTTI=0 -D__STDC_CONSTANT_MACROS -D__STDC_FORMAT_MACROS -D__STDC_LIMIT_MACROS -Ilib/Target/X86 -I/Users/buildslave/jenkins/workspace/clang-stage2-cmake-RgTSan/llvm-project/llvm/lib/Target/X86 -Iinclude -I/Users/buildslave/jenkins/workspace/clang-stage2-cmake-RgTSan/llvm-project/llvm/include -fPIC -fvisibility-inlines-hidden -Werror=date-time -Werror=unguarded-availability-new -Wall -Wextra -Wno-unused-parameter -Wwrite-strings -Wcast-qual -Wmissing-field-initializers -pedantic -Wno-long-long -Wc++98-compat-extra-semi -Wimplicit-fallthrough -Wcovered-switch-default -Wno-noexcept-type -Wnon-virtual-dtor -Wdelete-non-virtual-dtor -Wstring-conversion -fno-omit-frame-pointer -fsanitize=thread -fdiagnostics-color -flto=thin -O2 -g -DNDEBUG -isysroot /Applications/Xcode.app/Contents/Developer/Platforms/MacOSX.platform/Developer/SDKs/MacOSX10.15.sdk    -fno-exceptions -fno-rtti -std=c++14 -MD -MT lib/Target/X86/CMakeFiles/LLVMX86CodeGen.dir/X86FrameLowering.cpp.o -MF lib/Target/X86/CMakeFiles/LLVMX86CodeGen.dir/X86FrameLowering.cpp.o.d -o lib/Target/X86/CMakeFiles/LLVMX86CodeGen.dir/X86FrameLowering.cpp.o -c /Users/buildslave/jenkins/workspace/clang-stage2-cmake-RgTSan/llvm-project/llvm/lib/Target/X86/X86FrameLowering.cpp
[2271/2349] : && DYLD_LIBRARY_PATH=/Users/buildslave/jenkins/workspace/clang-stage2-cmake-RgTSan/host-compiler/lib/ "/Applications/Xcode.app/Contents/Developer/Toolchains/XcodeDefault.xctoolchain/usr/bin/libtool" -static -no_warning_for_no_symbols -o lib/libLLVMARMCodeGen.a  lib/Target/ARM/CMakeFiles/LLVMARMCodeGen.dir/A15SDOptimizer.cpp.o lib/Target/ARM/CMakeFiles/LLVMARMCodeGen.dir/ARMAsmPrinter.cpp.o lib/Target/ARM/CMakeFiles/LLVMARMCodeGen.dir/ARMBaseInstrInfo.cpp.o lib/Target/ARM/CMakeFiles/LLVMARMCodeGen.dir/ARMBaseRegisterInfo.cpp.o lib/Target/ARM/CMakeFiles/LLVMARMCodeGen.dir/ARMBasicBlockInfo.cpp.o lib/Target/ARM/CMakeFiles/LLVMARMCodeGen.dir/ARMCallingConv.cpp.o lib/Target/ARM/CMakeFiles/LLVMARMCodeGen.dir/ARMCallLowering.cpp.o lib/Target/ARM/CMakeFiles/LLVMARMCodeGen.dir/ARMConstantIslandPass.cpp.o lib/Target/ARM/CMakeFiles/LLVMARMCodeGen.dir/ARMConstantPoolValue.cpp.o lib/Target/ARM/CMakeFiles/LLVMARMCodeGen.dir/ARMExpandPseudoInsts.cpp.o lib/Target/ARM/CMakeFiles/LLVMARMCodeGen.dir/ARMFastISel.cpp.o lib/Target/ARM/CMakeFiles/LLVMARMCodeGen.dir/ARMFrameLowering.cpp.o lib/Target/ARM/CMakeFiles/LLVMARMCodeGen.dir/ARMHazardRecognizer.cpp.o lib/Target/ARM/CMakeFiles/LLVMARMCodeGen.dir/ARMInstructionSelector.cpp.o lib/Target/ARM/CMakeFiles/LLVMARMCodeGen.dir/ARMISelDAGToDAG.cpp.o lib/Target/ARM/CMakeFiles/LLVMARMCodeGen.dir/ARMISelLowering.cpp.o lib/Target/ARM/CMakeFiles/LLVMARMCodeGen.dir/ARMInstrInfo.cpp.o lib/Target/ARM/CMakeFiles/LLVMARMCodeGen.dir/ARMLegalizerInfo.cpp.o lib/Target/ARM/CMakeFiles/LLVMARMCodeGen.dir/ARMParallelDSP.cpp.o lib/Target/ARM/CMakeFiles/LLVMARMCodeGen.dir/ARMLoadStoreOptimizer.cpp.o lib/Target/ARM/CMakeFiles/LLVMARMCodeGen.dir/ARMLowOverheadLoops.cpp.o lib/Target/ARM/CMakeFiles/LLVMARMCodeGen.dir/ARMBlockPlacement.cpp.o lib/Target/ARM/CMakeFiles/LLVMARMCodeGen.dir/ARMMCInstLower.cpp.o lib/Target/ARM/CMakeFiles/LLVMARMCodeGen.dir/ARMMachineFunctionInfo.cpp.o lib/Target/ARM/CMakeFiles/LLVMARMCodeGen.dir/ARMMacroFusion.cpp.o lib/Target/ARM/CMakeFiles/LLVMARMCodeGen.dir/ARMRegisterInfo.cpp.o lib/Target/ARM/CMakeFiles/LLVMARMCodeGen.dir/ARMOptimizeBarriersPass.cpp.o lib/Target/ARM/CMakeFiles/LLVMARMCodeGen.dir/ARMRegisterBankInfo.cpp.o lib/Target/ARM/CMakeFiles/LLVMARMCodeGen.dir/ARMSelectionDAGInfo.cpp.o lib/Target/ARM/CMakeFiles/LLVMARMCodeGen.dir/ARMSLSHardening.cpp.o lib/Target/ARM/CMakeFiles/LLVMARMCodeGen.dir/ARMSubtarget.cpp.o lib/Target/ARM/CMakeFiles/LLVMARMCodeGen.dir/ARMTargetMachine.cpp.o lib/Target/ARM/CMakeFiles/LLVMARMCodeGen.dir/ARMTargetObjectFile.cpp.o lib/Target/ARM/CMakeFiles/LLVMARMCodeGen.dir/ARMTargetTransformInfo.cpp.o lib/Target/ARM/CMakeFiles/LLVMARMCodeGen.dir/MLxExpansionPass.cpp.o lib/Target/ARM/CMakeFiles/LLVMARMCodeGen.dir/MVEGatherScatterLowering.cpp.o lib/Target/ARM/CMakeFiles/LLVMARMCodeGen.dir/MVELaneInterleavingPass.cpp.o lib/Target/ARM/CMakeFiles/LLVMARMCodeGen.dir/MVETailPredication.cpp.o lib/Target/ARM/CMakeFiles/LLVMARMCodeGen.dir/MVEVPTBlockPass.cpp.o lib/Target/ARM/CMakeFiles/LLVMARMCodeGen.dir/MVETPAndVPTOptimisationsPass.cpp.o lib/Target/ARM/CMakeFiles/LLVMARMCodeGen.dir/Thumb1FrameLowering.cpp.o lib/Target/ARM/CMakeFiles/LLVMARMCodeGen.dir/Thumb1InstrInfo.cpp.o lib/Target/ARM/CMakeFiles/LLVMARMCodeGen.dir/ThumbRegisterInfo.cpp.o lib/Target/ARM/CMakeFiles/LLVMARMCodeGen.dir/Thumb2ITBlockPass.cpp.o lib/Target/ARM/CMakeFiles/LLVMARMCodeGen.dir/Thumb2InstrInfo.cpp.o lib/Target/ARM/CMakeFiles/LLVMARMCodeGen.dir/Thumb2SizeReduction.cpp.o && :
[2272/2349] : && DYLD_LIBRARY_PATH=/Users/buildslave/jenkins/workspace/clang-stage2-cmake-RgTSan/host-compiler/lib/ "/Applications/Xcode.app/Contents/Developer/Toolchains/XcodeDefault.xctoolchain/usr/bin/libtool" -static -no_warning_for_no_symbols -o lib/libLLVMAArch64CodeGen.a  lib/Target/AArch64/CMakeFiles/LLVMAArch64CodeGen.dir/GISel/AArch64CallLowering.cpp.o lib/Target/AArch64/CMakeFiles/LLVMAArch64CodeGen.dir/GISel/AArch64GlobalISelUtils.cpp.o lib/Target/AArch64/CMakeFiles/LLVMAArch64CodeGen.dir/GISel/AArch64InstructionSelector.cpp.o lib/Target/AArch64/CMakeFiles/LLVMAArch64CodeGen.dir/GISel/AArch64LegalizerInfo.cpp.o lib/Target/AArch64/CMakeFiles/LLVMAArch64CodeGen.dir/GISel/AArch64O0PreLegalizerCombiner.cpp.o lib/Target/AArch64/CMakeFiles/LLVMAArch64CodeGen.dir/GISel/AArch64PreLegalizerCombiner.cpp.o lib/Target/AArch64/CMakeFiles/LLVMAArch64CodeGen.dir/GISel/AArch64PostLegalizerCombiner.cpp.o lib/Target/AArch64/CMakeFiles/LLVMAArch64CodeGen.dir/GISel/AArch64PostLegalizerLowering.cpp.o lib/Target/AArch64/CMakeFiles/LLVMAArch64CodeGen.dir/GISel/AArch64PostSelectOptimize.cpp.o lib/Target/AArch64/CMakeFiles/LLVMAArch64CodeGen.dir/GISel/AArch64RegisterBankInfo.cpp.o lib/Target/AArch64/CMakeFiles/LLVMAArch64CodeGen.dir/AArch64A57FPLoadBalancing.cpp.o lib/Target/AArch64/CMakeFiles/LLVMAArch64CodeGen.dir/AArch64AdvSIMDScalarPass.cpp.o lib/Target/AArch64/CMakeFiles/LLVMAArch64CodeGen.dir/AArch64AsmPrinter.cpp.o lib/Target/AArch64/CMakeFiles/LLVMAArch64CodeGen.dir/AArch64BranchTargets.cpp.o lib/Target/AArch64/CMakeFiles/LLVMAArch64CodeGen.dir/AArch64CallingConvention.cpp.o lib/Target/AArch64/CMakeFiles/LLVMAArch64CodeGen.dir/AArch64CleanupLocalDynamicTLSPass.cpp.o lib/Target/AArch64/CMakeFiles/LLVMAArch64CodeGen.dir/AArch64CollectLOH.cpp.o lib/Target/AArch64/CMakeFiles/LLVMAArch64CodeGen.dir/AArch64CondBrTuning.cpp.o lib/Target/AArch64/CMakeFiles/LLVMAArch64CodeGen.dir/AArch64ConditionalCompares.cpp.o lib/Target/AArch64/CMakeFiles/LLVMAArch64CodeGen.dir/AArch64DeadRegisterDefinitionsPass.cpp.o lib/Target/AArch64/CMakeFiles/LLVMAArch64CodeGen.dir/AArch64ExpandImm.cpp.o lib/Target/AArch64/CMakeFiles/LLVMAArch64CodeGen.dir/AArch64ExpandPseudoInsts.cpp.o lib/Target/AArch64/CMakeFiles/LLVMAArch64CodeGen.dir/AArch64FalkorHWPFFix.cpp.o lib/Target/AArch64/CMakeFiles/LLVMAArch64CodeGen.dir/AArch64FastISel.cpp.o lib/Target/AArch64/CMakeFiles/LLVMAArch64CodeGen.dir/AArch64A53Fix835769.cpp.o lib/Target/AArch64/CMakeFiles/LLVMAArch64CodeGen.dir/AArch64FrameLowering.cpp.o lib/Target/AArch64/CMakeFiles/LLVMAArch64CodeGen.dir/AArch64CompressJumpTables.cpp.o lib/Target/AArch64/CMakeFiles/LLVMAArch64CodeGen.dir/AArch64ConditionOptimizer.cpp.o lib/Target/AArch64/CMakeFiles/LLVMAArch64CodeGen.dir/AArch64RedundantCopyElimination.cpp.o lib/Target/AArch64/CMakeFiles/LLVMAArch64CodeGen.dir/AArch64ISelDAGToDAG.cpp.o lib/Target/AArch64/CMakeFiles/LLVMAArch64CodeGen.dir/AArch64ISelLowering.cpp.o lib/Target/AArch64/CMakeFiles/LLVMAArch64CodeGen.dir/AArch64InstrInfo.cpp.o lib/Target/AArch64/CMakeFiles/LLVMAArch64CodeGen.dir/AArch64LoadStoreOptimizer.cpp.o lib/Target/AArch64/CMakeFiles/LLVMAArch64CodeGen.dir/AArch64LowerHomogeneousPrologEpilog.cpp.o lib/Target/AArch64/CMakeFiles/LLVMAArch64CodeGen.dir/AArch64MachineFunctionInfo.cpp.o lib/Target/AArch64/CMakeFiles/LLVMAArch64CodeGen.dir/AArch64MacroFusion.cpp.o lib/Target/AArch64/CMakeFiles/LLVMAArch64CodeGen.dir/AArch64MCInstLower.cpp.o lib/Target/AArch64/CMakeFiles/LLVMAArch64CodeGen.dir/AArch64PromoteConstant.cpp.o lib/Target/AArch64/CMakeFiles/LLVMAArch64CodeGen.dir/AArch64PBQPRegAlloc.cpp.o lib/Target/AArch64/CMakeFiles/LLVMAArch64CodeGen.dir/AArch64RegisterInfo.cpp.o lib/Target/AArch64/CMakeFiles/LLVMAArch64CodeGen.dir/AArch64SLSHardening.cpp.o lib/Target/AArch64/CMakeFiles/LLVMAArch64CodeGen.dir/AArch64SelectionDAGInfo.cpp.o lib/Target/AArch64/CMakeFiles/LLVMAArch64CodeGen.dir/AArch64SpeculationHardening.cpp.o lib/Target/AArch64/CMakeFiles/LLVMAArch64CodeGen.dir/AArch64StackTagging.cpp.o lib/Target/AArch64/CMakeFiles/LLVMAArch64CodeGen.dir/AArch64StackTaggingPreRA.cpp.o lib/Target/AArch64/CMakeFiles/LLVMAArch64CodeGen.dir/AArch64StorePairSuppress.cpp.o lib/Target/AArch64/CMakeFiles/LLVMAArch64CodeGen.dir/AArch64Subtarget.cpp.o lib/Target/AArch64/CMakeFiles/LLVMAArch64CodeGen.dir/AArch64TargetMachine.cpp.o lib/Target/AArch64/CMakeFiles/LLVMAArch64CodeGen.dir/AArch64TargetObjectFile.cpp.o lib/Target/AArch64/CMakeFiles/LLVMAArch64CodeGen.dir/AArch64TargetTransformInfo.cpp.o lib/Target/AArch64/CMakeFiles/LLVMAArch64CodeGen.dir/SVEIntrinsicOpts.cpp.o lib/Target/AArch64/CMakeFiles/LLVMAArch64CodeGen.dir/AArch64SIMDInstrOpt.cpp.o && :
[2273/2349] /usr/local/bin/sccache /Users/buildslave/jenkins/workspace/clang-stage2-cmake-RgTSan/host-compiler/bin/clang++  -DBUILD_EXAMPLES -DGTEST_HAS_RTTI=0 -D__STDC_CONSTANT_MACROS -D__STDC_FORMAT_MACROS -D__STDC_LIMIT_MACROS -Ilib/Target/X86 -I/Users/buildslave/jenkins/workspace/clang-stage2-cmake-RgTSan/llvm-project/llvm/lib/Target/X86 -Iinclude -I/Users/buildslave/jenkins/workspace/clang-stage2-cmake-RgTSan/llvm-project/llvm/include -fPIC -fvisibility-inlines-hidden -Werror=date-time -Werror=unguarded-availability-new -Wall -Wextra -Wno-unused-parameter -Wwrite-strings -Wcast-qual -Wmissing-field-initializers -pedantic -Wno-long-long -Wc++98-compat-extra-semi -Wimplicit-fallthrough -Wcovered-switch-default -Wno-noexcept-type -Wnon-virtual-dtor -Wdelete-non-virtual-dtor -Wstring-conversion -fno-omit-frame-pointer -fsanitize=thread -fdiagnostics-color -flto=thin -O2 -g -DNDEBUG -isysroot /Applications/Xcode.app/Contents/Developer/Platforms/MacOSX.platform/Developer/SDKs/MacOSX10.15.sdk    -fno-exceptions -fno-rtti -std=c++14 -MD -MT lib/Target/X86/CMakeFiles/LLVMX86CodeGen.dir/X86InstructionSelector.cpp.o -MF lib/Target/X86/CMakeFiles/LLVMX86CodeGen.dir/X86InstructionSelector.cpp.o.d -o lib/Target/X86/CMakeFiles/LLVMX86CodeGen.dir/X86InstructionSelector.cpp.o -c /Users/buildslave/jenkins/workspace/clang-stage2-cmake-RgTSan/llvm-project/llvm/lib/Target/X86/X86InstructionSelector.cpp
[2274/2349] /usr/local/bin/sccache /Users/buildslave/jenkins/workspace/clang-stage2-cmake-RgTSan/host-compiler/bin/clang++  -DBUILD_EXAMPLES -DGTEST_HAS_RTTI=0 -D__STDC_CONSTANT_MACROS -D__STDC_FORMAT_MACROS -D__STDC_LIMIT_MACROS -Ilib/Passes -I/Users/buildslave/jenkins/workspace/clang-stage2-cmake-RgTSan/llvm-project/llvm/lib/Passes -Iinclude -I/Users/buildslave/jenkins/workspace/clang-stage2-cmake-RgTSan/llvm-project/llvm/include -fPIC -fvisibility-inlines-hidden -Werror=date-time -Werror=unguarded-availability-new -Wall -Wextra -Wno-unused-parameter -Wwrite-strings -Wcast-qual -Wmissing-field-initializers -pedantic -Wno-long-long -Wc++98-compat-extra-semi -Wimplicit-fallthrough -Wcovered-switch-default -Wno-noexcept-type -Wnon-virtual-dtor -Wdelete-non-virtual-dtor -Wstring-conversion -fno-omit-frame-pointer -fsanitize=thread -fdiagnostics-color -flto=thin -O2 -g -DNDEBUG -isysroot /Applications/Xcode.app/Contents/Developer/Platforms/MacOSX.platform/Developer/SDKs/MacOSX10.15.sdk    -fno-exceptions -fno-rtti -std=c++14 -MD -MT lib/Passes/CMakeFiles/LLVMPasses.dir/PassBuilder.cpp.o -MF lib/Passes/CMakeFiles/LLVMPasses.dir/PassBuilder.cpp.o.d -o lib/Passes/CMakeFiles/LLVMPasses.dir/PassBuilder.cpp.o -c /Users/buildslave/jenkins/workspace/clang-stage2-cmake-RgTSan/llvm-project/llvm/lib/Passes/PassBuilder.cpp
[2275/2349] : && DYLD_LIBRARY_PATH=/Users/buildslave/jenkins/workspace/clang-stage2-cmake-RgTSan/host-compiler/lib/ "/Applications/Xcode.app/Contents/Developer/Toolchains/XcodeDefault.xctoolchain/usr/bin/libtool" -static -no_warning_for_no_symbols -o lib/libLLVMAVRCodeGen.a  lib/Target/AVR/CMakeFiles/LLVMAVRCodeGen.dir/AVRAsmPrinter.cpp.o lib/Target/AVR/CMakeFiles/LLVMAVRCodeGen.dir/AVRExpandPseudoInsts.cpp.o lib/Target/AVR/CMakeFiles/LLVMAVRCodeGen.dir/AVRFrameLowering.cpp.o lib/Target/AVR/CMakeFiles/LLVMAVRCodeGen.dir/AVRInstrInfo.cpp.o lib/Target/AVR/CMakeFiles/LLVMAVRCodeGen.dir/AVRISelDAGToDAG.cpp.o lib/Target/AVR/CMakeFiles/LLVMAVRCodeGen.dir/AVRISelLowering.cpp.o lib/Target/AVR/CMakeFiles/LLVMAVRCodeGen.dir/AVRMCInstLower.cpp.o lib/Target/AVR/CMakeFiles/LLVMAVRCodeGen.dir/AVRRelaxMemOperations.cpp.o lib/Target/AVR/CMakeFiles/LLVMAVRCodeGen.dir/AVRRegisterInfo.cpp.o lib/Target/AVR/CMakeFiles/LLVMAVRCodeGen.dir/AVRShiftExpand.cpp.o lib/Target/AVR/CMakeFiles/LLVMAVRCodeGen.dir/AVRSubtarget.cpp.o lib/Target/AVR/CMakeFiles/LLVMAVRCodeGen.dir/AVRTargetMachine.cpp.o lib/Target/AVR/CMakeFiles/LLVMAVRCodeGen.dir/AVRTargetObjectFile.cpp.o && :
[2276/2349] : && DYLD_LIBRARY_PATH=/Users/buildslave/jenkins/workspace/clang-stage2-cmake-RgTSan/host-compiler/lib/ "/Applications/Xcode.app/Contents/Developer/Toolchains/XcodeDefault.xctoolchain/usr/bin/libtool" -static -no_warning_for_no_symbols -o lib/libLLVMBPFCodeGen.a  lib/Target/BPF/CMakeFiles/LLVMBPFCodeGen.dir/BPFAbstractMemberAccess.cpp.o lib/Target/BPF/CMakeFiles/LLVMBPFCodeGen.dir/BPFAdjustOpt.cpp.o lib/Target/BPF/CMakeFiles/LLVMBPFCodeGen.dir/BPFAsmPrinter.cpp.o lib/Target/BPF/CMakeFiles/LLVMBPFCodeGen.dir/BPFCheckAndAdjustIR.cpp.o lib/Target/BPF/CMakeFiles/LLVMBPFCodeGen.dir/BPFFrameLowering.cpp.o lib/Target/BPF/CMakeFiles/LLVMBPFCodeGen.dir/BPFInstrInfo.cpp.o lib/Target/BPF/CMakeFiles/LLVMBPFCodeGen.dir/BPFISelDAGToDAG.cpp.o lib/Target/BPF/CMakeFiles/LLVMBPFCodeGen.dir/BPFISelLowering.cpp.o lib/Target/BPF/CMakeFiles/LLVMBPFCodeGen.dir/BPFMCInstLower.cpp.o lib/Target/BPF/CMakeFiles/LLVMBPFCodeGen.dir/BPFPreserveDIType.cpp.o lib/Target/BPF/CMakeFiles/LLVMBPFCodeGen.dir/BPFRegisterInfo.cpp.o lib/Target/BPF/CMakeFiles/LLVMBPFCodeGen.dir/BPFSelectionDAGInfo.cpp.o lib/Target/BPF/CMakeFiles/LLVMBPFCodeGen.dir/BPFSubtarget.cpp.o lib/Target/BPF/CMakeFiles/LLVMBPFCodeGen.dir/BPFTargetMachine.cpp.o lib/Target/BPF/CMakeFiles/LLVMBPFCodeGen.dir/BPFMIPeephole.cpp.o lib/Target/BPF/CMakeFiles/LLVMBPFCodeGen.dir/BPFMIChecking.cpp.o lib/Target/BPF/CMakeFiles/LLVMBPFCodeGen.dir/BPFMISimplifyPatchable.cpp.o lib/Target/BPF/CMakeFiles/LLVMBPFCodeGen.dir/BTFDebug.cpp.o && :
[2277/2349] /usr/local/bin/sccache /Users/buildslave/jenkins/workspace/clang-stage2-cmake-RgTSan/host-compiler/bin/clang++  -DBUILD_EXAMPLES -DGTEST_HAS_RTTI=0 -D__STDC_CONSTANT_MACROS -D__STDC_FORMAT_MACROS -D__STDC_LIMIT_MACROS -Ilib/Target/X86 -I/Users/buildslave/jenkins/workspace/clang-stage2-cmake-RgTSan/llvm-project/llvm/lib/Target/X86 -Iinclude -I/Users/buildslave/jenkins/workspace/clang-stage2-cmake-RgTSan/llvm-project/llvm/include -fPIC -fvisibility-inlines-hidden -Werror=date-time -Werror=unguarded-availability-new -Wall -Wextra -Wno-unused-parameter -Wwrite-strings -Wcast-qual -Wmissing-field-initializers -pedantic -Wno-long-long -Wc++98-compat-extra-semi -Wimplicit-fallthrough -Wcovered-switch-default -Wno-noexcept-type -Wnon-virtual-dtor -Wdelete-non-virtual-dtor -Wstring-conversion -fno-omit-frame-pointer -fsanitize=thread -fdiagnostics-color -flto=thin -O2 -g -DNDEBUG -isysroot /Applications/Xcode.app/Contents/Developer/Platforms/MacOSX.platform/Developer/SDKs/MacOSX10.15.sdk    -fno-exceptions -fno-rtti -std=c++14 -MD -MT lib/Target/X86/CMakeFiles/LLVMX86CodeGen.dir/X86IndirectBranchTracking.cpp.o -MF lib/Target/X86/CMakeFiles/LLVMX86CodeGen.dir/X86IndirectBranchTracking.cpp.o.d -o lib/Target/X86/CMakeFiles/LLVMX86CodeGen.dir/X86IndirectBranchTracking.cpp.o -c /Users/buildslave/jenkins/workspace/clang-stage2-cmake-RgTSan/llvm-project/llvm/lib/Target/X86/X86IndirectBranchTracking.cpp
[2278/2349] /usr/local/bin/sccache /Users/buildslave/jenkins/workspace/clang-stage2-cmake-RgTSan/host-compiler/bin/clang++  -DBUILD_EXAMPLES -DGTEST_HAS_RTTI=0 -D__STDC_CONSTANT_MACROS -D__STDC_FORMAT_MACROS -D__STDC_LIMIT_MACROS -Ilib/Target/X86 -I/Users/buildslave/jenkins/workspace/clang-stage2-cmake-RgTSan/llvm-project/llvm/lib/Target/X86 -Iinclude -I/Users/buildslave/jenkins/workspace/clang-stage2-cmake-RgTSan/llvm-project/llvm/include -fPIC -fvisibility-inlines-hidden -Werror=date-time -Werror=unguarded-availability-new -Wall -Wextra -Wno-unused-parameter -Wwrite-strings -Wcast-qual -Wmissing-field-initializers -pedantic -Wno-long-long -Wc++98-compat-extra-semi -Wimplicit-fallthrough -Wcovered-switch-default -Wno-noexcept-type -Wnon-virtual-dtor -Wdelete-non-virtual-dtor -Wstring-conversion -fno-omit-frame-pointer -fsanitize=thread -fdiagnostics-color -flto=thin -O2 -g -DNDEBUG -isysroot /Applications/Xcode.app/Contents/Developer/Platforms/MacOSX.platform/Developer/SDKs/MacOSX10.15.sdk    -fno-exceptions -fno-rtti -std=c++14 -MD -MT lib/Target/X86/CMakeFiles/LLVMX86CodeGen.dir/X86IndirectThunks.cpp.o -MF lib/Target/X86/CMakeFiles/LLVMX86CodeGen.dir/X86IndirectThunks.cpp.o.d -o lib/Target/X86/CMakeFiles/LLVMX86CodeGen.dir/X86IndirectThunks.cpp.o -c /Users/buildslave/jenkins/workspace/clang-stage2-cmake-RgTSan/llvm-project/llvm/lib/Target/X86/X86IndirectThunks.cpp
[2279/2349] : && DYLD_LIBRARY_PATH=/Users/buildslave/jenkins/workspace/clang-stage2-cmake-RgTSan/host-compiler/lib/ "/Applications/Xcode.app/Contents/Developer/Toolchains/XcodeDefault.xctoolchain/usr/bin/libtool" -static -no_warning_for_no_symbols -o lib/libLLVMLanaiCodeGen.a  lib/Target/Lanai/CMakeFiles/LLVMLanaiCodeGen.dir/LanaiAsmPrinter.cpp.o lib/Target/Lanai/CMakeFiles/LLVMLanaiCodeGen.dir/LanaiDelaySlotFiller.cpp.o lib/Target/Lanai/CMakeFiles/LLVMLanaiCodeGen.dir/LanaiFrameLowering.cpp.o lib/Target/Lanai/CMakeFiles/LLVMLanaiCodeGen.dir/LanaiInstrInfo.cpp.o lib/Target/Lanai/CMakeFiles/LLVMLanaiCodeGen.dir/LanaiISelDAGToDAG.cpp.o lib/Target/Lanai/CMakeFiles/LLVMLanaiCodeGen.dir/LanaiISelLowering.cpp.o lib/Target/Lanai/CMakeFiles/LLVMLanaiCodeGen.dir/LanaiMachineFunctionInfo.cpp.o lib/Target/Lanai/CMakeFiles/LLVMLanaiCodeGen.dir/LanaiMCInstLower.cpp.o lib/Target/Lanai/CMakeFiles/LLVMLanaiCodeGen.dir/LanaiMemAluCombiner.cpp.o lib/Target/Lanai/CMakeFiles/LLVMLanaiCodeGen.dir/LanaiRegisterInfo.cpp.o lib/Target/Lanai/CMakeFiles/LLVMLanaiCodeGen.dir/LanaiSelectionDAGInfo.cpp.o lib/Target/Lanai/CMakeFiles/LLVMLanaiCodeGen.dir/LanaiSubtarget.cpp.o lib/Target/Lanai/CMakeFiles/LLVMLanaiCodeGen.dir/LanaiTargetMachine.cpp.o lib/Target/Lanai/CMakeFiles/LLVMLanaiCodeGen.dir/LanaiTargetObjectFile.cpp.o && :
[2280/2349] /usr/local/bin/sccache /Users/buildslave/jenkins/workspace/clang-stage2-cmake-RgTSan/host-compiler/bin/clang++  -DBUILD_EXAMPLES -DGTEST_HAS_RTTI=0 -D__STDC_CONSTANT_MACROS -D__STDC_FORMAT_MACROS -D__STDC_LIMIT_MACROS -Ilib/Target/X86 -I/Users/buildslave/jenkins/workspace/clang-stage2-cmake-RgTSan/llvm-project/llvm/lib/Target/X86 -Iinclude -I/Users/buildslave/jenkins/workspace/clang-stage2-cmake-RgTSan/llvm-project/llvm/include -fPIC -fvisibility-inlines-hidden -Werror=date-time -Werror=unguarded-availability-new -Wall -Wextra -Wno-unused-parameter -Wwrite-strings -Wcast-qual -Wmissing-field-initializers -pedantic -Wno-long-long -Wc++98-compat-extra-semi -Wimplicit-fallthrough -Wcovered-switch-default -Wno-noexcept-type -Wnon-virtual-dtor -Wdelete-non-virtual-dtor -Wstring-conversion -fno-omit-frame-pointer -fsanitize=thread -fdiagnostics-color -flto=thin -O2 -g -DNDEBUG -isysroot /Applications/Xcode.app/Contents/Developer/Platforms/MacOSX.platform/Developer/SDKs/MacOSX10.15.sdk    -fno-exceptions -fno-rtti -std=c++14 -MD -MT lib/Target/X86/CMakeFiles/LLVMX86CodeGen.dir/X86InterleavedAccess.cpp.o -MF lib/Target/X86/CMakeFiles/LLVMX86CodeGen.dir/X86InterleavedAccess.cpp.o.d -o lib/Target/X86/CMakeFiles/LLVMX86CodeGen.dir/X86InterleavedAccess.cpp.o -c /Users/buildslave/jenkins/workspace/clang-stage2-cmake-RgTSan/llvm-project/llvm/lib/Target/X86/X86InterleavedAccess.cpp
[2281/2349] /usr/local/bin/sccache /Users/buildslave/jenkins/workspace/clang-stage2-cmake-RgTSan/host-compiler/bin/clang++  -DBUILD_EXAMPLES -DGTEST_HAS_RTTI=0 -D__STDC_CONSTANT_MACROS -D__STDC_FORMAT_MACROS -D__STDC_LIMIT_MACROS -Ilib/Target/X86 -I/Users/buildslave/jenkins/workspace/clang-stage2-cmake-RgTSan/llvm-project/llvm/lib/Target/X86 -Iinclude -I/Users/buildslave/jenkins/workspace/clang-stage2-cmake-RgTSan/llvm-project/llvm/include -fPIC -fvisibility-inlines-hidden -Werror=date-time -Werror=unguarded-availability-new -Wall -Wextra -Wno-unused-parameter -Wwrite-strings -Wcast-qual -Wmissing-field-initializers -pedantic -Wno-long-long -Wc++98-compat-extra-semi -Wimplicit-fallthrough -Wcovered-switch-default -Wno-noexcept-type -Wnon-virtual-dtor -Wdelete-non-virtual-dtor -Wstring-conversion -fno-omit-frame-pointer -fsanitize=thread -fdiagnostics-color -flto=thin -O2 -g -DNDEBUG -isysroot /Applications/Xcode.app/Contents/Developer/Platforms/MacOSX.platform/Developer/SDKs/MacOSX10.15.sdk    -fno-exceptions -fno-rtti -std=c++14 -MD -MT lib/Target/X86/CMakeFiles/LLVMX86CodeGen.dir/X86InstrFMA3Info.cpp.o -MF lib/Target/X86/CMakeFiles/LLVMX86CodeGen.dir/X86InstrFMA3Info.cpp.o.d -o lib/Target/X86/CMakeFiles/LLVMX86CodeGen.dir/X86InstrFMA3Info.cpp.o -c /Users/buildslave/jenkins/workspace/clang-stage2-cmake-RgTSan/llvm-project/llvm/lib/Target/X86/X86InstrFMA3Info.cpp
[2282/2349] /usr/local/bin/sccache /Users/buildslave/jenkins/workspace/clang-stage2-cmake-RgTSan/host-compiler/bin/clang++  -DBUILD_EXAMPLES -DGTEST_HAS_RTTI=0 -D__STDC_CONSTANT_MACROS -D__STDC_FORMAT_MACROS -D__STDC_LIMIT_MACROS -Ilib/Target/X86 -I/Users/buildslave/jenkins/workspace/clang-stage2-cmake-RgTSan/llvm-project/llvm/lib/Target/X86 -Iinclude -I/Users/buildslave/jenkins/workspace/clang-stage2-cmake-RgTSan/llvm-project/llvm/include -fPIC -fvisibility-inlines-hidden -Werror=date-time -Werror=unguarded-availability-new -Wall -Wextra -Wno-unused-parameter -Wwrite-strings -Wcast-qual -Wmissing-field-initializers -pedantic -Wno-long-long -Wc++98-compat-extra-semi -Wimplicit-fallthrough -Wcovered-switch-default -Wno-noexcept-type -Wnon-virtual-dtor -Wdelete-non-virtual-dtor -Wstring-conversion -fno-omit-frame-pointer -fsanitize=thread -fdiagnostics-color -flto=thin -O2 -g -DNDEBUG -isysroot /Applications/Xcode.app/Contents/Developer/Platforms/MacOSX.platform/Developer/SDKs/MacOSX10.15.sdk    -fno-exceptions -fno-rtti -std=c++14 -MD -MT lib/Target/X86/CMakeFiles/LLVMX86CodeGen.dir/X86InstrFoldTables.cpp.o -MF lib/Target/X86/CMakeFiles/LLVMX86CodeGen.dir/X86InstrFoldTables.cpp.o.d -o lib/Target/X86/CMakeFiles/LLVMX86CodeGen.dir/X86InstrFoldTables.cpp.o -c /Users/buildslave/jenkins/workspace/clang-stage2-cmake-RgTSan/llvm-project/llvm/lib/Target/X86/X86InstrFoldTables.cpp
[2283/2349] /usr/local/bin/sccache /Users/buildslave/jenkins/workspace/clang-stage2-cmake-RgTSan/host-compiler/bin/clang++  -DBUILD_EXAMPLES -DGTEST_HAS_RTTI=0 -D__STDC_CONSTANT_MACROS -D__STDC_FORMAT_MACROS -D__STDC_LIMIT_MACROS -Ilib/Target/X86 -I/Users/buildslave/jenkins/workspace/clang-stage2-cmake-RgTSan/llvm-project/llvm/lib/Target/X86 -Iinclude -I/Users/buildslave/jenkins/workspace/clang-stage2-cmake-RgTSan/llvm-project/llvm/include -fPIC -fvisibility-inlines-hidden -Werror=date-time -Werror=unguarded-availability-new -Wall -Wextra -Wno-unused-parameter -Wwrite-strings -Wcast-qual -Wmissing-field-initializers -pedantic -Wno-long-long -Wc++98-compat-extra-semi -Wimplicit-fallthrough -Wcovered-switch-default -Wno-noexcept-type -Wnon-virtual-dtor -Wdelete-non-virtual-dtor -Wstring-conversion -fno-omit-frame-pointer -fsanitize=thread -fdiagnostics-color -flto=thin -O2 -g -DNDEBUG -isysroot /Applications/Xcode.app/Contents/Developer/Platforms/MacOSX.platform/Developer/SDKs/MacOSX10.15.sdk    -fno-exceptions -fno-rtti -std=c++14 -MD -MT lib/Target/X86/CMakeFiles/LLVMX86CodeGen.dir/X86InsertPrefetch.cpp.o -MF lib/Target/X86/CMakeFiles/LLVMX86CodeGen.dir/X86InsertPrefetch.cpp.o.d -o lib/Target/X86/CMakeFiles/LLVMX86CodeGen.dir/X86InsertPrefetch.cpp.o -c /Users/buildslave/jenkins/workspace/clang-stage2-cmake-RgTSan/llvm-project/llvm/lib/Target/X86/X86InsertPrefetch.cpp
[2284/2349] /usr/local/bin/sccache /Users/buildslave/jenkins/workspace/clang-stage2-cmake-RgTSan/host-compiler/bin/clang++  -DBUILD_EXAMPLES -DGTEST_HAS_RTTI=0 -D__STDC_CONSTANT_MACROS -D__STDC_FORMAT_MACROS -D__STDC_LIMIT_MACROS -Ilib/Target/X86 -I/Users/buildslave/jenkins/workspace/clang-stage2-cmake-RgTSan/llvm-project/llvm/lib/Target/X86 -Iinclude -I/Users/buildslave/jenkins/workspace/clang-stage2-cmake-RgTSan/llvm-project/llvm/include -fPIC -fvisibility-inlines-hidden -Werror=date-time -Werror=unguarded-availability-new -Wall -Wextra -Wno-unused-parameter -Wwrite-strings -Wcast-qual -Wmissing-field-initializers -pedantic -Wno-long-long -Wc++98-compat-extra-semi -Wimplicit-fallthrough -Wcovered-switch-default -Wno-noexcept-type -Wnon-virtual-dtor -Wdelete-non-virtual-dtor -Wstring-conversion -fno-omit-frame-pointer -fsanitize=thread -fdiagnostics-color -flto=thin -O2 -g -DNDEBUG -isysroot /Applications/Xcode.app/Contents/Developer/Platforms/MacOSX.platform/Developer/SDKs/MacOSX10.15.sdk    -fno-exceptions -fno-rtti -std=c++14 -MD -MT lib/Target/X86/CMakeFiles/LLVMX86CodeGen.dir/X86InstCombineIntrinsic.cpp.o -MF lib/Target/X86/CMakeFiles/LLVMX86CodeGen.dir/X86InstCombineIntrinsic.cpp.o.d -o lib/Target/X86/CMakeFiles/LLVMX86CodeGen.dir/X86InstCombineIntrinsic.cpp.o -c /Users/buildslave/jenkins/workspace/clang-stage2-cmake-RgTSan/llvm-project/llvm/lib/Target/X86/X86InstCombineIntrinsic.cpp
[2285/2349] : && DYLD_LIBRARY_PATH=/Users/buildslave/jenkins/workspace/clang-stage2-cmake-RgTSan/host-compiler/lib/ "/Applications/Xcode.app/Contents/Developer/Toolchains/XcodeDefault.xctoolchain/usr/bin/libtool" -static -no_warning_for_no_symbols -o lib/libLLVMHexagonCodeGen.a  lib/Target/Hexagon/CMakeFiles/LLVMHexagonCodeGen.dir/BitTracker.cpp.o lib/Target/Hexagon/CMakeFiles/LLVMHexagonCodeGen.dir/HexagonAsmPrinter.cpp.o lib/Target/Hexagon/CMakeFiles/LLVMHexagonCodeGen.dir/HexagonBitSimplify.cpp.o lib/Target/Hexagon/CMakeFiles/LLVMHexagonCodeGen.dir/HexagonBitTracker.cpp.o lib/Target/Hexagon/CMakeFiles/LLVMHexagonCodeGen.dir/HexagonBlockRanges.cpp.o lib/Target/Hexagon/CMakeFiles/LLVMHexagonCodeGen.dir/HexagonBranchRelaxation.cpp.o lib/Target/Hexagon/CMakeFiles/LLVMHexagonCodeGen.dir/HexagonCFGOptimizer.cpp.o lib/Target/Hexagon/CMakeFiles/LLVMHexagonCodeGen.dir/HexagonCommonGEP.cpp.o lib/Target/Hexagon/CMakeFiles/LLVMHexagonCodeGen.dir/HexagonConstExtenders.cpp.o lib/Target/Hexagon/CMakeFiles/LLVMHexagonCodeGen.dir/HexagonConstPropagation.cpp.o lib/Target/Hexagon/CMakeFiles/LLVMHexagonCodeGen.dir/HexagonCopyToCombine.cpp.o lib/Target/Hexagon/CMakeFiles/LLVMHexagonCodeGen.dir/HexagonEarlyIfConv.cpp.o lib/Target/Hexagon/CMakeFiles/LLVMHexagonCodeGen.dir/HexagonExpandCondsets.cpp.o lib/Target/Hexagon/CMakeFiles/LLVMHexagonCodeGen.dir/HexagonFixupHwLoops.cpp.o lib/Target/Hexagon/CMakeFiles/LLVMHexagonCodeGen.dir/HexagonFrameLowering.cpp.o lib/Target/Hexagon/CMakeFiles/LLVMHexagonCodeGen.dir/HexagonGenExtract.cpp.o lib/Target/Hexagon/CMakeFiles/LLVMHexagonCodeGen.dir/HexagonGenInsert.cpp.o lib/Target/Hexagon/CMakeFiles/LLVMHexagonCodeGen.dir/HexagonGenMux.cpp.o lib/Target/Hexagon/CMakeFiles/LLVMHexagonCodeGen.dir/HexagonGenPredicate.cpp.o lib/Target/Hexagon/CMakeFiles/LLVMHexagonCodeGen.dir/HexagonHardwareLoops.cpp.o lib/Target/Hexagon/CMakeFiles/LLVMHexagonCodeGen.dir/HexagonHazardRecognizer.cpp.o lib/Target/Hexagon/CMakeFiles/LLVMHexagonCodeGen.dir/HexagonInstrInfo.cpp.o lib/Target/Hexagon/CMakeFiles/LLVMHexagonCodeGen.dir/HexagonISelDAGToDAG.cpp.o lib/Target/Hexagon/CMakeFiles/LLVMHexagonCodeGen.dir/HexagonISelDAGToDAGHVX.cpp.o lib/Target/Hexagon/CMakeFiles/LLVMHexagonCodeGen.dir/HexagonISelLowering.cpp.o lib/Target/Hexagon/CMakeFiles/LLVMHexagonCodeGen.dir/HexagonISelLoweringHVX.cpp.o lib/Target/Hexagon/CMakeFiles/LLVMHexagonCodeGen.dir/HexagonLoopIdiomRecognition.cpp.o lib/Target/Hexagon/CMakeFiles/LLVMHexagonCodeGen.dir/HexagonMachineFunctionInfo.cpp.o lib/Target/Hexagon/CMakeFiles/LLVMHexagonCodeGen.dir/HexagonMachineScheduler.cpp.o lib/Target/Hexagon/CMakeFiles/LLVMHexagonCodeGen.dir/HexagonMCInstLower.cpp.o lib/Target/Hexagon/CMakeFiles/LLVMHexagonCodeGen.dir/HexagonNewValueJump.cpp.o lib/Target/Hexagon/CMakeFiles/LLVMHexagonCodeGen.dir/HexagonOptAddrMode.cpp.o lib/Target/Hexagon/CMakeFiles/LLVMHexagonCodeGen.dir/HexagonOptimizeSZextends.cpp.o lib/Target/Hexagon/CMakeFiles/LLVMHexagonCodeGen.dir/HexagonPeephole.cpp.o lib/Target/Hexagon/CMakeFiles/LLVMHexagonCodeGen.dir/HexagonRDFOpt.cpp.o lib/Target/Hexagon/CMakeFiles/LLVMHexagonCodeGen.dir/HexagonRegisterInfo.cpp.o lib/Target/Hexagon/CMakeFiles/LLVMHexagonCodeGen.dir/HexagonSelectionDAGInfo.cpp.o lib/Target/Hexagon/CMakeFiles/LLVMHexagonCodeGen.dir/HexagonSplitConst32AndConst64.cpp.o lib/Target/Hexagon/CMakeFiles/LLVMHexagonCodeGen.dir/HexagonSplitDouble.cpp.o lib/Target/Hexagon/CMakeFiles/LLVMHexagonCodeGen.dir/HexagonStoreWidening.cpp.o lib/Target/Hexagon/CMakeFiles/LLVMHexagonCodeGen.dir/HexagonSubtarget.cpp.o lib/Target/Hexagon/CMakeFiles/LLVMHexagonCodeGen.dir/HexagonTargetMachine.cpp.o lib/Target/Hexagon/CMakeFiles/LLVMHexagonCodeGen.dir/HexagonTargetObjectFile.cpp.o lib/Target/Hexagon/CMakeFiles/LLVMHexagonCodeGen.dir/HexagonTargetTransformInfo.cpp.o lib/Target/Hexagon/CMakeFiles/LLVMHexagonCodeGen.dir/HexagonVectorCombine.cpp.o lib/Target/Hexagon/CMakeFiles/LLVMHexagonCodeGen.dir/HexagonVectorLoopCarriedReuse.cpp.o lib/Target/Hexagon/CMakeFiles/LLVMHexagonCodeGen.dir/HexagonVectorPrint.cpp.o lib/Target/Hexagon/CMakeFiles/LLVMHexagonCodeGen.dir/HexagonVExtract.cpp.o lib/Target/Hexagon/CMakeFiles/LLVMHexagonCodeGen.dir/HexagonVLIWPacketizer.cpp.o lib/Target/Hexagon/CMakeFiles/LLVMHexagonCodeGen.dir/RDFCopy.cpp.o lib/Target/Hexagon/CMakeFiles/LLVMHexagonCodeGen.dir/RDFDeadCode.cpp.o && :
[2286/2349] /usr/local/bin/sccache /Users/buildslave/jenkins/workspace/clang-stage2-cmake-RgTSan/host-compiler/bin/clang++  -DBUILD_EXAMPLES -DGTEST_HAS_RTTI=0 -D__STDC_CONSTANT_MACROS -D__STDC_FORMAT_MACROS -D__STDC_LIMIT_MACROS -Ilib/Target/X86 -I/Users/buildslave/jenkins/workspace/clang-stage2-cmake-RgTSan/llvm-project/llvm/lib/Target/X86 -Iinclude -I/Users/buildslave/jenkins/workspace/clang-stage2-cmake-RgTSan/llvm-project/llvm/include -fPIC -fvisibility-inlines-hidden -Werror=date-time -Werror=unguarded-availability-new -Wall -Wextra -Wno-unused-parameter -Wwrite-strings -Wcast-qual -Wmissing-field-initializers -pedantic -Wno-long-long -Wc++98-compat-extra-semi -Wimplicit-fallthrough -Wcovered-switch-default -Wno-noexcept-type -Wnon-virtual-dtor -Wdelete-non-virtual-dtor -Wstring-conversion -fno-omit-frame-pointer -fsanitize=thread -fdiagnostics-color -flto=thin -O2 -g -DNDEBUG -isysroot /Applications/Xcode.app/Contents/Developer/Platforms/MacOSX.platform/Developer/SDKs/MacOSX10.15.sdk    -fno-exceptions -fno-rtti -std=c++14 -MD -MT lib/Target/X86/CMakeFiles/LLVMX86CodeGen.dir/X86EvexToVex.cpp.o -MF lib/Target/X86/CMakeFiles/LLVMX86CodeGen.dir/X86EvexToVex.cpp.o.d -o lib/Target/X86/CMakeFiles/LLVMX86CodeGen.dir/X86EvexToVex.cpp.o -c /Users/buildslave/jenkins/workspace/clang-stage2-cmake-RgTSan/llvm-project/llvm/lib/Target/X86/X86EvexToVex.cpp
[2287/2349] : && DYLD_LIBRARY_PATH=/Users/buildslave/jenkins/workspace/clang-stage2-cmake-RgTSan/host-compiler/lib/ "/Applications/Xcode.app/Contents/Developer/Toolchains/XcodeDefault.xctoolchain/usr/bin/libtool" -static -no_warning_for_no_symbols -o lib/libLLVMMipsCodeGen.a  lib/Target/Mips/CMakeFiles/LLVMMipsCodeGen.dir/Mips16FrameLowering.cpp.o lib/Target/Mips/CMakeFiles/LLVMMipsCodeGen.dir/Mips16HardFloat.cpp.o lib/Target/Mips/CMakeFiles/LLVMMipsCodeGen.dir/Mips16HardFloatInfo.cpp.o lib/Target/Mips/CMakeFiles/LLVMMipsCodeGen.dir/Mips16InstrInfo.cpp.o lib/Target/Mips/CMakeFiles/LLVMMipsCodeGen.dir/Mips16ISelDAGToDAG.cpp.o lib/Target/Mips/CMakeFiles/LLVMMipsCodeGen.dir/Mips16ISelLowering.cpp.o lib/Target/Mips/CMakeFiles/LLVMMipsCodeGen.dir/Mips16RegisterInfo.cpp.o lib/Target/Mips/CMakeFiles/LLVMMipsCodeGen.dir/MipsAnalyzeImmediate.cpp.o lib/Target/Mips/CMakeFiles/LLVMMipsCodeGen.dir/MipsAsmPrinter.cpp.o lib/Target/Mips/CMakeFiles/LLVMMipsCodeGen.dir/MipsCallLowering.cpp.o lib/Target/Mips/CMakeFiles/LLVMMipsCodeGen.dir/MipsCCState.cpp.o lib/Target/Mips/CMakeFiles/LLVMMipsCodeGen.dir/MipsConstantIslandPass.cpp.o lib/Target/Mips/CMakeFiles/LLVMMipsCodeGen.dir/MipsDelaySlotFiller.cpp.o lib/Target/Mips/CMakeFiles/LLVMMipsCodeGen.dir/MipsExpandPseudo.cpp.o lib/Target/Mips/CMakeFiles/LLVMMipsCodeGen.dir/MipsFastISel.cpp.o lib/Target/Mips/CMakeFiles/LLVMMipsCodeGen.dir/MipsInstrInfo.cpp.o lib/Target/Mips/CMakeFiles/LLVMMipsCodeGen.dir/MipsInstructionSelector.cpp.o lib/Target/Mips/CMakeFiles/LLVMMipsCodeGen.dir/MipsISelDAGToDAG.cpp.o lib/Target/Mips/CMakeFiles/LLVMMipsCodeGen.dir/MipsISelLowering.cpp.o lib/Target/Mips/CMakeFiles/LLVMMipsCodeGen.dir/MipsFrameLowering.cpp.o lib/Target/Mips/CMakeFiles/LLVMMipsCodeGen.dir/MipsLegalizerInfo.cpp.o lib/Target/Mips/CMakeFiles/LLVMMipsCodeGen.dir/MipsBranchExpansion.cpp.o lib/Target/Mips/CMakeFiles/LLVMMipsCodeGen.dir/MipsMCInstLower.cpp.o lib/Target/Mips/CMakeFiles/LLVMMipsCodeGen.dir/MipsMachineFunction.cpp.o lib/Target/Mips/CMakeFiles/LLVMMipsCodeGen.dir/MipsModuleISelDAGToDAG.cpp.o lib/Target/Mips/CMakeFiles/LLVMMipsCodeGen.dir/MipsOptimizePICCall.cpp.o lib/Target/Mips/CMakeFiles/LLVMMipsCodeGen.dir/MipsOs16.cpp.o lib/Target/Mips/CMakeFiles/LLVMMipsCodeGen.dir/MipsPreLegalizerCombiner.cpp.o lib/Target/Mips/CMakeFiles/LLVMMipsCodeGen.dir/MipsRegisterBankInfo.cpp.o lib/Target/Mips/CMakeFiles/LLVMMipsCodeGen.dir/MipsRegisterInfo.cpp.o lib/Target/Mips/CMakeFiles/LLVMMipsCodeGen.dir/MipsSEFrameLowering.cpp.o lib/Target/Mips/CMakeFiles/LLVMMipsCodeGen.dir/MipsSEInstrInfo.cpp.o lib/Target/Mips/CMakeFiles/LLVMMipsCodeGen.dir/MipsSEISelDAGToDAG.cpp.o lib/Target/Mips/CMakeFiles/LLVMMipsCodeGen.dir/MipsSEISelLowering.cpp.o lib/Target/Mips/CMakeFiles/LLVMMipsCodeGen.dir/MipsSERegisterInfo.cpp.o lib/Target/Mips/CMakeFiles/LLVMMipsCodeGen.dir/MipsSubtarget.cpp.o lib/Target/Mips/CMakeFiles/LLVMMipsCodeGen.dir/MipsTargetMachine.cpp.o lib/Target/Mips/CMakeFiles/LLVMMipsCodeGen.dir/MipsTargetObjectFile.cpp.o lib/Target/Mips/CMakeFiles/LLVMMipsCodeGen.dir/MicroMipsSizeReduction.cpp.o && :
[2288/2349] : && DYLD_LIBRARY_PATH=/Users/buildslave/jenkins/workspace/clang-stage2-cmake-RgTSan/host-compiler/lib/ "/Applications/Xcode.app/Contents/Developer/Toolchains/XcodeDefault.xctoolchain/usr/bin/libtool" -static -no_warning_for_no_symbols -o lib/libLLVMMSP430CodeGen.a  lib/Target/MSP430/CMakeFiles/LLVMMSP430CodeGen.dir/MSP430BranchSelector.cpp.o lib/Target/MSP430/CMakeFiles/LLVMMSP430CodeGen.dir/MSP430ISelDAGToDAG.cpp.o lib/Target/MSP430/CMakeFiles/LLVMMSP430CodeGen.dir/MSP430ISelLowering.cpp.o lib/Target/MSP430/CMakeFiles/LLVMMSP430CodeGen.dir/MSP430InstrInfo.cpp.o lib/Target/MSP430/CMakeFiles/LLVMMSP430CodeGen.dir/MSP430FrameLowering.cpp.o lib/Target/MSP430/CMakeFiles/LLVMMSP430CodeGen.dir/MSP430MachineFunctionInfo.cpp.o lib/Target/MSP430/CMakeFiles/LLVMMSP430CodeGen.dir/MSP430RegisterInfo.cpp.o lib/Target/MSP430/CMakeFiles/LLVMMSP430CodeGen.dir/MSP430Subtarget.cpp.o lib/Target/MSP430/CMakeFiles/LLVMMSP430CodeGen.dir/MSP430TargetMachine.cpp.o lib/Target/MSP430/CMakeFiles/LLVMMSP430CodeGen.dir/MSP430AsmPrinter.cpp.o lib/Target/MSP430/CMakeFiles/LLVMMSP430CodeGen.dir/MSP430MCInstLower.cpp.o && :
[2289/2349] /usr/local/bin/sccache /Users/buildslave/jenkins/workspace/clang-stage2-cmake-RgTSan/host-compiler/bin/clang++  -DBUILD_EXAMPLES -DGTEST_HAS_RTTI=0 -D__STDC_CONSTANT_MACROS -D__STDC_FORMAT_MACROS -D__STDC_LIMIT_MACROS -Ilib/Target/X86 -I/Users/buildslave/jenkins/workspace/clang-stage2-cmake-RgTSan/llvm-project/llvm/lib/Target/X86 -Iinclude -I/Users/buildslave/jenkins/workspace/clang-stage2-cmake-RgTSan/llvm-project/llvm/include -fPIC -fvisibility-inlines-hidden -Werror=date-time -Werror=unguarded-availability-new -Wall -Wextra -Wno-unused-parameter -Wwrite-strings -Wcast-qual -Wmissing-field-initializers -pedantic -Wno-long-long -Wc++98-compat-extra-semi -Wimplicit-fallthrough -Wcovered-switch-default -Wno-noexcept-type -Wnon-virtual-dtor -Wdelete-non-virtual-dtor -Wstring-conversion -fno-omit-frame-pointer -fsanitize=thread -fdiagnostics-color -flto=thin -O2 -g -DNDEBUG -isysroot /Applications/Xcode.app/Contents/Developer/Platforms/MacOSX.platform/Developer/SDKs/MacOSX10.15.sdk    -fno-exceptions -fno-rtti -std=c++14 -MD -MT lib/Target/X86/CMakeFiles/LLVMX86CodeGen.dir/X86ISelDAGToDAG.cpp.o -MF lib/Target/X86/CMakeFiles/LLVMX86CodeGen.dir/X86ISelDAGToDAG.cpp.o.d -o lib/Target/X86/CMakeFiles/LLVMX86CodeGen.dir/X86ISelDAGToDAG.cpp.o -c /Users/buildslave/jenkins/workspace/clang-stage2-cmake-RgTSan/llvm-project/llvm/lib/Target/X86/X86ISelDAGToDAG.cpp
[2290/2349] : && DYLD_LIBRARY_PATH=/Users/buildslave/jenkins/workspace/clang-stage2-cmake-RgTSan/host-compiler/lib/ "/Applications/Xcode.app/Contents/Developer/Toolchains/XcodeDefault.xctoolchain/usr/bin/libtool" -static -no_warning_for_no_symbols -o lib/libLLVMNVPTXCodeGen.a  lib/Target/NVPTX/CMakeFiles/LLVMNVPTXCodeGen.dir/NVPTXAllocaHoisting.cpp.o lib/Target/NVPTX/CMakeFiles/LLVMNVPTXCodeGen.dir/NVPTXAtomicLower.cpp.o lib/Target/NVPTX/CMakeFiles/LLVMNVPTXCodeGen.dir/NVPTXAsmPrinter.cpp.o lib/Target/NVPTX/CMakeFiles/LLVMNVPTXCodeGen.dir/NVPTXAssignValidGlobalNames.cpp.o lib/Target/NVPTX/CMakeFiles/LLVMNVPTXCodeGen.dir/NVPTXFrameLowering.cpp.o lib/Target/NVPTX/CMakeFiles/LLVMNVPTXCodeGen.dir/NVPTXGenericToNVVM.cpp.o lib/Target/NVPTX/CMakeFiles/LLVMNVPTXCodeGen.dir/NVPTXISelDAGToDAG.cpp.o lib/Target/NVPTX/CMakeFiles/LLVMNVPTXCodeGen.dir/NVPTXISelLowering.cpp.o lib/Target/NVPTX/CMakeFiles/LLVMNVPTXCodeGen.dir/NVPTXImageOptimizer.cpp.o lib/Target/NVPTX/CMakeFiles/LLVMNVPTXCodeGen.dir/NVPTXInstrInfo.cpp.o lib/Target/NVPTX/CMakeFiles/LLVMNVPTXCodeGen.dir/NVPTXLowerAggrCopies.cpp.o lib/Target/NVPTX/CMakeFiles/LLVMNVPTXCodeGen.dir/NVPTXLowerArgs.cpp.o lib/Target/NVPTX/CMakeFiles/LLVMNVPTXCodeGen.dir/NVPTXLowerAlloca.cpp.o lib/Target/NVPTX/CMakeFiles/LLVMNVPTXCodeGen.dir/NVPTXPeephole.cpp.o lib/Target/NVPTX/CMakeFiles/LLVMNVPTXCodeGen.dir/NVPTXMCExpr.cpp.o lib/Target/NVPTX/CMakeFiles/LLVMNVPTXCodeGen.dir/NVPTXPrologEpilogPass.cpp.o lib/Target/NVPTX/CMakeFiles/LLVMNVPTXCodeGen.dir/NVPTXRegisterInfo.cpp.o lib/Target/NVPTX/CMakeFiles/LLVMNVPTXCodeGen.dir/NVPTXReplaceImageHandles.cpp.o lib/Target/NVPTX/CMakeFiles/LLVMNVPTXCodeGen.dir/NVPTXSubtarget.cpp.o lib/Target/NVPTX/CMakeFiles/LLVMNVPTXCodeGen.dir/NVPTXTargetMachine.cpp.o lib/Target/NVPTX/CMakeFiles/LLVMNVPTXCodeGen.dir/NVPTXTargetTransformInfo.cpp.o lib/Target/NVPTX/CMakeFiles/LLVMNVPTXCodeGen.dir/NVPTXUtilities.cpp.o lib/Target/NVPTX/CMakeFiles/LLVMNVPTXCodeGen.dir/NVVMIntrRange.cpp.o lib/Target/NVPTX/CMakeFiles/LLVMNVPTXCodeGen.dir/NVVMReflect.cpp.o lib/Target/NVPTX/CMakeFiles/LLVMNVPTXCodeGen.dir/NVPTXProxyRegErasure.cpp.o && :
[2291/2349] /usr/local/bin/sccache /Users/buildslave/jenkins/workspace/clang-stage2-cmake-RgTSan/host-compiler/bin/clang++  -DBUILD_EXAMPLES -DGTEST_HAS_RTTI=0 -D__STDC_CONSTANT_MACROS -D__STDC_FORMAT_MACROS -D__STDC_LIMIT_MACROS -Ilib/Target/X86 -I/Users/buildslave/jenkins/workspace/clang-stage2-cmake-RgTSan/llvm-project/llvm/lib/Target/X86 -Iinclude -I/Users/buildslave/jenkins/workspace/clang-stage2-cmake-RgTSan/llvm-project/llvm/include -fPIC -fvisibility-inlines-hidden -Werror=date-time -Werror=unguarded-availability-new -Wall -Wextra -Wno-unused-parameter -Wwrite-strings -Wcast-qual -Wmissing-field-initializers -pedantic -Wno-long-long -Wc++98-compat-extra-semi -Wimplicit-fallthrough -Wcovered-switch-default -Wno-noexcept-type -Wnon-virtual-dtor -Wdelete-non-virtual-dtor -Wstring-conversion -fno-omit-frame-pointer -fsanitize=thread -fdiagnostics-color -flto=thin -O2 -g -DNDEBUG -isysroot /Applications/Xcode.app/Contents/Developer/Platforms/MacOSX.platform/Developer/SDKs/MacOSX10.15.sdk    -fno-exceptions -fno-rtti -std=c++14 -MD -MT lib/Target/X86/CMakeFiles/LLVMX86CodeGen.dir/X86MachineFunctionInfo.cpp.o -MF lib/Target/X86/CMakeFiles/LLVMX86CodeGen.dir/X86MachineFunctionInfo.cpp.o.d -o lib/Target/X86/CMakeFiles/LLVMX86CodeGen.dir/X86MachineFunctionInfo.cpp.o -c /Users/buildslave/jenkins/workspace/clang-stage2-cmake-RgTSan/llvm-project/llvm/lib/Target/X86/X86MachineFunctionInfo.cpp
[2292/2349] /usr/local/bin/sccache /Users/buildslave/jenkins/workspace/clang-stage2-cmake-RgTSan/host-compiler/bin/clang++  -DBUILD_EXAMPLES -DGTEST_HAS_RTTI=0 -D__STDC_CONSTANT_MACROS -D__STDC_FORMAT_MACROS -D__STDC_LIMIT_MACROS -Ilib/Target/X86 -I/Users/buildslave/jenkins/workspace/clang-stage2-cmake-RgTSan/llvm-project/llvm/lib/Target/X86 -Iinclude -I/Users/buildslave/jenkins/workspace/clang-stage2-cmake-RgTSan/llvm-project/llvm/include -fPIC -fvisibility-inlines-hidden -Werror=date-time -Werror=unguarded-availability-new -Wall -Wextra -Wno-unused-parameter -Wwrite-strings -Wcast-qual -Wmissing-field-initializers -pedantic -Wno-long-long -Wc++98-compat-extra-semi -Wimplicit-fallthrough -Wcovered-switch-default -Wno-noexcept-type -Wnon-virtual-dtor -Wdelete-non-virtual-dtor -Wstring-conversion -fno-omit-frame-pointer -fsanitize=thread -fdiagnostics-color -flto=thin -O2 -g -DNDEBUG -isysroot /Applications/Xcode.app/Contents/Developer/Platforms/MacOSX.platform/Developer/SDKs/MacOSX10.15.sdk    -fno-exceptions -fno-rtti -std=c++14 -MD -MT lib/Target/X86/CMakeFiles/LLVMX86CodeGen.dir/X86LegalizerInfo.cpp.o -MF lib/Target/X86/CMakeFiles/LLVMX86CodeGen.dir/X86LegalizerInfo.cpp.o.d -o lib/Target/X86/CMakeFiles/LLVMX86CodeGen.dir/X86LegalizerInfo.cpp.o -c /Users/buildslave/jenkins/workspace/clang-stage2-cmake-RgTSan/llvm-project/llvm/lib/Target/X86/X86LegalizerInfo.cpp
[2293/2349] /usr/local/bin/sccache /Users/buildslave/jenkins/workspace/clang-stage2-cmake-RgTSan/host-compiler/bin/clang++  -DBUILD_EXAMPLES -DGTEST_HAS_RTTI=0 -D__STDC_CONSTANT_MACROS -D__STDC_FORMAT_MACROS -D__STDC_LIMIT_MACROS -Ilib/Target/X86 -I/Users/buildslave/jenkins/workspace/clang-stage2-cmake-RgTSan/llvm-project/llvm/lib/Target/X86 -Iinclude -I/Users/buildslave/jenkins/workspace/clang-stage2-cmake-RgTSan/llvm-project/llvm/include -fPIC -fvisibility-inlines-hidden -Werror=date-time -Werror=unguarded-availability-new -Wall -Wextra -Wno-unused-parameter -Wwrite-strings -Wcast-qual -Wmissing-field-initializers -pedantic -Wno-long-long -Wc++98-compat-extra-semi -Wimplicit-fallthrough -Wcovered-switch-default -Wno-noexcept-type -Wnon-virtual-dtor -Wdelete-non-virtual-dtor -Wstring-conversion -fno-omit-frame-pointer -fsanitize=thread -fdiagnostics-color -flto=thin -O2 -g -DNDEBUG -isysroot /Applications/Xcode.app/Contents/Developer/Platforms/MacOSX.platform/Developer/SDKs/MacOSX10.15.sdk    -fno-exceptions -fno-rtti -std=c++14 -MD -MT lib/Target/X86/CMakeFiles/LLVMX86CodeGen.dir/X86LoadValueInjectionRetHardening.cpp.o -MF lib/Target/X86/CMakeFiles/LLVMX86CodeGen.dir/X86LoadValueInjectionRetHardening.cpp.o.d -o lib/Target/X86/CMakeFiles/LLVMX86CodeGen.dir/X86LoadValueInjectionRetHardening.cpp.o -c /Users/buildslave/jenkins/workspace/clang-stage2-cmake-RgTSan/llvm-project/llvm/lib/Target/X86/X86LoadValueInjectionRetHardening.cpp
[2294/2349] : && DYLD_LIBRARY_PATH=/Users/buildslave/jenkins/workspace/clang-stage2-cmake-RgTSan/host-compiler/lib/ "/Applications/Xcode.app/Contents/Developer/Toolchains/XcodeDefault.xctoolchain/usr/bin/libtool" -static -no_warning_for_no_symbols -o lib/libLLVMRISCVCodeGen.a  lib/Target/RISCV/CMakeFiles/LLVMRISCVCodeGen.dir/RISCVAsmPrinter.cpp.o lib/Target/RISCV/CMakeFiles/LLVMRISCVCodeGen.dir/RISCVCallLowering.cpp.o lib/Target/RISCV/CMakeFiles/LLVMRISCVCodeGen.dir/RISCVExpandAtomicPseudoInsts.cpp.o lib/Target/RISCV/CMakeFiles/LLVMRISCVCodeGen.dir/RISCVExpandPseudoInsts.cpp.o lib/Target/RISCV/CMakeFiles/LLVMRISCVCodeGen.dir/RISCVFrameLowering.cpp.o lib/Target/RISCV/CMakeFiles/LLVMRISCVCodeGen.dir/RISCVInsertVSETVLI.cpp.o lib/Target/RISCV/CMakeFiles/LLVMRISCVCodeGen.dir/RISCVInstrInfo.cpp.o lib/Target/RISCV/CMakeFiles/LLVMRISCVCodeGen.dir/RISCVInstructionSelector.cpp.o lib/Target/RISCV/CMakeFiles/LLVMRISCVCodeGen.dir/RISCVISelDAGToDAG.cpp.o lib/Target/RISCV/CMakeFiles/LLVMRISCVCodeGen.dir/RISCVISelLowering.cpp.o lib/Target/RISCV/CMakeFiles/LLVMRISCVCodeGen.dir/RISCVLegalizerInfo.cpp.o lib/Target/RISCV/CMakeFiles/LLVMRISCVCodeGen.dir/RISCVMCInstLower.cpp.o lib/Target/RISCV/CMakeFiles/LLVMRISCVCodeGen.dir/RISCVMergeBaseOffset.cpp.o lib/Target/RISCV/CMakeFiles/LLVMRISCVCodeGen.dir/RISCVRegisterBankInfo.cpp.o lib/Target/RISCV/CMakeFiles/LLVMRISCVCodeGen.dir/RISCVRegisterInfo.cpp.o lib/Target/RISCV/CMakeFiles/LLVMRISCVCodeGen.dir/RISCVSubtarget.cpp.o lib/Target/RISCV/CMakeFiles/LLVMRISCVCodeGen.dir/RISCVTargetMachine.cpp.o lib/Target/RISCV/CMakeFiles/LLVMRISCVCodeGen.dir/RISCVTargetObjectFile.cpp.o lib/Target/RISCV/CMakeFiles/LLVMRISCVCodeGen.dir/RISCVTargetTransformInfo.cpp.o && :
[2295/2349] /usr/local/bin/sccache /Users/buildslave/jenkins/workspace/clang-stage2-cmake-RgTSan/host-compiler/bin/clang++  -DBUILD_EXAMPLES -DGTEST_HAS_RTTI=0 -D__STDC_CONSTANT_MACROS -D__STDC_FORMAT_MACROS -D__STDC_LIMIT_MACROS -Ilib/Target/X86 -I/Users/buildslave/jenkins/workspace/clang-stage2-cmake-RgTSan/llvm-project/llvm/lib/Target/X86 -Iinclude -I/Users/buildslave/jenkins/workspace/clang-stage2-cmake-RgTSan/llvm-project/llvm/include -fPIC -fvisibility-inlines-hidden -Werror=date-time -Werror=unguarded-availability-new -Wall -Wextra -Wno-unused-parameter -Wwrite-strings -Wcast-qual -Wmissing-field-initializers -pedantic -Wno-long-long -Wc++98-compat-extra-semi -Wimplicit-fallthrough -Wcovered-switch-default -Wno-noexcept-type -Wnon-virtual-dtor -Wdelete-non-virtual-dtor -Wstring-conversion -fno-omit-frame-pointer -fsanitize=thread -fdiagnostics-color -flto=thin -O2 -g -DNDEBUG -isysroot /Applications/Xcode.app/Contents/Developer/Platforms/MacOSX.platform/Developer/SDKs/MacOSX10.15.sdk    -fno-exceptions -fno-rtti -std=c++14 -MD -MT lib/Target/X86/CMakeFiles/LLVMX86CodeGen.dir/X86InstrInfo.cpp.o -MF lib/Target/X86/CMakeFiles/LLVMX86CodeGen.dir/X86InstrInfo.cpp.o.d -o lib/Target/X86/CMakeFiles/LLVMX86CodeGen.dir/X86InstrInfo.cpp.o -c /Users/buildslave/jenkins/workspace/clang-stage2-cmake-RgTSan/llvm-project/llvm/lib/Target/X86/X86InstrInfo.cpp
[2296/2349] : && DYLD_LIBRARY_PATH=/Users/buildslave/jenkins/workspace/clang-stage2-cmake-RgTSan/host-compiler/lib/ "/Applications/Xcode.app/Contents/Developer/Toolchains/XcodeDefault.xctoolchain/usr/bin/libtool" -static -no_warning_for_no_symbols -o lib/libLLVMSparcCodeGen.a  lib/Target/Sparc/CMakeFiles/LLVMSparcCodeGen.dir/DelaySlotFiller.cpp.o lib/Target/Sparc/CMakeFiles/LLVMSparcCodeGen.dir/LeonPasses.cpp.o lib/Target/Sparc/CMakeFiles/LLVMSparcCodeGen.dir/SparcAsmPrinter.cpp.o lib/Target/Sparc/CMakeFiles/LLVMSparcCodeGen.dir/SparcInstrInfo.cpp.o lib/Target/Sparc/CMakeFiles/LLVMSparcCodeGen.dir/SparcISelDAGToDAG.cpp.o lib/Target/Sparc/CMakeFiles/LLVMSparcCodeGen.dir/SparcISelLowering.cpp.o lib/Target/Sparc/CMakeFiles/LLVMSparcCodeGen.dir/SparcFrameLowering.cpp.o lib/Target/Sparc/CMakeFiles/LLVMSparcCodeGen.dir/SparcMachineFunctionInfo.cpp.o lib/Target/Sparc/CMakeFiles/LLVMSparcCodeGen.dir/SparcRegisterInfo.cpp.o lib/Target/Sparc/CMakeFiles/LLVMSparcCodeGen.dir/SparcSubtarget.cpp.o lib/Target/Sparc/CMakeFiles/LLVMSparcCodeGen.dir/SparcTargetMachine.cpp.o lib/Target/Sparc/CMakeFiles/LLVMSparcCodeGen.dir/SparcMCInstLower.cpp.o lib/Target/Sparc/CMakeFiles/LLVMSparcCodeGen.dir/SparcTargetObjectFile.cpp.o && :
[2297/2349] /usr/local/bin/sccache /Users/buildslave/jenkins/workspace/clang-stage2-cmake-RgTSan/host-compiler/bin/clang++  -DBUILD_EXAMPLES -DGTEST_HAS_RTTI=0 -D__STDC_CONSTANT_MACROS -D__STDC_FORMAT_MACROS -D__STDC_LIMIT_MACROS -Ilib/Target/X86 -I/Users/buildslave/jenkins/workspace/clang-stage2-cmake-RgTSan/llvm-project/llvm/lib/Target/X86 -Iinclude -I/Users/buildslave/jenkins/workspace/clang-stage2-cmake-RgTSan/llvm-project/llvm/include -fPIC -fvisibility-inlines-hidden -Werror=date-time -Werror=unguarded-availability-new -Wall -Wextra -Wno-unused-parameter -Wwrite-strings -Wcast-qual -Wmissing-field-initializers -pedantic -Wno-long-long -Wc++98-compat-extra-semi -Wimplicit-fallthrough -Wcovered-switch-default -Wno-noexcept-type -Wnon-virtual-dtor -Wdelete-non-virtual-dtor -Wstring-conversion -fno-omit-frame-pointer -fsanitize=thread -fdiagnostics-color -flto=thin -O2 -g -DNDEBUG -isysroot /Applications/Xcode.app/Contents/Developer/Platforms/MacOSX.platform/Developer/SDKs/MacOSX10.15.sdk    -fno-exceptions -fno-rtti -std=c++14 -MD -MT lib/Target/X86/CMakeFiles/LLVMX86CodeGen.dir/X86MacroFusion.cpp.o -MF lib/Target/X86/CMakeFiles/LLVMX86CodeGen.dir/X86MacroFusion.cpp.o.d -o lib/Target/X86/CMakeFiles/LLVMX86CodeGen.dir/X86MacroFusion.cpp.o -c /Users/buildslave/jenkins/workspace/clang-stage2-cmake-RgTSan/llvm-project/llvm/lib/Target/X86/X86MacroFusion.cpp
[2298/2349] : && DYLD_LIBRARY_PATH=/Users/buildslave/jenkins/workspace/clang-stage2-cmake-RgTSan/host-compiler/lib/ "/Applications/Xcode.app/Contents/Developer/Toolchains/XcodeDefault.xctoolchain/usr/bin/libtool" -static -no_warning_for_no_symbols -o lib/libLLVMPowerPCCodeGen.a  lib/Target/PowerPC/CMakeFiles/LLVMPowerPCCodeGen.dir/GISel/PPCInstructionSelector.cpp.o lib/Target/PowerPC/CMakeFiles/LLVMPowerPCCodeGen.dir/PPCBoolRetToInt.cpp.o lib/Target/PowerPC/CMakeFiles/LLVMPowerPCCodeGen.dir/PPCAsmPrinter.cpp.o lib/Target/PowerPC/CMakeFiles/LLVMPowerPCCodeGen.dir/PPCBranchSelector.cpp.o lib/Target/PowerPC/CMakeFiles/LLVMPowerPCCodeGen.dir/PPCBranchCoalescing.cpp.o lib/Target/PowerPC/CMakeFiles/LLVMPowerPCCodeGen.dir/PPCCallingConv.cpp.o lib/Target/PowerPC/CMakeFiles/LLVMPowerPCCodeGen.dir/PPCCCState.cpp.o lib/Target/PowerPC/CMakeFiles/LLVMPowerPCCodeGen.dir/PPCCTRLoops.cpp.o lib/Target/PowerPC/CMakeFiles/LLVMPowerPCCodeGen.dir/PPCExpandAtomicPseudoInsts.cpp.o lib/Target/PowerPC/CMakeFiles/LLVMPowerPCCodeGen.dir/PPCHazardRecognizers.cpp.o lib/Target/PowerPC/CMakeFiles/LLVMPowerPCCodeGen.dir/PPCInstrInfo.cpp.o lib/Target/PowerPC/CMakeFiles/LLVMPowerPCCodeGen.dir/PPCISelDAGToDAG.cpp.o lib/Target/PowerPC/CMakeFiles/LLVMPowerPCCodeGen.dir/PPCISelLowering.cpp.o lib/Target/PowerPC/CMakeFiles/LLVMPowerPCCodeGen.dir/PPCEarlyReturn.cpp.o lib/Target/PowerPC/CMakeFiles/LLVMPowerPCCodeGen.dir/PPCFastISel.cpp.o lib/Target/PowerPC/CMakeFiles/LLVMPowerPCCodeGen.dir/PPCFrameLowering.cpp.o lib/Target/PowerPC/CMakeFiles/LLVMPowerPCCodeGen.dir/PPCLoopInstrFormPrep.cpp.o lib/Target/PowerPC/CMakeFiles/LLVMPowerPCCodeGen.dir/PPCMCInstLower.cpp.o lib/Target/PowerPC/CMakeFiles/LLVMPowerPCCodeGen.dir/PPCMachineFunctionInfo.cpp.o lib/Target/PowerPC/CMakeFiles/LLVMPowerPCCodeGen.dir/PPCMachineScheduler.cpp.o lib/Target/PowerPC/CMakeFiles/LLVMPowerPCCodeGen.dir/PPCMacroFusion.cpp.o lib/Target/PowerPC/CMakeFiles/LLVMPowerPCCodeGen.dir/PPCMIPeephole.cpp.o lib/Target/PowerPC/CMakeFiles/LLVMPowerPCCodeGen.dir/PPCRegisterInfo.cpp.o lib/Target/PowerPC/CMakeFiles/LLVMPowerPCCodeGen.dir/PPCSubtarget.cpp.o lib/Target/PowerPC/CMakeFiles/LLVMPowerPCCodeGen.dir/PPCTargetMachine.cpp.o lib/Target/PowerPC/CMakeFiles/LLVMPowerPCCodeGen.dir/PPCTargetObjectFile.cpp.o lib/Target/PowerPC/CMakeFiles/LLVMPowerPCCodeGen.dir/PPCTargetTransformInfo.cpp.o lib/Target/PowerPC/CMakeFiles/LLVMPowerPCCodeGen.dir/PPCTOCRegDeps.cpp.o lib/Target/PowerPC/CMakeFiles/LLVMPowerPCCodeGen.dir/PPCTLSDynamicCall.cpp.o lib/Target/PowerPC/CMakeFiles/LLVMPowerPCCodeGen.dir/PPCVSXCopy.cpp.o lib/Target/PowerPC/CMakeFiles/LLVMPowerPCCodeGen.dir/PPCReduceCRLogicals.cpp.o lib/Target/PowerPC/CMakeFiles/LLVMPowerPCCodeGen.dir/PPCVSXFMAMutate.cpp.o lib/Target/PowerPC/CMakeFiles/LLVMPowerPCCodeGen.dir/PPCVSXSwapRemoval.cpp.o lib/Target/PowerPC/CMakeFiles/LLVMPowerPCCodeGen.dir/PPCExpandISEL.cpp.o lib/Target/PowerPC/CMakeFiles/LLVMPowerPCCodeGen.dir/PPCPreEmitPeephole.cpp.o lib/Target/PowerPC/CMakeFiles/LLVMPowerPCCodeGen.dir/PPCLowerMASSVEntries.cpp.o lib/Target/PowerPC/CMakeFiles/LLVMPowerPCCodeGen.dir/GISel/PPCCallLowering.cpp.o lib/Target/PowerPC/CMakeFiles/LLVMPowerPCCodeGen.dir/GISel/PPCRegisterBankInfo.cpp.o lib/Target/PowerPC/CMakeFiles/LLVMPowerPCCodeGen.dir/GISel/PPCLegalizerInfo.cpp.o && :
[2299/2349] /usr/local/bin/sccache /Users/buildslave/jenkins/workspace/clang-stage2-cmake-RgTSan/host-compiler/bin/clang++  -DBUILD_EXAMPLES -DGTEST_HAS_RTTI=0 -D__STDC_CONSTANT_MACROS -D__STDC_FORMAT_MACROS -D__STDC_LIMIT_MACROS -Ilib/Target/X86 -I/Users/buildslave/jenkins/workspace/clang-stage2-cmake-RgTSan/llvm-project/llvm/lib/Target/X86 -Iinclude -I/Users/buildslave/jenkins/workspace/clang-stage2-cmake-RgTSan/llvm-project/llvm/include -fPIC -fvisibility-inlines-hidden -Werror=date-time -Werror=unguarded-availability-new -Wall -Wextra -Wno-unused-parameter -Wwrite-strings -Wcast-qual -Wmissing-field-initializers -pedantic -Wno-long-long -Wc++98-compat-extra-semi -Wimplicit-fallthrough -Wcovered-switch-default -Wno-noexcept-type -Wnon-virtual-dtor -Wdelete-non-virtual-dtor -Wstring-conversion -fno-omit-frame-pointer -fsanitize=thread -fdiagnostics-color -flto=thin -O2 -g -DNDEBUG -isysroot /Applications/Xcode.app/Contents/Developer/Platforms/MacOSX.platform/Developer/SDKs/MacOSX10.15.sdk    -fno-exceptions -fno-rtti -std=c++14 -MD -MT lib/Target/X86/CMakeFiles/LLVMX86CodeGen.dir/X86LoadValueInjectionLoadHardening.cpp.o -MF lib/Target/X86/CMakeFiles/LLVMX86CodeGen.dir/X86LoadValueInjectionLoadHardening.cpp.o.d -o lib/Target/X86/CMakeFiles/LLVMX86CodeGen.dir/X86LoadValueInjectionLoadHardening.cpp.o -c /Users/buildslave/jenkins/workspace/clang-stage2-cmake-RgTSan/llvm-project/llvm/lib/Target/X86/X86LoadValueInjectionLoadHardening.cpp
[2300/2349] : && DYLD_LIBRARY_PATH=/Users/buildslave/jenkins/workspace/clang-stage2-cmake-RgTSan/host-compiler/lib/ "/Applications/Xcode.app/Contents/Developer/Toolchains/XcodeDefault.xctoolchain/usr/bin/libtool" -static -no_warning_for_no_symbols -o lib/libLLVMSystemZCodeGen.a  lib/Target/SystemZ/CMakeFiles/LLVMSystemZCodeGen.dir/SystemZAsmPrinter.cpp.o lib/Target/SystemZ/CMakeFiles/LLVMSystemZCodeGen.dir/SystemZCallingConv.cpp.o lib/Target/SystemZ/CMakeFiles/LLVMSystemZCodeGen.dir/SystemZConstantPoolValue.cpp.o lib/Target/SystemZ/CMakeFiles/LLVMSystemZCodeGen.dir/SystemZCopyPhysRegs.cpp.o lib/Target/SystemZ/CMakeFiles/LLVMSystemZCodeGen.dir/SystemZElimCompare.cpp.o lib/Target/SystemZ/CMakeFiles/LLVMSystemZCodeGen.dir/SystemZFrameLowering.cpp.o lib/Target/SystemZ/CMakeFiles/LLVMSystemZCodeGen.dir/SystemZHazardRecognizer.cpp.o lib/Target/SystemZ/CMakeFiles/LLVMSystemZCodeGen.dir/SystemZISelDAGToDAG.cpp.o lib/Target/SystemZ/CMakeFiles/LLVMSystemZCodeGen.dir/SystemZISelLowering.cpp.o lib/Target/SystemZ/CMakeFiles/LLVMSystemZCodeGen.dir/SystemZInstrInfo.cpp.o lib/Target/SystemZ/CMakeFiles/LLVMSystemZCodeGen.dir/SystemZLDCleanup.cpp.o lib/Target/SystemZ/CMakeFiles/LLVMSystemZCodeGen.dir/SystemZLongBranch.cpp.o lib/Target/SystemZ/CMakeFiles/LLVMSystemZCodeGen.dir/SystemZMachineFunctionInfo.cpp.o lib/Target/SystemZ/CMakeFiles/LLVMSystemZCodeGen.dir/SystemZMachineScheduler.cpp.o lib/Target/SystemZ/CMakeFiles/LLVMSystemZCodeGen.dir/SystemZMCInstLower.cpp.o lib/Target/SystemZ/CMakeFiles/LLVMSystemZCodeGen.dir/SystemZPostRewrite.cpp.o lib/Target/SystemZ/CMakeFiles/LLVMSystemZCodeGen.dir/SystemZRegisterInfo.cpp.o lib/Target/SystemZ/CMakeFiles/LLVMSystemZCodeGen.dir/SystemZSelectionDAGInfo.cpp.o lib/Target/SystemZ/CMakeFiles/LLVMSystemZCodeGen.dir/SystemZShortenInst.cpp.o lib/Target/SystemZ/CMakeFiles/LLVMSystemZCodeGen.dir/SystemZSubtarget.cpp.o lib/Target/SystemZ/CMakeFiles/LLVMSystemZCodeGen.dir/SystemZTargetMachine.cpp.o lib/Target/SystemZ/CMakeFiles/LLVMSystemZCodeGen.dir/SystemZTargetTransformInfo.cpp.o lib/Target/SystemZ/CMakeFiles/LLVMSystemZCodeGen.dir/SystemZTDC.cpp.o && :
[2301/2349] /usr/local/bin/sccache /Users/buildslave/jenkins/workspace/clang-stage2-cmake-RgTSan/host-compiler/bin/clang++  -DBUILD_EXAMPLES -DGTEST_HAS_RTTI=0 -D__STDC_CONSTANT_MACROS -D__STDC_FORMAT_MACROS -D__STDC_LIMIT_MACROS -Ilib/Target/X86 -I/Users/buildslave/jenkins/workspace/clang-stage2-cmake-RgTSan/llvm-project/llvm/lib/Target/X86 -Iinclude -I/Users/buildslave/jenkins/workspace/clang-stage2-cmake-RgTSan/llvm-project/llvm/include -fPIC -fvisibility-inlines-hidden -Werror=date-time -Werror=unguarded-availability-new -Wall -Wextra -Wno-unused-parameter -Wwrite-strings -Wcast-qual -Wmissing-field-initializers -pedantic -Wno-long-long -Wc++98-compat-extra-semi -Wimplicit-fallthrough -Wcovered-switch-default -Wno-noexcept-type -Wnon-virtual-dtor -Wdelete-non-virtual-dtor -Wstring-conversion -fno-omit-frame-pointer -fsanitize=thread -fdiagnostics-color -flto=thin -O2 -g -DNDEBUG -isysroot /Applications/Xcode.app/Contents/Developer/Platforms/MacOSX.platform/Developer/SDKs/MacOSX10.15.sdk    -fno-exceptions -fno-rtti -std=c++14 -MD -MT lib/Target/X86/CMakeFiles/LLVMX86CodeGen.dir/X86MCInstLower.cpp.o -MF lib/Target/X86/CMakeFiles/LLVMX86CodeGen.dir/X86MCInstLower.cpp.o.d -o lib/Target/X86/CMakeFiles/LLVMX86CodeGen.dir/X86MCInstLower.cpp.o -c /Users/buildslave/jenkins/workspace/clang-stage2-cmake-RgTSan/llvm-project/llvm/lib/Target/X86/X86MCInstLower.cpp
[2302/2349] /usr/local/bin/sccache /Users/buildslave/jenkins/workspace/clang-stage2-cmake-RgTSan/host-compiler/bin/clang++  -DBUILD_EXAMPLES -DGTEST_HAS_RTTI=0 -D__STDC_CONSTANT_MACROS -D__STDC_FORMAT_MACROS -D__STDC_LIMIT_MACROS -Ilib/Target/X86 -I/Users/buildslave/jenkins/workspace/clang-stage2-cmake-RgTSan/llvm-project/llvm/lib/Target/X86 -Iinclude -I/Users/buildslave/jenkins/workspace/clang-stage2-cmake-RgTSan/llvm-project/llvm/include -fPIC -fvisibility-inlines-hidden -Werror=date-time -Werror=unguarded-availability-new -Wall -Wextra -Wno-unused-parameter -Wwrite-strings -Wcast-qual -Wmissing-field-initializers -pedantic -Wno-long-long -Wc++98-compat-extra-semi -Wimplicit-fallthrough -Wcovered-switch-default -Wno-noexcept-type -Wnon-virtual-dtor -Wdelete-non-virtual-dtor -Wstring-conversion -fno-omit-frame-pointer -fsanitize=thread -fdiagnostics-color -flto=thin -O2 -g -DNDEBUG -isysroot /Applications/Xcode.app/Contents/Developer/Platforms/MacOSX.platform/Developer/SDKs/MacOSX10.15.sdk    -fno-exceptions -fno-rtti -std=c++14 -MD -MT lib/Target/X86/CMakeFiles/LLVMX86CodeGen.dir/X86ShuffleDecodeConstantPool.cpp.o -MF lib/Target/X86/CMakeFiles/LLVMX86CodeGen.dir/X86ShuffleDecodeConstantPool.cpp.o.d -o lib/Target/X86/CMakeFiles/LLVMX86CodeGen.dir/X86ShuffleDecodeConstantPool.cpp.o -c /Users/buildslave/jenkins/workspace/clang-stage2-cmake-RgTSan/llvm-project/llvm/lib/Target/X86/X86ShuffleDecodeConstantPool.cpp
[2303/2349] : && DYLD_LIBRARY_PATH=/Users/buildslave/jenkins/workspace/clang-stage2-cmake-RgTSan/host-compiler/lib/ "/Applications/Xcode.app/Contents/Developer/Toolchains/XcodeDefault.xctoolchain/usr/bin/libtool" -static -no_warning_for_no_symbols -o lib/libLLVMWebAssemblyCodeGen.a  lib/Target/WebAssembly/CMakeFiles/LLVMWebAssemblyCodeGen.dir/WebAssemblyAddMissingPrototypes.cpp.o lib/Target/WebAssembly/CMakeFiles/LLVMWebAssemblyCodeGen.dir/WebAssemblyArgumentMove.cpp.o lib/Target/WebAssembly/CMakeFiles/LLVMWebAssemblyCodeGen.dir/WebAssemblyAsmPrinter.cpp.o lib/Target/WebAssembly/CMakeFiles/LLVMWebAssemblyCodeGen.dir/WebAssemblyCFGStackify.cpp.o lib/Target/WebAssembly/CMakeFiles/LLVMWebAssemblyCodeGen.dir/WebAssemblyCFGSort.cpp.o lib/Target/WebAssembly/CMakeFiles/LLVMWebAssemblyCodeGen.dir/WebAssemblyDebugFixup.cpp.o lib/Target/WebAssembly/CMakeFiles/LLVMWebAssemblyCodeGen.dir/WebAssemblyDebugValueManager.cpp.o lib/Target/WebAssembly/CMakeFiles/LLVMWebAssemblyCodeGen.dir/WebAssemblyLateEHPrepare.cpp.o lib/Target/WebAssembly/CMakeFiles/LLVMWebAssemblyCodeGen.dir/WebAssemblyExceptionInfo.cpp.o lib/Target/WebAssembly/CMakeFiles/LLVMWebAssemblyCodeGen.dir/WebAssemblyExplicitLocals.cpp.o lib/Target/WebAssembly/CMakeFiles/LLVMWebAssemblyCodeGen.dir/WebAssemblyFastISel.cpp.o lib/Target/WebAssembly/CMakeFiles/LLVMWebAssemblyCodeGen.dir/WebAssemblyFixBrTableDefaults.cpp.o lib/Target/WebAssembly/CMakeFiles/LLVMWebAssemblyCodeGen.dir/WebAssemblyFixIrreducibleControlFlow.cpp.o lib/Target/WebAssembly/CMakeFiles/LLVMWebAssemblyCodeGen.dir/WebAssemblyFixFunctionBitcasts.cpp.o lib/Target/WebAssembly/CMakeFiles/LLVMWebAssemblyCodeGen.dir/WebAssemblyFrameLowering.cpp.o lib/Target/WebAssembly/CMakeFiles/LLVMWebAssemblyCodeGen.dir/WebAssemblyISelDAGToDAG.cpp.o lib/Target/WebAssembly/CMakeFiles/LLVMWebAssemblyCodeGen.dir/WebAssemblyISelLowering.cpp.o lib/Target/WebAssembly/CMakeFiles/LLVMWebAssemblyCodeGen.dir/WebAssemblyInstrInfo.cpp.o lib/Target/WebAssembly/CMakeFiles/LLVMWebAssemblyCodeGen.dir/WebAssemblyLowerBrUnless.cpp.o lib/Target/WebAssembly/CMakeFiles/LLVMWebAssemblyCodeGen.dir/WebAssemblyLowerEmscriptenEHSjLj.cpp.o lib/Target/WebAssembly/CMakeFiles/LLVMWebAssemblyCodeGen.dir/WebAssemblyLowerGlobalDtors.cpp.o lib/Target/WebAssembly/CMakeFiles/LLVMWebAssemblyCodeGen.dir/WebAssemblyLowerRefTypesIntPtrConv.cpp.o lib/Target/WebAssembly/CMakeFiles/LLVMWebAssemblyCodeGen.dir/WebAssemblyMachineFunctionInfo.cpp.o lib/Target/WebAssembly/CMakeFiles/LLVMWebAssemblyCodeGen.dir/WebAssemblyMCInstLower.cpp.o lib/Target/WebAssembly/CMakeFiles/LLVMWebAssemblyCodeGen.dir/WebAssemblyMCLowerPrePass.cpp.o lib/Target/WebAssembly/CMakeFiles/LLVMWebAssemblyCodeGen.dir/WebAssemblyNullifyDebugValueLists.cpp.o lib/Target/WebAssembly/CMakeFiles/LLVMWebAssemblyCodeGen.dir/WebAssemblyOptimizeLiveIntervals.cpp.o lib/Target/WebAssembly/CMakeFiles/LLVMWebAssemblyCodeGen.dir/WebAssemblyOptimizeReturned.cpp.o lib/Target/WebAssembly/CMakeFiles/LLVMWebAssemblyCodeGen.dir/WebAssemblyPeephole.cpp.o lib/Target/WebAssembly/CMakeFiles/LLVMWebAssemblyCodeGen.dir/WebAssemblyPrepareForLiveIntervals.cpp.o lib/Target/WebAssembly/CMakeFiles/LLVMWebAssemblyCodeGen.dir/WebAssemblyRegisterInfo.cpp.o lib/Target/WebAssembly/CMakeFiles/LLVMWebAssemblyCodeGen.dir/WebAssemblyRegColoring.cpp.o lib/Target/WebAssembly/CMakeFiles/LLVMWebAssemblyCodeGen.dir/WebAssemblyRegNumbering.cpp.o lib/Target/WebAssembly/CMakeFiles/LLVMWebAssemblyCodeGen.dir/WebAssemblyRegStackify.cpp.o lib/Target/WebAssembly/CMakeFiles/LLVMWebAssemblyCodeGen.dir/WebAssemblyReplacePhysRegs.cpp.o lib/Target/WebAssembly/CMakeFiles/LLVMWebAssemblyCodeGen.dir/WebAssemblyRuntimeLibcallSignatures.cpp.o lib/Target/WebAssembly/CMakeFiles/LLVMWebAssemblyCodeGen.dir/WebAssemblySelectionDAGInfo.cpp.o lib/Target/WebAssembly/CMakeFiles/LLVMWebAssemblyCodeGen.dir/WebAssemblySetP2AlignOperands.cpp.o lib/Target/WebAssembly/CMakeFiles/LLVMWebAssemblyCodeGen.dir/WebAssemblySortRegion.cpp.o lib/Target/WebAssembly/CMakeFiles/LLVMWebAssemblyCodeGen.dir/WebAssemblyMemIntrinsicResults.cpp.o lib/Target/WebAssembly/CMakeFiles/LLVMWebAssemblyCodeGen.dir/WebAssemblySubtarget.cpp.o lib/Target/WebAssembly/CMakeFiles/LLVMWebAssemblyCodeGen.dir/WebAssemblyTargetMachine.cpp.o lib/Target/WebAssembly/CMakeFiles/LLVMWebAssemblyCodeGen.dir/WebAssemblyTargetObjectFile.cpp.o lib/Target/WebAssembly/CMakeFiles/LLVMWebAssemblyCodeGen.dir/WebAssemblyTargetTransformInfo.cpp.o && :
[2304/2349] /usr/local/bin/sccache /Users/buildslave/jenkins/workspace/clang-stage2-cmake-RgTSan/host-compiler/bin/clang++  -DBUILD_EXAMPLES -DGTEST_HAS_RTTI=0 -D__STDC_CONSTANT_MACROS -D__STDC_FORMAT_MACROS -D__STDC_LIMIT_MACROS -Ilib/Target/X86 -I/Users/buildslave/jenkins/workspace/clang-stage2-cmake-RgTSan/llvm-project/llvm/lib/Target/X86 -Iinclude -I/Users/buildslave/jenkins/workspace/clang-stage2-cmake-RgTSan/llvm-project/llvm/include -fPIC -fvisibility-inlines-hidden -Werror=date-time -Werror=unguarded-availability-new -Wall -Wextra -Wno-unused-parameter -Wwrite-strings -Wcast-qual -Wmissing-field-initializers -pedantic -Wno-long-long -Wc++98-compat-extra-semi -Wimplicit-fallthrough -Wcovered-switch-default -Wno-noexcept-type -Wnon-virtual-dtor -Wdelete-non-virtual-dtor -Wstring-conversion -fno-omit-frame-pointer -fsanitize=thread -fdiagnostics-color -flto=thin -O2 -g -DNDEBUG -isysroot /Applications/Xcode.app/Contents/Developer/Platforms/MacOSX.platform/Developer/SDKs/MacOSX10.15.sdk    -fno-exceptions -fno-rtti -std=c++14 -MD -MT lib/Target/X86/CMakeFiles/LLVMX86CodeGen.dir/X86PadShortFunction.cpp.o -MF lib/Target/X86/CMakeFiles/LLVMX86CodeGen.dir/X86PadShortFunction.cpp.o.d -o lib/Target/X86/CMakeFiles/LLVMX86CodeGen.dir/X86PadShortFunction.cpp.o -c /Users/buildslave/jenkins/workspace/clang-stage2-cmake-RgTSan/llvm-project/llvm/lib/Target/X86/X86PadShortFunction.cpp
[2305/2349] /usr/local/bin/sccache /Users/buildslave/jenkins/workspace/clang-stage2-cmake-RgTSan/host-compiler/bin/clang++  -DBUILD_EXAMPLES -DGTEST_HAS_RTTI=0 -D__STDC_CONSTANT_MACROS -D__STDC_FORMAT_MACROS -D__STDC_LIMIT_MACROS -Ilib/Target/X86 -I/Users/buildslave/jenkins/workspace/clang-stage2-cmake-RgTSan/llvm-project/llvm/lib/Target/X86 -Iinclude -I/Users/buildslave/jenkins/workspace/clang-stage2-cmake-RgTSan/llvm-project/llvm/include -fPIC -fvisibility-inlines-hidden -Werror=date-time -Werror=unguarded-availability-new -Wall -Wextra -Wno-unused-parameter -Wwrite-strings -Wcast-qual -Wmissing-field-initializers -pedantic -Wno-long-long -Wc++98-compat-extra-semi -Wimplicit-fallthrough -Wcovered-switch-default -Wno-noexcept-type -Wnon-virtual-dtor -Wdelete-non-virtual-dtor -Wstring-conversion -fno-omit-frame-pointer -fsanitize=thread -fdiagnostics-color -flto=thin -O2 -g -DNDEBUG -isysroot /Applications/Xcode.app/Contents/Developer/Platforms/MacOSX.platform/Developer/SDKs/MacOSX10.15.sdk    -fno-exceptions -fno-rtti -std=c++14 -MD -MT lib/Target/X86/CMakeFiles/LLVMX86CodeGen.dir/X86RegisterBankInfo.cpp.o -MF lib/Target/X86/CMakeFiles/LLVMX86CodeGen.dir/X86RegisterBankInfo.cpp.o.d -o lib/Target/X86/CMakeFiles/LLVMX86CodeGen.dir/X86RegisterBankInfo.cpp.o -c /Users/buildslave/jenkins/workspace/clang-stage2-cmake-RgTSan/llvm-project/llvm/lib/Target/X86/X86RegisterBankInfo.cpp
[2306/2349] /usr/local/bin/sccache /Users/buildslave/jenkins/workspace/clang-stage2-cmake-RgTSan/host-compiler/bin/clang++  -DBUILD_EXAMPLES -DGTEST_HAS_RTTI=0 -D__STDC_CONSTANT_MACROS -D__STDC_FORMAT_MACROS -D__STDC_LIMIT_MACROS -Ilib/Target/X86 -I/Users/buildslave/jenkins/workspace/clang-stage2-cmake-RgTSan/llvm-project/llvm/lib/Target/X86 -Iinclude -I/Users/buildslave/jenkins/workspace/clang-stage2-cmake-RgTSan/llvm-project/llvm/include -fPIC -fvisibility-inlines-hidden -Werror=date-time -Werror=unguarded-availability-new -Wall -Wextra -Wno-unused-parameter -Wwrite-strings -Wcast-qual -Wmissing-field-initializers -pedantic -Wno-long-long -Wc++98-compat-extra-semi -Wimplicit-fallthrough -Wcovered-switch-default -Wno-noexcept-type -Wnon-virtual-dtor -Wdelete-non-virtual-dtor -Wstring-conversion -fno-omit-frame-pointer -fsanitize=thread -fdiagnostics-color -flto=thin -O2 -g -DNDEBUG -isysroot /Applications/Xcode.app/Contents/Developer/Platforms/MacOSX.platform/Developer/SDKs/MacOSX10.15.sdk    -fno-exceptions -fno-rtti -std=c++14 -MD -MT lib/Target/X86/CMakeFiles/LLVMX86CodeGen.dir/X86PartialReduction.cpp.o -MF lib/Target/X86/CMakeFiles/LLVMX86CodeGen.dir/X86PartialReduction.cpp.o.d -o lib/Target/X86/CMakeFiles/LLVMX86CodeGen.dir/X86PartialReduction.cpp.o -c /Users/buildslave/jenkins/workspace/clang-stage2-cmake-RgTSan/llvm-project/llvm/lib/Target/X86/X86PartialReduction.cpp
[2307/2349] /usr/local/bin/sccache /Users/buildslave/jenkins/workspace/clang-stage2-cmake-RgTSan/host-compiler/bin/clang++  -DBUILD_EXAMPLES -DGTEST_HAS_RTTI=0 -D__STDC_CONSTANT_MACROS -D__STDC_FORMAT_MACROS -D__STDC_LIMIT_MACROS -Ilib/Target/X86 -I/Users/buildslave/jenkins/workspace/clang-stage2-cmake-RgTSan/llvm-project/llvm/lib/Target/X86 -Iinclude -I/Users/buildslave/jenkins/workspace/clang-stage2-cmake-RgTSan/llvm-project/llvm/include -fPIC -fvisibility-inlines-hidden -Werror=date-time -Werror=unguarded-availability-new -Wall -Wextra -Wno-unused-parameter -Wwrite-strings -Wcast-qual -Wmissing-field-initializers -pedantic -Wno-long-long -Wc++98-compat-extra-semi -Wimplicit-fallthrough -Wcovered-switch-default -Wno-noexcept-type -Wnon-virtual-dtor -Wdelete-non-virtual-dtor -Wstring-conversion -fno-omit-frame-pointer -fsanitize=thread -fdiagnostics-color -flto=thin -O2 -g -DNDEBUG -isysroot /Applications/Xcode.app/Contents/Developer/Platforms/MacOSX.platform/Developer/SDKs/MacOSX10.15.sdk    -fno-exceptions -fno-rtti -std=c++14 -MD -MT lib/Target/X86/CMakeFiles/LLVMX86CodeGen.dir/X86OptimizeLEAs.cpp.o -MF lib/Target/X86/CMakeFiles/LLVMX86CodeGen.dir/X86OptimizeLEAs.cpp.o.d -o lib/Target/X86/CMakeFiles/LLVMX86CodeGen.dir/X86OptimizeLEAs.cpp.o -c /Users/buildslave/jenkins/workspace/clang-stage2-cmake-RgTSan/llvm-project/llvm/lib/Target/X86/X86OptimizeLEAs.cpp
[2308/2349] /usr/local/bin/sccache /Users/buildslave/jenkins/workspace/clang-stage2-cmake-RgTSan/host-compiler/bin/clang++  -DBUILD_EXAMPLES -DGTEST_HAS_RTTI=0 -D__STDC_CONSTANT_MACROS -D__STDC_FORMAT_MACROS -D__STDC_LIMIT_MACROS -Ilib/Target/X86 -I/Users/buildslave/jenkins/workspace/clang-stage2-cmake-RgTSan/llvm-project/llvm/lib/Target/X86 -Iinclude -I/Users/buildslave/jenkins/workspace/clang-stage2-cmake-RgTSan/llvm-project/llvm/include -fPIC -fvisibility-inlines-hidden -Werror=date-time -Werror=unguarded-availability-new -Wall -Wextra -Wno-unused-parameter -Wwrite-strings -Wcast-qual -Wmissing-field-initializers -pedantic -Wno-long-long -Wc++98-compat-extra-semi -Wimplicit-fallthrough -Wcovered-switch-default -Wno-noexcept-type -Wnon-virtual-dtor -Wdelete-non-virtual-dtor -Wstring-conversion -fno-omit-frame-pointer -fsanitize=thread -fdiagnostics-color -flto=thin -O2 -g -DNDEBUG -isysroot /Applications/Xcode.app/Contents/Developer/Platforms/MacOSX.platform/Developer/SDKs/MacOSX10.15.sdk    -fno-exceptions -fno-rtti -std=c++14 -MD -MT lib/Target/X86/CMakeFiles/LLVMX86CodeGen.dir/X86TargetObjectFile.cpp.o -MF lib/Target/X86/CMakeFiles/LLVMX86CodeGen.dir/X86TargetObjectFile.cpp.o.d -o lib/Target/X86/CMakeFiles/LLVMX86CodeGen.dir/X86TargetObjectFile.cpp.o -c /Users/buildslave/jenkins/workspace/clang-stage2-cmake-RgTSan/llvm-project/llvm/lib/Target/X86/X86TargetObjectFile.cpp
[2309/2349] /usr/local/bin/sccache /Users/buildslave/jenkins/workspace/clang-stage2-cmake-RgTSan/host-compiler/bin/clang++  -DBUILD_EXAMPLES -DGTEST_HAS_RTTI=0 -D__STDC_CONSTANT_MACROS -D__STDC_FORMAT_MACROS -D__STDC_LIMIT_MACROS -Ilib/Target/X86 -I/Users/buildslave/jenkins/workspace/clang-stage2-cmake-RgTSan/llvm-project/llvm/lib/Target/X86 -Iinclude -I/Users/buildslave/jenkins/workspace/clang-stage2-cmake-RgTSan/llvm-project/llvm/include -fPIC -fvisibility-inlines-hidden -Werror=date-time -Werror=unguarded-availability-new -Wall -Wextra -Wno-unused-parameter -Wwrite-strings -Wcast-qual -Wmissing-field-initializers -pedantic -Wno-long-long -Wc++98-compat-extra-semi -Wimplicit-fallthrough -Wcovered-switch-default -Wno-noexcept-type -Wnon-virtual-dtor -Wdelete-non-virtual-dtor -Wstring-conversion -fno-omit-frame-pointer -fsanitize=thread -fdiagnostics-color -flto=thin -O2 -g -DNDEBUG -isysroot /Applications/Xcode.app/Contents/Developer/Platforms/MacOSX.platform/Developer/SDKs/MacOSX10.15.sdk    -fno-exceptions -fno-rtti -std=c++14 -MD -MT lib/Target/X86/CMakeFiles/LLVMX86CodeGen.dir/X86SelectionDAGInfo.cpp.o -MF lib/Target/X86/CMakeFiles/LLVMX86CodeGen.dir/X86SelectionDAGInfo.cpp.o.d -o lib/Target/X86/CMakeFiles/LLVMX86CodeGen.dir/X86SelectionDAGInfo.cpp.o -c /Users/buildslave/jenkins/workspace/clang-stage2-cmake-RgTSan/llvm-project/llvm/lib/Target/X86/X86SelectionDAGInfo.cpp
[2310/2349] /usr/local/bin/sccache /Users/buildslave/jenkins/workspace/clang-stage2-cmake-RgTSan/host-compiler/bin/clang++  -DBUILD_EXAMPLES -DGTEST_HAS_RTTI=0 -D__STDC_CONSTANT_MACROS -D__STDC_FORMAT_MACROS -D__STDC_LIMIT_MACROS -Ilib/Target/X86 -I/Users/buildslave/jenkins/workspace/clang-stage2-cmake-RgTSan/llvm-project/llvm/lib/Target/X86 -Iinclude -I/Users/buildslave/jenkins/workspace/clang-stage2-cmake-RgTSan/llvm-project/llvm/include -fPIC -fvisibility-inlines-hidden -Werror=date-time -Werror=unguarded-availability-new -Wall -Wextra -Wno-unused-parameter -Wwrite-strings -Wcast-qual -Wmissing-field-initializers -pedantic -Wno-long-long -Wc++98-compat-extra-semi -Wimplicit-fallthrough -Wcovered-switch-default -Wno-noexcept-type -Wnon-virtual-dtor -Wdelete-non-virtual-dtor -Wstring-conversion -fno-omit-frame-pointer -fsanitize=thread -fdiagnostics-color -flto=thin -O2 -g -DNDEBUG -isysroot /Applications/Xcode.app/Contents/Developer/Platforms/MacOSX.platform/Developer/SDKs/MacOSX10.15.sdk    -fno-exceptions -fno-rtti -std=c++14 -MD -MT lib/Target/X86/CMakeFiles/LLVMX86CodeGen.dir/X86RegisterInfo.cpp.o -MF lib/Target/X86/CMakeFiles/LLVMX86CodeGen.dir/X86RegisterInfo.cpp.o.d -o lib/Target/X86/CMakeFiles/LLVMX86CodeGen.dir/X86RegisterInfo.cpp.o -c /Users/buildslave/jenkins/workspace/clang-stage2-cmake-RgTSan/llvm-project/llvm/lib/Target/X86/X86RegisterInfo.cpp
[2311/2349] /usr/local/bin/sccache /Users/buildslave/jenkins/workspace/clang-stage2-cmake-RgTSan/host-compiler/bin/clang++  -DBUILD_EXAMPLES -DGTEST_HAS_RTTI=0 -D__STDC_CONSTANT_MACROS -D__STDC_FORMAT_MACROS -D__STDC_LIMIT_MACROS -Ilib/Target/X86 -I/Users/buildslave/jenkins/workspace/clang-stage2-cmake-RgTSan/llvm-project/llvm/lib/Target/X86 -Iinclude -I/Users/buildslave/jenkins/workspace/clang-stage2-cmake-RgTSan/llvm-project/llvm/include -fPIC -fvisibility-inlines-hidden -Werror=date-time -Werror=unguarded-availability-new -Wall -Wextra -Wno-unused-parameter -Wwrite-strings -Wcast-qual -Wmissing-field-initializers -pedantic -Wno-long-long -Wc++98-compat-extra-semi -Wimplicit-fallthrough -Wcovered-switch-default -Wno-noexcept-type -Wnon-virtual-dtor -Wdelete-non-virtual-dtor -Wstring-conversion -fno-omit-frame-pointer -fsanitize=thread -fdiagnostics-color -flto=thin -O2 -g -DNDEBUG -isysroot /Applications/Xcode.app/Contents/Developer/Platforms/MacOSX.platform/Developer/SDKs/MacOSX10.15.sdk    -fno-exceptions -fno-rtti -std=c++14 -MD -MT lib/Target/X86/CMakeFiles/LLVMX86CodeGen.dir/X86SpeculativeExecutionSideEffectSuppression.cpp.o -MF lib/Target/X86/CMakeFiles/LLVMX86CodeGen.dir/X86SpeculativeExecutionSideEffectSuppression.cpp.o.d -o lib/Target/X86/CMakeFiles/LLVMX86CodeGen.dir/X86SpeculativeExecutionSideEffectSuppression.cpp.o -c /Users/buildslave/jenkins/workspace/clang-stage2-cmake-RgTSan/llvm-project/llvm/lib/Target/X86/X86SpeculativeExecutionSideEffectSuppression.cpp
[2312/2349] /usr/local/bin/sccache /Users/buildslave/jenkins/workspace/clang-stage2-cmake-RgTSan/host-compiler/bin/clang++  -DBUILD_EXAMPLES -DGTEST_HAS_RTTI=0 -D__STDC_CONSTANT_MACROS -D__STDC_FORMAT_MACROS -D__STDC_LIMIT_MACROS -Ilib/Target/X86 -I/Users/buildslave/jenkins/workspace/clang-stage2-cmake-RgTSan/llvm-project/llvm/lib/Target/X86 -Iinclude -I/Users/buildslave/jenkins/workspace/clang-stage2-cmake-RgTSan/llvm-project/llvm/include -fPIC -fvisibility-inlines-hidden -Werror=date-time -Werror=unguarded-availability-new -Wall -Wextra -Wno-unused-parameter -Wwrite-strings -Wcast-qual -Wmissing-field-initializers -pedantic -Wno-long-long -Wc++98-compat-extra-semi -Wimplicit-fallthrough -Wcovered-switch-default -Wno-noexcept-type -Wnon-virtual-dtor -Wdelete-non-virtual-dtor -Wstring-conversion -fno-omit-frame-pointer -fsanitize=thread -fdiagnostics-color -flto=thin -O2 -g -DNDEBUG -isysroot /Applications/Xcode.app/Contents/Developer/Platforms/MacOSX.platform/Developer/SDKs/MacOSX10.15.sdk    -fno-exceptions -fno-rtti -std=c++14 -MD -MT lib/Target/X86/CMakeFiles/LLVMX86CodeGen.dir/X86Subtarget.cpp.o -MF lib/Target/X86/CMakeFiles/LLVMX86CodeGen.dir/X86Subtarget.cpp.o.d -o lib/Target/X86/CMakeFiles/LLVMX86CodeGen.dir/X86Subtarget.cpp.o -c /Users/buildslave/jenkins/workspace/clang-stage2-cmake-RgTSan/llvm-project/llvm/lib/Target/X86/X86Subtarget.cpp
[2313/2349] /usr/local/bin/sccache /Users/buildslave/jenkins/workspace/clang-stage2-cmake-RgTSan/host-compiler/bin/clang++  -DBUILD_EXAMPLES -DGTEST_HAS_RTTI=0 -D__STDC_CONSTANT_MACROS -D__STDC_FORMAT_MACROS -D__STDC_LIMIT_MACROS -Ilib/Target/X86 -I/Users/buildslave/jenkins/workspace/clang-stage2-cmake-RgTSan/llvm-project/llvm/lib/Target/X86 -Iinclude -I/Users/buildslave/jenkins/workspace/clang-stage2-cmake-RgTSan/llvm-project/llvm/include -fPIC -fvisibility-inlines-hidden -Werror=date-time -Werror=unguarded-availability-new -Wall -Wextra -Wno-unused-parameter -Wwrite-strings -Wcast-qual -Wmissing-field-initializers -pedantic -Wno-long-long -Wc++98-compat-extra-semi -Wimplicit-fallthrough -Wcovered-switch-default -Wno-noexcept-type -Wnon-virtual-dtor -Wdelete-non-virtual-dtor -Wstring-conversion -fno-omit-frame-pointer -fsanitize=thread -fdiagnostics-color -flto=thin -O2 -g -DNDEBUG -isysroot /Applications/Xcode.app/Contents/Developer/Platforms/MacOSX.platform/Developer/SDKs/MacOSX10.15.sdk    -fno-exceptions -fno-rtti -std=c++14 -MD -MT lib/Target/X86/CMakeFiles/LLVMX86CodeGen.dir/X86SpeculativeLoadHardening.cpp.o -MF lib/Target/X86/CMakeFiles/LLVMX86CodeGen.dir/X86SpeculativeLoadHardening.cpp.o.d -o lib/Target/X86/CMakeFiles/LLVMX86CodeGen.dir/X86SpeculativeLoadHardening.cpp.o -c /Users/buildslave/jenkins/workspace/clang-stage2-cmake-RgTSan/llvm-project/llvm/lib/Target/X86/X86SpeculativeLoadHardening.cpp
[2314/2349] /usr/local/bin/sccache /Users/buildslave/jenkins/workspace/clang-stage2-cmake-RgTSan/host-compiler/bin/clang++  -DBUILD_EXAMPLES -DGTEST_HAS_RTTI=0 -D__STDC_CONSTANT_MACROS -D__STDC_FORMAT_MACROS -D__STDC_LIMIT_MACROS -Ilib/Target/X86 -I/Users/buildslave/jenkins/workspace/clang-stage2-cmake-RgTSan/llvm-project/llvm/lib/Target/X86 -Iinclude -I/Users/buildslave/jenkins/workspace/clang-stage2-cmake-RgTSan/llvm-project/llvm/include -fPIC -fvisibility-inlines-hidden -Werror=date-time -Werror=unguarded-availability-new -Wall -Wextra -Wno-unused-parameter -Wwrite-strings -Wcast-qual -Wmissing-field-initializers -pedantic -Wno-long-long -Wc++98-compat-extra-semi -Wimplicit-fallthrough -Wcovered-switch-default -Wno-noexcept-type -Wnon-virtual-dtor -Wdelete-non-virtual-dtor -Wstring-conversion -fno-omit-frame-pointer -fsanitize=thread -fdiagnostics-color -flto=thin -O2 -g -DNDEBUG -isysroot /Applications/Xcode.app/Contents/Developer/Platforms/MacOSX.platform/Developer/SDKs/MacOSX10.15.sdk    -fno-exceptions -fno-rtti -std=c++14 -MD -MT lib/Target/X86/CMakeFiles/LLVMX86CodeGen.dir/X86VZeroUpper.cpp.o -MF lib/Target/X86/CMakeFiles/LLVMX86CodeGen.dir/X86VZeroUpper.cpp.o.d -o lib/Target/X86/CMakeFiles/LLVMX86CodeGen.dir/X86VZeroUpper.cpp.o -c /Users/buildslave/jenkins/workspace/clang-stage2-cmake-RgTSan/llvm-project/llvm/lib/Target/X86/X86VZeroUpper.cpp
[2315/2349] /usr/local/bin/sccache /Users/buildslave/jenkins/workspace/clang-stage2-cmake-RgTSan/host-compiler/bin/clang++  -DBUILD_EXAMPLES -DGTEST_HAS_RTTI=0 -D__STDC_CONSTANT_MACROS -D__STDC_FORMAT_MACROS -D__STDC_LIMIT_MACROS -Ilib/Target/X86/AsmParser -I/Users/buildslave/jenkins/workspace/clang-stage2-cmake-RgTSan/llvm-project/llvm/lib/Target/X86/AsmParser -I/Users/buildslave/jenkins/workspace/clang-stage2-cmake-RgTSan/llvm-project/llvm/lib/Target/X86 -Ilib/Target/X86 -Iinclude -I/Users/buildslave/jenkins/workspace/clang-stage2-cmake-RgTSan/llvm-project/llvm/include -fPIC -fvisibility-inlines-hidden -Werror=date-time -Werror=unguarded-availability-new -Wall -Wextra -Wno-unused-parameter -Wwrite-strings -Wcast-qual -Wmissing-field-initializers -pedantic -Wno-long-long -Wc++98-compat-extra-semi -Wimplicit-fallthrough -Wcovered-switch-default -Wno-noexcept-type -Wnon-virtual-dtor -Wdelete-non-virtual-dtor -Wstring-conversion -fno-omit-frame-pointer -fsanitize=thread -fdiagnostics-color -flto=thin -O2 -g -DNDEBUG -isysroot /Applications/Xcode.app/Contents/Developer/Platforms/MacOSX.platform/Developer/SDKs/MacOSX10.15.sdk    -fno-exceptions -fno-rtti -std=c++14 -MD -MT lib/Target/X86/AsmParser/CMakeFiles/LLVMX86AsmParser.dir/X86AsmParser.cpp.o -MF lib/Target/X86/AsmParser/CMakeFiles/LLVMX86AsmParser.dir/X86AsmParser.cpp.o.d -o lib/Target/X86/AsmParser/CMakeFiles/LLVMX86AsmParser.dir/X86AsmParser.cpp.o -c /Users/buildslave/jenkins/workspace/clang-stage2-cmake-RgTSan/llvm-project/llvm/lib/Target/X86/AsmParser/X86AsmParser.cpp
[2316/2349] /usr/local/bin/sccache /Users/buildslave/jenkins/workspace/clang-stage2-cmake-RgTSan/host-compiler/bin/clang++  -DBUILD_EXAMPLES -DGTEST_HAS_RTTI=0 -D__STDC_CONSTANT_MACROS -D__STDC_FORMAT_MACROS -D__STDC_LIMIT_MACROS -Ilib/Target/X86/Disassembler -I/Users/buildslave/jenkins/workspace/clang-stage2-cmake-RgTSan/llvm-project/llvm/lib/Target/X86/Disassembler -I/Users/buildslave/jenkins/workspace/clang-stage2-cmake-RgTSan/llvm-project/llvm/lib/Target/X86 -Ilib/Target/X86 -Iinclude -I/Users/buildslave/jenkins/workspace/clang-stage2-cmake-RgTSan/llvm-project/llvm/include -fPIC -fvisibility-inlines-hidden -Werror=date-time -Werror=unguarded-availability-new -Wall -Wextra -Wno-unused-parameter -Wwrite-strings -Wcast-qual -Wmissing-field-initializers -pedantic -Wno-long-long -Wc++98-compat-extra-semi -Wimplicit-fallthrough -Wcovered-switch-default -Wno-noexcept-type -Wnon-virtual-dtor -Wdelete-non-virtual-dtor -Wstring-conversion -fno-omit-frame-pointer -fsanitize=thread -fdiagnostics-color -flto=thin -O2 -g -DNDEBUG -isysroot /Applications/Xcode.app/Contents/Developer/Platforms/MacOSX.platform/Developer/SDKs/MacOSX10.15.sdk    -fno-exceptions -fno-rtti -std=c++14 -MD -MT lib/Target/X86/Disassembler/CMakeFiles/LLVMX86Disassembler.dir/X86Disassembler.cpp.o -MF lib/Target/X86/Disassembler/CMakeFiles/LLVMX86Disassembler.dir/X86Disassembler.cpp.o.d -o lib/Target/X86/Disassembler/CMakeFiles/LLVMX86Disassembler.dir/X86Disassembler.cpp.o -c /Users/buildslave/jenkins/workspace/clang-stage2-cmake-RgTSan/llvm-project/llvm/lib/Target/X86/Disassembler/X86Disassembler.cpp
[2317/2349] /usr/local/bin/sccache /Users/buildslave/jenkins/workspace/clang-stage2-cmake-RgTSan/host-compiler/bin/clang++  -DBUILD_EXAMPLES -DGTEST_HAS_RTTI=0 -D__STDC_CONSTANT_MACROS -D__STDC_FORMAT_MACROS -D__STDC_LIMIT_MACROS -Ilib/Target/X86/MCTargetDesc -I/Users/buildslave/jenkins/workspace/clang-stage2-cmake-RgTSan/llvm-project/llvm/lib/Target/X86/MCTargetDesc -I/Users/buildslave/jenkins/workspace/clang-stage2-cmake-RgTSan/llvm-project/llvm/lib/Target/X86 -Ilib/Target/X86 -Iinclude -I/Users/buildslave/jenkins/workspace/clang-stage2-cmake-RgTSan/llvm-project/llvm/include -fPIC -fvisibility-inlines-hidden -Werror=date-time -Werror=unguarded-availability-new -Wall -Wextra -Wno-unused-parameter -Wwrite-strings -Wcast-qual -Wmissing-field-initializers -pedantic -Wno-long-long -Wc++98-compat-extra-semi -Wimplicit-fallthrough -Wcovered-switch-default -Wno-noexcept-type -Wnon-virtual-dtor -Wdelete-non-virtual-dtor -Wstring-conversion -fno-omit-frame-pointer -fsanitize=thread -fdiagnostics-color -flto=thin -O2 -g -DNDEBUG -isysroot /Applications/Xcode.app/Contents/Developer/Platforms/MacOSX.platform/Developer/SDKs/MacOSX10.15.sdk    -fno-exceptions -fno-rtti -std=c++14 -MD -MT lib/Target/X86/MCTargetDesc/CMakeFiles/LLVMX86Desc.dir/X86ATTInstPrinter.cpp.o -MF lib/Target/X86/MCTargetDesc/CMakeFiles/LLVMX86Desc.dir/X86ATTInstPrinter.cpp.o.d -o lib/Target/X86/MCTargetDesc/CMakeFiles/LLVMX86Desc.dir/X86ATTInstPrinter.cpp.o -c /Users/buildslave/jenkins/workspace/clang-stage2-cmake-RgTSan/llvm-project/llvm/lib/Target/X86/MCTargetDesc/X86ATTInstPrinter.cpp
[2318/2349] /usr/local/bin/sccache /Users/buildslave/jenkins/workspace/clang-stage2-cmake-RgTSan/host-compiler/bin/clang++  -DBUILD_EXAMPLES -DGTEST_HAS_RTTI=0 -D__STDC_CONSTANT_MACROS -D__STDC_FORMAT_MACROS -D__STDC_LIMIT_MACROS -Ilib/Target/X86/MCTargetDesc -I/Users/buildslave/jenkins/workspace/clang-stage2-cmake-RgTSan/llvm-project/llvm/lib/Target/X86/MCTargetDesc -I/Users/buildslave/jenkins/workspace/clang-stage2-cmake-RgTSan/llvm-project/llvm/lib/Target/X86 -Ilib/Target/X86 -Iinclude -I/Users/buildslave/jenkins/workspace/clang-stage2-cmake-RgTSan/llvm-project/llvm/include -fPIC -fvisibility-inlines-hidden -Werror=date-time -Werror=unguarded-availability-new -Wall -Wextra -Wno-unused-parameter -Wwrite-strings -Wcast-qual -Wmissing-field-initializers -pedantic -Wno-long-long -Wc++98-compat-extra-semi -Wimplicit-fallthrough -Wcovered-switch-default -Wno-noexcept-type -Wnon-virtual-dtor -Wdelete-non-virtual-dtor -Wstring-conversion -fno-omit-frame-pointer -fsanitize=thread -fdiagnostics-color -flto=thin -O2 -g -DNDEBUG -isysroot /Applications/Xcode.app/Contents/Developer/Platforms/MacOSX.platform/Developer/SDKs/MacOSX10.15.sdk    -fno-exceptions -fno-rtti -std=c++14 -MD -MT lib/Target/X86/MCTargetDesc/CMakeFiles/LLVMX86Desc.dir/X86IntelInstPrinter.cpp.o -MF lib/Target/X86/MCTargetDesc/CMakeFiles/LLVMX86Desc.dir/X86IntelInstPrinter.cpp.o.d -o lib/Target/X86/MCTargetDesc/CMakeFiles/LLVMX86Desc.dir/X86IntelInstPrinter.cpp.o -c /Users/buildslave/jenkins/workspace/clang-stage2-cmake-RgTSan/llvm-project/llvm/lib/Target/X86/MCTargetDesc/X86IntelInstPrinter.cpp
[2319/2349] /usr/local/bin/sccache /Users/buildslave/jenkins/workspace/clang-stage2-cmake-RgTSan/host-compiler/bin/clang++  -DBUILD_EXAMPLES -DGTEST_HAS_RTTI=0 -D__STDC_CONSTANT_MACROS -D__STDC_FORMAT_MACROS -D__STDC_LIMIT_MACROS -Ilib/Target/X86/MCTargetDesc -I/Users/buildslave/jenkins/workspace/clang-stage2-cmake-RgTSan/llvm-project/llvm/lib/Target/X86/MCTargetDesc -I/Users/buildslave/jenkins/workspace/clang-stage2-cmake-RgTSan/llvm-project/llvm/lib/Target/X86 -Ilib/Target/X86 -Iinclude -I/Users/buildslave/jenkins/workspace/clang-stage2-cmake-RgTSan/llvm-project/llvm/include -fPIC -fvisibility-inlines-hidden -Werror=date-time -Werror=unguarded-availability-new -Wall -Wextra -Wno-unused-parameter -Wwrite-strings -Wcast-qual -Wmissing-field-initializers -pedantic -Wno-long-long -Wc++98-compat-extra-semi -Wimplicit-fallthrough -Wcovered-switch-default -Wno-noexcept-type -Wnon-virtual-dtor -Wdelete-non-virtual-dtor -Wstring-conversion -fno-omit-frame-pointer -fsanitize=thread -fdiagnostics-color -flto=thin -O2 -g -DNDEBUG -isysroot /Applications/Xcode.app/Contents/Developer/Platforms/MacOSX.platform/Developer/SDKs/MacOSX10.15.sdk    -fno-exceptions -fno-rtti -std=c++14 -MD -MT lib/Target/X86/MCTargetDesc/CMakeFiles/LLVMX86Desc.dir/X86InstComments.cpp.o -MF lib/Target/X86/MCTargetDesc/CMakeFiles/LLVMX86Desc.dir/X86InstComments.cpp.o.d -o lib/Target/X86/MCTargetDesc/CMakeFiles/LLVMX86Desc.dir/X86InstComments.cpp.o -c /Users/buildslave/jenkins/workspace/clang-stage2-cmake-RgTSan/llvm-project/llvm/lib/Target/X86/MCTargetDesc/X86InstComments.cpp
[2320/2349] /usr/local/bin/sccache /Users/buildslave/jenkins/workspace/clang-stage2-cmake-RgTSan/host-compiler/bin/clang++  -DBUILD_EXAMPLES -DGTEST_HAS_RTTI=0 -D__STDC_CONSTANT_MACROS -D__STDC_FORMAT_MACROS -D__STDC_LIMIT_MACROS -Ilib/Target/X86/MCTargetDesc -I/Users/buildslave/jenkins/workspace/clang-stage2-cmake-RgTSan/llvm-project/llvm/lib/Target/X86/MCTargetDesc -I/Users/buildslave/jenkins/workspace/clang-stage2-cmake-RgTSan/llvm-project/llvm/lib/Target/X86 -Ilib/Target/X86 -Iinclude -I/Users/buildslave/jenkins/workspace/clang-stage2-cmake-RgTSan/llvm-project/llvm/include -fPIC -fvisibility-inlines-hidden -Werror=date-time -Werror=unguarded-availability-new -Wall -Wextra -Wno-unused-parameter -Wwrite-strings -Wcast-qual -Wmissing-field-initializers -pedantic -Wno-long-long -Wc++98-compat-extra-semi -Wimplicit-fallthrough -Wcovered-switch-default -Wno-noexcept-type -Wnon-virtual-dtor -Wdelete-non-virtual-dtor -Wstring-conversion -fno-omit-frame-pointer -fsanitize=thread -fdiagnostics-color -flto=thin -O2 -g -DNDEBUG -isysroot /Applications/Xcode.app/Contents/Developer/Platforms/MacOSX.platform/Developer/SDKs/MacOSX10.15.sdk    -fno-exceptions -fno-rtti -std=c++14 -MD -MT lib/Target/X86/MCTargetDesc/CMakeFiles/LLVMX86Desc.dir/X86InstPrinterCommon.cpp.o -MF lib/Target/X86/MCTargetDesc/CMakeFiles/LLVMX86Desc.dir/X86InstPrinterCommon.cpp.o.d -o lib/Target/X86/MCTargetDesc/CMakeFiles/LLVMX86Desc.dir/X86InstPrinterCommon.cpp.o -c /Users/buildslave/jenkins/workspace/clang-stage2-cmake-RgTSan/llvm-project/llvm/lib/Target/X86/MCTargetDesc/X86InstPrinterCommon.cpp
[2321/2349] /usr/local/bin/sccache /Users/buildslave/jenkins/workspace/clang-stage2-cmake-RgTSan/host-compiler/bin/clang++  -DBUILD_EXAMPLES -DGTEST_HAS_RTTI=0 -D__STDC_CONSTANT_MACROS -D__STDC_FORMAT_MACROS -D__STDC_LIMIT_MACROS -Ilib/Target/X86/MCTargetDesc -I/Users/buildslave/jenkins/workspace/clang-stage2-cmake-RgTSan/llvm-project/llvm/lib/Target/X86/MCTargetDesc -I/Users/buildslave/jenkins/workspace/clang-stage2-cmake-RgTSan/llvm-project/llvm/lib/Target/X86 -Ilib/Target/X86 -Iinclude -I/Users/buildslave/jenkins/workspace/clang-stage2-cmake-RgTSan/llvm-project/llvm/include -fPIC -fvisibility-inlines-hidden -Werror=date-time -Werror=unguarded-availability-new -Wall -Wextra -Wno-unused-parameter -Wwrite-strings -Wcast-qual -Wmissing-field-initializers -pedantic -Wno-long-long -Wc++98-compat-extra-semi -Wimplicit-fallthrough -Wcovered-switch-default -Wno-noexcept-type -Wnon-virtual-dtor -Wdelete-non-virtual-dtor -Wstring-conversion -fno-omit-frame-pointer -fsanitize=thread -fdiagnostics-color -flto=thin -O2 -g -DNDEBUG -isysroot /Applications/Xcode.app/Contents/Developer/Platforms/MacOSX.platform/Developer/SDKs/MacOSX10.15.sdk    -fno-exceptions -fno-rtti -std=c++14 -MD -MT lib/Target/X86/MCTargetDesc/CMakeFiles/LLVMX86Desc.dir/X86ShuffleDecode.cpp.o -MF lib/Target/X86/MCTargetDesc/CMakeFiles/LLVMX86Desc.dir/X86ShuffleDecode.cpp.o.d -o lib/Target/X86/MCTargetDesc/CMakeFiles/LLVMX86Desc.dir/X86ShuffleDecode.cpp.o -c /Users/buildslave/jenkins/workspace/clang-stage2-cmake-RgTSan/llvm-project/llvm/lib/Target/X86/MCTargetDesc/X86ShuffleDecode.cpp
[2322/2349] /usr/local/bin/sccache /Users/buildslave/jenkins/workspace/clang-stage2-cmake-RgTSan/host-compiler/bin/clang++  -DBUILD_EXAMPLES -DGTEST_HAS_RTTI=0 -D__STDC_CONSTANT_MACROS -D__STDC_FORMAT_MACROS -D__STDC_LIMIT_MACROS -Ilib/Target/X86/MCTargetDesc -I/Users/buildslave/jenkins/workspace/clang-stage2-cmake-RgTSan/llvm-project/llvm/lib/Target/X86/MCTargetDesc -I/Users/buildslave/jenkins/workspace/clang-stage2-cmake-RgTSan/llvm-project/llvm/lib/Target/X86 -Ilib/Target/X86 -Iinclude -I/Users/buildslave/jenkins/workspace/clang-stage2-cmake-RgTSan/llvm-project/llvm/include -fPIC -fvisibility-inlines-hidden -Werror=date-time -Werror=unguarded-availability-new -Wall -Wextra -Wno-unused-parameter -Wwrite-strings -Wcast-qual -Wmissing-field-initializers -pedantic -Wno-long-long -Wc++98-compat-extra-semi -Wimplicit-fallthrough -Wcovered-switch-default -Wno-noexcept-type -Wnon-virtual-dtor -Wdelete-non-virtual-dtor -Wstring-conversion -fno-omit-frame-pointer -fsanitize=thread -fdiagnostics-color -flto=thin -O2 -g -DNDEBUG -isysroot /Applications/Xcode.app/Contents/Developer/Platforms/MacOSX.platform/Developer/SDKs/MacOSX10.15.sdk    -fno-exceptions -fno-rtti -std=c++14 -MD -MT lib/Target/X86/MCTargetDesc/CMakeFiles/LLVMX86Desc.dir/X86AsmBackend.cpp.o -MF lib/Target/X86/MCTargetDesc/CMakeFiles/LLVMX86Desc.dir/X86AsmBackend.cpp.o.d -o lib/Target/X86/MCTargetDesc/CMakeFiles/LLVMX86Desc.dir/X86AsmBackend.cpp.o -c /Users/buildslave/jenkins/workspace/clang-stage2-cmake-RgTSan/llvm-project/llvm/lib/Target/X86/MCTargetDesc/X86AsmBackend.cpp
[2323/2349] /usr/local/bin/sccache /Users/buildslave/jenkins/workspace/clang-stage2-cmake-RgTSan/host-compiler/bin/clang++  -DBUILD_EXAMPLES -DGTEST_HAS_RTTI=0 -D__STDC_CONSTANT_MACROS -D__STDC_FORMAT_MACROS -D__STDC_LIMIT_MACROS -Ilib/Target/X86/MCTargetDesc -I/Users/buildslave/jenkins/workspace/clang-stage2-cmake-RgTSan/llvm-project/llvm/lib/Target/X86/MCTargetDesc -I/Users/buildslave/jenkins/workspace/clang-stage2-cmake-RgTSan/llvm-project/llvm/lib/Target/X86 -Ilib/Target/X86 -Iinclude -I/Users/buildslave/jenkins/workspace/clang-stage2-cmake-RgTSan/llvm-project/llvm/include -fPIC -fvisibility-inlines-hidden -Werror=date-time -Werror=unguarded-availability-new -Wall -Wextra -Wno-unused-parameter -Wwrite-strings -Wcast-qual -Wmissing-field-initializers -pedantic -Wno-long-long -Wc++98-compat-extra-semi -Wimplicit-fallthrough -Wcovered-switch-default -Wno-noexcept-type -Wnon-virtual-dtor -Wdelete-non-virtual-dtor -Wstring-conversion -fno-omit-frame-pointer -fsanitize=thread -fdiagnostics-color -flto=thin -O2 -g -DNDEBUG -isysroot /Applications/Xcode.app/Contents/Developer/Platforms/MacOSX.platform/Developer/SDKs/MacOSX10.15.sdk    -fno-exceptions -fno-rtti -std=c++14 -MD -MT lib/Target/X86/MCTargetDesc/CMakeFiles/LLVMX86Desc.dir/X86MCAsmInfo.cpp.o -MF lib/Target/X86/MCTargetDesc/CMakeFiles/LLVMX86Desc.dir/X86MCAsmInfo.cpp.o.d -o lib/Target/X86/MCTargetDesc/CMakeFiles/LLVMX86Desc.dir/X86MCAsmInfo.cpp.o -c /Users/buildslave/jenkins/workspace/clang-stage2-cmake-RgTSan/llvm-project/llvm/lib/Target/X86/MCTargetDesc/X86MCAsmInfo.cpp
[2324/2349] /usr/local/bin/sccache /Users/buildslave/jenkins/workspace/clang-stage2-cmake-RgTSan/host-compiler/bin/clang++  -DBUILD_EXAMPLES -DGTEST_HAS_RTTI=0 -D__STDC_CONSTANT_MACROS -D__STDC_FORMAT_MACROS -D__STDC_LIMIT_MACROS -Ilib/Target/X86/MCTargetDesc -I/Users/buildslave/jenkins/workspace/clang-stage2-cmake-RgTSan/llvm-project/llvm/lib/Target/X86/MCTargetDesc -I/Users/buildslave/jenkins/workspace/clang-stage2-cmake-RgTSan/llvm-project/llvm/lib/Target/X86 -Ilib/Target/X86 -Iinclude -I/Users/buildslave/jenkins/workspace/clang-stage2-cmake-RgTSan/llvm-project/llvm/include -fPIC -fvisibility-inlines-hidden -Werror=date-time -Werror=unguarded-availability-new -Wall -Wextra -Wno-unused-parameter -Wwrite-strings -Wcast-qual -Wmissing-field-initializers -pedantic -Wno-long-long -Wc++98-compat-extra-semi -Wimplicit-fallthrough -Wcovered-switch-default -Wno-noexcept-type -Wnon-virtual-dtor -Wdelete-non-virtual-dtor -Wstring-conversion -fno-omit-frame-pointer -fsanitize=thread -fdiagnostics-color -flto=thin -O2 -g -DNDEBUG -isysroot /Applications/Xcode.app/Contents/Developer/Platforms/MacOSX.platform/Developer/SDKs/MacOSX10.15.sdk    -fno-exceptions -fno-rtti -std=c++14 -MD -MT lib/Target/X86/MCTargetDesc/CMakeFiles/LLVMX86Desc.dir/X86MCTargetDesc.cpp.o -MF lib/Target/X86/MCTargetDesc/CMakeFiles/LLVMX86Desc.dir/X86MCTargetDesc.cpp.o.d -o lib/Target/X86/MCTargetDesc/CMakeFiles/LLVMX86Desc.dir/X86MCTargetDesc.cpp.o -c /Users/buildslave/jenkins/workspace/clang-stage2-cmake-RgTSan/llvm-project/llvm/lib/Target/X86/MCTargetDesc/X86MCTargetDesc.cpp
[2325/2349] /usr/local/bin/sccache /Users/buildslave/jenkins/workspace/clang-stage2-cmake-RgTSan/host-compiler/bin/clang++  -DBUILD_EXAMPLES -DGTEST_HAS_RTTI=0 -D__STDC_CONSTANT_MACROS -D__STDC_FORMAT_MACROS -D__STDC_LIMIT_MACROS -Ilib/Target/X86/MCTargetDesc -I/Users/buildslave/jenkins/workspace/clang-stage2-cmake-RgTSan/llvm-project/llvm/lib/Target/X86/MCTargetDesc -I/Users/buildslave/jenkins/workspace/clang-stage2-cmake-RgTSan/llvm-project/llvm/lib/Target/X86 -Ilib/Target/X86 -Iinclude -I/Users/buildslave/jenkins/workspace/clang-stage2-cmake-RgTSan/llvm-project/llvm/include -fPIC -fvisibility-inlines-hidden -Werror=date-time -Werror=unguarded-availability-new -Wall -Wextra -Wno-unused-parameter -Wwrite-strings -Wcast-qual -Wmissing-field-initializers -pedantic -Wno-long-long -Wc++98-compat-extra-semi -Wimplicit-fallthrough -Wcovered-switch-default -Wno-noexcept-type -Wnon-virtual-dtor -Wdelete-non-virtual-dtor -Wstring-conversion -fno-omit-frame-pointer -fsanitize=thread -fdiagnostics-color -flto=thin -O2 -g -DNDEBUG -isysroot /Applications/Xcode.app/Contents/Developer/Platforms/MacOSX.platform/Developer/SDKs/MacOSX10.15.sdk    -fno-exceptions -fno-rtti -std=c++14 -MD -MT lib/Target/X86/MCTargetDesc/CMakeFiles/LLVMX86Desc.dir/X86MCCodeEmitter.cpp.o -MF lib/Target/X86/MCTargetDesc/CMakeFiles/LLVMX86Desc.dir/X86MCCodeEmitter.cpp.o.d -o lib/Target/X86/MCTargetDesc/CMakeFiles/LLVMX86Desc.dir/X86MCCodeEmitter.cpp.o -c /Users/buildslave/jenkins/workspace/clang-stage2-cmake-RgTSan/llvm-project/llvm/lib/Target/X86/MCTargetDesc/X86MCCodeEmitter.cpp
[2326/2349] /usr/local/bin/sccache /Users/buildslave/jenkins/workspace/clang-stage2-cmake-RgTSan/host-compiler/bin/clang++  -DBUILD_EXAMPLES -DGTEST_HAS_RTTI=0 -D__STDC_CONSTANT_MACROS -D__STDC_FORMAT_MACROS -D__STDC_LIMIT_MACROS -Ilib/Target/X86/MCTargetDesc -I/Users/buildslave/jenkins/workspace/clang-stage2-cmake-RgTSan/llvm-project/llvm/lib/Target/X86/MCTargetDesc -I/Users/buildslave/jenkins/workspace/clang-stage2-cmake-RgTSan/llvm-project/llvm/lib/Target/X86 -Ilib/Target/X86 -Iinclude -I/Users/buildslave/jenkins/workspace/clang-stage2-cmake-RgTSan/llvm-project/llvm/include -fPIC -fvisibility-inlines-hidden -Werror=date-time -Werror=unguarded-availability-new -Wall -Wextra -Wno-unused-parameter -Wwrite-strings -Wcast-qual -Wmissing-field-initializers -pedantic -Wno-long-long -Wc++98-compat-extra-semi -Wimplicit-fallthrough -Wcovered-switch-default -Wno-noexcept-type -Wnon-virtual-dtor -Wdelete-non-virtual-dtor -Wstring-conversion -fno-omit-frame-pointer -fsanitize=thread -fdiagnostics-color -flto=thin -O2 -g -DNDEBUG -isysroot /Applications/Xcode.app/Contents/Developer/Platforms/MacOSX.platform/Developer/SDKs/MacOSX10.15.sdk    -fno-exceptions -fno-rtti -std=c++14 -MD -MT lib/Target/X86/MCTargetDesc/CMakeFiles/LLVMX86Desc.dir/X86MachObjectWriter.cpp.o -MF lib/Target/X86/MCTargetDesc/CMakeFiles/LLVMX86Desc.dir/X86MachObjectWriter.cpp.o.d -o lib/Target/X86/MCTargetDesc/CMakeFiles/LLVMX86Desc.dir/X86MachObjectWriter.cpp.o -c /Users/buildslave/jenkins/workspace/clang-stage2-cmake-RgTSan/llvm-project/llvm/lib/Target/X86/MCTargetDesc/X86MachObjectWriter.cpp
[2327/2349] /usr/local/bin/sccache /Users/buildslave/jenkins/workspace/clang-stage2-cmake-RgTSan/host-compiler/bin/clang++  -DBUILD_EXAMPLES -DGTEST_HAS_RTTI=0 -D__STDC_CONSTANT_MACROS -D__STDC_FORMAT_MACROS -D__STDC_LIMIT_MACROS -Ilib/Target/X86/MCTargetDesc -I/Users/buildslave/jenkins/workspace/clang-stage2-cmake-RgTSan/llvm-project/llvm/lib/Target/X86/MCTargetDesc -I/Users/buildslave/jenkins/workspace/clang-stage2-cmake-RgTSan/llvm-project/llvm/lib/Target/X86 -Ilib/Target/X86 -Iinclude -I/Users/buildslave/jenkins/workspace/clang-stage2-cmake-RgTSan/llvm-project/llvm/include -fPIC -fvisibility-inlines-hidden -Werror=date-time -Werror=unguarded-availability-new -Wall -Wextra -Wno-unused-parameter -Wwrite-strings -Wcast-qual -Wmissing-field-initializers -pedantic -Wno-long-long -Wc++98-compat-extra-semi -Wimplicit-fallthrough -Wcovered-switch-default -Wno-noexcept-type -Wnon-virtual-dtor -Wdelete-non-virtual-dtor -Wstring-conversion -fno-omit-frame-pointer -fsanitize=thread -fdiagnostics-color -flto=thin -O2 -g -DNDEBUG -isysroot /Applications/Xcode.app/Contents/Developer/Platforms/MacOSX.platform/Developer/SDKs/MacOSX10.15.sdk    -fno-exceptions -fno-rtti -std=c++14 -MD -MT lib/Target/X86/MCTargetDesc/CMakeFiles/LLVMX86Desc.dir/X86ELFObjectWriter.cpp.o -MF lib/Target/X86/MCTargetDesc/CMakeFiles/LLVMX86Desc.dir/X86ELFObjectWriter.cpp.o.d -o lib/Target/X86/MCTargetDesc/CMakeFiles/LLVMX86Desc.dir/X86ELFObjectWriter.cpp.o -c /Users/buildslave/jenkins/workspace/clang-stage2-cmake-RgTSan/llvm-project/llvm/lib/Target/X86/MCTargetDesc/X86ELFObjectWriter.cpp
[2328/2349] /usr/local/bin/sccache /Users/buildslave/jenkins/workspace/clang-stage2-cmake-RgTSan/host-compiler/bin/clang++  -DBUILD_EXAMPLES -DGTEST_HAS_RTTI=0 -D__STDC_CONSTANT_MACROS -D__STDC_FORMAT_MACROS -D__STDC_LIMIT_MACROS -Ilib/Target/X86/MCTargetDesc -I/Users/buildslave/jenkins/workspace/clang-stage2-cmake-RgTSan/llvm-project/llvm/lib/Target/X86/MCTargetDesc -I/Users/buildslave/jenkins/workspace/clang-stage2-cmake-RgTSan/llvm-project/llvm/lib/Target/X86 -Ilib/Target/X86 -Iinclude -I/Users/buildslave/jenkins/workspace/clang-stage2-cmake-RgTSan/llvm-project/llvm/include -fPIC -fvisibility-inlines-hidden -Werror=date-time -Werror=unguarded-availability-new -Wall -Wextra -Wno-unused-parameter -Wwrite-strings -Wcast-qual -Wmissing-field-initializers -pedantic -Wno-long-long -Wc++98-compat-extra-semi -Wimplicit-fallthrough -Wcovered-switch-default -Wno-noexcept-type -Wnon-virtual-dtor -Wdelete-non-virtual-dtor -Wstring-conversion -fno-omit-frame-pointer -fsanitize=thread -fdiagnostics-color -flto=thin -O2 -g -DNDEBUG -isysroot /Applications/Xcode.app/Contents/Developer/Platforms/MacOSX.platform/Developer/SDKs/MacOSX10.15.sdk    -fno-exceptions -fno-rtti -std=c++14 -MD -MT lib/Target/X86/MCTargetDesc/CMakeFiles/LLVMX86Desc.dir/X86WinCOFFObjectWriter.cpp.o -MF lib/Target/X86/MCTargetDesc/CMakeFiles/LLVMX86Desc.dir/X86WinCOFFObjectWriter.cpp.o.d -o lib/Target/X86/MCTargetDesc/CMakeFiles/LLVMX86Desc.dir/X86WinCOFFObjectWriter.cpp.o -c /Users/buildslave/jenkins/workspace/clang-stage2-cmake-RgTSan/llvm-project/llvm/lib/Target/X86/MCTargetDesc/X86WinCOFFObjectWriter.cpp
[2329/2349] /usr/local/bin/sccache /Users/buildslave/jenkins/workspace/clang-stage2-cmake-RgTSan/host-compiler/bin/clang++  -DBUILD_EXAMPLES -DGTEST_HAS_RTTI=0 -D__STDC_CONSTANT_MACROS -D__STDC_FORMAT_MACROS -D__STDC_LIMIT_MACROS -Ilib/Target/X86 -I/Users/buildslave/jenkins/workspace/clang-stage2-cmake-RgTSan/llvm-project/llvm/lib/Target/X86 -Iinclude -I/Users/buildslave/jenkins/workspace/clang-stage2-cmake-RgTSan/llvm-project/llvm/include -fPIC -fvisibility-inlines-hidden -Werror=date-time -Werror=unguarded-availability-new -Wall -Wextra -Wno-unused-parameter -Wwrite-strings -Wcast-qual -Wmissing-field-initializers -pedantic -Wno-long-long -Wc++98-compat-extra-semi -Wimplicit-fallthrough -Wcovered-switch-default -Wno-noexcept-type -Wnon-virtual-dtor -Wdelete-non-virtual-dtor -Wstring-conversion -fno-omit-frame-pointer -fsanitize=thread -fdiagnostics-color -flto=thin -O2 -g -DNDEBUG -isysroot /Applications/Xcode.app/Contents/Developer/Platforms/MacOSX.platform/Developer/SDKs/MacOSX10.15.sdk    -fno-exceptions -fno-rtti -std=c++14 -MD -MT lib/Target/X86/CMakeFiles/LLVMX86CodeGen.dir/X86WinEHState.cpp.o -MF lib/Target/X86/CMakeFiles/LLVMX86CodeGen.dir/X86WinEHState.cpp.o.d -o lib/Target/X86/CMakeFiles/LLVMX86CodeGen.dir/X86WinEHState.cpp.o -c /Users/buildslave/jenkins/workspace/clang-stage2-cmake-RgTSan/llvm-project/llvm/lib/Target/X86/X86WinEHState.cpp
[2330/2349] /usr/local/bin/sccache /Users/buildslave/jenkins/workspace/clang-stage2-cmake-RgTSan/host-compiler/bin/clang++  -DBUILD_EXAMPLES -DGTEST_HAS_RTTI=0 -D__STDC_CONSTANT_MACROS -D__STDC_FORMAT_MACROS -D__STDC_LIMIT_MACROS -Ilib/Target/X86/TargetInfo -I/Users/buildslave/jenkins/workspace/clang-stage2-cmake-RgTSan/llvm-project/llvm/lib/Target/X86/TargetInfo -I/Users/buildslave/jenkins/workspace/clang-stage2-cmake-RgTSan/llvm-project/llvm/lib/Target/X86 -Ilib/Target/X86 -Iinclude -I/Users/buildslave/jenkins/workspace/clang-stage2-cmake-RgTSan/llvm-project/llvm/include -fPIC -fvisibility-inlines-hidden -Werror=date-time -Werror=unguarded-availability-new -Wall -Wextra -Wno-unused-parameter -Wwrite-strings -Wcast-qual -Wmissing-field-initializers -pedantic -Wno-long-long -Wc++98-compat-extra-semi -Wimplicit-fallthrough -Wcovered-switch-default -Wno-noexcept-type -Wnon-virtual-dtor -Wdelete-non-virtual-dtor -Wstring-conversion -fno-omit-frame-pointer -fsanitize=thread -fdiagnostics-color -flto=thin -O2 -g -DNDEBUG -isysroot /Applications/Xcode.app/Contents/Developer/Platforms/MacOSX.platform/Developer/SDKs/MacOSX10.15.sdk    -fno-exceptions -fno-rtti -std=c++14 -MD -MT lib/Target/X86/TargetInfo/CMakeFiles/LLVMX86Info.dir/X86TargetInfo.cpp.o -MF lib/Target/X86/TargetInfo/CMakeFiles/LLVMX86Info.dir/X86TargetInfo.cpp.o.d -o lib/Target/X86/TargetInfo/CMakeFiles/LLVMX86Info.dir/X86TargetInfo.cpp.o -c /Users/buildslave/jenkins/workspace/clang-stage2-cmake-RgTSan/llvm-project/llvm/lib/Target/X86/TargetInfo/X86TargetInfo.cpp
[2331/2349] /usr/local/bin/sccache /Users/buildslave/jenkins/workspace/clang-stage2-cmake-RgTSan/host-compiler/bin/clang++  -DBUILD_EXAMPLES -DGTEST_HAS_RTTI=0 -D__STDC_CONSTANT_MACROS -D__STDC_FORMAT_MACROS -D__STDC_LIMIT_MACROS -Ilib/Target/X86/MCTargetDesc -I/Users/buildslave/jenkins/workspace/clang-stage2-cmake-RgTSan/llvm-project/llvm/lib/Target/X86/MCTargetDesc -I/Users/buildslave/jenkins/workspace/clang-stage2-cmake-RgTSan/llvm-project/llvm/lib/Target/X86 -Ilib/Target/X86 -Iinclude -I/Users/buildslave/jenkins/workspace/clang-stage2-cmake-RgTSan/llvm-project/llvm/include -fPIC -fvisibility-inlines-hidden -Werror=date-time -Werror=unguarded-availability-new -Wall -Wextra -Wno-unused-parameter -Wwrite-strings -Wcast-qual -Wmissing-field-initializers -pedantic -Wno-long-long -Wc++98-compat-extra-semi -Wimplicit-fallthrough -Wcovered-switch-default -Wno-noexcept-type -Wnon-virtual-dtor -Wdelete-non-virtual-dtor -Wstring-conversion -fno-omit-frame-pointer -fsanitize=thread -fdiagnostics-color -flto=thin -O2 -g -DNDEBUG -isysroot /Applications/Xcode.app/Contents/Developer/Platforms/MacOSX.platform/Developer/SDKs/MacOSX10.15.sdk    -fno-exceptions -fno-rtti -std=c++14 -MD -MT lib/Target/X86/MCTargetDesc/CMakeFiles/LLVMX86Desc.dir/X86WinCOFFStreamer.cpp.o -MF lib/Target/X86/MCTargetDesc/CMakeFiles/LLVMX86Desc.dir/X86WinCOFFStreamer.cpp.o.d -o lib/Target/X86/MCTargetDesc/CMakeFiles/LLVMX86Desc.dir/X86WinCOFFStreamer.cpp.o -c /Users/buildslave/jenkins/workspace/clang-stage2-cmake-RgTSan/llvm-project/llvm/lib/Target/X86/MCTargetDesc/X86WinCOFFStreamer.cpp
[2332/2349] /usr/local/bin/sccache /Users/buildslave/jenkins/workspace/clang-stage2-cmake-RgTSan/host-compiler/bin/clang++  -DBUILD_EXAMPLES -DGTEST_HAS_RTTI=0 -D__STDC_CONSTANT_MACROS -D__STDC_FORMAT_MACROS -D__STDC_LIMIT_MACROS -Itools/lto -I/Users/buildslave/jenkins/workspace/clang-stage2-cmake-RgTSan/llvm-project/llvm/tools/lto -Iinclude -I/Users/buildslave/jenkins/workspace/clang-stage2-cmake-RgTSan/llvm-project/llvm/include -fPIC -fvisibility-inlines-hidden -Werror=date-time -Werror=unguarded-availability-new -Wall -Wextra -Wno-unused-parameter -Wwrite-strings -Wcast-qual -Wmissing-field-initializers -pedantic -Wno-long-long -Wc++98-compat-extra-semi -Wimplicit-fallthrough -Wcovered-switch-default -Wno-noexcept-type -Wnon-virtual-dtor -Wdelete-non-virtual-dtor -Wstring-conversion -fno-omit-frame-pointer -fsanitize=thread -fdiagnostics-color -flto=thin -O2 -g -DNDEBUG -isysroot /Applications/Xcode.app/Contents/Developer/Platforms/MacOSX.platform/Developer/SDKs/MacOSX10.15.sdk -fPIC    -fno-exceptions -fno-rtti -std=c++14 -MD -MT tools/lto/CMakeFiles/LTO.dir/LTODisassembler.cpp.o -MF tools/lto/CMakeFiles/LTO.dir/LTODisassembler.cpp.o.d -o tools/lto/CMakeFiles/LTO.dir/LTODisassembler.cpp.o -c /Users/buildslave/jenkins/workspace/clang-stage2-cmake-RgTSan/llvm-project/llvm/tools/lto/LTODisassembler.cpp
[2333/2349] /usr/local/bin/sccache /Users/buildslave/jenkins/workspace/clang-stage2-cmake-RgTSan/host-compiler/bin/clang++  -DBUILD_EXAMPLES -DGTEST_HAS_RTTI=0 -D__STDC_CONSTANT_MACROS -D__STDC_FORMAT_MACROS -D__STDC_LIMIT_MACROS -Ilib/Target/X86/MCTargetDesc -I/Users/buildslave/jenkins/workspace/clang-stage2-cmake-RgTSan/llvm-project/llvm/lib/Target/X86/MCTargetDesc -I/Users/buildslave/jenkins/workspace/clang-stage2-cmake-RgTSan/llvm-project/llvm/lib/Target/X86 -Ilib/Target/X86 -Iinclude -I/Users/buildslave/jenkins/workspace/clang-stage2-cmake-RgTSan/llvm-project/llvm/include -fPIC -fvisibility-inlines-hidden -Werror=date-time -Werror=unguarded-availability-new -Wall -Wextra -Wno-unused-parameter -Wwrite-strings -Wcast-qual -Wmissing-field-initializers -pedantic -Wno-long-long -Wc++98-compat-extra-semi -Wimplicit-fallthrough -Wcovered-switch-default -Wno-noexcept-type -Wnon-virtual-dtor -Wdelete-non-virtual-dtor -Wstring-conversion -fno-omit-frame-pointer -fsanitize=thread -fdiagnostics-color -flto=thin -O2 -g -DNDEBUG -isysroot /Applications/Xcode.app/Contents/Developer/Platforms/MacOSX.platform/Developer/SDKs/MacOSX10.15.sdk    -fno-exceptions -fno-rtti -std=c++14 -MD -MT lib/Target/X86/MCTargetDesc/CMakeFiles/LLVMX86Desc.dir/X86WinCOFFTargetStreamer.cpp.o -MF lib/Target/X86/MCTargetDesc/CMakeFiles/LLVMX86Desc.dir/X86WinCOFFTargetStreamer.cpp.o.d -o lib/Target/X86/MCTargetDesc/CMakeFiles/LLVMX86Desc.dir/X86WinCOFFTargetStreamer.cpp.o -c /Users/buildslave/jenkins/workspace/clang-stage2-cmake-RgTSan/llvm-project/llvm/lib/Target/X86/MCTargetDesc/X86WinCOFFTargetStreamer.cpp
[2334/2349] /usr/local/bin/sccache /Users/buildslave/jenkins/workspace/clang-stage2-cmake-RgTSan/host-compiler/bin/clang++  -DBUILD_EXAMPLES -DGTEST_HAS_RTTI=0 -D__STDC_CONSTANT_MACROS -D__STDC_FORMAT_MACROS -D__STDC_LIMIT_MACROS -Ilib/Target/X86 -I/Users/buildslave/jenkins/workspace/clang-stage2-cmake-RgTSan/llvm-project/llvm/lib/Target/X86 -Iinclude -I/Users/buildslave/jenkins/workspace/clang-stage2-cmake-RgTSan/llvm-project/llvm/include -fPIC -fvisibility-inlines-hidden -Werror=date-time -Werror=unguarded-availability-new -Wall -Wextra -Wno-unused-parameter -Wwrite-strings -Wcast-qual -Wmissing-field-initializers -pedantic -Wno-long-long -Wc++98-compat-extra-semi -Wimplicit-fallthrough -Wcovered-switch-default -Wno-noexcept-type -Wnon-virtual-dtor -Wdelete-non-virtual-dtor -Wstring-conversion -fno-omit-frame-pointer -fsanitize=thread -fdiagnostics-color -flto=thin -O2 -g -DNDEBUG -isysroot /Applications/Xcode.app/Contents/Developer/Platforms/MacOSX.platform/Developer/SDKs/MacOSX10.15.sdk    -fno-exceptions -fno-rtti -std=c++14 -MD -MT lib/Target/X86/CMakeFiles/LLVMX86CodeGen.dir/X86WinAllocaExpander.cpp.o -MF lib/Target/X86/CMakeFiles/LLVMX86CodeGen.dir/X86WinAllocaExpander.cpp.o.d -o lib/Target/X86/CMakeFiles/LLVMX86CodeGen.dir/X86WinAllocaExpander.cpp.o -c /Users/buildslave/jenkins/workspace/clang-stage2-cmake-RgTSan/llvm-project/llvm/lib/Target/X86/X86WinAllocaExpander.cpp
[2335/2349] : && DYLD_LIBRARY_PATH=/Users/buildslave/jenkins/workspace/clang-stage2-cmake-RgTSan/host-compiler/lib/ "/Applications/Xcode.app/Contents/Developer/Toolchains/XcodeDefault.xctoolchain/usr/bin/libtool" -static -no_warning_for_no_symbols -o lib/libLLVMPasses.a  lib/Passes/CMakeFiles/LLVMPasses.dir/PassBuilder.cpp.o lib/Passes/CMakeFiles/LLVMPasses.dir/PassBuilderBindings.cpp.o lib/Passes/CMakeFiles/LLVMPasses.dir/PassPlugin.cpp.o lib/Passes/CMakeFiles/LLVMPasses.dir/StandardInstrumentations.cpp.o && :
[2336/2349] : && DYLD_LIBRARY_PATH=/Users/buildslave/jenkins/workspace/clang-stage2-cmake-RgTSan/host-compiler/lib/ "/Applications/Xcode.app/Contents/Developer/Toolchains/XcodeDefault.xctoolchain/usr/bin/libtool" -static -no_warning_for_no_symbols -o lib/libLLVMX86Info.a  lib/Target/X86/TargetInfo/CMakeFiles/LLVMX86Info.dir/X86TargetInfo.cpp.o && :
[2337/2349] : && DYLD_LIBRARY_PATH=/Users/buildslave/jenkins/workspace/clang-stage2-cmake-RgTSan/host-compiler/lib/ "/Applications/Xcode.app/Contents/Developer/Toolchains/XcodeDefault.xctoolchain/usr/bin/libtool" -static -no_warning_for_no_symbols -o lib/libLLVMXCoreCodeGen.a  lib/Target/XCore/CMakeFiles/LLVMXCoreCodeGen.dir/XCoreAsmPrinter.cpp.o lib/Target/XCore/CMakeFiles/LLVMXCoreCodeGen.dir/XCoreFrameLowering.cpp.o lib/Target/XCore/CMakeFiles/LLVMXCoreCodeGen.dir/XCoreInstrInfo.cpp.o lib/Target/XCore/CMakeFiles/LLVMXCoreCodeGen.dir/XCoreISelDAGToDAG.cpp.o lib/Target/XCore/CMakeFiles/LLVMXCoreCodeGen.dir/XCoreISelLowering.cpp.o lib/Target/XCore/CMakeFiles/LLVMXCoreCodeGen.dir/XCoreLowerThreadLocal.cpp.o lib/Target/XCore/CMakeFiles/LLVMXCoreCodeGen.dir/XCoreMachineFunctionInfo.cpp.o lib/Target/XCore/CMakeFiles/LLVMXCoreCodeGen.dir/XCoreMCInstLower.cpp.o lib/Target/XCore/CMakeFiles/LLVMXCoreCodeGen.dir/XCoreRegisterInfo.cpp.o lib/Target/XCore/CMakeFiles/LLVMXCoreCodeGen.dir/XCoreSubtarget.cpp.o lib/Target/XCore/CMakeFiles/LLVMXCoreCodeGen.dir/XCoreTargetMachine.cpp.o lib/Target/XCore/CMakeFiles/LLVMXCoreCodeGen.dir/XCoreTargetObjectFile.cpp.o lib/Target/XCore/CMakeFiles/LLVMXCoreCodeGen.dir/XCoreSelectionDAGInfo.cpp.o lib/Target/XCore/CMakeFiles/LLVMXCoreCodeGen.dir/XCoreFrameToArgsOffsetElim.cpp.o && :
[2338/2349] /usr/local/bin/sccache /Users/buildslave/jenkins/workspace/clang-stage2-cmake-RgTSan/host-compiler/bin/clang++  -DBUILD_EXAMPLES -DGTEST_HAS_RTTI=0 -D__STDC_CONSTANT_MACROS -D__STDC_FORMAT_MACROS -D__STDC_LIMIT_MACROS -Ilib/Target/X86 -I/Users/buildslave/jenkins/workspace/clang-stage2-cmake-RgTSan/llvm-project/llvm/lib/Target/X86 -Iinclude -I/Users/buildslave/jenkins/workspace/clang-stage2-cmake-RgTSan/llvm-project/llvm/include -fPIC -fvisibility-inlines-hidden -Werror=date-time -Werror=unguarded-availability-new -Wall -Wextra -Wno-unused-parameter -Wwrite-strings -Wcast-qual -Wmissing-field-initializers -pedantic -Wno-long-long -Wc++98-compat-extra-semi -Wimplicit-fallthrough -Wcovered-switch-default -Wno-noexcept-type -Wnon-virtual-dtor -Wdelete-non-virtual-dtor -Wstring-conversion -fno-omit-frame-pointer -fsanitize=thread -fdiagnostics-color -flto=thin -O2 -g -DNDEBUG -isysroot /Applications/Xcode.app/Contents/Developer/Platforms/MacOSX.platform/Developer/SDKs/MacOSX10.15.sdk    -fno-exceptions -fno-rtti -std=c++14 -MD -MT lib/Target/X86/CMakeFiles/LLVMX86CodeGen.dir/X86TargetMachine.cpp.o -MF lib/Target/X86/CMakeFiles/LLVMX86CodeGen.dir/X86TargetMachine.cpp.o.d -o lib/Target/X86/CMakeFiles/LLVMX86CodeGen.dir/X86TargetMachine.cpp.o -c /Users/buildslave/jenkins/workspace/clang-stage2-cmake-RgTSan/llvm-project/llvm/lib/Target/X86/X86TargetMachine.cpp
[2339/2349] /usr/local/bin/sccache /Users/buildslave/jenkins/workspace/clang-stage2-cmake-RgTSan/host-compiler/bin/clang++  -DBUILD_EXAMPLES -DGTEST_HAS_RTTI=0 -D__STDC_CONSTANT_MACROS -D__STDC_FORMAT_MACROS -D__STDC_LIMIT_MACROS -Ilib/Target/X86 -I/Users/buildslave/jenkins/workspace/clang-stage2-cmake-RgTSan/llvm-project/llvm/lib/Target/X86 -Iinclude -I/Users/buildslave/jenkins/workspace/clang-stage2-cmake-RgTSan/llvm-project/llvm/include -fPIC -fvisibility-inlines-hidden -Werror=date-time -Werror=unguarded-availability-new -Wall -Wextra -Wno-unused-parameter -Wwrite-strings -Wcast-qual -Wmissing-field-initializers -pedantic -Wno-long-long -Wc++98-compat-extra-semi -Wimplicit-fallthrough -Wcovered-switch-default -Wno-noexcept-type -Wnon-virtual-dtor -Wdelete-non-virtual-dtor -Wstring-conversion -fno-omit-frame-pointer -fsanitize=thread -fdiagnostics-color -flto=thin -O2 -g -DNDEBUG -isysroot /Applications/Xcode.app/Contents/Developer/Platforms/MacOSX.platform/Developer/SDKs/MacOSX10.15.sdk    -fno-exceptions -fno-rtti -std=c++14 -MD -MT lib/Target/X86/CMakeFiles/LLVMX86CodeGen.dir/X86InsertWait.cpp.o -MF lib/Target/X86/CMakeFiles/LLVMX86CodeGen.dir/X86InsertWait.cpp.o.d -o lib/Target/X86/CMakeFiles/LLVMX86CodeGen.dir/X86InsertWait.cpp.o -c /Users/buildslave/jenkins/workspace/clang-stage2-cmake-RgTSan/llvm-project/llvm/lib/Target/X86/X86InsertWait.cpp
[2340/2349] : && DYLD_LIBRARY_PATH=/Users/buildslave/jenkins/workspace/clang-stage2-cmake-RgTSan/host-compiler/lib/ "/Applications/Xcode.app/Contents/Developer/Toolchains/XcodeDefault.xctoolchain/usr/bin/libtool" -static -no_warning_for_no_symbols -o lib/libLLVMLTO.a  lib/LTO/CMakeFiles/LLVMLTO.dir/Caching.cpp.o lib/LTO/CMakeFiles/LLVMLTO.dir/LTO.cpp.o lib/LTO/CMakeFiles/LLVMLTO.dir/LTOBackend.cpp.o lib/LTO/CMakeFiles/LLVMLTO.dir/LTOModule.cpp.o lib/LTO/CMakeFiles/LLVMLTO.dir/LTOCodeGenerator.cpp.o lib/LTO/CMakeFiles/LLVMLTO.dir/SummaryBasedOptimizations.cpp.o lib/LTO/CMakeFiles/LLVMLTO.dir/UpdateCompilerUsed.cpp.o lib/LTO/CMakeFiles/LLVMLTO.dir/ThinLTOCodeGenerator.cpp.o && :
[2341/2349] /usr/local/bin/sccache /Users/buildslave/jenkins/workspace/clang-stage2-cmake-RgTSan/host-compiler/bin/clang++  -DBUILD_EXAMPLES -DGTEST_HAS_RTTI=0 -D__STDC_CONSTANT_MACROS -D__STDC_FORMAT_MACROS -D__STDC_LIMIT_MACROS -Ilib/Target/X86 -I/Users/buildslave/jenkins/workspace/clang-stage2-cmake-RgTSan/llvm-project/llvm/lib/Target/X86 -Iinclude -I/Users/buildslave/jenkins/workspace/clang-stage2-cmake-RgTSan/llvm-project/llvm/include -fPIC -fvisibility-inlines-hidden -Werror=date-time -Werror=unguarded-availability-new -Wall -Wextra -Wno-unused-parameter -Wwrite-strings -Wcast-qual -Wmissing-field-initializers -pedantic -Wno-long-long -Wc++98-compat-extra-semi -Wimplicit-fallthrough -Wcovered-switch-default -Wno-noexcept-type -Wnon-virtual-dtor -Wdelete-non-virtual-dtor -Wstring-conversion -fno-omit-frame-pointer -fsanitize=thread -fdiagnostics-color -flto=thin -O2 -g -DNDEBUG -isysroot /Applications/Xcode.app/Contents/Developer/Platforms/MacOSX.platform/Developer/SDKs/MacOSX10.15.sdk    -fno-exceptions -fno-rtti -std=c++14 -MD -MT lib/Target/X86/CMakeFiles/LLVMX86CodeGen.dir/X86TargetTransformInfo.cpp.o -MF lib/Target/X86/CMakeFiles/LLVMX86CodeGen.dir/X86TargetTransformInfo.cpp.o.d -o lib/Target/X86/CMakeFiles/LLVMX86CodeGen.dir/X86TargetTransformInfo.cpp.o -c /Users/buildslave/jenkins/workspace/clang-stage2-cmake-RgTSan/llvm-project/llvm/lib/Target/X86/X86TargetTransformInfo.cpp
[2342/2349] : && DYLD_LIBRARY_PATH=/Users/buildslave/jenkins/workspace/clang-stage2-cmake-RgTSan/host-compiler/lib/ "/Applications/Xcode.app/Contents/Developer/Toolchains/XcodeDefault.xctoolchain/usr/bin/libtool" -static -no_warning_for_no_symbols -o lib/libLLVMX86Disassembler.a  lib/Target/X86/Disassembler/CMakeFiles/LLVMX86Disassembler.dir/X86Disassembler.cpp.o && :
[2343/2349] : && DYLD_LIBRARY_PATH=/Users/buildslave/jenkins/workspace/clang-stage2-cmake-RgTSan/host-compiler/lib/ "/Applications/Xcode.app/Contents/Developer/Toolchains/XcodeDefault.xctoolchain/usr/bin/libtool" -static -no_warning_for_no_symbols -o lib/libLLVMX86Desc.a  lib/Target/X86/MCTargetDesc/CMakeFiles/LLVMX86Desc.dir/X86ATTInstPrinter.cpp.o lib/Target/X86/MCTargetDesc/CMakeFiles/LLVMX86Desc.dir/X86IntelInstPrinter.cpp.o lib/Target/X86/MCTargetDesc/CMakeFiles/LLVMX86Desc.dir/X86InstComments.cpp.o lib/Target/X86/MCTargetDesc/CMakeFiles/LLVMX86Desc.dir/X86InstPrinterCommon.cpp.o lib/Target/X86/MCTargetDesc/CMakeFiles/LLVMX86Desc.dir/X86ShuffleDecode.cpp.o lib/Target/X86/MCTargetDesc/CMakeFiles/LLVMX86Desc.dir/X86AsmBackend.cpp.o lib/Target/X86/MCTargetDesc/CMakeFiles/LLVMX86Desc.dir/X86MCTargetDesc.cpp.o lib/Target/X86/MCTargetDesc/CMakeFiles/LLVMX86Desc.dir/X86MCAsmInfo.cpp.o lib/Target/X86/MCTargetDesc/CMakeFiles/LLVMX86Desc.dir/X86MCCodeEmitter.cpp.o lib/Target/X86/MCTargetDesc/CMakeFiles/LLVMX86Desc.dir/X86MachObjectWriter.cpp.o lib/Target/X86/MCTargetDesc/CMakeFiles/LLVMX86Desc.dir/X86ELFObjectWriter.cpp.o lib/Target/X86/MCTargetDesc/CMakeFiles/LLVMX86Desc.dir/X86WinCOFFObjectWriter.cpp.o lib/Target/X86/MCTargetDesc/CMakeFiles/LLVMX86Desc.dir/X86WinCOFFStreamer.cpp.o lib/Target/X86/MCTargetDesc/CMakeFiles/LLVMX86Desc.dir/X86WinCOFFTargetStreamer.cpp.o && :
[2344/2349] : && DYLD_LIBRARY_PATH=/Users/buildslave/jenkins/workspace/clang-stage2-cmake-RgTSan/host-compiler/lib/ "/Applications/Xcode.app/Contents/Developer/Toolchains/XcodeDefault.xctoolchain/usr/bin/libtool" -static -no_warning_for_no_symbols -o lib/libLLVMX86AsmParser.a  lib/Target/X86/AsmParser/CMakeFiles/LLVMX86AsmParser.dir/X86AsmParser.cpp.o && :
[2345/2349] /usr/local/bin/sccache /Users/buildslave/jenkins/workspace/clang-stage2-cmake-RgTSan/host-compiler/bin/clang++  -DBUILD_EXAMPLES -DGTEST_HAS_RTTI=0 -D__STDC_CONSTANT_MACROS -D__STDC_FORMAT_MACROS -D__STDC_LIMIT_MACROS -Ilib/Target/X86 -I/Users/buildslave/jenkins/workspace/clang-stage2-cmake-RgTSan/llvm-project/llvm/lib/Target/X86 -Iinclude -I/Users/buildslave/jenkins/workspace/clang-stage2-cmake-RgTSan/llvm-project/llvm/include -fPIC -fvisibility-inlines-hidden -Werror=date-time -Werror=unguarded-availability-new -Wall -Wextra -Wno-unused-parameter -Wwrite-strings -Wcast-qual -Wmissing-field-initializers -pedantic -Wno-long-long -Wc++98-compat-extra-semi -Wimplicit-fallthrough -Wcovered-switch-default -Wno-noexcept-type -Wnon-virtual-dtor -Wdelete-non-virtual-dtor -Wstring-conversion -fno-omit-frame-pointer -fsanitize=thread -fdiagnostics-color -flto=thin -O2 -g -DNDEBUG -isysroot /Applications/Xcode.app/Contents/Developer/Platforms/MacOSX.platform/Developer/SDKs/MacOSX10.15.sdk    -fno-exceptions -fno-rtti -std=c++14 -MD -MT lib/Target/X86/CMakeFiles/LLVMX86CodeGen.dir/X86ISelLowering.cpp.o -MF lib/Target/X86/CMakeFiles/LLVMX86CodeGen.dir/X86ISelLowering.cpp.o.d -o lib/Target/X86/CMakeFiles/LLVMX86CodeGen.dir/X86ISelLowering.cpp.o -c /Users/buildslave/jenkins/workspace/clang-stage2-cmake-RgTSan/llvm-project/llvm/lib/Target/X86/X86ISelLowering.cpp
[2346/2349] /usr/local/bin/sccache /Users/buildslave/jenkins/workspace/clang-stage2-cmake-RgTSan/host-compiler/bin/clang++  -DBUILD_EXAMPLES -DGTEST_HAS_RTTI=0 -D__STDC_CONSTANT_MACROS -D__STDC_FORMAT_MACROS -D__STDC_LIMIT_MACROS -Itools/lto -I/Users/buildslave/jenkins/workspace/clang-stage2-cmake-RgTSan/llvm-project/llvm/tools/lto -Iinclude -I/Users/buildslave/jenkins/workspace/clang-stage2-cmake-RgTSan/llvm-project/llvm/include -fPIC -fvisibility-inlines-hidden -Werror=date-time -Werror=unguarded-availability-new -Wall -Wextra -Wno-unused-parameter -Wwrite-strings -Wcast-qual -Wmissing-field-initializers -pedantic -Wno-long-long -Wc++98-compat-extra-semi -Wimplicit-fallthrough -Wcovered-switch-default -Wno-noexcept-type -Wnon-virtual-dtor -Wdelete-non-virtual-dtor -Wstring-conversion -fno-omit-frame-pointer -fsanitize=thread -fdiagnostics-color -flto=thin -O2 -g -DNDEBUG -isysroot /Applications/Xcode.app/Contents/Developer/Platforms/MacOSX.platform/Developer/SDKs/MacOSX10.15.sdk -fPIC    -fno-exceptions -fno-rtti -std=c++14 -MD -MT tools/lto/CMakeFiles/LTO.dir/lto.cpp.o -MF tools/lto/CMakeFiles/LTO.dir/lto.cpp.o.d -o tools/lto/CMakeFiles/LTO.dir/lto.cpp.o -c /Users/buildslave/jenkins/workspace/clang-stage2-cmake-RgTSan/llvm-project/llvm/tools/lto/lto.cpp
[2347/2349] : && DYLD_LIBRARY_PATH=/Users/buildslave/jenkins/workspace/clang-stage2-cmake-RgTSan/host-compiler/lib/ "/Applications/Xcode.app/Contents/Developer/Toolchains/XcodeDefault.xctoolchain/usr/bin/libtool" -static -no_warning_for_no_symbols -o lib/libLLVMX86CodeGen.a  lib/Target/X86/CMakeFiles/LLVMX86CodeGen.dir/X86AsmPrinter.cpp.o lib/Target/X86/CMakeFiles/LLVMX86CodeGen.dir/X86AvoidTrailingCall.cpp.o lib/Target/X86/CMakeFiles/LLVMX86CodeGen.dir/X86CallFrameOptimization.cpp.o lib/Target/X86/CMakeFiles/LLVMX86CodeGen.dir/X86CallingConv.cpp.o lib/Target/X86/CMakeFiles/LLVMX86CodeGen.dir/X86CallLowering.cpp.o lib/Target/X86/CMakeFiles/LLVMX86CodeGen.dir/X86CmovConversion.cpp.o lib/Target/X86/CMakeFiles/LLVMX86CodeGen.dir/X86DomainReassignment.cpp.o lib/Target/X86/CMakeFiles/LLVMX86CodeGen.dir/X86DiscriminateMemOps.cpp.o lib/Target/X86/CMakeFiles/LLVMX86CodeGen.dir/X86LowerTileCopy.cpp.o lib/Target/X86/CMakeFiles/LLVMX86CodeGen.dir/X86LowerAMXType.cpp.o lib/Target/X86/CMakeFiles/LLVMX86CodeGen.dir/X86PreAMXConfig.cpp.o lib/Target/X86/CMakeFiles/LLVMX86CodeGen.dir/X86LowerAMXIntrinsics.cpp.o lib/Target/X86/CMakeFiles/LLVMX86CodeGen.dir/X86TileConfig.cpp.o lib/Target/X86/CMakeFiles/LLVMX86CodeGen.dir/X86FastTileConfig.cpp.o lib/Target/X86/CMakeFiles/LLVMX86CodeGen.dir/X86PreTileConfig.cpp.o lib/Target/X86/CMakeFiles/LLVMX86CodeGen.dir/X86ExpandPseudo.cpp.o lib/Target/X86/CMakeFiles/LLVMX86CodeGen.dir/X86FastISel.cpp.o lib/Target/X86/CMakeFiles/LLVMX86CodeGen.dir/X86FixupBWInsts.cpp.o lib/Target/X86/CMakeFiles/LLVMX86CodeGen.dir/X86FixupLEAs.cpp.o lib/Target/X86/CMakeFiles/LLVMX86CodeGen.dir/X86AvoidStoreForwardingBlocks.cpp.o lib/Target/X86/CMakeFiles/LLVMX86CodeGen.dir/X86FixupSetCC.cpp.o lib/Target/X86/CMakeFiles/LLVMX86CodeGen.dir/X86FlagsCopyLowering.cpp.o lib/Target/X86/CMakeFiles/LLVMX86CodeGen.dir/X86FloatingPoint.cpp.o lib/Target/X86/CMakeFiles/LLVMX86CodeGen.dir/X86FrameLowering.cpp.o lib/Target/X86/CMakeFiles/LLVMX86CodeGen.dir/X86InstructionSelector.cpp.o lib/Target/X86/CMakeFiles/LLVMX86CodeGen.dir/X86ISelDAGToDAG.cpp.o lib/Target/X86/CMakeFiles/LLVMX86CodeGen.dir/X86ISelLowering.cpp.o lib/Target/X86/CMakeFiles/LLVMX86CodeGen.dir/X86IndirectBranchTracking.cpp.o lib/Target/X86/CMakeFiles/LLVMX86CodeGen.dir/X86IndirectThunks.cpp.o lib/Target/X86/CMakeFiles/LLVMX86CodeGen.dir/X86InterleavedAccess.cpp.o lib/Target/X86/CMakeFiles/LLVMX86CodeGen.dir/X86InsertPrefetch.cpp.o lib/Target/X86/CMakeFiles/LLVMX86CodeGen.dir/X86InstCombineIntrinsic.cpp.o lib/Target/X86/CMakeFiles/LLVMX86CodeGen.dir/X86InstrFMA3Info.cpp.o lib/Target/X86/CMakeFiles/LLVMX86CodeGen.dir/X86InstrFoldTables.cpp.o lib/Target/X86/CMakeFiles/LLVMX86CodeGen.dir/X86InstrInfo.cpp.o lib/Target/X86/CMakeFiles/LLVMX86CodeGen.dir/X86EvexToVex.cpp.o lib/Target/X86/CMakeFiles/LLVMX86CodeGen.dir/X86LegalizerInfo.cpp.o lib/Target/X86/CMakeFiles/LLVMX86CodeGen.dir/X86LoadValueInjectionLoadHardening.cpp.o lib/Target/X86/CMakeFiles/LLVMX86CodeGen.dir/X86LoadValueInjectionRetHardening.cpp.o lib/Target/X86/CMakeFiles/LLVMX86CodeGen.dir/X86MCInstLower.cpp.o lib/Target/X86/CMakeFiles/LLVMX86CodeGen.dir/X86MachineFunctionInfo.cpp.o lib/Target/X86/CMakeFiles/LLVMX86CodeGen.dir/X86MacroFusion.cpp.o lib/Target/X86/CMakeFiles/LLVMX86CodeGen.dir/X86OptimizeLEAs.cpp.o lib/Target/X86/CMakeFiles/LLVMX86CodeGen.dir/X86PadShortFunction.cpp.o lib/Target/X86/CMakeFiles/LLVMX86CodeGen.dir/X86PartialReduction.cpp.o lib/Target/X86/CMakeFiles/LLVMX86CodeGen.dir/X86RegisterBankInfo.cpp.o lib/Target/X86/CMakeFiles/LLVMX86CodeGen.dir/X86RegisterInfo.cpp.o lib/Target/X86/CMakeFiles/LLVMX86CodeGen.dir/X86SelectionDAGInfo.cpp.o lib/Target/X86/CMakeFiles/LLVMX86CodeGen.dir/X86ShuffleDecodeConstantPool.cpp.o lib/Target/X86/CMakeFiles/LLVMX86CodeGen.dir/X86SpeculativeLoadHardening.cpp.o lib/Target/X86/CMakeFiles/LLVMX86CodeGen.dir/X86SpeculativeExecutionSideEffectSuppression.cpp.o lib/Target/X86/CMakeFiles/LLVMX86CodeGen.dir/X86Subtarget.cpp.o lib/Target/X86/CMakeFiles/LLVMX86CodeGen.dir/X86TargetMachine.cpp.o lib/Target/X86/CMakeFiles/LLVMX86CodeGen.dir/X86TargetObjectFile.cpp.o lib/Target/X86/CMakeFiles/LLVMX86CodeGen.dir/X86TargetTransformInfo.cpp.o lib/Target/X86/CMakeFiles/LLVMX86CodeGen.dir/X86VZeroUpper.cpp.o lib/Target/X86/CMakeFiles/LLVMX86CodeGen.dir/X86WinAllocaExpander.cpp.o lib/Target/X86/CMakeFiles/LLVMX86CodeGen.dir/X86WinEHState.cpp.o lib/Target/X86/CMakeFiles/LLVMX86CodeGen.dir/X86InsertWait.cpp.o && :
[2348/2349] : && DYLD_LIBRARY_PATH=/Users/buildslave/jenkins/workspace/clang-stage2-cmake-RgTSan/host-compiler/lib/ "/Applications/Xcode.app/Contents/Developer/Toolchains/XcodeDefault.xctoolchain/usr/bin/libtool" -static -no_warning_for_no_symbols -o lib/libLLVMAMDGPUCodeGen.a  lib/Target/AMDGPU/CMakeFiles/LLVMAMDGPUCodeGen.dir/AMDGPUAliasAnalysis.cpp.o lib/Target/AMDGPU/CMakeFiles/LLVMAMDGPUCodeGen.dir/AMDGPUAlwaysInlinePass.cpp.o lib/Target/AMDGPU/CMakeFiles/LLVMAMDGPUCodeGen.dir/AMDGPUAnnotateKernelFeatures.cpp.o lib/Target/AMDGPU/CMakeFiles/LLVMAMDGPUCodeGen.dir/AMDGPUAttributor.cpp.o lib/Target/AMDGPU/CMakeFiles/LLVMAMDGPUCodeGen.dir/AMDGPUAnnotateUniformValues.cpp.o lib/Target/AMDGPU/CMakeFiles/LLVMAMDGPUCodeGen.dir/AMDGPUArgumentUsageInfo.cpp.o lib/Target/AMDGPU/CMakeFiles/LLVMAMDGPUCodeGen.dir/AMDGPUAsmPrinter.cpp.o lib/Target/AMDGPU/CMakeFiles/LLVMAMDGPUCodeGen.dir/AMDGPUAtomicOptimizer.cpp.o lib/Target/AMDGPU/CMakeFiles/LLVMAMDGPUCodeGen.dir/AMDGPUCallLowering.cpp.o lib/Target/AMDGPU/CMakeFiles/LLVMAMDGPUCodeGen.dir/AMDGPUCodeGenPrepare.cpp.o lib/Target/AMDGPU/CMakeFiles/LLVMAMDGPUCodeGen.dir/AMDGPUExportClustering.cpp.o lib/Target/AMDGPU/CMakeFiles/LLVMAMDGPUCodeGen.dir/AMDGPUFixFunctionBitcasts.cpp.o lib/Target/AMDGPU/CMakeFiles/LLVMAMDGPUCodeGen.dir/AMDGPUCtorDtorLowering.cpp.o lib/Target/AMDGPU/CMakeFiles/LLVMAMDGPUCodeGen.dir/AMDGPUFrameLowering.cpp.o lib/Target/AMDGPU/CMakeFiles/LLVMAMDGPUCodeGen.dir/AMDGPUHSAMetadataStreamer.cpp.o lib/Target/AMDGPU/CMakeFiles/LLVMAMDGPUCodeGen.dir/AMDGPUInstCombineIntrinsic.cpp.o lib/Target/AMDGPU/CMakeFiles/LLVMAMDGPUCodeGen.dir/AMDGPUInstrInfo.cpp.o lib/Target/AMDGPU/CMakeFiles/LLVMAMDGPUCodeGen.dir/AMDGPUInstructionSelector.cpp.o lib/Target/AMDGPU/CMakeFiles/LLVMAMDGPUCodeGen.dir/AMDGPUISelDAGToDAG.cpp.o lib/Target/AMDGPU/CMakeFiles/LLVMAMDGPUCodeGen.dir/AMDGPUISelLowering.cpp.o lib/Target/AMDGPU/CMakeFiles/LLVMAMDGPUCodeGen.dir/AMDGPUGlobalISelUtils.cpp.o lib/Target/AMDGPU/CMakeFiles/LLVMAMDGPUCodeGen.dir/AMDGPULateCodeGenPrepare.cpp.o lib/Target/AMDGPU/CMakeFiles/LLVMAMDGPUCodeGen.dir/AMDGPULegalizerInfo.cpp.o lib/Target/AMDGPU/CMakeFiles/LLVMAMDGPUCodeGen.dir/AMDGPULibCalls.cpp.o lib/Target/AMDGPU/CMakeFiles/LLVMAMDGPUCodeGen.dir/AMDGPULibFunc.cpp.o lib/Target/AMDGPU/CMakeFiles/LLVMAMDGPUCodeGen.dir/AMDGPULowerIntrinsics.cpp.o lib/Target/AMDGPU/CMakeFiles/LLVMAMDGPUCodeGen.dir/AMDGPULowerKernelArguments.cpp.o lib/Target/AMDGPU/CMakeFiles/LLVMAMDGPUCodeGen.dir/AMDGPULowerKernelAttributes.cpp.o lib/Target/AMDGPU/CMakeFiles/LLVMAMDGPUCodeGen.dir/AMDGPULowerModuleLDSPass.cpp.o lib/Target/AMDGPU/CMakeFiles/LLVMAMDGPUCodeGen.dir/AMDGPUMachineCFGStructurizer.cpp.o lib/Target/AMDGPU/CMakeFiles/LLVMAMDGPUCodeGen.dir/AMDGPUMachineFunction.cpp.o lib/Target/AMDGPU/CMakeFiles/LLVMAMDGPUCodeGen.dir/AMDGPUMachineModuleInfo.cpp.o lib/Target/AMDGPU/CMakeFiles/LLVMAMDGPUCodeGen.dir/AMDGPUMacroFusion.cpp.o lib/Target/AMDGPU/CMakeFiles/LLVMAMDGPUCodeGen.dir/AMDGPUMCInstLower.cpp.o lib/Target/AMDGPU/CMakeFiles/LLVMAMDGPUCodeGen.dir/AMDGPUMIRFormatter.cpp.o lib/Target/AMDGPU/CMakeFiles/LLVMAMDGPUCodeGen.dir/AMDGPUOpenCLEnqueuedBlockLowering.cpp.o lib/Target/AMDGPU/CMakeFiles/LLVMAMDGPUCodeGen.dir/AMDGPUPostLegalizerCombiner.cpp.o lib/Target/AMDGPU/CMakeFiles/LLVMAMDGPUCodeGen.dir/AMDGPUPreLegalizerCombiner.cpp.o lib/Target/AMDGPU/CMakeFiles/LLVMAMDGPUCodeGen.dir/AMDGPUPromoteAlloca.cpp.o lib/Target/AMDGPU/CMakeFiles/LLVMAMDGPUCodeGen.dir/AMDGPUPropagateAttributes.cpp.o lib/Target/AMDGPU/CMakeFiles/LLVMAMDGPUCodeGen.dir/AMDGPURegBankCombiner.cpp.o lib/Target/AMDGPU/CMakeFiles/LLVMAMDGPUCodeGen.dir/AMDGPURegisterBankInfo.cpp.o lib/Target/AMDGPU/CMakeFiles/LLVMAMDGPUCodeGen.dir/AMDGPUReplaceLDSUseWithPointer.cpp.o lib/Target/AMDGPU/CMakeFiles/LLVMAMDGPUCodeGen.dir/AMDGPURewriteOutArguments.cpp.o lib/Target/AMDGPU/CMakeFiles/LLVMAMDGPUCodeGen.dir/AMDGPUSubtarget.cpp.o lib/Target/AMDGPU/CMakeFiles/LLVMAMDGPUCodeGen.dir/AMDGPUTargetMachine.cpp.o lib/Target/AMDGPU/CMakeFiles/LLVMAMDGPUCodeGen.dir/AMDGPUTargetObjectFile.cpp.o lib/Target/AMDGPU/CMakeFiles/LLVMAMDGPUCodeGen.dir/AMDGPUTargetTransformInfo.cpp.o lib/Target/AMDGPU/CMakeFiles/LLVMAMDGPUCodeGen.dir/AMDGPUUnifyDivergentExitNodes.cpp.o lib/Target/AMDGPU/CMakeFiles/LLVMAMDGPUCodeGen.dir/AMDGPUUnifyMetadata.cpp.o lib/Target/AMDGPU/CMakeFiles/LLVMAMDGPUCodeGen.dir/AMDGPUPerfHintAnalysis.cpp.o lib/Target/AMDGPU/CMakeFiles/LLVMAMDGPUCodeGen.dir/AMDILCFGStructurizer.cpp.o lib/Target/AMDGPU/CMakeFiles/LLVMAMDGPUCodeGen.dir/AMDGPUPrintfRuntimeBinding.cpp.o lib/Target/AMDGPU/CMakeFiles/LLVMAMDGPUCodeGen.dir/AMDGPUResourceUsageAnalysis.cpp.o lib/Target/AMDGPU/CMakeFiles/LLVMAMDGPUCodeGen.dir/GCNHazardRecognizer.cpp.o lib/Target/AMDGPU/CMakeFiles/LLVMAMDGPUCodeGen.dir/GCNIterativeScheduler.cpp.o lib/Target/AMDGPU/CMakeFiles/LLVMAMDGPUCodeGen.dir/GCNMinRegStrategy.cpp.o lib/Target/AMDGPU/CMakeFiles/LLVMAMDGPUCodeGen.dir/GCNRegPressure.cpp.o lib/Target/AMDGPU/CMakeFiles/LLVMAMDGPUCodeGen.dir/GCNSchedStrategy.cpp.o lib/Target/AMDGPU/CMakeFiles/LLVMAMDGPUCodeGen.dir/R600AsmPrinter.cpp.o lib/Target/AMDGPU/CMakeFiles/LLVMAMDGPUCodeGen.dir/R600ClauseMergePass.cpp.o lib/Target/AMDGPU/CMakeFiles/LLVMAMDGPUCodeGen.dir/R600ControlFlowFinalizer.cpp.o lib/Target/AMDGPU/CMakeFiles/LLVMAMDGPUCodeGen.dir/R600EmitClauseMarkers.cpp.o lib/Target/AMDGPU/CMakeFiles/LLVMAMDGPUCodeGen.dir/R600ExpandSpecialInstrs.cpp.o lib/Target/AMDGPU/CMakeFiles/LLVMAMDGPUCodeGen.dir/R600FrameLowering.cpp.o lib/Target/AMDGPU/CMakeFiles/LLVMAMDGPUCodeGen.dir/R600InstrInfo.cpp.o lib/Target/AMDGPU/CMakeFiles/LLVMAMDGPUCodeGen.dir/R600ISelLowering.cpp.o lib/Target/AMDGPU/CMakeFiles/LLVMAMDGPUCodeGen.dir/R600MachineFunctionInfo.cpp.o lib/Target/AMDGPU/CMakeFiles/LLVMAMDGPUCodeGen.dir/R600MachineScheduler.cpp.o lib/Target/AMDGPU/CMakeFiles/LLVMAMDGPUCodeGen.dir/R600OpenCLImageTypeLoweringPass.cpp.o lib/Target/AMDGPU/CMakeFiles/LLVMAMDGPUCodeGen.dir/R600OptimizeVectorRegisters.cpp.o lib/Target/AMDGPU/CMakeFiles/LLVMAMDGPUCodeGen.dir/R600Packetizer.cpp.o lib/Target/AMDGPU/CMakeFiles/LLVMAMDGPUCodeGen.dir/R600RegisterInfo.cpp.o lib/Target/AMDGPU/CMakeFiles/LLVMAMDGPUCodeGen.dir/R600Subtarget.cpp.o lib/Target/AMDGPU/CMakeFiles/LLVMAMDGPUCodeGen.dir/R600TargetMachine.cpp.o lib/Target/AMDGPU/CMakeFiles/LLVMAMDGPUCodeGen.dir/R600TargetTransformInfo.cpp.o lib/Target/AMDGPU/CMakeFiles/LLVMAMDGPUCodeGen.dir/SIAnnotateControlFlow.cpp.o lib/Target/AMDGPU/CMakeFiles/LLVMAMDGPUCodeGen.dir/SIFixSGPRCopies.cpp.o lib/Target/AMDGPU/CMakeFiles/LLVMAMDGPUCodeGen.dir/SIFixVGPRCopies.cpp.o lib/Target/AMDGPU/CMakeFiles/LLVMAMDGPUCodeGen.dir/SIPreAllocateWWMRegs.cpp.o lib/Target/AMDGPU/CMakeFiles/LLVMAMDGPUCodeGen.dir/SIFoldOperands.cpp.o lib/Target/AMDGPU/CMakeFiles/LLVMAMDGPUCodeGen.dir/SIFormMemoryClauses.cpp.o lib/Target/AMDGPU/CMakeFiles/LLVMAMDGPUCodeGen.dir/SIFrameLowering.cpp.o lib/Target/AMDGPU/CMakeFiles/LLVMAMDGPUCodeGen.dir/SIInsertHardClauses.cpp.o lib/Target/AMDGPU/CMakeFiles/LLVMAMDGPUCodeGen.dir/SILateBranchLowering.cpp.o lib/Target/AMDGPU/CMakeFiles/LLVMAMDGPUCodeGen.dir/SIInsertWaitcnts.cpp.o lib/Target/AMDGPU/CMakeFiles/LLVMAMDGPUCodeGen.dir/SIInstrInfo.cpp.o lib/Target/AMDGPU/CMakeFiles/LLVMAMDGPUCodeGen.dir/SIISelLowering.cpp.o lib/Target/AMDGPU/CMakeFiles/LLVMAMDGPUCodeGen.dir/SILoadStoreOptimizer.cpp.o lib/Target/AMDGPU/CMakeFiles/LLVMAMDGPUCodeGen.dir/SILowerControlFlow.cpp.o lib/Target/AMDGPU/CMakeFiles/LLVMAMDGPUCodeGen.dir/SILowerI1Copies.cpp.o lib/Target/AMDGPU/CMakeFiles/LLVMAMDGPUCodeGen.dir/SILowerSGPRSpills.cpp.o lib/Target/AMDGPU/CMakeFiles/LLVMAMDGPUCodeGen.dir/SIMachineFunctionInfo.cpp.o lib/Target/AMDGPU/CMakeFiles/LLVMAMDGPUCodeGen.dir/SIMachineScheduler.cpp.o lib/Target/AMDGPU/CMakeFiles/LLVMAMDGPUCodeGen.dir/SIMemoryLegalizer.cpp.o lib/Target/AMDGPU/CMakeFiles/LLVMAMDGPUCodeGen.dir/SIOptimizeExecMasking.cpp.o lib/Target/AMDGPU/CMakeFiles/LLVMAMDGPUCodeGen.dir/SIOptimizeExecMaskingPreRA.cpp.o lib/Target/AMDGPU/CMakeFiles/LLVMAMDGPUCodeGen.dir/SIOptimizeVGPRLiveRange.cpp.o lib/Target/AMDGPU/CMakeFiles/LLVMAMDGPUCodeGen.dir/SIPeepholeSDWA.cpp.o lib/Target/AMDGPU/CMakeFiles/LLVMAMDGPUCodeGen.dir/SIPostRABundler.cpp.o lib/Target/AMDGPU/CMakeFiles/LLVMAMDGPUCodeGen.dir/SIPreEmitPeephole.cpp.o lib/Target/AMDGPU/CMakeFiles/LLVMAMDGPUCodeGen.dir/SIProgramInfo.cpp.o lib/Target/AMDGPU/CMakeFiles/LLVMAMDGPUCodeGen.dir/SIRegisterInfo.cpp.o lib/Target/AMDGPU/CMakeFiles/LLVMAMDGPUCodeGen.dir/SIShrinkInstructions.cpp.o lib/Target/AMDGPU/CMakeFiles/LLVMAMDGPUCodeGen.dir/SIWholeQuadMode.cpp.o lib/Target/AMDGPU/CMakeFiles/LLVMAMDGPUCodeGen.dir/GCNILPSched.cpp.o lib/Target/AMDGPU/CMakeFiles/LLVMAMDGPUCodeGen.dir/GCNNSAReassign.cpp.o lib/Target/AMDGPU/CMakeFiles/LLVMAMDGPUCodeGen.dir/GCNDPPCombine.cpp.o lib/Target/AMDGPU/CMakeFiles/LLVMAMDGPUCodeGen.dir/GCNPreRAOptimizations.cpp.o lib/Target/AMDGPU/CMakeFiles/LLVMAMDGPUCodeGen.dir/SIModeRegister.cpp.o && :
[2349/2349] : && /Users/buildslave/jenkins/workspace/clang-stage2-cmake-RgTSan/host-compiler/bin/clang++ -fPIC -fvisibility-inlines-hidden -Werror=date-time -Werror=unguarded-availability-new -Wall -Wextra -Wno-unused-parameter -Wwrite-strings -Wcast-qual -Wmissing-field-initializers -pedantic -Wno-long-long -Wc++98-compat-extra-semi -Wimplicit-fallthrough -Wcovered-switch-default -Wno-noexcept-type -Wnon-virtual-dtor -Wdelete-non-virtual-dtor -Wstring-conversion -fno-omit-frame-pointer -fsanitize=thread -fdiagnostics-color -flto=thin -O2 -g -DNDEBUG -isysroot /Applications/Xcode.app/Contents/Developer/Platforms/MacOSX.platform/Developer/SDKs/MacOSX10.15.sdk -dynamiclib -Wl,-headerpad_max_install_names -flto=thin -Wl,-cache_path_lto,/Users/buildslave/jenkins/workspace/clang-stage2-cmake-RgTSan/clang-build/lto.cache   -Wl,-dead_strip -Wl,-exported_symbols_list,"/Users/buildslave/jenkins/workspace/clang-stage2-cmake-RgTSan/clang-build/tools/lto/LTO.exports" -compatibility_version 1 -current_version 14.0.0 -o lib/libLTO.dylib -install_name @rpath/libLTO.dylib tools/lto/CMakeFiles/LTO.dir/LTODisassembler.cpp.o tools/lto/CMakeFiles/LTO.dir/lto.cpp.o  -Wl,-rpath,@loader_path/../lib  lib/libLLVMAArch64AsmParser.a  lib/libLLVMAMDGPUAsmParser.a  lib/libLLVMARMAsmParser.a  lib/libLLVMAVRAsmParser.a  lib/libLLVMBPFAsmParser.a  lib/libLLVMHexagonAsmParser.a  lib/libLLVMLanaiAsmParser.a  lib/libLLVMMipsAsmParser.a  lib/libLLVMMSP430AsmParser.a  lib/libLLVMPowerPCAsmParser.a  lib/libLLVMRISCVAsmParser.a  lib/libLLVMSparcAsmParser.a  lib/libLLVMSystemZAsmParser.a  lib/libLLVMWebAssemblyAsmParser.a  lib/libLLVMX86AsmParser.a  lib/libLLVMAArch64CodeGen.a  lib/libLLVMAMDGPUCodeGen.a  lib/libLLVMARMCodeGen.a  lib/libLLVMAVRCodeGen.a  lib/libLLVMBPFCodeGen.a  lib/libLLVMHexagonCodeGen.a  lib/libLLVMLanaiCodeGen.a  lib/libLLVMMipsCodeGen.a  lib/libLLVMMSP430CodeGen.a  lib/libLLVMNVPTXCodeGen.a  lib/libLLVMPowerPCCodeGen.a  lib/libLLVMRISCVCodeGen.a  lib/libLLVMSparcCodeGen.a  lib/libLLVMSystemZCodeGen.a  lib/libLLVMWebAssemblyCodeGen.a  lib/libLLVMX86CodeGen.a  lib/libLLVMXCoreCodeGen.a  lib/libLLVMAArch64Desc.a  lib/libLLVMAMDGPUDesc.a  lib/libLLVMARMDesc.a  lib/libLLVMAVRDesc.a  lib/libLLVMBPFDesc.a  lib/libLLVMHexagonDesc.a  lib/libLLVMLanaiDesc.a  lib/libLLVMMipsDesc.a  lib/libLLVMMSP430Desc.a  lib/libLLVMNVPTXDesc.a  lib/libLLVMPowerPCDesc.a  lib/libLLVMRISCVDesc.a  lib/libLLVMSparcDesc.a  lib/libLLVMSystemZDesc.a  lib/libLLVMWebAssemblyDesc.a  lib/libLLVMX86Desc.a  lib/libLLVMXCoreDesc.a  lib/libLLVMAArch64Disassembler.a  lib/libLLVMAMDGPUDisassembler.a  lib/libLLVMARMDisassembler.a  lib/libLLVMAVRDisassembler.a  lib/libLLVMBPFDisassembler.a  lib/libLLVMHexagonDisassembler.a  lib/libLLVMLanaiDisassembler.a  lib/libLLVMMipsDisassembler.a  lib/libLLVMMSP430Disassembler.a  lib/libLLVMPowerPCDisassembler.a  lib/libLLVMRISCVDisassembler.a  lib/libLLVMSparcDisassembler.a  lib/libLLVMSystemZDisassembler.a  lib/libLLVMWebAssemblyDisassembler.a  lib/libLLVMX86Disassembler.a  lib/libLLVMXCoreDisassembler.a  lib/libLLVMAArch64Info.a  lib/libLLVMAMDGPUInfo.a  lib/libLLVMARMInfo.a  lib/libLLVMAVRInfo.a  lib/libLLVMBPFInfo.a  lib/libLLVMHexagonInfo.a  lib/libLLVMLanaiInfo.a  lib/libLLVMMipsInfo.a  lib/libLLVMMSP430Info.a  lib/libLLVMNVPTXInfo.a  lib/libLLVMPowerPCInfo.a  lib/libLLVMRISCVInfo.a  lib/libLLVMSparcInfo.a  lib/libLLVMSystemZInfo.a  lib/libLLVMWebAssemblyInfo.a  lib/libLLVMX86Info.a  lib/libLLVMXCoreInfo.a  lib/libLLVMBitReader.a  lib/libLLVMCore.a  lib/libLLVMCodeGen.a  lib/libLLVMLTO.a  lib/libLLVMMC.a  lib/libLLVMMCDisassembler.a  lib/libLLVMSupport.a  lib/libLLVMTarget.a  lib/libLLVMMIRParser.a  lib/libLLVMHexagonAsmParser.a  lib/libLLVMLanaiAsmParser.a  lib/libLLVMGlobalISel.a  lib/libLLVMCFGuard.a  lib/libLLVMAsmPrinter.a  lib/libLLVMDebugInfoDWARF.a  lib/libLLVMDebugInfoMSF.a  lib/libLLVMSelectionDAG.a  lib/libLLVMAArch64Desc.a  lib/libLLVMAArch64Info.a  lib/libLLVMAArch64Utils.a  lib/libLLVMAMDGPUDesc.a  lib/libLLVMAMDGPUInfo.a  lib/libLLVMAMDGPUUtils.a  lib/libLLVMARMDesc.a  lib/libLLVMARMInfo.a  lib/libLLVMARMUtils.a  lib/libLLVMHexagonDesc.a  lib/libLLVMHexagonInfo.a  lib/libLLVMLanaiDesc.a  lib/libLLVMLanaiInfo.a  lib/libLLVMRISCVDesc.a  lib/libLLVMRISCVInfo.a  lib/libLLVMSystemZDesc.a  lib/libLLVMSystemZInfo.a  lib/libLLVMWebAssemblyDesc.a  lib/libLLVMWebAssemblyInfo.a  lib/libLLVMWebAssemblyUtils.a  lib/libLLVMMCDisassembler.a  lib/libLLVMCodeGen.a  lib/libLLVMPasses.a  lib/libLLVMTarget.a  lib/libLLVMCoroutines.a  lib/libLLVMipo.a  lib/libLLVMVectorize.a  lib/libLLVMFrontendOpenMP.a  lib/libLLVMScalarOpts.a  lib/libLLVMIRReader.a  lib/libLLVMAsmParser.a  lib/libLLVMInstrumentation.a  lib/libLLVMBitWriter.a  lib/libLLVMAggressiveInstCombine.a  lib/libLLVMExtensions.a  lib/libLLVMInstCombine.a  lib/libLLVMLinker.a  lib/libLLVMObjCARCOpts.a  lib/libLLVMTransformUtils.a  lib/libLLVMAnalysis.a  lib/libLLVMProfileData.a  lib/libLLVMObject.a  lib/libLLVMBitReader.a  lib/libLLVMCore.a  lib/libLLVMRemarks.a  lib/libLLVMBitstreamReader.a  lib/libLLVMMCParser.a  lib/libLLVMMC.a  lib/libLLVMDebugInfoCodeView.a  lib/libLLVMTextAPI.a  lib/libLLVMBinaryFormat.a  lib/libLLVMSupport.a  -lm  /usr/lib/libz.dylib  /usr/lib/libcurses.dylib  lib/libLLVMDemangle.a && :
FAILED: lib/libLTO.dylib 
: && /Users/buildslave/jenkins/workspace/clang-stage2-cmake-RgTSan/host-compiler/bin/clang++ -fPIC -fvisibility-inlines-hidden -Werror=date-time -Werror=unguarded-availability-new -Wall -Wextra -Wno-unused-parameter -Wwrite-strings -Wcast-qual -Wmissing-field-initializers -pedantic -Wno-long-long -Wc++98-compat-extra-semi -Wimplicit-fallthrough -Wcovered-switch-default -Wno-noexcept-type -Wnon-virtual-dtor -Wdelete-non-virtual-dtor -Wstring-conversion -fno-omit-frame-pointer -fsanitize=thread -fdiagnostics-color -flto=thin -O2 -g -DNDEBUG -isysroot /Applications/Xcode.app/Contents/Developer/Platforms/MacOSX.platform/Developer/SDKs/MacOSX10.15.sdk -dynamiclib -Wl,-headerpad_max_install_names -flto=thin -Wl,-cache_path_lto,/Users/buildslave/jenkins/workspace/clang-stage2-cmake-RgTSan/clang-build/lto.cache   -Wl,-dead_strip -Wl,-exported_symbols_list,"/Users/buildslave/jenkins/workspace/clang-stage2-cmake-RgTSan/clang-build/tools/lto/LTO.exports" -compatibility_version 1 -current_version 14.0.0 -o lib/libLTO.dylib -install_name @rpath/libLTO.dylib tools/lto/CMakeFiles/LTO.dir/LTODisassembler.cpp.o tools/lto/CMakeFiles/LTO.dir/lto.cpp.o  -Wl,-rpath,@loader_path/../lib  lib/libLLVMAArch64AsmParser.a  lib/libLLVMAMDGPUAsmParser.a  lib/libLLVMARMAsmParser.a  lib/libLLVMAVRAsmParser.a  lib/libLLVMBPFAsmParser.a  lib/libLLVMHexagonAsmParser.a  lib/libLLVMLanaiAsmParser.a  lib/libLLVMMipsAsmParser.a  lib/libLLVMMSP430AsmParser.a  lib/libLLVMPowerPCAsmParser.a  lib/libLLVMRISCVAsmParser.a  lib/libLLVMSparcAsmParser.a  lib/libLLVMSystemZAsmParser.a  lib/libLLVMWebAssemblyAsmParser.a  lib/libLLVMX86AsmParser.a  lib/libLLVMAArch64CodeGen.a  lib/libLLVMAMDGPUCodeGen.a  lib/libLLVMARMCodeGen.a  lib/libLLVMAVRCodeGen.a  lib/libLLVMBPFCodeGen.a  lib/libLLVMHexagonCodeGen.a  lib/libLLVMLanaiCodeGen.a  lib/libLLVMMipsCodeGen.a  lib/libLLVMMSP430CodeGen.a  lib/libLLVMNVPTXCodeGen.a  lib/libLLVMPowerPCCodeGen.a  lib/libLLVMRISCVCodeGen.a  lib/libLLVMSparcCodeGen.a  lib/libLLVMSystemZCodeGen.a  lib/libLLVMWebAssemblyCodeGen.a  lib/libLLVMX86CodeGen.a  lib/libLLVMXCoreCodeGen.a  lib/libLLVMAArch64Desc.a  lib/libLLVMAMDGPUDesc.a  lib/libLLVMARMDesc.a  lib/libLLVMAVRDesc.a  lib/libLLVMBPFDesc.a  lib/libLLVMHexagonDesc.a  lib/libLLVMLanaiDesc.a  lib/libLLVMMipsDesc.a  lib/libLLVMMSP430Desc.a  lib/libLLVMNVPTXDesc.a  lib/libLLVMPowerPCDesc.a  lib/libLLVMRISCVDesc.a  lib/libLLVMSparcDesc.a  lib/libLLVMSystemZDesc.a  lib/libLLVMWebAssemblyDesc.a  lib/libLLVMX86Desc.a  lib/libLLVMXCoreDesc.a  lib/libLLVMAArch64Disassembler.a  lib/libLLVMAMDGPUDisassembler.a  lib/libLLVMARMDisassembler.a  lib/libLLVMAVRDisassembler.a  lib/libLLVMBPFDisassembler.a  lib/libLLVMHexagonDisassembler.a  lib/libLLVMLanaiDisassembler.a  lib/libLLVMMipsDisassembler.a  lib/libLLVMMSP430Disassembler.a  lib/libLLVMPowerPCDisassembler.a  lib/libLLVMRISCVDisassembler.a  lib/libLLVMSparcDisassembler.a  lib/libLLVMSystemZDisassembler.a  lib/libLLVMWebAssemblyDisassembler.a  lib/libLLVMX86Disassembler.a  lib/libLLVMXCoreDisassembler.a  lib/libLLVMAArch64Info.a  lib/libLLVMAMDGPUInfo.a  lib/libLLVMARMInfo.a  lib/libLLVMAVRInfo.a  lib/libLLVMBPFInfo.a  lib/libLLVMHexagonInfo.a  lib/libLLVMLanaiInfo.a  lib/libLLVMMipsInfo.a  lib/libLLVMMSP430Info.a  lib/libLLVMNVPTXInfo.a  lib/libLLVMPowerPCInfo.a  lib/libLLVMRISCVInfo.a  lib/libLLVMSparcInfo.a  lib/libLLVMSystemZInfo.a  lib/libLLVMWebAssemblyInfo.a  lib/libLLVMX86Info.a  lib/libLLVMXCoreInfo.a  lib/libLLVMBitReader.a  lib/libLLVMCore.a  lib/libLLVMCodeGen.a  lib/libLLVMLTO.a  lib/libLLVMMC.a  lib/libLLVMMCDisassembler.a  lib/libLLVMSupport.a  lib/libLLVMTarget.a  lib/libLLVMMIRParser.a  lib/libLLVMHexagonAsmParser.a  lib/libLLVMLanaiAsmParser.a  lib/libLLVMGlobalISel.a  lib/libLLVMCFGuard.a  lib/libLLVMAsmPrinter.a  lib/libLLVMDebugInfoDWARF.a  lib/libLLVMDebugInfoMSF.a  lib/libLLVMSelectionDAG.a  lib/libLLVMAArch64Desc.a  lib/libLLVMAArch64Info.a  lib/libLLVMAArch64Utils.a  lib/libLLVMAMDGPUDesc.a  lib/libLLVMAMDGPUInfo.a  lib/libLLVMAMDGPUUtils.a  lib/libLLVMARMDesc.a  lib/libLLVMARMInfo.a  lib/libLLVMARMUtils.a  lib/libLLVMHexagonDesc.a  lib/libLLVMHexagonInfo.a  lib/libLLVMLanaiDesc.a  lib/libLLVMLanaiInfo.a  lib/libLLVMRISCVDesc.a  lib/libLLVMRISCVInfo.a  lib/libLLVMSystemZDesc.a  lib/libLLVMSystemZInfo.a  lib/libLLVMWebAssemblyDesc.a  lib/libLLVMWebAssemblyInfo.a  lib/libLLVMWebAssemblyUtils.a  lib/libLLVMMCDisassembler.a  lib/libLLVMCodeGen.a  lib/libLLVMPasses.a  lib/libLLVMTarget.a  lib/libLLVMCoroutines.a  lib/libLLVMipo.a  lib/libLLVMVectorize.a  lib/libLLVMFrontendOpenMP.a  lib/libLLVMScalarOpts.a  lib/libLLVMIRReader.a  lib/libLLVMAsmParser.a  lib/libLLVMInstrumentation.a  lib/libLLVMBitWriter.a  lib/libLLVMAggressiveInstCombine.a  lib/libLLVMExtensions.a  lib/libLLVMInstCombine.a  lib/libLLVMLinker.a  lib/libLLVMObjCARCOpts.a  lib/libLLVMTransformUtils.a  lib/libLLVMAnalysis.a  lib/libLLVMProfileData.a  lib/libLLVMObject.a  lib/libLLVMBitReader.a  lib/libLLVMCore.a  lib/libLLVMRemarks.a  lib/libLLVMBitstreamReader.a  lib/libLLVMMCParser.a  lib/libLLVMMC.a  lib/libLLVMDebugInfoCodeView.a  lib/libLLVMTextAPI.a  lib/libLLVMBinaryFormat.a  lib/libLLVMSupport.a  -lm  /usr/lib/libz.dylib  /usr/lib/libcurses.dylib  lib/libLLVMDemangle.a && :
LLVM ERROR: IO failure on output stream: No space left on device
clang-7: error: linker command failed with exit code 1 (use -v to see invocation)
ninja: build stopped: subcommand failed.
Command failed: Command '['/usr/local/bin/ninja', '-v', 'LTO']' returned non-zero exit status 1.
Command: ['/usr/local/bin/ninja', '-v', 'LTO']
Build step 'Execute shell' marked build as failure
[WARNINGS] Skipping publisher since build result is FAILURE
Finished: FAILURE