Console Output

Skipping 837 KB.. Full Log
PASS: lldb-unit :: Utility/./UtilityTests/PassiveReplayTest.InstrumentedBarPtr (1237 of 2486)
PASS: lldb-unit :: Utility/./UtilityTests/DataExtractorTest.GetFloat (1238 of 2486)
PASS: lldb-api :: functionalities/data-formatter/data-formatter-stl/libcxx/vbool/TestDataFormatterLibcxxVBool.py (1239 of 2486)
PASS: lldb-unit :: Expression/./ExpressionTests/DiagnosticManagerTest.AppendMessageAttachToLastDiag (1240 of 2486)
PASS: lldb-unit :: Symbol/./SymbolTests/TestTypeSystemClang.TemplateArguments (1241 of 2486)
PASS: lldb-api :: lang/cpp/stl/TestSTL.py (1242 of 2486)
PASS: lldb-unit :: Process/minidump/./LLDBMinidumpTests/MinidumpParserTest.GetMemoryRegionInfoLinuxMaps (1243 of 2486)
PASS: lldb-api :: lang/objcxx/cpp_keywords_enabled/TestObjCppKeywordsEnabled.py (1244 of 2486)
PASS: lldb-unit :: UnwindAssembly/x86/./UnwindAssemblyx86Tests/Testx86AssemblyInspectionEngine.TestPopRBX (1245 of 2486)
PASS: lldb-shell :: ObjectFile/PDB/object.test (1246 of 2486)
PASS: lldb-unit :: Utility/./UtilityTests/BinaryStreamTest.PutSLEB128NineBytes (1247 of 2486)
PASS: lldb-unit :: Utility/./UtilityTests/StringListTest.LongestCommonPrefixSingleElement (1248 of 2486)
PASS: lldb-unit :: Utility/./UtilityTests/FileSpecTest.Yaml (1249 of 2486)
PASS: lldb-api :: functionalities/breakpoint/breakpoint_command/TestBreakpointCommand.py (1250 of 2486)
PASS: lldb-unit :: Utility/./UtilityTests/RecordReplayTest.InstrumentedFoo (1251 of 2486)
PASS: lldb-unit :: SymbolFile/NativePDB/./SymbolFileNativePDBTests/PDBFPOProgramToDWARFExpressionTests.InvalidOpBinary (1252 of 2486)
PASS: lldb-api :: tools/lldb-server/TestGdbRemoteRegisterState.py (1253 of 2486)
PASS: lldb-unit :: SymbolFile/DWARF/./SymbolFileDWARFTests/SymbolFileDWARFTests.ParseArangesWithMultipleTerminators (1254 of 2486)
PASS: lldb-api :: lang/objc/cpp_keyword_identifiers/TestCppKeywordsAsObjCIdentifiers.py (1255 of 2486)
PASS: lldb-unit :: Language/Highlighting/./HighlighterTests/HighlighterTest.ClangScalarLiterals (1256 of 2486)
PASS: lldb-api :: macosx/builtin-debugtrap/TestBuiltinDebugTrap.py (1257 of 2486)
PASS: lldb-shell :: SymbolFile/Breakpad/symtab-macho.test (1258 of 2486)
PASS: lldb-unit :: Host/./HostTests/SocketTests/SocketTest.TCPListen0GetPort/ipv4 (1259 of 2486)
PASS: lldb-unit :: Utility/./UtilityTests/StreamTest.PutBytesAsRawHex8ToMixedEndian (1260 of 2486)
PASS: lldb-unit :: Core/./LLDBCoreTests/DumpDataExtractorTest.StartOffset (1261 of 2486)
PASS: lldb-shell :: SymbolFile/DWARF/x86/debug_line-tombstone.s (1262 of 2486)
PASS: lldb-shell :: Commands/CommandScriptImmediateOutput/CommandScriptImmediateOutputFile.test (1263 of 2486)
PASS: lldb-api :: commands/reproducer/invalid-args/TestInvalidArgsReproducer.py (1264 of 2486)
UNSUPPORTED: lldb-shell :: Unwind/eh-frame-augment-noop.test (1265 of 2486)
PASS: lldb-api :: commands/expression/import-std-module/deque-basic/TestDequeFromStdModule.py (1266 of 2486)
PASS: lldb-unit :: UnwindAssembly/x86/./UnwindAssemblyx86Tests/Testx86AssemblyInspectionEngine.Test64bitFramelessBigStackFrame (1267 of 2486)
PASS: lldb-shell :: SymbolFile/absolute-symbol.test (1268 of 2486)
PASS: lldb-api :: functionalities/tail_call_frames/thread_step_out_or_return/TestSteppingOutWithArtificialFrames.py (1269 of 2486)
PASS: lldb-unit :: Utility/./UtilityTests/ScalarTest.GetBytes (1270 of 2486)
PASS: lldb-unit :: Utility/./UtilityTests/StringExtractorTest.GetHexBytesAvail_FullString (1271 of 2486)
PASS: lldb-shell :: Commands/command-regex-unalias.test (1272 of 2486)
PASS: lldb-shell :: ObjectFile/ELF/PT_LOAD-empty.yaml (1273 of 2486)
PASS: lldb-shell :: SymbolFile/Breakpad/unwind-via-stack-win.test (1274 of 2486)
PASS: lldb-api :: lang/objc/global_ptrs/TestGlobalObjects.py (1275 of 2486)
PASS: lldb-api :: functionalities/data-formatter/setvaluefromcstring/TestSetValueFromCString.py (1276 of 2486)
PASS: lldb-shell :: Quit/TestQuitExitCodeHex0.test (1277 of 2486)
UNSUPPORTED: lldb-api :: functionalities/data-formatter/data-formatter-stl/libstdcpp/smart_ptr/TestDataFormatterStdSmartPtr.py (1278 of 2486)
PASS: lldb-api :: lang/cpp/modules-import/TestCXXModulesImport.py (1279 of 2486)
PASS: lldb-unit :: Expression/./ExpressionTests/CppModuleConfigurationTest.LinuxLocalLibCpp (1280 of 2486)
PASS: lldb-api :: functionalities/data-formatter/data-formatter-stl/generic/list/loop/TestDataFormatterGenericListLoop.py (1281 of 2486)
PASS: lldb-api :: functionalities/gdb_remote_client/TestRemoteRegNums.py (1282 of 2486)
PASS: lldb-api :: lang/objc/objc-property/TestObjCProperty.py (1283 of 2486)
PASS: lldb-unit :: Utility/./UtilityTests/StringListTest.LongestCommonPrefixEmpty (1284 of 2486)
PASS: lldb-shell :: Register/Core/x86-32-linux-fp.test (1285 of 2486)
PASS: lldb-shell :: SymbolFile/DWARF/x86/unused-inlined-params.test (1286 of 2486)
PASS: lldb-shell :: Reproducer/Functionalities/TestExpressionEvaluation.test (1287 of 2486)
PASS: lldb-unit :: Utility/./UtilityTests/RangeTest.ContainsRange (1288 of 2486)
PASS: lldb-api :: python_api/exprpath_synthetic/TestExprPathSynthetic.py (1289 of 2486)
PASS: lldb-api :: commands/frame/language/TestGuessLanguage.py (1290 of 2486)
PASS: lldb-api :: lang/c/modules/TestCModules.py (1291 of 2486)
PASS: lldb-api :: functionalities/data-formatter/data-formatter-named-summaries/TestDataFormatterNamedSummaries.py (1292 of 2486)
PASS: lldb-api :: arm/emulation/TestEmulations.py (1293 of 2486)
PASS: lldb-unit :: Process/Utility/./ProcessUtilityTests/RegisterContext_x86Test.AbridgedToFullTagWord (1294 of 2486)
PASS: lldb-shell :: SymbolFile/DWARF/x86/DW_TAG_variable-DW_AT_const_value.s (1295 of 2486)
PASS: lldb-api :: lang/cpp/global_variables/TestCPPGlobalVariables.py (1296 of 2486)
PASS: lldb-unit :: Interpreter/./InterpreterTests/OptionValueString.DeepCopy (1297 of 2486)
PASS: lldb-api :: python_api/type/TestTypeList.py (1298 of 2486)
PASS: lldb-api :: lang/objc/modules-inline-functions/TestModulesInlineFunctions.py (1299 of 2486)
PASS: lldb-unit :: Utility/./UtilityTests/GeneratorTest.YamlMultiProvider (1300 of 2486)
PASS: lldb-api :: commands/breakpoint/command/list/TestBreakpointCommandList.py (1301 of 2486)
PASS: lldb-unit :: SymbolFile/DWARF/./SymbolFileDWARFTests/DWARFASTParserClangTests.EnsureAllDIEsInDeclContextHaveBeenParsedParsesOnlyMatchingEntries (1302 of 2486)
PASS: lldb-unit :: Interpreter/./InterpreterTests/OptionArgParserTest.toBoolean (1303 of 2486)
PASS: lldb-api :: commands/watchpoints/watchpoint_events/TestWatchpointEvents.py (1304 of 2486)
PASS: lldb-shell :: Minidump/disassemble-no-module.yaml (1305 of 2486)
PASS: lldb-unit :: Utility/./UtilityTests/StringListTest.InsertStringAtIndexOutOfBounds (1306 of 2486)
PASS: lldb-api :: functionalities/exec/TestExec.py (1307 of 2486)
PASS: lldb-api :: functionalities/breakpoint/breakpoint_ignore_count/TestBreakpointIgnoreCount.py (1308 of 2486)
PASS: lldb-unit :: Utility/./UtilityTests/StringLexerTest.Peek (1309 of 2486)
PASS: lldb-unit :: Symbol/./SymbolTests/TestTypeSystemClang.OnlyPackName (1310 of 2486)
PASS: lldb-unit :: Process/gdb-remote/./ProcessGdbRemoteTests/GDBRemoteCommunicationClientTest.WriteRegister (1311 of 2486)
PASS: lldb-unit :: Utility/./UtilityTests/RangeTest.Copy (1312 of 2486)
PASS: lldb-unit :: Utility/./UtilityTests/StringExtractorTest.GetU32BigEndian (1313 of 2486)
PASS: lldb-api :: commands/expression/radar_8638051/Test8638051.py (1314 of 2486)
PASS: lldb-api :: commands/target/stop-hooks/TestStopHookScripted.py (1315 of 2486)
PASS: lldb-shell :: SymbolFile/DWARF/x86/debug-names-compressed.cpp (1316 of 2486)
PASS: lldb-unit :: Utility/./UtilityTests/StringExtractorTest.GetHexBytes_Partial (1317 of 2486)
PASS: lldb-unit :: Utility/./UtilityTests/UriParserTest.MinimalPortPath (1318 of 2486)
PASS: lldb-unit :: UnwindAssembly/ARM64/./Arm64InstEmulationTests/TestArm64InstEmulation.TestCFARegisterTrackedAcrossJumps (1319 of 2486)
PASS: lldb-unit :: ScriptInterpreter/Python/./ScriptInterpreterPythonTests/PythonDataObjectsTest.TestResetting (1320 of 2486)
PASS: lldb-unit :: Process/gdb-remote/./ProcessGdbRemoteTests/GDBRemoteCommunicationClientTest.WriteRegisterNoSuffix (1321 of 2486)
PASS: lldb-api :: lang/cpp/bool/TestCPPBool.py (1322 of 2486)
PASS: lldb-api :: lang/c/conflicting-symbol/TestConflictingSymbol.py (1323 of 2486)
PASS: lldb-unit :: Symbol/./SymbolTests/TestTypeSystemClang.TestIsClangType (1324 of 2486)
PASS: lldb-unit :: Utility/./UtilityTests/BinaryStreamTest.PutULEB128One (1325 of 2486)
PASS: lldb-shell :: Register/Core/x86-32-netbsd-multithread.test (1326 of 2486)
PASS: lldb-unit :: Utility/./UtilityTests/LogTest.Register (1327 of 2486)
PASS: lldb-shell :: SymbolFile/Breakpad/line-table-discontinuous-file-ids.test (1328 of 2486)
PASS: lldb-api :: functionalities/stop-on-sharedlibrary-load/TestStopOnSharedlibraryEvents.py (1329 of 2486)
PASS: lldb-api :: functionalities/inferior-crashing/TestInferiorCrashing.py (1330 of 2486)
PASS: lldb-api :: tools/lldb-server/TestGdbRemoteSingleStep.py (1331 of 2486)
PASS: lldb-api :: lang/cpp/template-arguments/TestCppTemplateArguments.py (1332 of 2486)
PASS: lldb-unit :: Utility/./UtilityTests/StringListTest.ShiftMove (1333 of 2486)
PASS: lldb-unit :: Utility/./UtilityTests/AnsiTerminal.Incomplete (1334 of 2486)
PASS: lldb-unit :: Expression/./ExpressionTests/DiagnosticManagerTest.PutString (1335 of 2486)
PASS: lldb-unit :: Utility/./UtilityTests/ArgsTest.TestSingleArg (1336 of 2486)
PASS: lldb-unit :: Core/./LLDBCoreTests/DumpDataExtractorTest.ItemByteSizeErrors (1337 of 2486)
PASS: lldb-api :: commands/expression/po_verbosity/TestPoVerbosity.py (1338 of 2486)
UNSUPPORTED: lldb-shell :: Register/x86-ymm-read.test (1339 of 2486)
PASS: lldb-unit :: Core/./LLDBCoreTests/ModuleSpecTest.TestMachOFile (1340 of 2486)
PASS: lldb-unit :: Utility/./UtilityTests/LogTest.Unregister (1341 of 2486)
PASS: lldb-unit :: Utility/./UtilityTests/FileSpecTest.OperatorBool (1342 of 2486)
PASS: lldb-api :: lang/objcxx/cxx-bridged-po/TestObjCXXBridgedPO.py (1343 of 2486)
PASS: lldb-unit :: Utility/./UtilityTests/FileSpecTest.GuessPathStyle (1344 of 2486)
PASS: lldb-unit :: Process/gdb-remote/./ProcessGdbRemoteTests/GDBRemoteCommunicationClientTest.ReadRegister (1345 of 2486)
PASS: lldb-api :: tools/lldb-server/inferior-crash/TestGdbRemoteSegFault.py (1346 of 2486)
PASS: lldb-unit :: UnwindAssembly/ARM64/./Arm64InstEmulationTests/TestArm64InstEmulation.TestRegisterSavedTwice (1347 of 2486)
PASS: lldb-unit :: debugserver/./debugserverTests/RNBSocket.LoopBackConnectIPv6 (1348 of 2486)
PASS: lldb-unit :: Utility/./UtilityTests/PassiveReplayTest.InstrumentedBarRef (1349 of 2486)
PASS: lldb-shell :: Register/Core/x86-32-linux-addr.test (1350 of 2486)
PASS: lldb-api :: commands/process/attach/TestProcessAttach.py (1351 of 2486)
PASS: lldb-api :: commands/expression/scoped_enums/TestScopedEnumType.py (1352 of 2486)
PASS: lldb-unit :: Process/gdb-remote/./ProcessGdbRemoteTests/GDBRemoteCommunicationClientTest.WriteMemoryTags (1353 of 2486)
PASS: lldb-api :: functionalities/gdb_remote_client/TestNoWatchpointSupportInfo.py (1354 of 2486)
PASS: lldb-unit :: Utility/./UtilityTests/RangeTest.ContainsEndInclusiveInvalid (1355 of 2486)
PASS: lldb-unit :: Utility/./UtilityTests/VMRange.ContainsRange (1356 of 2486)
PASS: lldb-unit :: Utility/./UtilityTests/EnvironmentTest.EnvpConstruction (1357 of 2486)
PASS: lldb-unit :: SymbolFile/NativePDB/./SymbolFileNativePDBTests/PDBFPOProgramToDWARFExpressionTests.MultipleIndependentAssignments (1358 of 2486)
PASS: lldb-api :: lang/objc/tagged-pointer/TestTaggedPointerCmd.py (1359 of 2486)
PASS: lldb-shell :: ObjectFile/ELF/duplicate-section.yaml (1360 of 2486)
PASS: lldb-unit :: Process/gdb-remote/./ProcessGdbRemoteTests/GDBRemoteCommunicationClientTest.SendSignalsToIgnore (1361 of 2486)
PASS: lldb-shell :: Process/Optimization.test (1362 of 2486)
PASS: lldb-api :: functionalities/load_after_attach/TestLoadAfterAttach.py (1363 of 2486)
PASS: lldb-api :: functionalities/gdb_remote_client/TestRegDefinitionInParts.py (1364 of 2486)
PASS: lldb-unit :: Process/gdb-remote/./ProcessGdbRemoteTests/GDBRemoteCommunicationClientTest.SaveRestoreRegistersNoSuffix (1365 of 2486)
PASS: lldb-api :: types/TestCharType.py (1366 of 2486)
PASS: lldb-api :: lang/cpp/scratch-context-merging/structs/TestCppScratchContextMergingStructs.py (1367 of 2486)
PASS: lldb-unit :: Utility/./UtilityTests/StringExtractorTest.GetHexU8_Extra_NoEof (1368 of 2486)
PASS: lldb-shell :: Register/x86-multithread-read.test (1369 of 2486)
PASS: lldb-api :: commands/gui/breakpoints/TestGuiBreakpoints.py (1370 of 2486)
UNSUPPORTED: lldb-api :: tools/lldb-server/TestPtyServer.py (1371 of 2486)
PASS: lldb-api :: python_api/formatters/TestFormattersSBAPI.py (1372 of 2486)
PASS: lldb-unit :: Core/./LLDBCoreTests/ModuleSpecTest.TestELFFile (1373 of 2486)
UNSUPPORTED: lldb-shell :: Subprocess/vfork-follow-parent-softbp.test (1374 of 2486)
PASS: lldb-unit :: UnwindAssembly/x86/./UnwindAssemblyx86Tests/Testx86AssemblyInspectionEngine.Testi386IgnoredRegisters (1375 of 2486)
PASS: lldb-api :: lang/objc/ivar-IMP/TestObjCiVarIMP.py (1376 of 2486)
PASS: lldb-api :: commands/target/auto-install-main-executable/TestAutoInstallMainExecutable.py (1377 of 2486)
PASS: lldb-shell :: Register/Core/x86-32-netbsd-gp.test (1378 of 2486)
PASS: lldb-shell :: SymbolFile/Breakpad/stack-cfi-arm.yaml (1379 of 2486)
PASS: lldb-api :: python_api/disassemble-raw-data/TestDisassembleRawData.py (1380 of 2486)
PASS: lldb-unit :: Process/minidump/./LLDBMinidumpTests/MinidumpParserTest.GetMemory (1381 of 2486)
UNSUPPORTED: lldb-api :: lang/objc/modules-update/TestClangModulesUpdate.py (1382 of 2486)
PASS: lldb-unit :: Utility/./UtilityTests/StreamTest.AddressSuffix (1383 of 2486)
PASS: lldb-unit :: Utility/./UtilityTests/StreamTest.PutCString (1384 of 2486)
PASS: lldb-api :: functionalities/signal/TestSendSignal.py (1385 of 2486)
PASS: lldb-shell :: SymbolFile/DWARF/x86/debug-types-address-ranges.s (1386 of 2486)
PASS: lldb-shell :: Minidump/breakpad-symbols.test (1387 of 2486)
PASS: lldb-api :: functionalities/postmortem/elf-core/TestLinuxCore.py (1388 of 2486)
PASS: lldb-unit :: Language/Highlighting/./HighlighterTests/HighlighterTest.ClangSquareBrackets (1389 of 2486)
PASS: lldb-api :: commands/expression/import-std-module/conflicts/TestStdModuleWithConflicts.py (1390 of 2486)
PASS: lldb-api :: macosx/profile_vrs_detach/TestDetachVrsProfile.py (1391 of 2486)
PASS: lldb-unit :: Utility/./UtilityTests/StringExtractorTest.GetNameColonValueContainsColon (1392 of 2486)
PASS: lldb-api :: python_api/frame/get-variables/TestGetVariables.py (1393 of 2486)
UNSUPPORTED: lldb-api :: commands/trace/TestTraceExport.py (1394 of 2486)
PASS: lldb-shell :: SymbolFile/DWARF/x86/find-basic-type.cpp (1395 of 2486)
PASS: lldb-api :: functionalities/lazy-loading/TestLazyLoading.py (1396 of 2486)
PASS: lldb-shell :: ScriptInterpreter/Python/Crashlog/no_threadState.test (1397 of 2486)
UNSUPPORTED: lldb-shell :: ScriptInterpreter/Lua/fail_breakpoint_oneline.test (1398 of 2486)
PASS: lldb-shell :: SymbolFile/DWARF/dwo-relative-path.s (1399 of 2486)
PASS: lldb-shell :: BuildScript/compiler-full-path.test (1400 of 2486)
PASS: lldb-api :: functionalities/gdb_remote_client/TestProcessConnect.py (1401 of 2486)
PASS: lldb-unit :: Host/./HostTests/SocketTests/SocketTest.UDPGetConnectURI/ipv6 (1402 of 2486)
PASS: lldb-unit :: DataFormatter/./LLDBFormatterTests/StringPrinterTests.SwiftUTF8 (1403 of 2486)
PASS: lldb-unit :: Symbol/./SymbolTests/TestClangASTImporter.CompleteFwdDeclWithOtherOrigin (1404 of 2486)
PASS: lldb-api :: lang/objc/print-obj/TestPrintObj.py (1405 of 2486)
UNSUPPORTED: lldb-api :: commands/watchpoints/multi_watchpoint_slots/TestWatchpointMultipleSlots.py (1406 of 2486)
PASS: lldb-shell :: ObjectFile/MachO/lc_version_min.yaml (1407 of 2486)
UNSUPPORTED: lldb-api :: commands/watchpoints/watch_tagged_addr/TestWatchTaggedAddress.py (1408 of 2486)
PASS: lldb-api :: commands/expression/rdar42038760/TestScalarURem.py (1409 of 2486)
PASS: lldb-api :: lang/c/offsetof/TestOffsetof.py (1410 of 2486)
PASS: lldb-unit :: Utility/./UtilityTests/RangeDataVector.FindEntryIndexesThatContain (1411 of 2486)
PASS: lldb-unit :: Utility/./UtilityTests/BinaryStreamTest.PutULEB128FiveBytes (1412 of 2486)
PASS: lldb-api :: macosx/queues/TestQueues.py (1413 of 2486)
PASS: lldb-unit :: Utility/./UtilityTests/SerializationRountripTest.SerializeDeserializePodReferences (1414 of 2486)
UNSUPPORTED: lldb-api :: tools/lldb-vscode/disconnect/TestVSCode_disconnect.py (1415 of 2486)
PASS: lldb-api :: lang/cpp/rvalue-references/TestRvalueReferences.py (1416 of 2486)
PASS: lldb-unit :: ScriptInterpreter/Python/./ScriptInterpreterPythonTests/PythonDataObjectsTest.TestPythonFile (1417 of 2486)
PASS: lldb-unit :: Utility/./UtilityTests/StructuredDataTest.ParseJSONFromFile (1418 of 2486)
PASS: lldb-unit :: Language/Highlighting/./HighlighterTests/HighlighterTest.DefaultHighlighterWithCursor (1419 of 2486)
PASS: lldb-shell :: Settings/TestStopCommandSourceOnError.test (1420 of 2486)
XFAIL: lldb-shell :: Register/x86-64-ymm-write.test (1421 of 2486)
PASS: lldb-unit :: Utility/./UtilityTests/SharedCluster.ClusterManager (1422 of 2486)
PASS: lldb-unit :: Host/./HostTests/SocketTests/SocketTest.TCPListen0ConnectAccept/ipv4 (1423 of 2486)
PASS: lldb-api :: lang/cpp/subst_template_type_param/TestSubstTemplateTypeParam.py (1424 of 2486)
PASS: lldb-unit :: Host/./HostTests/MainLoopTest.ReadObject (1425 of 2486)
PASS: lldb-unit :: Utility/./UtilityTests/ArgsTest.BareSingleQuote (1426 of 2486)
PASS: lldb-api :: functionalities/tail_call_frames/disambiguate_paths_to_common_sink/TestDisambiguatePathsToCommonSink.py (1427 of 2486)
PASS: lldb-api :: lang/c/array_types/TestArrayTypes.py (1428 of 2486)
PASS: lldb-shell :: ExecControl/StopHook/stop-hook.test (1429 of 2486)
PASS: lldb-unit :: Utility/./UtilityTests/StreamTeeTest.GetStreamAtIndexOutOfBounds (1430 of 2486)
PASS: lldb-unit :: Core/./LLDBCoreTests/SourceLocationSpecTest.OperatorBool (1431 of 2486)
PASS: lldb-api :: tools/lldb-vscode/variables/TestVSCode_variables.py (1432 of 2486)
PASS: lldb-shell :: Settings/TestDefaultModuleCachePath.test (1433 of 2486)
PASS: lldb-unit :: Platform/Android/./AdbClientTests/AdbClientTest.CreateByDeviceId (1434 of 2486)
PASS: lldb-api :: commands/expression/anonymous-struct/TestCallUserAnonTypedef.py (1435 of 2486)
PASS: lldb-unit :: Utility/./UtilityTests/OptionsWithRawTest.ArgsButNoLeadingDash (1436 of 2486)
PASS: lldb-unit :: Utility/./UtilityTests/ArgsTest.TestAppendArg (1437 of 2486)
PASS: lldb-unit :: Disassembler/./DisassemblerTests/TestArmv7Disassembly.TestCortexFPDisass (1438 of 2486)
PASS: lldb-unit :: Utility/./UtilityTests/FileSpecTest.EqualSeparator (1439 of 2486)
PASS: lldb-api :: functionalities/data-formatter/data-formatter-objc/TestDataFormatterObjCPlain.py (1440 of 2486)
PASS: lldb-unit :: Process/gdb-remote/./ProcessGdbRemoteTests/PortMapTest.AllowPort (1441 of 2486)
PASS: lldb-api :: functionalities/data-formatter/data-formatter-objc/nsstring/TestDataFormatterNSString.py (1442 of 2486)
PASS: lldb-unit :: Process/Utility/./ProcessUtilityTests/MemoryTagManagerAArch64MTETest.RepeatTagsForRange (1443 of 2486)
PASS: lldb-unit :: Utility/./UtilityTests/StreamTeeTest.Constructor2Streams (1444 of 2486)
PASS: lldb-unit :: Core/./LLDBCoreTests/SourceFileCache.FindSourceFileFound (1445 of 2486)
PASS: lldb-unit :: Target/./TargetTests/MCBasedABI.MapRegisterName (1446 of 2486)
PASS: lldb-api :: functionalities/postmortem/elf-core/gcore/TestGCore.py (1447 of 2486)
UNSUPPORTED: lldb-api :: commands/trace/TestTraceSave.py (1448 of 2486)
PASS: lldb-unit :: Utility/./UtilityTests/BinaryStreamTest.PutULEB128SevenBytes (1449 of 2486)
PASS: lldb-api :: commands/expression/import-std-module/iterator/TestIteratorFromStdModule.py (1450 of 2486)
PASS: lldb-api :: commands/frame/diagnose/bad-reference/TestBadReference.py (1451 of 2486)
PASS: lldb-api :: functionalities/thread/concurrent_events/TestConcurrentWatchBreakDelay.py (1452 of 2486)
PASS: lldb-api :: commands/target/basic/TestTargetCommand.py (1453 of 2486)
PASS: lldb-unit :: Core/./LLDBCoreTests/DumpDataExtractorTest.FormatCharArray (1454 of 2486)
UNSUPPORTED: lldb-api :: commands/expression/macros/TestMacros.py (1455 of 2486)
PASS: lldb-unit :: ScriptInterpreter/Python/./ScriptInterpreterPythonTests/PythonDataObjectsTest.TestPythonStringToStructuredString (1456 of 2486)
PASS: lldb-shell :: SymbolFile/symbol-binding.test (1457 of 2486)
PASS: lldb-api :: lang/cpp/namespace/TestNamespaceLookup.py (1458 of 2486)
PASS: lldb-unit :: Host/./HostTests/SocketTests/SocketTest.TCPListen0ConnectAccept/ipv6 (1459 of 2486)
PASS: lldb-unit :: Core/./LLDBCoreTests/FormatEntityTest.DefinitionConstructionNameAndString (1460 of 2486)
PASS: lldb-api :: lang/objc/objc++/TestObjCXX.py (1461 of 2486)
PASS: lldb-api :: commands/expression/call-function/TestCallUserDefinedFunction.py (1462 of 2486)
PASS: lldb-unit :: Expression/./ExpressionTests/DiagnosticManagerTest.FixedExpression (1463 of 2486)
UNSUPPORTED: lldb-shell :: BuildScript/toolchain-clang-cl.test (1464 of 2486)
UNSUPPORTED: lldb-shell :: SymbolFile/PDB/vbases.test (1465 of 2486)
PASS: lldb-shell :: SymbolFile/NativePDB/source-list.cpp (1466 of 2486)
PASS: lldb-unit :: ScriptInterpreter/Python/./ScriptInterpreterPythonTests/PythonDataObjectsTest.TestExceptions (1467 of 2486)
PASS: lldb-shell :: Register/Core/x86-32-linux-multithread.test (1468 of 2486)
PASS: lldb-unit :: Utility/./UtilityTests/RangeDataVector.FindEntryThatContains_Overlap (1469 of 2486)
PASS: lldb-unit :: Process/minidump/./LLDBMinidumpTests/MinidumpParserTest.GetMemoryRegionInfoLinuxMapsError (1470 of 2486)
PASS: lldb-shell :: SymbolFile/DWARF/x86/debug_ranges-missing-section.s (1471 of 2486)
PASS: lldb-unit :: Language/Highlighting/./HighlighterTests/HighlighterTest.ClangCursorPosAfterOtherToken (1472 of 2486)
PASS: lldb-api :: python_api/symbol-context/two-files/TestSymbolContextTwoFiles.py (1473 of 2486)
PASS: lldb-api :: functionalities/pointer_num_children/TestPointerNumChildren.py (1474 of 2486)
PASS: lldb-shell :: SymbolFile/DWARF/x86/dir-separator-posix.s (1475 of 2486)
PASS: lldb-unit :: Host/./HostTests/FileSystemTest.GetPermissions (1476 of 2486)
PASS: lldb-api :: functionalities/data-formatter/data-formatter-stl/libcxx/string/TestDataFormatterLibcxxString.py (1477 of 2486)
PASS: lldb-unit :: Process/Utility/./ProcessUtilityTests/MemoryTagManagerAArch64MTETest.GetLogicalTag (1478 of 2486)
PASS: lldb-unit :: Utility/./UtilityTests/StreamTest.PutHex16ByteOrderBig (1479 of 2486)
PASS: lldb-api :: lang/cpp/static_methods/TestCPPStaticMethods.py (1480 of 2486)
UNSUPPORTED: lldb-api :: lang/objc/objc-dynamic-value/TestObjCDynamicValue.py (1481 of 2486)
PASS: lldb-api :: macosx/find-dsym/bundle-with-dot-in-filename/TestBundleWithDotInFilename.py (1482 of 2486)
PASS: lldb-api :: functionalities/data-formatter/data-formatter-proper-plurals/TestFormattersOneIsSingular.py (1483 of 2486)
PASS: lldb-unit :: Target/./TargetTests/RemoteAwarePlatformTest.TestResolveExecutabelOnClientByPlatform (1484 of 2486)
PASS: lldb-unit :: Utility/./UtilityTests/StreamTest.AddressRangeEmptyRange (1485 of 2486)
PASS: lldb-unit :: Utility/./UtilityTests/VMRange.IsValid (1486 of 2486)
PASS: lldb-unit :: Process/minidump/./LLDBMinidumpTests/RegisterContextMinidump.ConvertMinidumpContext_x86_32 (1487 of 2486)
PASS: lldb-unit :: Symbol/./SymbolTests/PostfixExpression.ParseFPOProgram (1488 of 2486)
PASS: lldb-unit :: Expression/./ExpressionTests/DWARFExpression.DW_OP_pick (1489 of 2486)
PASS: lldb-api :: python_api/watchpoint/condition/TestWatchpointConditionAPI.py (1490 of 2486)
PASS: lldb-unit :: Process/minidump/./LLDBMinidumpTests/MinidumpParserTest.GetMemoryRegionInfoFromMemory64List (1491 of 2486)
PASS: lldb-api :: functionalities/data-formatter/compactvectors/TestCompactVectors.py (1492 of 2486)
PASS: lldb-api :: functionalities/breakpoint/breakpoint_by_file_colon_line/TestBreakpointByFileColonLine.py (1493 of 2486)
PASS: lldb-api :: functionalities/var_path/TestVarPath.py (1494 of 2486)
PASS: lldb-unit :: Utility/./UtilityTests/BinaryStreamTest.PutSLEB128SixBytes (1495 of 2486)
UNSUPPORTED: lldb-shell :: Breakpoint/ppc64-localentry.test (1496 of 2486)
PASS: lldb-api :: functionalities/gdb_remote_client/TestGDBRemoteDiskFileCompletion.py (1497 of 2486)
PASS: lldb-unit :: Utility/./UtilityTests/UUIDTest.RelationalOperators (1498 of 2486)
PASS: lldb-api :: commands/platform/file/close/TestPlatformFileClose.py (1499 of 2486)
PASS: lldb-unit :: Utility/./UtilityTests/StreamTeeTest.Assignment (1500 of 2486)
PASS: lldb-unit :: Target/./TargetTests/PathMappingListTest.RelativeTests (1501 of 2486)
UNSUPPORTED: lldb-shell :: SymbolFile/PDB/class-layout.test (1502 of 2486)
UNSUPPORTED: lldb-shell :: ScriptInterpreter/Lua/convenience_variables.test (1503 of 2486)
PASS: lldb-shell :: ObjectFile/ELF/null-jmprel.yaml (1504 of 2486)
PASS: lldb-unit :: Language/CLanguages/./LanguageCLanguagesTests/CLanguages.LookupCLanguagesByLanguageType (1505 of 2486)
PASS: lldb-unit :: Symbol/./SymbolTests/TestTypeSystemClang.TestOwningModule (1506 of 2486)
PASS: lldb-api :: lang/objc/foundation/TestObjCMethodsNSError.py (1507 of 2486)
PASS: lldb-unit :: Utility/./UtilityTests/ScalarTest.Division (1508 of 2486)
PASS: lldb-api :: test_utils/base/TestBaseTest.py (1509 of 2486)
PASS: lldb-unit :: Utility/./UtilityTests/StreamTest.QuotedCString (1510 of 2486)
PASS: lldb-unit :: Expression/./ExpressionTests/ClangExpressionDeclMapTest.TestPersistentDeclLookup (1511 of 2486)
PASS: lldb-unit :: Language/Highlighting/./HighlighterTests/HighlighterTest.ClangCursorPos (1512 of 2486)
PASS: lldb-unit :: Symbol/./SymbolTests/TestClangASTImporter.MetadataPropagation (1513 of 2486)
PASS: lldb-api :: functionalities/data-formatter/typedef_array/TestTypedefArray.py (1514 of 2486)
PASS: lldb-unit :: Language/Highlighting/./HighlighterTests/HighlighterTest.ClangEmptyInput (1515 of 2486)
PASS: lldb-api :: functionalities/thread/concurrent_events/TestConcurrentTwoBreakpointsOneDelaySignal.py (1516 of 2486)
PASS: lldb-unit :: Utility/./UtilityTests/FileSpecTest.PrependPathComponent (1517 of 2486)
PASS: lldb-unit :: Process/Utility/./ProcessUtilityTests/MemoryTagManagerAArch64MTETest.AddressDiff (1518 of 2486)
PASS: lldb-shell :: SymbolFile/DWARF/x86/static_scope.s (1519 of 2486)
PASS: lldb-api :: functionalities/source-map/TestTargetSourceMap.py (1520 of 2486)
PASS: lldb-api :: functionalities/non-overlapping-index-variable-i/TestIndexVariable.py (1521 of 2486)
PASS: lldb-unit :: ScriptInterpreter/Python/./ScriptInterpreterPythonTests/PythonDataObjectsTest.TestBorrowedReferences (1522 of 2486)
PASS: lldb-shell :: Register/Core/x86-64-linux-fp.test (1523 of 2486)
UNSUPPORTED: lldb-shell :: Subprocess/clone-follow-parent-wp.test (1524 of 2486)
PASS: lldb-unit :: Utility/./UtilityTests/RegisterValueTest.GetScalarValue (1525 of 2486)
PASS: lldb-shell :: SymbolFile/DWARF/x86/DW_AT_const_value.s (1526 of 2486)
PASS: lldb-unit :: Utility/./UtilityTests/VASprintfTest.EncodingError (1527 of 2486)
PASS: lldb-unit :: Utility/./UtilityTests/ArgsTest.TestQuotedTrailingBackslash (1528 of 2486)
PASS: lldb-unit :: Symbol/./SymbolTests/TestClangASTImporter.MetadataPropagationIndirectImport (1529 of 2486)
PASS: lldb-unit :: Target/./TargetTests/DynamicRegisterInfoRegisterTest.SetRegisterInfo (1530 of 2486)
PASS: lldb-api :: functionalities/data-formatter/varscript_formatting/TestDataFormatterVarScriptFormatting.py (1531 of 2486)
PASS: lldb-api :: commands/expression/import-std-module/vector-bool/TestVectorBoolFromStdModule.py (1532 of 2486)
PASS: lldb-api :: functionalities/data-formatter/format-propagation/TestFormatPropagation.py (1533 of 2486)
PASS: lldb-unit :: UnwindAssembly/x86/./UnwindAssemblyx86Tests/Testx86AssemblyInspectionEngine.TestAddRSP (1534 of 2486)
PASS: lldb-unit :: Utility/./UtilityTests/Flags.AllClear (1535 of 2486)
PASS: lldb-unit :: Utility/./UtilityTests/VMRange.Reset (1536 of 2486)
PASS: lldb-unit :: Utility/./UtilityTests/PassiveReplayTest.InstrumentedFooInvalid (1537 of 2486)
PASS: lldb-api :: functionalities/multiword-commands/TestMultiWordCommands.py (1538 of 2486)
PASS: lldb-unit :: Utility/./UtilityTests/StringListTest.SplitIntoLinesSingleTrailingCR (1539 of 2486)
UNSUPPORTED: lldb-api :: functionalities/thread/state/TestThreadStates.py (1540 of 2486)
PASS: lldb-unit :: Utility/./UtilityTests/StreamTest.AddressRange (1541 of 2486)
PASS: lldb-unit :: Host/./HostTests/HostInfoTestInitialization.InitTwice (1542 of 2486)
UNSUPPORTED: lldb-shell :: Register/x86-64-ymm16-read.test (1543 of 2486)
PASS: lldb-api :: commands/expression/context-object/TestContextObject.py (1544 of 2486)
PASS: lldb-api :: sanity/TestModuleCacheSanity.py (1545 of 2486)
PASS: lldb-shell :: ObjectFile/PECOFF/sections.yaml (1546 of 2486)
PASS: lldb-unit :: debugserver/./debugserverTests/JSON.Parse (1547 of 2486)
PASS: lldb-unit :: Target/./TargetTests/ExecutionContextTest.GetByteOrder (1548 of 2486)
PASS: lldb-shell :: Quit/TestQuitExitCodeTooManyArgs.test (1549 of 2486)
PASS: lldb-api :: functionalities/thread/concurrent_events/TestConcurrentTwoBreakpointThreads.py (1550 of 2486)
XFAIL: lldb-shell :: Register/x86-mm-xmm-read.test (1551 of 2486)
PASS: lldb-unit :: Utility/./UtilityTests/UriParserTest.LongPath (1552 of 2486)
PASS: lldb-api :: functionalities/postmortem/elf-core/thread_crash/TestLinuxCoreThreads.py (1553 of 2486)
PASS: lldb-api :: macosx/universal/TestUniversal.py (1554 of 2486)
PASS: lldb-api :: types/TestFloatTypes.py (1555 of 2486)
PASS: lldb-unit :: Symbol/./SymbolTests/LineEntryTest.GetSameLineContiguousAddressRangeNoInlines (1556 of 2486)
PASS: lldb-shell :: ObjectFile/PECOFF/symbol.yaml (1557 of 2486)
PASS: lldb-unit :: Target/./TargetTests/DynamicRegisterInfoRegisterTest.addSupplementaryRegister (1558 of 2486)
PASS: lldb-shell :: SymbolFile/DWARF/deterministic-build.cpp (1559 of 2486)
PASS: lldb-api :: functionalities/abbreviation/TestAbbreviations.py (1560 of 2486)
PASS: lldb-api :: tools/lldb-vscode/evaluate/TestVSCode_evaluate.py (1561 of 2486)
PASS: lldb-unit :: Symbol/./SymbolTests/TestTypeSystemClang.TestDisplayNameEmpty (1562 of 2486)
UNSUPPORTED: lldb-api :: functionalities/thread/thread_specific_break_plus_condition/TestThreadSpecificBpPlusCondition.py (1563 of 2486)
PASS: lldb-api :: python_api/value/linked_list/TestValueAPILinkedList.py (1564 of 2486)
PASS: lldb-unit :: Utility/./UtilityTests/OptionsWithRawTest.TerminatedQuote (1565 of 2486)
PASS: lldb-unit :: Utility/./UtilityTests/RegisterValueTest.GetSet8 (1566 of 2486)
PASS: lldb-api :: lang/cpp/nsimport/TestCppNsImport.py (1567 of 2486)
PASS: lldb-shell :: ObjectFile/ELF/section-addresses.yaml (1568 of 2486)
PASS: lldb-unit :: UnwindAssembly/x86/./UnwindAssemblyx86Tests/Testx86AssemblyInspectionEngine.TestPushR15 (1569 of 2486)
XFAIL: lldb-shell :: Register/x86-64-fp-read.test (1570 of 2486)
PASS: lldb-unit :: Symbol/./SymbolTests/TestTypeSystemMap.GetTypeSystemForLanguageWithNoTarget (1571 of 2486)
PASS: lldb-api :: functionalities/memory/read/TestMemoryRead.py (1572 of 2486)
PASS: lldb-api :: lang/cpp/accelerator-table/TestCPPAccelerator.py (1573 of 2486)
PASS: lldb-unit :: Expression/./ExpressionTests/DiagnosticManagerTest.AppendMessageNoDiag (1574 of 2486)
PASS: lldb-api :: functionalities/data-formatter/hexcaps/TestDataFormatterHexCaps.py (1575 of 2486)
PASS: lldb-api :: commands/expression/context-object-objc/TestContextObjectObjc.py (1576 of 2486)
PASS: lldb-shell :: SymbolFile/DWARF/x86/debug_rnglists.s (1577 of 2486)
PASS: lldb-shell :: Driver/TestProcessAttach.test (1578 of 2486)
PASS: lldb-shell :: Settings/TestEchoCommands.test (1579 of 2486)
PASS: lldb-api :: commands/frame/diagnose/dereference-function-return/TestDiagnoseDereferenceFunctionReturn.py (1580 of 2486)
PASS: lldb-api :: commands/command/container/TestContainerCommands.py (1581 of 2486)
PASS: lldb-unit :: Language/Highlighting/./HighlighterTests/HighlighterTest.Keywords (1582 of 2486)
PASS: lldb-unit :: Platform/./LLDBPlatformTests/PlatformDarwinTest.GetCompatibleArchARMv6m (1583 of 2486)
PASS: lldb-api :: python_api/sbvalue_persist/TestSBValuePersist.py (1584 of 2486)
PASS: lldb-shell :: ScriptInterpreter/Python/Crashlog/json.test (1585 of 2486)
UNSUPPORTED: lldb-shell :: ScriptInterpreter/Lua/print.test (1586 of 2486)
PASS: lldb-api :: functionalities/thread/concurrent_events/TestConcurrentDelaySignalWatch.py (1587 of 2486)
PASS: lldb-unit :: Symbol/./SymbolTests/TestTypeSystemClang.TestDisplayName (1588 of 2486)
PASS: lldb-unit :: Utility/./UtilityTests/StringListTest.CopyListEmpty (1589 of 2486)
PASS: lldb-unit :: Core/./LLDBCoreTests/DumpDataExtractorTest.Formats (1590 of 2486)
PASS: lldb-api :: lang/cpp/break-on-initializers/TestBreakOnCPP11Initializers.py (1591 of 2486)
PASS: lldb-unit :: Utility/./UtilityTests/ArgsTest.ReplaceArgumentAtIndexLonger (1592 of 2486)
PASS: lldb-api :: commands/thread/select/TestThreadSelect.py (1593 of 2486)
PASS: lldb-unit :: Utility/./UtilityTests/StreamTeeTest.AppendStream (1594 of 2486)
PASS: lldb-unit :: Expression/./ExpressionTests/CppModuleConfigurationTest.IgnoreLibStdCpp (1595 of 2486)
PASS: lldb-shell :: Reproducer/TestFileRepro.test (1596 of 2486)
PASS: lldb-unit :: Core/./LLDBCoreTests/RichManglingContextTest.FromCxxMethodName (1597 of 2486)
PASS: lldb-unit :: Utility/./UtilityTests/ArgsTest.ReplaceArgumentAtIndexOutOfRange (1598 of 2486)
PASS: lldb-unit :: SymbolFile/DWARF/./SymbolFileDWARFTests/DWARFUnitTest.NullUnitDie (1599 of 2486)
PASS: lldb-shell :: ObjectFile/ELF/PT_LOAD-overlap.yaml (1600 of 2486)
PASS: lldb-shell :: SymbolFile/DWARF/x86/module-ownership.mm (1601 of 2486)
PASS: lldb-unit :: Utility/./UtilityTests/StreamTest.PutCStringWithStringRef (1602 of 2486)
PASS: lldb-unit :: Host/./HostTests/ProcessLaunchInfoTest.Constructor (1603 of 2486)
UNSUPPORTED: lldb-api :: android/platform/TestDefaultCacheLineSize.py (1604 of 2486)
PASS: lldb-unit :: SymbolFile/DWARF/./SymbolFileDWARFTests/DWARFDIETest.ChildIteration (1605 of 2486)
UNSUPPORTED: lldb-api :: linux/aarch64/unwind_signal/TestUnwindSignal.py (1606 of 2486)
PASS: lldb-unit :: Process/Utility/./ProcessUtilityTests/ProcSMapTests/LinuxProcSMapsTestFixture.ParseSMapRegions/4 (1607 of 2486)
PASS: lldb-api :: lang/c/cpp_keyword_identifiers/TestCppKeywordsAsCIdentifiers.py (1608 of 2486)
PASS: lldb-unit :: Utility/./UtilityTests/ArgsTest.TestMultipleArgs (1609 of 2486)
PASS: lldb-api :: commands/log/basic/TestLogging.py (1610 of 2486)
PASS: lldb-api :: commands/expression/issue_11588/Test11588.py (1611 of 2486)
PASS: lldb-unit :: Process/Utility/./ProcessUtilityTests/ProcMapTests/LinuxProcMapsTestFixture.ParseMapRegions/8 (1612 of 2486)
PASS: lldb-unit :: Utility/./UtilityTests/ConstStringTest.CompareStringRef (1613 of 2486)
PASS: lldb-unit :: Utility/./UtilityTests/BinaryStreamTest.PutULEB128Zero (1614 of 2486)
PASS: lldb-unit :: Utility/./UtilityTests/StreamTeeTest.Constructor1Stream (1615 of 2486)
PASS: lldb-shell :: Subprocess/fork-follow-parent-wp.test (1616 of 2486)
PASS: lldb-api :: functionalities/breakpoint/breakpoint_hit_count/TestBreakpointHitCount.py (1617 of 2486)
PASS: lldb-unit :: ScriptInterpreter/Python/./ScriptInterpreterPythonTests/PythonDataObjectsTest.TestExtractingUInt64ThroughStructuredData (1618 of 2486)
PASS: lldb-unit :: Utility/./UtilityTests/StreamTest.PutCharNull (1619 of 2486)
PASS: lldb-api :: commands/disassemble/basic/TestFrameDisassemble.py (1620 of 2486)
PASS: lldb-unit :: Utility/./UtilityTests/StreamTest.PutSLEB128 (1621 of 2486)
PASS: lldb-api :: commands/expression/persistent_variables/TestPersistentVariables.py (1622 of 2486)
PASS: lldb-shell :: Process/TestEnvironment.test (1623 of 2486)
PASS: lldb-unit :: ScriptInterpreter/Python/./ScriptInterpreterPythonTests/PythonDataObjectsTest.TestRun (1624 of 2486)
PASS: lldb-api :: functionalities/thread/concurrent_events/TestConcurrentDelayedCrashWithBreakpointWatchpoint.py (1625 of 2486)
PASS: lldb-api :: commands/apropos/basic/TestApropos.py (1626 of 2486)
PASS: lldb-api :: lang/cpp/multiple-inheritance/TestCppMultipleInheritance.py (1627 of 2486)
PASS: lldb-unit :: Host/./HostTests/HostInfoTest.GetHostname (1628 of 2486)
PASS: lldb-unit :: Utility/./UtilityTests/RegularExpression.CopyAssignment (1629 of 2486)
PASS: lldb-api :: commands/expression/import-std-module/list-dbg-info-content/TestDbgInfoContentListFromStdModule.py (1630 of 2486)
PASS: lldb-shell :: SymbolFile/NativePDB/globals-bss.cpp (1631 of 2486)
PASS: lldb-unit :: Expression/./ExpressionTests/DiagnosticManagerTest.AppendMessageSubsequentDiags (1632 of 2486)
PASS: lldb-unit :: Utility/./UtilityTests/StringListTest.ForRange (1633 of 2486)
PASS: lldb-api :: functionalities/thread/ignore_suspended/TestIgnoreSuspendedThread.py (1634 of 2486)
UNSUPPORTED: lldb-shell :: Subprocess/vfork-follow-child-softbp.test (1635 of 2486)
PASS: lldb-unit :: Process/gdb-remote/./ProcessGdbRemoteTests/GDBRemoteCommunicationServerTest.SendErrorResponse_Status (1636 of 2486)
UNSUPPORTED: lldb-api :: macosx/simulator/TestSimulatorPlatform.py (1637 of 2486)
PASS: lldb-api :: functionalities/gdb_remote_client/TestGDBRemotePlatformFile.py (1638 of 2486)
PASS: lldb-unit :: Utility/./UtilityTests/FileSpecTest.IsRelative (1639 of 2486)
PASS: lldb-api :: functionalities/thread/step_until/TestStepUntil.py (1640 of 2486)
PASS: lldb-unit :: Expression/./ExpressionTests/DWARFExpression.DW_OP_implicit_value (1641 of 2486)
PASS: lldb-api :: python_api/name_lookup/TestNameLookup.py (1642 of 2486)
PASS: lldb-unit :: DataFormatter/./LLDBFormatterTests/TypeMatcherTests.CreatedBySameMatchString (1643 of 2486)
PASS: lldb-unit :: UnwindAssembly/x86/./UnwindAssemblyx86Tests/Testx86AssemblyInspectionEngine.TestPopEBX (1644 of 2486)
UNSUPPORTED: lldb-shell :: Subprocess/clone-follow-child.test (1645 of 2486)
UNSUPPORTED: lldb-shell :: SymbolFile/PDB/function-level-linking.test (1646 of 2486)
PASS: lldb-api :: types/TestRecursiveTypes.py (1647 of 2486)
UNSUPPORTED: lldb-api :: functionalities/ptrauth_diagnostics/LDRAA_error/TestPtrauthLDRAADiagnostic.py (1648 of 2486)
PASS: lldb-unit :: Process/minidump/./LLDBMinidumpTests/MinidumpParserTest.GetPidWow64 (1649 of 2486)
PASS: lldb-api :: functionalities/unwind/noreturn/module-end/TestNoReturnModuleEnd.py (1650 of 2486)
PASS: lldb-unit :: Platform/./LLDBPlatformTests/PlatformAppleSimulatorTest.TestSimHasSimEnvionament (1651 of 2486)
UNSUPPORTED: lldb-shell :: SymbolFile/PDB/compilands.test (1652 of 2486)
PASS: lldb-shell :: ObjectFile/ELF/PT_LOAD.yaml (1653 of 2486)
PASS: lldb-unit :: Utility/./UtilityTests/StreamTest.PutPtr (1654 of 2486)
PASS: lldb-unit :: Utility/./UtilityTests/Flags.Test (1655 of 2486)
PASS: lldb-api :: functionalities/backticks/TestBackticksWithoutATarget.py (1656 of 2486)
UNSUPPORTED: lldb-shell :: SymbolFile/PDB/expressions.test (1657 of 2486)
PASS: lldb-api :: commands/gui/invalid-args/TestInvalidArgsGui.py (1658 of 2486)
PASS: lldb-api :: python_api/objc_type/TestObjCType.py (1659 of 2486)
PASS: lldb-api :: commands/expression/deleting-implicit-copy-constructor/TestDeletingImplicitCopyConstructor.py (1660 of 2486)
PASS: lldb-api :: functionalities/thread/thread_specific_break/TestThreadSpecificBreakpoint.py (1661 of 2486)
PASS: lldb-api :: macosx/add-dsym/TestAddDsymMidExecutionCommand.py (1662 of 2486)
PASS: lldb-api :: types/TestIntegerType.py (1663 of 2486)
PASS: lldb-unit :: Utility/./UtilityTests/ArchSpecTest.OperatorBool (1664 of 2486)
PASS: lldb-api :: python_api/section/TestSectionAPI.py (1665 of 2486)
PASS: lldb-api :: lang/objc/radar-9691614/TestObjCMethodReturningBOOL.py (1666 of 2486)
PASS: lldb-unit :: Process/Utility/./ProcessUtilityTests/ProcSMapTests/LinuxProcSMapsTestFixture.ParseSMapRegions/6 (1667 of 2486)
PASS: lldb-api :: commands/watchpoints/step_over_watchpoint/TestStepOverWatchpoint.py (1668 of 2486)
PASS: lldb-api :: functionalities/tsan/thread_numbers/TestTsanThreadNumbers.py (1669 of 2486)
PASS: lldb-shell :: Commands/command-target-modules-dump-sections.yaml (1670 of 2486)
PASS: lldb-unit :: Utility/./UtilityTests/XcodeSDKTest.GetCanonicalNameAndConstruct (1671 of 2486)
PASS: lldb-unit :: UnwindAssembly/x86/./UnwindAssemblyx86Tests/Testx86AssemblyInspectionEngine.TestPushEBP (1672 of 2486)
PASS: lldb-api :: lang/cpp/std-function-step-into-callable/TestStdFunctionStepIntoCallable.py (1673 of 2486)
PASS: lldb-unit :: Utility/./UtilityTests/ScalarTest.Getters (1674 of 2486)
PASS: lldb-api :: functionalities/gdb_remote_client/TestIOSSimulator.py (1675 of 2486)
PASS: lldb-api :: python_api/watchpoint/watchlocation/TestTargetWatchAddress.py (1676 of 2486)
PASS: lldb-api :: functionalities/load_lazy/TestLoadUsingLazyBind.py (1677 of 2486)
PASS: lldb-unit :: ScriptInterpreter/Python/./ScriptInterpreterPythonTests/PythonDataObjectsTest.TestPythonIntegerToStr (1678 of 2486)
PASS: lldb-api :: macosx/add-dsym/TestAddDsymDownload.py (1679 of 2486)
PASS: lldb-shell :: SymbolFile/Breakpad/line-table-missing-file.test (1680 of 2486)
PASS: lldb-unit :: Process/Utility/./ProcessUtilityTests/ProcMapTests/LinuxProcMapsTestFixture.ParseMapRegions/1 (1681 of 2486)
PASS: lldb-api :: macosx/dyld-trie-symbols/TestDyldTrieSymbols.py (1682 of 2486)
PASS: lldb-api :: functionalities/wrong_commands/TestWrongCommands.py (1683 of 2486)
PASS: lldb-unit :: Utility/./UtilityTests/NameMatchesTest.StartsWith (1684 of 2486)
PASS: lldb-unit :: ScriptInterpreter/Python/./ScriptInterpreterPythonTests/PythonDataObjectsTest.TestPythonListValueEquality (1685 of 2486)
PASS: lldb-api :: commands/frame/select/TestFrameSelect.py (1686 of 2486)
PASS: lldb-unit :: UnwindAssembly/x86/./UnwindAssemblyx86Tests/Testx86AssemblyInspectionEngine.TestCALLNextInsn (1687 of 2486)
PASS: lldb-unit :: Utility/./UtilityTests/StringExtractorTest.GetHexU8_InvalidHex (1688 of 2486)
PASS: lldb-api :: lang/objc/hidden-ivars/TestHiddenIvars.py (1689 of 2486)
PASS: lldb-unit :: Utility/./UtilityTests/StringExtractorTest.InitEmpty (1690 of 2486)
PASS: lldb-unit :: Utility/./UtilityTests/StreamTest.SetIndentLevel (1691 of 2486)
XFAIL: lldb-shell :: Register/x86-64-fp-write.test (1692 of 2486)
PASS: lldb-unit :: Utility/./UtilityTests/TimeoutTest.Construction (1693 of 2486)
PASS: lldb-api :: lang/cpp/this/TestCPPThis.py (1694 of 2486)
UNSUPPORTED: lldb-api :: linux/add-symbols/TestTargetSymbolsAddCommand.py (1695 of 2486)
UNSUPPORTED: lldb-api :: functionalities/longjmp/TestLongjmp.py (1696 of 2486)
PASS: lldb-unit :: Utility/./UtilityTests/StringExtractorTest.GetHexU8_Underflow_NoEof (1697 of 2486)
PASS: lldb-api :: python_api/target/TestTargetAPI.py (1698 of 2486)
PASS: lldb-api :: commands/expression/import-std-module/retry-with-std-module/TestRetryWithStdModule.py (1699 of 2486)
UNSUPPORTED: lldb-api :: linux/aarch64/mte_memory_region/TestAArch64LinuxMTEMemoryRegion.py (1700 of 2486)
PASS: lldb-api :: macosx/nslog/TestDarwinNSLogOutput.py (1701 of 2486)
PASS: lldb-unit :: Utility/./UtilityTests/ScalarTest.GetValue (1702 of 2486)
PASS: lldb-unit :: Utility/./UtilityTests/RangeTest.DefaultConstructor (1703 of 2486)
PASS: lldb-api :: lang/cpp/template/TestTemplateArgs.py (1704 of 2486)
PASS: lldb-api :: macosx/save_crashlog/TestSaveCrashlog.py (1705 of 2486)
PASS: lldb-api :: python_api/disassemble-raw-data/TestDisassemble_VST1_64.py (1706 of 2486)
PASS: lldb-unit :: Utility/./UtilityTests/BinaryStreamTest.PutULEB128MaxValue (1707 of 2486)
UNSUPPORTED: lldb-shell :: SymbolFile/PDB/variables-locations.test (1708 of 2486)
PASS: lldb-unit :: Utility/./UtilityTests/XcodeSDKTest.ParseTest (1709 of 2486)
PASS: lldb-unit :: Utility/./UtilityTests/DataExtractorTest.PeekData (1710 of 2486)
PASS: lldb-api :: macosx/version_zero/TestGetVersionZeroVersion.py (1711 of 2486)
PASS: lldb-shell :: SymbolFile/DWARF/x86/debug-types-signature-loop.s (1712 of 2486)
PASS: lldb-unit :: ScriptInterpreter/Python/./ScriptInterpreterPythonTests/PythonDataObjectsTest.TestPythonDictionaryManipulation (1713 of 2486)
PASS: lldb-unit :: Utility/./UtilityTests/NameMatchesTest.Ignore (1714 of 2486)
PASS: lldb-api :: lang/cpp/offsetof/TestOffsetofCpp.py (1715 of 2486)
PASS: lldb-shell :: Watchpoint/SetErrorCases.test (1716 of 2486)
PASS: lldb-unit :: Utility/./UtilityTests/SerializationRountripTest.SerializeDeserializeCStringArrayNullptrElem (1717 of 2486)
PASS: lldb-shell :: Expr/TestIRMemoryMap.test (1718 of 2486)
PASS: lldb-unit :: Utility/./UtilityTests/AnsiTerminal.WhiteSpace (1719 of 2486)
PASS: lldb-api :: commands/expression/import-std-module/vector-of-vectors/TestVectorOfVectorsFromStdModule.py (1720 of 2486)
PASS: lldb-shell :: SymbolFile/DWARF/x86/split-dwarf-multiple-cu.ll (1721 of 2486)
PASS: lldb-unit :: Utility/./UtilityTests/StringExtractorTest.GetHexBytes (1722 of 2486)
PASS: lldb-unit :: Language/Highlighting/./HighlighterTests/HighlighterTest.HighlighterSelectionPath (1723 of 2486)
PASS: lldb-api :: python_api/sblaunchinfo/TestSBLaunchInfo.py (1724 of 2486)
PASS: lldb-api :: functionalities/data-formatter/language_category_updates/TestDataFormatterLanguageCategoryUpdates.py (1725 of 2486)
PASS: lldb-unit :: Utility/./UtilityTests/DataExtractorTest.GetCStr (1726 of 2486)
PASS: lldb-unit :: Utility/./UtilityTests/TimerTest.CategoryTimes2 (1727 of 2486)
PASS: lldb-unit :: Host/./HostTests/SocketTests/SocketTest.DomainListenConnectAccept/ipv4 (1728 of 2486)
UNSUPPORTED: lldb-shell :: ScriptInterpreter/Lua/partial_statements.test (1729 of 2486)
PASS: lldb-unit :: tools/lldb-server/tests/./LLDBServerTests/TestBase.DebugserverEnv (1730 of 2486)
PASS: lldb-api :: commands/expression/char/TestExprsChar.py (1731 of 2486)
PASS: lldb-api :: commands/process/attach/attach_denied/TestAttachDenied.py (1732 of 2486)
PASS: lldb-unit :: Utility/./UtilityTests/NameMatchesTest.RegularExpression (1733 of 2486)
PASS: lldb-api :: functionalities/completion/TestCompletion.py (1734 of 2486)
PASS: lldb-unit :: Utility/./UtilityTests/NameMatchesTest.Contains (1735 of 2486)
PASS: lldb-unit :: UnwindAssembly/ARM64/./Arm64InstEmulationTests/TestArm64InstEmulation.TestSimpleDarwinFunction (1736 of 2486)
PASS: lldb-api :: lang/objc/objc-checker/TestObjCCheckers.py (1737 of 2486)
PASS: lldb-api :: macosx/DBGSourcePathRemapping/TestDSYMSourcePathRemapping.py (1738 of 2486)
PASS: lldb-shell :: Breakpoint/breakpoint-command.test (1739 of 2486)
PASS: lldb-api :: lang/cpp/namespace_conflicts/TestNamespaceConflicts.py (1740 of 2486)
PASS: lldb-api :: commands/expression/pr35310/TestExprsBug35310.py (1741 of 2486)
PASS: lldb-shell :: Driver/TestConvenienceVariables.test (1742 of 2486)
PASS: lldb-api :: functionalities/data-formatter/ostypeformatting/TestFormattersOsType.py (1743 of 2486)
PASS: lldb-api :: lang/cpp/unique-types/TestUniqueTypes.py (1744 of 2486)
PASS: lldb-unit :: DataFormatter/./LLDBFormatterTests/TypeMatcherTests.GetMatchStringExactName (1745 of 2486)
PASS: lldb-api :: functionalities/thread/jump/TestThreadJump.py (1746 of 2486)
PASS: lldb-api :: commands/watchpoints/watchpoint_set_command/TestWatchLocationWithWatchSet.py (1747 of 2486)
PASS: lldb-api :: functionalities/ubsan/basic/TestUbsanBasic.py (1748 of 2486)
PASS: lldb-api :: lang/objc/orderedset/TestOrderedSet.py (1749 of 2486)
PASS: lldb-shell :: Register/Core/x86-64-freebsd-gp.test (1750 of 2486)
PASS: lldb-api :: lang/objc/modules-auto-import/TestModulesAutoImport.py (1751 of 2486)
PASS: lldb-shell :: SymbolFile/DWARF/x86/DW_OP_piece-struct.s (1752 of 2486)
UNSUPPORTED: lldb-api :: functionalities/unwind/aarch64_unwind_pac/TestAArch64UnwindPAC.py (1753 of 2486)
PASS: lldb-api :: commands/expression/import-std-module/weak_ptr/TestWeakPtrFromStdModule.py (1754 of 2486)
PASS: lldb-api :: lang/objc/objc-new-syntax/TestObjCNewSyntaxLiteral.py (1755 of 2486)
PASS: lldb-unit :: Symbol/./SymbolTests/TestTypeSystemClang.GetExeModuleWhenMissingSymbolFile (1756 of 2486)
PASS: lldb-unit :: Host/./HostTests/FileActionTest.Open (1757 of 2486)
PASS: lldb-shell :: SymbolFile/DWARF/x86/debug_rnglists-dwp.s (1758 of 2486)
PASS: lldb-unit :: Symbol/./SymbolTests/TestClangASTImporter.DeportDeclTagDecl (1759 of 2486)
PASS: lldb-shell :: Commands/command-stop-hook-output.test (1760 of 2486)
PASS: lldb-shell :: ObjectFile/MachO/lc_build_version.yaml (1761 of 2486)
PASS: lldb-api :: api/check_public_api_headers/TestPublicAPIHeaders.py (1762 of 2486)
PASS: lldb-api :: python_api/watchpoint/watchlocation/TestSetWatchlocation.py (1763 of 2486)
PASS: lldb-shell :: Breakpoint/debug_rnglist_basic.test (1764 of 2486)
PASS: lldb-unit :: Expression/./ExpressionTests/CppModuleConfigurationTest.LinuxTargetSpecificInclude (1765 of 2486)
PASS: lldb-shell :: ScriptInterpreter/None/import_module.test (1766 of 2486)
PASS: lldb-api :: lang/objc/foundation/TestObjCMethodsNSArray.py (1767 of 2486)
PASS: lldb-api :: functionalities/gdb_remote_client/TestFork.py (1768 of 2486)
PASS: lldb-api :: functionalities/thread/concurrent_events/TestConcurrentSignalNWatchNBreak.py (1769 of 2486)
PASS: lldb-unit :: Utility/./UtilityTests/ArchSpecTest.TripleComponentsWereSpecified (1770 of 2486)
PASS: lldb-api :: sample_test/TestSampleTest.py (1771 of 2486)
PASS: lldb-unit :: Utility/./UtilityTests/LogChannelTest.Disable (1772 of 2486)
UNSUPPORTED: lldb-api :: benchmarks/libcxxlist/TestBenchmarkLibcxxList.py (1773 of 2486)
PASS: lldb-unit :: ObjectFile/Breakpad/./ObjectFileBreakpadTests/Record.classify (1774 of 2486)
PASS: lldb-api :: python_api/findvalue_duplist/TestSBFrameFindValue.py (1775 of 2486)
UNSUPPORTED: lldb-shell :: SymbolFile/PDB/calling-conventions.test (1776 of 2486)
PASS: lldb-shell :: Breakpoint/jit-loader_rtdyld_elf.test (1777 of 2486)
PASS: lldb-shell :: ObjectFile/PECOFF/sections-names.yaml (1778 of 2486)
PASS: lldb-api :: functionalities/data-formatter/data-formatter-synthval/TestDataFormatterSynthVal.py (1779 of 2486)
PASS: lldb-api :: commands/expression/import-std-module/empty-module/TestEmptyStdModule.py (1780 of 2486)
PASS: lldb-unit :: SymbolFile/NativePDB/./SymbolFileNativePDBTests/PDBFPOProgramToDWARFExpressionTests.UnknownOp (1781 of 2486)
PASS: lldb-api :: functionalities/recursion/TestValueObjectRecursion.py (1782 of 2486)
PASS: lldb-shell :: SymbolFile/DWARF/x86/dwarf5-index-is-used.cpp (1783 of 2486)
PASS: lldb-api :: lang/cpp/signed_types/TestSignedTypes.py (1784 of 2486)
PASS: lldb-unit :: Utility/./UtilityTests/BinaryStreamTest.PutULEB128TwoBytes (1785 of 2486)
PASS: lldb-unit :: Process/gdb-remote/./ProcessGdbRemoteTests/GDBRemoteCommunicationClientTest.TestPacketSpeedJSON (1786 of 2486)
PASS: lldb-api :: functionalities/thread/exit_during_break/TestExitDuringBreak.py (1787 of 2486)
PASS: lldb-api :: lang/cpp/char1632_t/TestChar1632T.py (1788 of 2486)
PASS: lldb-shell :: SymbolFile/NativePDB/break-by-line.cpp (1789 of 2486)
PASS: lldb-unit :: Language/CPlusPlus/./LanguageCPlusPlusTests/CPlusPlusLanguage.GenerateAlternateFunctionManglings (1790 of 2486)
PASS: lldb-shell :: Commands/command-image-lookup.yaml (1791 of 2486)
PASS: lldb-api :: functionalities/breakpoint/address_breakpoints/TestAddressBreakpoints.py (1792 of 2486)
PASS: lldb-unit :: Expression/./ExpressionTests/DiagnosticManagerTest.GetStringSeverityLabels (1793 of 2486)
PASS: lldb-shell :: Settings/TestModuleCacheSanity.test (1794 of 2486)
PASS: lldb-unit :: Utility/./UtilityTests/StreamTeeTest.GetStreamAtIndexOutOfBoundsEmpty (1795 of 2486)
UNSUPPORTED: lldb-shell :: Register/x86-64-gp-write.test (1796 of 2486)
PASS: lldb-api :: lang/objc/single-entry-dictionary/TestObjCSingleEntryDictionary.py (1797 of 2486)
PASS: lldb-api :: tools/lldb-server/TestLldbGdbServer.py (1798 of 2486)
PASS: lldb-api :: api/log/TestAPILog.py (1799 of 2486)
PASS: lldb-unit :: Symbol/./SymbolTests/TestTypeSystemClang.TestGetTypeClassNested (1800 of 2486)
PASS: lldb-unit :: Expression/./ExpressionTests/CppModuleConfigurationTest.MissingLibCpp (1801 of 2486)
PASS: lldb-unit :: Utility/./UtilityTests/PassiveReplayTest.InstrumentedBar (1802 of 2486)
PASS: lldb-unit :: Utility/./UtilityTests/BroadcasterTest.EventTypeHasListeners (1803 of 2486)
PASS: lldb-unit :: Symbol/./SymbolTests/TestTypeSystemClang.TestBuiltinTypeForEncodingAndBitSize (1804 of 2486)
UNSUPPORTED: lldb-api :: arm/breakpoint-thumb-codesection/TestBreakpointThumbCodesection.py (1805 of 2486)
PASS: lldb-shell :: SymbolFile/DWARF/x86/subprogram_ranges.test (1806 of 2486)
PASS: lldb-unit :: Symbol/./SymbolTests/TestScratchTypeSystemClang.InferSubASTFromLangOpts (1807 of 2486)
PASS: lldb-shell :: SymbolFile/DWARF/x86/find-function-regex.cpp (1808 of 2486)
UNSUPPORTED: lldb-shell :: Unwind/unwind-plan-dwarf-dump.test (1809 of 2486)
PASS: lldb-api :: functionalities/data-formatter/data-formatter-smart-array/TestDataFormatterSmartArray.py (1810 of 2486)
UNSUPPORTED: lldb-api :: functionalities/thread/multi_break/TestMultipleBreakpoints.py (1811 of 2486)
PASS: lldb-unit :: Utility/./UtilityTests/StringExtractorTest.GetU64BigEndian (1812 of 2486)
PASS: lldb-unit :: Signals/./SignalsTests/UnixSignalsTest.GetFilteredSignals (1813 of 2486)
PASS: lldb-unit :: Process/gdb-remote/./ProcessGdbRemoteTests/PortMapTest.FreePortForProcess (1814 of 2486)
PASS: lldb-unit :: Core/./LLDBCoreTests/DumpDataExtractorTest.MultiLine (1815 of 2486)
PASS: lldb-api :: commands/expression/import-std-module/unique_ptr-dbg-info-content/TestUniquePtrDbgInfoContent.py (1816 of 2486)
PASS: lldb-api :: types/TestIntegerTypeExpr.py (1817 of 2486)
PASS: lldb-unit :: UnwindAssembly/x86/./UnwindAssemblyx86Tests/Testx86AssemblyInspectionEngine.TestPushR13 (1818 of 2486)
PASS: lldb-unit :: Utility/./UtilityTests/AnsiTerminal.Basic (1819 of 2486)
PASS: lldb-api :: functionalities/reproducers/fs-case-sensitivity/TestReproducerFSCaseSensitivity.py (1820 of 2486)
PASS: lldb-api :: lang/objc/foundation/TestObjCMethodsString.py (1821 of 2486)
PASS: lldb-unit :: SymbolFile/DWARF/./SymbolFileDWARFTests/DWARFUnitTest.ClangProducer (1822 of 2486)
UNSUPPORTED: lldb-shell :: ScriptInterpreter/Lua/lua.test (1823 of 2486)
PASS: lldb-api :: functionalities/type_lookup/TestTypeLookup.py (1824 of 2486)
PASS: lldb-unit :: Utility/./UtilityTests/StringExtractorTest.GetHexU8_Exact_NoEof (1825 of 2486)
PASS: lldb-shell :: Settings/TestSettingsSet.test (1826 of 2486)
UNSUPPORTED: lldb-shell :: SymbolFile/PDB/ast-restore.test (1827 of 2486)
PASS: lldb-unit :: Utility/./UtilityTests/BinaryStreamTest.PutULEB128NineBytes (1828 of 2486)
PASS: lldb-unit :: Utility/./UtilityTests/UriParserTest.TypicalPortPathIPv4 (1829 of 2486)
PASS: lldb-api :: commands/expression/diagnostics/TestExprDiagnostics.py (1830 of 2486)
PASS: lldb-unit :: ScriptInterpreter/Python/./ScriptInterpreterPythonTests/PythonDataObjectsTest.TestPythonString (1831 of 2486)
UNSUPPORTED: lldb-shell :: Subprocess/fork-follow-child-wp.test (1832 of 2486)
PASS: lldb-api :: functionalities/data-formatter/data-formatter-ptr-to-array/TestPtrToArrayFormatting.py (1833 of 2486)
UNSUPPORTED: lldb-api :: functionalities/data-formatter/data-formatter-stl/libstdcpp/vector/TestDataFormatterStdVector.py (1834 of 2486)
PASS: lldb-api :: lang/cpp/gmodules/TestWithModuleDebugging.py (1835 of 2486)
PASS: lldb-unit :: Utility/./UtilityTests/RecordReplayTest.InvalidSequence (1836 of 2486)
PASS: lldb-unit :: Utility/./UtilityTests/UriParserTest.SchemeHostSeparator (1837 of 2486)
PASS: lldb-shell :: Reproducer/TestDriverOptions.test (1838 of 2486)
UNSUPPORTED: lldb-api :: benchmarks/turnaround/TestCompileRunToBreakpointTurnaround.py (1839 of 2486)
PASS: lldb-unit :: Utility/./UtilityTests/SerializationRountripTest.SerializeDeserializePod (1840 of 2486)
PASS: lldb-unit :: Host/./HostTests/ConnectionFileDescriptorTest.TCPGetURIv6 (1841 of 2486)
PASS: lldb-unit :: Utility/./UtilityTests/UriParserTest.Empty (1842 of 2486)
PASS: lldb-unit :: Utility/./UtilityTests/StreamTest.PutHex64ByteOrderLittle (1843 of 2486)
PASS: lldb-unit :: Process/gdb-remote/./ProcessGdbRemoteTests/GDBRemoteClientBaseTest.SendContinueDelegateInterface (1844 of 2486)
PASS: lldb-shell :: Minidump/Windows/Sigsegv/sigsegv.test (1845 of 2486)
PASS: lldb-api :: commands/expression/completion-in-lambda-and-unnamed-class/TestCompletionInLambdaAndUnnamedClass.py (1846 of 2486)
PASS: lldb-api :: functionalities/target_var/no_vars/TestTargetVarNoVars.py (1847 of 2486)
UNSUPPORTED: lldb-shell :: Register/x86-64-zmm-write.test (1848 of 2486)
PASS: lldb-api :: functionalities/signal/handle-abrt/TestHandleAbort.py (1849 of 2486)
PASS: lldb-unit :: UnwindAssembly/ARM64/./Arm64InstEmulationTests/TestArm64InstEmulation.TestFramelessThreeEpilogueFunction (1850 of 2486)
PASS: lldb-unit :: Language/Highlighting/./HighlighterTests/HighlighterTest.HighlighterSelectionType (1851 of 2486)
PASS: lldb-api :: commands/expression/fixits/TestFixIts.py (1852 of 2486)
PASS: lldb-unit :: Utility/./UtilityTests/StringListTest.ForRangeEmpty (1853 of 2486)
PASS: lldb-api :: functionalities/ptr_refs/TestPtrRefs.py (1854 of 2486)
PASS: lldb-api :: lang/cpp/breakpoint_in_member_func_w_non_primitive_params/TestBreakpointInMemberFuncWNonPrimitiveParams.py (1855 of 2486)
PASS: lldb-unit :: Process/Utility/./ProcessUtilityTests/ProcMapTests/LinuxProcMapsTestFixture.ParseMapRegions/7 (1856 of 2486)
PASS: lldb-api :: lang/cpp/overloaded-functions/TestOverloadedFunctions.py (1857 of 2486)
PASS: lldb-shell :: ObjectFile/ELF/section-types-edgecases.yaml (1858 of 2486)
PASS: lldb-unit :: Utility/./UtilityTests/RangeTest.ContainsEndInclusive (1859 of 2486)
PASS: lldb-api :: commands/command/script/import/TestImport.py (1860 of 2486)
PASS: lldb-unit :: Utility/./UtilityTests/StreamTeeTest.DefaultConstructor (1861 of 2486)
PASS: lldb-api :: functionalities/pre_run_dylibs/TestPreRunDylibs.py (1862 of 2486)
PASS: lldb-unit :: Utility/./UtilityTests/ReproducerTest.SetCapture (1863 of 2486)
PASS: lldb-shell :: SymbolFile/DWARF/x86/dead-code-filtering.yaml (1864 of 2486)
UNSUPPORTED: lldb-api :: functionalities/data-formatter/data-formatter-stl/libstdcpp/map/TestDataFormatterStdMap.py (1865 of 2486)
PASS: lldb-unit :: Language/Highlighting/./HighlighterTests/HighlighterTest.ClangCursorOutOfBounds (1866 of 2486)
PASS: lldb-api :: lang/objc/direct-dispatch-step/TestObjCDirectDispatchStepping.py (1867 of 2486)
PASS: lldb-api :: tools/lldb-vscode/step/TestVSCode_step.py (1868 of 2486)
PASS: lldb-unit :: Interpreter/./InterpreterTests/CompletionTest.DirCompletionAbsolute (1869 of 2486)
PASS: lldb-unit :: Utility/./UtilityTests/StringExtractorTest.DecodeHexU8_Underflow (1870 of 2486)
PASS: lldb-shell :: Reproducer/TestFinalize.test (1871 of 2486)
PASS: lldb-unit :: Utility/./UtilityTests/StringListTest.SetSize (1872 of 2486)
PASS: lldb-unit :: Symbol/./SymbolTests/TestTypeSystemClang.TestGetTypeClassTypeOfExpr (1873 of 2486)
PASS: lldb-unit :: Process/gdb-remote/./ProcessGdbRemoteTests/GDBRemoteClientBaseTest.SendContinueAndInterrupt (1874 of 2486)
PASS: lldb-unit :: Expression/./ExpressionTests/DiagnosticManagerTest.HasFixits (1875 of 2486)
PASS: lldb-unit :: Symbol/./SymbolTests/DWARFCallFrameInfoTest.Basic_eh (1876 of 2486)
PASS: lldb-unit :: Utility/./UtilityTests/ScalarTest.SetValueFromData (1877 of 2486)
PASS: lldb-unit :: DataFormatter/./LLDBFormatterTests/StringPrinterTests.CxxUTF8 (1878 of 2486)
UNSUPPORTED: lldb-api :: commands/watchpoints/variable_out_of_scope/TestWatchedVarHitWhenInScope.py (1879 of 2486)
PASS: lldb-unit :: Symbol/./SymbolTests/TestTypeSystemClang.TestFunctionTemplateInRecordConstruction (1880 of 2486)
PASS: lldb-api :: tools/lldb-server/TestGdbRemote_vCont.py (1881 of 2486)
PASS: lldb-unit :: Language/Highlighting/./HighlighterTests/HighlighterTest.ClangComments (1882 of 2486)
PASS: lldb-unit :: ScriptInterpreter/Python/./ScriptInterpreterPythonTests/PythonDataObjectsTest.TestPythonByteArray (1883 of 2486)
PASS: lldb-unit :: Host/./HostTests/File.GetStreamFromDescriptor (1884 of 2486)
PASS: lldb-unit :: Host/./HostTests/FileSystemTest.MakeAbsolute (1885 of 2486)
PASS: lldb-api :: lang/cpp/class-template-type-parameter-pack/TestClassTemplateTypeParameterPack.py (1886 of 2486)
PASS: lldb-unit :: Process/gdb-remote/./ProcessGdbRemoteTests/GDBRemoteClientBaseTest.InterruptNoResponse (1887 of 2486)
PASS: lldb-unit :: Process/gdb-remote/./ProcessGdbRemoteTests/GDBRemoteCommunicationClientTest.GetModulesInfo_UUID20 (1888 of 2486)
PASS: lldb-unit :: Utility/./UtilityTests/CompletionRequest.Constructor (1889 of 2486)
PASS: lldb-api :: lang/cpp/call-function/TestCallCPPFunction.py (1890 of 2486)
PASS: lldb-shell :: SymbolFile/Breakpad/line-table-mixed-path-styles.test (1891 of 2486)
PASS: lldb-api :: iohandler/resize/TestIOHandlerResize.py (1892 of 2486)
PASS: lldb-unit :: Language/Highlighting/./HighlighterTests/HighlighterTest.ClangCommas (1893 of 2486)
PASS: lldb-api :: lang/cpp/class-loading-via-member-typedef/TestClassLoadingViaMemberTypedef.py (1894 of 2486)
PASS: lldb-api :: commands/expression/completion-crash-incomplete-record/TestCompletionCrashIncompleteRecord.py (1895 of 2486)
PASS: lldb-unit :: Utility/./UtilityTests/RangeTest.SetRangeBase (1896 of 2486)
PASS: lldb-shell :: SymbolFile/DWARF/x86/array-sizes.s (1897 of 2486)
PASS: lldb-unit :: UnwindAssembly/x86/./UnwindAssemblyx86Tests/Testx86AssemblyInspectionEngine.TestStackRealign32BitDisp_x86_64 (1898 of 2486)
PASS: lldb-unit :: Utility/./UtilityTests/ArgsTest.TestSingleArgWithQuotedSpace (1899 of 2486)
PASS: lldb-api :: functionalities/thread/step_out/TestThreadStepOut.py (1900 of 2486)
PASS: lldb-unit :: Utility/./UtilityTests/UriParserTest.SchemeHostSeparator2 (1901 of 2486)
PASS: lldb-unit :: Platform/./LLDBPlatformTests/PlatformAppleSimulatorTest.TestHostPlatformToSim (1902 of 2486)
PASS: lldb-unit :: Utility/./UtilityTests/ConstStringTest.MangledCounterpart (1903 of 2486)
UNSUPPORTED: lldb-shell :: SymbolFile/DWARF/x86/dwarf5-line-strp.s (1904 of 2486)
PASS: lldb-unit :: Utility/./UtilityTests/StatusTest.ErrorConstructor (1905 of 2486)
PASS: lldb-shell :: Minidump/fb-dump.test (1906 of 2486)
PASS: lldb-api :: lang/cpp/complete-type-check/TestCppIsTypeComplete.py (1907 of 2486)
PASS: lldb-shell :: SymbolFile/DWARF/x86/DW_AT_low_pc-addrx.s (1908 of 2486)
PASS: lldb-api :: functionalities/jitloader_gdb/TestJITLoaderGDB.py (1909 of 2486)
PASS: lldb-unit :: Utility/./UtilityTests/DataExtractorTest.GetBitfield (1910 of 2486)
PASS: lldb-shell :: SymbolFile/NativePDB/break-by-function.cpp (1911 of 2486)
PASS: lldb-api :: functionalities/breakpoint/cpp_exception/TestCPPExceptionBreakpoint.py (1912 of 2486)
PASS: lldb-unit :: Utility/./UtilityTests/LogChannelTest.EnableOptions (1913 of 2486)
PASS: lldb-api :: commands/target/modules/search-paths/insert/TestTargetModulesSearchpathsInsert.py (1914 of 2486)
PASS: lldb-unit :: Utility/./UtilityTests/NameMatchesTest.Equals (1915 of 2486)
PASS: lldb-api :: types/TestShortTypeExpr.py (1916 of 2486)
PASS: lldb-api :: functionalities/data-formatter/data-formatter-objc/TestDataFormatterObjCCF.py (1917 of 2486)
PASS: lldb-api :: functionalities/gdb_remote_client/TestPty.py (1918 of 2486)
PASS: lldb-unit :: Utility/./UtilityTests/UUIDTest.StringConverion (1919 of 2486)
PASS: lldb-api :: python_api/sbenvironment/TestSBEnvironment.py (1920 of 2486)
PASS: lldb-unit :: Process/gdb-remote/./ProcessGdbRemoteTests/GDBRemoteCommunicationClientTest.GetMemoryRegionInfoInvalidResponse (1921 of 2486)
PASS: lldb-unit :: Utility/./UtilityTests/ArgsTest.GetShellSafeArgument (1922 of 2486)
PASS: lldb-unit :: Utility/./UtilityTests/VASprintfTest.BufferResize (1923 of 2486)
PASS: lldb-unit :: Utility/./UtilityTests/LogChannelEnabledTest.LogThread (1924 of 2486)
PASS: lldb-unit :: Utility/./UtilityTests/UriParserTest.SchemeHostSeparator3 (1925 of 2486)
PASS: lldb-api :: lang/objc/unicode-string/TestUnicodeString.py (1926 of 2486)
PASS: lldb-api :: lang/c/anonymous/TestAnonymous.py (1927 of 2486)
PASS: lldb-api :: commands/expression/regression-access-function-template-in-record/TestRegressionAccessFunctionTemplateInRecord.py (1928 of 2486)
PASS: lldb-api :: lang/c/inlines/TestRedefinitionsInInlines.py (1929 of 2486)
PASS: lldb-unit :: UnwindAssembly/x86/./UnwindAssemblyx86Tests/Testx86AssemblyInspectionEngine.TestPopR14 (1930 of 2486)
PASS: lldb-unit :: Utility/./UtilityTests/StringListTest.GetSize (1931 of 2486)
PASS: lldb-shell :: SymbolFile/DWARF/x86/dwarf5-atomic.s (1932 of 2486)
PASS: lldb-api :: lang/cpp/keywords_enabled/TestCppKeywordsEnabled.py (1933 of 2486)
UNSUPPORTED: lldb-shell :: ScriptInterpreter/Lua/breakpoint_function_callback.test (1934 of 2486)
PASS: lldb-unit :: UnwindAssembly/x86/./UnwindAssemblyx86Tests/Testx86AssemblyInspectionEngine.TestPopRBP (1935 of 2486)
PASS: lldb-api :: commands/expression/formatters/TestFormatters.py (1936 of 2486)
PASS: lldb-shell :: Register/Core/x86-32-linux-gp.test (1937 of 2486)
PASS: lldb-unit :: Host/./HostTests/NativeProcessProtocolTest.SetBreakpointFailVerify (1938 of 2486)
PASS: lldb-api :: functionalities/breakpoint/break_in_loaded_dylib/TestBreakInLoadedDylib.py (1939 of 2486)
PASS: lldb-api :: functionalities/load_unload/TestLoadUnload.py (1940 of 2486)
PASS: lldb-shell :: ObjectFile/PECOFF/dep-modules.yaml (1941 of 2486)
PASS: lldb-unit :: Core/./LLDBCoreTests/RichManglingContextTest.SwitchProvider (1942 of 2486)
UNSUPPORTED: lldb-api :: tools/lldb-server/TestGdbRemoteCompletion.py (1943 of 2486)
PASS: lldb-unit :: Symbol/./SymbolTests/TestClangASTImporter.DeportTypeTagDecl (1944 of 2486)
PASS: lldb-unit :: Process/Utility/./ProcessUtilityTests/ProcSMapTests/LinuxProcSMapsTestFixture.ParseSMapRegions/5 (1945 of 2486)
PASS: lldb-api :: lang/cpp/elaborated-types/TestElaboratedTypes.py (1946 of 2486)
PASS: lldb-api :: commands/target/dump-symtab-demangle/TestDumpSymtabDemangle.py (1947 of 2486)
PASS: lldb-shell :: Breakpoint/debug_rnglist_offset_pair.test (1948 of 2486)
PASS: lldb-api :: lang/objc/objc-static-method/TestObjCStaticMethod.py (1949 of 2486)
PASS: lldb-shell :: ObjectFile/MachO/lc_build_version_notools.yaml (1950 of 2486)
PASS: lldb-unit :: SymbolFile/NativePDB/./SymbolFileNativePDBTests/PDBFPOProgramToDWARFExpressionTests.InvalidAssignmentMultiple (1951 of 2486)
PASS: lldb-api :: lang/objc/objc-static-method-stripped/TestObjCStaticMethodStripped.py (1952 of 2486)
PASS: lldb-unit :: Utility/./UtilityTests/RangeTest.ContainsAddr (1953 of 2486)
PASS: lldb-api :: lang/cpp/this_class_type_mixing/TestThisClassTypeMixing.py (1954 of 2486)
PASS: lldb-api :: lang/cpp/trivial_abi/TestTrivialABI.py (1955 of 2486)
PASS: lldb-api :: functionalities/tsan/cpp_global_location/TestTsanCPPGlobalLocation.py (1956 of 2486)
PASS: lldb-unit :: Symbol/./SymbolTests/TestClangASTImporter.RecordLayout (1957 of 2486)
PASS: lldb-shell :: Register/Core/aarch64-freebsd-multithread.test (1958 of 2486)
PASS: lldb-api :: functionalities/set-data/TestSetData.py (1959 of 2486)
PASS: lldb-unit :: Utility/./UtilityTests/DataExtractorTest.GetULEB128_bit63 (1960 of 2486)
PASS: lldb-unit :: Utility/./UtilityTests/XcodeSDKTest.FindXcodeContentsDirectoryInPath (1961 of 2486)
PASS: lldb-unit :: ScriptInterpreter/Python/./ScriptInterpreterPythonTests/PythonDataObjectsTest.TestScript (1962 of 2486)
PASS: lldb-api :: commands/expression/import-std-module/queue/TestQueueFromStdModule.py (1963 of 2486)
PASS: lldb-unit :: SymbolFile/DWARF/./SymbolFileDWARFTests/XcodeSDKModuleTests.TestModuleGetXcodeSDK (1964 of 2486)
UNSUPPORTED: lldb-api :: tools/lldb-server/registers-target-xml-reading/TestGdbRemoteTargetXmlPacket.py (1965 of 2486)
PASS: lldb-shell :: ScriptInterpreter/Python/python.test (1966 of 2486)
PASS: lldb-shell :: SymbolFile/DWARF/x86/find-inline-method.s (1967 of 2486)
PASS: lldb-shell :: SymbolFile/Breakpad/unwind-via-stack-cfi.test (1968 of 2486)
PASS: lldb-unit :: Utility/./UtilityTests/BinaryStreamTest.PutULEB128ThreeBytes (1969 of 2486)
PASS: lldb-api :: functionalities/data-formatter/data-formatter-objc/TestDataFormatterObjCNSError.py (1970 of 2486)
PASS: lldb-shell :: Minidump/Windows/find-module.test (1971 of 2486)
PASS: lldb-api :: functionalities/tail_call_frames/disambiguate_tail_call_seq/TestDisambiguateTailCallSeq.py (1972 of 2486)
PASS: lldb-unit :: UnwindAssembly/x86/./UnwindAssemblyx86Tests/Testx86AssemblyInspectionEngine.TestLEAVE (1973 of 2486)
UNSUPPORTED: lldb-shell :: Subprocess/vfork-follow-child-wp.test (1974 of 2486)
PASS: lldb-api :: functionalities/thread/num_threads/TestNumThreads.py (1975 of 2486)
PASS: lldb-unit :: Utility/./UtilityTests/VMRange.CollectionContains (1976 of 2486)
PASS: lldb-unit :: debugserver/./debugserverTests/RNBSocket.LoopBackConnectIPv4 (1977 of 2486)
PASS: lldb-api :: functionalities/gdb_remote_client/TestRestartBug.py (1978 of 2486)
PASS: lldb-unit :: UnwindAssembly/x86/./UnwindAssemblyx86Tests/Testx86AssemblyInspectionEngine.Test32BitOnlyInstruction (1979 of 2486)
UNSUPPORTED: lldb-shell :: Register/x86-ymm-write.test (1980 of 2486)
PASS: lldb-unit :: Utility/./UtilityTests/StringListTest.JoinThree (1981 of 2486)
PASS: lldb-unit :: Symbol/./SymbolTests/LineEntryTest.GetAllExactLineColumnMatches (1982 of 2486)
PASS: lldb-api :: functionalities/thread/concurrent_events/TestConcurrentNWatchNBreak.py (1983 of 2486)
PASS: lldb-api :: functionalities/mtc/simple/TestMTCSimple.py (1984 of 2486)
PASS: lldb-api :: commands/expression/import_builtin_fileid/TestImportBuiltinFileID.py (1985 of 2486)
PASS: lldb-unit :: UnwindAssembly/x86/./UnwindAssemblyx86Tests/Testx86AssemblyInspectionEngine.TestPushRBPWithREX (1986 of 2486)
PASS: lldb-api :: python_api/symbol-context/TestSymbolContext.py (1987 of 2486)
PASS: lldb-shell :: Driver/TestPositionalArgs.test (1988 of 2486)
PASS: lldb-unit :: SymbolFile/DWARF/./SymbolFileDWARFTests/SymbolFileDWARFTests.TestAbbrevMissingTerminator (1989 of 2486)
PASS: lldb-api :: functionalities/dlopen_other_executable/TestDlopenOtherExecutable.py (1990 of 2486)
PASS: lldb-unit :: Utility/./UtilityTests/RegularExpression.Match (1991 of 2486)
PASS: lldb-unit :: ObjectFile/Breakpad/./ObjectFileBreakpadTests/PublicRecord.parse (1992 of 2486)
PASS: lldb-api :: lang/cpp/dynamic-value/TestDynamicValue.py (1993 of 2486)
PASS: lldb-api :: commands/expression/call-throws/TestCallThatThrows.py (1994 of 2486)
PASS: lldb-unit :: Expression/./ExpressionTests/DiagnosticManagerTest.GetStringBasic (1995 of 2486)
PASS: lldb-api :: lang/cpp/lambdas/TestLambdas.py (1996 of 2486)
PASS: lldb-shell :: Register/Core/x86-64-netbsd-multithread.test (1997 of 2486)
PASS: lldb-api :: functionalities/conditional_break/TestConditionalBreak.py (1998 of 2486)
PASS: lldb-api :: functionalities/breakpoint/breakpoint_by_line_and_column/TestBreakpointByLineAndColumn.py (1999 of 2486)
PASS: lldb-shell :: Driver/LocalLLDBInit.test (2000 of 2486)
PASS: lldb-unit :: Host/./HostTests/TerminalTest.SaveRestoreRAII (2001 of 2486)
PASS: lldb-shell :: SymbolFile/DWARF/x86/debug_loc.s (2002 of 2486)
PASS: lldb-api :: terminal/TestSTTYBeforeAndAfter.py (2003 of 2486)
PASS: lldb-unit :: Utility/./UtilityTests/StringListTest.LongestCommonPrefix (2004 of 2486)
PASS: lldb-unit :: Utility/./UtilityTests/DataExtractorTest.GetDouble (2005 of 2486)
PASS: lldb-shell :: SymbolFile/DWARF/x86/debug_aranges-empty-section.s (2006 of 2486)
PASS: lldb-api :: functionalities/gdb_remote_client/TestAArch64XMLRegOffsets.py (2007 of 2486)
PASS: lldb-unit :: Utility/./UtilityTests/RegularExpression.Empty (2008 of 2486)
PASS: lldb-api :: python_api/class_members/TestSBTypeClassMembers.py (2009 of 2486)
PASS: lldb-unit :: Utility/./UtilityTests/LogChannelEnabledTest.LogGetLogThread (2010 of 2486)
PASS: lldb-unit :: Utility/./UtilityTests/CompletionRequest.FakeLastArg (2011 of 2486)
PASS: lldb-api :: functionalities/gdb_remote_client/TestPlatformKill.py (2012 of 2486)
PASS: lldb-api :: commands/process/attach-resume/TestAttachResume.py (2013 of 2486)
UNSUPPORTED: lldb-shell :: ScriptInterpreter/Lua/nested_sessions.test (2014 of 2486)
PASS: lldb-unit :: Utility/./UtilityTests/ListenerTest.GetEventImmediate (2015 of 2486)
PASS: lldb-api :: tools/lldb-server/TestGdbRemoteExpeditedRegisters.py (2016 of 2486)
PASS: lldb-api :: lang/cpp/dereferencing_references/TestCPPDereferencingReferences.py (2017 of 2486)
PASS: lldb-api :: functionalities/data-formatter/data-formatter-objc/TestDataFormatterObjCNSData.py (2018 of 2486)
PASS: lldb-unit :: Target/./TargetTests/PathMappingListTest.CrossPlatformTests (2019 of 2486)
PASS: lldb-unit :: Symbol/./SymbolTests/TestTypeSystemClang.TestGetEnumIntegerTypeBasicTypes (2020 of 2486)
UNSUPPORTED: lldb-api :: functionalities/data-formatter/data-formatter-stl/libstdcpp/iterator/TestDataFormatterStdIterator.py (2021 of 2486)
PASS: lldb-unit :: Utility/./UtilityTests/UriParserTest.SchemeHostSeparator4 (2022 of 2486)
PASS: lldb-unit :: Utility/./UtilityTests/SubsystemRAIITest.NormalSubsystem (2023 of 2486)
PASS: lldb-shell :: ObjectFile/ELF/riscv-arch.yaml (2024 of 2486)
PASS: lldb-unit :: Utility/./UtilityTests/StreamTest.ShiftOperatorPtr (2025 of 2486)
PASS: lldb-unit :: Utility/./UtilityTests/ArchSpecTest.MergeFromMachOUnknown (2026 of 2486)
PASS: lldb-api :: python_api/sbtype_typeclass/TestSBTypeTypeClass.py (2027 of 2486)
PASS: lldb-unit :: Host/./HostTests/XML.GetAs (2028 of 2486)
PASS: lldb-unit :: Utility/./UtilityTests/StringListTest.GetMaxStringLengthDecreasingSize (2029 of 2486)
PASS: lldb-api :: iohandler/resize/TestIOHandlerResizeNoEditline.py (2030 of 2486)
PASS: lldb-api :: lang/cpp/function_refs/TestFunctionRefs.py (2031 of 2486)
PASS: lldb-unit :: Host/./HostTests/SocketTests/SocketTest.TCPGetConnectURI/ipv6 (2032 of 2486)
FAIL: lldb-api :: commands/gui/expand-threads-tree/TestGuiExpandThreadsTree.py (2033 of 2486)
******************** TEST 'lldb-api :: commands/gui/expand-threads-tree/TestGuiExpandThreadsTree.py' FAILED ********************
Script:
--
/usr/local/Frameworks/Python.framework/Versions/3.7/bin/python3.7 /Users/buildslave/jenkins/workspace/lldb-cmake/llvm-project/lldb/test/API/dotest.py -u CXXFLAGS -u CFLAGS --codesign-identity lldb_codesign --arch x86_64 --build-dir /Users/buildslave/jenkins/workspace/lldb-cmake/lldb-build/lldb-test-build.noindex -t --env TERM=vt100 --env LLVM_LIBS_DIR=/Users/buildslave/jenkins/workspace/lldb-cmake/lldb-build/./lib --arch x86_64 --build-dir /Users/buildslave/jenkins/workspace/lldb-cmake/lldb-build/lldb-test-build.noindex --lldb-module-cache-dir /Users/buildslave/jenkins/workspace/lldb-cmake/lldb-build/lldb-test-build.noindex/module-cache-lldb/lldb-api --clang-module-cache-dir /Users/buildslave/jenkins/workspace/lldb-cmake/lldb-build/lldb-test-build.noindex/module-cache-clang/lldb-api --executable /Users/buildslave/jenkins/workspace/lldb-cmake/lldb-build/./bin/lldb --compiler /Users/buildslave/jenkins/workspace/lldb-cmake/lldb-build/./bin/clang --dsymutil /Users/buildslave/jenkins/workspace/lldb-cmake/lldb-build/./bin/dsymutil --llvm-tools-dir /Users/buildslave/jenkins/workspace/lldb-cmake/lldb-build/./bin --lldb-libs-dir /Users/buildslave/jenkins/workspace/lldb-cmake/lldb-build/./lib /Users/buildslave/jenkins/workspace/lldb-cmake/llvm-project/lldb/test/API/commands/gui/expand-threads-tree -p TestGuiExpandThreadsTree.py
--
Exit Code: 1

Hide Details

Command Output (stdout): -- lldb version 14.0.99 (http://labmaster3.local/git/llvm-project.git revision 729bf9b26b657df8ddad2e5a63377e6afb349a18) clang revision 729bf9b26b657df8ddad2e5a63377e6afb349a18 llvm revision 729bf9b26b657df8ddad2e5a63377e6afb349a18 (lldb) settings clear -all (lldb) settings set symbols.enable-external-lookup false (lldb) settings set target.inherit-tcc true (lldb) settings set target.detach-on-error false (lldb) settings set target.auto-apply-fixits false (lldb) settings set plugin.process.gdb-remote.packet-timeout 60 (lldb) settings set symbols.clang-modules-cache-path "/Users/buildslave/jenkins/workspace/lldb-cmake/lldb-build/lldb-test-build.noindex/module-cache-lldb/lldb-api" (lldb) settings set use-color false (lldb) setting set target.prefer-dynamic-value no-dynamic-values (lldb) target create "/Users/buildslave/jenkins/workspace/lldb-cmake/lldb-build/lldb-test-build.noindex/commands/gui/expand-threads-tree/TestGuiExpandThreadsTree.test_gui/a.out" Current executable set to '/Users/buildslave/jenkins/workspace/lldb-cmake/lldb-build/lldb-test-build.noindex/commands/gui/expand-threads-tree/TestGuiExpandThreadsTree.test_gui/a.out' (x86_64). (lldb) breakpoint set -n break_here breakpoint set -n break_here Breakpoint 1: where = a.out`break_here() + 4 at main.cpp:8:20, address = 0x0000000100000b54 (lldb) run run Process 57526 launched: '/Users/buildslave/jenkins/workspace/lldb-cmake/lldb-build/lldb-test-build.noindex/commands/gui/expand-threads-tree/TestGuiExpandThreadsTree.test_gui/a.out' (x86_64) Process 57526 stopped * thread #2, stop reason = breakpoint 1.1 frame #0: 0x0000000100000b54 a.out`break_here() at main.cpp:8:20 5 pseudo_barrier_t barrier_before; 6 pseudo_barrier_t barrier_after; 7 -> 8 void break_here() {} ^ 9 10 void thread_func() { 11 pseudo_barrier_wait(barrier_before); (lldb) gui gui (B)0[?7h[?1h=| LLDB (F1) | Target (F2) | Process (F3) | Thread (F4) | View (F5) | Help (F6) | lqq<Sources>qqqqqqqqqqqqqqqqqqqqqqqqqqqqqqqqqqqqqqqqqqqqqqqqqqqqqqqqqqqqqqqqqqqqqqqqqqqqqqqqqqqqqqqqqqqqqqqqqqqqqqqqqqqqqqqqqqqqqqqqqqqqqqqqqqqqqqqqqqqqqqqqqqqqqqqqqqqqqqqqqqqqqqqqqqqqqqqqqqqqqqqqqqqqqqqqqqqqqqqqqqqqqqqqqqqqqqqqqqqqqqqqqqqqqqqqqqqqqqqqqqqqqqqqqqqqqqqqqqqqqqqqqqqqqqqqqqqqqqqqqqqqqqqqqqqqqqqqqqqqqqqqqqqqqqqqqqqqqqqqqqqqqqqqqqqqqqqqqqqqqqqqqqqqqqqqqqqqqqqqqqqqqqqqqqqqqqqqqqqqqqqqqqqklqq<Threads>qqqqqqqqqqqqqqqqqqqqqqqqqqqqqqqqqqqqqqqqqqqqqqqqqqqqqqqqqqqqqqqqqqqqqqqqqqqqqqqqqqqqqqqkx a.out`break_here() xx `qprocess 57526xx 1 x #include "pseudo_barrier.h"xx tq`qthread #1: tid = 0xa75cb7xx 2 x #include <thread>xx mq`qthread #2: tid = 0xa75d2a, stop reason = breakpoint 1.1xx 3 xxx tqframe #0: break_here() + 4xx 4 xxx tqframe #1: thread_func() + 62xx 5 x pseudo_barrier_t barrier_before;xx tqframe #2: decltype(static_cast<void (*>(fp)()) std::__1::__invoke<void (*)()>(void (*&&)()) +xx 6 x pseudo_barrier_t barrier_after;xx tqframe #3: void std::__1::__thread_execute<std::__1::unique_ptr<std::__1::__thread_struct, stdxx 7 xxx tqframe #4: void* std::__1::__thread_proxy<std::__1::tuple<std::__1::unique_ptr<std::__1::__thrxx 8 x`void break_here() {} <<< Thread 2: breakpoint 1.1xx tqframe #5: _pthread_start + 148xx 9 xxx mqframe #6: thread_start + 15xx 10 x void thread_func() {xxxx 11 x pseudo_barrier_wait(barrier_before);xxxx 12 x break_here();xxxx 13 x pseudo_barrier_wait(barrier_after);xxxx 14 x }xxxx 15 xxxxx 16 x int main() {xxxx 17 x pseudo_barrier_init(barrier_before, 2);xxxx 18 x pseudo_barrier_init(barrier_after, 2);xxxx 19 x std::thread thread(thread_func);xxxx 20 x pseudo_barrier_wait(barrier_before);xxxx 21 x pseudo_barrier_wait(barrier_after);xxxx 22 x thread.join();xxxx 23 x return 0;xxxx 24 x }xxxx 25 xxxxxxxxxxxxxxxxxxxxxxxxxxxxxxxxxxxxxxxxxxxxxxxxxxxxxxxxxlqq<Help>qqqqqqqqqqqqqqqqqqqqqqqqqqqqqqqqqqqqqqqqqqqqqqqqqqqqqqqqqqqqqqqqqqqqqqqqqqqqqqqkxxxxx Welcome to the LLDB curses GUI.xxxxxxxxxxxx Press the TAB key to change the selected view.xxxxxx Each view has its own keyboard shortcuts, press 'h' to open a dialog to display them. xxxxxxxxxxxx Common key bindings for all views:xxxxxxxxxxxxtab - Select next viewxxxxxx back-tab key - Select previous viewxxxxxxh - Show help dialog with view specific key bindingsxxxxxx, - Page upxxxxxx. - Page downxxxxxxup - Select previousxxxxxxdown - Select nextxxxxxxleft - Unexpand or select parentxxxxxxright - Expandxxxxxx page-up - Page upxxxxxx page-down - Page downxxxxxmqqqqqqqqqqqqqqqqqqqqqqqqqqqqqqqqqqqqqqqqqqqqqqqqqqqqqqqqqqqqqq[Press any key to exit]qqjxxxxxxxxxxxxxxxxxxxxxxxxxxxxxxxmqqqqqqqqqqqqqqqqqqqqqqqqqqqqqqqqqqqqqqqqqqqqqqqqqqqqqqqqqqqqqqqqqqqqqqqqqqqqqqqqqqqqqqqqqqqqqqqqqqqqqqqqqqqqqqqqqqqqqqqqqqqqqqqqqqqqqqqqqqqqqqqqqqqqqqqqqqqqqqqqqqqqqqqqqqqqqqqqqqqqqqqqqqqqqqqqqqqqqqqqqqqqqqqqqqqqqqqqqqqqqqqqqqqqqqqqqqqqqqqqqqqqqqqqqqqqqqqqqqqqqqqqqqqqqqqqqqqqqqqqqqqqqqqqqqqqqqqqqqqqqqqqqqqqqqqqqqqqqqqqqqqqqqqqqqqqqqqqqqqqqqqqqqqqqqqqqqqqqqqqqqqqqqqqqqqqqqqqqqqqqqqqqqqqqqqqqqqqqqjxxlqq<Variables>qqqqqqqqqqqqqqqqqqqqqqqqqqqqqqqqqqqqqqqqqqqqqqqqqqqqqqqqqqqqqqqqqqqqqqqqqqqqqqqqqqqqqqqqqqqqqqqqqqqqqqqqqqqqqqqqqqqqqqqqqqqqqqqqqqqqqqqqqqqqqqqqqqqqqqqqqqqqqqqqqqqqqqqqqqqqqqqqqqqqqqqqqqqqqqqqqqqqqqqqqqqqqqqqqqqqqqqqqqqqqqqqqqqqqqqqqqqqqqqqqqqqqqqqqqqqqqqqqqqqqqqqqqqqqqqqqqqqqqqqqqqqqqqqqqqqqqqqqqqqqqqqqqqqqqqqqqqqqqqqqqqqqqqqqqqqqqqqqqqqqqqqqqqqqqqqqqqqqqqqqqqqqqqqqqqqqqqqqqqqqqqqqkxxx `q(pseudo_barrier_t) ::barrier_beforexxxx `q(pseudo_barrier_t) ::barrier_afterxxxxxxxxxxxxxxxxxxxxxxxxxxxxxxxxxxxxxxxxxxxxxxxxxxxxxxxxxxxxxxxxxxxxxxxxxxxxxxxxxxxxxxxxxxxxxxxxxxxxxxxxxxxmqqqqqqqqqqqqqqqqqqqqqqqqqqqqqqqqqqqqqqqqqqqqqqqqqqqqqqqqqqqqqqqqqqqqqqqqqqqqqqqqqqqqqqqqqqqqqqqqqqqqqqqqqqqqqqqqqqqqqqqqqqqqqqqqqqqqqqqqqqqqqqqqqqqqqqqqqqqqqqqqqqqqqqqqqqqqqqqqqqqqqqqqqqqqqqqqqqqqqqqqqqqqqqqqqqqqqqqqqqqqqqqqqqqqqqqqqqqqqqqqqqqqqqqqqqqqqqqqqqqqqqqqqqqqqqqqqqqqqqqqqqqqqqqqqqqqqqqqqqqqqqqqqqqqqqqqqqqqqqqqqqqqqqqqqqqqqqqqqqqqqqqqqqqqqqqqqqqqqqqqqqqqqqqqqqqqqqqqqqqqqqqqqqqqqqqqqqqqqqjmqqqqqqqqqqqqqqqqqqqqqqqqqqqqqqqqqqqqqqqqqqqqqqqqqqqqqqqqqqqqqqqqqqqqqqqqqqqqqqqqqqqqqqqqqqqqqqqqqqjProcess: 57526 stopped Thread: 0xa75d2a Frame: 0 PC = 0x0000000100000b54 lqq<Sources>qqqqqqqqqqqqqqqqqqqqqqqqqqqqqqqqqqqqqqqqqqqqqqqqqqqqqqqqqqqqqqqqqqqqqqqqqqqqqqqqqqqqqqqqqqqqqqqqqqqqqqqqqqqqqqqqqqqqqqqqqqqqqqqqqqqqqqqqqqqqqqqqqqqqqqqqqqqqqqqqqqqqqqqqqqqqqqqqqqqqqqqqqqqqqqqqqqqqqqqqqqqqqqqqqqqqqqqqqqqqqqqqqqqqqqqqqqqqqqqqqqqqqqqqqqqqqqqqqqqqqqqqqqqqqqqqqqqqqqqqqqqqqqqqqqqqqqqqqqqqqqqqqqqqqqqqqqqqqqqqqqqqqqqqqqqqqqqqqqqqqqqqqqqqqqqqqqqqqqqqqqqqqqqqqqqqqqqqqqqqqqqqqqqk xx xx xx xx xx xx xx xx xx xx xx xx xx xx xx xx xx xx xx xx xx xx xx xx xx xx xx xx xx xx xx xx xx xx xx xx xx xx xx x x x  x x  x x  x x x x  x x  x x  x x   x x  x x   x x   x x   x x   x x   x x   x x   x x  x x  x x x xx xx xx xx xx xx xx mqqqqqqqqqqqqqqqqqqqqqqqqqqqqqqqqqqqqqqqqqqqqqqqqqqqqqqqqqqqqqqqqqqqqqqqqqqqqqqqqqqqqqqqqqqqqqqqqqqqqqqqqqqqqqqqqqqqqqqqqqqqqqqqqqqqqqqqqqqqqqqqqqqqqqqqqqqqqqqqqqqqqqqqqqqqqqqqqqqqqqqqqqqqqqqqqqqqqqqqqqqqqqqqqqqqqqqqqqqqqqqqqqqqqqqqqqqqqqqqqqqqqqqqqqqqqqqqqqqqqqqqqqqqqqqqqqqqqqqqqqqqqqqqqqqqqqqqqqqqqqqqqqqqqqqqqqqqqqqqqqqqqqqqqqqqqqqqqqqqqqqqqqqqqqqqqqqqqqqqqqqqqqqqqqqqqqqqqqqqqqqqqqqqqqqqqqqqqqqj [?1l>(lldb) thread select 1 gui thread select 1 (lldb) gui (B)0[?7h[?1h=settings set interpreter.prompt-on-quit false quit Skipping the following test categories: ['libstdcxx', 'dwo', 'llgs', 'fork']

Hide Details

-- Command Output (stderr): -- Change dir to: /Users/buildslave/jenkins/workspace/lldb-cmake/llvm-project/lldb/test/API/commands/gui/expand-threads-tree runCmd: settings clear -all output:

Hide Details

runCmd: settings set symbols.enable-external-lookup false output:

Hide Details

runCmd: settings set target.inherit-tcc true output:

Hide Details

runCmd: settings set target.detach-on-error false output:

Hide Details

runCmd: settings set target.auto-apply-fixits false output:

Hide Details

runCmd: settings set plugin.process.gdb-remote.packet-timeout 60 output:

Hide Details

runCmd: settings set symbols.clang-modules-cache-path "/Users/buildslave/jenkins/workspace/lldb-cmake/lldb-build/lldb-test-build.noindex/module-cache-lldb/lldb-api" output:

Hide Details

runCmd: settings set use-color false output:

Hide Details

runCmd: setting set target.prefer-dynamic-value no-dynamic-values output:

Hide Details

make VPATH=/Users/buildslave/jenkins/workspace/lldb-cmake/llvm-project/lldb/test/API/commands/gui/expand-threads-tree -C /Users/buildslave/jenkins/workspace/lldb-cmake/lldb-build/lldb-test-build.noindex/commands/gui/expand-threads-tree/TestGuiExpandThreadsTree.test_gui -I /Users/buildslave/jenkins/workspace/lldb-cmake/llvm-project/lldb/test/API/commands/gui/expand-threads-tree -I /Users/buildslave/jenkins/workspace/lldb-cmake/llvm-project/lldb/packages/Python/lldbsuite/test/make -f /Users/buildslave/jenkins/workspace/lldb-cmake/llvm-project/lldb/test/API/commands/gui/expand-threads-tree/Makefile all ARCH=x86_64 'CC="/Users/buildslave/jenkins/workspace/lldb-cmake/lldb-build/bin/clang"' DSYMUTIL=/Users/buildslave/jenkins/workspace/lldb-cmake/lldb-build/./bin/dsymutil CODESIGN=codesign CLANG_MODULE_CACHE_DIR=/Users/buildslave/jenkins/workspace/lldb-cmake/lldb-build/lldb-test-build.noindex/module-cache-clang/lldb-api

Hide Details

"/Users/buildslave/jenkins/workspace/lldb-cmake/lldb-build/bin/clang" -std=c++11 -g -O0 -fno-builtin -isysroot "/Applications/Xcode.app/Contents/Developer/Platforms/MacOSX.platform/Developer/SDKs/MacOSX10.15.sdk" -arch x86_64 -I/Users/buildslave/jenkins/workspace/lldb-cmake/llvm-project/lldb/packages/Python/lldbsuite/test/make/../../../../../include -I/Users/buildslave/jenkins/workspace/lldb-cmake/llvm-project/lldb/test/API/commands/gui/expand-threads-tree -I/Users/buildslave/jenkins/workspace/lldb-cmake/llvm-project/lldb/packages/Python/lldbsuite/test/make -include /Users/buildslave/jenkins/workspace/lldb-cmake/llvm-project/lldb/packages/Python/lldbsuite/test/make/test_common.h -fno-limit-debug-info --driver-mode=g++ -MT main.o -MD -MP -MF main.d -c -o main.o /Users/buildslave/jenkins/workspace/lldb-cmake/llvm-project/lldb/test/API/commands/gui/expand-threads-tree/main.cpp "/Users/buildslave/jenkins/workspace/lldb-cmake/lldb-build/bin/clang" main.o -g -O0 -fno-builtin -isysroot "/Applications/Xcode.app/Contents/Developer/Platforms/MacOSX.platform/Developer/SDKs/MacOSX10.15.sdk" -arch x86_64 -I/Users/buildslave/jenkins/workspace/lldb-cmake/llvm-project/lldb/packages/Python/lldbsuite/test/make/../../../../../include -I/Users/buildslave/jenkins/workspace/lldb-cmake/llvm-project/lldb/test/API/commands/gui/expand-threads-tree -I/Users/buildslave/jenkins/workspace/lldb-cmake/llvm-project/lldb/packages/Python/lldbsuite/test/make -include /Users/buildslave/jenkins/workspace/lldb-cmake/llvm-project/lldb/packages/Python/lldbsuite/test/make/test_common.h -fno-limit-debug-info --driver-mode=g++ -o "a.out" codesign -s - "a.out" "/Users/buildslave/jenkins/workspace/lldb-cmake/lldb-build/./bin/dsymutil" -o "a.out.dSYM" "a.out"

Hide Details

Hide Details

FAIL: LLDB (/Users/buildslave/jenkins/workspace/lldb-cmake/lldb-build/bin/clang-x86_64) :: test_gui (TestGuiExpandThreadsTree.TestGuiExpandThreadsTree) tearing down the child process....

Hide Details

Restore dir to: /Users/buildslave/jenkins/workspace/lldb-cmake/lldb-build/tools/lldb/test ====================================================================== ERROR: test_gui (TestGuiExpandThreadsTree.TestGuiExpandThreadsTree) ---------------------------------------------------------------------- Traceback (most recent call last): File "/Users/buildslave/jenkins/workspace/lldb-cmake/llvm-project/lldb/third_party/Python/module/pexpect-4.6/pexpect/expect.py", line 111, in expect_loop incoming = spawn.read_nonblocking(spawn.maxread, timeout) File "/Users/buildslave/jenkins/workspace/lldb-cmake/llvm-project/lldb/third_party/Python/module/pexpect-4.6/pexpect/pty_spawn.py", line 482, in read_nonblocking raise TIMEOUT('Timeout exceeded.') pexpect.exceptions.TIMEOUT: Timeout exceeded.

Hide Details

During handling of the above exception, another exception occurred:

Hide Details

Traceback (most recent call last): File "/Users/buildslave/jenkins/workspace/lldb-cmake/llvm-project/lldb/packages/Python/lldbsuite/test/decorators.py", line 152, in wrapper return func(*args, **kwargs) File "/Users/buildslave/jenkins/workspace/lldb-cmake/llvm-project/lldb/packages/Python/lldbsuite/test/decorators.py", line 152, in wrapper return func(*args, **kwargs) File "/Users/buildslave/jenkins/workspace/lldb-cmake/llvm-project/lldb/test/API/commands/gui/expand-threads-tree/TestGuiExpandThreadsTree.py", line 47, in test_gui self.child.expect_exact("Threads") File "/Users/buildslave/jenkins/workspace/lldb-cmake/llvm-project/lldb/third_party/Python/module/pexpect-4.6/pexpect/spawnbase.py", line 418, in expect_exact return exp.expect_loop(timeout) File "/Users/buildslave/jenkins/workspace/lldb-cmake/llvm-project/lldb/third_party/Python/module/pexpect-4.6/pexpect/expect.py", line 119, in expect_loop return self.timeout(e) File "/Users/buildslave/jenkins/workspace/lldb-cmake/llvm-project/lldb/third_party/Python/module/pexpect-4.6/pexpect/expect.py", line 82, in timeout raise TIMEOUT(msg) pexpect.exceptions.TIMEOUT: Timeout exceeded. <pexpect.pty_spawn.spawn object at 0x10b58e4a8> command: /Users/buildslave/jenkins/workspace/lldb-cmake/lldb-build/bin/lldb args: ['/Users/buildslave/jenkins/workspace/lldb-cmake/lldb-build/bin/lldb', '--no-lldbinit', '--no-use-colors', '-O', 'settings clear -all', '-O', 'settings set symbols.enable-external-lookup false', '-O', 'settings set target.inherit-tcc true', '-O', 'settings set target.detach-on-error false', '-O', 'settings set target.auto-apply-fixits false', '-O', 'settings set plugin.process.gdb-remote.packet-timeout 60', '-O', 'settings set symbols.clang-modules-cache-path "/Users/buildslave/jenkins/workspace/lldb-cmake/lldb-build/lldb-test-build.noindex/module-cache-lldb/lldb-api"', '-O', 'settings set use-color false', '-O', 'setting set target.prefer-dynamic-value no-dynamic-values', '--file', '/Users/buildslave/jenkins/workspace/lldb-cmake/lldb-build/lldb-test-build.noindex/commands/gui/expand-threads-tree/TestGuiExpandThreadsTree.test_gui/a.out'] buffer (last 100 chars): b'thread select 1\r\n(lldb) gui\r\n\x1b(B\x1b)0\x1b[1;100r\x1b[m\x0f\x1b[?7h\x1b[?1h\x1b=' before (last 100 chars): b'thread select 1\r\n(lldb) gui\r\n\x1b(B\x1b)0\x1b[1;100r\x1b[m\x0f\x1b[?7h\x1b[?1h\x1b=' after: <class 'pexpect.exceptions.TIMEOUT'> match: None match_index: None exitstatus: None flag_eof: False pid: 57522 child_fd: 7 closed: False timeout: 60 delimiter: <class 'pexpect.exceptions.EOF'> logfile: <_io.BufferedWriter name='<stdout>'> logfile_read: None logfile_send: None maxread: 2000 ignorecase: False searchwindowsize: None delaybeforesend: 0.05 delayafterclose: 0.1 delayafterterminate: 0.1 searcher: searcher_string: 0: b'Threads' Config=x86_64-/Users/buildslave/jenkins/workspace/lldb-cmake/lldb-build/bin/clang ---------------------------------------------------------------------- Ran 1 test in 123.622s

Hide Details

RESULT: FAILED (0 passes, 0 failures, 1 errors, 0 skipped, 0 expected failures, 0 unexpected successes)

Hide Details

--

Hide Details

******************** PASS: lldb-unit :: Platform/./LLDBPlatformTests/PlatformDarwinTest.GetCompatibleArchARMv7em (2034 of 2486) PASS: lldb-unit :: Utility/./UtilityTests/LogChannelTest.List (2035 of 2486) PASS: lldb-unit :: Core/./LLDBCoreTests/FormatEntityTest.DefinitionConstructionNameTypeData (2036 of 2486) PASS: lldb-unit :: Utility/./UtilityTests/StringListTest.GetMaxStringLengthEqualSize (2037 of 2486) PASS: lldb-api :: lang/objc/rdar-11355592/TestRdar11355592.py (2038 of 2486) PASS: lldb-unit :: Utility/./UtilityTests/Flags.GetBitSize (2039 of 2486) PASS: lldb-unit :: ScriptInterpreter/Python/./ScriptInterpreterPythonTests/PythonDataObjectsTest.TestPythonListToStructuredList (2040 of 2486) PASS: lldb-unit :: Utility/./UtilityTests/BroadcasterTest.BroadcastEvent (2041 of 2486) PASS: lldb-api :: commands/memory/write/TestMemoryWrite.py (2042 of 2486) PASS: lldb-unit :: SymbolFile/NativePDB/./SymbolFileNativePDBTests/PDBFPOProgramToDWARFExpressionTests.UnresolvedRegisterAssignmentReference (2043 of 2486) PASS: lldb-api :: functionalities/find-line-entry/TestFindLineEntry.py (2044 of 2486) PASS: lldb-unit :: Utility/./UtilityTests/Flags.AllSet (2045 of 2486) PASS: lldb-shell :: SymbolFile/DWARF/x86/find-method.cpp (2046 of 2486) PASS: lldb-shell :: SymbolFile/DWARF/x86/find-basic-function.cpp (2047 of 2486) PASS: lldb-api :: functionalities/thread/backtrace_all/TestBacktraceAll.py (2048 of 2486) PASS: lldb-unit :: debugserver/./debugserverTests/RNBSocket.LoopBackListenIPv6 (2049 of 2486) UNSUPPORTED: lldb-api :: lang/c/typedef/Testtypedef.py (2050 of 2486) PASS: lldb-api :: commands/expression/import-std-module/forward_decl_from_module/TestForwardDeclFromStdModule.py (2051 of 2486) PASS: lldb-api :: commands/expression/save_jit_objects/TestSaveJITObjects.py (2052 of 2486) PASS: lldb-unit :: Utility/./UtilityTests/StreamTeeTest.Flush (2053 of 2486) PASS: lldb-shell :: SymbolFile/DWARF/x86/dwarf5-split.s (2054 of 2486) PASS: lldb-unit :: Host/./HostTests/SocketTests/SocketTest.DomainGetConnectURI/ipv4 (2055 of 2486) PASS: lldb-api :: functionalities/thread/crash_during_step/TestCrashDuringStep.py (2056 of 2486) PASS: lldb-unit :: Utility/./UtilityTests/VMRange.Ordering (2057 of 2486) PASS: lldb-shell :: SymbolFile/DWARF/clang-ast-from-dwarf-objc-property.m (2058 of 2486) XFAIL: lldb-shell :: Register/x86-mm-xmm-write.test (2059 of 2486) PASS: lldb-api :: functionalities/data-formatter/data-formatter-disabling/TestDataFormatterDisabling.py (2060 of 2486) PASS: lldb-unit :: Process/gdb-remote/./ProcessGdbRemoteTests/GDBRemoteCommunicationClientTest.GetModulesInfo (2061 of 2486) PASS: lldb-api :: functionalities/thread/concurrent_events/TestConcurrentTwoWatchpointsOneDelayBreakpoint.py (2062 of 2486) PASS: lldb-unit :: Expression/./ExpressionTests/CppModuleConfigurationTest.UnrelatedLibrary (2063 of 2486) PASS: lldb-unit :: Interpreter/./InterpreterTests/OptionValueArgs.DeepCopy (2064 of 2486) UNSUPPORTED: lldb-shell :: Subprocess/vfork-follow-parent-wp.test (2065 of 2486) PASS: lldb-api :: lang/cpp/covariant-return-types/TestCovariantReturnTypes.py (2066 of 2486) PASS: lldb-unit :: Symbol/./SymbolTests/TestClangASTImporter.ImportInvalidType (2067 of 2486) UNSUPPORTED: lldb-api :: tools/lldb-server/TestGdbRemoteAuxvSupport.py (2068 of 2486) PASS: lldb-unit :: Interpreter/./InterpreterTests/TestProperties.DeepCopy (2069 of 2486) PASS: lldb-api :: lang/c/set_values/TestSetValues.py (2070 of 2486) PASS: lldb-api :: functionalities/inferior-crashing/recursive-inferior/TestRecursiveInferior.py (2071 of 2486) PASS: lldb-unit :: Utility/./UtilityTests/DataExtractorTest.GetDoubleUnaligned (2072 of 2486) UNSUPPORTED: lldb-shell :: SymbolFile/PDB/enums-layout.test (2073 of 2486) PASS: lldb-api :: commands/command/script/TestCommandScript.py (2074 of 2486) PASS: lldb-shell :: Minidump/dump-all.test (2075 of 2486) PASS: lldb-api :: functionalities/tail_call_frames/disambiguate_call_site/TestDisambiguateCallSite.py (2076 of 2486) PASS: lldb-api :: functionalities/process_group/TestChangeProcessGroup.py (2077 of 2486) PASS: lldb-unit :: Expression/./ExpressionTests/DiagnosticManagerTest.AddDiagnostic (2078 of 2486) PASS: lldb-shell :: Unwind/eh-frame-dwarf-unwind.test (2079 of 2486) PASS: lldb-unit :: Utility/./UtilityTests/IndexToObjectTest.ObjectForIndex (2080 of 2486) PASS: lldb-unit :: Process/gdb-remote/./ProcessGdbRemoteTests/GDBRemoteClientBaseTest.SendContinueAndAsyncPacket (2081 of 2486) PASS: lldb-unit :: SymbolFile/DWARF/./SymbolFileDWARFTests/SymbolFileDWARFTests.TestAbbrevOrder1Start1 (2082 of 2486) PASS: lldb-shell :: SymbolFile/Breakpad/line-table-edgecases.test (2083 of 2486) PASS: lldb-api :: lang/objc/objc-super/TestObjCSuper.py (2084 of 2486) PASS: lldb-unit :: API/./APITests/SBStructuredDataTest.NullImpl (2085 of 2486) PASS: lldb-api :: macosx/function-starts/TestFunctionStarts.py (2086 of 2486) PASS: lldb-unit :: Utility/./UtilityTests/RangeTest.DoesAdjoinOrIntersect (2087 of 2486) PASS: lldb-unit :: Expression/./ExpressionTests/DWARFExpression.DW_OP_stack_value (2088 of 2486) PASS: lldb-shell :: SymbolFile/DWARF/x86/dir-separator-windows.s (2089 of 2486) PASS: lldb-api :: types/TestLongTypes.py (2090 of 2486) PASS: lldb-api :: python_api/watchpoint/TestSetWatchpoint.py (2091 of 2486) UNSUPPORTED: lldb-api :: benchmarks/libcxxmap/TestBenchmarkLibcxxMap.py (2092 of 2486) PASS: lldb-unit :: Expression/./ExpressionTests/DWARFExpressionMockProcessTest.DW_OP_deref (2093 of 2486) PASS: lldb-unit :: Utility/./UtilityTests/UUIDTest.Validity (2094 of 2486) PASS: lldb-unit :: Process/gdb-remote/./ProcessGdbRemoteTests/GDBRemoteCommunicationClientTest.SyncThreadState (2095 of 2486) UNSUPPORTED: lldb-shell :: SymbolFile/DWARF/x86/DW_TAG_variable-DW_AT_decl_file-DW_AT_abstract_origin-crosscu1.s (2096 of 2486) PASS: lldb-unit :: ObjectFile/Breakpad/./ObjectFileBreakpadTests/ModuleRecord.parse (2097 of 2486) PASS: lldb-api :: tools/lldb-vscode/launch/TestVSCode_launch.py (2098 of 2486) PASS: lldb-unit :: Utility/./UtilityTests/DataExtractorTest.GetFloatUnaligned (2099 of 2486) PASS: lldb-unit :: Utility/./UtilityTests/StringLexerTest.GetUnlexed (2100 of 2486) PASS: lldb-unit :: Core/./LLDBCoreTests/SourceLocationSpecTest.FileLineColumnComponents (2101 of 2486) PASS: lldb-api :: commands/expression/persistent_ptr_update/TestPersistentPtrUpdate.py (2102 of 2486) PASS: lldb-unit :: Process/Utility/./ProcessUtilityTests/ProcMapTests/LinuxProcMapsTestFixture.ParseMapRegions/4 (2103 of 2486) PASS: lldb-api :: lang/cpp/namespace_definitions/TestNamespaceDefinitions.py (2104 of 2486) PASS: lldb-unit :: UnwindAssembly/x86/./UnwindAssemblyx86Tests/Testx86AssemblyInspectionEngine.TestPushRBX (2105 of 2486) PASS: lldb-shell :: ObjectFile/ELF/eh_frame-symbols.yaml (2106 of 2486) UNSUPPORTED: lldb-api :: tools/lldb-vscode/completions/TestVSCode_completions.py (2107 of 2486) PASS: lldb-unit :: ScriptInterpreter/Python/./ScriptInterpreterPythonTests/PythonDataObjectsTest.TestPythonBytes (2108 of 2486) PASS: lldb-shell :: ObjectFile/PECOFF/basic-info-arm.yaml (2109 of 2486) PASS: lldb-unit :: Utility/./UtilityTests/ArchSpecTest.YAML (2110 of 2486) PASS: lldb-unit :: Utility/./UtilityTests/StatusTest.ErrorConversion (2111 of 2486) PASS: lldb-unit :: Host/./HostTests/SocketTests/SocketTest.TCPGetAddress/ipv4 (2112 of 2486) PASS: lldb-shell :: ObjectFile/PECOFF/section-types.yaml (2113 of 2486) PASS: lldb-api :: commands/platform/file/read/TestPlatformFileRead.py (2114 of 2486) PASS: lldb-api :: lang/cpp/diamond/TestCppDiamond.py (2115 of 2486) PASS: lldb-api :: lang/objc/objc-ivar-stripped/TestObjCIvarStripped.py (2116 of 2486) PASS: lldb-unit :: Process/gdb-remote/./ProcessGdbRemoteTests/GDBRemoteClientBaseTest.SendContinueAndInterrupt2PacketBug (2117 of 2486) PASS: lldb-unit :: Host/./HostTests/HostInfoTest.GetAugmentedArchSpec (2118 of 2486) PASS: lldb-api :: commands/disassemble/basic/TestDisassembleBreakpoint.py (2119 of 2486) PASS: lldb-shell :: ObjectFile/ELF/avr-basic-info.yaml (2120 of 2486) PASS: lldb-api :: types/TestCharTypeExpr.py (2121 of 2486) PASS: lldb-api :: functionalities/data-formatter/parray/TestPrintArray.py (2122 of 2486) PASS: lldb-shell :: ObjectFile/Breakpad/sections.test (2123 of 2486) PASS: lldb-unit :: Utility/./UtilityTests/AnsiTerminal.AtStart (2124 of 2486) PASS: lldb-shell :: Expr/TestMultilineExpr.test (2125 of 2486) PASS: lldb-unit :: Expression/./ExpressionTests/DWARFExpression.DW_OP_convert (2126 of 2486) PASS: lldb-api :: functionalities/multidebugger_commands/TestMultipleDebuggersCommands.py (2127 of 2486) PASS: lldb-unit :: Symbol/./SymbolTests/TestTypeSystemClang.TestConvertAccessTypeToAccessSpecifier (2128 of 2486) PASS: lldb-unit :: Interpreter/./InterpreterTests/OptionArgParserTest.toChar (2129 of 2486) PASS: lldb-shell :: Quit/TestQuitExitCodeNonInt.test (2130 of 2486) PASS: lldb-unit :: Utility/./UtilityTests/StreamTest.ShiftOperatorStrings (2131 of 2486) PASS: lldb-unit :: Utility/./UtilityTests/VMRange.SetEndAddress (2132 of 2486) PASS: lldb-unit :: Platform/./LLDBPlatformTests/PlatformDarwinTest.GetCompatibleArchARMv4 (2133 of 2486) PASS: lldb-shell :: SymbolFile/DWARF/x86/debug-types-dwo-cross-reference.cpp (2134 of 2486) PASS: lldb-api :: python_api/lldbutil/TestSwigVersion.py (2135 of 2486) PASS: lldb-api :: lang/c/unicode/TestUnicodeSymbols.py (2136 of 2486) PASS: lldb-unit :: UnwindAssembly/x86/./UnwindAssemblyx86Tests/Testx86AssemblyInspectionEngine.TestReturnDetect (2137 of 2486) PASS: lldb-api :: lang/cpp/forward-declared-template-specialization/TestCppForwardDeclaredTemplateSpecialization.py (2138 of 2486) PASS: lldb-unit :: Symbol/./SymbolTests/PostfixExpression.ParseOneExpression (2139 of 2486) PASS: lldb-api :: functionalities/data-formatter/data-formatter-objc/TestDataFormatterObjNSException.py (2140 of 2486) PASS: lldb-shell :: Unwind/thread-step-out-ret-addr-check.test (2141 of 2486) PASS: lldb-unit :: Host/./HostTests/SocketTests/SocketTest.UDPConnect/ipv6 (2142 of 2486) PASS: lldb-api :: commands/expression/expr-in-syscall/TestExpressionInSyscall.py (2143 of 2486) PASS: lldb-unit :: Utility/./UtilityTests/RangeTest.Slide (2144 of 2486) PASS: lldb-api :: functionalities/breakpoint/auto_continue/TestBreakpointAutoContinue.py (2145 of 2486) PASS: lldb-unit :: Utility/./UtilityTests/StreamTest.AddressEmptyPrefix (2146 of 2486) PASS: lldb-api :: commands/expression/invalid-args/TestInvalidArgsExpression.py (2147 of 2486) PASS: lldb-unit :: Utility/./UtilityTests/ArgsTest.GetArgumentArrayRef (2148 of 2486) PASS: lldb-unit :: Utility/./UtilityTests/TildeExpressionResolver.ResolveFullPath (2149 of 2486) PASS: lldb-api :: commands/expression/namespace_local_var_same_name_obj_c/TestNamespaceLocalVarSameNameObjC.py (2150 of 2486) PASS: lldb-unit :: Utility/./UtilityTests/OptionsWithRawTest.EmptyInput (2151 of 2486) PASS: lldb-unit :: Process/Utility/./ProcessUtilityTests/RegisterContext_x86Test.FullToAbridgedTagWord (2152 of 2486) PASS: lldb-unit :: Utility/./UtilityTests/StreamTeeTest.SetStreamAtIndexOverwrite (2153 of 2486) PASS: lldb-unit :: ScriptInterpreter/Python/./ScriptInterpreterPythonTests/PythonDataObjectsTest.TestPythonIntegerToStructuredInteger (2154 of 2486) PASS: lldb-unit :: Platform/./LLDBPlatformTests/PlatformDarwinTest.GetCompatibleArchARMv7 (2155 of 2486) PASS: lldb-unit :: Utility/./UtilityTests/StringListTest.Clear (2156 of 2486) PASS: lldb-unit :: Host/./HostTests/NativeProcessProtocolTest.SetBreakpoint (2157 of 2486) PASS: lldb-api :: python_api/breakpoint/TestBreakpointAPI.py (2158 of 2486) PASS: lldb-unit :: Utility/./UtilityTests/ConstStringTest.UpdateMangledCounterpart (2159 of 2486) PASS: lldb-api :: functionalities/unwind/noreturn/TestNoreturnUnwind.py (2160 of 2486) PASS: lldb-api :: lang/cpp/sizeof/TestCPPSizeof.py (2161 of 2486) PASS: lldb-unit :: Utility/./UtilityTests/FileSpecTest.FileAndDirectoryComponents (2162 of 2486) PASS: lldb-unit :: Utility/./UtilityTests/RangeTest.Constructor (2163 of 2486) PASS: lldb-api :: lang/objc/objc-baseclass-sbtype/TestObjCBaseClassSBType.py (2164 of 2486) PASS: lldb-unit :: Utility/./UtilityTests/UriParserTest.BracketedHostname (2165 of 2486) PASS: lldb-unit :: ScriptInterpreter/Python/./ScriptInterpreterPythonTests/PythonDataObjectsTest.TestPythonCallableInvoke (2166 of 2486) PASS: lldb-api :: commands/expression/result_numbering/TestResultNumbering.py (2167 of 2486) PASS: lldb-unit :: Utility/./UtilityTests/LogChannelEnabledTest.LogVerboseThread (2168 of 2486) PASS: lldb-api :: commands/expression/multiline-completion/TestMultilineCompletion.py (2169 of 2486) PASS: lldb-unit :: Utility/./UtilityTests/StructuredDataTest.StringDump (2170 of 2486) PASS: lldb-unit :: Expression/./ExpressionTests/CppModuleConfigurationTest.LibCppV2 (2171 of 2486) PASS: lldb-api :: functionalities/testid/TestTestId.py (2172 of 2486) PASS: lldb-unit :: Utility/./UtilityTests/UriParserTest.MinimalPath (2173 of 2486) PASS: lldb-unit :: Utility/./UtilityTests/StringListTest.GetMaxStringLengthEmpty (2174 of 2486) PASS: lldb-unit :: Host/./HostTests/PipeTest.OpenAsReader (2175 of 2486) PASS: lldb-api :: commands/command/invalid-args/TestInvalidArgsCommand.py (2176 of 2486) PASS: lldb-unit :: SymbolFile/DWARF/./SymbolFileDWARFTests/SymbolFileDWARFTests.TestAbbrevValidAttrNullForm (2177 of 2486) PASS: lldb-api :: lang/cpp/printf/TestPrintf.py (2178 of 2486) PASS: lldb-api :: commands/frame/var-scope/TestFrameVariableScope.py (2179 of 2486) PASS: lldb-unit :: Expression/./ExpressionTests/CppModuleConfigurationTest.AmbiguousCLib (2180 of 2486) PASS: lldb-api :: functionalities/thread/concurrent_events/TestConcurrentTwoBreakpointsOneSignal.py (2181 of 2486) PASS: lldb-api :: functionalities/data-formatter/nsarraysynth/TestNSArraySynthetic.py (2182 of 2486) PASS: lldb-unit :: SymbolFile/DWARF/./SymbolFileDWARFTests/SymbolFileDWARFTests.ParseAranges (2183 of 2486) UNSUPPORTED: lldb-shell :: Register/x86-64-xmm16-read.test (2184 of 2486) PASS: lldb-api :: repl/clang/TestClangREPL.py (2185 of 2486) PASS: lldb-api :: functionalities/data-formatter/data-formatter-stl/libcxx/queue/TestDataFormatterLibcxxQueue.py (2186 of 2486) UNSUPPORTED: lldb-api :: linux/sepdebugsymlink/TestTargetSymbolsSepDebugSymlink.py (2187 of 2486) PASS: lldb-unit :: Target/./TargetTests/MemoryRegionInfoTest.Formatv (2188 of 2486) PASS: lldb-unit :: Utility/./UtilityTests/VMRange.ContainsAddr (2189 of 2486) PASS: lldb-shell :: SymbolFile/DWARF/x86/find-variable-dwo.cpp (2190 of 2486) PASS: lldb-api :: test_utils/TestPExpectTest.py (2191 of 2486) PASS: lldb-api :: python_api/file_handle/TestFileHandle.py (2192 of 2486) UNSUPPORTED: lldb-api :: commands/watchpoints/hello_watchlocation/TestWatchLocation.py (2193 of 2486) PASS: lldb-api :: functionalities/thread/state_after_expression/TestStateAfterExpression.py (2194 of 2486) PASS: lldb-unit :: Utility/./UtilityTests/StringListTest.JoinMultiCharSeparator (2195 of 2486) PASS: lldb-api :: commands/command/source/TestCommandSource.py (2196 of 2486) UNSUPPORTED: lldb-shell :: Register/arm-gp-read.test (2197 of 2486) PASS: lldb-unit :: Host/./HostTests/FileSystemTest.EmptyTest (2198 of 2486) PASS: lldb-unit :: SymbolFile/DWARF/./SymbolFileDWARFTests/SymbolFileDWARFTests.TestAbilitiesForDWARF (2199 of 2486) PASS: lldb-unit :: UnwindAssembly/x86/./UnwindAssemblyx86Tests/Testx86AssemblyInspectionEngine.TestSimple32bitFrameFunction (2200 of 2486) PASS: lldb-unit :: Expression/./ExpressionTests/DWARFExpression.DW_OP_unknown (2201 of 2486) PASS: lldb-unit :: Utility/./UtilityTests/RangeTest.NotEqualInvalid (2202 of 2486) PASS: lldb-api :: functionalities/data-formatter/data-formatter-stl/libcxx/initializerlist/TestInitializerList.py (2203 of 2486) PASS: lldb-api :: commands/settings/use_source_cache/TestUseSourceCache.py (2204 of 2486) UNSUPPORTED: lldb-api :: commands/expression/call-restarts/TestCallThatRestarts.py (2205 of 2486) PASS: lldb-shell :: ObjectFile/ELF/compressed-sections.yaml (2206 of 2486) PASS: lldb-unit :: Utility/./UtilityTests/StringLexerTest.NextIf (2207 of 2486) PASS: lldb-api :: lang/objc/foundation/TestSymbolTable.py (2208 of 2486) UNSUPPORTED: lldb-api :: macosx/posix_spawn/TestLaunchProcessPosixSpawn.py (2209 of 2486) PASS: lldb-unit :: Process/Utility/./ProcessUtilityTests/MemoryTagManagerAArch64MTETest.MakeTaggedRange (2210 of 2486) PASS: lldb-unit :: Utility/./UtilityTests/SubsystemRAIITest.SubsystemWithErrorFailure (2211 of 2486) PASS: lldb-unit :: Utility/./UtilityTests/StringListTest.AppendListCStringArrayEmpty (2212 of 2486) PASS: lldb-unit :: Utility/./UtilityTests/SerializationRountripTest.SerializeDeserializeCStringArray (2213 of 2486) PASS: lldb-unit :: Language/Highlighting/./HighlighterTests/HighlighterTest.ClangStringLiterals (2214 of 2486) PASS: lldb-shell :: Driver/TestFile.test (2215 of 2486) PASS: lldb-unit :: Symbol/./SymbolTests/TestClangASTImporter.MetadataPropagationAfterCopying (2216 of 2486) PASS: lldb-api :: functionalities/breakpoint/objc/TestObjCBreakpoints.py (2217 of 2486) PASS: lldb-shell :: ObjectFile/ELF/minidebuginfo-find-symbols.yaml (2218 of 2486) PASS: lldb-api :: python_api/thread/TestThreadAPI.py (2219 of 2486) PASS: lldb-api :: tools/lldb-server/inferior-crash/TestGdbRemoteAbort.py (2220 of 2486) PASS: lldb-unit :: Symbol/./SymbolTests/Type.GetTypeScopeAndBasename (2221 of 2486) PASS: lldb-unit :: UnwindAssembly/x86/./UnwindAssemblyx86Tests/Testx86AssemblyInspectionEngine.TestSimplei386ugmented (2222 of 2486) PASS: lldb-unit :: Process/gdb-remote/./ProcessGdbRemoteTests/GDBRemoteClientBaseTest.SendPacketAndReceiveResponseWithOutputSupport (2223 of 2486) PASS: lldb-unit :: Utility/./UtilityTests/StringExtractorTest.GetNameColonValueNoColon (2224 of 2486) PASS: lldb-api :: commands/expression/ignore-artificial-constructors/TestIgnoreArtificialConstructors.py (2225 of 2486) PASS: lldb-api :: tools/lldb-server/TestGdbRemoteHostInfo.py (2226 of 2486) PASS: lldb-unit :: Host/./HostTests/FileSystemTest.FileAndDirectoryComponents (2227 of 2486) PASS: lldb-shell :: ObjectFile/MachO/symtab.yaml (2228 of 2486) UNSUPPORTED: lldb-shell :: SymbolFile/target-symbols-add-unwind.test (2229 of 2486) PASS: lldb-unit :: UnwindAssembly/x86/./UnwindAssemblyx86Tests/Testx86AssemblyInspectionEngine.TestStackRealignMSVC_i386 (2230 of 2486) PASS: lldb-api :: functionalities/fat_archives/TestFatArchives.py (2231 of 2486) PASS: lldb-unit :: Utility/./UtilityTests/DeserializerTest.HasData (2232 of 2486) PASS: lldb-api :: functionalities/breakpoint/breakpoint_set_restart/TestBreakpointSetRestart.py (2233 of 2486) PASS: lldb-unit :: UnwindAssembly/x86/./UnwindAssemblyx86Tests/Testx86AssemblyInspectionEngine.TestDisassemblyJunkBytes (2234 of 2486) PASS: lldb-shell :: Driver/TestUseColor.test (2235 of 2486) PASS: lldb-api :: commands/statistics/basic/TestStats.py (2236 of 2486) PASS: lldb-unit :: Host/./HostTests/TerminalTest.SetBaudRate (2237 of 2486) PASS: lldb-shell :: Quit/TestQuitExitCode30.test (2238 of 2486) UNSUPPORTED: lldb-api :: functionalities/signal/handle-segv/TestHandleSegv.py (2239 of 2486) PASS: lldb-api :: functionalities/data-formatter/data-formatter-stl/libcxx/atomic/TestLibCxxAtomic.py (2240 of 2486) PASS: lldb-api :: lang/objc/foundation/TestObjCMethods2.py (2241 of 2486) PASS: lldb-api :: tools/lldb-server/TestGdbRemote_qThreadStopInfo.py (2242 of 2486) PASS: lldb-shell :: SymbolFile/DWARF/x86/DW_OP_piece-smaller-than-struct.s (2243 of 2486) PASS: lldb-unit :: Process/minidump/./LLDBMinidumpTests/MinidumpParserTest.GetThreadContext_x86_32_wow64 (2244 of 2486) PASS: lldb-unit :: Process/gdb-remote/./ProcessGdbRemoteTests/GDBRemoteCommunicationServerLLGSTest.LLGSArgToURL (2245 of 2486) PASS: lldb-unit :: Symbol/./SymbolTests/TestTypeSystemClang.TestNotDeletingUserCopyCstrDueToMoveCStr (2246 of 2486) PASS: lldb-unit :: tools/lldb-server/tests/./LLDBServerTests/TestBase.LaunchModePreservesEnvironment (2247 of 2486) PASS: lldb-api :: functionalities/breakpoint/breakpoint_command/TestRegexpBreakCommand.py (2248 of 2486) PASS: lldb-api :: python_api/watchpoint/TestWatchpointIter.py (2249 of 2486) PASS: lldb-unit :: Symbol/./SymbolTests/TestTypeSystemMap.GetTypeSystemForLanguageWithInvalidModule (2250 of 2486) PASS: lldb-unit :: Utility/./UtilityTests/ArgsTest.GetQuotedCommandString (2251 of 2486) PASS: lldb-unit :: Host/./HostTests/TerminalTest.SetHardwareFlowControl (2252 of 2486) PASS: lldb-api :: functionalities/tail_call_frames/cross_object/TestCrossObjectTailCalls.py (2253 of 2486) PASS: lldb-unit :: ScriptInterpreter/Python/./ScriptInterpreterPythonTests/PythonDataObjectsTest.TestObjectAttributes (2254 of 2486) PASS: lldb-api :: commands/expression/options/TestExprOptions.py (2255 of 2486) PASS: lldb-unit :: ObjectFile/MachO/./ObjectFileMachOTests/ObjectFileMachOTest.ModuleFromSharedCacheInfo (2256 of 2486) PASS: lldb-api :: iohandler/unicode/TestUnicode.py (2257 of 2486) UNSUPPORTED: lldb-api :: tools/lldb-server/vCont-threads/TestGdbRemote_vContThreads.py (2258 of 2486) PASS: lldb-unit :: UnwindAssembly/x86/./UnwindAssemblyx86Tests/Testx86AssemblyInspectionEngine.TestSimplex86_64Augmented (2259 of 2486) PASS: lldb-shell :: Driver/TestSingleQuote.test (2260 of 2486) PASS: lldb-shell :: Register/x86-64-gp-read.test (2261 of 2486) UNSUPPORTED: lldb-api :: benchmarks/frame_variable/TestFrameVariableResponse.py (2262 of 2486) PASS: lldb-api :: functionalities/gdb_remote_client/TestGDBServerTargetXML.py (2263 of 2486) UNSUPPORTED: lldb-shell :: SymbolFile/PDB/func-symbols.test (2264 of 2486) PASS: lldb-api :: tools/lldb-vscode/breakpoint/TestVSCode_setFunctionBreakpoints.py (2265 of 2486) PASS: lldb-api :: functionalities/inferior-assert/TestInferiorAssert.py (2266 of 2486) PASS: lldb-unit :: Utility/./UtilityTests/UserIDResolver.GetUserName (2267 of 2486) PASS: lldb-unit :: debugserver/./debugserverTests/RNBSocket.LoopBackListenIPv4 (2268 of 2486) PASS: lldb-api :: functionalities/asan/TestMemoryHistory.py (2269 of 2486) PASS: lldb-unit :: Target/./TargetTests/ModuleCacheTest.GetAndPutStrangeHostname (2270 of 2486) PASS: lldb-unit :: Process/minidump/./LLDBMinidumpTests/MinidumpParserTest.GetThreadContext_x86_32 (2271 of 2486) PASS: lldb-api :: functionalities/gdb_remote_client/TestThreadSelectionBug.py (2272 of 2486) PASS: lldb-api :: lang/objc/modules-objc-property/TestModulesObjCProperty.py (2273 of 2486) PASS: lldb-shell :: Reproducer/TestDSYM.test (2274 of 2486) PASS: lldb-shell :: SymbolFile/DWARF/x86/dwarf5-partial-index.cpp (2275 of 2486) PASS: lldb-api :: functionalities/data-formatter/array_typedef/TestArrayTypedef.py (2276 of 2486) PASS: lldb-unit :: Signals/./SignalsTests/UnixSignalsTest.GetInfo (2277 of 2486) PASS: lldb-api :: functionalities/breakpoint/global_constructor/TestBreakpointInGlobalConstructor.py (2278 of 2486) PASS: lldb-unit :: Utility/./UtilityTests/CompletionRequest.ShiftArguments (2279 of 2486) PASS: lldb-shell :: Register/Core/x86-64-linux-addr.test (2280 of 2486) PASS: lldb-unit :: ObjectFile/Breakpad/./ObjectFileBreakpadTests/InfoRecord.parse (2281 of 2486) PASS: lldb-api :: functionalities/plugins/command_plugin/TestPluginCommands.py (2282 of 2486) PASS: lldb-shell :: SymbolFile/NativePDB/nested-types.cpp (2283 of 2486) PASS: lldb-api :: lang/cpp/virtual-overload/TestVirtualOverload.py (2284 of 2486) PASS: lldb-shell :: Driver/TestRepl.test (2285 of 2486) UNSUPPORTED: lldb-api :: macosx/corefile-exception-reason/TestCorefileExceptionReason.py (2286 of 2486) PASS: lldb-api :: lang/c/calling-conventions/TestCCallingConventions.py (2287 of 2486) PASS: lldb-api :: commands/quit/TestQuit.py (2288 of 2486) PASS: lldb-api :: functionalities/gdb_remote_client/TestGDBRemoteClient.py (2289 of 2486) PASS: lldb-api :: functionalities/stats_api/TestStatisticsAPI.py (2290 of 2486) PASS: lldb-api :: commands/platform/basic/TestPlatformPython.py (2291 of 2486) UNSUPPORTED: lldb-shell :: SymbolFile/DWARF/split-optimized.c (2292 of 2486) PASS: lldb-shell :: Breakpoint/debug_addrx.test (2293 of 2486) PASS: lldb-shell :: Heap/heap-cstr.test (2294 of 2486) PASS: lldb-unit :: Utility/./UtilityTests/ScalarTest.Equality (2295 of 2486) PASS: lldb-shell :: Register/x86-multithread-write.test (2296 of 2486) PASS: lldb-unit :: Utility/./UtilityTests/StringExtractorTest.GetHexBytesAvail (2297 of 2486) PASS: lldb-shell :: ScriptInterpreter/Python/fail_breakpoint_oneline.test (2298 of 2486) PASS: lldb-api :: lang/objc/objc-new-syntax/TestObjCNewSyntaxDictionary.py (2299 of 2486) PASS: lldb-api :: lang/c/global_variables/TestGlobalVariables.py (2300 of 2486) PASS: lldb-unit :: Utility/./UtilityTests/BinaryStreamTest.PutSLEB128SevenBytes (2301 of 2486) PASS: lldb-api :: commands/command/script/import/rdar-12586188/TestRdar12586188.py (2302 of 2486) PASS: lldb-unit :: ObjectFile/Breakpad/./ObjectFileBreakpadTests/FileRecord.parse (2303 of 2486) PASS: lldb-shell :: ObjectFile/PECOFF/basic-info.yaml (2304 of 2486) PASS: lldb-api :: commands/expression/cast_int_to_anonymous_enum/TestCastIntToAnonymousEnum.py (2305 of 2486) PASS: lldb-unit :: Utility/./UtilityTests/VASprintfTest.NoBufferResize (2306 of 2486) PASS: lldb-api :: commands/target/stop-hook/delete/TestTargetStopHookDelete.py (2307 of 2486) PASS: lldb-api :: lang/c/local_types/TestUseClosestType.py (2308 of 2486) PASS: lldb-shell :: SymbolFile/DWARF/x86/debug-line-basic.s (2309 of 2486) PASS: lldb-shell :: Recognizer/assert.test (2310 of 2486) PASS: lldb-unit :: UnwindAssembly/x86/./UnwindAssemblyx86Tests/Testx86AssemblyInspectionEngine.TestPushECX (2311 of 2486) PASS: lldb-api :: functionalities/data-formatter/data-formatter-cpp/TestDataFormatterCpp.py (2312 of 2486) PASS: lldb-api :: commands/expression/calculator_mode/TestCalculatorMode.py (2313 of 2486) PASS: lldb-unit :: Process/minidump/./LLDBMinidumpTests/MinidumpParserTest.MinidumpDuplicateModuleMinAddress (2314 of 2486) PASS: lldb-api :: functionalities/memory/tag/TestMemoryTag.py (2315 of 2486) PASS: lldb-api :: lang/cpp/nested-class-other-compilation-unit/TestNestedClassWithParentInAnotherCU.py (2316 of 2486) PASS: lldb-api :: tools/lldb-vscode/stackTrace/TestVSCode_stackTrace.py (2317 of 2486) PASS: lldb-unit :: Host/./HostTests/NativeProcessProtocolTest.ReadCStringFromMemory_CrossPageBoundary (2318 of 2486) PASS: lldb-shell :: SymbolFile/DWARF/x86/debug_rnglists-dwo.s (2319 of 2486) PASS: lldb-api :: driver/batch_mode/TestBatchMode.py (2320 of 2486) PASS: lldb-api :: functionalities/breakpoint/debugbreak/TestDebugBreak.py (2321 of 2486) PASS: lldb-api :: lang/objc/objc_direct-methods/TestObjCDirectMethods.py (2322 of 2486) PASS: lldb-unit :: Language/Highlighting/./HighlighterTests/HighlighterTest.ClangTrailingBackslashMissingNewLine (2323 of 2486) PASS: lldb-shell :: ObjectFile/ELF/build-id-case.yaml (2324 of 2486) PASS: lldb-unit :: Host/./HostTests/Host.GetEnvironment (2325 of 2486) PASS: lldb-unit :: Process/minidump/./LLDBMinidumpTests/MinidumpParserTest.FindMemoryRangeWithFullMemoryMinidump (2326 of 2486) PASS: lldb-unit :: ObjectFile/PECOFF/./ObjectFilePECOFFTests/PECallFrameInfoTest.Basic_eh (2327 of 2486) PASS: lldb-api :: functionalities/data-formatter/nsdictionarysynth/TestNSDictionarySynthetic.py (2328 of 2486) UNSUPPORTED: lldb-shell :: SymbolFile/PDB/function-nested-block.test (2329 of 2486) PASS: lldb-api :: commands/watchpoints/watchpoint_count/TestWatchpointCount.py (2330 of 2486) UNSUPPORTED: lldb-api :: functionalities/unwind/ehframe/TestEhFrameUnwind.py (2331 of 2486) PASS: lldb-shell :: Commands/command-source.test (2332 of 2486) PASS: lldb-api :: commands/expression/vector_of_enums/TestVectorOfEnums.py (2333 of 2486) PASS: lldb-shell :: SymbolFile/NativePDB/ast-methods.cpp (2334 of 2486) PASS: lldb-unit :: Symbol/./SymbolTests/TestClangASTImporter.CanImportInvalidType (2335 of 2486) PASS: lldb-unit :: Host/./HostTests/FileSystemTest.OpenErrno (2336 of 2486) PASS: lldb-unit :: Utility/./UtilityTests/RangeTest.LessThanInvalid (2337 of 2486) PASS: lldb-unit :: Host/./HostTests/TerminalTest.SetEcho (2338 of 2486) PASS: lldb-api :: functionalities/scripted_process/TestScriptedProcess.py (2339 of 2486) PASS: lldb-api :: functionalities/target-new-solib-notifications/TestModuleLoadedNotifys.py (2340 of 2486) PASS: lldb-api :: functionalities/breakpoint/hardware_breakpoints/require_hw_breakpoints/TestRequireHWBreakpoints.py (2341 of 2486) PASS: lldb-unit :: Utility/./UtilityTests/StringExtractorTest.GetHexBytesAvail_Underflow (2342 of 2486) PASS: lldb-shell :: SymbolFile/NativePDB/locate-pdb.cpp (2343 of 2486) PASS: lldb-unit :: Utility/./UtilityTests/RangeVector.CombineConsecutiveRanges (2344 of 2486) PASS: lldb-unit :: Utility/./UtilityTests/CompletionRequest.TryCompleteCurrentArgGood (2345 of 2486) PASS: lldb-unit :: Core/./LLDBCoreTests/CommunicationTest.SynchronizeWhileClosing (2346 of 2486) PASS: lldb-shell :: SymbolFile/Breakpad/line-table.test (2347 of 2486) PASS: lldb-unit :: Editline/./EditlineTests/EditlineTestFixture.EditlineReceivesSingleLineText (2348 of 2486) PASS: lldb-unit :: Utility/./UtilityTests/GeneratorTest.GetOrCreate (2349 of 2486) PASS: lldb-shell :: SymbolFile/NativePDB/load-pdb.cpp (2350 of 2486) PASS: lldb-api :: python_api/sbvalue_const_addrof/TestSBValueConstAddrOf.py (2351 of 2486) PASS: lldb-unit :: UnwindAssembly/x86/./UnwindAssemblyx86Tests/Testx86AssemblyInspectionEngine.TestPopR15 (2352 of 2486) PASS: lldb-unit :: Utility/./UtilityTests/ArgsTest.ReplaceArgumentAtIndexShort (2353 of 2486) PASS: lldb-shell :: ScriptInterpreter/Python/eof.test (2354 of 2486) PASS: lldb-api :: lang/objc/blocks/TestObjCIvarsInBlocks.py (2355 of 2486) PASS: lldb-api :: functionalities/tail_call_frames/sbapi_support/TestTailCallFrameSBAPI.py (2356 of 2486) PASS: lldb-shell :: SymbolFile/DWARF/x86/DW_AT_declaration-with-children.s (2357 of 2486) PASS: lldb-api :: functionalities/postmortem/minidump-new/TestMiniDumpUUID.py (2358 of 2486) PASS: lldb-shell :: Commands/command-backtrace-parser-2.test (2359 of 2486) PASS: lldb-unit :: Utility/./UtilityTests/StringExtractorTest.GetU64LittleEndian (2360 of 2486) PASS: lldb-shell :: Register/Core/x86-64-freebsd-fp.test (2361 of 2486) PASS: lldb-unit :: Utility/./UtilityTests/StreamTest.PutMaxHex64ByteOrderLittle (2362 of 2486) PASS: lldb-unit :: Process/minidump/./LLDBMinidumpTests/MinidumpParserTest.FindMemoryRange (2363 of 2486) PASS: lldb-unit :: Process/gdb-remote/./ProcessGdbRemoteTests/PortMapTest.FreePort (2364 of 2486) PASS: lldb-api :: commands/watchpoints/multiple_threads/TestWatchpointMultipleThreads.py (2365 of 2486) PASS: lldb-unit :: Symbol/./SymbolTests/TestTypeSystemClang.TestGetEnumIntegerTypeUnexpectedType (2366 of 2486) UNSUPPORTED: lldb-shell :: ScriptInterpreter/Lua/lua-python.test (2367 of 2486) PASS: lldb-unit :: UnwindAssembly/x86/./UnwindAssemblyx86Tests/Testx86AssemblyInspectionEngine.TestPopR12 (2368 of 2486) PASS: lldb-unit :: Utility/./UtilityTests/StringExtractorTest.GetHexBytes_OddPair (2369 of 2486) PASS: lldb-shell :: Breakpoint/split-dwarf-5-addrbase.test (2370 of 2486) PASS: lldb-shell :: Reproducer/TestSynchronous.test (2371 of 2486) UNSUPPORTED: lldb-api :: lang/cpp/reference-to-outer-type/TestCppReferenceToOuterClass.py (2372 of 2486) PASS: lldb-unit :: Core/./LLDBCoreTests/FormatEntityTest.DefinitionConstructionNameTypeChildren (2373 of 2486) PASS: lldb-unit :: Process/minidump/./LLDBMinidumpTests/MinidumpParserTest.GetMiscInfoWindows (2374 of 2486) PASS: lldb-unit :: Process/Utility/./ProcessUtilityTests/ProcSMapTests/LinuxProcSMapsTestFixture.ParseSMapRegions/8 (2375 of 2486) PASS: lldb-unit :: Utility/./UtilityTests/StreamTest.PutBytesAsRawHex8ToBigEndian (2376 of 2486) PASS: lldb-unit :: Process/Utility/./ProcessUtilityTests/ProcSMapTests/LinuxProcSMapsTestFixture.ParseSMapRegions/2 (2377 of 2486) UNSUPPORTED: lldb-shell :: ScriptInterpreter/Lua/persistent_state.test (2378 of 2486) PASS: lldb-api :: lang/objc/objc-struct-return/TestObjCStructReturn.py (2379 of 2486) PASS: lldb-unit :: ScriptInterpreter/Python/./ScriptInterpreterPythonTests/PythonDataObjectsTest.TestPythonStringToStr (2380 of 2486) PASS: lldb-unit :: Utility/./UtilityTests/RecordReplayTest.InstrumentedBar (2381 of 2486) PASS: lldb-api :: lang/c/forward/TestForwardDeclaration.py (2382 of 2486) PASS: lldb-unit :: Utility/./UtilityTests/ScalarTest.LongLongAssigmentOperator (2383 of 2486) PASS: lldb-unit :: ScriptInterpreter/Python/./ScriptInterpreterPythonTests/PythonDataObjectsTest.TestPythonTupleToStructuredList (2384 of 2486) UNSUPPORTED: lldb-shell :: SymbolFile/NativePDB/local-variables.cpp (2385 of 2486) PASS: lldb-api :: sample_test/TestSampleInlineTest.py (2386 of 2486) PASS: lldb-shell :: ScriptInterpreter/Python/command_import.test (2387 of 2486) PASS: lldb-api :: macosx/lc-note/kern-ver-str/TestKernVerStrLCNOTE.py (2388 of 2486) PASS: lldb-unit :: UnwindAssembly/x86/./UnwindAssemblyx86Tests/Testx86AssemblyInspectionEngine.TestPushEAX (2389 of 2486) PASS: lldb-unit :: Utility/./UtilityTests/Flags.AnyClear (2390 of 2486) UNSUPPORTED: lldb-shell :: ScriptInterpreter/Lua/io.test (2391 of 2486) PASS: lldb-api :: commands/target/dump/TestTargetDumpTypeSystem.py (2392 of 2486) PASS: lldb-unit :: UnwindAssembly/x86/./UnwindAssemblyx86Tests/Testx86AssemblyInspectionEngine.TestPopEDI (2393 of 2486) PASS: lldb-unit :: Process/minidump/./LLDBMinidumpTests/RegisterContextMinidump.CheckRegisterContextMinidump_ARM (2394 of 2486) PASS: lldb-unit :: UnwindAssembly/x86/./UnwindAssemblyx86Tests/Testx86AssemblyInspectionEngine.TestMovRSPtoRBP (2395 of 2486) PASS: lldb-api :: commands/expression/import_base_class_when_class_has_derived_member/TestImportBaseClassWhenClassHasDerivedMember.py (2396 of 2486) PASS: lldb-api :: functionalities/postmortem/minidump-new/TestMiniDumpNew.py (2397 of 2486) PASS: lldb-shell :: Reproducer/Modules/TestModuleCXX.test (2398 of 2486) PASS: lldb-shell :: Reproducer/Functionalities/TestStepping.test (2399 of 2486) PASS: lldb-api :: lang/cpp/default-template-args/TestDefaultTemplateArgs.py (2400 of 2486) UNSUPPORTED: lldb-shell :: ScriptInterpreter/Lua/breakpoint_callback.test (2401 of 2486) PASS: lldb-shell :: Reproducer/TestCrash.test (2402 of 2486) PASS: lldb-unit :: Core/./LLDBCoreTests/RichManglingContextTest.IPDRealloc (2403 of 2486) PASS: lldb-api :: lang/objc/objc-class-method/TestObjCClassMethod.py (2404 of 2486) PASS: lldb-unit :: ScriptInterpreter/Python/./ScriptInterpreterPythonTests/PythonDataObjectsTest.TestPythonListManipulation (2405 of 2486) PASS: lldb-unit :: Symbol/./SymbolTests/Type.CompilerContextPattern (2406 of 2486) UNSUPPORTED: lldb-api :: functionalities/breakpoint/hardware_breakpoints/hardware_breakpoint_on_multiple_threads/TestHWBreakMultiThread.py (2407 of 2486) PASS: lldb-api :: commands/expression/rdar44436068/Test128BitsInteger.py (2408 of 2486) UNSUPPORTED: lldb-shell :: ScriptInterpreter/Lua/quit.test (2409 of 2486) PASS: lldb-unit :: Expression/./ExpressionTests/CppModuleConfigurationTest.Xcode (2410 of 2486) PASS: lldb-shell :: ScriptInterpreter/Python/Crashlog/text.test (2411 of 2486) PASS: lldb-api :: lang/objc/modules-non-objc-target/TestObjCModulesNonObjCTarget.py (2412 of 2486) PASS: lldb-api :: functionalities/breakpoint/move_nearest/TestMoveNearest.py (2413 of 2486) PASS: lldb-unit :: Utility/./UtilityTests/StringListTest.LongestCommonPrefixDuplicateElement (2414 of 2486) PASS: lldb-unit :: UnwindAssembly/x86/./UnwindAssemblyx86Tests/Testx86AssemblyInspectionEngine.TestPopR13 (2415 of 2486) PASS: lldb-api :: commands/frame/diagnose/dereference-argument/TestDiagnoseDereferenceArgument.py (2416 of 2486) UNSUPPORTED: lldb-api :: functionalities/data-formatter/data-formatter-stl/libstdcpp/unique_ptr/TestDataFormatterStdUniquePtr.py (2417 of 2486) PASS: lldb-unit :: Utility/./UtilityTests/RangeTest.EqualInvalid (2418 of 2486) PASS: lldb-api :: functionalities/postmortem/netbsd-core/TestNetBSDCore.py (2419 of 2486) PASS: lldb-unit :: Utility/./UtilityTests/CompletionRequest.TryCompleteCurrentArgBad (2420 of 2486) PASS: lldb-unit :: Utility/./UtilityTests/ScalarTest.ExtractBitfield (2421 of 2486) PASS: lldb-unit :: ScriptInterpreter/Python/./ScriptInterpreterPythonTests/PythonDataObjectsTest.TestOwnedReferences (2422 of 2486) PASS: lldb-unit :: Utility/./UtilityTests/StreamTest.PutHex16ByteOrderLittle (2423 of 2486) PASS: lldb-unit :: Target/./TargetTests/ExecutionContextTest.GetByteOrderProcess (2424 of 2486) PASS: lldb-api :: functionalities/data-formatter/data-formatter-objc/TestDataFormatterObjCKVO.py (2425 of 2486) PASS: lldb-unit :: Expression/./ExpressionTests/DWARFExpression.DW_OP_piece (2426 of 2486) PASS: lldb-unit :: Utility/./UtilityTests/BinaryStreamTest.PutSLEB128MaxValue (2427 of 2486) PASS: lldb-unit :: Host/./HostTests/TerminalTest.SetCanonical (2428 of 2486) PASS: lldb-unit :: Utility/./UtilityTests/StringExtractorTest.GetHexU8_Exact (2429 of 2486) PASS: lldb-unit :: ObjectFile/Breakpad/./ObjectFileBreakpadTests/InlineOriginRecord.parse (2430 of 2486) PASS: lldb-api :: commands/help/TestHelp.py (2431 of 2486) PASS: lldb-unit :: Language/Highlighting/./HighlighterTests/HighlighterTest.ClangTrailingBackslashBeforeNewline (2432 of 2486) PASS: lldb-api :: lang/objc/complete-type-check/TestObjCIsTypeComplete.py (2433 of 2486) PASS: lldb-unit :: UnwindAssembly/x86/./UnwindAssemblyx86Tests/Testx86AssemblyInspectionEngine.TestPopRBPWithREX (2434 of 2486) PASS: lldb-api :: lang/c/const_variables/TestConstVariables.py (2435 of 2486) PASS: lldb-unit :: Utility/./UtilityTests/CompletionRequest.TestCompletionOwnership (2436 of 2486) PASS: lldb-unit :: Utility/./UtilityTests/XcodeSDKTest.SDKSupportsSwift (2437 of 2486) PASS: lldb-unit :: Utility/./UtilityTests/ScalarTest.ComparisonFloat (2438 of 2486) UNSUPPORTED: lldb-shell :: Register/x86-64-ymm16-write.test (2439 of 2486) PASS: lldb-unit :: Utility/./UtilityTests/BinaryStreamTest.PutSLEB128ThreeBytes (2440 of 2486) PASS: lldb-api :: functionalities/data-formatter/data-formatter-objc/TestDataFormatterObjCNSURL.py (2441 of 2486) PASS: lldb-unit :: UnwindAssembly/x86/./UnwindAssemblyx86Tests/Testx86AssemblyInspectionEngine.Test64bitFramelessSmallStackFrame (2442 of 2486) PASS: lldb-shell :: Subprocess/vfork-follow-parent.test (2443 of 2486) PASS: lldb-unit :: UnwindAssembly/x86/./UnwindAssemblyx86Tests/Testx86AssemblyInspectionEngine.TestPushRBP (2444 of 2486) PASS: lldb-unit :: Utility/./UtilityTests/CompletionRequest.DuplicateFilteringWithComments (2445 of 2486) PASS: lldb-unit :: Utility/./UtilityTests/RangeTest.ClearWithStarAddress (2446 of 2486) PASS: lldb-api :: test_utils/TestInlineTest.py (2447 of 2486) PASS: lldb-unit :: Language/CPlusPlus/./LanguageCPlusPlusTests/CPlusPlusLanguage.MethodNameParsing (2448 of 2486) PASS: lldb-unit :: UnwindAssembly/x86/./UnwindAssemblyx86Tests/Testx86AssemblyInspectionEngine.TestSpillRegToStackViaMOVi386 (2449 of 2486) PASS: lldb-unit :: Utility/./UtilityTests/StringListTest.DefaultConstructor (2450 of 2486) PASS: lldb-unit :: Utility/./UtilityTests/StringListTest.ShiftStdString (2451 of 2486) UNSUPPORTED: lldb-api :: lang/cpp/function-template-parameter-pack/TestFunctionTemplateParameterPack.py (2452 of 2486) PASS: lldb-api :: functionalities/data-formatter/data-formatter-categories/TestDataFormatterCategories.py (2453 of 2486) PASS: lldb-shell :: SymbolFile/DWARF/x86/dwp.s (2454 of 2486) UNSUPPORTED: lldb-api :: macosx/macCatalystAppMacOSFramework/TestMacCatalystAppWithMacOSFramework.py (2455 of 2486) UNSUPPORTED: lldb-api :: functionalities/data-formatter/data-formatter-stl/libstdcpp/tuple/TestDataFormatterStdTuple.py (2456 of 2486) PASS: lldb-shell :: ObjectFile/ELF/section-types.yaml (2457 of 2486) PASS: lldb-api :: commands/expression/import-std-module/deque-dbg-info-content/TestDbgInfoContentDequeFromStdModule.py (2458 of 2486) UNSUPPORTED: lldb-api :: commands/platform/connect/TestPlatformConnect.py (2459 of 2486) PASS: lldb-api :: macosx/safe-to-func-call/TestSafeFuncCalls.py (2460 of 2486) PASS: lldb-api :: functionalities/memory/cache/TestMemoryCache.py (2461 of 2486) PASS: lldb-api :: functionalities/data-formatter/data-formatter-stl/libcxx/function/TestLibCxxFunction.py (2462 of 2486) PASS: lldb-api :: commands/frame/var/TestFrameVar.py (2463 of 2486) PASS: lldb-api :: lang/objc/ptr_refs/TestPtrRefsObjC.py (2464 of 2486) PASS: lldb-api :: functionalities/data-formatter/nssetsynth/TestNSSetSynthetic.py (2465 of 2486) UNSUPPORTED: lldb-shell :: SymbolFile/NativePDB/ast-functions-msvc.cpp (2466 of 2486) PASS: lldb-unit :: Language/Highlighting/./HighlighterTests/HighlighterTest.ClangOperators (2467 of 2486) PASS: lldb-unit :: Utility/./UtilityTests/Flags.Clear (2468 of 2486) PASS: lldb-api :: lang/c/function_types/TestFunctionTypes.py (2469 of 2486) PASS: lldb-api :: commands/expression/import-std-module/list/TestListFromStdModule.py (2470 of 2486) PASS: lldb-api :: functionalities/tail_call_frames/cross_dso/TestCrossDSOTailCalls.py (2471 of 2486) PASS: lldb-shell :: Minidump/no-process-id.yaml (2472 of 2486) PASS: lldb-unit :: Expression/./ExpressionTests/DiagnosticManagerTest.GetStringPreserveOrder (2473 of 2486) PASS: lldb-api :: commands/expression/import-std-module/basic/TestImportStdModule.py (2474 of 2486) PASS: lldb-api :: functionalities/data-formatter/data-formatter-stl/generic/optional/TestDataFormatterGenericOptional.py (2475 of 2486) PASS: lldb-unit :: Process/gdb-remote/./ProcessGdbRemoteTests/GDBRemoteCommunicationClientTest.GetQOffsets (2476 of 2486) PASS: lldb-api :: commands/expression/import-std-module/unique_ptr/TestUniquePtrFromStdModule.py (2477 of 2486) PASS: lldb-shell :: ObjectFile/ELF/section-permissions.yaml (2478 of 2486) PASS: lldb-api :: commands/expression/import-std-module/sysroot/TestStdModuleSysroot.py (2479 of 2486) UNSUPPORTED: lldb-api :: functionalities/process_save_core/TestProcessSaveCore.py (2480 of 2486) PASS: lldb-unit :: Symbol/./SymbolTests/TestTypeSystemClang.TestDeletingImplicitCopyCstrDueToMoveCStr (2481 of 2486) PASS: lldb-api :: terminal/TestEditline.py (2482 of 2486) PASS: lldb-shell :: SymbolFile/DWARF/x86/find-method-local-struct.cpp (2483 of 2486) PASS: lldb-api :: commands/watchpoints/watchpoint_disable/TestWatchpointDisable.py (2484 of 2486) PASS: lldb-api :: commands/frame/diagnose/virtual-method-call/TestDiagnoseDereferenceVirtualMethodCall.py (2485 of 2486) PASS: lldb-api :: types/TestShortType.py (2486 of 2486) Slowest Tests: -------------------------------------------------------------------------- 123.98s: lldb-api :: commands/gui/expand-threads-tree/TestGuiExpandThreadsTree.py 93.93s: lldb-api :: tools/lldb-server/TestLldbGdbServer.py 78.63s: lldb-api :: api/multithreaded/TestMultithreaded.py 68.86s: lldb-api :: commands/process/attach/TestProcessAttach.py 65.12s: lldb-api :: lang/objc/foundation/TestFoundationDisassembly.py 46.22s: lldb-api :: types/TestLongTypesExpr.py 45.41s: lldb-api :: lang/objc/exceptions/TestObjCExceptions.py 44.98s: lldb-api :: tools/lldb-server/vCont-threads/TestGdbRemote_vContThreads.py 38.17s: lldb-api :: lang/objc/hidden-ivars/TestHiddenIvars.py 37.06s: lldb-api :: lang/objc/foundation/TestObjCMethods.py 36.76s: lldb-api :: lang/cpp/namespace/TestNamespaceLookup.py 34.43s: lldb-api :: functionalities/completion/TestCompletion.py 34.34s: lldb-api :: python_api/target/TestTargetAPI.py 32.18s: lldb-api :: tools/lldb-server/TestGdbRemoteThreadsInStopReply.py 31.34s: lldb-api :: lang/objc/objc-new-syntax/TestObjCNewSyntaxLiteral.py 26.46s: lldb-api :: lang/objc/real-definition/TestRealDefinition.py 25.92s: lldb-api :: types/TestLongTypes.py 25.58s: lldb-api :: types/TestIntegerTypeExpr.py 25.09s: lldb-api :: lang/objc/objc-new-syntax/TestObjCNewSyntaxDictionary.py 24.12s: lldb-api :: functionalities/data-formatter/poarray/TestPrintObjectArray.py

Hide Details

Tests Times: -------------------------------------------------------------------------- [ Range ] :: [ Percentage ] :: [ Count ] -------------------------------------------------------------------------- [120s,130s) :: [ ] :: [ 1/2486] [110s,120s) :: [ ] :: [ 0/2486] [100s,110s) :: [ ] :: [ 0/2486] [ 90s,100s) :: [ ] :: [ 1/2486] [ 80s, 90s) :: [ ] :: [ 1/2486] [ 70s, 80s) :: [ ] :: [ 1/2486] [ 60s, 70s) :: [ ] :: [ 1/2486] [ 50s, 60s) :: [ ] :: [ 0/2486] [ 40s, 50s) :: [ ] :: [ 4/2486] [ 30s, 40s) :: [ ] :: [ 6/2486] [ 20s, 30s) :: [ ] :: [ 17/2486] [ 10s, 20s) :: [* ] :: [ 103/2486] [ 0s, 10s) :: [************************************* ] :: [2351/2486] -------------------------------------------------------------------------- ******************** Failed Tests (1): lldb-api :: commands/gui/expand-threads-tree/TestGuiExpandThreadsTree.py

Hide Details

Hide Details

Testing Time: 1371.35s Unsupported : 194 Passed : 2281 Expectedly Failed: 10 Failed : 1 FAILED: tools/lldb/test/CMakeFiles/check-lldb cd /Users/buildslave/jenkins/workspace/lldb-cmake/lldb-build/tools/lldb/test && /usr/local/Frameworks/Python.framework/Versions/3.7/bin/python3.7 /Users/buildslave/jenkins/workspace/lldb-cmake/lldb-build/./bin/llvm-lit -v --time-tests --shuffle --xunit-xml-output=/Users/buildslave/jenkins/workspace/lldb-cmake/test/results.xml -v -j 4 /Users/buildslave/jenkins/workspace/lldb-cmake/lldb-build/tools/lldb/test ninja: build stopped: subcommand failed. Command failed: Command '['/usr/bin/env', 'TERM=vt100', '/usr/local/bin/ninja', '-v', 'check-lldb']' returned non-zero exit status 1 Command: ['/usr/bin/env', 'TERM=vt100', '/usr/local/bin/ninja', '-v', 'check-lldb'] [Pipeline] } [Pipeline] // timeout [Pipeline] } [Pipeline] // stage [Pipeline] stage [Pipeline] { (Upload artifacts (LLDB)) Stage "Upload artifacts (LLDB)" skipped due to earlier failure(s) [Pipeline] } [Pipeline] // stage [Pipeline] stage [Pipeline] { (Declarative: Post Actions) [Pipeline] scanForIssues [Clang] Sleeping for 5 seconds due to JENKINS-32191... [Clang] Parsing console log (workspace: '/Users/buildslave/jenkins/workspace/lldb-cmake') [Clang] -> found 7 issues (skipped 2 duplicates) [Clang] Parsing console log (workspace: '/Users/buildslave/jenkins/workspace/lldb-cmake') [Clang] -> found 7 issues (skipped 2 duplicates) [Clang] Successfully parsed console log [Clang] -> found 7 issues (skipped 2 duplicates) [Clang] Parsing console log (workspace: '/Users/buildslave/jenkins/workspace/lldb-cmake') [Clang] Post processing issues on 'green-dragon-04' with source code encoding 'UTF-8' [Clang] Creating SCM blamer to obtain author and commit information for affected files [Clang] -> No blamer installed yet. You need to install the 'git-forensics' plugin to enable blaming for Git. [Clang] Resolving file names for all issues in source directory '/Users/buildslave/jenkins/workspace/lldb-cmake' [Clang] -> resolved paths in source directory (4 found, 0 not found) [Clang] Resolving module names from module definitions (build.xml, pom.xml, or Manifest.mf files) [Clang] -> resolved module names for 7 issues [Clang] Resolving package names (or namespaces) by parsing the affected files [Clang] -> resolved package names of 4 affected files [Clang] No filter has been set, publishing all 7 issues [Clang] Creating fingerprints for all affected code blocks to track issues over different builds [Clang] -> created fingerprints for 7 issues (skipped 0 issues) [Clang] Copying affected files to Jenkins' build folder '/Users/Shared/Jenkins/Home/jobs/lldb-cmake/builds/39049/files-with-issues' [Clang] -> 4 copied, 0 not in workspace, 0 not-found, 0 with I/O error [Clang] Repository miner is not configured, skipping repository mining [Pipeline] junit Recording test results [Checks API] No suitable checks publisher found. [Pipeline] } [Pipeline] // stage [Pipeline] } [Pipeline] // withEnv [Pipeline] } [Pipeline] // node [Pipeline] End of Pipeline ERROR: script returned exit code 1 Finished: FAILURE