Console Output

Skipping 174,473 KB.. Full Log
0x7fff39ff2a9e <+4>:  pushq  %r15
0x7fff39ff2aa0 <+6>:  pushq  %r14
0x7fff39ff2aa2 <+8>:  pushq  %rbx
0x7fff39ff2aa3 <+9>:  pushq  %rax
0x7fff39ff2aa4 <+10>: movq   %rsi, %r14
0x7fff39ff2aa7 <+13>: movq   %rdi, %rbx
0x7fff39ff2aaa <+16>: movq   0x5557ec07(%rip), %rdi    ; (void *)0x00007fff8f5811c0: NSFileManager
0x7fff39ff2ab1 <+23>: movq   0x555743b8(%rip), %rsi    ; "defaultManager"
0x7fff39ff2ab8 <+30>: movq   0x5549c179(%rip), %r15    ; (void *)0x00007fff70605e40: objc_msgSend
0x7fff39ff2abf <+37>: callq  *%r15
0x7fff39ff2ac2 <+40>: movq   0x5557bb47(%rip), %rsi    ; "moveItemAtPath:toPath:error:"
0x7fff39ff2ac9 <+47>: movq   %rax, %rdi
0x7fff39ff2acc <+50>: movq   %rbx, %rdx
0x7fff39ff2acf <+53>: movq   %r14, %rcx
0x7fff39ff2ad2 <+56>: xorl   %r8d, %r8d
0x7fff39ff2ad5 <+59>: callq  *%r15
0x7fff39ff2ad8 <+62>: cmpb   $0x1, %al
0x7fff39ff2ada <+64>: sbbq   %rax, %rax
0x7fff39ff2add <+67>: addq   $0x8, %rsp
0x7fff39ff2ae1 <+71>: popq   %rbx
0x7fff39ff2ae2 <+72>: popq   %r14
0x7fff39ff2ae4 <+74>: popq   %r15
0x7fff39ff2ae6 <+76>: popq   %rbp
0x7fff39ff2ae7 <+77>: retq   

Hide Details

Hide Details

runCmd: image lookup -s "_NXStatFile" output: 1 symbols match '_NXStatFile' in /System/Library/Frameworks/Foundation.framework/Versions/C/Foundation: Address: Foundation[0x00007fff2f96782c] (Foundation.__TEXT.__text + 1337788) Summary: Foundation`_NXStatFile

Hide Details

Hide Details

runCmd: disassemble --force -n "_NXStatFile" output: Foundation`_NXStatFile: 0x7fff39ea582c <+0>: pushq %rbp 0x7fff39ea582d <+1>: movq %rsp, %rbp 0x7fff39ea5830 <+4>: pushq %r15 0x7fff39ea5832 <+6>: pushq %r14 0x7fff39ea5834 <+8>: pushq %rbx 0x7fff39ea5835 <+9>: pushq %rax 0x7fff39ea5836 <+10>: movq %rsi, %r14 0x7fff39ea5839 <+13>: movq %rdi, %rbx 0x7fff39ea583c <+16>: movq 0x556cbe75(%rip), %rdi ; (void *)0x00007fff8f5811c0: NSFileManager 0x7fff39ea5843 <+23>: movq 0x556c1626(%rip), %rsi ; "defaultManager" 0x7fff39ea584a <+30>: movq 0x555e93e7(%rip), %r15 ; (void *)0x00007fff70605e40: objc_msgSend 0x7fff39ea5851 <+37>: callq *%r15 0x7fff39ea5854 <+40>: movq 0x556c31ed(%rip), %rsi ; "fileSystemRepresentationWithPath:" 0x7fff39ea585b <+47>: movq %rax, %rdi 0x7fff39ea585e <+50>: movq %rbx, %rdx 0x7fff39ea5861 <+53>: callq *%r15 0x7fff39ea5864 <+56>: movq %rax, %rdi 0x7fff39ea5867 <+59>: movq %r14, %rsi 0x7fff39ea586a <+62>: callq 0x7fff2fb27e58 ; symbol stub for: stat$INODE64 0x7fff39ea586f <+67>: cltq 0x7fff39ea5871 <+69>: addq $0x8, %rsp 0x7fff39ea5875 <+73>: popq %rbx 0x7fff39ea5876 <+74>: popq %r14 0x7fff39ea5878 <+76>: popq %r15 0x7fff39ea587a <+78>: popq %rbp 0x7fff39ea587b <+79>: retq

Hide Details

Hide Details

runCmd: image lookup -s "__NSCoderInvalidState" output: 1 symbols match '__NSCoderInvalidState' in /System/Library/Frameworks/Foundation.framework/Versions/C/Foundation: Address: Foundation[0x00007fff2f9a0f57] (Foundation.__TEXT.__text + 1573095) Summary: Foundation`__NSCoderInvalidState

Hide Details

Hide Details

runCmd: disassemble --force -n "__NSCoderInvalidState" output: Foundation`__NSCoderInvalidState: 0x7fff39edef57 <+0>: pushq %rbp 0x7fff39edef58 <+1>: movq %rsp, %rbp 0x7fff39edef5b <+4>: pushq %r14 0x7fff39edef5d <+6>: pushq %rbx 0x7fff39edef5e <+7>: subq $0xd0, %rsp 0x7fff39edef65 <+14>: movq %rdi, %rbx 0x7fff39edef68 <+17>: testb %al, %al 0x7fff39edef6a <+19>: je 0x7fff2f9a0f8f ; <+56> 0x7fff39edef6c <+21>: movaps %xmm0, -0x90(%rbp) 0x7fff39edef73 <+28>: movaps %xmm1, -0x80(%rbp) 0x7fff39edef77 <+32>: movaps %xmm2, -0x70(%rbp) 0x7fff39edef7b <+36>: movaps %xmm3, -0x60(%rbp) 0x7fff39edef7f <+40>: movaps %xmm4, -0x50(%rbp) 0x7fff39edef83 <+44>: movaps %xmm5, -0x40(%rbp) 0x7fff39edef87 <+48>: movaps %xmm6, -0x30(%rbp) 0x7fff39edef8b <+52>: movaps %xmm7, -0x20(%rbp) 0x7fff39edef8f <+56>: movq %rsi, -0xb8(%rbp) 0x7fff39edef96 <+63>: movq %rdx, -0xb0(%rbp) 0x7fff39edef9d <+70>: movq %rcx, -0xa8(%rbp) 0x7fff39edefa4 <+77>: movq %r8, -0xa0(%rbp) 0x7fff39edefab <+84>: movq %r9, -0x98(%rbp) 0x7fff39edefb2 <+91>: testq %rbx, %rbx 0x7fff39edefb5 <+94>: jne 0x7fff2f9a0fc0 ; <+105> 0x7fff39edefb7 <+96>: leaq 0x555c0f5a(%rip), %rcx ; @"" 0x7fff39edefbe <+103>: jmp 0x7fff2f9a1014 ; <+189> 0x7fff39edefc0 <+105>: leaq -0xc0(%rbp), %rax 0x7fff39edefc7 <+112>: leaq -0xe0(%rbp), %r14 0x7fff39edefce <+119>: movq %rax, 0x10(%r14) 0x7fff39edefd2 <+123>: leaq 0x10(%rbp), %rax 0x7fff39edefd6 <+127>: movq %rax, 0x8(%r14) 0x7fff39edefda <+131>: movabsq $0x3000000008, %rax ; imm = 0x3000000008 0x7fff39edefe4 <+141>: movq %rax, (%r14) 0x7fff39edefe7 <+144>: movq 0x55692502(%rip), %rdi ; (void *)0x00007fff8f582e08: NSString 0x7fff39edefee <+151>: callq 0x7fff2fb279d8 ; symbol stub for: objc_alloc 0x7fff39edeff3 <+156>: movq 0x55688756(%rip), %rsi ; "initWithFormat:arguments:" 0x7fff39edeffa <+163>: movq %rax, %rdi 0x7fff39edeffd <+166>: movq %rbx, %rdx 0x7fff39edf000 <+169>: movq %r14, %rcx 0x7fff39edf003 <+172>: callq *0x555afc2f(%rip) ; (void *)0x00007fff70605e40: objc_msgSend 0x7fff39edf009 <+178>: movq %rax, %rdi 0x7fff39edf00c <+181>: callq 0x7fff2fb279f0 ; symbol stub for: objc_autorelease 0x7fff39edf011 <+186>: movq %rax, %rcx 0x7fff39edf014 <+189>: movq 0x55692575(%rip), %rdi ; (void *)0x00007fff8f00b2d8: NSException 0x7fff39edf01b <+196>: movq 0x555af146(%rip), %rax ; (void *)0x00007fff8ef0f4e8: NSInternalInconsistencyException 0x7fff39edf022 <+203>: movq (%rax), %rdx 0x7fff39edf025 <+206>: movq 0x556873a4(%rip), %rsi ; "exceptionWithName:reason:userInfo:" 0x7fff39edf02c <+213>: xorl %r8d, %r8d 0x7fff39edf02f <+216>: callq *0x555afc03(%rip) ; (void *)0x00007fff70605e40: objc_msgSend 0x7fff39edf035 <+222>: movq %rax, %rdi 0x7fff39edf038 <+225>: callq 0x7fff2fb27a4a ; symbol stub for: objc_exception_throw

Hide Details

Hide Details

runCmd: image lookup -s "__NSDescribeDelayedPerformCallout" output: 1 symbols match '__NSDescribeDelayedPerformCallout' in /System/Library/Frameworks/Foundation.framework/Versions/C/Foundation: Address: Foundation[0x00007fff2fa2409a] (Foundation.__TEXT.__text + 2109994) Summary: Foundation`__NSDescribeDelayedPerformCallout

Hide Details

Hide Details

runCmd: disassemble --force -n "__NSDescribeDelayedPerformCallout" output: Foundation`__NSDescribeDelayedPerformCallout: 0x7fff39f6209a <+0>: pushq %rbp 0x7fff39f6209b <+1>: movq %rsp, %rbp 0x7fff39f6209e <+4>: pushq %r15 0x7fff39f620a0 <+6>: pushq %r14 0x7fff39f620a2 <+8>: pushq %r13 0x7fff39f620a4 <+10>: pushq %r12 0x7fff39f620a6 <+12>: pushq %rbx 0x7fff39f620a7 <+13>: subq $0x48, %rsp 0x7fff39f620ab <+17>: movq %r9, %r12 0x7fff39f620ae <+20>: movq %r8, %r13 0x7fff39f620b1 <+23>: movq %rcx, -0x60(%rbp) 0x7fff39f620b5 <+27>: movq %rdx, -0x58(%rbp) 0x7fff39f620b9 <+31>: movq %rsi, %rbx 0x7fff39f620bc <+34>: movq 0x5552c565(%rip), %rax ; (void *)0x00007fff97e0ed40: __stack_chk_guard 0x7fff39f620c3 <+41>: movq (%rax), %rax 0x7fff39f620c6 <+44>: movq %rax, -0x30(%rbp) 0x7fff39f620ca <+48>: movq (%rsi), %rdi 0x7fff39f620cd <+51>: callq 0x7fff2fb27b0a ; symbol stub for: object_getClassName 0x7fff39f620d2 <+56>: movq %rax, %r14 0x7fff39f620d5 <+59>: movq 0x8(%rbx), %rdi 0x7fff39f620d9 <+63>: callq 0x7fff2fb27e04 ; symbol stub for: sel_getName 0x7fff39f620de <+68>: movq %rax, %r15 0x7fff39f620e1 <+71>: cmpq $0x0, 0x10(%rbp) 0x7fff39f620e6 <+76>: je 0x7fff2fa240fb ; <+97> 0x7fff39f620e8 <+78>: movq (%rbx), %rdi 0x7fff39f620eb <+81>: movq 0x8(%rbx), %rsi 0x7fff39f620ef <+85>: callq 0x7fff2fb27b1c ; symbol stub for: object_getMethodImplementation 0x7fff39f620f4 <+90>: movq 0x10(%rbp), %rcx 0x7fff39f620f8 <+94>: movq %rax, (%rcx) 0x7fff39f620fb <+97>: testq %r14, %r14 0x7fff39f620fe <+100>: leaq 0x12c403(%rip), %r9 ; "<unknown name>" 0x7fff39f62105 <+107>: cmovneq %r14, %r9 0x7fff39f62109 <+111>: testq %r15, %r15 0x7fff39f6210c <+114>: leaq 0x12f398(%rip), %rax ; "<unknown selector>" 0x7fff39f62113 <+121>: cmovneq %r15, %rax 0x7fff39f62117 <+125>: movq %rax, (%rsp) 0x7fff39f6211b <+129>: leaq 0x12f371(%rip), %r8 ; "(Delayed Perform) %s %s" 0x7fff39f62122 <+136>: movq %r13, %rdi 0x7fff39f62125 <+139>: movq %r12, %rsi 0x7fff39f62128 <+142>: movl $0x0, %edx 0x7fff39f6212d <+147>: movq $-0x1, %rcx 0x7fff39f62134 <+154>: xorl %eax, %eax 0x7fff39f62136 <+156>: callq 0x7fff2fb27246 ; symbol stub for: __snprintf_chk 0x7fff39f6213b <+161>: movq (%rbx), %rdi 0x7fff39f6213e <+164>: callq 0x7fff2fb27b04 ; symbol stub for: object_getClass 0x7fff39f62143 <+169>: leaq -0x50(%rbp), %rsi 0x7fff39f62147 <+173>: movq %rax, %rdi 0x7fff39f6214a <+176>: callq 0x7fff2fb2763c ; symbol stub for: dladdr 0x7fff39f6214f <+181>: testl %eax, %eax 0x7fff39f62151 <+183>: je 0x7fff2fa24187 ; <+237> 0x7fff39f62153 <+185>: movq -0x50(%rbp), %rax 0x7fff39f62157 <+189>: testq %rax, %rax 0x7fff39f6215a <+192>: leaq 0x12c3b6(%rip), %r9 ; "<unknown library>" 0x7fff39f62161 <+199>: cmovneq %rax, %r9 0x7fff39f62165 <+203>: leaq 0x121b27(%rip), %r8 ; "%s" 0x7fff39f6216c <+210>: movq -0x58(%rbp), %rdi 0x7fff39f62170 <+214>: movq -0x60(%rbp), %rsi 0x7fff39f62174 <+218>: movl $0x0, %edx 0x7fff39f62179 <+223>: movq $-0x1, %rcx 0x7fff39f62180 <+230>: xorl %eax, %eax 0x7fff39f62182 <+232>: callq 0x7fff2fb27246 ; symbol stub for: __snprintf_chk 0x7fff39f62187 <+237>: movq 0x5552c49a(%rip), %rax ; (void *)0x00007fff97e0ed40: __stack_chk_guard 0x7fff39f6218e <+244>: movq (%rax), %rax 0x7fff39f62191 <+247>: cmpq -0x30(%rbp), %rax 0x7fff39f62195 <+251>: jne 0x7fff2fa241a6 ; <+268> 0x7fff39f62197 <+253>: addq $0x48, %rsp 0x7fff39f6219b <+257>: popq %rbx 0x7fff39f6219c <+258>: popq %r12 0x7fff39f6219e <+260>: popq %r13 0x7fff39f621a0 <+262>: popq %r14 0x7fff39f621a2 <+264>: popq %r15 0x7fff39f621a4 <+266>: popq %rbp 0x7fff39f621a5 <+267>: retq 0x7fff39f621a6 <+268>: callq 0x7fff2fb2724c ; symbol stub for: __stack_chk_fail

Hide Details

Hide Details

runCmd: image lookup -s "__NSDescribeNSMachPortCallout" output: 1 symbols match '__NSDescribeNSMachPortCallout' in /System/Library/Frameworks/Foundation.framework/Versions/C/Foundation: Address: Foundation[0x00007fff2fa0d99d] (Foundation.__TEXT.__text + 2018093) Summary: Foundation`__NSDescribeNSMachPortCallout

Hide Details

Hide Details

runCmd: disassemble --force -n "__NSDescribeNSMachPortCallout" output: Foundation`__NSDescribeNSMachPortCallout: 0x7fff39f4b99d <+0>: pushq %rbp 0x7fff39f4b99e <+1>: movq %rsp, %rbp 0x7fff39f4b9a1 <+4>: pushq %r15 0x7fff39f4b9a3 <+6>: pushq %r14 0x7fff39f4b9a5 <+8>: pushq %r13 0x7fff39f4b9a7 <+10>: pushq %r12 0x7fff39f4b9a9 <+12>: pushq %rbx 0x7fff39f4b9aa <+13>: subq $0x38, %rsp 0x7fff39f4b9ae <+17>: movq %r9, %r12 0x7fff39f4b9b1 <+20>: movq %r8, %r13 0x7fff39f4b9b4 <+23>: movq %rcx, -0x58(%rbp) 0x7fff39f4b9b8 <+27>: movq %rdx, %r15 0x7fff39f4b9bb <+30>: movq %rsi, %rbx 0x7fff39f4b9be <+33>: movq 0x55542c63(%rip), %rax ; (void *)0x00007fff97e0ed40: __stack_chk_guard 0x7fff39f4b9c5 <+40>: movq (%rax), %rax 0x7fff39f4b9c8 <+43>: movq %rax, -0x30(%rbp) 0x7fff39f4b9cc <+47>: movq 0x8(%rsi), %rdi 0x7fff39f4b9d0 <+51>: callq 0x7fff2fb27b0a ; symbol stub for: object_getClassName 0x7fff39f4b9d5 <+56>: movq %rax, %r14 0x7fff39f4b9d8 <+59>: movq 0x8(%rbx), %rdi 0x7fff39f4b9dc <+63>: callq 0x7fff2fb27b04 ; symbol stub for: object_getClass 0x7fff39f4b9e1 <+68>: movq %rax, %rbx 0x7fff39f4b9e4 <+71>: testq %r14, %r14 0x7fff39f4b9e7 <+74>: leaq 0x142b1a(%rip), %r9 ; "<unknown name>" 0x7fff39f4b9ee <+81>: cmovneq %r14, %r9 0x7fff39f4b9f2 <+85>: leaq 0x142aff(%rip), %r8 ; "(NSMachPort) %s" 0x7fff39f4b9f9 <+92>: movq %r13, %rdi 0x7fff39f4b9fc <+95>: movq %r12, %rsi 0x7fff39f4b9ff <+98>: movl $0x0, %edx 0x7fff39f4ba04 <+103>: movq $-0x1, %rcx 0x7fff39f4ba0b <+110>: xorl %eax, %eax 0x7fff39f4ba0d <+112>: callq 0x7fff2fb27246 ; symbol stub for: __snprintf_chk 0x7fff39f4ba12 <+117>: leaq -0x50(%rbp), %rsi 0x7fff39f4ba16 <+121>: movq %rbx, %rdi 0x7fff39f4ba19 <+124>: callq 0x7fff2fb2763c ; symbol stub for: dladdr 0x7fff39f4ba1e <+129>: testl %eax, %eax 0x7fff39f4ba20 <+131>: je 0x7fff2fa0da55 ; <+184> 0x7fff39f4ba22 <+133>: movq -0x50(%rbp), %rax 0x7fff39f4ba26 <+137>: testq %rax, %rax 0x7fff39f4ba29 <+140>: leaq 0x142ae7(%rip), %r9 ; "<unknown library>" 0x7fff39f4ba30 <+147>: cmovneq %rax, %r9 0x7fff39f4ba34 <+151>: leaq 0x138258(%rip), %r8 ; "%s" 0x7fff39f4ba3b <+158>: movq %r15, %rdi 0x7fff39f4ba3e <+161>: movq -0x58(%rbp), %rsi 0x7fff39f4ba42 <+165>: movl $0x0, %edx 0x7fff39f4ba47 <+170>: movq $-0x1, %rcx 0x7fff39f4ba4e <+177>: xorl %eax, %eax 0x7fff39f4ba50 <+179>: callq 0x7fff2fb27246 ; symbol stub for: __snprintf_chk 0x7fff39f4ba55 <+184>: movq 0x55542bcc(%rip), %rax ; (void *)0x00007fff97e0ed40: __stack_chk_guard 0x7fff39f4ba5c <+191>: movq (%rax), %rax 0x7fff39f4ba5f <+194>: cmpq -0x30(%rbp), %rax 0x7fff39f4ba63 <+198>: jne 0x7fff2fa0da74 ; <+215> 0x7fff39f4ba65 <+200>: addq $0x38, %rsp 0x7fff39f4ba69 <+204>: popq %rbx 0x7fff39f4ba6a <+205>: popq %r12 0x7fff39f4ba6c <+207>: popq %r13 0x7fff39f4ba6e <+209>: popq %r14 0x7fff39f4ba70 <+211>: popq %r15 0x7fff39f4ba72 <+213>: popq %rbp 0x7fff39f4ba73 <+214>: retq 0x7fff39f4ba74 <+215>: callq 0x7fff2fb2724c ; symbol stub for: __stack_chk_fail

Hide Details

Hide Details

runCmd: image lookup -s "__NSDescribeTimerCallout" output: 1 symbols match '__NSDescribeTimerCallout' in /System/Library/Frameworks/Foundation.framework/Versions/C/Foundation: Address: Foundation[0x00007fff2fa5ef92] (Foundation.__TEXT.__text + 2351394) Summary: Foundation`__NSDescribeTimerCallout

Hide Details

Hide Details

runCmd: disassemble --force -n "__NSDescribeTimerCallout" output: Foundation`__NSDescribeTimerCallout: 0x7fff39f9cf92 <+0>: pushq %rbp 0x7fff39f9cf93 <+1>: movq %rsp, %rbp 0x7fff39f9cf96 <+4>: pushq %r15 0x7fff39f9cf98 <+6>: pushq %r14 0x7fff39f9cf9a <+8>: pushq %r13 0x7fff39f9cf9c <+10>: pushq %r12 0x7fff39f9cf9e <+12>: pushq %rbx 0x7fff39f9cf9f <+13>: subq $0x48, %rsp 0x7fff39f9cfa3 <+17>: movq 0x554f167e(%rip), %rax ; (void *)0x00007fff97e0ed40: __stack_chk_guard 0x7fff39f9cfaa <+24>: movq (%rax), %rax 0x7fff39f9cfad <+27>: movq %rax, -0x30(%rbp) 0x7fff39f9cfb1 <+31>: testq %rsi, %rsi 0x7fff39f9cfb4 <+34>: je 0x7fff2fa5f084 ; <+242> 0x7fff39f9cfba <+40>: movq %r9, %r12 0x7fff39f9cfbd <+43>: movq %r8, %r13 0x7fff39f9cfc0 <+46>: movq %rsi, %rbx 0x7fff39f9cfc3 <+49>: movq %rdx, -0x58(%rbp) 0x7fff39f9cfc7 <+53>: movq %rcx, -0x60(%rbp) 0x7fff39f9cfcb <+57>: movq 0x8(%rsi), %rdi 0x7fff39f9cfcf <+61>: callq 0x7fff2fb27b0a ; symbol stub for: object_getClassName 0x7fff39f9cfd4 <+66>: movq %rax, %r14 0x7fff39f9cfd7 <+69>: movq 0x10(%rbx), %rdi 0x7fff39f9cfdb <+73>: callq 0x7fff2fb27e04 ; symbol stub for: sel_getName 0x7fff39f9cfe0 <+78>: movq %rax, %r15 0x7fff39f9cfe3 <+81>: movq 0x8(%rbx), %rdi 0x7fff39f9cfe7 <+85>: movq 0x10(%rbx), %rsi 0x7fff39f9cfeb <+89>: callq 0x7fff2fb27b1c ; symbol stub for: object_getMethodImplementation 0x7fff39f9cff0 <+94>: movq 0x10(%rbp), %rcx 0x7fff39f9cff4 <+98>: movq %rax, (%rcx) 0x7fff39f9cff7 <+101>: testq %r14, %r14 0x7fff39f9cffa <+104>: leaq 0xfcd3d(%rip), %r9 ; "<unknown class name>" 0x7fff39f9d001 <+111>: cmovneq %r14, %r9 0x7fff39f9d005 <+115>: testq %r15, %r15 0x7fff39f9d008 <+118>: leaq 0xf449c(%rip), %rax ; "<unknown selector>" 0x7fff39f9d00f <+125>: cmovneq %r15, %rax 0x7fff39f9d013 <+129>: movq %rax, (%rsp) 0x7fff39f9d017 <+133>: leaq 0xfcd0e(%rip), %r8 ; "(NSTimer) [%s %s]" 0x7fff39f9d01e <+140>: movq %r13, %rdi 0x7fff39f9d021 <+143>: movq %r12, %rsi 0x7fff39f9d024 <+146>: movl $0x0, %edx 0x7fff39f9d029 <+151>: movq $-0x1, %rcx 0x7fff39f9d030 <+158>: xorl %eax, %eax 0x7fff39f9d032 <+160>: callq 0x7fff2fb27246 ; symbol stub for: __snprintf_chk 0x7fff39f9d037 <+165>: movq 0x8(%rbx), %rdi 0x7fff39f9d03b <+169>: callq 0x7fff2fb27b04 ; symbol stub for: object_getClass 0x7fff39f9d040 <+174>: leaq -0x50(%rbp), %rsi 0x7fff39f9d044 <+178>: movq %rax, %rdi 0x7fff39f9d047 <+181>: callq 0x7fff2fb2763c ; symbol stub for: dladdr 0x7fff39f9d04c <+186>: testl %eax, %eax 0x7fff39f9d04e <+188>: je 0x7fff2fa5f084 ; <+242> 0x7fff39f9d050 <+190>: movq -0x50(%rbp), %rax 0x7fff39f9d054 <+194>: testq %rax, %rax 0x7fff39f9d057 <+197>: leaq 0xf14b9(%rip), %r9 ; "<unknown library>" 0x7fff39f9d05e <+204>: cmovneq %rax, %r9 0x7fff39f9d062 <+208>: leaq 0xe6c2a(%rip), %r8 ; "%s" 0x7fff39f9d069 <+215>: movq -0x58(%rbp), %rdi 0x7fff39f9d06d <+219>: movq -0x60(%rbp), %rsi 0x7fff39f9d071 <+223>: movl $0x0, %edx 0x7fff39f9d076 <+228>: movq $-0x1, %rcx 0x7fff39f9d07d <+235>: xorl %eax, %eax 0x7fff39f9d07f <+237>: callq 0x7fff2fb27246 ; symbol stub for: __snprintf_chk 0x7fff39f9d084 <+242>: movq 0x554f159d(%rip), %rax ; (void *)0x00007fff97e0ed40: __stack_chk_guard 0x7fff39f9d08b <+249>: movq (%rax), %rax 0x7fff39f9d08e <+252>: cmpq -0x30(%rbp), %rax 0x7fff39f9d092 <+256>: jne 0x7fff2fa5f0a3 ; <+273> 0x7fff39f9d094 <+258>: addq $0x48, %rsp 0x7fff39f9d098 <+262>: popq %rbx 0x7fff39f9d099 <+263>: popq %r12 0x7fff39f9d09b <+265>: popq %r13 0x7fff39f9d09d <+267>: popq %r14 0x7fff39f9d09f <+269>: popq %r15 0x7fff39f9d0a1 <+271>: popq %rbp 0x7fff39f9d0a2 <+272>: retq 0x7fff39f9d0a3 <+273>: callq 0x7fff2fb2724c ; symbol stub for: __stack_chk_fail

Hide Details

Hide Details

runCmd: image lookup -s "__NSFireDelayedPerform" output: 1 symbols match '__NSFireDelayedPerform' in /System/Library/Frameworks/Foundation.framework/Versions/C/Foundation: Address: Foundation[0x00007fff2f8ba543] (Foundation.__TEXT.__text + 628435) Summary: Foundation`__NSFireDelayedPerform

Hide Details

Hide Details

runCmd: disassemble --force -n "__NSFireDelayedPerform" output: Foundation`__NSFireDelayedPerform: 0x7fff39df8543 <+0>: pushq %rbp 0x7fff39df8544 <+1>: movq %rsp, %rbp 0x7fff39df8547 <+4>: pushq %r15 0x7fff39df8549 <+6>: pushq %r14 0x7fff39df854b <+8>: pushq %r13 0x7fff39df854d <+10>: pushq %r12 0x7fff39df854f <+12>: pushq %rbx 0x7fff39df8550 <+13>: subq $0x58, %rsp 0x7fff39df8554 <+17>: movq %rdi, -0x38(%rbp) 0x7fff39df8558 <+21>: movq (%rsi), %rax 0x7fff39df855b <+24>: movq %rax, -0x58(%rbp) 0x7fff39df855f <+28>: movq 0x8(%rsi), %rax 0x7fff39df8563 <+32>: movq %rax, -0x50(%rbp) 0x7fff39df8567 <+36>: movq 0x10(%rsi), %rax 0x7fff39df856b <+40>: movq %rax, -0x48(%rbp) 0x7fff39df856f <+44>: movq 0x18(%rsi), %rax 0x7fff39df8573 <+48>: movq %rax, -0x40(%rbp) 0x7fff39df8577 <+52>: movq 0x20(%rsi), %r15 0x7fff39df857b <+56>: movq 0x28(%rsi), %rax 0x7fff39df857f <+60>: movq %rax, -0x30(%rbp) 0x7fff39df8583 <+64>: movq 0x30(%rsi), %rbx 0x7fff39df8587 <+68>: callq 0x7fff2fb26c3a ; symbol stub for: _CFAutoreleasePoolPush 0x7fff39df858c <+73>: movq %rax, -0x68(%rbp) 0x7fff39df8590 <+77>: testq %rbx, %rbx 0x7fff39df8593 <+80>: je 0x7fff2f8ba5bd ; <+122> 0x7fff39df8595 <+82>: movq 0x557794cc(%rip), %rdi ; (void *)0x00007fff8f582430: NSProcessInfo 0x7fff39df859c <+89>: movq 0x557703b5(%rip), %rsi ; "processInfo" 0x7fff39df85a3 <+96>: movq 0x5569668e(%rip), %r14 ; (void *)0x00007fff70605e40: objc_msgSend 0x7fff39df85aa <+103>: callq *%r14 0x7fff39df85ad <+106>: movq 0x55773034(%rip), %rsi ; "_reactivateActivity:" 0x7fff39df85b4 <+113>: movq %rax, %rdi 0x7fff39df85b7 <+116>: movq %rbx, %rdx 0x7fff39df85ba <+119>: callq *%r14 0x7fff39df85bd <+122>: movq %rbx, -0x60(%rbp) 0x7fff39df85c1 <+126>: movq -0x38(%rbp), %rdi 0x7fff39df85c5 <+130>: callq 0x7fff2fb264f0 ; symbol stub for: CFRetain 0x7fff39df85ca <+135>: movq -0x30(%rbp), %rbx 0x7fff39df85ce <+139>: movq %rbx, %rdi 0x7fff39df85d1 <+142>: callq 0x7fff2fb27ae6 ; symbol stub for: objc_sync_enter 0x7fff39df85d6 <+147>: movq 0x55695eb3(%rip), %r14 ; (void *)0x00007fff8f008428: NSRunLoop._dperf 0x7fff39df85dd <+154>: movq (%r14), %rax 0x7fff39df85e0 <+157>: movq (%rbx,%rax), %rbx 0x7fff39df85e4 <+161>: movq 0x5576d9bd(%rip), %r12 ; "count" 0x7fff39df85eb <+168>: movq %rbx, %rdi 0x7fff39df85ee <+171>: movq %r12, %rsi 0x7fff39df85f1 <+174>: callq *0x55696641(%rip) ; (void *)0x00007fff70605e40: objc_msgSend 0x7fff39df85f7 <+180>: movq %rbx, %rdi 0x7fff39df85fa <+183>: xorl %esi, %esi 0x7fff39df85fc <+185>: movq %rax, %rdx 0x7fff39df85ff <+188>: movq %r15, %rcx 0x7fff39df8602 <+191>: callq 0x7fff2fb25fb0 ; symbol stub for: CFArrayGetFirstIndexOfValue 0x7fff39df8607 <+196>: shlq $0x20, %rax 0x7fff39df860b <+200>: movabsq $-0x100000000, %rcx ; imm = 0xFFFFFFFF00000000 0x7fff39df8615 <+210>: cmpq %rcx, %rax 0x7fff39df8618 <+213>: je 0x7fff2f8ba631 ; <+238> 0x7fff39df861a <+215>: sarq $0x20, %rax 0x7fff39df861e <+219>: movq (%r14), %rcx 0x7fff39df8621 <+222>: movq -0x30(%rbp), %rdx 0x7fff39df8625 <+226>: movq (%rdx,%rcx), %rdi 0x7fff39df8629 <+230>: movq %rax, %rsi 0x7fff39df862c <+233>: callq 0x7fff2fb25fc2 ; symbol stub for: CFArrayRemoveValueAtIndex 0x7fff39df8631 <+238>: movq -0x40(%rbp), %rdi 0x7fff39df8635 <+242>: movq %r12, %rsi 0x7fff39df8638 <+245>: callq *0x556965fa(%rip) ; (void *)0x00007fff70605e40: objc_msgSend 0x7fff39df863e <+251>: movq 0x5576e54b(%rip), %rcx ; "objectAtIndex:" 0x7fff39df8645 <+258>: movq %rcx, -0x78(%rbp) 0x7fff39df8649 <+262>: movq 0x55695b88(%rip), %rcx ; (void *)0x00007fff8eeda348: NSRunLoopCommonModes 0x7fff39df8650 <+269>: movq (%rcx), %r15 0x7fff39df8653 <+272>: movq 0x5576dcc6(%rip), %rcx ; "isEqual:" 0x7fff39df865a <+279>: movq %rcx, -0x70(%rbp) 0x7fff39df865e <+283>: movq 0x5569645b(%rip), %rcx ; (void *)0x00007fff8eeda348: NSRunLoopCommonModes 0x7fff39df8665 <+290>: movq (%rcx), %r13 0x7fff39df8668 <+293>: movslq %eax, %r12 0x7fff39df866b <+296>: decq %r12 0x7fff39df866e <+299>: cmpq $-0x1, %r12 0x7fff39df8672 <+303>: je 0x7fff2f8ba6c7 ; <+388> 0x7fff39df8674 <+305>: movq -0x40(%rbp), %rdi 0x7fff39df8678 <+309>: movq -0x78(%rbp), %rsi 0x7fff39df867c <+313>: movq %r12, %rdx 0x7fff39df867f <+316>: callq *0x556965b3(%rip) ; (void *)0x00007fff70605e40: objc_msgSend 0x7fff39df8685 <+322>: movq %rax, %rbx 0x7fff39df8688 <+325>: movq %r13, %r14 0x7fff39df868b <+328>: cmpq %r15, %rax 0x7fff39df868e <+331>: je 0x7fff2f8ba6ae ; <+363> 0x7fff39df8690 <+333>: movq %rbx, %rdi 0x7fff39df8693 <+336>: movq -0x70(%rbp), %rsi 0x7fff39df8697 <+340>: leaq 0x556ba99a(%rip), %rdx ; @"kCFRunLoopCommonModes" 0x7fff39df869e <+347>: callq *0x55696594(%rip) ; (void *)0x00007fff70605e40: objc_msgSend 0x7fff39df86a4 <+353>: movq %rbx, %r14 0x7fff39df86a7 <+356>: testb %al, %al 0x7fff39df86a9 <+358>: je 0x7fff2f8ba6ae ; <+363> 0x7fff39df86ab <+360>: movq %r13, %r14 0x7fff39df86ae <+363>: callq 0x7fff2fb2651a ; symbol stub for: CFRunLoopGetCurrent 0x7fff39df86b3 <+368>: decq %r12 0x7fff39df86b6 <+371>: movq %rax, %rdi 0x7fff39df86b9 <+374>: movq -0x38(%rbp), %rsi 0x7fff39df86bd <+378>: movq %r14, %rdx 0x7fff39df86c0 <+381>: callq 0x7fff2fb26550 ; symbol stub for: CFRunLoopRemoveTimer 0x7fff39df86c5 <+386>: jmp 0x7fff2f8ba66e ; <+299> 0x7fff39df86c7 <+388>: movq -0x30(%rbp), %rdi 0x7fff39df86cb <+392>: callq 0x7fff2fb27aec ; symbol stub for: objc_sync_exit 0x7fff39df86d0 <+397>: movq -0x58(%rbp), %rdi 0x7fff39df86d4 <+401>: movq -0x50(%rbp), %rsi 0x7fff39df86d8 <+405>: movq -0x48(%rbp), %rdx 0x7fff39df86dc <+409>: callq *0x55696556(%rip) ; (void *)0x00007fff70605e40: objc_msgSend 0x7fff39df86e2 <+415>: movq -0x38(%rbp), %rdi 0x7fff39df86e6 <+419>: callq 0x7fff2fb264ea ; symbol stub for: CFRelease 0x7fff39df86eb <+424>: movq -0x60(%rbp), %rbx 0x7fff39df86ef <+428>: testq %rbx, %rbx 0x7fff39df86f2 <+431>: je 0x7fff2f8ba71e ; <+475> 0x7fff39df86f4 <+433>: movq 0x5577936d(%rip), %rdi ; (void *)0x00007fff8f582430: NSProcessInfo 0x7fff39df86fb <+440>: movq 0x55770256(%rip), %rsi ; "processInfo" 0x7fff39df8702 <+447>: movq 0x5569652f(%rip), %rax ; (void *)0x00007fff70605e40: objc_msgSend 0x7fff39df8709 <+454>: movq %rax, %r14 0x7fff39df870c <+457>: callq *%rax 0x7fff39df870e <+459>: movq 0x55772edb(%rip), %rsi ; "endActivity:" 0x7fff39df8715 <+466>: movq %rax, %rdi 0x7fff39df8718 <+469>: movq %rbx, %rdx 0x7fff39df871b <+472>: callq *%r14 0x7fff39df871e <+475>: movq -0x68(%rbp), %rdi 0x7fff39df8722 <+479>: addq $0x58, %rsp 0x7fff39df8726 <+483>: popq %rbx 0x7fff39df8727 <+484>: popq %r12 0x7fff39df8729 <+486>: popq %r13 0x7fff39df872b <+488>: popq %r14 0x7fff39df872d <+490>: popq %r15 0x7fff39df872f <+492>: popq %rbp 0x7fff39df8730 <+493>: jmp 0x7fff2fb26c2e ; symbol stub for: _CFAutoreleasePoolPop 0x7fff39df8735 <+498>: jmp 0x7fff2f8ba737 ; <+500> 0x7fff39df8737 <+500>: movq %rax, %rbx 0x7fff39df873a <+503>: movq -0x30(%rbp), %rdi 0x7fff39df873e <+507>: callq 0x7fff2fb27aec ; symbol stub for: objc_sync_exit 0x7fff39df8743 <+512>: movq %rbx, %rdi 0x7fff39df8746 <+515>: callq 0x7fff2fb27180 ; symbol stub for: _Unwind_Resume 0x7fff39df874b <+520>: ud2 0x7fff39df874d <+522>: nop 0x7fff39df874e <+523>: nop 0x7fff39df874f <+524>: nop

Hide Details

Hide Details

runCmd: image lookup -s "__NSFireMachPort" output: 1 symbols match '__NSFireMachPort' in /System/Library/Frameworks/Foundation.framework/Versions/C/Foundation: Address: Foundation[0x00007fff2f8ddb44] (Foundation.__TEXT.__text + 773332) Summary: Foundation`__NSFireMachPort

Hide Details

Hide Details

runCmd: disassemble --force -n "__NSFireMachPort" output: Foundation`__NSFireMachPort: 0x7fff39e1bb44 <+0>: pushq %rbp 0x7fff39e1bb45 <+1>: movq %rsp, %rbp 0x7fff39e1bb48 <+4>: pushq %r15 0x7fff39e1bb4a <+6>: pushq %r14 0x7fff39e1bb4c <+8>: pushq %r13 0x7fff39e1bb4e <+10>: pushq %r12 0x7fff39e1bb50 <+12>: pushq %rbx 0x7fff39e1bb51 <+13>: subq $0x38, %rsp 0x7fff39e1bb55 <+17>: movq %rsi, %r12 0x7fff39e1bb58 <+20>: movq 0x55672ac9(%rip), %rax ; (void *)0x00007fff97e0ed40: __stack_chk_guard 0x7fff39e1bb5f <+27>: movq (%rax), %rax 0x7fff39e1bb62 <+30>: movq %rax, -0x30(%rbp) 0x7fff39e1bb66 <+34>: movq 0x8(%rcx), %r15 0x7fff39e1bb6a <+38>: callq 0x7fff2fb26c3a ; symbol stub for: _CFAutoreleasePoolPush 0x7fff39e1bb6f <+43>: movq %rax, %r14 0x7fff39e1bb72 <+46>: movq 0x5574f39f(%rip), %rbx ; "handleMachMessage:" 0x7fff39e1bb79 <+53>: movq 0x5574a728(%rip), %r13 ; "respondsToSelector:" 0x7fff39e1bb80 <+60>: movq %r15, %rdi 0x7fff39e1bb83 <+63>: movq %r13, %rsi 0x7fff39e1bb86 <+66>: movq %rbx, %rdx 0x7fff39e1bb89 <+69>: callq *0x556730a9(%rip) ; (void *)0x00007fff70605e40: objc_msgSend 0x7fff39e1bb8f <+75>: testb %al, %al 0x7fff39e1bb91 <+77>: je 0x7fff2f8ddba7 ; <+99> 0x7fff39e1bb93 <+79>: movq %r15, %rdi 0x7fff39e1bb96 <+82>: movq %rbx, %rsi 0x7fff39e1bb99 <+85>: movq %r12, %rdx 0x7fff39e1bb9c <+88>: callq *0x55673096(%rip) ; (void *)0x00007fff70605e40: objc_msgSend 0x7fff39e1bba2 <+94>: jmp 0x7fff2f8ddc6d ; <+297> 0x7fff39e1bba7 <+99>: movq 0x5574f372(%rip), %rdx ; "handlePortMessage:" 0x7fff39e1bbae <+106>: movq %r15, %rdi 0x7fff39e1bbb1 <+109>: movq %r13, %rsi 0x7fff39e1bbb4 <+112>: callq *0x5567307e(%rip) ; (void *)0x00007fff70605e40: objc_msgSend 0x7fff39e1bbba <+118>: testb %al, %al 0x7fff39e1bbbc <+120>: je 0x7fff2f8ddc6d ; <+297> 0x7fff39e1bbc2 <+126>: movq 0x55755c1f(%rip), %rdi ; (void *)0x00007fbd13c060f0 0x7fff39e1bbc9 <+133>: movq 0x5574f358(%rip), %rsi ; "parseMachMessage:localPort:remotePort:msgid:components:" 0x7fff39e1bbd0 <+140>: leaq -0x48(%rbp), %rax 0x7fff39e1bbd4 <+144>: movq %rax, (%rsp) 0x7fff39e1bbd8 <+148>: movq 0x55673059(%rip), %r13 ; (void *)0x00007fff70605e40: objc_msgSend 0x7fff39e1bbdf <+155>: leaq -0x40(%rbp), %rcx 0x7fff39e1bbe3 <+159>: leaq -0x38(%rbp), %rbx 0x7fff39e1bbe7 <+163>: leaq -0x4c(%rbp), %r9 0x7fff39e1bbeb <+167>: movq %r12, %rdx 0x7fff39e1bbee <+170>: movq %rcx, %r12 0x7fff39e1bbf1 <+173>: movq %rbx, %r8 0x7fff39e1bbf4 <+176>: callq *%r13 0x7fff39e1bbf7 <+179>: movq 0x557564d2(%rip), %rdi ; (void *)0x00007fff8f582368: NSPortMessage 0x7fff39e1bbfe <+186>: callq 0x7fff2fb279de ; symbol stub for: objc_allocWithZone 0x7fff39e1bc03 <+191>: movq (%rbx), %rdx 0x7fff39e1bc06 <+194>: movq (%r12), %rcx 0x7fff39e1bc0a <+198>: leaq -0x48(%rbp), %r12 0x7fff39e1bc0e <+202>: movq (%r12), %r8 0x7fff39e1bc12 <+206>: movq 0x5574f317(%rip), %rsi ; "initWithSendPort:receivePort:components:" 0x7fff39e1bc19 <+213>: movq %rax, %rdi 0x7fff39e1bc1c <+216>: callq *%r13 0x7fff39e1bc1f <+219>: movq %rax, %rbx 0x7fff39e1bc22 <+222>: leaq -0x4c(%rbp), %rax 0x7fff39e1bc26 <+226>: movl (%rax), %edx 0x7fff39e1bc28 <+228>: movq 0x5574f309(%rip), %rsi ; "setMsgid:" 0x7fff39e1bc2f <+235>: movq %rbx, %rdi 0x7fff39e1bc32 <+238>: callq *%r13 0x7fff39e1bc35 <+241>: movq %r15, %rdi 0x7fff39e1bc38 <+244>: movq 0x5574f2e1(%rip), %rsi ; "handlePortMessage:" 0x7fff39e1bc3f <+251>: movq %rbx, %rdx 0x7fff39e1bc42 <+254>: callq *%r13 0x7fff39e1bc45 <+257>: movq 0x55672ff4(%rip), %r15 ; (void *)0x00007fff70607ca0: objc_release 0x7fff39e1bc4c <+264>: movq %rbx, %rdi 0x7fff39e1bc4f <+267>: callq *%r15 0x7fff39e1bc52 <+270>: movq (%r12), %rdi 0x7fff39e1bc56 <+274>: callq *%r15 0x7fff39e1bc59 <+277>: leaq -0x40(%rbp), %rax 0x7fff39e1bc5d <+281>: movq (%rax), %rdi 0x7fff39e1bc60 <+284>: callq *%r15 0x7fff39e1bc63 <+287>: leaq -0x38(%rbp), %rax 0x7fff39e1bc67 <+291>: movq (%rax), %rdi 0x7fff39e1bc6a <+294>: callq *%r15 0x7fff39e1bc6d <+297>: movq %r14, %rdi 0x7fff39e1bc70 <+300>: callq 0x7fff2fb26c2e ; symbol stub for: _CFAutoreleasePoolPop 0x7fff39e1bc75 <+305>: movq 0x556729ac(%rip), %rax ; (void *)0x00007fff97e0ed40: __stack_chk_guard 0x7fff39e1bc7c <+312>: movq (%rax), %rax 0x7fff39e1bc7f <+315>: cmpq -0x30(%rbp), %rax 0x7fff39e1bc83 <+319>: jne 0x7fff2f8ddc94 ; <+336> 0x7fff39e1bc85 <+321>: addq $0x38, %rsp 0x7fff39e1bc89 <+325>: popq %rbx 0x7fff39e1bc8a <+326>: popq %r12 0x7fff39e1bc8c <+328>: popq %r13 0x7fff39e1bc8e <+330>: popq %r14 0x7fff39e1bc90 <+332>: popq %r15 0x7fff39e1bc92 <+334>: popq %rbp 0x7fff39e1bc93 <+335>: retq 0x7fff39e1bc94 <+336>: callq 0x7fff2fb2724c ; symbol stub for: __stack_chk_fail 0x7fff39e1bc99 <+341>: nop 0x7fff39e1bc9a <+342>: nop 0x7fff39e1bc9b <+343>: nop

Hide Details

Hide Details

runCmd: image lookup -s "__NSFireTimer" output: 1 symbols match '__NSFireTimer' in /System/Library/Frameworks/Foundation.framework/Versions/C/Foundation: Address: Foundation[0x00007fff2f8de2a7] (Foundation.__TEXT.__text + 775223) Summary: Foundation`__NSFireTimer

Hide Details

Hide Details

runCmd: disassemble --force -n "__NSFireTimer" output: Foundation`__NSFireTimer: 0x7fff39e1c2a7 <+0>: pushq %rbp 0x7fff39e1c2a8 <+1>: movq %rsp, %rbp 0x7fff39e1c2ab <+4>: pushq %r15 0x7fff39e1c2ad <+6>: pushq %r14 0x7fff39e1c2af <+8>: pushq %r13 0x7fff39e1c2b1 <+10>: pushq %r12 0x7fff39e1c2b3 <+12>: pushq %rbx 0x7fff39e1c2b4 <+13>: pushq %rax 0x7fff39e1c2b5 <+14>: movq %rdi, %r14 0x7fff39e1c2b8 <+17>: movq 0x8(%rsi), %rbx 0x7fff39e1c2bc <+21>: movq 0x10(%rsi), %r15 0x7fff39e1c2c0 <+25>: callq 0x7fff2fb26c3a ; symbol stub for: _CFAutoreleasePoolPush 0x7fff39e1c2c5 <+30>: movq %rax, %r12 0x7fff39e1c2c8 <+33>: movq 0x55672979(%rip), %r13 ; (void *)0x00007fff70605d10: objc_retain 0x7fff39e1c2cf <+40>: movq %r14, %rdi 0x7fff39e1c2d2 <+43>: callq *%r13 0x7fff39e1c2d5 <+46>: movq %rbx, %rdi 0x7fff39e1c2d8 <+49>: callq *%r13 0x7fff39e1c2db <+52>: movq %rbx, %rdi 0x7fff39e1c2de <+55>: movq %r15, %rsi 0x7fff39e1c2e1 <+58>: movq %r14, %rdx 0x7fff39e1c2e4 <+61>: callq *0x5567294e(%rip) ; (void *)0x00007fff70605e40: objc_msgSend 0x7fff39e1c2ea <+67>: movq 0x5567294f(%rip), %r15 ; (void *)0x00007fff70607ca0: objc_release 0x7fff39e1c2f1 <+74>: movq %rbx, %rdi 0x7fff39e1c2f4 <+77>: callq *%r15 0x7fff39e1c2f7 <+80>: movq %r14, %rdi 0x7fff39e1c2fa <+83>: callq *%r15 0x7fff39e1c2fd <+86>: movq %r12, %rdi 0x7fff39e1c300 <+89>: addq $0x8, %rsp 0x7fff39e1c304 <+93>: popq %rbx 0x7fff39e1c305 <+94>: popq %r12 0x7fff39e1c307 <+96>: popq %r13 0x7fff39e1c309 <+98>: popq %r14 0x7fff39e1c30b <+100>: popq %r15 0x7fff39e1c30d <+102>: popq %rbp 0x7fff39e1c30e <+103>: jmp 0x7fff2fb26c2e ; symbol stub for: _CFAutoreleasePoolPop

Hide Details

Hide Details

runCmd: image lookup -s "__NSPropertyListClasses_ForArchival_ErrorAndException" output: 1 symbols match '__NSPropertyListClasses_ForArchival_ErrorAndException' in /System/Library/Frameworks/Foundation.framework/Versions/C/Foundation: Address: Foundation[0x00007fff2f87b58d] (Foundation.__TEXT.__text + 370461) Summary: Foundation`__NSPropertyListClasses_ForArchival_ErrorAndException

Hide Details

Hide Details

runCmd: disassemble --force -n "__NSPropertyListClasses_ForArchival_ErrorAndException" output: Foundation`__NSPropertyListClasses_ForArchival_ErrorAndException: 0x7fff39db958d <+0>: pushq %rbp 0x7fff39db958e <+1>: movq %rsp, %rbp 0x7fff39db9591 <+4>: cmpq $-0x1, 0x557d3017(%rip) ; __NSPropertyListClasses_ForArchival_ErrorAndException.plistClasses + 7 0x7fff39db9599 <+12>: jne 0x7fff2f87b5a4 ; <+23> 0x7fff39db959b <+14>: movq 0x557d3006(%rip), %rax ; __NSPropertyListClasses_ForArchival_ErrorAndException.plistClasses 0x7fff39db95a2 <+21>: popq %rbp 0x7fff39db95a3 <+22>: retq 0x7fff39db95a4 <+23>: leaq 0x557d3005(%rip), %rdi ; __NSPropertyListClasses_ForArchival_ErrorAndException.onceToken 0x7fff39db95ab <+30>: leaq 0x556ddf96(%rip), %rsi ; __block_literal_global 0x7fff39db95b2 <+37>: callq 0x7fff2fb275a0 ; symbol stub for: dispatch_once 0x7fff39db95b7 <+42>: jmp 0x7fff2f87b59b ; <+14>

Hide Details

Hide Details

runCmd: image lookup -s "__NSUserScriptTaskServiceStart" output: 1 symbols match '__NSUserScriptTaskServiceStart' in /System/Library/Frameworks/Foundation.framework/Versions/C/Foundation: Address: Foundation[0x00007fff2fb24ceb] (Foundation.__TEXT.__text + 3161723) Summary: Foundation`__NSUserScriptTaskServiceStart

Hide Details

Hide Details

runCmd: disassemble --force -n "__NSUserScriptTaskServiceStart" output: Foundation`__NSUserScriptTaskServiceStart: 0x7fff3a062ceb <+0>: pushq %rbp 0x7fff3a062cec <+1>: movq %rsp, %rbp 0x7fff3a062cef <+4>: pushq %r15 0x7fff3a062cf1 <+6>: pushq %r14 0x7fff3a062cf3 <+8>: pushq %rbx 0x7fff3a062cf4 <+9>: pushq %rax 0x7fff3a062cf5 <+10>: movq $0x0, (%rsp) 0x7fff3a062cfd <+18>: leaq 0x522d5(%rip), %rdi ; "com.apple.automation.app_launched" 0x7fff3a062d04 <+25>: leaq 0x52279(%rip), %rdx ; "com.apple.message.signature" 0x7fff3a062d0b <+32>: leaq 0x51f1c(%rip), %rcx ; "com.apple.foundation.UserScriptService" 0x7fff3a062d12 <+39>: leaq 0x522a4(%rip), %r8 ; "com.apple.message.summarize" 0x7fff3a062d19 <+46>: leaq 0x1ad10(%rip), %r9 ; "YES" 0x7fff3a062d20 <+53>: movl $0x5, %esi 0x7fff3a062d25 <+58>: xorl %eax, %eax 0x7fff3a062d27 <+60>: callq 0x7fff2fb279ae ; symbol stub for: msgtracer_log_with_keys 0x7fff3a062d2c <+65>: movq 0x5550fec5(%rip), %rdi ; (void *)0x00007fff8f5836a0: NSUserScriptTaskServiceDelegate 0x7fff3a062d33 <+72>: callq 0x7fff2fb279d8 ; symbol stub for: objc_alloc 0x7fff3a062d38 <+77>: movq 0x55503201(%rip), %rsi ; "init" 0x7fff3a062d3f <+84>: movq 0x5542bef2(%rip), %r15 ; (void *)0x00007fff70605e40: objc_msgSend 0x7fff3a062d46 <+91>: movq %rax, %rdi 0x7fff3a062d49 <+94>: callq *%r15 0x7fff3a062d4c <+97>: movq %rax, %r14 0x7fff3a062d4f <+100>: movq 0x5550ed5a(%rip), %rdi ; (void *)0x00007fff8f583970: NSXPCListener 0x7fff3a062d56 <+107>: movq 0x5550e023(%rip), %rsi ; "serviceListener" 0x7fff3a062d5d <+114>: callq *%r15 0x7fff3a062d60 <+117>: movq %rax, %rbx 0x7fff3a062d63 <+120>: movq 0x55504cfe(%rip), %rsi ; "setDelegate:" 0x7fff3a062d6a <+127>: movq %rax, %rdi 0x7fff3a062d6d <+130>: movq %r14, %rdx 0x7fff3a062d70 <+133>: callq *%r15 0x7fff3a062d73 <+136>: movq 0x5550335e(%rip), %rsi ; "resume" 0x7fff3a062d7a <+143>: movq %rbx, %rdi 0x7fff3a062d7d <+146>: callq *%r15 0x7fff3a062d80 <+149>: movq %r14, %rdi 0x7fff3a062d83 <+152>: addq $0x8, %rsp 0x7fff3a062d87 <+156>: popq %rbx 0x7fff3a062d88 <+157>: popq %r14 0x7fff3a062d8a <+159>: popq %r15 0x7fff3a062d8c <+161>: popq %rbp 0x7fff3a062d8d <+162>: jmpq *0x5542bead(%rip) ; (void *)0x00007fff70607ca0: objc_release

Hide Details

Hide Details

runCmd: image lookup -s "getStackObservedValueClassAndBoxSize" output: 1 symbols match 'getStackObservedValueClassAndBoxSize' in /System/Library/Frameworks/Foundation.framework/Versions/C/Foundation: Address: Foundation[0x00007fff2f8a4760] (Foundation.__TEXT.__text + 538864) Summary: Foundation`getStackObservedValueClassAndBoxSize

Hide Details

Hide Details

runCmd: disassemble --force -n "getStackObservedValueClassAndBoxSize" output: Foundation`getStackObservedValueClassAndBoxSize: 0x7fff39de2760 <+0>: pushq %rbp 0x7fff39de2761 <+1>: movq %rsp, %rbp 0x7fff39de2764 <+4>: pushq %rbx 0x7fff39de2765 <+5>: pushq %rax 0x7fff39de2766 <+6>: movq %rdi, %rbx 0x7fff39de2769 <+9>: cmpq $-0x1, 0x557a9bc7(%rip) ; getStackObservedValueClassAndBoxSize.cls + 7 0x7fff39de2771 <+17>: jne 0x7fff2f8a478b ; <+43> 0x7fff39de2773 <+19>: movq 0x557a9bae(%rip), %rax ; getStackObservedValueClassAndBoxSize.boxSize 0x7fff39de277a <+26>: movq %rax, (%rbx) 0x7fff39de277d <+29>: movq 0x557a9bac(%rip), %rax ; getStackObservedValueClassAndBoxSize.cls 0x7fff39de2784 <+36>: addq $0x8, %rsp 0x7fff39de2788 <+40>: popq %rbx 0x7fff39de2789 <+41>: popq %rbp 0x7fff39de278a <+42>: retq 0x7fff39de278b <+43>: leaq 0x557a9ba6(%rip), %rdi ; getStackObservedValueClassAndBoxSize.onceToken 0x7fff39de2792 <+50>: leaq 0x556b38f7(%rip), %rsi ; __block_literal_global 0x7fff39de2799 <+57>: callq 0x7fff2fb275a0 ; symbol stub for: dispatch_once 0x7fff39de279e <+62>: jmp 0x7fff2f8a4773 ; <+19>

Hide Details

Hide Details

<bound method SBProcess.Kill of <lldb.SBProcess; proxy of <Swig Object of type 'lldb::SBProcess *' at 0x108347870> >>: success

Hide Details

PASS: LLDB (/Users/buildslave/jenkins/workspace/lldb-cmake-matrix/lldb-build/bin/clang-x86_64) :: test_foundation_disasm (TestFoundationDisassembly.FoundationDisassembleTestCase) runCmd: settings clear -all output:

Hide Details

runCmd: settings set symbols.enable-external-lookup false output:

Hide Details

runCmd: settings set target.inherit-tcc true output:

Hide Details

runCmd: settings set target.detach-on-error false output:

Hide Details

runCmd: settings set target.auto-apply-fixits false output:

Hide Details

runCmd: settings set plugin.process.gdb-remote.packet-timeout 60 output:

Hide Details

runCmd: settings set symbols.clang-modules-cache-path "/Users/buildslave/jenkins/workspace/lldb-cmake-matrix/lldb-build/lldb-test-build.noindex/module-cache-lldb/lldb-api" output:

Hide Details

runCmd: settings set use-color false output:

Hide Details

runCmd: setting set target.prefer-dynamic-value no-dynamic-values output:

Hide Details

FAIL: LLDB (/Users/buildslave/jenkins/workspace/lldb-cmake-matrix/lldb-build/bin/clang-x86_64) :: test_simple_disasm (TestFoundationDisassembly.FoundationDisassembleTestCase) Restore dir to: /Users/buildslave/jenkins/workspace/lldb-cmake-matrix/lldb-build/tools/lldb/test ====================================================================== ERROR: test_simple_disasm (TestFoundationDisassembly.FoundationDisassembleTestCase) Test the lldb 'disassemble' command ---------------------------------------------------------------------- Error when building test subject.

Hide Details

Build Command: make VPATH=/Users/buildslave/jenkins/workspace/lldb-cmake-matrix/llvm-project/lldb/test/API/lang/objc/foundation -C /Users/buildslave/jenkins/workspace/lldb-cmake-matrix/lldb-build/lldb-test-build.noindex/lang/objc/foundation/TestFoundationDisassembly.test_simple_disasm -I /Users/buildslave/jenkins/workspace/lldb-cmake-matrix/llvm-project/lldb/test/API/lang/objc/foundation -I /Users/buildslave/jenkins/workspace/lldb-cmake-matrix/llvm-project/lldb/packages/Python/lldbsuite/test/make -f /Users/buildslave/jenkins/workspace/lldb-cmake-matrix/llvm-project/lldb/test/API/lang/objc/foundation/Makefile all ARCH=x86_64 CC="/Users/buildslave/jenkins/workspace/lldb-cmake-matrix/lldb-build/bin/clang" DSYMUTIL="/Users/buildslave/jenkins/workspace/lldb-cmake-matrix/lldb-build/./bin/dsymutil" CLANG_MODULE_CACHE_DIR=/Users/buildslave/jenkins/workspace/lldb-cmake-matrix/lldb-build/lldb-test-build.noindex/module-cache-clang/lldb-api

Hide Details

Build Command Output: /Users/buildslave/jenkins/workspace/lldb-cmake-matrix/lldb-build/bin/clang -g -O0 -fno-builtin -isysroot "/Applications/Xcode.app/Contents/Developer/Platforms/MacOSX.platform/Developer/SDKs/MacOSX10.15.sdk" -arch x86_64 -I/Users/buildslave/jenkins/workspace/lldb-cmake-matrix/llvm-project/lldb/packages/Python/lldbsuite/test/make/../../../../../include -I/Users/buildslave/jenkins/workspace/lldb-cmake-matrix/llvm-project/lldb/test/API/lang/objc/foundation -I/Users/buildslave/jenkins/workspace/lldb-cmake-matrix/llvm-project/lldb/packages/Python/lldbsuite/test/make -include /Users/buildslave/jenkins/workspace/lldb-cmake-matrix/llvm-project/lldb/packages/Python/lldbsuite/test/make/test_common.h -fno-limit-debug-info -MT main.o -MD -MP -MF main.d -c -o main.o /Users/buildslave/jenkins/workspace/lldb-cmake-matrix/llvm-project/lldb/test/API/lang/objc/foundation/main.m make: *** [main.o] Killed: 9

Hide Details

Test Directory: /Users/buildslave/jenkins/workspace/lldb-cmake-matrix/llvm-project/lldb/test/API/lang/objc/foundation ---------------------------------------------------------------------- Ran 2 tests in 77.480s

Hide Details

RESULT: FAILED (1 passes, 0 failures, 1 errors, 0 skipped, 0 expected failures, 0 unexpected successes)

Hide Details

--

Hide Details

******************** Slowest Tests: -------------------------------------------------------------------------- 78.13s: lldb-api :: lang/objc/foundation/TestFoundationDisassembly.py 49.39s: lldb-api :: api/multithreaded/TestMultithreaded.py 42.52s: lldb-api :: lang/objc/exceptions/TestObjCExceptions.py 31.25s: lldb-api :: python_api/target/TestTargetAPI.py 27.86s: lldb-api :: functionalities/load_unload/TestLoadUnload.py 24.86s: lldb-api :: lang/objc/objc-new-syntax/TestObjCNewSyntaxDictionary.py 20.94s: lldb-api :: types/TestLongTypes.py 19.61s: lldb-api :: commands/expression/import-std-module/queue/TestQueueFromStdModule.py 17.50s: lldb-api :: types/TestCharTypeExpr.py 15.66s: lldb-api :: commands/expression/import-std-module/list-dbg-info-content/TestDbgInfoContentListFromStdModule.py 15.35s: lldb-api :: python_api/lldbutil/iter/TestLLDBIterator.py 15.25s: lldb-api :: tools/lldb-server/TestGdbRemote_vCont.py 13.91s: lldb-api :: commands/expression/expr-in-syscall/TestExpressionInSyscall.py 13.77s: lldb-api :: tools/lldb-vscode/attach/TestVSCode_attach.py 13.62s: lldb-api :: functionalities/data-formatter/compactvectors/TestCompactVectors.py 13.50s: lldb-api :: functionalities/mtc/simple/TestMTCSimple.py 13.40s: lldb-api :: tools/lldb-server/TestGdbRemoteProcessInfo.py 13.15s: lldb-api :: tools/lldb-server/TestGdbRemoteExpeditedRegisters.py 13.10s: lldb-api :: commands/expression/persist_objc_pointeetype/TestPersistObjCPointeeType.py 12.96s: lldb-api :: functionalities/thread/backtrace_all/TestBacktraceAll.py

Hide Details

Tests Times: -------------------------------------------------------------------------- [ Range ] :: [ Percentage ] :: [ Count ] -------------------------------------------------------------------------- [75.0s,80.0s) :: [ ] :: [ 1/2288] [70.0s,75.0s) :: [ ] :: [ 0/2288] [65.0s,70.0s) :: [ ] :: [ 0/2288] [60.0s,65.0s) :: [ ] :: [ 0/2288] [55.0s,60.0s) :: [ ] :: [ 0/2288] [50.0s,55.0s) :: [ ] :: [ 1/2288] [45.0s,50.0s) :: [ ] :: [ 0/2288] [40.0s,45.0s) :: [ ] :: [ 1/2288] [35.0s,40.0s) :: [ ] :: [ 0/2288] [30.0s,35.0s) :: [ ] :: [ 1/2288] [25.0s,30.0s) :: [ ] :: [ 2/2288] [20.0s,25.0s) :: [ ] :: [ 2/2288] [15.0s,20.0s) :: [ ] :: [ 4/2288] [10.0s,15.0s) :: [ ] :: [ 20/2288] [ 5.0s,10.0s) :: [* ] :: [ 71/2288] [ 0.0s, 5.0s) :: [************************************** ] :: [2185/2288] -------------------------------------------------------------------------- ******************** Failed Tests (1350): lldb-api :: android/platform/TestDefaultCacheLineSize.py lldb-api :: api/check_public_api_headers/TestPublicAPIHeaders.py lldb-api :: api/command-return-object/TestSBCommandReturnObject.py lldb-api :: api/listeners/TestListener.py lldb-api :: api/log/TestAPILog.py lldb-api :: api/multiple-targets/TestMultipleTargets.py lldb-api :: api/multithreaded/TestMultithreaded.py lldb-api :: arm/breakpoint-it/TestBreakpointIt.py lldb-api :: assert_messages_test/TestAssertMessages.py lldb-api :: benchmarks/continue/TestBenchmarkContinue.py lldb-api :: benchmarks/expression/TestExpressionCmd.py lldb-api :: benchmarks/expression/TestRepeatedExprs.py lldb-api :: benchmarks/startup/TestStartupDelays.py lldb-api :: commands/apropos/basic/TestApropos.py lldb-api :: commands/apropos/with-process/TestAproposWithProcess.py lldb-api :: commands/breakpoint/set/func-regex/TestBreakpointRegexError.py lldb-api :: commands/command/delete/TestCommandDelete.py lldb-api :: commands/command/invalid-args/TestInvalidArgsCommand.py lldb-api :: commands/command/nested_alias/TestNestedAlias.py lldb-api :: commands/command/script/TestCommandScript.py lldb-api :: commands/command/script/import/TestImport.py lldb-api :: commands/command/script_alias/TestCommandScriptAlias.py lldb-api :: commands/disassemble/basic/TestFrameDisassemble.py lldb-api :: commands/expression/anonymous-struct/TestCallUserAnonTypedef.py lldb-api :: commands/expression/argument_passing_restrictions/TestArgumentPassingRestrictions.py lldb-api :: commands/expression/call-function/TestCallStopAndContinue.py lldb-api :: commands/expression/call-function/TestCallUserDefinedFunction.py lldb-api :: commands/expression/call-throws/TestCallThatThrows.py lldb-api :: commands/expression/cast_int_to_anonymous_enum/TestCastIntToAnonymousEnum.py lldb-api :: commands/expression/char/TestExprsChar.py lldb-api :: commands/expression/codegen-crash-typedefdecl-not-in_declcontext/TestCodegenCrashTypedefDeclNotInDeclContext.py lldb-api :: commands/expression/completion-crash-incomplete-record/TestCompletionCrashIncompleteRecord.py lldb-api :: commands/expression/completion-crash-invalid-iterator/TestInvalidIteratorCompletionCrash.py lldb-api :: commands/expression/completion-in-lambda-and-unnamed-class/TestCompletionInLambdaAndUnnamedClass.py lldb-api :: commands/expression/context-object-objc/TestContextObjectObjc.py lldb-api :: commands/expression/context-object/TestContextObject.py lldb-api :: commands/expression/deleting-implicit-copy-constructor/TestDeletingImplicitCopyConstructor.py lldb-api :: commands/expression/diagnostics/TestExprDiagnostics.py lldb-api :: commands/expression/dollar-in-variable/TestDollarInVariable.py lldb-api :: commands/expression/entry-bp/TestExprEntryBP.py lldb-api :: commands/expression/fixits/TestFixIts.py lldb-api :: commands/expression/formatters/TestFormatters.py lldb-api :: commands/expression/function_template_specialization_temp_args/TestFunctionTemplateSpecializationTempArgs.py lldb-api :: commands/expression/ignore-artificial-constructors/TestIgnoreArtificialConstructors.py lldb-api :: commands/expression/import-std-module/array/TestArrayFromStdModule.py lldb-api :: commands/expression/import-std-module/basic/TestImportStdModule.py lldb-api :: commands/expression/import-std-module/conflicts/TestStdModuleWithConflicts.py lldb-api :: commands/expression/import-std-module/deque-basic/TestDequeFromStdModule.py lldb-api :: commands/expression/import-std-module/deque-dbg-info-content/TestDbgInfoContentDequeFromStdModule.py lldb-api :: commands/expression/import-std-module/forward_decl_from_module/TestForwardDeclFromStdModule.py lldb-api :: commands/expression/import-std-module/iterator/TestIteratorFromStdModule.py lldb-api :: commands/expression/import-std-module/list/TestListFromStdModule.py lldb-api :: commands/expression/import-std-module/non-module-type-separation/TestNonModuleTypeSeparation.py lldb-api :: commands/expression/import-std-module/pair/TestPairFromStdModule.py lldb-api :: commands/expression/import-std-module/shared_ptr-dbg-info-content/TestSharedPtrDbgInfoContentFromStdModule.py lldb-api :: commands/expression/import-std-module/shared_ptr/TestSharedPtrFromStdModule.py lldb-api :: commands/expression/import-std-module/stack/TestStackFromStdModule.py lldb-api :: commands/expression/import-std-module/sysroot/TestStdModuleSysroot.py lldb-api :: commands/expression/import-std-module/unique_ptr/TestUniquePtrFromStdModule.py lldb-api :: commands/expression/import-std-module/vector-dbg-info-content/TestDbgInfoContentVectorFromStdModule.py lldb-api :: commands/expression/import-std-module/vector-of-vectors/TestVectorOfVectorsFromStdModule.py lldb-api :: commands/expression/import-std-module/vector/TestVectorFromStdModule.py lldb-api :: commands/expression/import-std-module/weak_ptr/TestWeakPtrFromStdModule.py lldb-api :: commands/expression/import_builtin_fileid/TestImportBuiltinFileID.py lldb-api :: commands/expression/inline-namespace/TestInlineNamespace.py lldb-api :: commands/expression/issue_11588/Test11588.py lldb-api :: commands/expression/macros/TestMacros.py lldb-api :: commands/expression/multiline-completion/TestMultilineCompletion.py lldb-api :: commands/expression/multiline-navigation/TestMultilineNavigation.py lldb-api :: commands/expression/no-deadlock/TestExprDoesntBlock.py lldb-api :: commands/expression/options/TestExprOptions.py lldb-api :: commands/expression/persistent_ptr_update/TestPersistentPtrUpdate.py lldb-api :: commands/expression/persistent_types/TestNestedPersistentTypes.py lldb-api :: commands/expression/persistent_types/TestPersistentTypes.py lldb-api :: commands/expression/po_verbosity/TestPoVerbosity.py lldb-api :: commands/expression/radar_8638051/Test8638051.py lldb-api :: commands/expression/radar_9673664/TestExprHelpExamples.py lldb-api :: commands/expression/rdar42038760/TestScalarURem.py lldb-api :: commands/expression/rdar44436068/Test128BitsInteger.py lldb-api :: commands/expression/regression-access-function-template-in-record/TestRegressionAccessFunctionTemplateInRecord.py lldb-api :: commands/expression/result_numbering/TestResultNumbering.py lldb-api :: commands/expression/save_jit_objects/TestSaveJITObjects.py lldb-api :: commands/expression/scoped_enums/TestScopedEnumType.py lldb-api :: commands/expression/test/TestExprs.py lldb-api :: commands/expression/test/TestExprs2.py lldb-api :: commands/expression/timeout/TestCallWithTimeout.py lldb-api :: commands/expression/two-files/TestObjCTypeQueryFromOtherCompileUnit.py lldb-api :: commands/expression/unwind_expression/TestUnwindExpression.py lldb-api :: commands/expression/vector_of_enums/TestVectorOfEnums.py lldb-api :: commands/expression/weak_symbols/TestWeakSymbols.py lldb-api :: commands/expression/xvalue/TestXValuePrinting.py lldb-api :: commands/frame/diagnose/bad-reference/TestBadReference.py lldb-api :: commands/frame/diagnose/complicated-expression/TestComplicatedExpression.py lldb-api :: commands/frame/diagnose/dereference-argument/TestDiagnoseDereferenceArgument.py lldb-api :: commands/frame/diagnose/dereference-this/TestDiagnoseDereferenceThis.py lldb-api :: commands/frame/diagnose/inheritance/TestDiagnoseInheritance.py lldb-api :: commands/frame/diagnose/local-variable/TestLocalVariable.py lldb-api :: commands/frame/var-scope/TestFrameVariableScope.py lldb-api :: commands/frame/var/TestFrameVar.py lldb-api :: commands/gui/basic/TestGuiBasic.py lldb-api :: commands/gui/basicdebug/TestGuiBasicDebug.py lldb-api :: commands/gui/breakpoints/TestGuiBreakpoints.py lldb-api :: commands/gui/invalid-args/TestInvalidArgsGui.py lldb-api :: commands/help/TestHelp.py lldb-api :: commands/log/basic/TestLogging.py lldb-api :: commands/platform/connect/TestPlatformConnect.py lldb-api :: commands/platform/sdk/TestPlatformSDK.py lldb-api :: commands/process/attach/TestProcessAttach.py lldb-api :: commands/process/attach/attach_denied/TestAttachDenied.py lldb-api :: commands/process/launch-with-shellexpand/TestLaunchWithShellExpand.py lldb-api :: commands/process/launch/TestProcessLaunch.py lldb-api :: commands/quit/TestQuit.py lldb-api :: commands/register/register/aarch64_sve_registers/rw_access_dynamic_resize/TestSVEThreadedDynamic.py lldb-api :: commands/register/register/intel_xtended_registers/TestMPXRegisters.py lldb-api :: commands/register/register/register_command/TestRegisters.py lldb-api :: commands/reproducer/invalid-args/TestInvalidArgsReproducer.py lldb-api :: commands/session/history/TestSessionHistory.py lldb-api :: commands/settings/TestSettings.py lldb-api :: commands/settings/use_source_cache/TestUseSourceCache.py lldb-api :: commands/source/info/TestSourceInfo.py lldb-api :: commands/target/auto-install-main-executable/TestAutoInstallMainExecutable.py lldb-api :: commands/target/basic/TestTargetCommand.py lldb-api :: commands/target/create-deps/TestTargetCreateDeps.py lldb-api :: commands/target/create-no-such-arch/TestNoSuchArch.py lldb-api :: commands/target/dump-symtab-demangle/TestDumpSymtabDemangle.py lldb-api :: commands/target/stop-hook/delete/TestTargetStopHookDelete.py lldb-api :: commands/target/stop-hook/disable/TestTargetStopHookDisable.py lldb-api :: commands/target/stop-hook/enable/TestTargetStopHookEnable.py lldb-api :: commands/target/stop-hooks/TestStopHookScripted.py lldb-api :: commands/thread/select/TestThreadSelect.py lldb-api :: commands/trace/TestTraceDumpInstructions.py lldb-api :: commands/trace/TestTraceLoad.py lldb-api :: commands/trace/TestTraceStartStop.py lldb-api :: commands/trace/multiple-threads/TestTraceStartStopMultipleThreads.py lldb-api :: commands/watchpoints/hello_watchlocation/TestWatchLocation.py lldb-api :: commands/watchpoints/hello_watchpoint/TestMyFirstWatchpoint.py lldb-api :: commands/watchpoints/multiple_threads/TestWatchpointMultipleThreads.py lldb-api :: commands/watchpoints/variable_out_of_scope/TestWatchedVarHitWhenInScope.py lldb-api :: commands/watchpoints/watchpoint_commands/command/TestWatchpointCommandLLDB.py lldb-api :: commands/watchpoints/watchpoint_count/TestWatchpointCount.py lldb-api :: commands/watchpoints/watchpoint_disable/TestWatchpointDisable.py lldb-api :: commands/watchpoints/watchpoint_events/TestWatchpointEvents.py lldb-api :: commands/watchpoints/watchpoint_set_command/TestWatchLocationWithWatchSet.py lldb-api :: functionalities/abbreviation/TestAbbreviations.py lldb-api :: functionalities/abbreviation/TestCommonShortSpellings.py lldb-api :: functionalities/archives/TestBSDArchives.py lldb-api :: functionalities/asan/TestMemoryHistory.py lldb-api :: functionalities/asan/TestReportData.py lldb-api :: functionalities/avoids-fd-leak/TestFdLeak.py lldb-api :: functionalities/breakpoint/address_breakpoints/TestAddressBreakpoints.py lldb-api :: functionalities/breakpoint/address_breakpoints/TestBadAddressBreakpoints.py lldb-api :: functionalities/breakpoint/auto_continue/TestBreakpointAutoContinue.py lldb-api :: functionalities/breakpoint/breakpoint_by_line_and_column/TestBreakpointByLineAndColumn.py lldb-api :: functionalities/breakpoint/breakpoint_conditions/TestBreakpointConditions.py lldb-api :: functionalities/breakpoint/breakpoint_ignore_count/TestBreakpointIgnoreCount.py lldb-api :: functionalities/breakpoint/breakpoint_in_delayslot/TestAvoidBreakpointInDelaySlot.py lldb-api :: functionalities/breakpoint/breakpoint_language/TestBreakpointLanguage.py lldb-api :: functionalities/breakpoint/breakpoint_locations/TestBreakpointLocations.py lldb-api :: functionalities/breakpoint/breakpoint_options/TestBreakpointOptions.py lldb-api :: functionalities/breakpoint/breakpoint_set_restart/TestBreakpointSetRestart.py lldb-api :: functionalities/breakpoint/consecutive_breakpoints/TestConsecutiveBreakpoints.py lldb-api :: functionalities/breakpoint/cpp/TestCPPBreakpointLocations.py lldb-api :: functionalities/breakpoint/cpp_exception/TestCPPExceptionBreakpoint.py lldb-api :: functionalities/breakpoint/debugbreak/TestDebugBreak.py lldb-api :: functionalities/breakpoint/global_constructor/TestBreakpointInGlobalConstructor.py lldb-api :: functionalities/breakpoint/hardware_breakpoints/hardware_breakpoint_on_multiple_threads/TestHWBreakMultiThread.py lldb-api :: functionalities/breakpoint/hardware_breakpoints/require_hw_breakpoints/TestRequireHWBreakpoints.py lldb-api :: functionalities/breakpoint/hardware_breakpoints/write_memory_with_hw_breakpoint/TestWriteMemoryWithHWBreakpoint.py lldb-api :: functionalities/breakpoint/inlined_breakpoints/TestInlinedBreakpoints.py lldb-api :: functionalities/breakpoint/objc/TestObjCBreakpoints.py lldb-api :: functionalities/breakpoint/scripted_bkpt/TestScriptedResolver.py lldb-api :: functionalities/breakpoint/source_regexp/TestSourceRegexBreakpoints.py lldb-api :: functionalities/completion/TestCompletion.py lldb-api :: functionalities/conditional_break/TestConditionalBreak.py lldb-api :: functionalities/darwin_log/basic/TestDarwinLogBasic.py lldb-api :: functionalities/darwin_log/filter/exact_match/activity/TestDarwinLogFilterMatchActivity.py lldb-api :: functionalities/darwin_log/filter/exact_match/message/TestDarwinLogFilterMatchMessage.py lldb-api :: functionalities/darwin_log/filter/exact_match/subsystem/TestDarwinLogFilterMatchSubsystem.py lldb-api :: functionalities/darwin_log/filter/regex/activity-chain/TestDarwinLogFilterRegexActivityChain.py lldb-api :: functionalities/darwin_log/filter/regex/message/TestDarwinLogFilterRegexMessage.py lldb-api :: functionalities/darwin_log/format/TestDarwinLogMessageFormat.py lldb-api :: functionalities/darwin_log/source/info/TestDarwinLogSourceInfo.py lldb-api :: functionalities/data-formatter/array_typedef/TestArrayTypedef.py lldb-api :: functionalities/data-formatter/builtin-formats/TestBuiltinFormats.py lldb-api :: functionalities/data-formatter/cstring-utf8-summary/TestCstringUnicode.py lldb-api :: functionalities/data-formatter/data-formatter-advanced/TestDataFormatterAdv.py lldb-api :: functionalities/data-formatter/data-formatter-caching/TestDataFormatterCaching.py lldb-api :: functionalities/data-formatter/data-formatter-cpp/TestDataFormatterCpp.py lldb-api :: functionalities/data-formatter/data-formatter-disabling/TestDataFormatterDisabling.py lldb-api :: functionalities/data-formatter/data-formatter-objc/TestDataFormatterObjCCF.py lldb-api :: functionalities/data-formatter/data-formatter-objc/TestDataFormatterObjCExpr.py lldb-api :: functionalities/data-formatter/data-formatter-objc/TestDataFormatterObjCKVO.py lldb-api :: functionalities/data-formatter/data-formatter-objc/TestDataFormatterObjCNSContainer.py lldb-api :: functionalities/data-formatter/data-formatter-objc/TestDataFormatterObjCNSData.py lldb-api :: functionalities/data-formatter/data-formatter-objc/TestDataFormatterObjCNSDate.py lldb-api :: functionalities/data-formatter/data-formatter-objc/TestDataFormatterObjCNSError.py lldb-api :: functionalities/data-formatter/data-formatter-objc/cmtime/TestDataFormatterCMTime.py lldb-api :: functionalities/data-formatter/data-formatter-objc/nsindexpath/TestDataFormatterNSIndexPath.py lldb-api :: functionalities/data-formatter/data-formatter-objc/nsstring/TestDataFormatterNSString.py lldb-api :: functionalities/data-formatter/data-formatter-proper-plurals/TestFormattersOneIsSingular.py lldb-api :: functionalities/data-formatter/data-formatter-ptr-to-array/TestPtrToArrayFormatting.py lldb-api :: functionalities/data-formatter/data-formatter-script/TestDataFormatterScript.py lldb-api :: functionalities/data-formatter/data-formatter-skip-summary/TestDataFormatterSkipSummary.py lldb-api :: functionalities/data-formatter/data-formatter-smart-array/TestDataFormatterSmartArray.py lldb-api :: functionalities/data-formatter/data-formatter-stl/libcxx/bitset/TestDataFormatterLibcxxBitset.py lldb-api :: functionalities/data-formatter/data-formatter-stl/libcxx/deque/TestDataFormatterLibcxxDeque.py lldb-api :: functionalities/data-formatter/data-formatter-stl/libcxx/forward_list/TestDataFormatterLibcxxForwardList.py lldb-api :: functionalities/data-formatter/data-formatter-stl/libcxx/iterator/TestDataFormatterLibccIterator.py lldb-api :: functionalities/data-formatter/data-formatter-stl/libcxx/list/loop/TestDataFormatterLibcxxListLoop.py lldb-api :: functionalities/data-formatter/data-formatter-stl/libcxx/map/TestDataFormatterLibccMap.py lldb-api :: functionalities/data-formatter/data-formatter-stl/libcxx/multimap/TestDataFormatterLibccMultiMap.py lldb-api :: functionalities/data-formatter/data-formatter-stl/libcxx/multiset/TestDataFormatterLibcxxMultiSet.py lldb-api :: functionalities/data-formatter/data-formatter-stl/libcxx/shared_ptr/TestDataFormatterLibcxxSharedPtr.py lldb-api :: functionalities/data-formatter/data-formatter-stl/libcxx/tuple/TestDataFormatterLibcxxTuple.py lldb-api :: functionalities/data-formatter/data-formatter-stl/libcxx/unordered/TestDataFormatterUnordered.py lldb-api :: functionalities/data-formatter/data-formatter-stl/libcxx/vbool/TestDataFormatterLibcxxVBool.py lldb-api :: functionalities/data-formatter/data-formatter-stl/libcxx/vector/TestDataFormatterLibcxxVector.py lldb-api :: functionalities/data-formatter/data-formatter-stl/libstdcpp/iterator/TestDataFormatterStdIterator.py lldb-api :: functionalities/data-formatter/data-formatter-stl/libstdcpp/list/TestDataFormatterStdList.py lldb-api :: functionalities/data-formatter/data-formatter-stl/libstdcpp/smart_ptr/TestDataFormatterStdSmartPtr.py lldb-api :: functionalities/data-formatter/data-formatter-stl/libstdcpp/string/TestDataFormatterStdString.py lldb-api :: functionalities/data-formatter/data-formatter-stl/libstdcpp/unique_ptr/TestDataFormatterStdUniquePtr.py lldb-api :: functionalities/data-formatter/data-formatter-stl/libstdcpp/unique_ptr/invalid/TestDataFormatterInvalidStdUniquePtr.py lldb-api :: functionalities/data-formatter/data-formatter-synthtype/TestDataFormatterSynthType.py lldb-api :: functionalities/data-formatter/data-formatter-synthval/TestDataFormatterSynthVal.py lldb-api :: functionalities/data-formatter/dump_dynamic/TestDumpDynamic.py lldb-api :: functionalities/data-formatter/frameformat_smallstruct/TestFrameFormatSmallStruct.py lldb-api :: functionalities/data-formatter/hexcaps/TestDataFormatterHexCaps.py lldb-api :: functionalities/data-formatter/nsarraysynth/TestNSArraySynthetic.py lldb-api :: functionalities/data-formatter/refpointer-recursion/TestDataFormatterRefPtrRecursion.py lldb-api :: functionalities/data-formatter/setvaluefromcstring/TestSetValueFromCString.py lldb-api :: functionalities/data-formatter/synthupdate/TestSyntheticFilterRecompute.py lldb-api :: functionalities/data-formatter/type_summary_list_arg/TestTypeSummaryListArg.py lldb-api :: functionalities/data-formatter/type_summary_list_script/TestTypeSummaryListScript.py lldb-api :: functionalities/data-formatter/user-format-vs-summary/TestUserFormatVsSummary.py lldb-api :: functionalities/data-formatter/var-in-aggregate-misuse/TestVarInAggregateMisuse.py lldb-api :: functionalities/data-formatter/varscript_formatting/TestDataFormatterVarScriptFormatting.py lldb-api :: functionalities/data-formatter/vector-types/TestVectorTypesFormatting.py lldb-api :: functionalities/deleted-executable/TestDeletedExecutable.py lldb-api :: functionalities/dlopen_other_executable/TestDlopenOtherExecutable.py lldb-api :: functionalities/dynamic_value_child_count/TestDynamicValueChildCount.py lldb-api :: functionalities/gdb_remote_client/TestArmRegisterDefinition.py lldb-api :: functionalities/gdb_remote_client/TestGDBRemoteClient.py lldb-api :: functionalities/gdb_remote_client/TestGDBRemoteDiskFileCompletion.py lldb-api :: functionalities/gdb_remote_client/TestGDBRemoteLoad.py lldb-api :: functionalities/gdb_remote_client/TestIOSSimulator.py lldb-api :: functionalities/gdb_remote_client/TestJLink6Armv7RegisterDefinition.py lldb-api :: functionalities/gdb_remote_client/TestMultiprocess.py lldb-api :: functionalities/gdb_remote_client/TestNestedRegDefinitions.py lldb-api :: functionalities/gdb_remote_client/TestNoGPacketSupported.py lldb-api :: functionalities/gdb_remote_client/TestPartialGPacket.py lldb-api :: functionalities/gdb_remote_client/TestPlatformClient.py lldb-api :: functionalities/gdb_remote_client/TestProcessConnect.py lldb-api :: functionalities/gdb_remote_client/TestQemuAArch64TargetXml.py lldb-api :: functionalities/gdb_remote_client/TestTargetXMLArch.py lldb-api :: functionalities/gdb_remote_client/TestThreadSelectionBug.py lldb-api :: functionalities/gdb_remote_client/TestWasm.py lldb-api :: functionalities/history/TestHistoryRecall.py lldb-api :: functionalities/inferior-assert/TestInferiorAssert.py lldb-api :: functionalities/inferior-changed/TestInferiorChanged.py lldb-api :: functionalities/inferior-crashing/TestInferiorCrashing.py lldb-api :: functionalities/inferior-crashing/TestInferiorCrashingStep.py lldb-api :: functionalities/inferior-crashing/recursive-inferior/TestRecursiveInferior.py lldb-api :: functionalities/inferior-crashing/recursive-inferior/TestRecursiveInferiorStep.py lldb-api :: functionalities/inline-stepping/TestInlineStepping.py lldb-api :: functionalities/jitloader_gdb/TestJITLoaderGDB.py lldb-api :: functionalities/limit-debug-info/TestLimitDebugInfo.py lldb-api :: functionalities/load_lazy/TestLoadUsingLazyBind.py lldb-api :: functionalities/memory-region/TestMemoryRegion.py lldb-api :: functionalities/memory/cache/TestMemoryCache.py lldb-api :: functionalities/memory/find/TestMemoryFind.py lldb-api :: functionalities/memory/read/TestMemoryRead.py lldb-api :: functionalities/param_entry_vals/basic_entry_values/TestBasicEntryValues.py lldb-api :: functionalities/paths/TestPaths.py lldb-api :: functionalities/plugins/command_plugin/TestPluginCommands.py lldb-api :: functionalities/plugins/python_os_plugin/TestPythonOSPlugin.py lldb-api :: functionalities/plugins/python_os_plugin/stepping_plugin_threads/TestOSPluginStepping.py lldb-api :: functionalities/pointer_num_children/TestPointerNumChildren.py lldb-api :: functionalities/postmortem/elf-core/TestLinuxCore.py lldb-api :: functionalities/postmortem/elf-core/gcore/TestGCore.py lldb-api :: functionalities/postmortem/mach-core/TestMachCore.py lldb-api :: functionalities/postmortem/minidump/TestMiniDump.py lldb-api :: functionalities/postmortem/netbsd-core/TestNetBSDCore.py lldb-api :: functionalities/postmortem/wow64_minidump/TestWow64MiniDump.py lldb-api :: functionalities/pre_run_dylibs/TestPreRunDylibs.py lldb-api :: functionalities/process_crash_info/TestProcessCrashInfo.py lldb-api :: functionalities/reproducers/fs-case-sensitivity/TestReproducerFSCaseSensitivity.py lldb-api :: functionalities/return-value/TestReturnValue.py lldb-api :: functionalities/signal/TestSendSignal.py lldb-api :: functionalities/signal/handle-segv/TestHandleSegv.py lldb-api :: functionalities/source-map/TestTargetSourceMap.py lldb-api :: functionalities/step-avoids-no-debug/TestStepNoDebug.py lldb-api :: functionalities/step_scripted/TestStepScripted.py lldb-api :: functionalities/tail_call_frames/ambiguous_tail_call_seq1/TestAmbiguousTailCallSeq1.py lldb-api :: functionalities/tail_call_frames/ambiguous_tail_call_seq2/TestAmbiguousTailCallSeq2.py lldb-api :: functionalities/tail_call_frames/cross_dso/TestCrossDSOTailCalls.py lldb-api :: functionalities/tail_call_frames/cross_object/TestCrossObjectTailCalls.py lldb-api :: functionalities/tail_call_frames/disambiguate_call_site/TestDisambiguateCallSite.py lldb-api :: functionalities/tail_call_frames/disambiguate_tail_call_seq/TestDisambiguateTailCallSeq.py lldb-api :: functionalities/tail_call_frames/inlining_and_tail_calls/TestInliningAndTailCalls.py lldb-api :: functionalities/tail_call_frames/sbapi_support/TestTailCallFrameSBAPI.py lldb-api :: functionalities/tail_call_frames/thread_step_out_message/TestArtificialFrameStepOutMessage.py lldb-api :: functionalities/tail_call_frames/thread_step_out_or_return/TestSteppingOutWithArtificialFrames.py lldb-api :: functionalities/tail_call_frames/unambiguous_sequence/TestUnambiguousTailCalls.py lldb-api :: functionalities/target_var/no_vars/TestTargetVarNoVars.py lldb-api :: functionalities/testid/TestTestId.py lldb-api :: functionalities/thread/backtrace_limit/TestBacktraceLimit.py lldb-api :: functionalities/thread/break_after_join/TestBreakAfterJoin.py lldb-api :: functionalities/thread/concurrent_events/TestConcurrentBreakpointDelayBreakpointOneSignal.py lldb-api :: functionalities/thread/concurrent_events/TestConcurrentBreakpointOneDelayBreakpointThreads.py lldb-api :: functionalities/thread/concurrent_events/TestConcurrentBreakpointsDelayedBreakpointOneWatchpoint.py lldb-api :: functionalities/thread/concurrent_events/TestConcurrentCrashWithBreak.py lldb-api :: functionalities/thread/concurrent_events/TestConcurrentCrashWithSignal.py lldb-api :: functionalities/thread/concurrent_events/TestConcurrentCrashWithWatchpointBreakpointSignal.py lldb-api :: functionalities/thread/concurrent_events/TestConcurrentDelaySignalBreak.py lldb-api :: functionalities/thread/concurrent_events/TestConcurrentDelaySignalWatch.py lldb-api :: functionalities/thread/concurrent_events/TestConcurrentDelayWatchBreak.py lldb-api :: functionalities/thread/concurrent_events/TestConcurrentDelayedCrashWithBreakpointSignal.py lldb-api :: functionalities/thread/concurrent_events/TestConcurrentDelayedCrashWithBreakpointWatchpoint.py lldb-api :: functionalities/thread/concurrent_events/TestConcurrentManyBreakpoints.py lldb-api :: functionalities/thread/concurrent_events/TestConcurrentManyCrash.py lldb-api :: functionalities/thread/concurrent_events/TestConcurrentManyWatchpoints.py lldb-api :: functionalities/thread/concurrent_events/TestConcurrentNWatchNBreak.py lldb-api :: functionalities/thread/concurrent_events/TestConcurrentSignalBreak.py lldb-api :: functionalities/thread/concurrent_events/TestConcurrentSignalNWatchNBreak.py lldb-api :: functionalities/thread/concurrent_events/TestConcurrentTwoBreakpointThreads.py lldb-api :: functionalities/thread/concurrent_events/TestConcurrentTwoBreakpointsOneSignal.py lldb-api :: functionalities/thread/concurrent_events/TestConcurrentTwoBreakpointsOneWatchpoint.py lldb-api :: functionalities/thread/concurrent_events/TestConcurrentTwoWatchpointThreads.py lldb-api :: functionalities/thread/concurrent_events/TestConcurrentTwoWatchpointsOneBreakpoint.py lldb-api :: functionalities/thread/concurrent_events/TestConcurrentTwoWatchpointsOneDelayBreakpoint.py lldb-api :: functionalities/thread/concurrent_events/TestConcurrentTwoWatchpointsOneSignal.py lldb-api :: functionalities/thread/concurrent_events/TestConcurrentWatchBreak.py lldb-api :: functionalities/thread/concurrent_events/TestConcurrentWatchBreakDelay.py lldb-api :: functionalities/thread/concurrent_events/TestConcurrentWatchpointDelayWatchpointOneBreakpoint.py lldb-api :: functionalities/thread/concurrent_events/TestConcurrentWatchpointWithDelayWatchpointThreads.py lldb-api :: functionalities/thread/crash_during_step/TestCrashDuringStep.py lldb-api :: functionalities/thread/create_after_attach/TestCreateAfterAttach.py lldb-api :: functionalities/thread/create_during_step/TestCreateDuringStep.py lldb-api :: functionalities/thread/exit_during_expression/TestExitDuringExpression.py lldb-api :: functionalities/thread/exit_during_step/TestExitDuringStep.py lldb-api :: functionalities/thread/ignore_suspended/TestIgnoreSuspendedThread.py lldb-api :: functionalities/thread/jump/TestThreadJump.py lldb-api :: functionalities/thread/num_threads/TestNumThreads.py lldb-api :: functionalities/thread/state/TestThreadStates.py lldb-api :: functionalities/thread/step_out/TestThreadStepOut.py lldb-api :: functionalities/thread/step_until/TestStepUntil.py lldb-api :: functionalities/thread/thread_specific_break/TestThreadSpecificBreakpoint.py lldb-api :: functionalities/thread/thread_specific_break_plus_condition/TestThreadSpecificBpPlusCondition.py lldb-api :: functionalities/tsan/basic/TestTsanBasic.py lldb-api :: functionalities/tsan/cpp_global_location/TestTsanCPPGlobalLocation.py lldb-api :: functionalities/tsan/global_location/TestTsanGlobalLocation.py lldb-api :: functionalities/tsan/thread_leak/TestTsanThreadLeak.py lldb-api :: functionalities/tty/TestTerminal.py lldb-api :: functionalities/type_get_module/TestTypeGetModule.py lldb-api :: functionalities/type_lookup/TestTypeLookup.py lldb-api :: functionalities/ubsan/basic/TestUbsanBasic.py lldb-api :: functionalities/ubsan/user-expression/TestUbsanUserExpression.py lldb-api :: functionalities/unwind/ehframe/TestEhFrameUnwind.py lldb-api :: functionalities/unwind/standard/TestStandardUnwind.py lldb-api :: functionalities/unwind/zeroth_frame/TestZerothFrame.py lldb-api :: functionalities/var_path/TestVarPath.py lldb-api :: functionalities/wrong_commands/TestWrongCommands.py lldb-api :: iohandler/autosuggestion/TestAutosuggestion.py lldb-api :: iohandler/completion/TestIOHandlerCompletion.py lldb-api :: iohandler/resize/TestIOHandlerResize.py lldb-api :: iohandler/resize/TestIOHandlerResizeNoEditline.py lldb-api :: lang/c/anonymous/TestAnonymous.py lldb-api :: lang/c/array_types/TestArrayTypes.py lldb-api :: lang/c/blocks/TestBlocks.py lldb-api :: lang/c/complex/TestComplexC99.py lldb-api :: lang/c/complex_int/TestComplexInt.py lldb-api :: lang/c/conflicting-symbol/TestConflictingSymbol.py lldb-api :: lang/c/const_variables/TestConstVariables.py lldb-api :: lang/c/cpp_keyword_identifiers/TestCppKeywordsAsCIdentifiers.py lldb-api :: lang/c/enum_types/TestEnumTypes.py lldb-api :: lang/c/function_types/TestFunctionTypes.py lldb-api :: lang/c/global_variables/TestGlobalVariables.py lldb-api :: lang/c/local_types/TestUseClosestType.py lldb-api :: lang/c/local_variables/TestLocalVariables.py lldb-api :: lang/c/modules/TestCModules.py lldb-api :: lang/c/record_decl_in_expr/TestRecordDeclInExpr.py lldb-api :: lang/c/register_variables/TestRegisterVariables.py lldb-api :: lang/c/set_values/TestSetValues.py lldb-api :: lang/c/step-target/TestStepTarget.py lldb-api :: lang/c/step_over_no_deadlock/TestStepOverDoesntBlock.py lldb-api :: lang/c/strings/TestCStrings.py lldb-api :: lang/c/tls_globals/TestTlsGlobals.py lldb-api :: lang/c/typedef/Testtypedef.py lldb-api :: lang/c/unicode/TestUnicodeSymbols.py lldb-api :: lang/c/vla/TestVLA.py lldb-api :: lang/cpp/accelerator-table/TestCPPAccelerator.py lldb-api :: lang/cpp/alignas_base_class/TestAlignAsBaseClass.py lldb-api :: lang/cpp/bool/TestCPPBool.py lldb-api :: lang/cpp/call-function/TestCallCPPFunction.py lldb-api :: lang/cpp/chained-calls/TestCppChainedCalls.py lldb-api :: lang/cpp/char1632_t/TestChar1632T.py lldb-api :: lang/cpp/char8_t/TestCxxChar8_t.py lldb-api :: lang/cpp/class-template-non-type-parameter-pack/TestClassTemplateNonTypeParameterPack.py lldb-api :: lang/cpp/class_static/TestStaticVariables.py lldb-api :: lang/cpp/class_types/TestClassTypes.py lldb-api :: lang/cpp/class_types/TestClassTypesDisassembly.py lldb-api :: lang/cpp/const_this/TestConstThis.py lldb-api :: lang/cpp/constructors/TestCppConstructors.py lldb-api :: lang/cpp/covariant-return-types/TestCovariantReturnTypes.py lldb-api :: lang/cpp/diamond/TestDiamond.py lldb-api :: lang/cpp/dynamic-value-same-basename/TestDynamicValueSameBase.py lldb-api :: lang/cpp/dynamic-value/TestCppValueCast.py lldb-api :: lang/cpp/elaborated-types/TestElaboratedTypes.py lldb-api :: lang/cpp/enum_types/TestCPP11EnumTypes.py lldb-api :: lang/cpp/exceptions/TestCPPExceptionBreakpoints.py lldb-api :: lang/cpp/function-qualifiers/TestCppFunctionQualifiers.py lldb-api :: lang/cpp/function-template-parameter-pack/TestFunctionTemplateParameterPack.py lldb-api :: lang/cpp/function_refs/TestFunctionRefs.py lldb-api :: lang/cpp/global_operators/TestCppGlobalOperators.py lldb-api :: lang/cpp/global_variables/TestCPPGlobalVariables.py lldb-api :: lang/cpp/gmodules-templates/TestGModules.py lldb-api :: lang/cpp/gmodules/TestWithModuleDebugging.py lldb-api :: lang/cpp/incomplete-types/TestCppIncompleteTypes.py lldb-api :: lang/cpp/limit-debug-info/TestWithLimitDebugInfo.py lldb-api :: lang/cpp/llvm-style/TestLLVMStyle.py lldb-api :: lang/cpp/modules-import/TestCXXModulesImport.py lldb-api :: lang/cpp/multiple-inheritance/TestCppMultipleInheritance.py lldb-api :: lang/cpp/namespace/TestNamespaceLookup.py lldb-api :: lang/cpp/namespace_conflicts/TestNamespaceConflicts.py lldb-api :: lang/cpp/operators/TestCppOperators.py lldb-api :: lang/cpp/overloaded-functions/TestOverloadedFunctions.py lldb-api :: lang/cpp/printf/TestPrintf.py lldb-api :: lang/cpp/rvalue-references/TestRvalueReferences.py lldb-api :: lang/cpp/scope/TestCppScope.py lldb-api :: lang/cpp/signed_types/TestSignedTypes.py lldb-api :: lang/cpp/static_member_type_depending_on_parent_size/TestStaticMemberTypeDependingOnParentSize.py lldb-api :: lang/cpp/static_members/TestCPPStaticMembers.py lldb-api :: lang/cpp/std-function-step-into-callable/TestStdFunctionStepIntoCallable.py lldb-api :: lang/cpp/stl/TestStdCXXDisassembly.py lldb-api :: lang/cpp/subst_template_type_param/TestSubstTemplateTypeParam.py lldb-api :: lang/cpp/template-arguments/TestCppTemplateArguments.py lldb-api :: lang/cpp/template-specialization-type/TestTemplateSpecializationType.py lldb-api :: lang/cpp/template/TestTemplateArgs.py lldb-api :: lang/cpp/type_lookup/TestCppTypeLookup.py lldb-api :: lang/cpp/typedef/TestCppTypedef.py lldb-api :: lang/cpp/typeof/TestTypeOfDeclTypeExpr.py lldb-api :: lang/cpp/unicode-literals/TestUnicodeLiterals.py lldb-api :: lang/cpp/virtual-functions/TestCppVirtualFunctions.py lldb-api :: lang/cpp/virtual-overload/TestVirtualOverload.py lldb-api :: lang/cpp/wchar_t/TestCxxWCharT.py lldb-api :: lang/mixed/TestMixedLanguages.py lldb-api :: lang/objc/bitfield_ivars/TestBitfieldIvars.py lldb-api :: lang/objc/conflicting-definition/TestConflictingDefinition.py lldb-api :: lang/objc/cpp_keyword_identifiers/TestCppKeywordsAsObjCIdentifiers.py lldb-api :: lang/objc/direct-dispatch-step/TestObjCDirectDispatchStepping.py lldb-api :: lang/objc/forward-decl/TestForwardDecl.py lldb-api :: lang/objc/foundation/TestConstStrings.py lldb-api :: lang/objc/foundation/TestFoundationDisassembly.py lldb-api :: lang/objc/foundation/TestObjCMethods.py lldb-api :: lang/objc/foundation/TestObjCMethods2.py lldb-api :: lang/objc/foundation/TestObjCMethodsNSError.py lldb-api :: lang/objc/foundation/TestObjCMethodsString.py lldb-api :: lang/objc/foundation/TestObjectDescriptionAPI.py lldb-api :: lang/objc/foundation/TestRuntimeTypes.py lldb-api :: lang/objc/global_ptrs/TestGlobalObjects.py lldb-api :: lang/objc/hidden-ivars/TestHiddenIvars.py lldb-api :: lang/objc/ivar-IMP/TestObjCiVarIMP.py lldb-api :: lang/objc/modules-app-update/TestClangModulesAppUpdate.py lldb-api :: lang/objc/modules-auto-import/TestModulesAutoImport.py lldb-api :: lang/objc/modules-compile-error/TestModulesCompileError.py lldb-api :: lang/objc/modules-non-objc-target/TestObjCModulesNonObjCTarget.py lldb-api :: lang/objc/modules-objc-property/TestModulesObjCProperty.py lldb-api :: lang/objc/modules-update/TestClangModulesUpdate.py lldb-api :: lang/objc/modules/TestObjCModules.py lldb-api :: lang/objc/objc++/TestObjCXX.py lldb-api :: lang/objc/objc-checker/TestObjCCheckers.py lldb-api :: lang/objc/objc-class-method/TestObjCClassMethod.py lldb-api :: lang/objc/objc-dynamic-value/TestObjCDynamicValue.py lldb-api :: lang/objc/objc-foundation-dictionary-empty/TestNSDictionary0.py lldb-api :: lang/objc/objc-ivar-offsets/TestObjCIvarOffsets.py lldb-api :: lang/objc/objc-new-syntax/TestObjCNewSyntaxArray.py lldb-api :: lang/objc/objc-new-syntax/TestObjCNewSyntaxLiteral.py lldb-api :: lang/objc/objc-optimized/TestObjcOptimized.py lldb-api :: lang/objc/objc-property/TestObjCProperty.py lldb-api :: lang/objc/objc-static-method/TestObjCStaticMethod.py lldb-api :: lang/objc/objc-stepping/TestObjCStepping.py lldb-api :: lang/objc/objc-struct-argument/TestObjCStructArgument.py lldb-api :: lang/objc/objc_direct-methods/TestObjCDirectMethods.py lldb-api :: lang/objc/orderedset/TestOrderedSet.py lldb-api :: lang/objc/ptr_refs/TestPtrRefsObjC.py lldb-api :: lang/objc/radar-9691614/TestObjCMethodReturningBOOL.py lldb-api :: lang/objc/rdar-10967107/TestRdar10967107.py lldb-api :: lang/objc/rdar-11355592/TestRdar11355592.py lldb-api :: lang/objc/real-definition/TestRealDefinition.py lldb-api :: lang/objc/self/TestObjCSelf.py lldb-api :: lang/objc/single-entry-dictionary/TestObjCSingleEntryDictionary.py lldb-api :: lang/objc/unicode-string/TestUnicodeString.py lldb-api :: lang/objcxx/class-name-clash/TestNameClash.py lldb-api :: lang/objcxx/hide-runtime-values/TestObjCXXHideRuntimeValues.py lldb-api :: lang/objcxx/objc-builtin-types/TestObjCBuiltinTypes.py lldb-api :: lang/objcxx/objcxx-ivar-vector/TestIvarVector.py lldb-api :: linux/aarch64/mte_memory_region/TestAArch64LinuxMTEMemoryRegion.py lldb-api :: linux/mix-dwo-and-regular-objects/TestMixedDwarfBinary.py lldb-api :: linux/sepdebugsymlink/TestTargetSymbolsSepDebugSymlink.py lldb-api :: macosx/DBGSourcePathRemapping/TestDSYMSourcePathRemapping.py lldb-api :: macosx/add-dsym/TestAddDsymMidExecutionCommand.py lldb-api :: macosx/builtin-debugtrap/TestBuiltinDebugTrap.py lldb-api :: macosx/duplicate-archive-members/TestDuplicateMembers.py lldb-api :: macosx/dyld-trie-symbols/TestDyldTrieSymbols.py lldb-api :: macosx/find-app-in-bundle/TestFindAppInBundle.py lldb-api :: macosx/find-dsym/bundle-with-dot-in-filename/TestBundleWithDotInFilename.py lldb-api :: macosx/find-dsym/deep-bundle/TestDeepBundle.py lldb-api :: macosx/function-starts/TestFunctionStarts.py lldb-api :: macosx/macCatalyst/TestMacCatalyst.py lldb-api :: macosx/macCatalystAppMacOSFramework/TestMacCatalystAppWithMacOSFramework.py lldb-api :: macosx/nslog/TestDarwinNSLogOutput.py lldb-api :: macosx/posix_spawn/TestLaunchProcessPosixSpawn.py lldb-api :: macosx/profile_vrs_detach/TestDetachVrsProfile.py lldb-api :: macosx/queues/TestQueues.py lldb-api :: macosx/simulator/TestSimulatorPlatform.py lldb-api :: macosx/thread_suspend/TestInternalThreadSuspension.py lldb-api :: macosx/universal/TestUniversal.py lldb-api :: macosx/version_zero/TestGetVersionZeroVersion.py lldb-api :: python_api/breakpoint/TestBreakpointAPI.py lldb-api :: python_api/disassemble-raw-data/TestDisassembleRawData.py lldb-api :: python_api/event/TestEvents.py lldb-api :: python_api/file_handle/TestFileHandle.py lldb-api :: python_api/findvalue_duplist/TestSBFrameFindValue.py lldb-api :: python_api/formatters/TestFormattersSBAPI.py lldb-api :: python_api/frame/TestFrames.py lldb-api :: python_api/frame/get-variables/TestGetVariables.py lldb-api :: python_api/frame/inlines/TestInlinedFrame.py lldb-api :: python_api/function_symbol/TestDisasmAPI.py lldb-api :: python_api/function_symbol/TestSymbolAPI.py lldb-api :: python_api/interpreter/TestCommandInterpreterAPI.py lldb-api :: python_api/interpreter/TestRunCommandInterpreterAPI.py lldb-api :: python_api/lldbutil/TestSwigVersion.py lldb-api :: python_api/lldbutil/frame/TestFrameUtils.py lldb-api :: python_api/lldbutil/iter/TestRegistersIterator.py lldb-api :: python_api/lldbutil/process/TestPrintStackTraces.py lldb-api :: python_api/module_section/TestModuleAndSection.py lldb-api :: python_api/name_lookup/TestNameLookup.py lldb-api :: python_api/objc_type/TestObjCType.py lldb-api :: python_api/process/TestProcessAPI.py lldb-api :: python_api/sberror/TestSBError.py lldb-api :: python_api/sblaunchinfo/TestSBLaunchInfo.py lldb-api :: python_api/sbplatform/TestSBPlatform.py lldb-api :: python_api/sbstructureddata/TestStructuredDataAPI.py lldb-api :: python_api/signals/TestSignalsAPI.py lldb-api :: python_api/symbol-context/TestSymbolContext.py lldb-api :: python_api/type/TestTypeList.py lldb-api :: python_api/value/change_values/TestChangeValueAPI.py lldb-api :: python_api/value/empty_class/TestValueAPIEmptyClass.py lldb-api :: python_api/watchpoint/TestWatchpointIter.py lldb-api :: python_api/watchpoint/condition/TestWatchpointConditionAPI.py lldb-api :: python_api/watchpoint/watchlocation/TestSetWatchlocation.py lldb-api :: python_api/watchpoint/watchlocation/TestTargetWatchAddress.py lldb-api :: sample_test/TestSampleInlineTest.py lldb-api :: sample_test/TestSampleTest.py lldb-api :: sanity/TestModuleCacheSanity.py lldb-api :: sanity/TestSettingSkipping.py lldb-api :: source-manager/TestSourceManager.py lldb-api :: terminal/TestEditline.py lldb-api :: test_utils/TestPExpectTest.py lldb-api :: tools/intel-features/intel-pt/test/TestIntelPTSimpleBinary.py lldb-api :: tools/lldb-server/TestAppleSimulatorOSType.py lldb-api :: tools/lldb-server/TestGdbRemoteAttach.py lldb-api :: tools/lldb-server/TestGdbRemoteAttachOrWait.py lldb-api :: tools/lldb-server/TestGdbRemoteAttachWait.py lldb-api :: tools/lldb-server/TestGdbRemoteAuxvSupport.py lldb-api :: tools/lldb-server/TestGdbRemoteCompletion.py lldb-api :: tools/lldb-server/TestGdbRemoteHostInfo.py lldb-api :: tools/lldb-server/TestGdbRemoteKill.py lldb-api :: tools/lldb-server/TestGdbRemoteModuleInfo.py lldb-api :: tools/lldb-server/TestGdbRemoteRegisterState.py lldb-api :: tools/lldb-server/TestGdbRemoteThreadsInStopReply.py lldb-api :: tools/lldb-server/TestGdbRemote_qThreadStopInfo.py lldb-api :: tools/lldb-server/TestGdbRemote_vCont.py lldb-api :: tools/lldb-server/TestLldbGdbServer.py lldb-api :: tools/lldb-server/inferior-crash/TestGdbRemoteAbort.py lldb-api :: tools/lldb-server/inferior-crash/TestGdbRemoteSegFault.py lldb-api :: tools/lldb-server/registers-target-xml-reading/TestGdbRemoteTargetXmlPacket.py lldb-api :: tools/lldb-server/signal-filtering/TestGdbRemote_QPassSignals.py lldb-api :: tools/lldb-server/thread-name/TestGdbRemoteThreadName.py lldb-api :: tools/lldb-server/vCont-threads/TestGdbRemote_vContThreads.py lldb-api :: tools/lldb-vscode/breakpoint-events/TestVSCode_breakpointEvents.py lldb-api :: tools/lldb-vscode/breakpoint/TestVSCode_setBreakpoints.py lldb-api :: tools/lldb-vscode/breakpoint/TestVSCode_setFunctionBreakpoints.py lldb-api :: tools/lldb-vscode/completions/TestVSCode_completions.py lldb-api :: tools/lldb-vscode/coreFile/TestVSCode_coreFile.py lldb-api :: tools/lldb-vscode/disconnect/TestVSCode_disconnect.py lldb-api :: tools/lldb-vscode/evaluate/TestVSCode_evaluate.py lldb-api :: tools/lldb-vscode/launch/TestVSCode_launch.py lldb-api :: tools/lldb-vscode/module/TestVSCode_module.py lldb-api :: tools/lldb-vscode/runInTerminal/TestVSCode_runInTerminal.py lldb-api :: tools/lldb-vscode/stackTrace/TestVSCode_stackTrace.py lldb-api :: tools/lldb-vscode/variables/TestVSCode_variables.py lldb-api :: types/TestDoubleTypes.py lldb-api :: types/TestDoubleTypesExpr.py lldb-api :: types/TestFloatTypes.py lldb-api :: types/TestIntegerType.py lldb-api :: types/TestIntegerTypeExpr.py lldb-api :: types/TestLongTypesExpr.py lldb-api :: types/TestRecursiveTypes.py lldb-api :: types/TestShortTypeExpr.py lldb-shell :: Breakpoint/case-sensitive.test lldb-shell :: Breakpoint/debug_rnglist_basic.test lldb-shell :: Breakpoint/debug_rnglistx_rlex.test lldb-shell :: Breakpoint/dummy-target.test lldb-shell :: Breakpoint/jit-loader_rtdyld_elf.test lldb-shell :: Breakpoint/split-dwarf-5-addrbase.test lldb-shell :: Breakpoint/split-dwarf5-debug-stroffsets.test lldb-shell :: BuildScript/modes.test lldb-shell :: Commands/CommandScriptImmediateOutput/CommandScriptImmediateOutputConsole.test lldb-shell :: Commands/CommandScriptImmediateOutput/CommandScriptImmediateOutputFile.test lldb-shell :: Commands/command-backtrace.test lldb-shell :: Commands/command-breakpoint-col.test lldb-shell :: Commands/command-disassemble.s lldb-shell :: Commands/command-image-lookup.yaml lldb-shell :: Commands/command-script-import.test lldb-shell :: Commands/command-stop-hook-output.test lldb-shell :: Commands/command-target-modules-dump-sections.yaml lldb-shell :: Driver/LocalLLDBInit.test lldb-shell :: Driver/TestCommands.test lldb-shell :: Driver/TestConvenienceVariables.test lldb-shell :: Driver/TestCore.test lldb-shell :: Driver/TestFile.test lldb-shell :: Driver/TestHelp.test lldb-shell :: Driver/TestNoUseColor.test lldb-shell :: Driver/TestProcessAttach.test lldb-shell :: Driver/TestRepl.test lldb-shell :: Driver/TestSingleQuote.test lldb-shell :: Driver/TestTarget.test lldb-shell :: Driver/TestUseColor.test lldb-shell :: Error/assert.test lldb-shell :: ExecControl/StopHook/stop-hook.test lldb-shell :: Expr/TestMultilineExpr.test lldb-shell :: Host/TestCustomShell.test lldb-shell :: Minidump/Windows/find-module.test lldb-shell :: Minidump/disassemble-no-module.yaml lldb-shell :: Minidump/dump-all.test lldb-shell :: Minidump/memory-region.yaml lldb-shell :: ObjectFile/Breakpad/sections.test lldb-shell :: ObjectFile/Breakpad/uuid-matching-mac.test lldb-shell :: ObjectFile/ELF/PT_LOAD-empty.yaml lldb-shell :: ObjectFile/ELF/PT_LOAD-overlap-PT_INTERP.yaml lldb-shell :: ObjectFile/ELF/PT_LOAD-overlap-PT_TLS.yaml lldb-shell :: ObjectFile/ELF/aarch64-relocations.yaml lldb-shell :: ObjectFile/ELF/avr-basic-info.yaml lldb-shell :: ObjectFile/ELF/base-address.yaml lldb-shell :: ObjectFile/ELF/gnu-debuglink.yaml lldb-shell :: ObjectFile/ELF/minidebuginfo-corrupt-xz.yaml lldb-shell :: ObjectFile/ELF/minidebuginfo-find-symbols.yaml lldb-shell :: ObjectFile/ELF/netbsd-core-amd64.test lldb-shell :: ObjectFile/ELF/riscv-arch.yaml lldb-shell :: ObjectFile/ELF/section-overlap.yaml lldb-shell :: ObjectFile/ELF/section-types-edgecases.yaml lldb-shell :: ObjectFile/ELF/section-types.yaml lldb-shell :: ObjectFile/ELF/short-build-id.yaml lldb-shell :: ObjectFile/MachO/lc_build_version_notools.yaml lldb-shell :: ObjectFile/MachO/lc_version_min.yaml lldb-shell :: ObjectFile/PDB/object.test lldb-shell :: ObjectFile/PECOFF/basic-info-arm.yaml lldb-shell :: ObjectFile/PECOFF/basic-info-arm64.yaml lldb-shell :: ObjectFile/PECOFF/invalid-export-table.yaml lldb-shell :: ObjectFile/PECOFF/section-types.yaml lldb-shell :: ObjectFile/PECOFF/sections-names.yaml lldb-shell :: ObjectFile/PECOFF/sections.yaml lldb-shell :: ObjectFile/PECOFF/symbol.yaml lldb-shell :: ObjectFile/wasm/basic.yaml lldb-shell :: ObjectFile/wasm/embedded-debug-sections.yaml lldb-shell :: ObjectFile/wasm/stripped-debug-sections.yaml lldb-shell :: Process/Optimization.test lldb-shell :: Process/TestEnvironment.test lldb-shell :: Process/UnsupportedLanguage.test lldb-shell :: Quit/TestQuitExitCode-30.test lldb-shell :: Quit/TestQuitExitCode30.test lldb-shell :: Quit/TestQuitExitCodeHex0.test lldb-shell :: Quit/TestQuitExitCodeHexA.test lldb-shell :: Quit/TestQuitExitCodeTooManyArgs.test lldb-shell :: Recognizer/assert.test lldb-shell :: Register/x86-64-read.test lldb-shell :: Register/x86-64-ymm-read.test lldb-shell :: Register/x86-multithread-read.test lldb-shell :: Reproducer/Functionalities/TestExpressionEvaluation.test lldb-shell :: Reproducer/Functionalities/TestImageList.test lldb-shell :: Reproducer/Functionalities/TestStepping.test lldb-shell :: Reproducer/Modules/TestModuleCXX.test lldb-shell :: Reproducer/TestCrash.test lldb-shell :: Reproducer/TestDebugSymbols.test lldb-shell :: Reproducer/TestDiscard.test lldb-shell :: Reproducer/TestDriverOptions.test lldb-shell :: Reproducer/TestDump.test lldb-shell :: Reproducer/TestGDBRemoteRepro.test lldb-shell :: Reproducer/TestHomeDir.test lldb-shell :: Reproducer/TestProcessList.test lldb-shell :: Reproducer/TestPythonImport.test lldb-shell :: Reproducer/TestRelativePath.test lldb-shell :: Reproducer/TestSynchronous.test lldb-shell :: Reproducer/TestVerify.test lldb-shell :: Reproducer/TestVersionCheck.test lldb-shell :: Reproducer/TestWorkingDir.test lldb-shell :: ScriptInterpreter/None/import_module.test lldb-shell :: ScriptInterpreter/Python/Crashlog/parser_json.test lldb-shell :: ScriptInterpreter/Python/Crashlog/parser_text.test lldb-shell :: ScriptInterpreter/Python/Crashlog/text.test lldb-shell :: ScriptInterpreter/Python/command_import.test lldb-shell :: ScriptInterpreter/Python/command_relative_import.test lldb-shell :: ScriptInterpreter/Python/eof.test lldb-shell :: ScriptInterpreter/Python/fail_breakpoint_oneline.test lldb-shell :: ScriptInterpreter/Python/sb_address_exception.test lldb-shell :: ScriptInterpreter/Python/scripted_breakpoint.test lldb-shell :: ScriptInterpreter/Python/scripted_breakpoint_lua.test lldb-shell :: Settings/TestDefaultModuleCachePath.test lldb-shell :: Settings/TestDisableColor.test lldb-shell :: Settings/TestFrameFormatColor.test lldb-shell :: Settings/TestFrameFormatMangling.test lldb-shell :: Settings/TestModuleCacheSanity.test lldb-shell :: Settings/TestSettingsSet.test lldb-shell :: Settings/TestStopCommandSourceOnError.test lldb-shell :: Subprocess/fork-follow-parent.test lldb-shell :: SymbolFile/Breakpad/line-table-discontinuous-file-ids.test lldb-shell :: SymbolFile/Breakpad/line-table-edgecases.test lldb-shell :: SymbolFile/Breakpad/line-table-missing-file.test lldb-shell :: SymbolFile/Breakpad/line-table-mixed-path-styles.test lldb-shell :: SymbolFile/Breakpad/line-table.test lldb-shell :: SymbolFile/Breakpad/symtab-macho.test lldb-shell :: SymbolFile/Breakpad/symtab.test lldb-shell :: SymbolFile/Breakpad/unwind-via-stack-cfi.test lldb-shell :: SymbolFile/Breakpad/unwind-via-stack-win.test lldb-shell :: SymbolFile/DWARF/anon_class_w_and_wo_export_symbols.ll lldb-shell :: SymbolFile/DWARF/clang-ast-from-dwarf-objc-property.m lldb-shell :: SymbolFile/DWARF/clang-ast-from-dwarf-unamed-and-anon-structs.cpp lldb-shell :: SymbolFile/DWARF/deterministic-build.cpp lldb-shell :: SymbolFile/DWARF/x86/DW_AT_const_value-bitfields.s lldb-shell :: SymbolFile/DWARF/x86/DW_AT_const_value.s lldb-shell :: SymbolFile/DWARF/x86/DW_AT_data_bit_offset-DW_OP_stack_value.s lldb-shell :: SymbolFile/DWARF/x86/DW_AT_location-DW_AT_const_value.s lldb-shell :: SymbolFile/DWARF/x86/DW_OP_piece-smaller-than-struct.s lldb-shell :: SymbolFile/DWARF/x86/DW_OP_piece-struct.s lldb-shell :: SymbolFile/DWARF/x86/DW_TAG_basic_type_DW_ATE_UTF_nonC.ll lldb-shell :: SymbolFile/DWARF/x86/DW_TAG_variable-invalid_location.s lldb-shell :: SymbolFile/DWARF/x86/apple-index-is-used.cpp lldb-shell :: SymbolFile/DWARF/x86/childless-compile-unit.s lldb-shell :: SymbolFile/DWARF/x86/compilercontext.ll lldb-shell :: SymbolFile/DWARF/x86/debug-types-dwarf5.s lldb-shell :: SymbolFile/DWARF/x86/debug-types-line-tables.s lldb-shell :: SymbolFile/DWARF/x86/debug-types-missing-signature.test lldb-shell :: SymbolFile/DWARF/x86/debug_aranges-empty-section.s lldb-shell :: SymbolFile/DWARF/x86/debug_line-tombstone.s lldb-shell :: SymbolFile/DWARF/x86/debug_loc-aslr.s lldb-shell :: SymbolFile/DWARF/x86/debug_loclists-dwo.s lldb-shell :: SymbolFile/DWARF/x86/debug_ranges-missing-section.s lldb-shell :: SymbolFile/DWARF/x86/debug_rnglists-dwo.s lldb-shell :: SymbolFile/DWARF/x86/debug_rnglists.s lldb-shell :: SymbolFile/DWARF/x86/dwarf5-atomic.s lldb-shell :: SymbolFile/DWARF/x86/dwarf5-debug_line-file-index.s lldb-shell :: SymbolFile/DWARF/x86/dwarf5-implicit-const.s lldb-shell :: SymbolFile/DWARF/x86/dwarf5-split.s lldb-shell :: SymbolFile/DWARF/x86/dwarf5_tu_index_abbrev_offset.s lldb-shell :: SymbolFile/DWARF/x86/dwo-type-in-main-file.s lldb-shell :: SymbolFile/DWARF/x86/dwp-debug-types.s lldb-shell :: SymbolFile/DWARF/x86/find-method-local-struct.cpp lldb-shell :: SymbolFile/DWARF/x86/find-qualified-variable.cpp lldb-shell :: SymbolFile/DWARF/x86/module-ownership.mm lldb-shell :: SymbolFile/DWARF/x86/parallel-indexing-stress.s lldb-shell :: SymbolFile/DWARF/x86/split-dwarf-multiple-cu.ll lldb-shell :: SymbolFile/DWARF/x86/static_scope.s lldb-shell :: SymbolFile/symbol-binding.test lldb-shell :: Unwind/eh-frame-dwarf-unwind.test lldb-shell :: Unwind/thread-step-out-ret-addr-check.test lldb-shell :: lldb-server/TestErrorMessages.test lldb-shell :: lldb-server/TestGdbserverPort.test lldb-unit :: API/./APITests/SBCommandInterpreterTest.MultiWordCommand lldb-unit :: API/./APITests/SBCommandInterpreterTest.SingleWordCommand lldb-unit :: Breakpoint/./LLDBBreakpointTests/BreakpointIDTest.StringIsBreakpointName lldb-unit :: Core/./LLDBCoreTests/CommunicationTest.SynchronizeWhileClosing lldb-unit :: Core/./LLDBCoreTests/MangledTest.EmptyForInvalidName lldb-unit :: Core/./LLDBCoreTests/MangledTest.ResultForBlockInvocation lldb-unit :: Core/./LLDBCoreTests/MangledTest.ResultForValidName lldb-unit :: Core/./LLDBCoreTests/ModuleSpecTest.InvalidInMemoryBuffer lldb-unit :: Core/./LLDBCoreTests/ModuleSpecTest.TestCOFFFile lldb-unit :: Core/./LLDBCoreTests/ModuleSpecTest.TestELFFile lldb-unit :: Core/./LLDBCoreTests/ModuleSpecTest.TestMachOFile lldb-unit :: Core/./LLDBCoreTests/RichManglingContextTest.FromCxxMethodName lldb-unit :: Core/./LLDBCoreTests/RichManglingContextTest.IPDRealloc lldb-unit :: Core/./LLDBCoreTests/StreamCallbackTest.Callback lldb-unit :: Core/./LLDBCoreTests/UniqueCStringMap.NoDefaultConstructor lldb-unit :: DataFormatter/./LLDBFormatterTests/FormatManagerTests.CompatibleLangs lldb-unit :: DataFormatter/./LLDBFormatterTests/StringPrinterTests.SwiftUTF8 lldb-unit :: DataFormatter/./LLDBFormatterTests/TypeMatcherTests.CreatedBySameMatchString lldb-unit :: DataFormatter/./LLDBFormatterTests/TypeMatcherTests.CreatedBySameMatchStringExactNamePrefixes lldb-unit :: DataFormatter/./LLDBFormatterTests/TypeMatcherTests.GetMatchStringRegex lldb-unit :: Editline/./EditlineTests/EditlineTestFixture.EditlineReceivesMultiLineText lldb-unit :: Expression/./ExpressionTests/ClangExpressionDeclMapTest.TestUnknownIdentifierLookup lldb-unit :: Expression/./ExpressionTests/ClangHostTest.ComputeClangResourceDirectory lldb-unit :: Expression/./ExpressionTests/CppModuleConfigurationTest.AmbiguousCLib lldb-unit :: Expression/./ExpressionTests/CppModuleConfigurationTest.IgnoreLibStdCpp lldb-unit :: Expression/./ExpressionTests/CppModuleConfigurationTest.Linux lldb-unit :: Expression/./ExpressionTests/CppModuleConfigurationTest.LinuxLocalLibCpp lldb-unit :: Expression/./ExpressionTests/CppModuleConfigurationTest.MissingLibCpp lldb-unit :: Expression/./ExpressionTests/CppModuleConfigurationTest.MissingUsrInclude lldb-unit :: Expression/./ExpressionTests/CppModuleConfigurationTest.Sysroot lldb-unit :: Expression/./ExpressionTests/CppModuleConfigurationTest.Xcode lldb-unit :: Expression/./ExpressionTests/DWARFExpression.DW_OP_const lldb-unit :: Expression/./ExpressionTests/DWARFExpression.DW_OP_unknown lldb-unit :: Expression/./ExpressionTests/DWARFExpressionMockProcessTest.DW_OP_deref lldb-unit :: Expression/./ExpressionTests/DiagnosticManagerTest.AppendMessageAttachToLastDiag lldb-unit :: Expression/./ExpressionTests/DiagnosticManagerTest.AppendMessageNoDiag lldb-unit :: Expression/./ExpressionTests/DiagnosticManagerTest.AppendMessageSubsequentDiags lldb-unit :: Expression/./ExpressionTests/DiagnosticManagerTest.GetStringBasic lldb-unit :: Expression/./ExpressionTests/DiagnosticManagerTest.GetStringMultipleDiags lldb-unit :: Expression/./ExpressionTests/DiagnosticManagerTest.GetStringPreserveOrder lldb-unit :: Expression/./ExpressionTests/DiagnosticManagerTest.GetStringSeverityLabels lldb-unit :: Expression/./ExpressionTests/DiagnosticManagerTest.PutString lldb-unit :: Expression/./ExpressionTests/DiagnosticManagerTest.PutStringSeverities lldb-unit :: Host/./HostTests/ConnectionFileDescriptorTest.TCPGetURIv6 lldb-unit :: Host/./HostTests/File.GetStreamFromDescriptor lldb-unit :: Host/./HostTests/File.GetWaitableHandleFileno lldb-unit :: Host/./HostTests/FileActionTest.Open lldb-unit :: Host/./HostTests/FileSystemTest.EmptyTest lldb-unit :: Host/./HostTests/FileSystemTest.EnumerateDirectory lldb-unit :: Host/./HostTests/FileSystemTest.FileAndDirectoryComponents lldb-unit :: Host/./HostTests/FileSystemTest.GetPermissions lldb-unit :: Host/./HostTests/FileSystemTest.MakeAbsolute lldb-unit :: Host/./HostTests/FileSystemTest.Readable lldb-unit :: Host/./HostTests/FileSystemTest.Resolve lldb-unit :: Host/./HostTests/HostInfoTest.GetAugmentedArchSpec lldb-unit :: Host/./HostTests/HostInfoTest.GetHostname lldb-unit :: Host/./HostTests/MainLoopTest.ReadObject lldb-unit :: Host/./HostTests/MainLoopTest.Signal lldb-unit :: Host/./HostTests/MainLoopTest.TerminatesImmediately lldb-unit :: Host/./HostTests/NativeProcessProtocolTest.ReadCStringFromMemory lldb-unit :: Host/./HostTests/NativeProcessProtocolTest.ReadCStringFromMemory_CrossPageBoundary lldb-unit :: Host/./HostTests/NativeProcessProtocolTest.ReadCStringFromMemory_MaxSize lldb-unit :: Host/./HostTests/NativeProcessProtocolTest.ReadMemoryWithoutTrap lldb-unit :: Host/./HostTests/NativeProcessProtocolTest.SetBreakpointFailRead lldb-unit :: Host/./HostTests/NativeProcessProtocolTest.SetBreakpointFailVerify lldb-unit :: Host/./HostTests/NativeProcessProtocolTest.SetBreakpointFailWrite lldb-unit :: Host/./HostTests/ProcessLaunchInfoTest.Constructor lldb-unit :: Host/./HostTests/SocketAddressTest.GetAddressInfo lldb-unit :: Host/./HostTests/SocketAddressTest.Set lldb-unit :: Host/./HostTests/SocketTests/SocketTest.DomainGetConnectURI/ipv6 lldb-unit :: Host/./HostTests/SocketTests/SocketTest.DomainListenConnectAccept/ipv4 lldb-unit :: Host/./HostTests/SocketTests/SocketTest.TCPGetAddress/ipv6 lldb-unit :: Host/./HostTests/SocketTests/SocketTest.TCPGetConnectURI/ipv4 lldb-unit :: Host/./HostTests/SocketTests/SocketTest.TCPListen0ConnectAccept/ipv4 lldb-unit :: Host/./HostTests/SocketTests/SocketTest.TCPListen0ConnectAccept/ipv6 lldb-unit :: Host/./HostTests/SocketTests/SocketTest.TCPListen0GetPort/ipv4 lldb-unit :: Host/./HostTests/SocketTests/SocketTest.UDPConnect/ipv4 lldb-unit :: Host/./HostTests/SocketTests/SocketTest.UDPGetConnectURI/ipv4 lldb-unit :: Host/./HostTests/SocketTests/SocketTest.UDPGetConnectURI/ipv6 lldb-unit :: Interpreter/./InterpreterTests/CompletionTest.DirCompletionUsername lldb-unit :: Interpreter/./InterpreterTests/CompletionTest.FileCompletionAbsolute lldb-unit :: Interpreter/./InterpreterTests/OptionArgParserTest.toBoolean lldb-unit :: Interpreter/./InterpreterTests/OptionArgParserTest.toScriptLanguage lldb-unit :: Interpreter/./InterpreterTests/OptionValueArgs.DeepCopy lldb-unit :: Interpreter/./InterpreterTests/OptionValueString.DeepCopy lldb-unit :: Language/CPlusPlus/./LanguageCPlusPlusTests/CPlusPlusLanguage.CPlusPlusNameParser lldb-unit :: Language/CPlusPlus/./LanguageCPlusPlusTests/CPlusPlusLanguage.MethodNameParsing lldb-unit :: Language/Highlighting/./HighlighterTests/HighlighterTest.ClangBraces lldb-unit :: Language/Highlighting/./HighlighterTests/HighlighterTest.ClangCommas lldb-unit :: Language/Highlighting/./HighlighterTests/HighlighterTest.ClangComments lldb-unit :: Language/Highlighting/./HighlighterTests/HighlighterTest.ClangCursorOutOfBounds lldb-unit :: Language/Highlighting/./HighlighterTests/HighlighterTest.ClangCursorPos lldb-unit :: Language/Highlighting/./HighlighterTests/HighlighterTest.ClangCursorPosBeforeOtherToken lldb-unit :: Language/Highlighting/./HighlighterTests/HighlighterTest.ClangCursorPosEndOfLine lldb-unit :: Language/Highlighting/./HighlighterTests/HighlighterTest.ClangEmptyInput lldb-unit :: Language/Highlighting/./HighlighterTests/HighlighterTest.ClangOperators lldb-unit :: Language/Highlighting/./HighlighterTests/HighlighterTest.ClangPPDirectives lldb-unit :: Language/Highlighting/./HighlighterTests/HighlighterTest.ClangPreserveNewLine lldb-unit :: Language/Highlighting/./HighlighterTests/HighlighterTest.ClangScalarLiterals lldb-unit :: Language/Highlighting/./HighlighterTests/HighlighterTest.ClangStringLiterals lldb-unit :: Language/Highlighting/./HighlighterTests/HighlighterTest.ClangTrailingBackslashBeforeNewline lldb-unit :: Language/Highlighting/./HighlighterTests/HighlighterTest.ClangTrailingBackslashWithWhitespace lldb-unit :: Language/Highlighting/./HighlighterTests/HighlighterTest.ClangUnterminatedString lldb-unit :: Language/Highlighting/./HighlighterTests/HighlighterTest.Colons lldb-unit :: Language/Highlighting/./HighlighterTests/HighlighterTest.DefaultHighlighterWithCursorOutOfBounds lldb-unit :: Language/Highlighting/./HighlighterTests/HighlighterTest.FallbackHighlighter lldb-unit :: Language/Highlighting/./HighlighterTests/HighlighterTest.HighlighterSelectionPath lldb-unit :: Language/Highlighting/./HighlighterTests/HighlighterTest.HighlighterSelectionType lldb-unit :: ObjectFile/Breakpad/./ObjectFileBreakpadTests/FileRecord.parse lldb-unit :: ObjectFile/Breakpad/./ObjectFileBreakpadTests/LineRecord.parse lldb-unit :: ObjectFile/Breakpad/./ObjectFileBreakpadTests/ModuleRecord.parse lldb-unit :: ObjectFile/Breakpad/./ObjectFileBreakpadTests/PublicRecord.parse lldb-unit :: ObjectFile/Breakpad/./ObjectFileBreakpadTests/StackCFIRecord.parse lldb-unit :: ObjectFile/Breakpad/./ObjectFileBreakpadTests/StackWinRecord.parse lldb-unit :: ObjectFile/ELF/./ObjectFileELFTests/ObjectFileELFTest.GetModuleSpecifications_EarlySectionHeaders lldb-unit :: ObjectFile/ELF/./ObjectFileELFTests/ObjectFileELFTest.GetSymtab_NoSymEntryPointArmAddressClass lldb-unit :: ObjectFile/ELF/./ObjectFileELFTests/ObjectFileELFTest.GetSymtab_NoSymEntryPointArmThumbAddressClass lldb-unit :: ObjectFile/MachO/./ObjectFileMachOTests/ObjectFileMachOTest.ModuleFromSharedCacheInfo lldb-unit :: ObjectFile/PECOFF/./ObjectFilePECOFFTests/PECallFrameInfoTest.Basic_eh lldb-unit :: Platform/./LLDBPlatformTests/PlatformAppleSimulatorTest.TestHostPlatformToSim lldb-unit :: Platform/./LLDBPlatformTests/PlatformAppleSimulatorTest.TestSimHasSimEnvionament lldb-unit :: Platform/./LLDBPlatformTests/PlatformDarwinTest.FindComponentInPath lldb-unit :: Platform/./LLDBPlatformTests/PlatformDarwinTest.TestParseVersionBuildDir lldb-unit :: Platform/Android/./AdbClientTests/AdbClientTest.CreateByDeviceId lldb-unit :: Platform/Android/./AdbClientTests/AdbClientTest.CreateByDeviceId_ByEnvVar lldb-unit :: Process/./ProcessEventDataTests/ProcessEventDataTest.DoOnRemoval lldb-unit :: Process/./ProcessEventDataTests/ProcessEventDataTest.ShouldStop lldb-unit :: Process/Utility/./ProcessUtilityTests/ProcMapTests/LinuxProcMapsTestFixture.ParseMapRegions/0 lldb-unit :: Process/Utility/./ProcessUtilityTests/ProcMapTests/LinuxProcMapsTestFixture.ParseMapRegions/1 lldb-unit :: Process/Utility/./ProcessUtilityTests/ProcMapTests/LinuxProcMapsTestFixture.ParseMapRegions/3 lldb-unit :: Process/Utility/./ProcessUtilityTests/ProcMapTests/LinuxProcMapsTestFixture.ParseMapRegions/7 lldb-unit :: Process/Utility/./ProcessUtilityTests/ProcSMapTests/LinuxProcSMapsTestFixture.ParseSMapRegions/1 lldb-unit :: Process/Utility/./ProcessUtilityTests/ProcSMapTests/LinuxProcSMapsTestFixture.ParseSMapRegions/2 lldb-unit :: Process/Utility/./ProcessUtilityTests/ProcSMapTests/LinuxProcSMapsTestFixture.ParseSMapRegions/3 lldb-unit :: Process/Utility/./ProcessUtilityTests/ProcSMapTests/LinuxProcSMapsTestFixture.ParseSMapRegions/4 lldb-unit :: Process/Utility/./ProcessUtilityTests/ProcSMapTests/LinuxProcSMapsTestFixture.ParseSMapRegions/5 lldb-unit :: Process/Utility/./ProcessUtilityTests/ProcSMapTests/LinuxProcSMapsTestFixture.ParseSMapRegions/8 lldb-unit :: Process/Utility/./ProcessUtilityTests/RegisterContext_x86Test.FullToAbridgedTagWord lldb-unit :: Process/gdb-remote/./ProcessGdbRemoteTests/GDBRemoteClientBaseTest.InterruptNoResponse lldb-unit :: Process/gdb-remote/./ProcessGdbRemoteTests/GDBRemoteClientBaseTest.SendContinueAndAsyncSignal lldb-unit :: Process/gdb-remote/./ProcessGdbRemoteTests/GDBRemoteClientBaseTest.SendContinueAndLateInterrupt lldb-unit :: Process/gdb-remote/./ProcessGdbRemoteTests/GDBRemoteClientBaseTest.SendPacketAndReceiveResponseWithOutputSupport lldb-unit :: Process/gdb-remote/./ProcessGdbRemoteTests/GDBRemoteCommunicationClientTest.GetMemoryRegionInfoInvalidResponse lldb-unit :: Process/gdb-remote/./ProcessGdbRemoteTests/GDBRemoteCommunicationClientTest.GetModulesInfo lldb-unit :: Process/gdb-remote/./ProcessGdbRemoteTests/GDBRemoteCommunicationClientTest.GetQOffsets lldb-unit :: Process/gdb-remote/./ProcessGdbRemoteTests/GDBRemoteCommunicationClientTest.ReadRegister lldb-unit :: Process/gdb-remote/./ProcessGdbRemoteTests/GDBRemoteCommunicationClientTest.SaveRestoreRegistersNoSuffix lldb-unit :: Process/gdb-remote/./ProcessGdbRemoteTests/GDBRemoteCommunicationClientTest.SendSignalsToIgnore lldb-unit :: Process/gdb-remote/./ProcessGdbRemoteTests/GDBRemoteCommunicationClientTest.TestPacketSpeedJSON lldb-unit :: Process/gdb-remote/./ProcessGdbRemoteTests/GDBRemoteCommunicationClientTest.WriteRegister lldb-unit :: Process/gdb-remote/./ProcessGdbRemoteTests/GDBRemoteCommunicationClientTest.WriteRegisterNoSuffix lldb-unit :: Process/gdb-remote/./ProcessGdbRemoteTests/GDBRemoteCommunicationServerTest.SendErrorResponse_Status lldb-unit :: Process/gdb-remote/./ProcessGdbRemoteTests/GDBRemoteCommunicationServerTest.SendErrorResponse_StringError lldb-unit :: Process/gdb-remote/./ProcessGdbRemoteTests/GDBRemoteCommunicationTest.ReadPacket_checksum lldb-unit :: Process/gdb-remote/./ProcessGdbRemoteTests/PortMapTest.AllowPort lldb-unit :: Process/gdb-remote/./ProcessGdbRemoteTests/PortMapTest.FreePort lldb-unit :: Process/minidump/./LLDBMinidumpTests/MinidumpParserTest.GetArchitecture lldb-unit :: Process/minidump/./LLDBMinidumpTests/MinidumpParserTest.GetArchitectureWindows lldb-unit :: Process/minidump/./LLDBMinidumpTests/MinidumpParserTest.GetExceptionStream lldb-unit :: Process/minidump/./LLDBMinidumpTests/MinidumpParserTest.GetFilteredModuleList lldb-unit :: Process/minidump/./LLDBMinidumpTests/MinidumpParserTest.GetLinuxProcStatus lldb-unit :: Process/minidump/./LLDBMinidumpTests/MinidumpParserTest.GetMemory lldb-unit :: Process/minidump/./LLDBMinidumpTests/MinidumpParserTest.GetMemoryRegionInfo lldb-unit :: Process/minidump/./LLDBMinidumpTests/MinidumpParserTest.GetMemoryRegionInfoFromMemoryList lldb-unit :: Process/minidump/./LLDBMinidumpTests/MinidumpParserTest.GetMemoryRegionInfoLinuxMaps lldb-unit :: Process/minidump/./LLDBMinidumpTests/MinidumpParserTest.GetMiscInfoWindows lldb-unit :: Process/minidump/./LLDBMinidumpTests/MinidumpParserTest.GetMiscInfo_no_stream lldb-unit :: Process/minidump/./LLDBMinidumpTests/MinidumpParserTest.GetPid lldb-unit :: Process/minidump/./LLDBMinidumpTests/MinidumpParserTest.GetPidWow64 lldb-unit :: Process/minidump/./LLDBMinidumpTests/MinidumpParserTest.GetThreadsAndGetThreadContext lldb-unit :: Process/minidump/./LLDBMinidumpTests/MinidumpParserTest.InvalidMinidump lldb-unit :: Process/minidump/./LLDBMinidumpTests/MinidumpParserTest.MinidumpDuplicateModuleMappedFirst lldb-unit :: Process/minidump/./LLDBMinidumpTests/MinidumpParserTest.MinidumpDuplicateModuleMappedSecond lldb-unit :: Process/minidump/./LLDBMinidumpTests/MinidumpParserTest.MinidumpDuplicateModuleMinAddress lldb-unit :: Process/minidump/./LLDBMinidumpTests/MinidumpParserTest.MinidumpDuplicateModuleSeparateCode lldb-unit :: Process/minidump/./LLDBMinidumpTests/MinidumpParserTest.MinidumpModuleOrder lldb-unit :: Process/minidump/./LLDBMinidumpTests/RegisterContextMinidump.ConvertMinidumpContext_x86_32 lldb-unit :: ScriptInterpreter/Python/./ScriptInterpreterPythonTests/PythonDataObjectsTest.TestBorrowedReferences lldb-unit :: ScriptInterpreter/Python/./ScriptInterpreterPythonTests/PythonDataObjectsTest.TestExceptions lldb-unit :: ScriptInterpreter/Python/./ScriptInterpreterPythonTests/PythonDataObjectsTest.TestExtractingUInt64ThroughStructuredData lldb-unit :: ScriptInterpreter/Python/./ScriptInterpreterPythonTests/PythonDataObjectsTest.TestGlobalNameResolutionNoDot lldb-unit :: ScriptInterpreter/Python/./ScriptInterpreterPythonTests/PythonDataObjectsTest.TestGlobalNameResolutionWithDot lldb-unit :: ScriptInterpreter/Python/./ScriptInterpreterPythonTests/PythonDataObjectsTest.TestModuleNameResolutionNoDot lldb-unit :: ScriptInterpreter/Python/./ScriptInterpreterPythonTests/PythonDataObjectsTest.TestObjectAttributes lldb-unit :: ScriptInterpreter/Python/./ScriptInterpreterPythonTests/PythonDataObjectsTest.TestOwnedReferences lldb-unit :: ScriptInterpreter/Python/./ScriptInterpreterPythonTests/PythonDataObjectsTest.TestPythonByteArray lldb-unit :: ScriptInterpreter/Python/./ScriptInterpreterPythonTests/PythonDataObjectsTest.TestPythonBytes lldb-unit :: ScriptInterpreter/Python/./ScriptInterpreterPythonTests/PythonDataObjectsTest.TestPythonCallableCheck lldb-unit :: ScriptInterpreter/Python/./ScriptInterpreterPythonTests/PythonDataObjectsTest.TestPythonCallableInvoke lldb-unit :: ScriptInterpreter/Python/./ScriptInterpreterPythonTests/PythonDataObjectsTest.TestPythonDictionaryManipulation lldb-unit :: ScriptInterpreter/Python/./ScriptInterpreterPythonTests/PythonDataObjectsTest.TestPythonDictionaryToStructuredDictionary lldb-unit :: ScriptInterpreter/Python/./ScriptInterpreterPythonTests/PythonDataObjectsTest.TestPythonDictionaryValueEquality lldb-unit :: ScriptInterpreter/Python/./ScriptInterpreterPythonTests/PythonDataObjectsTest.TestPythonFile lldb-unit :: ScriptInterpreter/Python/./ScriptInterpreterPythonTests/PythonDataObjectsTest.TestPythonIntegerToStr lldb-unit :: ScriptInterpreter/Python/./ScriptInterpreterPythonTests/PythonDataObjectsTest.TestPythonListToStructuredList lldb-unit :: ScriptInterpreter/Python/./ScriptInterpreterPythonTests/PythonDataObjectsTest.TestPythonListValueEquality lldb-unit :: ScriptInterpreter/Python/./ScriptInterpreterPythonTests/PythonDataObjectsTest.TestPythonStringToStructuredString lldb-unit :: ScriptInterpreter/Python/./ScriptInterpreterPythonTests/PythonDataObjectsTest.TestPythonTupleInitializerList lldb-unit :: ScriptInterpreter/Python/./ScriptInterpreterPythonTests/PythonDataObjectsTest.TestPythonTupleToStructuredList lldb-unit :: ScriptInterpreter/Python/./ScriptInterpreterPythonTests/PythonDataObjectsTest.TestPythonTupleValues lldb-unit :: ScriptInterpreter/Python/./ScriptInterpreterPythonTests/PythonDataObjectsTest.TestResetting lldb-unit :: ScriptInterpreter/Python/./ScriptInterpreterPythonTests/PythonDataObjectsTest.TestRun lldb-unit :: ScriptInterpreter/Python/./ScriptInterpreterPythonTests/PythonDataObjectsTest.TestTypeNameResolutionNoDot lldb-unit :: Signals/./SignalsTests/UnixSignalsTest.VersionChange lldb-unit :: Symbol/./SymbolTests/DWARFCallFrameInfoTest.Basic_dwarf3 lldb-unit :: Symbol/./SymbolTests/DWARFCallFrameInfoTest.Basic_dwarf4 lldb-unit :: Symbol/./SymbolTests/DWARFCallFrameInfoTest.Basic_eh lldb-unit :: Symbol/./SymbolTests/LineEntryTest.GetSameLineContiguousAddressRangeNestedInline lldb-unit :: Symbol/./SymbolTests/LineEntryTest.GetSameLineContiguousAddressRangeNoInlines lldb-unit :: Symbol/./SymbolTests/LineEntryTest.GetSameLineContiguousAddressRangeOneInline lldb-unit :: Symbol/./SymbolTests/PostfixExpression.ParseFPOProgram lldb-unit :: Symbol/./SymbolTests/PostfixExpression.ParseOneExpression lldb-unit :: Symbol/./SymbolTests/PostfixExpression.ToDWARF lldb-unit :: Symbol/./SymbolTests/SymbolsTest.LocateExecutableSymbolFileForUnknownExecutableAndMissingSymbolFile lldb-unit :: Symbol/./SymbolTests/SymbolsTest.TerminateLocateExecutableSymbolFileForUnknownExecutableAndUnknownSymbolFile lldb-unit :: Symbol/./SymbolTests/TestClangASTImporter.CompleteFwdDeclWithOtherOrigin lldb-unit :: Symbol/./SymbolTests/TestClangASTImporter.MetadataPropagationAfterCopying lldb-unit :: Symbol/./SymbolTests/TestClangASTImporter.MetadataPropagationIndirectImport lldb-unit :: Symbol/./SymbolTests/TestTypeSystemClang.AddMethodToObjCObjectType lldb-unit :: Symbol/./SymbolTests/TestTypeSystemClang.TemplateArguments lldb-unit :: Symbol/./SymbolTests/TestTypeSystemClang.TestDeletingImplicitCopyCstrDueToMoveCStr lldb-unit :: Symbol/./SymbolTests/TestTypeSystemClang.TestDisplayNameEmpty lldb-unit :: Symbol/./SymbolTests/TestTypeSystemClang.TestFunctionTemplateConstruction lldb-unit :: Symbol/./SymbolTests/TestTypeSystemClang.TestGetBasicTypeFromName lldb-unit :: Symbol/./SymbolTests/TestTypeSystemClang.TestGetEnumIntegerTypeBasicTypes lldb-unit :: Symbol/./SymbolTests/TestTypeSystemClang.TestGetEnumIntegerTypeInvalid lldb-unit :: Symbol/./SymbolTests/TestTypeSystemClang.TestGetEnumIntegerTypeUnexpectedType lldb-unit :: Symbol/./SymbolTests/TestTypeSystemClang.TestGetTypeClassDeclType lldb-unit :: Symbol/./SymbolTests/TestTypeSystemClang.TestGetTypeClassNested lldb-unit :: Symbol/./SymbolTests/TestTypeSystemClang.TestGetTypeClassTypeOfExpr lldb-unit :: Symbol/./SymbolTests/TestTypeSystemClang.TestIsClangType lldb-unit :: Symbol/./SymbolTests/TestTypeSystemClang.TestOwningModule lldb-unit :: Symbol/./SymbolTests/TestTypeSystemClang.TestRemoveFastQualifiers lldb-unit :: Symbol/./SymbolTests/TestTypeSystemClang.TestUnifyAccessSpecifiers lldb-unit :: SymbolFile/DWARF/./SymbolFileDWARFTests/DWARFASTParserClangTests.EnsureAllDIEsInDeclContextHaveBeenParsedParsesOnlyMatchingEntries lldb-unit :: SymbolFile/DWARF/./SymbolFileDWARFTests/SymbolFileDWARFTests.ParseArangesIgnoreEmpty lldb-unit :: SymbolFile/DWARF/./SymbolFileDWARFTests/SymbolFileDWARFTests.ParseArangesSkipErrors lldb-unit :: SymbolFile/DWARF/./SymbolFileDWARFTests/SymbolFileDWARFTests.TestAbbrevInvalidNULLTag lldb-unit :: SymbolFile/DWARF/./SymbolFileDWARFTests/SymbolFileDWARFTests.TestAbbrevOrder1Start1 lldb-unit :: SymbolFile/DWARF/./SymbolFileDWARFTests/SymbolFileDWARFTests.TestAbbrevOrder1Start5 lldb-unit :: SymbolFile/DWARF/./SymbolFileDWARFTests/SymbolFileDWARFTests.TestAbbrevOutOfOrder lldb-unit :: SymbolFile/DWARF/./SymbolFileDWARFTests/SymbolFileDWARFTests.TestAbbrevValidAttrNullForm lldb-unit :: SymbolFile/DWARF/./SymbolFileDWARFTests/SymbolFileDWARFTests.TestAbilitiesForDWARF lldb-unit :: SymbolFile/NativePDB/./SymbolFileNativePDBTests/PDBFPOProgramToDWARFExpressionTests.DependencyChain lldb-unit :: SymbolFile/NativePDB/./SymbolFileNativePDBTests/PDBFPOProgramToDWARFExpressionTests.InvalidAssignmentMultiple lldb-unit :: SymbolFile/NativePDB/./SymbolFileNativePDBTests/PDBFPOProgramToDWARFExpressionTests.InvalidAssignmentSingle lldb-unit :: SymbolFile/NativePDB/./SymbolFileNativePDBTests/PDBFPOProgramToDWARFExpressionTests.InvalidOpBinary lldb-unit :: SymbolFile/NativePDB/./SymbolFileNativePDBTests/PDBFPOProgramToDWARFExpressionTests.MissingTargetRegister lldb-unit :: SymbolFile/NativePDB/./SymbolFileNativePDBTests/PDBFPOProgramToDWARFExpressionTests.MultipleIndependentAssignments lldb-unit :: SymbolFile/NativePDB/./SymbolFileNativePDBTests/PDBFPOProgramToDWARFExpressionTests.SingleAssignmentRegisterRef lldb-unit :: SymbolFile/NativePDB/./SymbolFileNativePDBTests/PDBFPOProgramToDWARFExpressionTests.UnknownOp lldb-unit :: SymbolFile/NativePDB/./SymbolFileNativePDBTests/PDBFPOProgramToDWARFExpressionTests.UnresolvedDependentCyclicRegisterAssignmentReference lldb-unit :: SymbolFile/NativePDB/./SymbolFileNativePDBTests/PDBFPOProgramToDWARFExpressionTests.UnresolvedRegisterReference lldb-unit :: SymbolFile/NativePDB/./SymbolFileNativePDBTests/PDBFPOProgramToDWARFExpressionTests.UnsupportedRASearch lldb-unit :: Target/./TargetTests/ExecutionContextTest.GetByteOrderProcess lldb-unit :: Target/./TargetTests/MCBasedABI.MapRegisterName lldb-unit :: Target/./TargetTests/ModuleCacheTest.GetAndPutStrangeHostname lldb-unit :: Target/./TargetTests/PathMappingListTest.RelativeTests lldb-unit :: Target/./TargetTests/RemoteAwarePlatformTest.TestResolveExecutabelOnClientByPlatform lldb-unit :: Thread/./ThreadTests/ThreadTest.GetPrivateStopInfo lldb-unit :: Thread/./ThreadTests/ThreadTest.SetStopInfo lldb-unit :: UnwindAssembly/x86/./UnwindAssemblyx86Tests/Testx86AssemblyInspectionEngine.Test32BitOnlyInstruction lldb-unit :: UnwindAssembly/x86/./UnwindAssemblyx86Tests/Testx86AssemblyInspectionEngine.Test64bitFramelessBigStackFrame lldb-unit :: UnwindAssembly/x86/./UnwindAssemblyx86Tests/Testx86AssemblyInspectionEngine.Test64bitFramelessSmallStackFrame lldb-unit :: UnwindAssembly/x86/./UnwindAssemblyx86Tests/Testx86AssemblyInspectionEngine.TestAddESP lldb-unit :: UnwindAssembly/x86/./UnwindAssemblyx86Tests/Testx86AssemblyInspectionEngine.TestAddRSP lldb-unit :: UnwindAssembly/x86/./UnwindAssemblyx86Tests/Testx86AssemblyInspectionEngine.TestDisassemblyJunkBytes lldb-unit :: UnwindAssembly/x86/./UnwindAssemblyx86Tests/Testx86AssemblyInspectionEngine.TestDisassemblyMidFunctionEpilogues lldb-unit :: UnwindAssembly/x86/./UnwindAssemblyx86Tests/Testx86AssemblyInspectionEngine.TestLEAVE lldb-unit :: UnwindAssembly/x86/./UnwindAssemblyx86Tests/Testx86AssemblyInspectionEngine.TestPopEBP lldb-unit :: UnwindAssembly/x86/./UnwindAssemblyx86Tests/Testx86AssemblyInspectionEngine.TestPopEDI lldb-unit :: UnwindAssembly/x86/./UnwindAssemblyx86Tests/Testx86AssemblyInspectionEngine.TestPopR12 lldb-unit :: UnwindAssembly/x86/./UnwindAssemblyx86Tests/Testx86AssemblyInspectionEngine.TestPopR13 lldb-unit :: UnwindAssembly/x86/./UnwindAssemblyx86Tests/Testx86AssemblyInspectionEngine.TestPopRBP lldb-unit :: UnwindAssembly/x86/./UnwindAssemblyx86Tests/Testx86AssemblyInspectionEngine.TestPopRBPWithREX lldb-unit :: UnwindAssembly/x86/./UnwindAssemblyx86Tests/Testx86AssemblyInspectionEngine.TestPushEAX lldb-unit :: UnwindAssembly/x86/./UnwindAssemblyx86Tests/Testx86AssemblyInspectionEngine.TestPushEBP lldb-unit :: UnwindAssembly/x86/./UnwindAssemblyx86Tests/Testx86AssemblyInspectionEngine.TestPushEBX lldb-unit :: UnwindAssembly/x86/./UnwindAssemblyx86Tests/Testx86AssemblyInspectionEngine.TestPushECX lldb-unit :: UnwindAssembly/x86/./UnwindAssemblyx86Tests/Testx86AssemblyInspectionEngine.TestPushEDX lldb-unit :: UnwindAssembly/x86/./UnwindAssemblyx86Tests/Testx86AssemblyInspectionEngine.TestPushESI lldb-unit :: UnwindAssembly/x86/./UnwindAssemblyx86Tests/Testx86AssemblyInspectionEngine.TestPushImm lldb-unit :: UnwindAssembly/x86/./UnwindAssemblyx86Tests/Testx86AssemblyInspectionEngine.TestPushR12 lldb-unit :: UnwindAssembly/x86/./UnwindAssemblyx86Tests/Testx86AssemblyInspectionEngine.TestPushR13 lldb-unit :: UnwindAssembly/x86/./UnwindAssemblyx86Tests/Testx86AssemblyInspectionEngine.TestPushR14 lldb-unit :: UnwindAssembly/x86/./UnwindAssemblyx86Tests/Testx86AssemblyInspectionEngine.TestPushRBP lldb-unit :: UnwindAssembly/x86/./UnwindAssemblyx86Tests/Testx86AssemblyInspectionEngine.TestPushRBPWithREX lldb-unit :: UnwindAssembly/x86/./UnwindAssemblyx86Tests/Testx86AssemblyInspectionEngine.TestSimple32bitFrameFunction lldb-unit :: UnwindAssembly/x86/./UnwindAssemblyx86Tests/Testx86AssemblyInspectionEngine.TestSpArithx86_64Augmented lldb-unit :: UnwindAssembly/x86/./UnwindAssemblyx86Tests/Testx86AssemblyInspectionEngine.TestSpillRegToStackViaMOVi386 lldb-unit :: UnwindAssembly/x86/./UnwindAssemblyx86Tests/Testx86AssemblyInspectionEngine.TestStackRealign8BitDisp_i386 lldb-unit :: UnwindAssembly/x86/./UnwindAssemblyx86Tests/Testx86AssemblyInspectionEngine.TestStackRealignMSVC_i386 lldb-unit :: Utility/./UtilityTests/AnsiTerminal.AtEnd lldb-unit :: Utility/./UtilityTests/AnsiTerminal.Basic lldb-unit :: Utility/./UtilityTests/AnsiTerminal.Incomplete lldb-unit :: Utility/./UtilityTests/AnsiTerminal.KnownPrefix lldb-unit :: Utility/./UtilityTests/AnsiTerminal.Unknown lldb-unit :: Utility/./UtilityTests/ArchSpecTest.MergeFrom lldb-unit :: Utility/./UtilityTests/ArchSpecTest.MergeFromMachOUnknown lldb-unit :: Utility/./UtilityTests/ArchSpecTest.TestParseMachCPUDashSubtypeTripleExtra lldb-unit :: Utility/./UtilityTests/ArchSpecTest.TestParseMachCPUDashSubtypeTripleSimple lldb-unit :: Utility/./UtilityTests/ArchSpecTest.TestSetTriple lldb-unit :: Utility/./UtilityTests/ArgsTest.AppendArguments lldb-unit :: Utility/./UtilityTests/ArgsTest.BareSingleQuote lldb-unit :: Utility/./UtilityTests/ArgsTest.DoubleQuotedItem lldb-unit :: Utility/./UtilityTests/ArgsTest.EscapeLLDBCommandArgument lldb-unit :: Utility/./UtilityTests/ArgsTest.GetArgumentArrayRef lldb-unit :: Utility/./UtilityTests/ArgsTest.GetShellSafeArgument lldb-unit :: Utility/./UtilityTests/ArgsTest.ReplaceArgumentAtIndexLonger lldb-unit :: Utility/./UtilityTests/ArgsTest.ReplaceArgumentAtIndexOutOfRange lldb-unit :: Utility/./UtilityTests/ArgsTest.StringListConstructor lldb-unit :: Utility/./UtilityTests/ArgsTest.TestAppendArg lldb-unit :: Utility/./UtilityTests/ArgsTest.TestArgv lldb-unit :: Utility/./UtilityTests/ArgsTest.TestOverwriteArgs lldb-unit :: Utility/./UtilityTests/ArgsTest.TestQuotedTrailingBackslash lldb-unit :: Utility/./UtilityTests/ArgsTest.TestQuotedUnknownEscape lldb-unit :: Utility/./UtilityTests/ArgsTest.TestSingleArg lldb-unit :: Utility/./UtilityTests/ArgsTest.Yaml lldb-unit :: Utility/./UtilityTests/BinaryStreamTest.PutSLEB128FiveBytes lldb-unit :: Utility/./UtilityTests/BinaryStreamTest.PutSLEB128MaxValue lldb-unit :: Utility/./UtilityTests/BinaryStreamTest.PutSLEB128NineBytes lldb-unit :: Utility/./UtilityTests/BinaryStreamTest.PutSLEB128SevenBytes lldb-unit :: Utility/./UtilityTests/BinaryStreamTest.PutSLEB128ThreeBytes lldb-unit :: Utility/./UtilityTests/BinaryStreamTest.PutSLEB128Zero lldb-unit :: Utility/./UtilityTests/BinaryStreamTest.PutULEB128FiveBytes lldb-unit :: Utility/./UtilityTests/BinaryStreamTest.PutULEB128FourBytes lldb-unit :: Utility/./UtilityTests/BinaryStreamTest.PutULEB128MaxValue lldb-unit :: Utility/./UtilityTests/BinaryStreamTest.PutULEB128NineBytes lldb-unit :: Utility/./UtilityTests/BinaryStreamTest.PutULEB128One lldb-unit :: Utility/./UtilityTests/BinaryStreamTest.PutULEB128SixBytes lldb-unit :: Utility/./UtilityTests/BinaryStreamTest.PutULEB128Zero lldb-unit :: Utility/./UtilityTests/BroadcasterTest.BroadcastEvent lldb-unit :: Utility/./UtilityTests/BroadcasterTest.EventTypeHasListeners lldb-unit :: Utility/./UtilityTests/CompletionRequest.DuplicateFiltering lldb-unit :: Utility/./UtilityTests/CompletionRequest.FakeLastArg lldb-unit :: Utility/./UtilityTests/CompletionRequest.ShiftArguments lldb-unit :: Utility/./UtilityTests/CompletionRequest.TryCompleteCurrentArgBad lldb-unit :: Utility/./UtilityTests/ConstStringTest.CompareConstString lldb-unit :: Utility/./UtilityTests/ConstStringTest.CompareStringRef lldb-unit :: Utility/./UtilityTests/ConstStringTest.NullAndEmptyStates lldb-unit :: Utility/./UtilityTests/ConstStringTest.YAML lldb-unit :: Utility/./UtilityTests/DataExtractorTest.GetBitfield lldb-unit :: Utility/./UtilityTests/DataExtractorTest.GetCStr lldb-unit :: Utility/./UtilityTests/DataExtractorTest.GetCStrAtEnd lldb-unit :: Utility/./UtilityTests/DataExtractorTest.GetCStrAtNullOffset lldb-unit :: Utility/./UtilityTests/DataExtractorTest.GetCStrEmpty lldb-unit :: Utility/./UtilityTests/DataExtractorTest.GetCStrUnterminated lldb-unit :: Utility/./UtilityTests/DataExtractorTest.GetDoubleUnaligned lldb-unit :: Utility/./UtilityTests/DataExtractorTest.GetSLEB128_bit63 lldb-unit :: Utility/./UtilityTests/DataExtractorTest.PeekData lldb-unit :: Utility/./UtilityTests/DataExtractorTest.UncommonAddressSize lldb-unit :: Utility/./UtilityTests/DeserializerTest.HasData lldb-unit :: Utility/./UtilityTests/EnvironmentTest.EnvpConstruction lldb-unit :: Utility/./UtilityTests/EnvironmentTest.EnvpConversion lldb-unit :: Utility/./UtilityTests/EventTest.DumpEventDataBytes lldb-unit :: Utility/./UtilityTests/FileSpecTest.CopyByAppendingPathComponent lldb-unit :: Utility/./UtilityTests/FileSpecTest.EqualDotsPosixRoot lldb-unit :: Utility/./UtilityTests/FileSpecTest.FileAndDirectoryComponents lldb-unit :: Utility/./UtilityTests/FileSpecTest.FormatFileSpec lldb-unit :: Utility/./UtilityTests/FileSpecTest.GetPath lldb-unit :: Utility/./UtilityTests/FileSpecTest.Match lldb-unit :: Utility/./UtilityTests/FileSpecTest.OperatorBool lldb-unit :: Utility/./UtilityTests/FileSpecTest.Yaml lldb-unit :: Utility/./UtilityTests/Flags.AllClear lldb-unit :: Utility/./UtilityTests/Flags.AnySet lldb-unit :: Utility/./UtilityTests/Flags.GetBitSize lldb-unit :: Utility/./UtilityTests/Flags.IsClear lldb-unit :: Utility/./UtilityTests/Flags.Test lldb-unit :: Utility/./UtilityTests/GeneratorTest.Create lldb-unit :: Utility/./UtilityTests/GeneratorTest.Get lldb-unit :: Utility/./UtilityTests/GeneratorTest.GetOrCreate lldb-unit :: Utility/./UtilityTests/GeneratorTest.YamlMultiProvider lldb-unit :: Utility/./UtilityTests/ListenerTest.GetEventImmediate lldb-unit :: Utility/./UtilityTests/ListenerTest.GetEventWait lldb-unit :: Utility/./UtilityTests/LogChannelEnabledTest.LLDB_LOG_ERROR lldb-unit :: Utility/./UtilityTests/LogChannelEnabledTest.LogGetLogThread lldb-unit :: Utility/./UtilityTests/LogChannelEnabledTest.LogVerboseThread lldb-unit :: Utility/./UtilityTests/LogChannelEnabledTest.log_options lldb-unit :: Utility/./UtilityTests/LogChannelTest.Disable lldb-unit :: Utility/./UtilityTests/LogChannelTest.List lldb-unit :: Utility/./UtilityTests/LogTest.LLDB_LOG_nullptr lldb-unit :: Utility/./UtilityTests/NameMatchesTest.Contains lldb-unit :: Utility/./UtilityTests/NameMatchesTest.Equals lldb-unit :: Utility/./UtilityTests/NameMatchesTest.RegularExpression lldb-unit :: Utility/./UtilityTests/NameMatchesTest.StartsWith lldb-unit :: Utility/./UtilityTests/OptionsWithRawTest.ArgsButNoDelimiter lldb-unit :: Utility/./UtilityTests/OptionsWithRawTest.EmptyArgsOnlySuffix lldb-unit :: Utility/./UtilityTests/OptionsWithRawTest.EmptyInput lldb-unit :: Utility/./UtilityTests/OptionsWithRawTest.EmptySuffix lldb-unit :: Utility/./UtilityTests/OptionsWithRawTest.EmptySuffixSingleWhitespace lldb-unit :: Utility/./UtilityTests/OptionsWithRawTest.LeadingSpaceArgs lldb-unit :: Utility/./UtilityTests/OptionsWithRawTest.MultiWordSuffix lldb-unit :: Utility/./UtilityTests/OptionsWithRawTest.SingleWhitespaceInput lldb-unit :: Utility/./UtilityTests/OptionsWithRawTest.SingleWordSuffix lldb-unit :: Utility/./UtilityTests/OptionsWithRawTest.TerminatedQuote lldb-unit :: Utility/./UtilityTests/OptionsWithRawTest.WhitespaceSuffix lldb-unit :: Utility/./UtilityTests/PassiveReplayTest.InstrumentedBarRef lldb-unit :: Utility/./UtilityTests/PassiveReplayTest.InstrumentedFoo lldb-unit :: Utility/./UtilityTests/Predicate.WaitForValueEqualTo lldb-unit :: Utility/./UtilityTests/Predicate.WaitForValueNotEqualTo lldb-unit :: Utility/./UtilityTests/ProcessInstanceInfo.Dump lldb-unit :: Utility/./UtilityTests/ProcessInstanceInfo.DumpTable lldb-unit :: Utility/./UtilityTests/ProcessInstanceInfoList.Yaml lldb-unit :: Utility/./UtilityTests/ProcessInstanceInfoMatch.Name lldb-unit :: Utility/./UtilityTests/RangeDataVector.FindEntryIndexesThatContain_Overlap lldb-unit :: Utility/./UtilityTests/RangeTest.Clear lldb-unit :: Utility/./UtilityTests/RangeTest.Constructor lldb-unit :: Utility/./UtilityTests/RangeTest.ContainsAddr lldb-unit :: Utility/./UtilityTests/RangeTest.ContainsAddrInvalid lldb-unit :: Utility/./UtilityTests/RangeTest.ContainsEndInclusive lldb-unit :: Utility/./UtilityTests/RangeTest.Copy lldb-unit :: Utility/./UtilityTests/RangeTest.DoesIntersect lldb-unit :: Utility/./UtilityTests/RangeTest.Equal lldb-unit :: Utility/./UtilityTests/RangeTest.EqualInvalid lldb-unit :: Utility/./UtilityTests/RangeTest.LessThan lldb-unit :: Utility/./UtilityTests/RangeTest.LessThanInvalid lldb-unit :: Utility/./UtilityTests/RangeTest.NotEqual lldb-unit :: Utility/./UtilityTests/RangeTest.NotEqualInvalid lldb-unit :: Utility/./UtilityTests/RangeTest.SetRangeBase lldb-unit :: Utility/./UtilityTests/RangeTest.SizeTypes lldb-unit :: Utility/./UtilityTests/RangeTest.Slide lldb-unit :: Utility/./UtilityTests/RangeTest.SlideZero lldb-unit :: Utility/./UtilityTests/RangeVector.CombineConsecutiveRanges lldb-unit :: Utility/./UtilityTests/RecordReplayTest.InstrumentedBar lldb-unit :: Utility/./UtilityTests/RecordReplayTest.InstrumentedFoo lldb-unit :: Utility/./UtilityTests/RecordReplayTest.InvalidSequence lldb-unit :: Utility/./UtilityTests/RegisterValueTest.GetSet8 lldb-unit :: Utility/./UtilityTests/RegularExpression.CopyAssignment lldb-unit :: Utility/./UtilityTests/RegularExpression.Empty lldb-unit :: Utility/./UtilityTests/RegularExpression.Invalid lldb-unit :: Utility/./UtilityTests/RegularExpression.Match lldb-unit :: Utility/./UtilityTests/RegularExpression.Valid lldb-unit :: Utility/./UtilityTests/ReproducerTest.SetCapture lldb-unit :: Utility/./UtilityTests/ReproducerTest.SetReplay lldb-unit :: Utility/./UtilityTests/ScalarTest.CastOperations lldb-unit :: Utility/./UtilityTests/ScalarTest.Comparison lldb-unit :: Utility/./UtilityTests/ScalarTest.Division lldb-unit :: Utility/./UtilityTests/ScalarTest.Equality lldb-unit :: Utility/./UtilityTests/ScalarTest.GetBytes lldb-unit :: Utility/./UtilityTests/ScalarTest.GetValue lldb-unit :: Utility/./UtilityTests/ScalarTest.Getters lldb-unit :: Utility/./UtilityTests/ScalarTest.LongLongAssigmentOperator lldb-unit :: Utility/./UtilityTests/ScalarTest.Promotion lldb-unit :: Utility/./UtilityTests/ScalarTest.RightShiftOperator lldb-unit :: Utility/./UtilityTests/ScalarTest.Scalar_512 lldb-unit :: Utility/./UtilityTests/ScalarTest.SetValueFromCString lldb-unit :: Utility/./UtilityTests/ScalarTest.TruncOrExtendTo lldb-unit :: Utility/./UtilityTests/SerializationRountripTest.SerializeDeserializeCString lldb-unit :: Utility/./UtilityTests/SerializationRountripTest.SerializeDeserializeCStringArrayNullptr lldb-unit :: Utility/./UtilityTests/SerializationRountripTest.SerializeDeserializeObjectReference lldb-unit :: Utility/./UtilityTests/SerializationRountripTest.SerializeDeserializePod lldb-unit :: Utility/./UtilityTests/SerializationRountripTest.SerializeDeserializePodPointers lldb-unit :: Utility/./UtilityTests/SerializationRountripTest.SerializeDeserializePodReferences lldb-unit :: Utility/./UtilityTests/StateTest.Formatv lldb-unit :: Utility/./UtilityTests/StatusTest.ErrorConversion lldb-unit :: Utility/./UtilityTests/StreamTeeTest.AppendStream lldb-unit :: Utility/./UtilityTests/StreamTeeTest.Constructor1Stream lldb-unit :: Utility/./UtilityTests/StreamTeeTest.Constructor2Streams lldb-unit :: Utility/./UtilityTests/StreamTeeTest.DefaultConstructor lldb-unit :: Utility/./UtilityTests/StreamTeeTest.Flush lldb-unit :: Utility/./UtilityTests/StreamTeeTest.GetStreamAtIndexOutOfBounds lldb-unit :: Utility/./UtilityTests/StreamTeeTest.GetStreamAtIndexOutOfBoundsEmpty lldb-unit :: Utility/./UtilityTests/StreamTeeTest.SetStreamAtIndexOverwrite lldb-unit :: Utility/./UtilityTests/StreamTeeTest.Write lldb-unit :: Utility/./UtilityTests/StreamTest.AddressEmptyPrefix lldb-unit :: Utility/./UtilityTests/StreamTest.AddressNoSuffix lldb-unit :: Utility/./UtilityTests/StreamTest.AddressPrefix lldb-unit :: Utility/./UtilityTests/StreamTest.AddressRangeEmptyRange lldb-unit :: Utility/./UtilityTests/StreamTest.AddressRangeInvalidRange lldb-unit :: Utility/./UtilityTests/StreamTest.AddressRangeSize lldb-unit :: Utility/./UtilityTests/StreamTest.AddressSize lldb-unit :: Utility/./UtilityTests/StreamTest.AddressSuffix lldb-unit :: Utility/./UtilityTests/StreamTest.PutCString lldb-unit :: Utility/./UtilityTests/StreamTest.PutCStringWithStringRef lldb-unit :: Utility/./UtilityTests/StreamTest.PutCharNull lldb-unit :: Utility/./UtilityTests/StreamTest.PutCharWhitespace lldb-unit :: Utility/./UtilityTests/StreamTest.PutHex64ByteOrderBig lldb-unit :: Utility/./UtilityTests/StreamTest.PutHex64ByteOrderLittle lldb-unit :: Utility/./UtilityTests/StreamTest.PutHex8 lldb-unit :: Utility/./UtilityTests/StreamTest.PutNHex8 lldb-unit :: Utility/./UtilityTests/StreamTest.PutRawBytesToBigEndian lldb-unit :: Utility/./UtilityTests/StreamTest.PutRawBytesToMixedEndian lldb-unit :: Utility/./UtilityTests/StreamTest.ShiftOperatorStrings lldb-unit :: Utility/./UtilityTests/StringExtractorGDBRemoteTest.GetPidTid lldb-unit :: Utility/./UtilityTests/StringExtractorTest.DecodeHexU8_Exact lldb-unit :: Utility/./UtilityTests/StringExtractorTest.DecodeHexU8_InvalidHex lldb-unit :: Utility/./UtilityTests/StringExtractorTest.DecodeHexU8_Underflow lldb-unit :: Utility/./UtilityTests/StringExtractorTest.GetHexBytes lldb-unit :: Utility/./UtilityTests/StringExtractorTest.GetHexBytesAvail lldb-unit :: Utility/./UtilityTests/StringExtractorTest.GetHexBytesAvail_FullString lldb-unit :: Utility/./UtilityTests/StringExtractorTest.GetHexBytesAvail_OddPair lldb-unit :: Utility/./UtilityTests/StringExtractorTest.GetHexBytesAvail_Partial lldb-unit :: Utility/./UtilityTests/StringExtractorTest.GetHexBytes_FullString lldb-unit :: Utility/./UtilityTests/StringExtractorTest.GetHexBytes_OddPair lldb-unit :: Utility/./UtilityTests/StringExtractorTest.GetHexBytes_OddPair2 lldb-unit :: Utility/./UtilityTests/StringExtractorTest.GetHexBytes_Underflow lldb-unit :: Utility/./UtilityTests/StringExtractorTest.GetHexU8_Exact_NoEof lldb-unit :: Utility/./UtilityTests/StringExtractorTest.GetHexU8_Extra lldb-unit :: Utility/./UtilityTests/StringExtractorTest.GetHexU8_Extra_NoEof lldb-unit :: Utility/./UtilityTests/StringExtractorTest.GetHexU8_InvalidHex_NoEof lldb-unit :: Utility/./UtilityTests/StringExtractorTest.GetHexU8_Underflow lldb-unit :: Utility/./UtilityTests/StringExtractorTest.GetHexU8_Underflow2_NoEof lldb-unit :: Utility/./UtilityTests/StringExtractorTest.GetNameColonValueNoColon lldb-unit :: Utility/./UtilityTests/StringExtractorTest.GetU32BigEndian lldb-unit :: Utility/./UtilityTests/StringExtractorTest.GetU64LittleEndian lldb-unit :: Utility/./UtilityTests/StringExtractorTest.InitEmpty lldb-unit :: Utility/./UtilityTests/StringLexerTest.AdvanceIf lldb-unit :: Utility/./UtilityTests/StringLexerTest.GetUnlexed lldb-unit :: Utility/./UtilityTests/StringLexerTest.HasAtLeast lldb-unit :: Utility/./UtilityTests/StringLexerTest.Next lldb-unit :: Utility/./UtilityTests/StringLexerTest.PutBack lldb-unit :: Utility/./UtilityTests/StringListTest.AppendListCStringArray lldb-unit :: Utility/./UtilityTests/StringListTest.AppendListCStringArrayEmpty lldb-unit :: Utility/./UtilityTests/StringListTest.AppendStringCString lldb-unit :: Utility/./UtilityTests/StringListTest.AppendStringMove lldb-unit :: Utility/./UtilityTests/StringListTest.AppendStringStdString lldb-unit :: Utility/./UtilityTests/StringListTest.Assignment lldb-unit :: Utility/./UtilityTests/StringListTest.Clear lldb-unit :: Utility/./UtilityTests/StringListTest.CopyListEmpty lldb-unit :: Utility/./UtilityTests/StringListTest.CopyListSingle lldb-unit :: Utility/./UtilityTests/StringListTest.ForRangeEmpty lldb-unit :: Utility/./UtilityTests/StringListTest.GetMaxStringLengthEqualSize lldb-unit :: Utility/./UtilityTests/StringListTest.GetSize lldb-unit :: Utility/./UtilityTests/StringListTest.InsertStringAtIndexMove lldb-unit :: Utility/./UtilityTests/StringListTest.InsertStringAtIndexOutOfBounds lldb-unit :: Utility/./UtilityTests/StringListTest.InsertStringAtIndexStart lldb-unit :: Utility/./UtilityTests/StringListTest.Join lldb-unit :: Utility/./UtilityTests/StringListTest.JoinEmpty lldb-unit :: Utility/./UtilityTests/StringListTest.JoinMultiCharSeparator lldb-unit :: Utility/./UtilityTests/StringListTest.JoinNonSpace lldb-unit :: Utility/./UtilityTests/StringListTest.JoinSingle lldb-unit :: Utility/./UtilityTests/StringListTest.JoinThree lldb-unit :: Utility/./UtilityTests/StringListTest.LongestCommonPrefix lldb-unit :: Utility/./UtilityTests/StringListTest.LongestCommonPrefixEmpty lldb-unit :: Utility/./UtilityTests/StringListTest.LongestCommonPrefixSingleElement lldb-unit :: Utility/./UtilityTests/StringListTest.RemoveBlankLines lldb-unit :: Utility/./UtilityTests/StringListTest.SetSize lldb-unit :: Utility/./UtilityTests/StringListTest.ShiftCString lldb-unit :: Utility/./UtilityTests/StringListTest.ShiftMove lldb-unit :: Utility/./UtilityTests/StringListTest.SplitIntoLines lldb-unit :: Utility/./UtilityTests/StringListTest.SplitIntoLinesEmpty lldb-unit :: Utility/./UtilityTests/StructuredDataTest.StringDump lldb-unit :: Utility/./UtilityTests/SubsystemRAIITest.SubsystemWithErrorSuccess lldb-unit :: Utility/./UtilityTests/TimeoutTest.Format lldb-unit :: Utility/./UtilityTests/TimerTest.CategoryTimes2 lldb-unit :: Utility/./UtilityTests/TimerTest.CategoryTimesStats lldb-unit :: Utility/./UtilityTests/UUIDTest.RelationalOperators lldb-unit :: Utility/./UtilityTests/UUIDTest.SetFromStringRef lldb-unit :: Utility/./UtilityTests/UUIDTest.StringConverion lldb-unit :: Utility/./UtilityTests/UUIDTest.Validity lldb-unit :: Utility/./UtilityTests/UriParserTest.BadPort lldb-unit :: Utility/./UtilityTests/UriParserTest.BadPort2 lldb-unit :: Utility/./UtilityTests/UriParserTest.BracketedHostname lldb-unit :: Utility/./UtilityTests/UriParserTest.BracketedHostnameWithColon lldb-unit :: Utility/./UtilityTests/UriParserTest.BracketedHostnameWithPortIPv4 lldb-unit :: Utility/./UtilityTests/UriParserTest.BracketedHostnameWithPortIPv6 lldb-unit :: Utility/./UtilityTests/UriParserTest.Empty lldb-unit :: Utility/./UtilityTests/UriParserTest.LongPath lldb-unit :: Utility/./UtilityTests/UriParserTest.MinimalPath lldb-unit :: Utility/./UtilityTests/UriParserTest.MinimalPort lldb-unit :: Utility/./UtilityTests/UriParserTest.SchemeHostSeparator lldb-unit :: Utility/./UtilityTests/UriParserTest.SchemeHostSeparator2 lldb-unit :: Utility/./UtilityTests/UriParserTest.SchemeHostSeparator3 lldb-unit :: Utility/./UtilityTests/UriParserTest.TypicalPortPathIPv4 lldb-unit :: Utility/./UtilityTests/VASprintfTest.BufferResize lldb-unit :: Utility/./UtilityTests/VASprintfTest.EncodingError lldb-unit :: Utility/./UtilityTests/VMRange.CollectionContains lldb-unit :: Utility/./UtilityTests/VMRange.ContainsAddr lldb-unit :: Utility/./UtilityTests/VMRange.ContainsRange lldb-unit :: Utility/./UtilityTests/VMRange.IsValid lldb-unit :: Utility/./UtilityTests/VMRange.Ordering lldb-unit :: Utility/./UtilityTests/XcodeSDKTest.FindXcodeContentsDirectoryInPath lldb-unit :: Utility/./UtilityTests/XcodeSDKTest.GetCanonicalNameAndConstruct lldb-unit :: Utility/./UtilityTests/XcodeSDKTest.MergeTest lldb-unit :: Utility/./UtilityTests/XcodeSDKTest.ParseTest lldb-unit :: Utility/./UtilityTests/XcodeSDKTest.SDKSupportsModules lldb-unit :: Utility/./UtilityTests/XcodeSDKTest.SDKSupportsSwift lldb-unit :: debugserver/./debugserverTests/RNBSocket.AnyListen lldb-unit :: debugserver/./debugserverTests/RNBSocket.LoopBackConnectIPv6 lldb-unit :: debugserver/./debugserverTests/RNBSocket.LoopBackListenIPv4 lldb-unit :: tools/lldb-server/tests/./LLDBServerTests/TestBase.LaunchModePreservesEnvironment

Hide Details

Hide Details

Testing Time: 113.35s Unsupported : 192 Passed : 737 Expectedly Failed: 9 Failed : 1350 FAILED: tools/lldb/test/CMakeFiles/check-lldb cd /Users/buildslave/jenkins/workspace/lldb-cmake-matrix/lldb-build/tools/lldb/test && /usr/local/Frameworks/Python.framework/Versions/3.7/bin/python3.7 /Users/buildslave/jenkins/workspace/lldb-cmake-matrix/lldb-build/./bin/llvm-lit -v --time-tests --shuffle --xunit-xml-output=/Users/buildslave/jenkins/workspace/lldb-cmake-matrix/test/results.xml -v /Users/buildslave/jenkins/workspace/lldb-cmake-matrix/lldb-build/tools/lldb/test ninja: build stopped: subcommand failed. Command failed: Command '['/usr/bin/env', 'TERM=vt100', '/usr/local/bin/ninja', '-v', 'check-lldb']' returned non-zero exit status 1. Command: ['/usr/bin/env', 'TERM=vt100', '/usr/local/bin/ninja', '-v', 'check-lldb'] + set -e [Pipeline] } [Pipeline] // timeout [Pipeline] junit Recording test results [Checks API] No suitable checks publisher found. [Pipeline] } [Pipeline] // stage [Pipeline] stage [Pipeline] { (Test Reproducers) [Pipeline] timeout Timeout set to expire in 2 hr 0 min [Pipeline] { [Pipeline] sh process apparently never started in /Users/buildslave/jenkins/workspace/lldb-cmake-matrix@tmp/durable-ea2cb522 (running Jenkins temporarily with -Dorg.jenkinsci.plugins.durabletask.BourneShellScript.LAUNCH_DIAGNOSTICS=true might make the problem clearer) [Pipeline] } [Pipeline] // timeout [Pipeline] } [Pipeline] // stage [Pipeline] } [Pipeline] // withEnv [Pipeline] } [Pipeline] // node [Pipeline] End of Pipeline ERROR: script returned exit code -2 Finished: FAILURE