FailedConsole Output

Skipping 9,052 KB.. Full Log
PASS: lldb-unit :: Language/Highlighting/./HighlighterTests/HighlighterTest.HighlighterSelectionPath (844 of 2287)
PASS: lldb-unit :: UnwindAssembly/x86/./UnwindAssemblyx86Tests/Testx86AssemblyInspectionEngine.TestPopRBP (845 of 2287)
PASS: lldb-unit :: ScriptInterpreter/Python/./ScriptInterpreterPythonTests/PythonDataObjectsTest.TestPythonDictionaryValueEquality (846 of 2287)
PASS: lldb-api :: functionalities/gdb_remote_client/TestProcessConnect.py (847 of 2287)
PASS: lldb-shell :: Unwind/trap_frame_sym_ctx.test (848 of 2287)
PASS: lldb-unit :: Host/./HostTests/SocketTests/SocketTest.TCPListen0GetPort/ipv4 (849 of 2287)
PASS: lldb-api :: functionalities/thread/concurrent_events/TestConcurrentCrashWithSignal.py (850 of 2287)
PASS: lldb-api :: functionalities/data-formatter/data-formatter-objc/TestDataFormatterObjCNSContainer.py (851 of 2287)
UNSUPPORTED: lldb-api :: functionalities/data-formatter/data-formatter-stl/libstdcpp/string/TestDataFormatterStdString.py (852 of 2287)
UNSUPPORTED: lldb-shell :: SymbolFile/DWARF/debug-types-expressions.test (853 of 2287)
PASS: lldb-api :: commands/frame/diagnose/inheritance/TestDiagnoseInheritance.py (854 of 2287)
PASS: lldb-api :: lang/c/unicode/TestUnicodeSymbols.py (855 of 2287)
PASS: lldb-unit :: Utility/./UtilityTests/StringExtractorTest.GetHexU8_Underflow (856 of 2287)
PASS: lldb-api :: lang/c/bitfields/TestBitfields.py (857 of 2287)
PASS: lldb-api :: lang/objc/modules-compile-error/TestModulesCompileError.py (858 of 2287)
PASS: lldb-shell :: ObjectFile/ELF/gnu-debuglink.yaml (859 of 2287)
PASS: lldb-api :: lang/c/cpp_keyword_identifiers/TestCppKeywordsAsCIdentifiers.py (860 of 2287)
UNSUPPORTED: lldb-api :: functionalities/thread/create_during_step/TestCreateDuringStep.py (861 of 2287)
PASS: lldb-unit :: Process/Utility/./ProcessUtilityTests/ProcMapTests/LinuxProcMapsTestFixture.ParseMapRegions/4 (862 of 2287)
PASS: lldb-unit :: SymbolFile/DWARF/./SymbolFileDWARFTests/SymbolFileDWARFTests.ParseArangesNonzeroSegmentSize (863 of 2287)
PASS: lldb-shell :: Settings/TestFrameFormatMangling.test (864 of 2287)
PASS: lldb-unit :: Utility/./UtilityTests/StringExtractorTest.GetHexU8_Exact (865 of 2287)
PASS: lldb-unit :: Utility/./UtilityTests/UriParserTest.BadPort2 (866 of 2287)
PASS: lldb-unit :: Process/gdb-remote/./ProcessGdbRemoteTests/GDBRemoteClientBaseTest.SendContinueDelegateInterface (867 of 2287)
PASS: lldb-api :: commands/process/attach/attach_denied/TestAttachDenied.py (868 of 2287)
PASS: lldb-api :: lang/c/blocks/TestBlocks.py (869 of 2287)
PASS: lldb-api :: types/TestShortType.py (870 of 2287)
PASS: lldb-shell :: ObjectFile/PECOFF/uuid.yaml (871 of 2287)
PASS: lldb-api :: types/TestLongTypesExpr.py (872 of 2287)
PASS: lldb-unit :: Utility/./UtilityTests/VMRange.SetEndAddress (873 of 2287)
PASS: lldb-unit :: Process/minidump/./LLDBMinidumpTests/MinidumpParserTest.GetMemoryRegionInfoLinuxMapsError (874 of 2287)
PASS: lldb-unit :: Target/./TargetTests/RemoteAwarePlatformTest.TestResolveExecutabelOnClientByPlatform (875 of 2287)
PASS: lldb-api :: types/TestFloatTypes.py (876 of 2287)
XFAIL: lldb-shell :: Register/x86-mm-xmm-read.test (877 of 2287)
PASS: lldb-shell :: SymbolFile/NativePDB/disassembly.cpp (878 of 2287)
UNSUPPORTED: lldb-api :: commands/register/register/aarch64_sve_registers/rw_access_static_config/TestSVERegisters.py (879 of 2287)
PASS: lldb-unit :: Symbol/./SymbolTests/Type.GetTypeScopeAndBasename (880 of 2287)
PASS: lldb-api :: lang/objc/warnings-in-expr-parser/TestObjCWarningsInExprParser.py (881 of 2287)
PASS: lldb-api :: commands/apropos/basic/TestApropos.py (882 of 2287)
PASS: lldb-api :: lang/cpp/nsimport/TestCppNsImport.py (883 of 2287)
UNSUPPORTED: lldb-api :: benchmarks/turnaround/TestCompileRunToBreakpointTurnaround.py (884 of 2287)
PASS: lldb-api :: functionalities/thread/exit_during_break/TestExitDuringBreak.py (885 of 2287)
PASS: lldb-unit :: SymbolFile/NativePDB/./SymbolFileNativePDBTests/PDBFPOProgramToDWARFExpressionTests.UnknownOp (886 of 2287)
PASS: lldb-api :: commands/target/auto-install-main-executable/TestAutoInstallMainExecutable.py (887 of 2287)
UNSUPPORTED: lldb-shell :: ScriptInterpreter/Lua/quit.test (888 of 2287)
UNSUPPORTED: lldb-shell :: SymbolFile/PDB/function-nested-block.test (889 of 2287)
PASS: lldb-shell :: SymbolFile/symbol-binding.test (890 of 2287)
UNSUPPORTED: lldb-api :: commands/gui/breakpoints/TestGuiBreakpoints.py (891 of 2287)
PASS: lldb-unit :: Utility/./UtilityTests/UriParserTest.BracketedHostnamePort (892 of 2287)
PASS: lldb-unit :: Utility/./UtilityTests/RangeTest.ContainsAddrInvalid (893 of 2287)
PASS: lldb-api :: python_api/get-value-32bit-int/TestGetValue32BitInt.py (894 of 2287)
PASS: lldb-api :: api/multithreaded/TestMultithreaded.py (895 of 2287)
UNSUPPORTED: lldb-shell :: Breakpoint/ppc64-localentry.test (896 of 2287)
PASS: lldb-unit :: Symbol/./SymbolTests/LineEntryTest.GetSameLineContiguousAddressRangeNoInlines (897 of 2287)
PASS: lldb-unit :: Utility/./UtilityTests/LogChannelTest.List (898 of 2287)
PASS: lldb-api :: commands/expression/import-std-module/shared_ptr/TestSharedPtrFromStdModule.py (899 of 2287)
PASS: lldb-unit :: Utility/./UtilityTests/RecordReplayTest.InstrumentedBarRef (900 of 2287)
PASS: lldb-api :: functionalities/thread/concurrent_events/TestConcurrentTwoWatchpointThreads.py (901 of 2287)
PASS: lldb-api :: functionalities/data-formatter/dump_dynamic/TestDumpDynamic.py (902 of 2287)
PASS: lldb-api :: lang/objc/radar-9691614/TestObjCMethodReturningBOOL.py (903 of 2287)
PASS: lldb-api :: functionalities/data-formatter/cstring-utf8-summary/TestCstringUnicode.py (904 of 2287)
PASS: lldb-api :: commands/expression/import-std-module/forward_decl_from_module/TestForwardDeclFromStdModule.py (905 of 2287)
PASS: lldb-api :: lang/objc/conflicting-definition/TestConflictingDefinition.py (906 of 2287)
PASS: lldb-unit :: Utility/./UtilityTests/ScalarTest.ComparisonFloat (907 of 2287)
XFAIL: lldb-shell :: Register/x86-mm-xmm-write.test (908 of 2287)
PASS: lldb-unit :: Utility/./UtilityTests/FileSpecTest.GuessPathStyle (909 of 2287)
PASS: lldb-shell :: Reproducer/TestReuseDirectory.test (910 of 2287)
PASS: lldb-api :: commands/expression/error-limit/TestExprErrorLimit.py (911 of 2287)
PASS: lldb-api :: functionalities/data-formatter/data-formatter-objc/TestDataFormatterObjNSException.py (912 of 2287)
PASS: lldb-shell :: BuildScript/modes.test (913 of 2287)
PASS: lldb-api :: functionalities/data-formatter/data-formatter-objc/TestDataFormatterObjCKVO.py (914 of 2287)
PASS: lldb-api :: functionalities/data-formatter/data-formatter-stl/libcxx/queue/TestDataFormatterLibcxxQueue.py (915 of 2287)
PASS: lldb-unit :: Language/Highlighting/./HighlighterTests/HighlighterTest.ClangTrailingBackslashWithWhitespace (916 of 2287)
PASS: lldb-unit :: Process/gdb-remote/./ProcessGdbRemoteTests/GDBRemoteCommunicationClientTest.GetQOffsets (917 of 2287)
PASS: lldb-shell :: SymbolFile/DWARF/x86/find-variable-dwo.cpp (918 of 2287)
PASS: lldb-unit :: Language/Highlighting/./HighlighterTests/HighlighterTest.ClangPreserveNewLine (919 of 2287)
PASS: lldb-unit :: Utility/./UtilityTests/BroadcasterTest.EventTypeHasListeners (920 of 2287)
PASS: lldb-api :: lang/c/register_variables/TestRegisterVariables.py (921 of 2287)
PASS: lldb-unit :: ObjectFile/Breakpad/./ObjectFileBreakpadTests/InfoRecord.parse (922 of 2287)
PASS: lldb-unit :: Utility/./UtilityTests/RangeTest.SetRangeBase (923 of 2287)
PASS: lldb-unit :: Host/./HostTests/NativeProcessProtocolTest.ReadCStringFromMemory_CrossPageBoundary (924 of 2287)
PASS: lldb-shell :: ObjectFile/ELF/section-types.yaml (925 of 2287)
PASS: lldb-unit :: SymbolFile/DWARF/./SymbolFileDWARFTests/SymbolFileDWARFTests.TestAbilitiesForDWARF (926 of 2287)
PASS: lldb-shell :: Driver/TestNoUseColor.test (927 of 2287)
PASS: lldb-api :: lang/objc/print-obj/TestPrintObj.py (928 of 2287)
PASS: lldb-api :: commands/frame/select/TestFrameSelect.py (929 of 2287)
UNSUPPORTED: lldb-api :: functionalities/breakpoint/breakpoint_in_delayslot/TestAvoidBreakpointInDelaySlot.py (930 of 2287)
PASS: lldb-api :: commands/expression/inline-namespace/TestInlineNamespace.py (931 of 2287)
PASS: lldb-api :: functionalities/data-formatter/var-in-aggregate-misuse/TestVarInAggregateMisuse.py (932 of 2287)
PASS: lldb-unit :: Utility/./UtilityTests/OptionsWithRawTest.ArgsButNoLeadingDash (933 of 2287)
PASS: lldb-api :: functionalities/process_group/TestChangeProcessGroup.py (934 of 2287)
PASS: lldb-shell :: Breakpoint/split-dwarf5-debug-stroffsets.test (935 of 2287)
PASS: lldb-api :: tools/lldb-vscode/coreFile/TestVSCode_coreFile.py (936 of 2287)
PASS: lldb-api :: commands/reproducer/invalid-args/TestInvalidArgsReproducer.py (937 of 2287)
PASS: lldb-api :: commands/breakpoint/set/func-regex/TestBreakpointRegexError.py (938 of 2287)
PASS: lldb-api :: functionalities/step_scripted/TestStepScripted.py (939 of 2287)
PASS: lldb-unit :: tools/lldb-server/tests/./LLDBServerTests/StandardStartupTest.TestStopReplyContainsThreadPcs (940 of 2287)
PASS: lldb-unit :: Utility/./UtilityTests/NameMatchesTest.Contains (941 of 2287)
PASS: lldb-api :: functionalities/data-formatter/data-formatter-objc/TestDataFormatterObjCNSError.py (942 of 2287)
PASS: lldb-api :: functionalities/data-formatter/type_summary_list_script/TestTypeSummaryListScript.py (943 of 2287)
PASS: lldb-shell :: Breakpoint/debug_rnglist_offset_pair.test (944 of 2287)
PASS: lldb-unit :: SymbolFile/DWARF/./SymbolFileDWARFTests/DWARFUnitTest.NullUnitDie (945 of 2287)
PASS: lldb-shell :: ObjectFile/ELF/short-build-id.yaml (946 of 2287)
PASS: lldb-api :: lang/cpp/scope/TestCppScope.py (947 of 2287)
PASS: lldb-unit :: DataFormatter/./LLDBFormatterTests/FormatManagerTests.CompatibleLangs (948 of 2287)
PASS: lldb-unit :: Utility/./UtilityTests/FileSpecTest.Match (949 of 2287)
UNSUPPORTED: lldb-api :: linux/sepdebugsymlink/TestTargetSymbolsSepDebugSymlink.py (950 of 2287)
PASS: lldb-unit :: Utility/./UtilityTests/StreamTeeTest.Write (951 of 2287)
PASS: lldb-shell :: Commands/command-regex-unalias.test (952 of 2287)
PASS: lldb-api :: lang/cpp/template-arguments/TestCppTemplateArguments.py (953 of 2287)
PASS: lldb-api :: functionalities/data-formatter/typedef_array/TestTypedefArray.py (954 of 2287)
PASS: lldb-unit :: Utility/./UtilityTests/RegularExpression.Invalid (955 of 2287)
PASS: lldb-unit :: UnwindAssembly/x86/./UnwindAssemblyx86Tests/Testx86AssemblyInspectionEngine.TestPushRBPWithREX (956 of 2287)
PASS: lldb-shell :: SymbolFile/DWARF/x86/DW_AT_const_value-bitfields.s (957 of 2287)
UNSUPPORTED: lldb-shell :: BuildScript/toolchain-clang-cl.test (958 of 2287)
PASS: lldb-unit :: Language/Highlighting/./HighlighterTests/HighlighterTest.ClangBraces (959 of 2287)
PASS: lldb-unit :: Utility/./UtilityTests/StringListTest.ForRangeEmpty (960 of 2287)
PASS: lldb-api :: commands/process/attach/TestProcessAttach.py (961 of 2287)
PASS: lldb-unit :: Utility/./UtilityTests/DataExtractorTest.GetSLEB128_bit63 (962 of 2287)
PASS: lldb-api :: functionalities/tail_call_frames/cross_object/TestCrossObjectTailCalls.py (963 of 2287)
PASS: lldb-unit :: Process/minidump/./LLDBMinidumpTests/MinidumpParserTest.GetThreadContext_x86_32_wow64 (964 of 2287)
PASS: lldb-api :: tools/lldb-vscode/console/TestVSCode_console.py (965 of 2287)
PASS: lldb-api :: api/command-return-object/TestSBCommandReturnObject.py (966 of 2287)
UNSUPPORTED: lldb-shell :: Subprocess/vfork-follow-parent-wp.test (967 of 2287)
PASS: lldb-unit :: Utility/./UtilityTests/StringExtractorTest.GetU32LittleEndian (968 of 2287)
PASS: lldb-shell :: Driver/TestConvenienceVariables.test (969 of 2287)
PASS: lldb-api :: commands/watchpoints/hello_watchpoint/TestMyFirstWatchpoint.py (970 of 2287)
PASS: lldb-shell :: Driver/TestHelp.test (971 of 2287)
PASS: lldb-unit :: Utility/./UtilityTests/StreamTest.AddressRange (972 of 2287)
UNSUPPORTED: lldb-api :: commands/expression/call-restarts/TestCallThatRestarts.py (973 of 2287)
PASS: lldb-api :: functionalities/data-formatter/user-format-vs-summary/TestUserFormatVsSummary.py (974 of 2287)
PASS: lldb-unit :: Language/Highlighting/./HighlighterTests/HighlighterTest.ClangCommas (975 of 2287)
PASS: lldb-unit :: Symbol/./SymbolTests/TestTypeSystemClang.TestRemoveFastQualifiers (976 of 2287)
PASS: lldb-unit :: debugserver/./debugserverTests/RNBSocket.LoopBackConnectIPv6 (977 of 2287)
PASS: lldb-unit :: Utility/./UtilityTests/RangeDataVector.FindEntryThatContains (978 of 2287)
PASS: lldb-api :: functionalities/data-formatter/data-formatter-stl/libcxx/vbool/TestDataFormatterLibcxxVBool.py (979 of 2287)
PASS: lldb-shell :: ObjectFile/PDB/object.test (980 of 2287)
PASS: lldb-api :: functionalities/data-formatter/data-formatter-stl/libcxx/atomic/TestLibCxxAtomic.py (981 of 2287)
PASS: lldb-unit :: SymbolFile/DWARF/./SymbolFileDWARFTests/SymbolFileDWARFTests.ParseArangesWithMultipleTerminators (982 of 2287)
PASS: lldb-api :: lang/cpp/char1632_t/TestChar1632T.py (983 of 2287)
PASS: lldb-shell :: BuildScript/script-args.test (984 of 2287)
PASS: lldb-unit :: Utility/./UtilityTests/ArgsTest.TestQuotedUnknownEscape (985 of 2287)
PASS: lldb-api :: functionalities/gdb_remote_client/TestRemoteRegNums.py (986 of 2287)
PASS: lldb-unit :: UnwindAssembly/x86/./UnwindAssemblyx86Tests/Testx86AssemblyInspectionEngine.TestAddESP (987 of 2287)
PASS: lldb-api :: python_api/sbstructureddata/TestStructuredDataAPI.py (988 of 2287)
PASS: lldb-unit :: Core/./LLDBCoreTests/StreamCallbackTest.Callback (989 of 2287)
PASS: lldb-unit :: Utility/./UtilityTests/OptionsWithRawTest.WhitespaceInput (990 of 2287)
PASS: lldb-shell :: ObjectFile/PECOFF/basic-info-arm64.yaml (991 of 2287)
PASS: lldb-unit :: ObjectFile/Breakpad/./ObjectFileBreakpadTests/ModuleRecord.parse (992 of 2287)
PASS: lldb-shell :: SymbolFile/DWARF/x86/find-variable-file.cpp (993 of 2287)
PASS: lldb-unit :: Symbol/./SymbolTests/TestClangASTImporter.MetadataPropagationIndirectImport (994 of 2287)
PASS: lldb-api :: functionalities/unwind/noreturn/TestNoreturnUnwind.py (995 of 2287)
PASS: lldb-unit :: Process/gdb-remote/./ProcessGdbRemoteTests/PortMapTest.Constructors (996 of 2287)
UNSUPPORTED: lldb-api :: arm/breakpoint-it/TestBreakpointIt.py (997 of 2287)
PASS: lldb-unit :: Host/./HostTests/MainLoopTest.TerminatesImmediately (998 of 2287)
PASS: lldb-api :: commands/thread/select/TestThreadSelect.py (999 of 2287)
UNSUPPORTED: lldb-shell :: Reproducer/TestLuaImport.test (1000 of 2287)
PASS: lldb-unit :: ScriptInterpreter/Python/./ScriptInterpreterPythonTests/PythonDataObjectsTest.TestPythonCallableCheck (1001 of 2287)
PASS: lldb-api :: functionalities/postmortem/elf-core/TestLinuxCore.py (1002 of 2287)
PASS: lldb-api :: commands/expression/import-std-module/deque-basic/TestDequeFromStdModule.py (1003 of 2287)
PASS: lldb-api :: commands/frame/diagnose/array/TestArray.py (1004 of 2287)
PASS: lldb-api :: commands/expression/calculator_mode/TestCalculatorMode.py (1005 of 2287)
PASS: lldb-unit :: Utility/./UtilityTests/StringListTest.InsertStringAtIndexStdString (1006 of 2287)
PASS: lldb-unit :: ScriptInterpreter/Python/./ScriptInterpreterPythonTests/PythonDataObjectsTest.TestPythonCallableInvoke (1007 of 2287)
PASS: lldb-unit :: Utility/./UtilityTests/ArgsTest.TestSingleArgWithQuotedSpace (1008 of 2287)
PASS: lldb-shell :: SymbolFile/DWARF/x86/find-qualified-variable.cpp (1009 of 2287)
PASS: lldb-api :: tools/lldb-server/TestGdbRemoteThreadsInStopReply.py (1010 of 2287)
PASS: lldb-unit :: Utility/./UtilityTests/StringListTest.LongestCommonPrefixDuplicateElement (1011 of 2287)
UNSUPPORTED: lldb-shell :: SymbolFile/PDB/typedefs.test (1012 of 2287)
PASS: lldb-unit :: Utility/./UtilityTests/UriParserTest.PortOverflow (1013 of 2287)
PASS: lldb-api :: functionalities/breakpoint/debugbreak/TestDebugBreak.py (1014 of 2287)
PASS: lldb-unit :: Utility/./UtilityTests/OptionsWithRawTest.ArgsButNoDelimiter (1015 of 2287)
PASS: lldb-shell :: Process/Optimization.test (1016 of 2287)
PASS: lldb-unit :: Language/Highlighting/./HighlighterTests/HighlighterTest.ClangCursorOutOfBounds (1017 of 2287)
PASS: lldb-unit :: Utility/./UtilityTests/XcodeSDKTest.SDKSupportsModules (1018 of 2287)
PASS: lldb-api :: commands/watchpoints/watchpoint_count/TestWatchpointCount.py (1019 of 2287)
PASS: lldb-api :: functionalities/data-formatter/data-formatter-skip-summary/TestDataFormatterSkipSummary.py (1020 of 2287)
PASS: lldb-api :: commands/expression/context-object-objc/TestContextObjectObjc.py (1021 of 2287)
PASS: lldb-unit :: Utility/./UtilityTests/StringListTest.CopyListSingle (1022 of 2287)
PASS: lldb-unit :: Utility/./UtilityTests/ScalarTest.Promotion (1023 of 2287)
PASS: lldb-unit :: UnwindAssembly/x86/./UnwindAssemblyx86Tests/Testx86AssemblyInspectionEngine.TestPushEBP (1024 of 2287)
PASS: lldb-unit :: Process/Utility/./ProcessUtilityTests/RegisterContext_x86Test.AbridgedToFullTagWord (1025 of 2287)
PASS: lldb-shell :: SymbolFile/DWARF/x86/debug-types-dwarf5.s (1026 of 2287)
UNSUPPORTED: lldb-api :: benchmarks/continue/TestBenchmarkContinue.py (1027 of 2287)
PASS: lldb-unit :: Host/./HostTests/SocketTests/SocketTest.TCPListen0GetPort/ipv6 (1028 of 2287)
PASS: lldb-api :: lang/cpp/inlines/TestInlines.py (1029 of 2287)
PASS: lldb-api :: macosx/version_zero/TestGetVersionZeroVersion.py (1030 of 2287)
PASS: lldb-unit :: Process/minidump/./LLDBMinidumpTests/MinidumpParserTest.MinidumpDuplicateModuleMappedSecondHigh (1031 of 2287)
PASS: lldb-unit :: Symbol/./SymbolTests/PostfixExpression.ToDWARF (1032 of 2287)
PASS: lldb-api :: functionalities/pointer_num_children/TestPointerNumChildren.py (1033 of 2287)
PASS: lldb-api :: functionalities/thread/concurrent_events/TestConcurrentDelayedCrashWithBreakpointSignal.py (1034 of 2287)
PASS: lldb-api :: functionalities/tail_call_frames/disambiguate_call_site/TestDisambiguateCallSite.py (1035 of 2287)
PASS: lldb-unit :: Utility/./UtilityTests/StringExtractorTest.GetHexU8_Underflow_NoEof (1036 of 2287)
PASS: lldb-api :: functionalities/gdb_remote_client/TestNestedRegDefinitions.py (1037 of 2287)
PASS: lldb-unit :: Utility/./UtilityTests/StringListTest.AppendStringStdString (1038 of 2287)
PASS: lldb-unit :: Utility/./UtilityTests/PassiveReplayTest.InstrumentedBarRef (1039 of 2287)
PASS: lldb-api :: commands/platform/basic/TestPlatformCommand.py (1040 of 2287)
PASS: lldb-unit :: Utility/./UtilityTests/RecordReplayTest.InvalidSequence (1041 of 2287)
PASS: lldb-shell :: Breakpoint/jit-loader_jitlink_elf.test (1042 of 2287)
PASS: lldb-api :: lang/objc/direct-dispatch-step/TestObjCDirectDispatchStepping.py (1043 of 2287)
PASS: lldb-shell :: SymbolFile/Breakpad/line-table-edgecases.test (1044 of 2287)
PASS: lldb-unit :: SymbolFile/NativePDB/./SymbolFileNativePDBTests/PDBFPOProgramToDWARFExpressionTests.MultipleDependentAssignments (1045 of 2287)
PASS: lldb-api :: python_api/sbplatform/TestSBPlatform.py (1046 of 2287)
UNSUPPORTED: lldb-api :: commands/gui/viewlarge/TestGuiViewLarge.py (1047 of 2287)
PASS: lldb-api :: commands/process/launch/TestProcessLaunch.py (1048 of 2287)
PASS: lldb-api :: commands/expression/namespace_local_var_same_name_obj_c/TestNamespaceLocalVarSameNameObjC.py (1049 of 2287)
PASS: lldb-api :: macosx/find-app-in-bundle/TestFindAppInBundle.py (1050 of 2287)
UNSUPPORTED: lldb-api :: tools/lldb-server/TestGdbRemoteModuleInfo.py (1051 of 2287)
PASS: lldb-api :: commands/session/history/TestSessionHistory.py (1052 of 2287)
PASS: lldb-unit :: Utility/./UtilityTests/UriParserTest.MinimalPortPath (1053 of 2287)
PASS: lldb-api :: functionalities/data-formatter/synthcapping/TestSyntheticCapping.py (1054 of 2287)
PASS: lldb-shell :: SymbolFile/DWARF/x86/dir-separator-posix.s (1055 of 2287)
PASS: lldb-api :: python_api/frame/inlines/TestInlinedFrame.py (1056 of 2287)
PASS: lldb-shell :: SymbolFile/DWARF/clang-ast-from-dwarf-objc-property.m (1057 of 2287)
PASS: lldb-api :: lang/objc/foundation/TestConstStrings.py (1058 of 2287)
PASS: lldb-unit :: UnwindAssembly/x86/./UnwindAssemblyx86Tests/Testx86AssemblyInspectionEngine.Test64bitFramelessSmallStackFrame (1059 of 2287)
PASS: lldb-api :: commands/expression/formatters/TestFormatters.py (1060 of 2287)
PASS: lldb-api :: functionalities/thread/concurrent_events/TestConcurrentWatchpointWithDelayWatchpointThreads.py (1061 of 2287)
PASS: lldb-unit :: Utility/./UtilityTests/StringLexerTest.NextIf (1062 of 2287)
PASS: lldb-api :: functionalities/stats_api/TestStatisticsAPI.py (1063 of 2287)
PASS: lldb-unit :: Utility/./UtilityTests/TimerTest.CategoryTimesStats (1064 of 2287)
PASS: lldb-unit :: Utility/./UtilityTests/SerializationRountripTest.SerializeDeserializePodReferences (1065 of 2287)
PASS: lldb-api :: sample_test/TestSampleInlineTest.py (1066 of 2287)
PASS: lldb-unit :: Utility/./UtilityTests/StringListTest.Join (1067 of 2287)
PASS: lldb-api :: commands/quit/TestQuit.py (1068 of 2287)
PASS: lldb-shell :: Reproducer/Modules/TestModuleCXX.test (1069 of 2287)
PASS: lldb-shell :: Quit/TestQuitExitCodeHexA.test (1070 of 2287)
PASS: lldb-api :: lang/cpp/class_types/TestClassTypes.py (1071 of 2287)
PASS: lldb-api :: lang/cpp/rvalue-references/TestRvalueReferences.py (1072 of 2287)
PASS: lldb-api :: lang/cpp/breakpoint_in_member_func_w_non_primitive_params/TestBreakpointInMemberFuncWNonPrimitiveParams.py (1073 of 2287)
UNSUPPORTED: lldb-api :: functionalities/gdb_remote_client/TestAArch64XMLRegOffsets.py (1074 of 2287)
UNSUPPORTED: lldb-api :: functionalities/data-formatter/data-formatter-stl/libstdcpp/vbool/TestDataFormatterStdVBool.py (1075 of 2287)
PASS: lldb-unit :: Symbol/./SymbolTests/TestTypeSystemClang.OnlyPackName (1076 of 2287)
PASS: lldb-api :: linux/builtin_trap/TestBuiltinTrap.py (1077 of 2287)
UNSUPPORTED: lldb-shell :: Breakpoint/case-insensitive.test (1078 of 2287)
PASS: lldb-unit :: UnwindAssembly/x86/./UnwindAssemblyx86Tests/Testx86AssemblyInspectionEngine.Test64bitFramelessBigStackFrame (1079 of 2287)
PASS: lldb-unit :: Host/./HostTests/SocketTests/SocketTest.DomainListenConnectAccept/ipv6 (1080 of 2287)
PASS: lldb-shell :: SymbolFile/NativePDB/ast-methods.cpp (1081 of 2287)
PASS: lldb-api :: functionalities/thread/state_after_expression/TestStateAfterExpression.py (1082 of 2287)
PASS: lldb-api :: lang/objc/objc-static-method-stripped/TestObjCStaticMethodStripped.py (1083 of 2287)
PASS: lldb-api :: lang/c/record_decl_in_expr/TestRecordDeclInExpr.py (1084 of 2287)
UNSUPPORTED: lldb-shell :: Register/x86-ymm-write.test (1085 of 2287)
PASS: lldb-api :: lang/cpp/this_class_type_mixing/TestThisClassTypeMixing.py (1086 of 2287)
PASS: lldb-unit :: Utility/./UtilityTests/BinaryStreamTest.PutSLEB128SevenBytes (1087 of 2287)
PASS: lldb-api :: functionalities/data-formatter/nssetsynth/TestNSSetSynthetic.py (1088 of 2287)
PASS: lldb-shell :: Reproducer/Functionalities/TestExpressionEvaluation.test (1089 of 2287)
PASS: lldb-unit :: Language/Highlighting/./HighlighterTests/HighlighterTest.ClangCursorPosEndOfLine (1090 of 2287)
PASS: lldb-api :: python_api/file_handle/TestFileHandle.py (1091 of 2287)
PASS: lldb-unit :: Expression/./ExpressionTests/ClangHostTest.MacOSX (1092 of 2287)
PASS: lldb-unit :: Symbol/./SymbolTests/TestClangASTImporter.MetadataPropagationAfterCopying (1093 of 2287)
PASS: lldb-unit :: Language/Highlighting/./HighlighterTests/HighlighterTest.FallbackHighlighter (1094 of 2287)
PASS: lldb-api :: functionalities/breakpoint/comp_dir_symlink/TestCompDirSymLink.py (1095 of 2287)
PASS: lldb-api :: lang/objc/objc-dyn-sbtype/TestObjCDynamicSBType.py (1096 of 2287)
PASS: lldb-unit :: Platform/Android/./AdbClientTests/AdbClientTest.CreateByDeviceId (1097 of 2287)
PASS: lldb-api :: commands/target/stop-hook/disable/TestTargetStopHookDisable.py (1098 of 2287)
PASS: lldb-unit :: Language/Highlighting/./HighlighterTests/HighlighterTest.ClangStringLiterals (1099 of 2287)
PASS: lldb-api :: functionalities/data-formatter/data-formatter-objc/nsstring/TestDataFormatterNSString.py (1100 of 2287)
PASS: lldb-unit :: Utility/./UtilityTests/StreamTeeTest.DefaultConstructor (1101 of 2287)
PASS: lldb-api :: functionalities/inferior-crashing/recursive-inferior/TestRecursiveInferior.py (1102 of 2287)
PASS: lldb-unit :: Utility/./UtilityTests/StringListTest.InsertStringAtIndexStart (1103 of 2287)
PASS: lldb-api :: lang/c/shared_lib_stripped_symbols/TestSharedLibStrippedSymbols.py (1104 of 2287)
PASS: lldb-unit :: Symbol/./SymbolTests/TestTypeSystemClang.TestGetBasicTypeFromName (1105 of 2287)
PASS: lldb-shell :: SymbolFile/DWARF/x86/debug-types-basic.test (1106 of 2287)
PASS: lldb-unit :: Utility/./UtilityTests/RangeDataVector.FindEntryIndexesThatContain (1107 of 2287)
PASS: lldb-api :: lang/cpp/std-function-step-into-callable/TestStdFunctionStepIntoCallable.py (1108 of 2287)
PASS: lldb-api :: macosx/nslog/TestDarwinNSLogOutput.py (1109 of 2287)
PASS: lldb-api :: commands/expression/persistent_variables/TestPersistentVariables.py (1110 of 2287)
PASS: lldb-api :: lang/c/vla/TestVLA.py (1111 of 2287)
PASS: lldb-unit :: Utility/./UtilityTests/ArchSpecTest.TripleComponentsWereSpecified (1112 of 2287)
PASS: lldb-unit :: Utility/./UtilityTests/StreamTest.PutBytesAsRawHex8ToMixedEndian (1113 of 2287)
PASS: lldb-unit :: Expression/./ExpressionTests/DiagnosticManagerTest.GetStringBasic (1114 of 2287)
PASS: lldb-unit :: UnwindAssembly/x86/./UnwindAssemblyx86Tests/Testx86AssemblyInspectionEngine.TestAddRSP (1115 of 2287)
PASS: lldb-unit :: Utility/./UtilityTests/BinaryStreamTest.PutULEB128MaxValue (1116 of 2287)
PASS: lldb-api :: commands/expression/import-std-module/iterator/TestIteratorFromStdModule.py (1117 of 2287)
PASS: lldb-api :: functionalities/scripted_process/TestScriptedProcess.py (1118 of 2287)
PASS: lldb-unit :: Expression/./ExpressionTests/CppModuleConfigurationTest.IgnoreLibStdCpp (1119 of 2287)
PASS: lldb-unit :: Utility/./UtilityTests/RangeTest.Constructor (1120 of 2287)
PASS: lldb-unit :: UnwindAssembly/x86/./UnwindAssemblyx86Tests/Testx86AssemblyInspectionEngine.TestSimple32bitFrameFunction (1121 of 2287)
UNSUPPORTED: lldb-shell :: SymbolFile/NativePDB/local-variables.cpp (1122 of 2287)
PASS: lldb-api :: commands/expression/function_template_specialization_temp_args/TestFunctionTemplateSpecializationTempArgs.py (1123 of 2287)
PASS: lldb-unit :: Symbol/./SymbolTests/SymbolsTest.TerminateLocateExecutableSymbolFileForUnknownExecutableAndUnknownSymbolFile (1124 of 2287)
PASS: lldb-unit :: Utility/./UtilityTests/ArchSpecTest.OperatorBool (1125 of 2287)
PASS: lldb-api :: commands/expression/import-std-module/missing-module-sources/TestStdModuleSourcesMissing.py (1126 of 2287)
PASS: lldb-unit :: Language/Highlighting/./HighlighterTests/HighlighterTest.ClangEmptyInput (1127 of 2287)
PASS: lldb-shell :: ObjectFile/ELF/netbsd-exec-8.99.30-amd64.yaml (1128 of 2287)
PASS: lldb-shell :: ObjectFile/ELF/PT_LOAD-overlap-PT_TLS.yaml (1129 of 2287)
PASS: lldb-api :: lang/objc/foundation/TestObjCMethodsNSArray.py (1130 of 2287)
PASS: lldb-api :: lang/objc/objc-struct-return/TestObjCStructReturn.py (1131 of 2287)
PASS: lldb-unit :: ObjectFile/ELF/./ObjectFileELFTests/ObjectFileELFTest.GetSymtab_NoSymEntryPointArmAddressClass (1132 of 2287)
PASS: lldb-api :: functionalities/data-formatter/data-formatter-stl/libcxx/set/TestDataFormatterLibcxxSet.py (1133 of 2287)
PASS: lldb-unit :: SymbolFile/DWARF/./SymbolFileDWARFTests/SymbolFileDWARFTests.TestAbbrevOutOfOrder (1134 of 2287)
PASS: lldb-unit :: Utility/./UtilityTests/ConstStringTest.YAML (1135 of 2287)
PASS: lldb-unit :: Utility/./UtilityTests/ConstStringTest.MangledCounterpart (1136 of 2287)
UNSUPPORTED: lldb-shell :: Register/arm-gp-read.test (1137 of 2287)
PASS: lldb-unit :: SymbolFile/DWARF/./SymbolFileDWARFTests/XcodeSDKModuleTests.TestModuleGetXcodeSDK (1138 of 2287)
PASS: lldb-shell :: Commands/command-backtrace.test (1139 of 2287)
PASS: lldb-shell :: SymbolFile/DWARF/x86/childless-compile-unit.s (1140 of 2287)
PASS: lldb-api :: commands/version/TestVersion.py (1141 of 2287)
PASS: lldb-shell :: SymbolFile/DWARF/deterministic-build.cpp (1142 of 2287)
PASS: lldb-api :: commands/expression/xvalue/TestXValuePrinting.py (1143 of 2287)
PASS: lldb-api :: commands/expression/expr-in-syscall/TestExpressionInSyscall.py (1144 of 2287)
PASS: lldb-api :: lang/cpp/unsigned_types/TestUnsignedTypes.py (1145 of 2287)
PASS: lldb-api :: commands/register/register/register_command/TestRegisters.py (1146 of 2287)
PASS: lldb-unit :: Utility/./UtilityTests/XcodeSDKTest.SDKSupportsSwift (1147 of 2287)
PASS: lldb-unit :: Utility/./UtilityTests/StreamTest.ChangingByteOrder (1148 of 2287)
PASS: lldb-unit :: Symbol/./SymbolTests/TestClangASTImporter.DeportTypeTagDecl (1149 of 2287)
PASS: lldb-unit :: Target/./TargetTests/ExecutionContextTest.GetByteOrderProcess (1150 of 2287)
PASS: lldb-unit :: ScriptInterpreter/Python/./ScriptInterpreterPythonTests/PythonDataObjectsTest.TestPythonStringToStr (1151 of 2287)
PASS: lldb-api :: functionalities/type_lookup/TestTypeLookup.py (1152 of 2287)
PASS: lldb-api :: types/TestIntegerType.py (1153 of 2287)
PASS: lldb-unit :: Interpreter/./InterpreterTests/TestProperties.DeepCopy (1154 of 2287)
PASS: lldb-unit :: Utility/./UtilityTests/StringListTest.AppendStringCString (1155 of 2287)
PASS: lldb-api :: commands/expression/test/TestExprs2.py (1156 of 2287)
PASS: lldb-unit :: Process/minidump/./LLDBMinidumpTests/RegisterContextMinidump.ConvertMinidumpContext_x86_32 (1157 of 2287)
PASS: lldb-unit :: Utility/./UtilityTests/RegisterValueTest.GetSet8 (1158 of 2287)
PASS: lldb-unit :: Utility/./UtilityTests/StreamTest.AddressNoSuffix (1159 of 2287)
PASS: lldb-shell :: SymbolFile/DWARF/x86/DW_TAG_basic_type_DW_ATE_UTF_nonC.ll (1160 of 2287)
PASS: lldb-unit :: Utility/./UtilityTests/StringExtractorTest.GetHexU8_Extra_NoEof (1161 of 2287)
UNSUPPORTED: lldb-shell :: Register/x86-64-xmm16-read.test (1162 of 2287)
PASS: lldb-shell :: ObjectFile/ELF/build-id-case.yaml (1163 of 2287)
PASS: lldb-unit :: ScriptInterpreter/Python/./ScriptInterpreterPythonTests/PythonDataObjectsTest.TestPythonListValueEquality (1164 of 2287)
PASS: lldb-shell :: ObjectFile/wasm/basic.yaml (1165 of 2287)
PASS: lldb-api :: functionalities/fat_archives/TestFatArchives.py (1166 of 2287)
PASS: lldb-shell :: SymbolFile/DWARF/x86/dir-separator-no-comp-dir-relative-name.s (1167 of 2287)
PASS: lldb-api :: functionalities/memory/find/TestMemoryFind.py (1168 of 2287)
PASS: lldb-unit :: Interpreter/./InterpreterTests/OptionArgParserTest.toChar (1169 of 2287)
PASS: lldb-unit :: Process/gdb-remote/./ProcessGdbRemoteTests/GDBRemoteCommunicationClientTest.SendSignalsToIgnore (1170 of 2287)
PASS: lldb-unit :: Utility/./UtilityTests/StringExtractorTest.GetNameColonValueSuccess (1171 of 2287)
PASS: lldb-api :: functionalities/thread/step_out/TestThreadStepOut.py (1172 of 2287)
PASS: lldb-unit :: Utility/./UtilityTests/StringLexerTest.GetUnlexed (1173 of 2287)
PASS: lldb-unit :: DataFormatter/./LLDBFormatterTests/TypeMatcherTests.RegexMatchPart (1174 of 2287)
PASS: lldb-unit :: Utility/./UtilityTests/StringLexerTest.Next (1175 of 2287)
PASS: lldb-unit :: Utility/./UtilityTests/UriParserTest.BracketedHostnameWithPortIPv4 (1176 of 2287)
PASS: lldb-api :: lang/cpp/class-template-parameter-pack/TestClassTemplateParameterPack.py (1177 of 2287)
PASS: lldb-api :: macosx/queues/TestQueues.py (1178 of 2287)
PASS: lldb-shell :: SymbolFile/Breakpad/line-table.test (1179 of 2287)
PASS: lldb-unit :: Process/Utility/./ProcessUtilityTests/ProcMapTests/LinuxProcMapsTestFixture.ParseMapRegions/0 (1180 of 2287)
PASS: lldb-unit :: Utility/./UtilityTests/UriParserTest.BracketedHostnameWithColon (1181 of 2287)
PASS: lldb-unit :: Symbol/./SymbolTests/TestTypeSystemClang.TestFunctionTemplateInRecordConstruction (1182 of 2287)
UNSUPPORTED: lldb-api :: commands/gui/basicdebug/TestGuiBasicDebug.py (1183 of 2287)
PASS: lldb-shell :: Reproducer/TestHomeDir.test (1184 of 2287)
PASS: lldb-api :: functionalities/unwind/zeroth_frame/TestZerothFrame.py (1185 of 2287)
PASS: lldb-api :: types/TestDoubleTypes.py (1186 of 2287)
PASS: lldb-unit :: Utility/./UtilityTests/StreamTeeTest.SetStreamAtIndexOverwrite (1187 of 2287)
PASS: lldb-api :: functionalities/breakpoint/step_over_breakpoint/TestStepOverBreakpoint.py (1188 of 2287)
PASS: lldb-shell :: SymbolFile/NativePDB/s_constant.cpp (1189 of 2287)
PASS: lldb-unit :: Utility/./UtilityTests/StringListTest.DefaultConstructor (1190 of 2287)
PASS: lldb-unit :: Utility/./UtilityTests/StringListTest.JoinNonSpace (1191 of 2287)
PASS: lldb-shell :: SymbolFile/NativePDB/locate-pdb.cpp (1192 of 2287)
UNSUPPORTED: lldb-shell :: SymbolFile/PDB/udt-layout.test (1193 of 2287)
PASS: lldb-shell :: Reproducer/TestCrash.test (1194 of 2287)
UNSUPPORTED: lldb-api :: tools/lldb-server/TestGdbRemoteAuxvSupport.py (1195 of 2287)
PASS: lldb-api :: functionalities/target_var/no_vars/TestTargetVarNoVars.py (1196 of 2287)
PASS: lldb-api :: macosx/profile_vrs_detach/TestDetachVrsProfile.py (1197 of 2287)
PASS: lldb-shell :: Settings/TestDefaultModuleCachePath.test (1198 of 2287)
PASS: lldb-unit :: Utility/./UtilityTests/BinaryStreamTest.PutSLEB128TwoBytes (1199 of 2287)
PASS: lldb-unit :: Utility/./UtilityTests/StreamTest.PutNHex8 (1200 of 2287)
PASS: lldb-unit :: Utility/./UtilityTests/GeneratorTest.GetOrCreate (1201 of 2287)
PASS: lldb-unit :: Host/./HostTests/SocketTests/SocketTest.DomainListenConnectAccept/ipv4 (1202 of 2287)
PASS: lldb-unit :: Expression/./ExpressionTests/CppModuleConfigurationTest.AmbiguousLibCpp (1203 of 2287)
PASS: lldb-api :: functionalities/data-formatter/data-formatter-proper-plurals/TestFormattersOneIsSingular.py (1204 of 2287)
PASS: lldb-unit :: Expression/./ExpressionTests/DiagnosticManagerTest.AppendMessageSubsequentDiags (1205 of 2287)
PASS: lldb-unit :: Utility/./UtilityTests/StateTest.Formatv (1206 of 2287)
PASS: lldb-api :: commands/expression/import-std-module/vector-of-vectors/TestVectorOfVectorsFromStdModule.py (1207 of 2287)
PASS: lldb-unit :: Language/Highlighting/./HighlighterTests/HighlighterTest.ClangComments (1208 of 2287)
PASS: lldb-shell :: SymbolFile/DWARF/x86/debug_loc.s (1209 of 2287)
PASS: lldb-unit :: Utility/./UtilityTests/RecordReplayTest.InstrumentedBar (1210 of 2287)
PASS: lldb-unit :: Symbol/./SymbolTests/TestTypeSystemClang.TestNotDeletingUserCopyCstrDueToMoveCStr (1211 of 2287)
PASS: lldb-unit :: Host/./HostTests/NativeProcessProtocolTest.SetBreakpointFailVerify (1212 of 2287)
PASS: lldb-api :: macosx/thread_suspend/TestInternalThreadSuspension.py (1213 of 2287)
PASS: lldb-unit :: Utility/./UtilityTests/OptionsWithRawTest.EmptyInput (1214 of 2287)
PASS: lldb-api :: functionalities/data-formatter/data-formatter-synth/TestDataFormatterSynth.py (1215 of 2287)
PASS: lldb-shell :: SymbolFile/DWARF/x86/parallel-indexing-stress.s (1216 of 2287)
UNSUPPORTED: lldb-shell :: SymbolFile/Breakpad/stack-cfi-arm.yaml (1217 of 2287)
PASS: lldb-api :: lang/c/shared_lib/TestSharedLib.py (1218 of 2287)
PASS: lldb-api :: commands/watchpoints/multiple_hits/TestMultipleHits.py (1219 of 2287)
PASS: lldb-api :: lang/c/stepping/TestThreadStepInAvoidRegexp.py (1220 of 2287)
PASS: lldb-unit :: SymbolFile/NativePDB/./SymbolFileNativePDBTests/PDBFPOProgramToDWARFExpressionTests.UnresolvedDependentCyclicRegisterAssignmentReference (1221 of 2287)
PASS: lldb-api :: commands/expression/char/TestExprsChar.py (1222 of 2287)
PASS: lldb-api :: python_api/process/read-mem-cstring/TestReadMemCString.py (1223 of 2287)
PASS: lldb-api :: python_api/breakpoint/TestBreakpointAPI.py (1224 of 2287)
PASS: lldb-api :: lang/objc/modules-objc-property/TestModulesObjCProperty.py (1225 of 2287)
PASS: lldb-api :: commands/target/dump-symtab-demangle/TestDumpSymtabDemangle.py (1226 of 2287)
PASS: lldb-api :: commands/expression/rdar44436068/Test128BitsInteger.py (1227 of 2287)
PASS: lldb-api :: tools/lldb-vscode/attach/TestVSCode_attach.py (1228 of 2287)
PASS: lldb-unit :: ObjectFile/PECOFF/./ObjectFilePECOFFTests/PECallFrameInfoTest.Basic_eh (1229 of 2287)
PASS: lldb-shell :: Quit/TestQuitExitCode0.test (1230 of 2287)
PASS: lldb-unit :: Utility/./UtilityTests/ProcessInstanceInfo.Yaml (1231 of 2287)
PASS: lldb-unit :: Utility/./UtilityTests/FileSpecTest.OperatorBool (1232 of 2287)
PASS: lldb-shell :: SymbolFile/DWARF/x86/subprogram_ranges.test (1233 of 2287)
PASS: lldb-unit :: Utility/./UtilityTests/ArgsTest.DoubleQuotedItem (1234 of 2287)
PASS: lldb-unit :: Utility/./UtilityTests/RangeTest.Clear (1235 of 2287)
PASS: lldb-api :: macosx/function-starts/TestFunctionStarts.py (1236 of 2287)
PASS: lldb-shell :: ObjectFile/PECOFF/sections-names.yaml (1237 of 2287)
PASS: lldb-unit :: Utility/./UtilityTests/PassiveReplayTest.InstrumentedBar (1238 of 2287)
UNSUPPORTED: lldb-api :: functionalities/thread/state/TestThreadStates.py (1239 of 2287)
PASS: lldb-api :: python_api/value/empty_class/TestValueAPIEmptyClass.py (1240 of 2287)
PASS: lldb-unit :: Utility/./UtilityTests/RangeTest.NotEqual (1241 of 2287)
PASS: lldb-unit :: Process/gdb-remote/./ProcessGdbRemoteTests/GDBRemoteCommunicationClientTest.GetModulesInfo_UUID20 (1242 of 2287)
PASS: lldb-unit :: Utility/./UtilityTests/NameMatchesTest.StartsWith (1243 of 2287)
PASS: lldb-api :: functionalities/thread/concurrent_events/TestConcurrentDelayedCrashWithBreakpointWatchpoint.py (1244 of 2287)
PASS: lldb-unit :: Utility/./UtilityTests/OptionsWithRawTest.QuotedSuffix (1245 of 2287)
UNSUPPORTED: lldb-api :: functionalities/exec/TestExec.py (1246 of 2287)
PASS: lldb-unit :: Utility/./UtilityTests/BinaryStreamTest.PutULEB128FourBytes (1247 of 2287)
PASS: lldb-api :: functionalities/load_lazy/TestLoadUsingLazyBind.py (1248 of 2287)
PASS: lldb-shell :: Settings/TestDisableColor.test (1249 of 2287)
PASS: lldb-shell :: ScriptInterpreter/Python/Crashlog/json.test (1250 of 2287)
PASS: lldb-unit :: ScriptInterpreter/Python/./ScriptInterpreterPythonTests/PythonDataObjectsTest.TestPythonIntegerToStr (1251 of 2287)
PASS: lldb-api :: tools/lldb-vscode/breakpoint/TestVSCode_setBreakpoints.py (1252 of 2287)
PASS: lldb-unit :: Utility/./UtilityTests/StringLexerTest.HasAtLeast (1253 of 2287)
PASS: lldb-api :: python_api/watchpoint/watchlocation/TestTargetWatchAddress.py (1254 of 2287)
PASS: lldb-api :: functionalities/data-formatter/ptr_ref_typedef/TestPtrRef2Typedef.py (1255 of 2287)
PASS: lldb-unit :: Host/./HostTests/FileSystemTest.FileAndDirectoryComponents (1256 of 2287)
PASS: lldb-api :: functionalities/gdb_remote_client/TestqOffsets.py (1257 of 2287)
UNSUPPORTED: lldb-api :: android/platform/TestDefaultCacheLineSize.py (1258 of 2287)
PASS: lldb-unit :: Utility/./UtilityTests/ScalarTest.Getters (1259 of 2287)
PASS: lldb-api :: commands/command/script/import/TestImport.py (1260 of 2287)
PASS: lldb-shell :: ObjectFile/PECOFF/sections.yaml (1261 of 2287)
PASS: lldb-api :: lang/cpp/global_variables/TestCPPGlobalVariables.py (1262 of 2287)
PASS: lldb-api :: lang/objc/objc++/TestObjCXX.py (1263 of 2287)
PASS: lldb-unit :: Utility/./UtilityTests/ArgsTest.TestOverwriteArgs (1264 of 2287)
PASS: lldb-api :: iohandler/resize/TestIOHandlerResizeNoEditline.py (1265 of 2287)
PASS: lldb-api :: functionalities/load_using_paths/TestLoadUsingPaths.py (1266 of 2287)
PASS: lldb-unit :: Language/Highlighting/./HighlighterTests/HighlighterTest.ClangPPDirectives (1267 of 2287)
PASS: lldb-unit :: Core/./LLDBCoreTests/SourceFileCache.FindSourceFileNotFound (1268 of 2287)
PASS: lldb-api :: commands/command/script/TestCommandScript.py (1269 of 2287)
PASS: lldb-api :: functionalities/tail_call_frames/thread_step_out_or_return/TestSteppingOutWithArtificialFrames.py (1270 of 2287)
UNSUPPORTED: lldb-api :: functionalities/darwin_log/source/info/TestDarwinLogSourceInfo.py (1271 of 2287)
PASS: lldb-unit :: Utility/./UtilityTests/FileSpecTest.GetPath (1272 of 2287)
PASS: lldb-api :: lang/cpp/wchar_t/TestCxxWCharT.py (1273 of 2287)
PASS: lldb-shell :: SymbolFile/NativePDB/function-types-calling-conv.cpp (1274 of 2287)
UNSUPPORTED: lldb-shell :: Register/x86-64-gp-write.test (1275 of 2287)
PASS: lldb-unit :: Core/./LLDBCoreTests/MangledTest.ResultForValidName (1276 of 2287)
PASS: lldb-api :: functionalities/data-formatter/pyobjsynthprovider/TestPyObjSynthProvider.py (1277 of 2287)
PASS: lldb-unit :: Host/./HostTests/NativeProcessProtocolTest.ReadCStringFromMemory (1278 of 2287)
PASS: lldb-shell :: SymbolFile/NativePDB/break-by-line.cpp (1279 of 2287)
PASS: lldb-unit :: Utility/./UtilityTests/VMRange.IsValid (1280 of 2287)
PASS: lldb-shell :: SymbolFile/NativePDB/nested-types.cpp (1281 of 2287)
PASS: lldb-shell :: Unwind/eh-frame-dwarf-unwind.test (1282 of 2287)
PASS: lldb-shell :: ObjectFile/Breakpad/breakpad-identification.test (1283 of 2287)
PASS: lldb-api :: commands/expression/call-function/TestCallStdStringFunction.py (1284 of 2287)
PASS: lldb-api :: lang/cpp/dynamic-value-same-basename/TestDynamicValueSameBase.py (1285 of 2287)
PASS: lldb-unit :: Utility/./UtilityTests/BinaryStreamTest.PutSLEB128OneByte (1286 of 2287)
PASS: lldb-shell :: Reproducer/TestDump.test (1287 of 2287)
PASS: lldb-api :: lang/cpp/enum_types/TestCPP11EnumTypes.py (1288 of 2287)
PASS: lldb-shell :: SymbolFile/DWARF/x86/debug-types-dwo-cross-reference.cpp (1289 of 2287)
PASS: lldb-unit :: Utility/./UtilityTests/StatusTest.ErrorCodeConstructor (1290 of 2287)
PASS: lldb-unit :: Expression/./ExpressionTests/DiagnosticManagerTest.HasFixits (1291 of 2287)
PASS: lldb-unit :: Utility/./UtilityTests/RangeDataVector.FindEntryIndexesThatContain_Overlap (1292 of 2287)
PASS: lldb-unit :: Utility/./UtilityTests/RangeTest.Union (1293 of 2287)
PASS: lldb-unit :: Utility/./UtilityTests/FileSpecTest.EqualDotsPosixRoot (1294 of 2287)
PASS: lldb-unit :: Host/./HostTests/SocketAddressTest.GetAddressInfo (1295 of 2287)
PASS: lldb-api :: functionalities/jitloader_gdb/TestJITLoaderGDB.py (1296 of 2287)
PASS: lldb-unit :: Process/./ProcessEventDataTests/ProcessEventDataTest.ShouldStop (1297 of 2287)
PASS: lldb-shell :: Minidump/fb-dump.test (1298 of 2287)
PASS: lldb-shell :: Commands/command-regex-delete.test (1299 of 2287)
PASS: lldb-shell :: Breakpoint/case-sensitive.test (1300 of 2287)
PASS: lldb-api :: lang/cpp/template-function/TestTemplateFunctions.py (1301 of 2287)
UNSUPPORTED: lldb-api :: commands/trace/TestTraceStartStop.py (1302 of 2287)
PASS: lldb-api :: tools/lldb-vscode/variables/TestVSCode_variables.py (1303 of 2287)
PASS: lldb-unit :: Utility/./UtilityTests/ArchSpecTest.Compatibility (1304 of 2287)
PASS: lldb-api :: functionalities/breakpoint/breakpoint_names/TestBreakpointNames.py (1305 of 2287)
PASS: lldb-unit :: Utility/./UtilityTests/DataExtractorTest.GetCStrAtEnd (1306 of 2287)
UNSUPPORTED: lldb-api :: functionalities/breakpoint/hardware_breakpoints/write_memory_with_hw_breakpoint/TestWriteMemoryWithHWBreakpoint.py (1307 of 2287)
PASS: lldb-api :: functionalities/gdb_remote_client/TestTargetXMLArch.py (1308 of 2287)
PASS: lldb-unit :: Expression/./ExpressionTests/DWARFExpressionMockProcessTest.DW_OP_deref (1309 of 2287)
PASS: lldb-shell :: Driver/TestSingleQuote.test (1310 of 2287)
PASS: lldb-api :: lang/cpp/char8_t/TestCxxChar8_t.py (1311 of 2287)
PASS: lldb-api :: functionalities/data-formatter/data-formatter-stl/libcxx/tuple/TestDataFormatterLibcxxTuple.py (1312 of 2287)
PASS: lldb-api :: functionalities/inline-stepping/TestInlineStepping.py (1313 of 2287)
PASS: lldb-unit :: Process/gdb-remote/./ProcessGdbRemoteTests/GDBRemoteCommunicationServerTest.SendErrorResponse_StringError (1314 of 2287)
PASS: lldb-unit :: Expression/./ExpressionTests/DWARFExpression.DW_OP_pick (1315 of 2287)
PASS: lldb-unit :: Utility/./UtilityTests/BinaryStreamTest.PutULEB128SixBytes (1316 of 2287)
PASS: lldb-api :: functionalities/gdb_remote_client/TestRegDefinitionInParts.py (1317 of 2287)
PASS: lldb-api :: functionalities/breakpoint/hardware_breakpoints/require_hw_breakpoints/TestRequireHWBreakpoints.py (1318 of 2287)
PASS: lldb-shell :: SymbolFile/DWARF/x86/find-basic-type.cpp (1319 of 2287)
PASS: lldb-unit :: Utility/./UtilityTests/DataExtractorTest.GetDoubleUnaligned (1320 of 2287)
PASS: lldb-api :: functionalities/limit-debug-info/TestLimitDebugInfo.py (1321 of 2287)
PASS: lldb-unit :: Utility/./UtilityTests/Flags.GetBitSize (1322 of 2287)
PASS: lldb-unit :: debugserver/./debugserverTests/RNBSocket.LoopBackListenIPv6 (1323 of 2287)
UNSUPPORTED: lldb-api :: commands/register/register/intel_xtended_registers/TestMPXRegisters.py (1324 of 2287)
PASS: lldb-unit :: Symbol/./SymbolTests/TestTypeSystemClang.TestBuiltinTypeForEncodingAndBitSize (1325 of 2287)
PASS: lldb-api :: python_api/name_lookup/TestNameLookup.py (1326 of 2287)
PASS: lldb-unit :: ScriptInterpreter/Python/./ScriptInterpreterPythonTests/PythonDataObjectsTest.TestPythonFile (1327 of 2287)
XFAIL: lldb-shell :: Register/x86-64-fp-read.test (1328 of 2287)
PASS: lldb-api :: lang/cpp/dynamic-value/TestDynamicValue.py (1329 of 2287)
PASS: lldb-unit :: Host/./HostTests/MainLoopTest.ReadObject (1330 of 2287)
PASS: lldb-api :: functionalities/unwind/noreturn/module-end/TestNoReturnModuleEnd.py (1331 of 2287)
PASS: lldb-shell :: SymbolFile/DWARF/x86/debug_loc-aslr.s (1332 of 2287)
UNSUPPORTED: lldb-api :: functionalities/darwin_log/filter/regex/subsystem/TestDarwinLogFilterRegexSubsystem.py (1333 of 2287)
PASS: lldb-unit :: Process/Utility/./ProcessUtilityTests/ProcSMapTests/LinuxProcSMapsTestFixture.ParseSMapRegions/8 (1334 of 2287)
PASS: lldb-unit :: Utility/./UtilityTests/NameMatchesTest.RegularExpression (1335 of 2287)
PASS: lldb-api :: tools/lldb-vscode/breakpoint/TestVSCode_setExceptionBreakpoints.py (1336 of 2287)
PASS: lldb-unit :: Utility/./UtilityTests/StringListTest.GetSize (1337 of 2287)
PASS: lldb-unit :: Utility/./UtilityTests/RegularExpression.CopyAssignment (1338 of 2287)
PASS: lldb-shell :: ScriptInterpreter/Python/command_import.test (1339 of 2287)
PASS: lldb-unit :: Process/gdb-remote/./ProcessGdbRemoteTests/GDBRemoteCommunicationServerTest.SendErrorResponse_ErrorList (1340 of 2287)
PASS: lldb-api :: functionalities/multidebugger_commands/TestMultipleDebuggersCommands.py (1341 of 2287)
PASS: lldb-unit :: Process/Utility/./ProcessUtilityTests/ProcSMapTests/LinuxProcSMapsTestFixture.ParseSMapRegions/3 (1342 of 2287)
PASS: lldb-shell :: Breakpoint/single-file-split-dwarf.test (1343 of 2287)
PASS: lldb-api :: commands/frame/var/TestFrameVar.py (1344 of 2287)
PASS: lldb-unit :: Utility/./UtilityTests/BinaryStreamTest.PutULEB128SevenBytes (1345 of 2287)
PASS: lldb-api :: lang/cpp/function_refs/TestFunctionRefs.py (1346 of 2287)
PASS: lldb-shell :: Recognizer/assert.test (1347 of 2287)
PASS: lldb-unit :: Utility/./UtilityTests/UUIDTest.Validity (1348 of 2287)
PASS: lldb-unit :: Language/Highlighting/./HighlighterTests/HighlighterTest.ClangScalarLiterals (1349 of 2287)
PASS: lldb-unit :: SymbolFile/DWARF/./SymbolFileDWARFTests/SymbolFileDWARFTests.TestAbbrevValidAttrNullForm (1350 of 2287)
PASS: lldb-shell :: ObjectFile/ELF/compressed-sections.yaml (1351 of 2287)
PASS: lldb-api :: lang/cpp/stl/TestStdCXXDisassembly.py (1352 of 2287)
PASS: lldb-api :: lang/cpp/accelerator-table/TestCPPAccelerator.py (1353 of 2287)
PASS: lldb-unit :: Core/./LLDBCoreTests/MangledTest.EmptyForInvalidName (1354 of 2287)
PASS: lldb-api :: commands/expression/persist_objc_pointeetype/TestPersistObjCPointeeType.py (1355 of 2287)
PASS: lldb-api :: lang/objc/foundation/TestObjCMethods2.py (1356 of 2287)
UNSUPPORTED: lldb-api :: functionalities/darwin_log/basic/TestDarwinLogBasic.py (1357 of 2287)
PASS: lldb-api :: functionalities/dlopen_other_executable/TestDlopenOtherExecutable.py (1358 of 2287)
PASS: lldb-api :: lang/cpp/template-specialization-type/TestTemplateSpecializationType.py (1359 of 2287)
PASS: lldb-unit :: Utility/./UtilityTests/StreamTest.PutCString (1360 of 2287)
PASS: lldb-api :: functionalities/reproducers/attach/TestReproducerAttach.py (1361 of 2287)
PASS: lldb-api :: commands/expression/unwind_expression/TestUnwindExpression.py (1362 of 2287)
PASS: lldb-unit :: ScriptInterpreter/Python/./ScriptInterpreterPythonTests/PythonDataObjectsTest.TestPythonBytes (1363 of 2287)
PASS: lldb-unit :: Host/./HostTests/PipeTest.OpenAsReader (1364 of 2287)
PASS: lldb-shell :: ObjectFile/ELF/many-sections.s (1365 of 2287)
PASS: lldb-api :: functionalities/data-formatter/frameformat_smallstruct/TestFrameFormatSmallStruct.py (1366 of 2287)
PASS: lldb-api :: functionalities/postmortem/minidump/TestMiniDump.py (1367 of 2287)
PASS: lldb-unit :: Platform/./LLDBPlatformTests/PlatformDarwinTest.FindComponentInPath (1368 of 2287)
PASS: lldb-unit :: Utility/./UtilityTests/StringExtractorTest.DecodeHexU8_InvalidHex2 (1369 of 2287)
PASS: lldb-unit :: Utility/./UtilityTests/StreamTest.QuotedCString (1370 of 2287)
PASS: lldb-api :: functionalities/thread/concurrent_events/TestConcurrentTwoBreakpointsOneSignal.py (1371 of 2287)
PASS: lldb-unit :: ObjectFile/Breakpad/./ObjectFileBreakpadTests/FileRecord.parse (1372 of 2287)
PASS: lldb-unit :: Process/Utility/./ProcessUtilityTests/RegisterContext_x86Test.FullToAbridgedTagWord (1373 of 2287)
PASS: lldb-api :: functionalities/data-formatter/language_category_updates/TestDataFormatterLanguageCategoryUpdates.py (1374 of 2287)
PASS: lldb-unit :: Utility/./UtilityTests/SerializationRountripTest.SerializeDeserializeCString (1375 of 2287)
PASS: lldb-api :: functionalities/tail_call_frames/disambiguate_tail_call_seq/TestDisambiguateTailCallSeq.py (1376 of 2287)
PASS: lldb-unit :: Utility/./UtilityTests/UriParserTest.SchemeHostSeparator2 (1377 of 2287)
PASS: lldb-api :: commands/log/invalid-args/TestInvalidArgsLog.py (1378 of 2287)
PASS: lldb-api :: commands/settings/quoting/TestQuoting.py (1379 of 2287)
PASS: lldb-unit :: Utility/./UtilityTests/RegularExpression.Match (1380 of 2287)
PASS: lldb-unit :: Utility/./UtilityTests/DataExtractorTest.GetBitfield (1381 of 2287)
PASS: lldb-api :: commands/expression/persistent_types/TestNestedPersistentTypes.py (1382 of 2287)
PASS: lldb-unit :: debugserver/./debugserverTests/RNBSocket.AnyListen (1383 of 2287)
UNSUPPORTED: lldb-shell :: Register/aarch64-fp-read.test (1384 of 2287)
PASS: lldb-unit :: Utility/./UtilityTests/UriParserTest.BracketedHostnameWithPortIPv6 (1385 of 2287)
PASS: lldb-unit :: Symbol/./SymbolTests/DWARFCallFrameInfoTest.Basic_eh (1386 of 2287)
PASS: lldb-api :: commands/frame/language/TestGuessLanguage.py (1387 of 2287)
PASS: lldb-api :: functionalities/data-formatter/poarray/TestPrintObjectArray.py (1388 of 2287)
PASS: lldb-unit :: Utility/./UtilityTests/FileSpecTest.EqualDotsPosix (1389 of 2287)
PASS: lldb-unit :: Process/minidump/./LLDBMinidumpTests/MinidumpParserTest.GetPid (1390 of 2287)
PASS: lldb-unit :: Utility/./UtilityTests/StatusTest.ErrorConstructor (1391 of 2287)
PASS: lldb-shell :: SymbolFile/DWARF/x86/dwarf5_tu_index_abbrev_offset.s (1392 of 2287)
PASS: lldb-api :: lang/cpp/offsetof/TestOffsetofCpp.py (1393 of 2287)
PASS: lldb-shell :: Heap/heap-cstr.test (1394 of 2287)
PASS: lldb-unit :: Symbol/./SymbolTests/TestClangASTImporter.CompleteFwdDeclWithOtherOrigin (1395 of 2287)
UNSUPPORTED: lldb-api :: functionalities/asan/TestMemoryHistory.py (1396 of 2287)
UNSUPPORTED: lldb-shell :: SymbolFile/PDB/func-symbols.test (1397 of 2287)
PASS: lldb-api :: functionalities/data-formatter/data-formatter-script/TestDataFormatterScript.py (1398 of 2287)
PASS: lldb-unit :: Utility/./UtilityTests/StringExtractorTest.GetHexBytes_Partial (1399 of 2287)
PASS: lldb-unit :: SymbolFile/DWARF/./SymbolFileDWARFTests/SymbolFileDWARFTests.ParseAranges (1400 of 2287)
PASS: lldb-api :: functionalities/data-formatter/data-formatter-enum-format/TestDataFormatterEnumFormat.py (1401 of 2287)
PASS: lldb-api :: functionalities/target_var/TestTargetVar.py (1402 of 2287)
PASS: lldb-unit :: Expression/./ExpressionTests/DiagnosticManagerTest.AppendMessageNoDiag (1403 of 2287)
UNSUPPORTED: lldb-shell :: Unwind/eh-frame-augment-noop.test (1404 of 2287)
PASS: lldb-api :: python_api/symbol-context/two-files/TestSymbolContextTwoFiles.py (1405 of 2287)
PASS: lldb-unit :: Utility/./UtilityTests/StringExtractorTest.GetHexBytesAvail_Partial (1406 of 2287)
UNSUPPORTED: lldb-api :: lang/cpp/static_members/TestCPPStaticMembers.py (1407 of 2287)
PASS: lldb-unit :: Utility/./UtilityTests/StringListTest.GetMaxStringLengthIncreasingSize (1408 of 2287)
PASS: lldb-unit :: Utility/./UtilityTests/StringListTest.ShiftMove (1409 of 2287)
PASS: lldb-unit :: Utility/./UtilityTests/StreamTest.PutHex16ByteOrderLittle (1410 of 2287)
PASS: lldb-unit :: Utility/./UtilityTests/StringExtractorTest.GetHexBytesAvail (1411 of 2287)
PASS: lldb-api :: commands/expression/rdar42038760/TestScalarURem.py (1412 of 2287)
UNSUPPORTED: lldb-shell :: SymbolFile/PDB/type-quals.test (1413 of 2287)
PASS: lldb-api :: python_api/disassemble-raw-data/TestDisassembleRawData.py (1414 of 2287)
PASS: lldb-unit :: Utility/./UtilityTests/UriParserTest.SchemeHostSeparator4 (1415 of 2287)
PASS: lldb-unit :: UnwindAssembly/x86/./UnwindAssemblyx86Tests/Testx86AssemblyInspectionEngine.TestPushEDI (1416 of 2287)
PASS: lldb-unit :: Utility/./UtilityTests/DeserializerTest.HasData (1417 of 2287)
PASS: lldb-api :: lang/objc/objc-new-syntax/TestObjCNewSyntaxDictionary.py (1418 of 2287)
PASS: lldb-shell :: SymbolFile/DWARF/clang-ast-from-dwarf-unamed-and-anon-structs.cpp (1419 of 2287)
PASS: lldb-unit :: ScriptInterpreter/Python/./ScriptInterpreterPythonTests/PythonDataObjectsTest.TestRun (1420 of 2287)
PASS: lldb-shell :: SymbolFile/DWARF/x86/debug_loclists-dwo.s (1421 of 2287)
PASS: lldb-unit :: Utility/./UtilityTests/StreamTest.PutBytesAsRawHex8ToBigEndian (1422 of 2287)
PASS: lldb-unit :: Language/Highlighting/./HighlighterTests/HighlighterTest.HighlighterSelectionType (1423 of 2287)
PASS: lldb-unit :: Utility/./UtilityTests/StringLexerTest.NextIfList (1424 of 2287)
XFAIL: lldb-shell :: SymbolFile/DWARF/find-type-in-function.cpp (1425 of 2287)
PASS: lldb-shell :: Breakpoint/debug_rnglistx_rlex.test (1426 of 2287)
PASS: lldb-unit :: Symbol/./SymbolTests/TestTypeSystemClang.TestGetTypeClassNested (1427 of 2287)
PASS: lldb-unit :: Utility/./UtilityTests/CompletionRequest.TryCompleteCurrentArgMode (1428 of 2287)
PASS: lldb-shell :: ObjectFile/MachO/lc_build_version_notools.yaml (1429 of 2287)
PASS: lldb-shell :: Reproducer/TestProcessList.test (1430 of 2287)
PASS: lldb-api :: functionalities/type_completion/TestTypeCompletion.py (1431 of 2287)
PASS: lldb-api :: functionalities/data-formatter/data-formatter-objc/TestDataFormatterObjCCF.py (1432 of 2287)
XFAIL: lldb-shell :: Register/x86-64-ymm-write.test (1433 of 2287)
PASS: lldb-api :: lang/objc/objc-foundation-dictionary-empty/TestNSDictionary0.py (1434 of 2287)
UNSUPPORTED: lldb-api :: macosx/macCatalystAppMacOSFramework/TestMacCatalystAppWithMacOSFramework.py (1435 of 2287)
PASS: lldb-unit :: Utility/./UtilityTests/StreamTest.PutMaxHex64ByteOrderLittle (1436 of 2287)
PASS: lldb-api :: python_api/default-constructor/TestDefaultConstructorForAPIObjects.py (1437 of 2287)
PASS: lldb-api :: functionalities/abbreviation/TestAbbreviations.py (1438 of 2287)
PASS: lldb-unit :: Utility/./UtilityTests/SerializationRountripTest.SerializeDeserializePodPointers (1439 of 2287)
UNSUPPORTED: lldb-api :: lang/objc/modules-update/TestClangModulesUpdate.py (1440 of 2287)
PASS: lldb-api :: lang/cpp/class-template-type-parameter-pack/TestClassTemplateTypeParameterPack.py (1441 of 2287)
PASS: lldb-shell :: SymbolFile/DWARF/x86/find-basic-function.cpp (1442 of 2287)
PASS: lldb-unit :: Utility/./UtilityTests/SubsystemRAIITest.NormalSubsystem (1443 of 2287)
PASS: lldb-unit :: Utility/./UtilityTests/ListenerTest.GetEventImmediate (1444 of 2287)
PASS: lldb-api :: macosx/dyld-trie-symbols/TestDyldTrieSymbols.py (1445 of 2287)
PASS: lldb-unit :: DataFormatter/./LLDBFormatterTests/TypeMatcherTests.GetMatchStringRegex (1446 of 2287)
PASS: lldb-api :: commands/expression/scoped_enums/TestScopedEnumType.py (1447 of 2287)
PASS: lldb-api :: functionalities/breakpoint/objc/TestObjCBreakpoints.py (1448 of 2287)
PASS: lldb-unit :: Host/./HostTests/FileSystemTest.EmptyTest (1449 of 2287)
PASS: lldb-unit :: Symbol/./SymbolTests/TestTypeSystemClang.TestGetEnumIntegerTypeUnexpectedType (1450 of 2287)
PASS: lldb-unit :: Process/gdb-remote/./ProcessGdbRemoteTests/GDBRemoteCommunicationServerTest.SendErrorResponse_UnimplementedError (1451 of 2287)
PASS: lldb-api :: lang/objcxx/objcxx-ivar-vector/TestIvarVector.py (1452 of 2287)
UNSUPPORTED: lldb-shell :: SymbolFile/PDB/variables-locations.test (1453 of 2287)
PASS: lldb-unit :: Utility/./UtilityTests/StringListTest.CopyList (1454 of 2287)
PASS: lldb-api :: lang/objc/objc-new-syntax/TestObjCNewSyntaxArray.py (1455 of 2287)
PASS: lldb-api :: api/log/TestAPILog.py (1456 of 2287)
PASS: lldb-api :: functionalities/data-formatter/data-formatter-objc/cmtime/TestDataFormatterCMTime.py (1457 of 2287)
PASS: lldb-unit :: Utility/./UtilityTests/AnsiTerminal.Twice (1458 of 2287)
PASS: lldb-api :: commands/target/modules/search-paths/insert/TestTargetModulesSearchpathsInsert.py (1459 of 2287)
UNSUPPORTED: lldb-api :: benchmarks/expression/TestExpressionCmd.py (1460 of 2287)
PASS: lldb-unit :: ObjectFile/Breakpad/./ObjectFileBreakpadTests/LineRecord.parse (1461 of 2287)
PASS: lldb-api :: lang/objc/hidden-ivars/TestHiddenIvars.py (1462 of 2287)
PASS: lldb-unit :: Utility/./UtilityTests/SubsystemRAIITest.SubsystemWithErrorSuccess (1463 of 2287)
PASS: lldb-api :: lang/c/complex_int/TestComplexInt.py (1464 of 2287)
PASS: lldb-api :: functionalities/thread/concurrent_events/TestConcurrentSignalWatch.py (1465 of 2287)
PASS: lldb-unit :: Process/minidump/./LLDBMinidumpTests/RegisterContextMinidump.ConvertMinidumpContext_x86_64 (1466 of 2287)
PASS: lldb-unit :: UnwindAssembly/x86/./UnwindAssemblyx86Tests/Testx86AssemblyInspectionEngine.TestPushRBP (1467 of 2287)
PASS: lldb-api :: python_api/value/change_values/TestChangeValueAPI.py (1468 of 2287)
PASS: lldb-shell :: SymbolFile/DWARF/x86/debug-names-compressed.cpp (1469 of 2287)
UNSUPPORTED: lldb-shell :: ScriptInterpreter/Lua/print.test (1470 of 2287)
PASS: lldb-shell :: Driver/TestPositionalArgs.test (1471 of 2287)
PASS: lldb-unit :: Utility/./UtilityTests/EventTest.DumpEventDataBytes (1472 of 2287)
PASS: lldb-api :: commands/watchpoints/watchpoint_commands/command/TestWatchpointCommandLLDB.py (1473 of 2287)
PASS: lldb-unit :: Process/minidump/./LLDBMinidumpTests/MinidumpParserTest.MinidumpDuplicateModuleMinAddress (1474 of 2287)
PASS: lldb-api :: lang/objc/foundation/TestSymbolTable.py (1475 of 2287)
PASS: lldb-api :: commands/expression/cast_int_to_anonymous_enum/TestCastIntToAnonymousEnum.py (1476 of 2287)
PASS: lldb-unit :: Utility/./UtilityTests/UriParserTest.LongPath (1477 of 2287)
PASS: lldb-api :: tools/lldb-vscode/launch/TestVSCode_launch.py (1478 of 2287)
PASS: lldb-unit :: Utility/./UtilityTests/BinaryStreamTest.PutSLEB128Zero (1479 of 2287)
UNSUPPORTED: lldb-api :: commands/watchpoints/variable_out_of_scope/TestWatchedVarHitWhenInScope.py (1480 of 2287)
PASS: lldb-shell :: SymbolFile/NativePDB/ast-types.cpp (1481 of 2287)
PASS: lldb-unit :: SymbolFile/NativePDB/./SymbolFileNativePDBTests/PDBFPOProgramToDWARFExpressionTests.UnresolvedCyclicRegisterAssignmentReference (1482 of 2287)
PASS: lldb-api :: functionalities/stop-on-sharedlibrary-load/TestStopOnSharedlibraryEvents.py (1483 of 2287)
UNSUPPORTED: lldb-shell :: Unwind/basic-block-sections.test (1484 of 2287)
UNSUPPORTED: lldb-api :: commands/trace/multiple-threads/TestTraceStartStopMultipleThreads.py (1485 of 2287)
PASS: lldb-api :: python_api/objc_type/TestObjCType.py (1486 of 2287)
PASS: lldb-unit :: Utility/./UtilityTests/ArgsTest.BareSingleQuote (1487 of 2287)
PASS: lldb-api :: functionalities/breakpoint/cpp_exception/TestCPPExceptionBreakpoint.py (1488 of 2287)
PASS: lldb-shell :: SymbolFile/DWARF/x86/dwarf5-split.s (1489 of 2287)
PASS: lldb-api :: lang/cpp/trivial_abi/TestTrivialABI.py (1490 of 2287)
PASS: lldb-api :: lang/objc/single-entry-dictionary/TestObjCSingleEntryDictionary.py (1491 of 2287)
UNSUPPORTED: lldb-shell :: SymbolFile/DWARF/split-dwarf-expression-eval-bug.cpp (1492 of 2287)
PASS: lldb-unit :: Utility/./UtilityTests/VMRange.CollectionContains (1493 of 2287)
UNSUPPORTED: lldb-shell :: Register/x86-ymm-read.test (1494 of 2287)
PASS: lldb-shell :: SymbolFile/NativePDB/tag-types.cpp (1495 of 2287)
PASS: lldb-api :: functionalities/data-formatter/builtin-formats/TestBuiltinFormats.py (1496 of 2287)
PASS: lldb-api :: lang/objc/foundation/TestObjCMethods.py (1497 of 2287)
PASS: lldb-unit :: Utility/./UtilityTests/BroadcasterTest.BroadcastEvent (1498 of 2287)
PASS: lldb-api :: lang/cpp/chained-calls/TestCppChainedCalls.py (1499 of 2287)
PASS: lldb-unit :: Utility/./UtilityTests/StringListTest.CopyListEmpty (1500 of 2287)
PASS: lldb-api :: lang/objc/objc-class-method/TestObjCClassMethod.py (1501 of 2287)
PASS: lldb-api :: functionalities/thread/concurrent_events/TestConcurrentDelaySignalBreak.py (1502 of 2287)
PASS: lldb-api :: commands/platform/file/close/TestPlatformFileClose.py (1503 of 2287)
PASS: lldb-shell :: Reproducer/TestMultipleTargets.test (1504 of 2287)
PASS: lldb-api :: functionalities/gdb_remote_client/TestRestartBug.py (1505 of 2287)
PASS: lldb-unit :: Process/gdb-remote/./ProcessGdbRemoteTests/GDBRemoteCommunicationClientTest.SyncThreadState (1506 of 2287)
PASS: lldb-unit :: ScriptInterpreter/Python/./ScriptInterpreterPythonTests/PythonDataObjectsTest.TestResetting (1507 of 2287)
PASS: lldb-shell :: ObjectFile/PECOFF/invalid-export-table.yaml (1508 of 2287)
PASS: lldb-unit :: Symbol/./SymbolTests/TestTypeSystemClang.TestGetEnumIntegerTypeBasicTypes (1509 of 2287)
PASS: lldb-shell :: SymbolFile/DWARF/x86/dwarf5-index-is-used.cpp (1510 of 2287)
PASS: lldb-unit :: ScriptInterpreter/Python/./ScriptInterpreterPythonTests/PythonDataObjectsTest.TestPythonListToStructuredList (1511 of 2287)
PASS: lldb-api :: functionalities/plugins/command_plugin/TestPluginCommands.py (1512 of 2287)
PASS: lldb-api :: functionalities/data-formatter/varscript_formatting/TestDataFormatterVarScriptFormatting.py (1513 of 2287)
PASS: lldb-api :: tools/lldb-vscode/runInTerminal/TestVSCode_runInTerminal.py (1514 of 2287)
PASS: lldb-api :: functionalities/conditional_break/TestConditionalBreak.py (1515 of 2287)
PASS: lldb-unit :: Host/./HostTests/SocketTests/SocketTest.DecodeHostAndPort/ipv4 (1516 of 2287)
PASS: lldb-shell :: Minidump/disassemble-no-module.yaml (1517 of 2287)
UNSUPPORTED: lldb-shell :: SymbolFile/PDB/function-level-linking.test (1518 of 2287)
PASS: lldb-api :: functionalities/memory/cache/TestMemoryCache.py (1519 of 2287)
PASS: lldb-api :: commands/expression/import-std-module/empty-module/TestEmptyStdModule.py (1520 of 2287)
PASS: lldb-unit :: UnwindAssembly/x86/./UnwindAssemblyx86Tests/Testx86AssemblyInspectionEngine.TestDisassemblyMidFunctionEpilogues (1521 of 2287)
PASS: lldb-shell :: SymbolFile/DWARF/x86/dwarf5-debug_line-file-index.s (1522 of 2287)
XFAIL: lldb-shell :: Expr/nodefaultlib.cpp (1523 of 2287)
PASS: lldb-unit :: Expression/./ExpressionTests/DiagnosticManagerTest.AppendMessageAttachToLastDiag (1524 of 2287)
PASS: lldb-api :: types/TestRecursiveTypes.py (1525 of 2287)
PASS: lldb-unit :: ScriptInterpreter/Python/./ScriptInterpreterPythonTests/PythonDataObjectsTest.TestObjectAttributes (1526 of 2287)
PASS: lldb-shell :: SymbolFile/NativePDB/source-list.cpp (1527 of 2287)
PASS: lldb-unit :: Utility/./UtilityTests/TildeExpressionResolver.ResolveFullPath (1528 of 2287)
UNSUPPORTED: lldb-api :: commands/gui/basic/TestGuiBasic.py (1529 of 2287)
PASS: lldb-unit :: UnwindAssembly/x86/./UnwindAssemblyx86Tests/Testx86AssemblyInspectionEngine.TestPopEBP (1530 of 2287)
PASS: lldb-api :: lang/cpp/static_member_type_depending_on_parent_size/TestStaticMemberTypeDependingOnParentSize.py (1531 of 2287)
PASS: lldb-api :: tools/lldb-server/TestGdbRemoteAttachOrWait.py (1532 of 2287)
PASS: lldb-api :: functionalities/gdb_remote_client/TestNoWatchpointSupportInfo.py (1533 of 2287)
PASS: lldb-unit :: Utility/./UtilityTests/StringExtractorTest.DecodeHexU8_Underflow2 (1534 of 2287)
PASS: lldb-api :: lang/cpp/nested-class-other-compilation-unit/TestNestedClassWithParentInAnotherCU.py (1535 of 2287)
PASS: lldb-unit :: Utility/./UtilityTests/VASprintfTest.EncodingError (1536 of 2287)
PASS: lldb-unit :: Symbol/./SymbolTests/TestTypeSystemClang.TestIsClangType (1537 of 2287)
PASS: lldb-api :: lang/objcxx/cpp_keywords_enabled/TestObjCppKeywordsEnabled.py (1538 of 2287)
PASS: lldb-unit :: Utility/./UtilityTests/StringExtractorTest.InitMisc (1539 of 2287)
PASS: lldb-api :: lang/objc/modules-hash-mismatch/TestClangModulesHashMismatch.py (1540 of 2287)
PASS: lldb-unit :: Symbol/./SymbolTests/TestClangASTImporter.ImportInvalidType (1541 of 2287)
PASS: lldb-unit :: SymbolFile/DWARF/./SymbolFileDWARFTests/SymbolFileDWARFTests.ParseArangesSkipErrors (1542 of 2287)
PASS: lldb-api :: commands/platform/file/read/TestPlatformFileRead.py (1543 of 2287)
PASS: lldb-shell :: Settings/TestSettingsWrite.test (1544 of 2287)
UNSUPPORTED: lldb-shell :: SymbolFile/DWARF/x86/dwarf5-line-strp.s (1545 of 2287)
PASS: lldb-api :: functionalities/data-formatter/nsdictionarysynth/TestNSDictionarySynthetic.py (1546 of 2287)
PASS: lldb-unit :: Utility/./UtilityTests/StreamTest.PutStringAsRawHex8 (1547 of 2287)
UNSUPPORTED: lldb-api :: functionalities/ptr_refs/TestPtrRefs.py (1548 of 2287)
PASS: lldb-api :: lang/c/forward/TestForwardDeclaration.py (1549 of 2287)
PASS: lldb-shell :: SymbolFile/Breakpad/unwind-via-stack-win-no-memory-info.yaml (1550 of 2287)
PASS: lldb-api :: macosx/lc-note/firmware-corefile/TestFirmwareCorefiles.py (1551 of 2287)
PASS: lldb-api :: commands/expression/import-std-module/sysroot/TestStdModuleSysroot.py (1552 of 2287)
PASS: lldb-unit :: Host/./HostTests/SocketTests/SocketTest.DecodeHostAndPort/ipv6 (1553 of 2287)
PASS: lldb-api :: commands/watchpoints/multiple_threads/TestWatchpointMultipleThreads.py (1554 of 2287)
PASS: lldb-unit :: Process/minidump/./LLDBMinidumpTests/MinidumpParserTest.GetThreadsAndGetThreadContext (1555 of 2287)
PASS: lldb-shell :: ObjectFile/ELF/base-address.yaml (1556 of 2287)
PASS: lldb-unit :: Process/minidump/./LLDBMinidumpTests/MinidumpParserTest.MinidumpDuplicateModuleMappedSecond (1557 of 2287)
PASS: lldb-shell :: ObjectFile/MachO/symtab.yaml (1558 of 2287)
PASS: lldb-unit :: Symbol/./SymbolTests/PostfixExpression.ParseOneExpression (1559 of 2287)
PASS: lldb-unit :: Process/Utility/./ProcessUtilityTests/ProcSMapTests/LinuxProcSMapsTestFixture.ParseSMapRegions/7 (1560 of 2287)
PASS: lldb-unit :: Utility/./UtilityTests/StreamTeeTest.GetStreamAtIndexOutOfBounds (1561 of 2287)
PASS: lldb-shell :: Expr/TestMultilineExpr.test (1562 of 2287)
PASS: lldb-api :: functionalities/tail_call_frames/ambiguous_tail_call_seq1/TestAmbiguousTailCallSeq1.py (1563 of 2287)
PASS: lldb-api :: lang/objc/modules-auto-import/TestModulesAutoImport.py (1564 of 2287)
UNSUPPORTED: lldb-api :: functionalities/unwind/standard/TestStandardUnwind.py (1565 of 2287)
PASS: lldb-api :: commands/expression/completion-crash-incomplete-record/TestCompletionCrashIncompleteRecord.py (1566 of 2287)
PASS: lldb-unit :: Core/./LLDBCoreTests/RichManglingContextTest.FromCxxMethodName (1567 of 2287)
PASS: lldb-unit :: Process/Utility/./ProcessUtilityTests/ProcSMapTests/LinuxProcSMapsTestFixture.ParseSMapRegions/5 (1568 of 2287)
PASS: lldb-api :: commands/expression/namespace_local_var_same_name_cpp_and_c/TestNamespaceLocalVarSameNameCppAndC.py (1569 of 2287)
PASS: lldb-unit :: Process/minidump/./LLDBMinidumpTests/MinidumpParserTest.FindMemoryRange (1570 of 2287)
PASS: lldb-api :: functionalities/tail_call_frames/inlining_and_tail_calls/TestInliningAndTailCalls.py (1571 of 2287)
PASS: lldb-shell :: SymbolFile/DWARF/x86/dir-separator-no-comp-dir.s (1572 of 2287)
PASS: lldb-shell :: ObjectFile/PECOFF/export-dllfunc.yaml (1573 of 2287)
PASS: lldb-shell :: Host/TestCustomShell.test (1574 of 2287)
PASS: lldb-unit :: Symbol/./SymbolTests/TestTypeSystemClang.TestConvertAccessTypeToAccessSpecifier (1575 of 2287)
PASS: lldb-shell :: SymbolFile/DWARF/x86/dwarf5-partial-index.cpp (1576 of 2287)
PASS: lldb-shell :: Driver/TestError.test (1577 of 2287)
UNSUPPORTED: lldb-api :: functionalities/longjmp/TestLongjmp.py (1578 of 2287)
PASS: lldb-unit :: Signals/./SignalsTests/UnixSignalsTest.GetInfo (1579 of 2287)
PASS: lldb-unit :: Utility/./UtilityTests/DataExtractorTest.GetMaxU64 (1580 of 2287)
PASS: lldb-unit :: Utility/./UtilityTests/StringExtractorGDBRemoteTest.GetPidTidMultipleValues (1581 of 2287)
PASS: lldb-api :: functionalities/abbreviation/TestCommonShortSpellings.py (1582 of 2287)
PASS: lldb-shell :: ObjectFile/ELF/section-types-edgecases.yaml (1583 of 2287)
PASS: lldb-unit :: tools/lldb-server/tests/./LLDBServerTests/TestBase.DebugserverEnv (1584 of 2287)
PASS: lldb-api :: api/check_public_api_headers/TestPublicAPIHeaders.py (1585 of 2287)
UNSUPPORTED: lldb-shell :: SymbolFile/NativePDB/typedefs.cpp (1586 of 2287)
PASS: lldb-api :: commands/expression/ignore-artificial-constructors/TestIgnoreArtificialConstructors.py (1587 of 2287)
PASS: lldb-unit :: Utility/./UtilityTests/FileSpecTest.CopyByAppendingPathComponent (1588 of 2287)
PASS: lldb-api :: commands/expression/import_base_class_when_class_has_derived_member/TestImportBaseClassWhenClassHasDerivedMember.py (1589 of 2287)
PASS: lldb-unit :: UnwindAssembly/x86/./UnwindAssemblyx86Tests/Testx86AssemblyInspectionEngine.TestSubRSP (1590 of 2287)
PASS: lldb-unit :: debugserver/./debugserverTests/RNBSocket.LoopBackConnectIPv4 (1591 of 2287)
PASS: lldb-shell :: SymbolFile/DWARF/x86/split-dwarf-inlining.cpp (1592 of 2287)
PASS: lldb-unit :: Language/Highlighting/./HighlighterTests/HighlighterTest.ClangUnterminatedString (1593 of 2287)
PASS: lldb-api :: commands/expression/import-std-module/vector/TestVectorFromStdModule.py (1594 of 2287)
PASS: lldb-unit :: Host/./HostTests/NativeProcessProtocolTest.ReadMemoryWithoutTrap (1595 of 2287)
PASS: lldb-unit :: Utility/./UtilityTests/VMRange.Ordering (1596 of 2287)
PASS: lldb-shell :: SymbolFile/DWARF/x86/limit-debug-info.s (1597 of 2287)
PASS: lldb-unit :: Editline/./EditlineTests/EditlineTestFixture.EditlineReceivesSingleLineText (1598 of 2287)
PASS: lldb-unit :: UnwindAssembly/x86/./UnwindAssemblyx86Tests/Testx86AssemblyInspectionEngine.TestPopEDI (1599 of 2287)
UNSUPPORTED: lldb-api :: lang/cpp/function-template-parameter-pack/TestFunctionTemplateParameterPack.py (1600 of 2287)
UNSUPPORTED: lldb-api :: linux/add-symbols/TestTargetSymbolsAddCommand.py (1601 of 2287)
PASS: lldb-shell :: ObjectFile/ELF/minidebuginfo-find-symbols.yaml (1602 of 2287)
PASS: lldb-api :: python_api/exprpath_synthetic/TestExprPathSynthetic.py (1603 of 2287)
PASS: lldb-unit :: Utility/./UtilityTests/BinaryStreamTest.PutSLEB128ThreeBytes (1604 of 2287)
PASS: lldb-unit :: Process/minidump/./LLDBMinidumpTests/MinidumpParserTest.GetArchitectureWindows (1605 of 2287)
PASS: lldb-api :: lang/cpp/namespace/TestNamespaceLookup.py (1606 of 2287)
UNSUPPORTED: lldb-shell :: ScriptInterpreter/Lua/fail_breakpoint_oneline.test (1607 of 2287)
PASS: lldb-unit :: Utility/./UtilityTests/DataExtractorTest.GetCStr (1608 of 2287)
PASS: lldb-unit :: Utility/./UtilityTests/LogChannelTest.Enable (1609 of 2287)
PASS: lldb-unit :: Utility/./UtilityTests/FileSpecTest.FileAndDirectoryComponents (1610 of 2287)
PASS: lldb-api :: lang/objcxx/cxx-bridged-po/TestObjCXXBridgedPO.py (1611 of 2287)
PASS: lldb-unit :: Utility/./UtilityTests/CompletionRequest.Constructor (1612 of 2287)
PASS: lldb-shell :: SymbolFile/DWARF/x86/dwarf5_locations.s (1613 of 2287)
PASS: lldb-api :: functionalities/history/TestHistoryRecall.py (1614 of 2287)
PASS: lldb-unit :: Utility/./UtilityTests/StringExtractorTest.GetHexBytesAvail_OddPair (1615 of 2287)
PASS: lldb-unit :: Utility/./UtilityTests/StreamTest.PutHex32ByteOrderLittle (1616 of 2287)
PASS: lldb-shell :: Settings/TestEchoCommands.test (1617 of 2287)
PASS: lldb-api :: functionalities/thread/concurrent_events/TestConcurrentManyWatchpoints.py (1618 of 2287)
PASS: lldb-api :: lang/c/strings/TestCStrings.py (1619 of 2287)
UNSUPPORTED: lldb-shell :: SymbolFile/PDB/ast-restore.test (1620 of 2287)
UNSUPPORTED: lldb-shell :: Unwind/split-machine-functions.test (1621 of 2287)
PASS: lldb-api :: functionalities/tail_call_frames/ambiguous_tail_call_seq2/TestAmbiguousTailCallSeq2.py (1622 of 2287)
PASS: lldb-unit :: Utility/./UtilityTests/PassiveReplayTest.InstrumentedBarPtr (1623 of 2287)
PASS: lldb-api :: functionalities/data-formatter/data-formatter-stl/libcxx/deque/TestDataFormatterLibcxxDeque.py (1624 of 2287)
PASS: lldb-shell :: Settings/TestFrameFormatColor.test (1625 of 2287)
PASS: lldb-shell :: Reproducer/TestVersionCheck.test (1626 of 2287)
PASS: lldb-api :: functionalities/data-formatter/data-formatter-stl/libcxx/multimap/TestDataFormatterLibccMultiMap.py (1627 of 2287)
PASS: lldb-api :: lang/cpp/multiple-inheritance/TestCppMultipleInheritance.py (1628 of 2287)
PASS: lldb-unit :: Symbol/./SymbolTests/TestTypeSystemClang.TestOwningModule (1629 of 2287)
PASS: lldb-shell :: ScriptInterpreter/None/import_module.test (1630 of 2287)
PASS: lldb-api :: commands/watchpoints/watchpoint_commands/condition/TestWatchpointConditionCmd.py (1631 of 2287)
PASS: lldb-unit :: Process/minidump/./LLDBMinidumpTests/MinidumpParserTest.MinidumpDuplicateModuleSeparateCode (1632 of 2287)
PASS: lldb-shell :: Quit/TestQuitExitCode30.test (1633 of 2287)
UNSUPPORTED: lldb-api :: tools/lldb-server/registers-target-xml-reading/TestGdbRemoteTargetXmlPacket.py (1634 of 2287)
UNSUPPORTED: lldb-api :: functionalities/darwin_log/filter/exact_match/activity-chain/TestDarwinLogFilterMatchActivityChain.py (1635 of 2287)
PASS: lldb-unit :: Utility/./UtilityTests/StringLexerTest.Peek (1636 of 2287)
PASS: lldb-unit :: Utility/./UtilityTests/StringExtractorTest.GetHexBytes (1637 of 2287)
UNSUPPORTED: lldb-api :: functionalities/tsan/global_location/TestTsanGlobalLocation.py (1638 of 2287)
PASS: lldb-api :: functionalities/postmortem/mach-core/TestMachCore.py (1639 of 2287)
PASS: lldb-unit :: Utility/./UtilityTests/AnsiTerminal.Unknown (1640 of 2287)
PASS: lldb-unit :: Utility/./UtilityTests/StringListTest.SplitIntoLinesSingleTrailingCR (1641 of 2287)
PASS: lldb-shell :: Reproducer/TestSynchronous.test (1642 of 2287)
PASS: lldb-api :: terminal/TestSTTYBeforeAndAfter.py (1643 of 2287)
UNSUPPORTED: lldb-api :: functionalities/ubsan/user-expression/TestUbsanUserExpression.py (1644 of 2287)
UNSUPPORTED: lldb-api :: tools/intel-features/intel-pt/test/TestIntelPTSimpleBinary.py (1645 of 2287)
PASS: lldb-shell :: SymbolFile/NativePDB/function-types-classes.cpp (1646 of 2287)
PASS: lldb-unit :: Utility/./UtilityTests/ScalarTest.ExtractBitfield (1647 of 2287)
PASS: lldb-api :: functionalities/breakpoint/breakpoint_locations/TestBreakpointLocations.py (1648 of 2287)
PASS: lldb-api :: functionalities/set-data/TestSetData.py (1649 of 2287)
PASS: lldb-api :: macosx/save_crashlog/TestSaveCrashlog.py (1650 of 2287)
PASS: lldb-shell :: SymbolFile/DWARF/x86/find-basic-variable.cpp (1651 of 2287)
PASS: lldb-api :: functionalities/thread/concurrent_events/TestConcurrentWatchBreakDelay.py (1652 of 2287)
PASS: lldb-unit :: Target/./TargetTests/MCBasedABI.MapRegisterName (1653 of 2287)
PASS: lldb-unit :: Symbol/./SymbolTests/TestTypeSystemClang.TestDisplayNameEmpty (1654 of 2287)
PASS: lldb-shell :: Register/x86-64-gp-read.test (1655 of 2287)
PASS: lldb-unit :: SymbolFile/DWARF/./SymbolFileDWARFTests/SymbolFileDWARFTests.TestAbbrevOrder1Start5 (1656 of 2287)
PASS: lldb-unit :: Host/./HostTests/NativeProcessProtocolTest.SetBreakpoint (1657 of 2287)
PASS: lldb-unit :: Utility/./UtilityTests/ProcessInstanceInfo.Dump (1658 of 2287)
PASS: lldb-unit :: DataFormatter/./LLDBFormatterTests/TypeMatcherTests.CreatedBySameMatchStringExactNamePrefixes (1659 of 2287)
PASS: lldb-api :: lang/objc/foundation/TestObjCMethodsNSError.py (1660 of 2287)
PASS: lldb-unit :: Process/gdb-remote/./ProcessGdbRemoteTests/GDBRemoteCommunicationClientTest.WriteRegisterNoSuffix (1661 of 2287)
PASS: lldb-api :: lang/objc/objc-ivar-stripped/TestObjCIvarStripped.py (1662 of 2287)
PASS: lldb-unit :: Process/minidump/./LLDBMinidumpTests/MinidumpParserTest.GetMemory (1663 of 2287)
PASS: lldb-api :: functionalities/breakpoint/breakpoint_by_file_colon_line/TestBreakpointByFileColonLine.py (1664 of 2287)
PASS: lldb-unit :: Utility/./UtilityTests/CompletionRequest.DuplicateFiltering (1665 of 2287)
PASS: lldb-unit :: Utility/./UtilityTests/OptionsWithRawTest.TerminatedQuote (1666 of 2287)
PASS: lldb-unit :: UnwindAssembly/x86/./UnwindAssemblyx86Tests/Testx86AssemblyInspectionEngine.TestReturnDetect (1667 of 2287)
PASS: lldb-shell :: Reproducer/TestFinalize.test (1668 of 2287)
PASS: lldb-unit :: Interpreter/./InterpreterTests/OptionArgParserTest.toBoolean (1669 of 2287)
PASS: lldb-unit :: ScriptInterpreter/Python/./ScriptInterpreterPythonTests/PythonDataObjectsTest.TestDictionaryResolutionWithDot (1670 of 2287)
PASS: lldb-unit :: ScriptInterpreter/Python/./ScriptInterpreterPythonTests/PythonDataObjectsTest.TestExtractingUInt64ThroughStructuredData (1671 of 2287)
PASS: lldb-api :: python_api/sbvalue_const_addrof/TestSBValueConstAddrOf.py (1672 of 2287)
PASS: lldb-api :: commands/statistics/basic/TestStats.py (1673 of 2287)
PASS: lldb-api :: functionalities/gdb_remote_client/TestGDBRemoteClient.py (1674 of 2287)
PASS: lldb-unit :: Process/gdb-remote/./ProcessGdbRemoteTests/GDBRemoteCommunicationClientTest.GetMemoryRegionInfoInvalidResponse (1675 of 2287)
PASS: lldb-api :: functionalities/data-formatter/data-formatter-synthval/TestDataFormatterSynthVal.py (1676 of 2287)
PASS: lldb-api :: macosx/macCatalyst/TestMacCatalyst.py (1677 of 2287)
PASS: lldb-unit :: ScriptInterpreter/Python/./ScriptInterpreterPythonTests/PythonDataObjectsTest.TestPythonTupleToStructuredList (1678 of 2287)
PASS: lldb-api :: functionalities/unwind/sigtramp/TestSigtrampUnwind.py (1679 of 2287)
PASS: lldb-api :: lang/cpp/exceptions/TestCPPExceptionBreakpoints.py (1680 of 2287)
PASS: lldb-api :: functionalities/paths/TestPaths.py (1681 of 2287)
UNSUPPORTED: lldb-api :: tools/lldb-vscode/disconnect/TestVSCode_disconnect.py (1682 of 2287)
PASS: lldb-api :: commands/expression/import-std-module/non-module-type-separation/TestNonModuleTypeSeparation.py (1683 of 2287)
PASS: lldb-unit :: Utility/./UtilityTests/ScalarTest.TruncOrExtendTo (1684 of 2287)
PASS: lldb-unit :: Utility/./UtilityTests/OptionsWithRawTest.SingleWhitespaceInput (1685 of 2287)
PASS: lldb-shell :: ScriptInterpreter/Python/Crashlog/parser_json.test (1686 of 2287)
PASS: lldb-api :: lang/cpp/constructors/TestCppConstructors.py (1687 of 2287)
PASS: lldb-api :: functionalities/breakpoint/breakpoint_set_restart/TestBreakpointSetRestart.py (1688 of 2287)
PASS: lldb-api :: functionalities/thread_plan/TestThreadPlanCommands.py (1689 of 2287)
PASS: lldb-unit :: Utility/./UtilityTests/StreamTest.PutCStringWithStringRef (1690 of 2287)
PASS: lldb-shell :: ObjectFile/PECOFF/symbol.yaml (1691 of 2287)
PASS: lldb-shell :: BuildScript/toolchain-clang.test (1692 of 2287)
PASS: lldb-unit :: Utility/./UtilityTests/CompletionRequest.DuplicateFilteringWithComments (1693 of 2287)
PASS: lldb-unit :: Utility/./UtilityTests/StreamTest.PutCharWhitespace (1694 of 2287)
UNSUPPORTED: lldb-api :: linux/thread/create_during_instruction_step/TestCreateDuringInstructionStep.py (1695 of 2287)
PASS: lldb-api :: functionalities/data-formatter/data-formatter-stl/libcxx/optional/TestDataFormatterLibcxxOptional.py (1696 of 2287)
PASS: lldb-unit :: Utility/./UtilityTests/BinaryStreamTest.PutULEB128NineBytes (1697 of 2287)
PASS: lldb-api :: lang/objc/objc_direct-methods/TestObjCDirectMethods.py (1698 of 2287)
PASS: lldb-unit :: Utility/./UtilityTests/SerializationRountripTest.SerializeDeserializeCStringArray (1699 of 2287)
PASS: lldb-unit :: Utility/./UtilityTests/StringExtractorTest.DecodeHexU8_Exact (1700 of 2287)
UNSUPPORTED: lldb-api :: commands/register/register/aarch64_dynamic_regset/TestArm64DynamicRegsets.py (1701 of 2287)
PASS: lldb-shell :: SymbolFile/DWARF/x86/array-sizes.s (1702 of 2287)
PASS: lldb-unit :: ObjectFile/MachO/./ObjectFileMachOTests/ObjectFileMachOTest.ModuleFromSharedCacheInfo (1703 of 2287)
PASS: lldb-unit :: Language/Highlighting/./HighlighterTests/HighlighterTest.Keywords (1704 of 2287)
PASS: lldb-unit :: Utility/./UtilityTests/ArgsTest.TestAppendArg (1705 of 2287)
PASS: lldb-unit :: Host/./HostTests/FileSystemTest.OpenErrno (1706 of 2287)
PASS: lldb-unit :: Process/minidump/./LLDBMinidumpTests/MinidumpParserTest.FindMemoryRangeWithFullMemoryMinidump (1707 of 2287)
PASS: lldb-unit :: Utility/./UtilityTests/AnsiTerminal.KnownPrefix (1708 of 2287)
PASS: lldb-unit :: Expression/./ExpressionTests/DiagnosticManagerTest.PutString (1709 of 2287)
PASS: lldb-api :: functionalities/thread/concurrent_events/TestConcurrentWatchBreak.py (1710 of 2287)
PASS: lldb-api :: commands/expression/import-std-module/retry-with-std-module/TestRetryWithStdModule.py (1711 of 2287)
PASS: lldb-api :: macosx/lc-note/kern-ver-str/TestKernVerStrLCNOTE.py (1712 of 2287)
PASS: lldb-unit :: Utility/./UtilityTests/SerializationRountripTest.SerializeDeserializeObjectReference (1713 of 2287)
PASS: lldb-api :: lang/objc/objc-struct-argument/TestObjCStructArgument.py (1714 of 2287)
PASS: lldb-unit :: Utility/./UtilityTests/BinaryStreamTest.PutSLEB128NineBytes (1715 of 2287)
PASS: lldb-api :: functionalities/data-formatter/data-formatter-objc/TestDataFormatterObjCNSBundle.py (1716 of 2287)
PASS: lldb-api :: commands/expression/options/TestExprOptions.py (1717 of 2287)
PASS: lldb-unit :: Symbol/./SymbolTests/DWARFCallFrameInfoTest.Basic_dwarf3 (1718 of 2287)
PASS: lldb-api :: tools/lldb-vscode/evaluate/TestVSCode_evaluate.py (1719 of 2287)
PASS: lldb-unit :: Host/./HostTests/NativeProcessProtocolTest.SetBreakpointFailWrite (1720 of 2287)
PASS: lldb-unit :: Utility/./UtilityTests/UserIDResolver.GetGroupName (1721 of 2287)
PASS: lldb-unit :: UnwindAssembly/x86/./UnwindAssemblyx86Tests/Testx86AssemblyInspectionEngine.TestPushImm (1722 of 2287)
PASS: lldb-unit :: Utility/./UtilityTests/Flags.AllClear (1723 of 2287)
PASS: lldb-api :: lang/cpp/limit-debug-info/TestWithLimitDebugInfo.py (1724 of 2287)
PASS: lldb-api :: commands/target/create-no-such-arch/TestNoSuchArch.py (1725 of 2287)
PASS: lldb-api :: commands/expression/timeout/TestCallWithTimeout.py (1726 of 2287)
PASS: lldb-api :: driver/batch_mode/TestBatchMode.py (1727 of 2287)
PASS: lldb-unit :: Utility/./UtilityTests/StringListTest.Assignment (1728 of 2287)
PASS: lldb-shell :: ObjectFile/ELF/minidebuginfo-corrupt-xz.yaml (1729 of 2287)
PASS: lldb-unit :: Symbol/./SymbolTests/TestClangASTImporter.DeportDeclTagDecl (1730 of 2287)
PASS: lldb-unit :: Utility/./UtilityTests/ProcessInstanceInfoMatch.Name (1731 of 2287)
PASS: lldb-unit :: Expression/./ExpressionTests/DiagnosticManagerTest.GetStringMultiline (1732 of 2287)
PASS: lldb-unit :: Expression/./ExpressionTests/CppModuleConfigurationTest.MissingLibCpp (1733 of 2287)
PASS: lldb-unit :: Utility/./UtilityTests/CompletionRequest.TestCompletionOwnership (1734 of 2287)
PASS: lldb-unit :: ObjectFile/PECOFF/./ObjectFilePECOFFTests/PECallFrameInfoTest.Frame_reg_eh (1735 of 2287)
PASS: lldb-shell :: Commands/command-stop-hook-output.test (1736 of 2287)
XFAIL: lldb-shell :: Register/x86-fp-write.test (1737 of 2287)
PASS: lldb-unit :: Expression/./ExpressionTests/CppModuleConfigurationTest.LinuxLocalLibCpp (1738 of 2287)
PASS: lldb-shell :: SymbolFile/DWARF/x86/DW_OP_piece-struct.s (1739 of 2287)
PASS: lldb-api :: lang/cpp/dynamic-value/TestCppValueCast.py (1740 of 2287)
UNSUPPORTED: lldb-api :: arm/breakpoint-thumb-codesection/TestBreakpointThumbCodesection.py (1741 of 2287)
PASS: lldb-unit :: Utility/./UtilityTests/ArgsTest.GetQuotedCommandString (1742 of 2287)
UNSUPPORTED: lldb-api :: functionalities/gdb_remote_client/TestQemuAArch64TargetXml.py (1743 of 2287)
PASS: lldb-shell :: Driver/TestCore.test (1744 of 2287)
PASS: lldb-api :: functionalities/data-formatter/stringprinter/TestStringPrinter.py (1745 of 2287)
PASS: lldb-unit :: UnwindAssembly/x86/./UnwindAssemblyx86Tests/Testx86AssemblyInspectionEngine.TestPopR13 (1746 of 2287)
PASS: lldb-api :: commands/expression/import-std-module/list/TestListFromStdModule.py (1747 of 2287)
PASS: lldb-api :: lang/cpp/type_lookup/TestCppTypeLookup.py (1748 of 2287)
PASS: lldb-api :: lang/cpp/function-qualifiers/TestCppFunctionQualifiers.py (1749 of 2287)
PASS: lldb-api :: functionalities/data-formatter/refpointer-recursion/TestDataFormatterRefPtrRecursion.py (1750 of 2287)
PASS: lldb-shell :: Reproducer/TestDebugSymbols.test (1751 of 2287)
PASS: lldb-api :: lang/cpp/llvm-style/TestLLVMStyle.py (1752 of 2287)
PASS: lldb-unit :: Utility/./UtilityTests/StringListTest.Clear (1753 of 2287)
PASS: lldb-shell :: Breakpoint/debug_rnglist_rlestartend.test (1754 of 2287)
PASS: lldb-unit :: Utility/./UtilityTests/StringListTest.GetMaxStringLengthEmpty (1755 of 2287)
PASS: lldb-unit :: Utility/./UtilityTests/ConstStringTest.CompareConstString (1756 of 2287)
PASS: lldb-unit :: ScriptInterpreter/Python/./ScriptInterpreterPythonTests/PythonDataObjectsTest.TestPythonDictionaryToStructuredDictionary (1757 of 2287)
PASS: lldb-unit :: Process/minidump/./LLDBMinidumpTests/MinidumpParserTest.GetLinuxProcStatus (1758 of 2287)
PASS: lldb-unit :: Utility/./UtilityTests/BinaryStreamTest.PutSLEB128FourBytes (1759 of 2287)
PASS: lldb-unit :: ScriptInterpreter/Python/./ScriptInterpreterPythonTests/PythonDataObjectsTest.TestPythonDictionaryManipulation (1760 of 2287)
PASS: lldb-unit :: Utility/./UtilityTests/StreamTeeTest.Assignment (1761 of 2287)
PASS: lldb-unit :: ObjectFile/Breakpad/./ObjectFileBreakpadTests/FuncRecord.parse (1762 of 2287)
PASS: lldb-api :: commands/expression/ir-interpreter-phi-nodes/TestIRInterpreterPHINodes.py (1763 of 2287)
PASS: lldb-shell :: ObjectFile/PECOFF/basic-info-arm.yaml (1764 of 2287)
PASS: lldb-shell :: ObjectFile/wasm/embedded-debug-sections.yaml (1765 of 2287)
PASS: lldb-unit :: Host/./HostTests/SocketTests/SocketTest.UDPConnect/ipv4 (1766 of 2287)
PASS: lldb-api :: python_api/function_symbol/TestSymbolAPI.py (1767 of 2287)
PASS: lldb-shell :: SymbolFile/NativePDB/globals-fundamental.cpp (1768 of 2287)
PASS: lldb-shell :: SymbolFile/DWARF/x86/debug_line-relative_path.s (1769 of 2287)
PASS: lldb-unit :: Utility/./UtilityTests/UriParserTest.Empty (1770 of 2287)
PASS: lldb-unit :: Utility/./UtilityTests/BinaryStreamTest.PutSLEB128One (1771 of 2287)
PASS: lldb-api :: functionalities/data-formatter/data-formatter-stl/libcxx/function/TestLibCxxFunction.py (1772 of 2287)
PASS: lldb-api :: lang/cpp/global_operators/TestCppGlobalOperators.py (1773 of 2287)
PASS: lldb-unit :: Utility/./UtilityTests/RangeDataVector.CustomSort (1774 of 2287)
PASS: lldb-api :: functionalities/data-formatter/type_summary_list_arg/TestTypeSummaryListArg.py (1775 of 2287)
PASS: lldb-unit :: Utility/./UtilityTests/StreamTest.ShiftOperatorChars (1776 of 2287)
PASS: lldb-api :: lang/cpp/typedef/TestCppTypedef.py (1777 of 2287)
PASS: lldb-unit :: Utility/./UtilityTests/RecordReplayTest.InstrumentedFooSameThis (1778 of 2287)
PASS: lldb-unit :: Process/minidump/./LLDBMinidumpTests/MinidumpParserTest.MinidumpModuleOrder (1779 of 2287)
PASS: lldb-unit :: ObjectFile/Breakpad/./ObjectFileBreakpadTests/Record.classify (1780 of 2287)
PASS: lldb-api :: lang/cpp/namespace_conflicts/TestNamespaceConflicts.py (1781 of 2287)
PASS: lldb-unit :: Host/./HostTests/MainLoopTest.UnmonitoredSignal (1782 of 2287)
PASS: lldb-unit :: SymbolFile/NativePDB/./SymbolFileNativePDBTests/PDBFPOProgramToDWARFExpressionTests.InvalidAssignmentSingle (1783 of 2287)
PASS: lldb-api :: functionalities/avoids-fd-leak/TestFdLeak.py (1784 of 2287)
PASS: lldb-api :: functionalities/breakpoint/breakpoint_options/TestBreakpointOptions.py (1785 of 2287)
PASS: lldb-unit :: Expression/./ExpressionTests/ClangExpressionDeclMapTest.TestUnknownIdentifierLookup (1786 of 2287)
PASS: lldb-api :: python_api/sberror/TestSBError.py (1787 of 2287)
XFAIL: lldb-shell :: Register/x86-64-fp-write.test (1788 of 2287)
PASS: lldb-api :: functionalities/data-formatter/data-formatter-disabling/TestDataFormatterDisabling.py (1789 of 2287)
PASS: lldb-unit :: Utility/./UtilityTests/RangeTest.DefaultConstructor (1790 of 2287)
PASS: lldb-api :: lang/objc/objc-runtime-ivars/TestRuntimeIvars.py (1791 of 2287)
PASS: lldb-unit :: Utility/./UtilityTests/TimeoutTest.Construction (1792 of 2287)
PASS: lldb-api :: tools/lldb-server/TestGdbRemoteExpeditedRegisters.py (1793 of 2287)
PASS: lldb-api :: functionalities/thread/concurrent_events/TestConcurrentTwoBreakpointsOneDelaySignal.py (1794 of 2287)
PASS: lldb-unit :: Utility/./UtilityTests/StringExtractorTest.GetHexBytesAvail_FullString (1795 of 2287)
PASS: lldb-api :: functionalities/gdb_remote_client/TestWriteMemory.py (1796 of 2287)
PASS: lldb-shell :: SymbolFile/NativePDB/global-classes.cpp (1797 of 2287)
UNSUPPORTED: lldb-api :: commands/expression/macros/TestMacros.py (1798 of 2287)
PASS: lldb-api :: tools/lldb-server/TestGdbRemoteAttach.py (1799 of 2287)
PASS: lldb-unit :: Utility/./UtilityTests/OptionsWithRawTest.SingleWordSuffix (1800 of 2287)
PASS: lldb-api :: python_api/value/linked_list/TestValueAPILinkedList.py (1801 of 2287)
PASS: lldb-unit :: UnwindAssembly/x86/./UnwindAssemblyx86Tests/Testx86AssemblyInspectionEngine.TestPushR14 (1802 of 2287)
PASS: lldb-api :: functionalities/thread/create_after_attach/TestCreateAfterAttach.py (1803 of 2287)
PASS: lldb-api :: lang/objcxx/class-name-clash/TestNameClash.py (1804 of 2287)
UNSUPPORTED: lldb-api :: commands/register/register/intel_xtended_registers/mpx_offset_intersection/TestMPXOffsetIntersection.py (1805 of 2287)
UNSUPPORTED: lldb-api :: functionalities/darwin_log/filter/regex/message/TestDarwinLogFilterRegexMessage.py (1806 of 2287)
PASS: lldb-api :: functionalities/gdb_remote_client/TestIOSSimulator.py (1807 of 2287)
UNSUPPORTED: lldb-api :: functionalities/data-formatter/data-formatter-stl/libstdcpp/vector/TestDataFormatterStdVector.py (1808 of 2287)
PASS: lldb-unit :: ScriptInterpreter/Python/./ScriptInterpreterPythonTests/PythonDataObjectsTest.TestPythonTupleValues (1809 of 2287)
PASS: lldb-shell :: Settings/TestStopCommandSourceOnError.test (1810 of 2287)
PASS: lldb-unit :: API/./APITests/SBCommandInterpreterTest.MultiWordCommand (1811 of 2287)
PASS: lldb-api :: commands/expression/import-std-module/queue/TestQueueFromStdModule.py (1812 of 2287)
PASS: lldb-api :: lang/cpp/virtual-overload/TestVirtualOverload.py (1813 of 2287)
PASS: lldb-api :: lang/c/set_values/TestSetValues.py (1814 of 2287)
PASS: lldb-unit :: Utility/./UtilityTests/CompletionRequest.FakeLastArg (1815 of 2287)
PASS: lldb-unit :: Utility/./UtilityTests/OptionsWithRawTest.LeadingSpaceArgs (1816 of 2287)
PASS: lldb-api :: commands/expression/import-std-module/stack/TestStackFromStdModule.py (1817 of 2287)
PASS: lldb-api :: lang/objc/orderedset/TestOrderedSet.py (1818 of 2287)
PASS: lldb-api :: python_api/value_var_update/TestValueVarUpdate.py (1819 of 2287)
PASS: lldb-shell :: SymbolFile/DWARF/x86/gnu-style-compression.cpp (1820 of 2287)
PASS: lldb-unit :: SymbolFile/DWARF/./SymbolFileDWARFTests/SymbolFileDWARFTests.TestAbbrevMissingTerminator (1821 of 2287)
PASS: lldb-api :: functionalities/tail_call_frames/thread_step_out_message/TestArtificialFrameStepOutMessage.py (1822 of 2287)
PASS: lldb-unit :: Utility/./UtilityTests/LogTest.LLDB_LOG_nullptr (1823 of 2287)
PASS: lldb-unit :: Process/minidump/./LLDBMinidumpTests/MinidumpParserTest.GetMemoryRegionInfo (1824 of 2287)
PASS: lldb-api :: functionalities/data-formatter/data-formatter-named-summaries/TestDataFormatterNamedSummaries.py (1825 of 2287)
PASS: lldb-unit :: Process/Utility/./ProcessUtilityTests/ProcSMapTests/LinuxProcSMapsTestFixture.ParseSMapRegions/0 (1826 of 2287)
PASS: lldb-unit :: Utility/./UtilityTests/Flags.Reset (1827 of 2287)
PASS: lldb-api :: commands/expression/po_verbosity/TestPoVerbosity.py (1828 of 2287)
PASS: lldb-api :: lang/cpp/virtual-functions/TestCppVirtualFunctions.py (1829 of 2287)
PASS: lldb-unit :: Expression/./ExpressionTests/DiagnosticManagerTest.GetStringSeverityLabels (1830 of 2287)
PASS: lldb-api :: lang/c/const_variables/TestConstVariables.py (1831 of 2287)
PASS: lldb-api :: python_api/type/TestTypeList.py (1832 of 2287)
PASS: lldb-unit :: Utility/./UtilityTests/ConstStringTest.UpdateMangledCounterpart (1833 of 2287)
PASS: lldb-api :: lang/c/complex/TestComplexC99.py (1834 of 2287)
PASS: lldb-unit :: Utility/./UtilityTests/StreamTest.ShiftOperatorPtr (1835 of 2287)
PASS: lldb-unit :: Utility/./UtilityTests/UUIDTest.SetFromStringRef (1836 of 2287)
PASS: lldb-shell :: Quit/TestQuitExitCodeTooManyArgs.test (1837 of 2287)
PASS: lldb-unit :: Symbol/./SymbolTests/SymbolsTest.LocateExecutableSymbolFileForUnknownExecutableAndMissingSymbolFile (1838 of 2287)
PASS: lldb-unit :: Utility/./UtilityTests/VMRange.Reset (1839 of 2287)
PASS: lldb-unit :: Interpreter/./InterpreterTests/OptionValueFileColonLine.setFromString (1840 of 2287)
PASS: lldb-api :: commands/watchpoints/watchpoint_size/TestWatchpointSizes.py (1841 of 2287)
PASS: lldb-unit :: Host/./HostTests/ConnectionFileDescriptorTest.TCPGetURIv6 (1842 of 2287)
PASS: lldb-api :: functionalities/data-formatter/parray/TestPrintArray.py (1843 of 2287)
PASS: lldb-unit :: Utility/./UtilityTests/FileSpecTest.AppendPathComponent (1844 of 2287)
PASS: lldb-shell :: Watchpoint/SetErrorCases.test (1845 of 2287)
PASS: lldb-unit :: Utility/./UtilityTests/StringExtractorTest.GetHexU8_Extra (1846 of 2287)
PASS: lldb-shell :: Reproducer/TestDiscard.test (1847 of 2287)
PASS: lldb-unit :: Utility/./UtilityTests/FileSpecTest.EqualDotsWindows (1848 of 2287)
PASS: lldb-unit :: SymbolFile/NativePDB/./SymbolFileNativePDBTests/PDBFPOProgramToDWARFExpressionTests.InvalidOpUnary (1849 of 2287)
PASS: lldb-api :: lang/cpp/bitfields/TestCppBitfields.py (1850 of 2287)
PASS: lldb-unit :: ObjectFile/Breakpad/./ObjectFileBreakpadTests/StackWinRecord.parse (1851 of 2287)
PASS: lldb-api :: lang/cpp/operator-overload/TestOperatorOverload.py (1852 of 2287)
PASS: lldb-unit :: Core/./LLDBCoreTests/UniqueCStringMap.NoDefaultConstructor (1853 of 2287)
PASS: lldb-api :: lang/objc/exceptions/TestObjCExceptions.py (1854 of 2287)
PASS: lldb-unit :: Utility/./UtilityTests/DataExtractorTest.GetMaxS64 (1855 of 2287)
PASS: lldb-api :: python_api/watchpoint/TestSetWatchpoint.py (1856 of 2287)
PASS: lldb-shell :: Reproducer/Functionalities/TestImageList.test (1857 of 2287)
PASS: lldb-unit :: Expression/./ExpressionTests/DiagnosticManagerTest.PutStringSeverities (1858 of 2287)
PASS: lldb-api :: lang/cpp/symbols/TestSymbols.py (1859 of 2287)
PASS: lldb-shell :: ObjectFile/ELF/riscv-arch.yaml (1860 of 2287)
PASS: lldb-unit :: Utility/./UtilityTests/StreamTest.AddressRangeSize (1861 of 2287)
PASS: lldb-unit :: Core/./LLDBCoreTests/RichManglingContextTest.IPDRealloc (1862 of 2287)
PASS: lldb-api :: commands/target/create-deps/TestTargetCreateDeps.py (1863 of 2287)
PASS: lldb-unit :: Utility/./UtilityTests/ArchSpecTest.YAML (1864 of 2287)
PASS: lldb-api :: lang/c/step_over_no_deadlock/TestStepOverDoesntBlock.py (1865 of 2287)
PASS: lldb-unit :: Utility/./UtilityTests/StringListTest.AppendStringMove (1866 of 2287)
PASS: lldb-unit :: ScriptInterpreter/Python/./ScriptInterpreterPythonTests/PythonDataObjectsTest.TestPythonTupleSize (1867 of 2287)
PASS: lldb-api :: python_api/module_section/TestModuleAndSection.py (1868 of 2287)
PASS: lldb-unit :: Process/gdb-remote/./ProcessGdbRemoteTests/GDBRemoteClientBaseTest.SendContinueAndInterrupt (1869 of 2287)
PASS: lldb-api :: macosx/load-kext/TestLoadKext.py (1870 of 2287)
PASS: lldb-unit :: Utility/./UtilityTests/FileSpecTest.RemoveLastPathComponent (1871 of 2287)
PASS: lldb-unit :: Utility/./UtilityTests/ArgsTest.EscapeLLDBCommandArgument (1872 of 2287)
PASS: lldb-api :: functionalities/data-formatter/data-formatter-cpp/TestDataFormatterCpp.py (1873 of 2287)
PASS: lldb-unit :: Core/./LLDBCoreTests/MangledTest.ResultForBlockInvocation (1874 of 2287)
PASS: lldb-unit :: Expression/./ExpressionTests/CppModuleConfigurationTest.MissingUsrInclude (1875 of 2287)
UNSUPPORTED: lldb-shell :: Unwind/unwind-plan-dwarf-dump.test (1876 of 2287)
PASS: lldb-unit :: Utility/./UtilityTests/StreamTest.PutHex8 (1877 of 2287)
PASS: lldb-unit :: Host/./HostTests/HostInfoTest.GetHostname (1878 of 2287)
PASS: lldb-api :: functionalities/postmortem/elf-core/gcore/TestGCore.py (1879 of 2287)
PASS: lldb-api :: functionalities/data-formatter/data-formatter-stl/libstdcpp/unique_ptr/invalid/TestDataFormatterInvalidStdUniquePtr.py (1880 of 2287)
PASS: lldb-unit :: Utility/./UtilityTests/StringExtractorTest.GetHexU8_Exact_NoEof (1881 of 2287)
PASS: lldb-unit :: Editline/./EditlineTests/EditlineTestFixture.EditlineReceivesMultiLineText (1882 of 2287)
UNSUPPORTED: lldb-shell :: Expr/TestIRMemoryMapWindows.test (1883 of 2287)
PASS: lldb-unit :: Symbol/./SymbolTests/TestTypeSystemClang.TestDeletingImplicitCopyCstrDueToMoveCStr (1884 of 2287)
PASS: lldb-api :: commands/expression/import-std-module/conflicts/TestStdModuleWithConflicts.py (1885 of 2287)
PASS: lldb-unit :: Utility/./UtilityTests/DataExtractorTest.GetCStrEmpty (1886 of 2287)
PASS: lldb-api :: functionalities/thread/concurrent_events/TestConcurrentSignalNWatchNBreak.py (1887 of 2287)
PASS: lldb-shell :: ObjectFile/ELF/section-overlap.yaml (1888 of 2287)
PASS: lldb-api :: python_api/section/TestSectionAPI.py (1889 of 2287)
PASS: lldb-unit :: Utility/./UtilityTests/ScalarTest.Comparison (1890 of 2287)
PASS: lldb-api :: tools/lldb-server/inferior-crash/TestGdbRemoteAbort.py (1891 of 2287)
PASS: lldb-api :: lang/objc/modules-app-update/TestClangModulesAppUpdate.py (1892 of 2287)
PASS: lldb-unit :: Utility/./UtilityTests/UriParserTest.MinimalPath (1893 of 2287)
PASS: lldb-unit :: DataFormatter/./LLDBFormatterTests/TypeMatcherTests.ExactName (1894 of 2287)
PASS: lldb-shell :: SymbolFile/DWARF/x86/dwarf5-debug_line.s (1895 of 2287)
PASS: lldb-api :: python_api/frame/TestFrames.py (1896 of 2287)
PASS: lldb-api :: functionalities/breakpoint/cpp/TestCPPBreakpointLocations.py (1897 of 2287)
PASS: lldb-shell :: Commands/command-disassemble.s (1898 of 2287)
PASS: lldb-unit :: Host/./HostTests/SocketTests/SocketTest.TCPGetConnectURI/ipv4 (1899 of 2287)
PASS: lldb-unit :: Utility/./UtilityTests/ArchSpecTest.TestParseMachCPUDashSubtypeTripleExtra (1900 of 2287)
UNSUPPORTED: lldb-shell :: Watchpoint/netbsd-nouserdbregs.test (1901 of 2287)
PASS: lldb-unit :: ObjectFile/Breakpad/./ObjectFileBreakpadTests/PublicRecord.parse (1902 of 2287)
PASS: lldb-unit :: Language/Highlighting/./HighlighterTests/HighlighterTest.ClangIdentifiers (1903 of 2287)
PASS: lldb-unit :: Process/minidump/./LLDBMinidumpTests/MinidumpParserTest.GetMemoryRegionInfoFromMemory64List (1904 of 2287)
PASS: lldb-api :: functionalities/thread/concurrent_events/TestConcurrentBreakpointsDelayedBreakpointOneWatchpoint.py (1905 of 2287)
PASS: lldb-unit :: Utility/./UtilityTests/StreamTeeTest.CopyConstructor (1906 of 2287)
PASS: lldb-api :: lang/objc/objc-optimized/TestObjcOptimized.py (1907 of 2287)
UNSUPPORTED: lldb-api :: functionalities/data-formatter/data-formatter-stl/libstdcpp/smart_ptr/TestDataFormatterStdSmartPtr.py (1908 of 2287)
PASS: lldb-api :: functionalities/breakpoint/breakpoint_ids/TestBreakpointIDs.py (1909 of 2287)
PASS: lldb-unit :: Host/./HostTests/SocketTests/SocketTest.TCPListen0ConnectAccept/ipv4 (1910 of 2287)
PASS: lldb-unit :: ScriptInterpreter/Python/./ScriptInterpreterPythonTests/PythonDataObjectsTest.TestPythonListManipulation (1911 of 2287)
PASS: lldb-api :: tools/lldb-server/commandline/TestStubSetSID.py (1912 of 2287)
PASS: lldb-unit :: Utility/./UtilityTests/DataExtractorTest.GetFloat (1913 of 2287)
PASS: lldb-unit :: Host/./HostTests/PipeTest.CreateWithUniqueName (1914 of 2287)
PASS: lldb-shell :: Reproducer/Functionalities/TestDataFormatter.test (1915 of 2287)
PASS: lldb-unit :: Utility/./UtilityTests/ProcessInstanceInfo.DumpTable (1916 of 2287)
PASS: lldb-api :: functionalities/breakpoint/breakpoint_language/TestBreakpointLanguage.py (1917 of 2287)
PASS: lldb-api :: commands/command/nested_alias/TestNestedAlias.py (1918 of 2287)
PASS: lldb-api :: lang/cpp/alignas_base_class/TestAlignAsBaseClass.py (1919 of 2287)
PASS: lldb-unit :: Utility/./UtilityTests/StringExtractorTest.GetNameColonValueNoSemicolon (1920 of 2287)
PASS: lldb-unit :: Utility/./UtilityTests/LogChannelTest.Disable (1921 of 2287)
PASS: lldb-api :: functionalities/postmortem/minidump-new/TestMiniDumpNew.py (1922 of 2287)
PASS: lldb-api :: commands/expression/deleting-implicit-copy-constructor/TestDeletingImplicitCopyConstructor.py (1923 of 2287)
UNSUPPORTED: lldb-shell :: ScriptInterpreter/Lua/lua.test (1924 of 2287)
PASS: lldb-unit :: UnwindAssembly/x86/./UnwindAssemblyx86Tests/Testx86AssemblyInspectionEngine.TestPopESI (1925 of 2287)
PASS: lldb-api :: tools/lldb-server/thread-name/TestGdbRemoteThreadName.py (1926 of 2287)
PASS: lldb-unit :: Utility/./UtilityTests/RangeTest.Slide (1927 of 2287)
PASS: lldb-unit :: Utility/./UtilityTests/UriParserTest.MinimalPort (1928 of 2287)
PASS: lldb-unit :: Utility/./UtilityTests/StringListTest.SplitIntoLines (1929 of 2287)
PASS: lldb-unit :: Utility/./UtilityTests/StreamTest.PutBytesAsRawHex8ToLittleEndian (1930 of 2287)
UNSUPPORTED: lldb-api :: commands/trace/TestTraceLoad.py (1931 of 2287)
UNSUPPORTED: lldb-api :: benchmarks/libcxxmap/TestBenchmarkLibcxxMap.py (1932 of 2287)
PASS: lldb-unit :: Utility/./UtilityTests/Flags.Test (1933 of 2287)
PASS: lldb-api :: lang/objc/variadic_methods/TestVariadicMethods.py (1934 of 2287)
PASS: lldb-unit :: debugserver/./debugserverTests/RNBSocket.LoopBackListenIPv4 (1935 of 2287)
PASS: lldb-api :: functionalities/thread/concurrent_events/TestConcurrentManyBreakpoints.py (1936 of 2287)
PASS: lldb-api :: tools/lldb-vscode/breakpoint/TestVSCode_setFunctionBreakpoints.py (1937 of 2287)
PASS: lldb-api :: commands/expression/persistent_ptr_update/TestPersistentPtrUpdate.py (1938 of 2287)
PASS: lldb-api :: commands/expression/pr35310/TestExprsBug35310.py (1939 of 2287)
PASS: lldb-shell :: ObjectFile/ELF/basic-info.yaml (1940 of 2287)
UNSUPPORTED: lldb-api :: tools/lldb-vscode/completions/TestVSCode_completions.py (1941 of 2287)
PASS: lldb-shell :: SymbolFile/NativePDB/ast-functions.cpp (1942 of 2287)
PASS: lldb-unit :: Utility/./UtilityTests/StreamTest.PutRawBytesToBigEndian (1943 of 2287)
PASS: lldb-unit :: Signals/./SignalsTests/UnixSignalsTest.GetFilteredSignals (1944 of 2287)
PASS: lldb-api :: lang/objc/modules-non-objc-target/TestObjCModulesNonObjCTarget.py (1945 of 2287)
PASS: lldb-api :: python_api/lldbutil/TestSwigVersion.py (1946 of 2287)
PASS: lldb-api :: commands/expression/persistent_types/TestPersistentTypes.py (1947 of 2287)
PASS: lldb-unit :: Process/gdb-remote/./ProcessGdbRemoteTests/GDBRemoteCommunicationClientTest.SaveRestoreRegistersNoSuffix (1948 of 2287)
PASS: lldb-shell :: SymbolFile/DWARF/x86/dwarf5-atomic.s (1949 of 2287)
UNSUPPORTED: lldb-api :: lang/objc/foundation/TestFoundationDisassembly.py (1950 of 2287)
UNSUPPORTED: lldb-api :: benchmarks/stepping/TestSteppingSpeed.py (1951 of 2287)
PASS: lldb-shell :: Subprocess/vfork-follow-parent.test (1952 of 2287)
PASS: lldb-api :: commands/watchpoints/watchpoint_events/TestWatchpointEvents.py (1953 of 2287)
PASS: lldb-api :: functionalities/thread/concurrent_events/TestConcurrentTwoBreakpointThreads.py (1954 of 2287)
PASS: lldb-api :: types/TestCharTypeExpr.py (1955 of 2287)
PASS: lldb-shell :: SymbolFile/DWARF/x86/debug_rnglists-dwo.s (1956 of 2287)
PASS: lldb-api :: python_api/watchpoint/TestWatchpointIgnoreCount.py (1957 of 2287)
PASS: lldb-unit :: Utility/./UtilityTests/StringListTest.InsertStringAtIndexEnd (1958 of 2287)
PASS: lldb-unit :: SymbolFile/NativePDB/./SymbolFileNativePDBTests/PDBFPOProgramToDWARFExpressionTests.InvalidAssignmentMultiple (1959 of 2287)
PASS: lldb-api :: sanity/TestModuleCacheSanity.py (1960 of 2287)
PASS: lldb-unit :: Host/./HostTests/SocketTests/SocketTest.UDPGetConnectURI/ipv4 (1961 of 2287)
PASS: lldb-unit :: Utility/./UtilityTests/ArgsTest.TestArgv (1962 of 2287)
PASS: lldb-shell :: ScriptInterpreter/Python/Crashlog/text.test (1963 of 2287)
PASS: lldb-unit :: Symbol/./SymbolTests/TestClangASTImporter.CanImportInvalidType (1964 of 2287)
PASS: lldb-api :: lang/cpp/typeof/TestTypeOfDeclTypeExpr.py (1965 of 2287)
PASS: lldb-api :: lang/objc/modules-inline-functions/TestModulesInlineFunctions.py (1966 of 2287)
PASS: lldb-api :: functionalities/process_crash_info/TestProcessCrashInfo.py (1967 of 2287)
PASS: lldb-unit :: Expression/./ExpressionTests/DiagnosticManagerTest.PutStringMultiple (1968 of 2287)
PASS: lldb-shell :: ObjectFile/ELF/netbsd-core-amd64.test (1969 of 2287)
PASS: lldb-api :: lang/cpp/gmodules/TestWithModuleDebugging.py (1970 of 2287)
PASS: lldb-api :: api/multiple-debuggers/TestMultipleDebuggers.py (1971 of 2287)
PASS: lldb-unit :: UnwindAssembly/x86/./UnwindAssemblyx86Tests/Testx86AssemblyInspectionEngine.TestPopR14 (1972 of 2287)
PASS: lldb-unit :: Utility/./UtilityTests/StreamTeeTest.AppendStream (1973 of 2287)
PASS: lldb-unit :: Utility/./UtilityTests/ArgsTest.GetArgumentArrayRef (1974 of 2287)
PASS: lldb-api :: commands/expression/ir-interpreter/TestIRInterpreter.py (1975 of 2287)
PASS: lldb-unit :: Utility/./UtilityTests/StringListTest.RemoveBlankLines (1976 of 2287)
PASS: lldb-api :: functionalities/postmortem/netbsd-core/TestNetBSDCore.py (1977 of 2287)
PASS: lldb-unit :: Host/./HostTests/MainLoopTest.Signal (1978 of 2287)
PASS: lldb-shell :: Commands/command-target-modules-dump-sections.yaml (1979 of 2287)
PASS: lldb-unit :: Utility/./UtilityTests/RangeTest.LessThanInvalid (1980 of 2287)
PASS: lldb-api :: commands/command/script/import/rdar-12586188/TestRdar12586188.py (1981 of 2287)
PASS: lldb-unit :: Platform/Android/./AdbClientTests/AdbClientTest.CreateByDeviceId_ByEnvVar (1982 of 2287)
PASS: lldb-shell :: ScriptInterpreter/Python/scripted_breakpoint_lua.test (1983 of 2287)
PASS: lldb-unit :: ObjectFile/ELF/./ObjectFileELFTests/ObjectFileELFTest.GetModuleSpecifications_EarlySectionHeaders (1984 of 2287)
PASS: lldb-unit :: Utility/./UtilityTests/OptionsWithRawTest.UnterminatedQuote (1985 of 2287)
PASS: lldb-api :: lang/c/local_types/TestUseClosestType.py (1986 of 2287)
PASS: lldb-shell :: ScriptInterpreter/None/none.test (1987 of 2287)
PASS: lldb-unit :: Utility/./UtilityTests/BinaryStreamTest.PutULEB128EightBytes (1988 of 2287)
PASS: lldb-unit :: Expression/./ExpressionTests/DiagnosticManagerTest.AddDiagnostic (1989 of 2287)
PASS: lldb-shell :: Quit/TestQuitExitCode-30.test (1990 of 2287)
PASS: lldb-api :: functionalities/inferior-crashing/TestInferiorCrashing.py (1991 of 2287)
PASS: lldb-unit :: Utility/./UtilityTests/StringExtractorTest.GetHexBytes_FullString (1992 of 2287)
PASS: lldb-api :: lang/objc/foundation/TestObjectDescriptionAPI.py (1993 of 2287)
PASS: lldb-api :: commands/expression/call-function/TestCallUserDefinedFunction.py (1994 of 2287)
PASS: lldb-unit :: Process/Utility/./ProcessUtilityTests/ProcMapTests/LinuxProcMapsTestFixture.ParseMapRegions/1 (1995 of 2287)
PASS: lldb-api :: python_api/sbvalue_persist/TestSBValuePersist.py (1996 of 2287)
PASS: lldb-unit :: Utility/./UtilityTests/BinaryStreamTest.PutULEB128TwoBytes (1997 of 2287)
PASS: lldb-shell :: ObjectFile/Breakpad/discontiguous-sections.test (1998 of 2287)
PASS: lldb-api :: commands/frame/recognizer/TestFrameRecognizer.py (1999 of 2287)
PASS: lldb-unit :: Host/./HostTests/File.GetWaitableHandleFileno (2000 of 2287)
PASS: lldb-unit :: Host/./HostTests/SocketTests/SocketTest.TCPGetAddress/ipv4 (2001 of 2287)
PASS: lldb-api :: functionalities/data-formatter/boolreference/TestFormattersBoolRefPtr.py (2002 of 2287)
UNSUPPORTED: lldb-api :: commands/trace/TestTraceDumpInstructions.py (2003 of 2287)
PASS: lldb-unit :: Utility/./UtilityTests/Flags.AnySet (2004 of 2287)
PASS: lldb-unit :: Core/./LLDBCoreTests/ModuleSpecTest.TestCOFFFile (2005 of 2287)
PASS: lldb-shell :: SymbolFile/DWARF/x86/DW_AT_data_bit_offset-DW_OP_stack_value.s (2006 of 2287)
PASS: lldb-unit :: Utility/./UtilityTests/RangeTest.ContainsEndInclusiveInvalid (2007 of 2287)
PASS: lldb-unit :: Expression/./ExpressionTests/DiagnosticManagerTest.GetStringNoDiags (2008 of 2287)
PASS: lldb-unit :: Interpreter/./InterpreterTests/CompletionTest.DirCompletionUsername (2009 of 2287)
PASS: lldb-api :: commands/expression/import-std-module/weak_ptr/TestWeakPtrFromStdModule.py (2010 of 2287)
PASS: lldb-api :: lang/objcxx/objc-builtin-types/TestObjCBuiltinTypes.py (2011 of 2287)
PASS: lldb-api :: python_api/lldbutil/iter/TestRegistersIterator.py (2012 of 2287)
PASS: lldb-api :: lang/objc/forward-decl/TestForwardDecl.py (2013 of 2287)
UNSUPPORTED: lldb-shell :: ScriptInterpreter/Lua/bindings.test (2014 of 2287)
PASS: lldb-api :: lang/cpp/member-and-local-vars-with-same-name/TestMembersAndLocalsWithSameName.py (2015 of 2287)
PASS: lldb-unit :: Process/gdb-remote/./ProcessGdbRemoteTests/GDBRemoteClientBaseTest.SendContinueAndInterrupt2PacketBug (2016 of 2287)
PASS: lldb-api :: commands/expression/invalid-args/TestInvalidArgsExpression.py (2017 of 2287)
PASS: lldb-unit :: Target/./TargetTests/ModuleCacheTest.GetAndPutStrangeHostname (2018 of 2287)
PASS: lldb-api :: commands/expression/two-files/TestObjCTypeQueryFromOtherCompileUnit.py (2019 of 2287)
PASS: lldb-unit :: Utility/./UtilityTests/TimerTest.CategoryTimesNested (2020 of 2287)
PASS: lldb-shell :: Quit/TestQuitExitCodeHex0.test (2021 of 2287)
PASS: lldb-unit :: Utility/./UtilityTests/TimerTest.CategoryTimes (2022 of 2287)
PASS: lldb-api :: lang/cpp/frame-var-anon-unions/TestFrameVariableAnonymousUnions.py (2023 of 2287)
PASS: lldb-api :: functionalities/data-formatter/data-formatter-stl/libcxx/list/loop/TestDataFormatterLibcxxListLoop.py (2024 of 2287)
PASS: lldb-unit :: Expression/./ExpressionTests/CppModuleConfigurationTest.UnknownLibCppFile (2025 of 2287)
PASS: lldb-api :: functionalities/thread/concurrent_events/TestConcurrentTwoWatchpointsOneDelayBreakpoint.py (2026 of 2287)
PASS: lldb-unit :: Utility/./UtilityTests/ProcessInstanceInfo.DumpTable_invalidUID (2027 of 2287)
PASS: lldb-api :: macosx/find-dsym/deep-bundle/TestDeepBundle.py (2028 of 2287)
PASS: lldb-shell :: ObjectFile/ELF/null-jmprel.yaml (2029 of 2287)
UNSUPPORTED: lldb-api :: benchmarks/frame_variable/TestFrameVariableResponse.py (2030 of 2287)
PASS: lldb-api :: commands/command/script_alias/TestCommandScriptAlias.py (2031 of 2287)
PASS: lldb-unit :: Utility/./UtilityTests/StringExtractorTest.GetHexU8_InvalidHex (2032 of 2287)
PASS: lldb-unit :: Host/./HostTests/ConnectionFileDescriptorTest.TCPGetURIv4 (2033 of 2287)
PASS: lldb-api :: commands/expression/import-std-module/unique_ptr/TestUniquePtrFromStdModule.py (2034 of 2287)
PASS: lldb-api :: commands/expression/issue_11588/Test11588.py (2035 of 2287)
PASS: lldb-unit :: ScriptInterpreter/Python/./ScriptInterpreterPythonTests/PythonDataObjectsTest.TestScript (2036 of 2287)
PASS: lldb-api :: commands/settings/TestSettings.py (2037 of 2287)
PASS: lldb-unit :: Symbol/./SymbolTests/LineEntryTest.GetSameLineContiguousAddressRangeOneInline (2038 of 2287)
PASS: lldb-api :: functionalities/thread/backtrace_all/TestBacktraceAll.py (2039 of 2287)
PASS: lldb-unit :: Utility/./UtilityTests/PassiveReplayTest.InstrumentedFooInvalid (2040 of 2287)
PASS: lldb-api :: functionalities/tail_call_frames/disambiguate_paths_to_common_sink/TestDisambiguatePathsToCommonSink.py (2041 of 2287)
PASS: lldb-unit :: Utility/./UtilityTests/StructuredDataTest.ParseJSONFromFile (2042 of 2287)
PASS: lldb-api :: lang/c/offsetof/TestOffsetof.py (2043 of 2287)
PASS: lldb-api :: functionalities/completion/TestCompletion.py (2044 of 2287)
PASS: lldb-api :: functionalities/data-formatter/data-formatter-stl/libcxx/map/TestDataFormatterLibccMap.py (2045 of 2287)
PASS: lldb-api :: commands/platform/sdk/TestPlatformSDK.py (2046 of 2287)
PASS: lldb-api :: functionalities/data-formatter/data-formatter-stl/libcxx/vector/TestDataFormatterLibcxxVector.py (2047 of 2287)
PASS: lldb-api :: functionalities/gdb_remote_client/TestPlatformClient.py (2048 of 2287)
PASS: lldb-api :: commands/expression/import-std-module/unique_ptr-dbg-info-content/TestUniquePtrDbgInfoContent.py (2049 of 2287)
TIMEOUT: lldb-api :: tools/lldb-server/memory-allocation/TestGdbRemoteMemoryAllocation.py (2050 of 2287)
******************** TEST 'lldb-api :: tools/lldb-server/memory-allocation/TestGdbRemoteMemoryAllocation.py' FAILED ********************
Script:
--
/Users/buildslave/jenkins/workspace/lldb-cmake-sanitized/lldb-build/lldb-test-build.noindex/copied-python /Users/buildslave/jenkins/workspace/lldb-cmake-sanitized/llvm-project/lldb/test/API/dotest.py -u CXXFLAGS -u CFLAGS --codesign-identity lldb_codesign --arch x86_64 --build-dir /Users/buildslave/jenkins/workspace/lldb-cmake-sanitized/lldb-build/lldb-test-build.noindex -t --env TERM=vt100 --env LLVM_LIBS_DIR=/Users/buildslave/jenkins/workspace/lldb-cmake-sanitized/lldb-build/./lib --inferior-env ASAN_OPTIONS=detect_stack_use_after_return=1 --inferior-env DYLD_INSERT_LIBRARIES=/Users/buildslave/jenkins/workspace/lldb-cmake-sanitized/host-compiler/lib/clang/13.0.0/lib/darwin/libclang_rt.asan_osx_dynamic.dylib --arch x86_64 --build-dir /Users/buildslave/jenkins/workspace/lldb-cmake-sanitized/lldb-build/lldb-test-build.noindex --lldb-module-cache-dir /Users/buildslave/jenkins/workspace/lldb-cmake-sanitized/lldb-build/lldb-test-build.noindex/module-cache-lldb/lldb-api --clang-module-cache-dir /Users/buildslave/jenkins/workspace/lldb-cmake-sanitized/lldb-build/lldb-test-build.noindex/module-cache-clang/lldb-api --executable /Users/buildslave/jenkins/workspace/lldb-cmake-sanitized/lldb-build/./bin/lldb --compiler /Users/buildslave/jenkins/workspace/lldb-cmake-sanitized/lldb-build/./bin/clang --dsymutil /Users/buildslave/jenkins/workspace/lldb-cmake-sanitized/lldb-build/./bin/dsymutil --llvm-tools-dir /Users/buildslave/jenkins/workspace/lldb-cmake-sanitized/lldb-build/./bin --lldb-libs-dir /Users/buildslave/jenkins/workspace/lldb-cmake-sanitized/lldb-build/./lib /Users/buildslave/jenkins/workspace/lldb-cmake-sanitized/llvm-project/lldb/test/API/tools/lldb-server/memory-allocation -p TestGdbRemoteMemoryAllocation.py
--
Exit Code: -9
Timeout: Reached timeout of 1200 seconds

Hide Details

Command Output (stdout): -- lldb version 13.0.99 (http://labmaster3.local/git/llvm-project.git revision c3f127146415c1dd59db798fc244e14ec9feeed1) clang revision c3f127146415c1dd59db798fc244e14ec9feeed1 llvm revision c3f127146415c1dd59db798fc244e14ec9feeed1

Hide Details

-- Command Output (stderr): -- ================================================================= ==47281==ERROR: AddressSanitizer: heap-use-after-free on address 0x604000001870 at pc 0x000107429f5d bp 0x7ffee88d1390 sp 0x7ffee88d1388 READ of size 8 at 0x604000001870 thread T0 #0 0x107429f5c in MachTask::DeallocateMemory(unsigned long long) MachTask.mm:994 #1 0x10734fa3c in DNBProcessMemoryDeallocate(int, unsigned long long) DNB.cpp:1293 #2 0x10739db3f in RNBRemote::HandlePacket_DeallocateMemory(char const*) RNBRemote.cpp:3518 #3 0x1073ad9cc in RNBRemote::HandleReceivedPacket(RNBRemote::PacketEnum*) RNBRemote.cpp:1074 #4 0x10733381b in RNBRunLoopInferiorExecuting(RNBRemote*) debugserver.cpp:573 #5 0x10733702b in main debugserver.cpp:1663 #6 0x7fff6d7e2cc8 in start+0x0 (libdyld.dylib:x86_64+0x1acc8)

Hide Details

0x604000001870 is located 32 bytes inside of 48-byte region [0x604000001850,0x604000001880) freed by thread T0 here: #0 0x107b01f1d in wrap__ZdlPv+0x7d (libclang_rt.asan_osx_dynamic.dylib:x86_64+0x4ff1d) #1 0x10742ad95 in std::__1::__tree<std::__1::__value_type<unsigned long long, unsigned long>, std::__1::__map_value_compare<unsigned long long, std::__1::__value_type<unsigned long long, unsigned long>, std::__1::less<unsigned long long>, true>, std::__1::allocator<std::__1::__value_type<unsigned long long, unsigned long> > >::erase(std::__1::__tree_const_iterator<std::__1::__value_type<unsigned long long, unsigned long>, std::__1::__tree_node<std::__1::__value_type<unsigned long long, unsigned long>, void*>*, long>) __tree:2424 #2 0x107429d1e in MachTask::DeallocateMemory(unsigned long long) MachTask.mm:987 #3 0x10734fa3c in DNBProcessMemoryDeallocate(int, unsigned long long) DNB.cpp:1293 #4 0x10739db3f in RNBRemote::HandlePacket_DeallocateMemory(char const*) RNBRemote.cpp:3518 #5 0x1073ad9cc in RNBRemote::HandleReceivedPacket(RNBRemote::PacketEnum*) RNBRemote.cpp:1074 #6 0x10733381b in RNBRunLoopInferiorExecuting(RNBRemote*) debugserver.cpp:573 #7 0x10733702b in main debugserver.cpp:1663 #8 0x7fff6d7e2cc8 in start+0x0 (libdyld.dylib:x86_64+0x1acc8)

Hide Details

previously allocated by thread T0 here: #0 0x107b01afd in wrap__Znwm+0x7d (libclang_rt.asan_osx_dynamic.dylib:x86_64+0x4fafd) #1 0x10742a872 in std::__1::unique_ptr<std::__1::__tree_node<std::__1::__value_type<unsigned long long, unsigned long>, void*>, std::__1::__tree_node_destructor<std::__1::allocator<std::__1::__tree_node<std::__1::__value_type<unsigned long long, unsigned long>, void*> > > > std::__1::__tree<std::__1::__value_type<unsigned long long, unsigned long>, std::__1::__map_value_compare<unsigned long long, std::__1::__value_type<unsigned long long, unsigned long>, std::__1::less<unsigned long long>, true>, std::__1::allocator<std::__1::__value_type<unsigned long long, unsigned long> > >::__construct_node<std::__1::pair<unsigned long long, unsigned long> >(std::__1::pair<unsigned long long, unsigned long>&&) __tree:2133 #2 0x10742a456 in std::__1::pair<std::__1::__tree_iterator<std::__1::__value_type<unsigned long long, unsigned long>, std::__1::__tree_node<std::__1::__value_type<unsigned long long, unsigned long>, void*>*, long>, bool> std::__1::__tree<std::__1::__value_type<unsigned long long, unsigned long>, std::__1::__map_value_compare<unsigned long long, std::__1::__value_type<unsigned long long, unsigned long>, std::__1::less<unsigned long long>, true>, std::__1::allocator<std::__1::__value_type<unsigned long long, unsigned long> > >::__emplace_unique_key_args<unsigned long long, std::__1::pair<unsigned long long, unsigned long> >(unsigned long long const&, std::__1::pair<unsigned long long, unsigned long>&&) __tree:2096 #3 0x107429845 in MachTask::AllocateMemory(unsigned long, unsigned int) MachTask.mm:967 #4 0x10734f810 in DNBProcessMemoryAllocate(int, unsigned long, unsigned int) DNB.cpp:1286 #5 0x10739d50b in RNBRemote::HandlePacket_AllocateMemory(char const*) RNBRemote.cpp:3489 #6 0x1073ad9cc in RNBRemote::HandleReceivedPacket(RNBRemote::PacketEnum*) RNBRemote.cpp:1074 #7 0x10733381b in RNBRunLoopInferiorExecuting(RNBRemote*) debugserver.cpp:573 #8 0x10733702b in main debugserver.cpp:1663 #9 0x7fff6d7e2cc8 in start+0x0 (libdyld.dylib:x86_64+0x1acc8)

Hide Details

SUMMARY: AddressSanitizer: heap-use-after-free MachTask.mm:994 in MachTask::DeallocateMemory(unsigned long long) Shadow bytes around the buggy address: 0x1c08000002b0: fa fa fd fd fd fd fd fa fa fa fd fd fd fd fd fd 0x1c08000002c0: fa fa fd fd fd fd fd fd fa fa fd fd fd fd fd fd 0x1c08000002d0: fa fa fd fd fd fd fd fd fa fa fd fd fd fd fd fd 0x1c08000002e0: fa fa fd fd fd fd fd fd fa fa fd fd fd fd fd fd 0x1c08000002f0: fa fa fd fd fd fd fd fd fa fa fd fd fd fd fd fd =>0x1c0800000300: fa fa fd fd fd fd fd fd fa fa fd fd fd fd[fd]fd 0x1c0800000310: fa fa fd fd fd fd fd fd fa fa fd fd fd fd fd fd 0x1c0800000320: fa fa fd fd fd fd fd fd fa fa fd fd fd fd fd fd 0x1c0800000330: fa fa fd fd fd fd fd fd fa fa 00 00 00 00 00 00 0x1c0800000340: fa fa fa fa fa fa fa fa fa fa fa fa fa fa fa fa 0x1c0800000350: fa fa fa fa fa fa fa fa fa fa fa fa fa fa fa fa Shadow byte legend (one shadow byte represents 8 application bytes): Addressable: 00 Partially addressable: 01 02 03 04 05 06 07 Heap left redzone: fa Freed heap region: fd Stack left redzone: f1 Stack mid redzone: f2 Stack right redzone: f3 Stack after return: f5 Stack use after scope: f8 Global redzone: f9 Global init order: f6 Poisoned by user: f7 Container overflow: fc Array cookie: ac Intra object redzone: bb ASan internal: fe Left alloca redzone: ca Right alloca redzone: cb Shadow gap: cc ==47281==ABORTING

Hide Details

--

Hide Details

******************** PASS: lldb-api :: lang/objcxx/hide-runtime-values/TestObjCXXHideRuntimeValues.py (2051 of 2287) PASS: lldb-shell :: Reproducer/TestWorkingDir.test (2052 of 2287) PASS: lldb-unit :: Utility/./UtilityTests/StringListTest.JoinThree (2053 of 2287) PASS: lldb-shell :: SymbolFile/Breakpad/line-table-discontinuous-file-ids.test (2054 of 2287) PASS: lldb-api :: commands/expression/import-std-module/deque-dbg-info-content/TestDbgInfoContentDequeFromStdModule.py (2055 of 2287) PASS: lldb-api :: lang/objc/objc-new-syntax/TestObjCNewSyntaxLiteral.py (2056 of 2287) UNSUPPORTED: lldb-api :: functionalities/darwin_log/source/debug/TestDarwinLogSourceDebug.py (2057 of 2287) UNSUPPORTED: lldb-api :: tools/lldb-server/libraries-svr4/TestGdbRemoteLibrariesSvr4Support.py (2058 of 2287) PASS: lldb-unit :: Process/minidump/./LLDBMinidumpTests/MinidumpParserTest.GetMemoryRegionInfoFromMemoryList (2059 of 2287) PASS: lldb-api :: lang/cpp/namespace/TestNamespace.py (2060 of 2287) PASS: lldb-unit :: UnwindAssembly/x86/./UnwindAssemblyx86Tests/Testx86AssemblyInspectionEngine.Test32bitFramelessSmallStackFrame (2061 of 2287) PASS: lldb-api :: lang/cpp/class_types/TestClassTypesDisassembly.py (2062 of 2287) PASS: lldb-unit :: UnwindAssembly/x86/./UnwindAssemblyx86Tests/Testx86AssemblyInspectionEngine.TestPushRBX (2063 of 2287) PASS: lldb-shell :: ObjectFile/wasm/stripped-debug-sections.yaml (2064 of 2287) PASS: lldb-unit :: Utility/./UtilityTests/StreamTest.PutChar (2065 of 2287) PASS: lldb-unit :: Utility/./UtilityTests/StringExtractorTest.DecodeHexU8_Extra (2066 of 2287) PASS: lldb-shell :: Settings/TestDisassemblyFormat.test (2067 of 2287) UNSUPPORTED: lldb-api :: commands/register/register/intel_xtended_registers/mpx_bound_violation/TestBoundViolation.py (2068 of 2287) PASS: lldb-api :: functionalities/breakpoint/breakpoint_hit_count/TestBreakpointHitCount.py (2069 of 2287) PASS: lldb-unit :: Expression/./ExpressionTests/CppModuleConfigurationTest.Xcode (2070 of 2287) PASS: lldb-api :: functionalities/breakpoint/serialize/TestBreakpointSerialization.py (2071 of 2287) PASS: lldb-api :: lang/c/global_variables/TestGlobalVariables.py (2072 of 2287) PASS: lldb-api :: test_utils/TestPExpectTest.py (2073 of 2287) PASS: lldb-shell :: SymbolFile/DWARF/x86/dir-separator-windows.s (2074 of 2287) PASS: lldb-api :: arm/emulation/TestEmulations.py (2075 of 2287) PASS: lldb-shell :: Commands/CommandScriptImmediateOutput/CommandScriptImmediateOutputConsole.test (2076 of 2287) PASS: lldb-shell :: SymbolFile/DWARF/x86/dwarf5-implicit-const.s (2077 of 2287) PASS: lldb-shell :: ScriptInterpreter/Python/fail_breakpoint_oneline.test (2078 of 2287) PASS: lldb-api :: functionalities/data-formatter/nsarraysynth/TestNSArraySynthetic.py (2079 of 2287) PASS: lldb-unit :: Expression/./ExpressionTests/DWARFExpression.DW_OP_implicit_value (2080 of 2287) PASS: lldb-api :: macosx/universal/TestUniversal.py (2081 of 2287) PASS: lldb-unit :: Utility/./UtilityTests/StringListTest.ShiftCString (2082 of 2287) PASS: lldb-api :: lang/cpp/non-type-template-param/TestCppNonTypeTemplateParam.py (2083 of 2287) PASS: lldb-unit :: Utility/./UtilityTests/StringExtractorTest.GetHexBytesAvail_OddPair2 (2084 of 2287) PASS: lldb-shell :: Driver/TestProcessAttach.test (2085 of 2287) PASS: lldb-unit :: Expression/./ExpressionTests/DiagnosticManagerTest.GetStringMultipleDiags (2086 of 2287) PASS: lldb-api :: lang/cpp/incomplete-types/TestCppIncompleteTypes.py (2087 of 2287) PASS: lldb-unit :: Utility/./UtilityTests/Flags.Clear (2088 of 2287) PASS: lldb-shell :: Reproducer/TestGDBRemoteRepro.test (2089 of 2287) PASS: lldb-api :: functionalities/breakpoint/inlined_breakpoints/TestInlinedBreakpoints.py (2090 of 2287) PASS: lldb-api :: functionalities/tail_call_frames/sbapi_support/TestTailCallFrameSBAPI.py (2091 of 2287) PASS: lldb-unit :: Language/CPlusPlus/./LanguageCPlusPlusTests/CPlusPlusLanguage.CPlusPlusNameParser (2092 of 2287) UNSUPPORTED: lldb-shell :: ScriptInterpreter/Lua/command_script_import.test (2093 of 2287) PASS: lldb-api :: lang/objc/objc-stepping/TestObjCStepping.py (2094 of 2287) PASS: lldb-unit :: Utility/./UtilityTests/StreamTest.PutHex32ByteOrderBig (2095 of 2287) PASS: lldb-shell :: Reproducer/TestFileRepro.test (2096 of 2287) PASS: lldb-unit :: Host/./HostTests/MainLoopTest.DetectsEOF (2097 of 2287) PASS: lldb-unit :: ObjectFile/ELF/./ObjectFileELFTests/ObjectFileELFTest.SectionsResolveConsistently (2098 of 2287) PASS: lldb-unit :: Process/gdb-remote/./ProcessGdbRemoteTests/GDBRemoteClientBaseTest.SendContinueAndWait (2099 of 2287) UNSUPPORTED: lldb-api :: functionalities/ubsan/basic/TestUbsanBasic.py (2100 of 2287) PASS: lldb-api :: functionalities/breakpoint/breakpoint_conditions/TestBreakpointConditions.py (2101 of 2287) PASS: lldb-shell :: ObjectFile/Breakpad/uuid-matching-mac.test (2102 of 2287) PASS: lldb-api :: python_api/lldbutil/iter/TestLLDBIterator.py (2103 of 2287) PASS: lldb-unit :: Symbol/./SymbolTests/TestTypeSystemClang.TestGetEnumIntegerTypeInvalid (2104 of 2287) PASS: lldb-api :: lang/cpp/subst_template_type_param/TestSubstTemplateTypeParam.py (2105 of 2287) PASS: lldb-api :: tools/lldb-server/TestGdbRemoteAttachWait.py (2106 of 2287) PASS: lldb-api :: functionalities/gdb_remote_client/TestStopPCs.py (2107 of 2287) TIMEOUT: lldb-api :: tools/lldb-server/vCont-threads/TestGdbRemote_vContThreads.py (2108 of 2287) ******************** TEST 'lldb-api :: tools/lldb-server/vCont-threads/TestGdbRemote_vContThreads.py' FAILED ******************** Script: -- /Users/buildslave/jenkins/workspace/lldb-cmake-sanitized/lldb-build/lldb-test-build.noindex/copied-python /Users/buildslave/jenkins/workspace/lldb-cmake-sanitized/llvm-project/lldb/test/API/dotest.py -u CXXFLAGS -u CFLAGS --codesign-identity lldb_codesign --arch x86_64 --build-dir /Users/buildslave/jenkins/workspace/lldb-cmake-sanitized/lldb-build/lldb-test-build.noindex -t --env TERM=vt100 --env LLVM_LIBS_DIR=/Users/buildslave/jenkins/workspace/lldb-cmake-sanitized/lldb-build/./lib --inferior-env ASAN_OPTIONS=detect_stack_use_after_return=1 --inferior-env DYLD_INSERT_LIBRARIES=/Users/buildslave/jenkins/workspace/lldb-cmake-sanitized/host-compiler/lib/clang/13.0.0/lib/darwin/libclang_rt.asan_osx_dynamic.dylib --arch x86_64 --build-dir /Users/buildslave/jenkins/workspace/lldb-cmake-sanitized/lldb-build/lldb-test-build.noindex --lldb-module-cache-dir /Users/buildslave/jenkins/workspace/lldb-cmake-sanitized/lldb-build/lldb-test-build.noindex/module-cache-lldb/lldb-api --clang-module-cache-dir /Users/buildslave/jenkins/workspace/lldb-cmake-sanitized/lldb-build/lldb-test-build.noindex/module-cache-clang/lldb-api --executable /Users/buildslave/jenkins/workspace/lldb-cmake-sanitized/lldb-build/./bin/lldb --compiler /Users/buildslave/jenkins/workspace/lldb-cmake-sanitized/lldb-build/./bin/clang --dsymutil /Users/buildslave/jenkins/workspace/lldb-cmake-sanitized/lldb-build/./bin/dsymutil --llvm-tools-dir /Users/buildslave/jenkins/workspace/lldb-cmake-sanitized/lldb-build/./bin --lldb-libs-dir /Users/buildslave/jenkins/workspace/lldb-cmake-sanitized/lldb-build/./lib /Users/buildslave/jenkins/workspace/lldb-cmake-sanitized/llvm-project/lldb/test/API/tools/lldb-server/vCont-threads -p TestGdbRemote_vContThreads.py -- Exit Code: -9 Timeout: Reached timeout of 1200 seconds

Hide Details

Command Output (stdout): -- lldb version 13.0.99 (http://labmaster3.local/git/llvm-project.git revision c3f127146415c1dd59db798fc244e14ec9feeed1) clang revision c3f127146415c1dd59db798fc244e14ec9feeed1 llvm revision c3f127146415c1dd59db798fc244e14ec9feeed1

Hide Details

--

Hide Details

******************** PASS: lldb-unit :: Process/Utility/./ProcessUtilityTests/ProcMapTests/LinuxProcMapsTestFixture.ParseMapRegions/8 (2109 of 2287) PASS: lldb-api :: functionalities/gdb_remote_client/TestThreadSelectionBug.py (2110 of 2287) PASS: lldb-api :: commands/process/signal/TestProcessSignal.py (2111 of 2287) PASS: lldb-shell :: SymbolFile/NativePDB/bitfields.cpp (2112 of 2287) PASS: lldb-unit :: Utility/./UtilityTests/SharedCluster.ClusterManager (2113 of 2287) PASS: lldb-api :: lang/c/array_types/TestArrayTypes.py (2114 of 2287) PASS: lldb-api :: functionalities/thread/jump/TestThreadJump.py (2115 of 2287) PASS: lldb-api :: functionalities/gdb_remote_client/TestJLink6Armv7RegisterDefinition.py (2116 of 2287) PASS: lldb-unit :: Process/Utility/./ProcessUtilityTests/ProcSMapTests/LinuxProcSMapsTestFixture.ParseSMapRegions/1 (2117 of 2287) PASS: lldb-unit :: Utility/./UtilityTests/FileSpecTest.FormatFileSpec (2118 of 2287) PASS: lldb-api :: lang/objc/modules/TestObjCModules.py (2119 of 2287) PASS: lldb-unit :: Utility/./UtilityTests/AnsiTerminal.AtEnd (2120 of 2287) PASS: lldb-unit :: SymbolFile/NativePDB/./SymbolFileNativePDBTests/PDBFPOProgramToDWARFExpressionTests.SingleAssignmentRegisterRef (2121 of 2287) PASS: lldb-api :: functionalities/dynamic_value_child_count/TestDynamicValueChildCount.py (2122 of 2287) PASS: lldb-unit :: Utility/./UtilityTests/ReproducerTest.SetCapture (2123 of 2287) PASS: lldb-unit :: Utility/./UtilityTests/BinaryStreamTest.PutULEB128OneByte (2124 of 2287) PASS: lldb-unit :: Process/gdb-remote/./ProcessGdbRemoteTests/GDBRemoteCommunicationServerTest.SendErrorResponse_ErrorNumber (2125 of 2287) PASS: lldb-unit :: Symbol/./SymbolTests/TestTypeSystemClang.TestGetTypeClassTypeOf (2126 of 2287) PASS: lldb-unit :: Thread/./ThreadTests/ThreadTest.SetStopInfo (2127 of 2287) PASS: lldb-unit :: Utility/./UtilityTests/ArgsTest.ReplaceArgumentAtIndexEqual (2128 of 2287) PASS: lldb-unit :: Utility/./UtilityTests/BinaryStreamTest.PutSLEB128FiveBytes (2129 of 2287) PASS: lldb-unit :: Host/./HostTests/FileSystemTest.Readable (2130 of 2287) PASS: lldb-shell :: SymbolFile/DWARF/x86/find-inline-method.s (2131 of 2287) PASS: lldb-unit :: Utility/./UtilityTests/StreamTest.AddressRangeEmptyRange (2132 of 2287) PASS: lldb-shell :: SymbolFile/DWARF/x86/win-i386-line-table.s (2133 of 2287) PASS: lldb-unit :: Expression/./ExpressionTests/DiagnosticManagerTest.GetStringPreserveOrder (2134 of 2287) PASS: lldb-unit :: Thread/./ThreadTests/ThreadTest.GetPrivateStopInfo (2135 of 2287) PASS: lldb-unit :: Utility/./UtilityTests/StringListTest.LongestCommonPrefixEmpty (2136 of 2287) PASS: lldb-api :: functionalities/data-formatter/data-formatter-stl/libcxx/shared_ptr/TestDataFormatterLibcxxSharedPtr.py (2137 of 2287) PASS: lldb-api :: functionalities/source-map/TestTargetSourceMap.py (2138 of 2287) PASS: lldb-unit :: Language/CPlusPlus/./LanguageCPlusPlusTests/CPlusPlusLanguage.FindAlternateFunctionManglings (2139 of 2287) PASS: lldb-api :: python_api/target/TestTargetAPI.py (2140 of 2287) PASS: lldb-api :: lang/cpp/keywords_enabled/TestCppKeywordsEnabled.py (2141 of 2287) PASS: lldb-api :: commands/expression/codegen-crash-import-def-arraytype-element/TestImportDefinitionArrayType.py (2142 of 2287) PASS: lldb-api :: commands/expression/context-object/TestContextObject.py (2143 of 2287) PASS: lldb-api :: functionalities/gdb_remote_client/TestPartialGPacket.py (2144 of 2287) PASS: lldb-api :: commands/frame/var-scope/TestFrameVariableScope.py (2145 of 2287) PASS: lldb-unit :: Utility/./UtilityTests/BinaryStreamTest.PutSLEB128MaxValue (2146 of 2287) PASS: lldb-shell :: Breakpoint/debug_addrx.test (2147 of 2287) PASS: lldb-api :: functionalities/thread/concurrent_events/TestConcurrentBreakpointOneDelayBreakpointThreads.py (2148 of 2287) PASS: lldb-shell :: Commands/command-source.test (2149 of 2287) PASS: lldb-unit :: Core/./LLDBCoreTests/RichManglingContextTest.SwitchProvider (2150 of 2287) PASS: lldb-shell :: ObjectFile/ELF/PT_TLS-overlap-PT_LOAD.yaml (2151 of 2287) PASS: lldb-unit :: Utility/./UtilityTests/StatusTest.ErrorConversion (2152 of 2287) PASS: lldb-unit :: UnwindAssembly/x86/./UnwindAssemblyx86Tests/Testx86AssemblyInspectionEngine.TestPopR15 (2153 of 2287) PASS: lldb-unit :: Utility/./UtilityTests/ArgsTest.TestSingleQuotedArgWithSpace (2154 of 2287) PASS: lldb-unit :: UnwindAssembly/x86/./UnwindAssemblyx86Tests/Testx86AssemblyInspectionEngine.TestSpillRegToStackViaMOVx86_64 (2155 of 2287) PASS: lldb-unit :: Target/./TargetTests/PathMappingListTest.RemapRoot (2156 of 2287) PASS: lldb-api :: functionalities/memory-region/TestMemoryRegion.py (2157 of 2287) PASS: lldb-unit :: Utility/./UtilityTests/ArgsTest.TestMultipleArgs (2158 of 2287) PASS: lldb-api :: commands/breakpoint/command/list/TestBreakpointCommandList.py (2159 of 2287) PASS: lldb-api :: lang/cpp/this/TestCPPThis.py (2160 of 2287) PASS: lldb-shell :: ScriptInterpreter/Python/command_relative_import.test (2161 of 2287) PASS: lldb-unit :: UnwindAssembly/x86/./UnwindAssemblyx86Tests/Testx86AssemblyInspectionEngine.TestCALLNextInsn (2162 of 2287) PASS: lldb-api :: types/TestIntegerTypeExpr.py (2163 of 2287) PASS: lldb-unit :: Utility/./UtilityTests/RangeTest.SlideZero (2164 of 2287) UNSUPPORTED: lldb-shell :: ScriptInterpreter/Lua/persistent_state.test (2165 of 2287) PASS: lldb-api :: python_api/function_symbol/TestDisasmAPI.py (2166 of 2287) PASS: lldb-api :: lang/cpp/thread_local/TestThreadLocal.py (2167 of 2287) PASS: lldb-api :: commands/platform/process/list/TestProcessList.py (2168 of 2287) PASS: lldb-unit :: Utility/./UtilityTests/RangeTest.Copy (2169 of 2287) PASS: lldb-api :: commands/expression/argument_passing_restrictions/TestArgumentPassingRestrictions.py (2170 of 2287) PASS: lldb-unit :: ScriptInterpreter/Python/./ScriptInterpreterPythonTests/PythonDataObjectsTest.TestPythonInteger (2171 of 2287) PASS: lldb-unit :: Process/gdb-remote/./ProcessGdbRemoteTests/GDBRemoteCommunicationServerTest.SendErrorResponse_Status (2172 of 2287) PASS: lldb-api :: lang/objc/objc-baseclass-sbtype/TestObjCBaseClassSBType.py (2173 of 2287) PASS: lldb-api :: functionalities/data-formatter/data-formatter-categories/TestDataFormatterCategories.py (2174 of 2287) PASS: lldb-unit :: Utility/./UtilityTests/PassiveReplayTest.InstrumentedFoo (2175 of 2287) UNSUPPORTED: lldb-api :: python_api/disassemble-raw-data/TestDisassemble_VST1_64.py (2176 of 2287) UNSUPPORTED: lldb-api :: commands/platform/connect/TestPlatformConnect.py (2177 of 2287) UNSUPPORTED: lldb-shell :: SymbolFile/DWARF/x86/DW_TAG_GNU_call_site-DW_AT_low_pc.s (2178 of 2287) PASS: lldb-api :: lang/objc/objc-checker/TestObjCCheckers.py (2179 of 2287) PASS: lldb-unit :: SymbolFile/NativePDB/./SymbolFileNativePDBTests/PDBFPOProgramToDWARFExpressionTests.UnsupportedRASearch (2180 of 2287) UNSUPPORTED: lldb-api :: functionalities/signal/handle-segv/TestHandleSegv.py (2181 of 2287) PASS: lldb-unit :: Language/Highlighting/./HighlighterTests/HighlighterTest.ClangOperators (2182 of 2287) PASS: lldb-api :: functionalities/thread/concurrent_events/TestConcurrentSignalDelayBreak.py (2183 of 2287) PASS: lldb-api :: commands/expression/test/TestExprs.py (2184 of 2287) PASS: lldb-unit :: Expression/./ExpressionTests/DWARFExpression.DW_OP_const (2185 of 2287) PASS: lldb-unit :: Utility/./UtilityTests/StatusTest.Formatv (2186 of 2287) PASS: lldb-unit :: Utility/./UtilityTests/BinaryStreamTest.PutULEB128Zero (2187 of 2287) PASS: lldb-unit :: Utility/./UtilityTests/StringListTest.JoinEmpty (2188 of 2287) PASS: lldb-shell :: SymbolFile/DWARF/x86/DW_AT_decl_file-DW_AT_specification-crosscu.s (2189 of 2287) PASS: lldb-unit :: Utility/./UtilityTests/RecordReplayTest.InstrumentedBarPtr (2190 of 2287) PASS: lldb-shell :: Register/x86-multithread-read.test (2191 of 2287) PASS: lldb-api :: commands/watchpoints/step_over_watchpoint/TestStepOverWatchpoint.py (2192 of 2287) PASS: lldb-api :: functionalities/thread/crash_during_step/TestCrashDuringStep.py (2193 of 2287) UNSUPPORTED: lldb-api :: macosx/posix_spawn/TestLaunchProcessPosixSpawn.py (2194 of 2287) PASS: lldb-unit :: Host/./HostTests/FileSystemTest.Resolve (2195 of 2287) PASS: lldb-unit :: Utility/./UtilityTests/StreamTest.AddressEmptyPrefix (2196 of 2287) PASS: lldb-api :: lang/objc/foundation/TestObjCMethodsString.py (2197 of 2287) PASS: lldb-api :: tools/lldb-vscode/stackTrace/TestVSCode_stackTrace.py (2198 of 2287) PASS: lldb-shell :: Reproducer/TestDriverOptions.test (2199 of 2287) PASS: lldb-shell :: Commands/command-image-lookup.yaml (2200 of 2287) PASS: lldb-unit :: Utility/./UtilityTests/RegularExpression.Empty (2201 of 2287) PASS: lldb-shell :: ObjectFile/MachO/lc_version_min.yaml (2202 of 2287) PASS: lldb-unit :: Process/minidump/./LLDBMinidumpTests/MinidumpParserTest.InvalidMinidump (2203 of 2287) PASS: lldb-unit :: Expression/./ExpressionTests/CppModuleConfigurationTest.UnrelatedLibrary (2204 of 2287) PASS: lldb-shell :: ObjectFile/PECOFF/dep-modules.yaml (2205 of 2287) PASS: lldb-api :: functionalities/object-file/TestImageListMultiArchitecture.py (2206 of 2287) PASS: lldb-api :: commands/watchpoints/watchpoint_commands/command/TestWatchpointCommandPython.py (2207 of 2287) PASS: lldb-api :: types/TestLongTypes.py (2208 of 2287) PASS: lldb-unit :: Utility/./UtilityTests/StringExtractorTest.InitEmpty (2209 of 2287) PASS: lldb-api :: python_api/watchpoint/TestWatchpointIter.py (2210 of 2287) PASS: lldb-unit :: Utility/./UtilityTests/DataExtractorTest.GetDouble (2211 of 2287) PASS: lldb-unit :: Process/minidump/./LLDBMinidumpTests/MinidumpParserTest.MinidumpDuplicateModuleMappedFirst (2212 of 2287) PASS: lldb-unit :: Utility/./UtilityTests/StringListTest.SplitIntoLinesEmpty (2213 of 2287) PASS: lldb-api :: functionalities/breakpoint/breakpoint_command/TestRegexpBreakCommand.py (2214 of 2287) PASS: lldb-api :: commands/expression/call-function/TestCallBuiltinFunction.py (2215 of 2287) PASS: lldb-api :: python_api/interpreter/TestRunCommandInterpreterAPI.py (2216 of 2287) PASS: lldb-unit :: Interpreter/./InterpreterTests/CompletionTest.DirCompletionAbsolute (2217 of 2287) PASS: lldb-unit :: Host/./HostTests/Host.GetEnvironment (2218 of 2287) UNSUPPORTED: lldb-api :: functionalities/gdb_remote_client/TestWasm.py (2219 of 2287) PASS: lldb-shell :: Driver/TestCommands.test (2220 of 2287) PASS: lldb-api :: functionalities/data-formatter/format-propagation/TestFormatPropagation.py (2221 of 2287) PASS: lldb-api :: functionalities/thread/exit_during_step/TestExitDuringStep.py (2222 of 2287) PASS: lldb-api :: functionalities/target-new-solib-notifications/TestModuleLoadedNotifys.py (2223 of 2287) PASS: lldb-api :: functionalities/breakpoint/scripted_bkpt/TestScriptedResolver.py (2224 of 2287) PASS: lldb-api :: functionalities/gdb_remote_client/TestMultiprocess.py (2225 of 2287) PASS: lldb-shell :: Driver/TestFile.test (2226 of 2287) PASS: lldb-api :: functionalities/wrong_commands/TestWrongCommands.py (2227 of 2287) PASS: lldb-unit :: Utility/./UtilityTests/StringExtractorTest.GetHexBytes_OddPair2 (2228 of 2287) PASS: lldb-api :: python_api/hello_world/TestHelloWorld.py (2229 of 2287) PASS: lldb-unit :: Utility/./UtilityTests/StreamTest.AddressSize (2230 of 2287) PASS: lldb-unit :: Utility/./UtilityTests/NameMatchesTest.Equals (2231 of 2287) PASS: lldb-api :: lang/cpp/class_static/TestStaticVariables.py (2232 of 2287) PASS: lldb-api :: functionalities/breakpoint/address_breakpoints/TestBadAddressBreakpoints.py (2233 of 2287) PASS: lldb-unit :: Utility/./UtilityTests/StreamTest.Indent (2234 of 2287) PASS: lldb-unit :: Utility/./UtilityTests/ReproducerTest.SetReplay (2235 of 2287) PASS: lldb-unit :: Host/./HostTests/NativeProcessProtocolTest.SetBreakpointFailRead (2236 of 2287) PASS: lldb-shell :: lldb-server/TestErrorMessages.test (2237 of 2287) PASS: lldb-api :: functionalities/data-formatter/summary-string-onfail/Test-rdar-9974002.py (2238 of 2287) PASS: lldb-unit :: Language/Highlighting/./HighlighterTests/HighlighterTest.ClangCursorPosAfterOtherToken (2239 of 2287) PASS: lldb-api :: functionalities/thread/concurrent_events/TestConcurrentCrashWithWatchpoint.py (2240 of 2287) PASS: lldb-unit :: ScriptInterpreter/Python/./ScriptInterpreterPythonTests/PythonDataObjectsTest.TestInstanceNameResolutionNoDot (2241 of 2287) PASS: lldb-api :: commands/apropos/with-process/TestAproposWithProcess.py (2242 of 2287) PASS: lldb-api :: commands/expression/import-std-module/basic/TestImportStdModule.py (2243 of 2287) PASS: lldb-unit :: Utility/./UtilityTests/StringListTest.GetMaxStringLengthEqualSize (2244 of 2287) UNSUPPORTED: lldb-shell :: BuildScript/toolchain-msvc.test (2245 of 2287) PASS: lldb-api :: functionalities/thread/concurrent_events/TestConcurrentSignalBreak.py (2246 of 2287) PASS: lldb-unit :: Utility/./UtilityTests/LogChannelEnabledTest.LLDB_LOG_ERROR (2247 of 2287) PASS: lldb-unit :: Utility/./UtilityTests/Flags.AnyClear (2248 of 2287) PASS: lldb-api :: commands/expression/dollar-in-variable/TestDollarInVariable.py (2249 of 2287) PASS: lldb-unit :: Process/gdb-remote/./ProcessGdbRemoteTests/PortMapTest.FreePort (2250 of 2287) PASS: lldb-unit :: Utility/./UtilityTests/LogTest.Unregister (2251 of 2287) PASS: lldb-api :: functionalities/inferior-assert/TestInferiorAssert.py (2252 of 2287) PASS: lldb-api :: functionalities/thread/concurrent_events/TestConcurrentDelaySignalWatch.py (2253 of 2287) PASS: lldb-shell :: SymbolFile/DWARF/x86/debug_loc_and_loclists.s (2254 of 2287) UNSUPPORTED: lldb-api :: iohandler/autosuggestion/TestAutosuggestion.py (2255 of 2287) PASS: lldb-unit :: Utility/./UtilityTests/XcodeSDKTest.MergeTest (2256 of 2287) PASS: lldb-api :: functionalities/tail_call_frames/cross_dso/TestCrossDSOTailCalls.py (2257 of 2287) PASS: lldb-api :: lang/c/conflicting-symbol/TestConflictingSymbol.py (2258 of 2287) PASS: lldb-unit :: Utility/./UtilityTests/ArchSpecTest.MergeFromMachOUnknown (2259 of 2287) PASS: lldb-unit :: Utility/./UtilityTests/RecordReplayTest.InstrumentedFoo (2260 of 2287) PASS: lldb-api :: lang/cpp/template/TestTemplateArgs.py (2261 of 2287) PASS: lldb-api :: macosx/DBGSourcePathRemapping/TestDSYMSourcePathRemapping.py (2262 of 2287) PASS: lldb-unit :: Host/./HostTests/SocketTests/SocketTest.TCPListen0ConnectAccept/ipv6 (2263 of 2287) PASS: lldb-unit :: Utility/./UtilityTests/ScalarTest.Scalar_512 (2264 of 2287) PASS: lldb-unit :: Symbol/./SymbolTests/TestTypeSystemClang.TestFunctionTemplateConstruction (2265 of 2287) PASS: lldb-api :: functionalities/data-formatter/data-formatter-synthtype/TestDataFormatterSynthType.py (2266 of 2287) PASS: lldb-unit :: Symbol/./SymbolTests/TestTypeSystemClang.AddMethodToObjCObjectType (2267 of 2287) PASS: lldb-unit :: UnwindAssembly/x86/./UnwindAssemblyx86Tests/Testx86AssemblyInspectionEngine.TestMovRSPtoRBP (2268 of 2287) PASS: lldb-unit :: Utility/./UtilityTests/EnvironmentTest.EnvpConstruction (2269 of 2287) PASS: lldb-api :: functionalities/optimized_code/TestNoASanExceptionAfterEvalOP_piece.py (2270 of 2287) PASS: lldb-shell :: Commands/command-disassemble-process.yaml (2271 of 2287) PASS: lldb-api :: macosx/builtin-debugtrap/TestBuiltinDebugTrap.py (2272 of 2287) PASS: lldb-unit :: Utility/./UtilityTests/SerializationRountripTest.SerializeDeserializeCStringArrayNullptrElem (2273 of 2287) PASS: lldb-api :: commands/expression/save_jit_objects/TestSaveJITObjects.py (2274 of 2287) PASS: lldb-unit :: Language/Highlighting/./HighlighterTests/HighlighterTest.DefaultHighlighter (2275 of 2287) PASS: lldb-unit :: Utility/./UtilityTests/UriParserTest.TypicalPortPathIPv4 (2276 of 2287) PASS: lldb-api :: functionalities/non-overlapping-index-variable-i/TestIndexVariable.py (2277 of 2287) XFAIL: lldb-shell :: Register/x86-64-write.test (2278 of 2287) PASS: lldb-unit :: ScriptInterpreter/Python/./ScriptInterpreterPythonTests/PythonDataObjectsTest.TestExceptions (2279 of 2287) PASS: lldb-api :: commands/expression/import-std-module/shared_ptr-dbg-info-content/TestSharedPtrDbgInfoContentFromStdModule.py (2280 of 2287) UNSUPPORTED: lldb-shell :: Register/x86-64-zmm-write.test (2281 of 2287) PASS: lldb-unit :: Utility/./UtilityTests/StringExtractorTest.GetU32BigEndian (2282 of 2287) PASS: lldb-shell :: SymbolFile/DWARF/x86/split-dwarf-multiple-cu.ll (2283 of 2287) PASS: lldb-unit :: Utility/./UtilityTests/StreamTest.AddressPrefix (2284 of 2287) PASS: lldb-api :: commands/expression/call-throws/TestCallThatThrows.py (2285 of 2287) PASS: lldb-api :: functionalities/return-value/TestReturnValue.py (2286 of 2287) PASS: lldb-api :: commands/expression/import-std-module/vector-bool/TestVectorBoolFromStdModule.py (2287 of 2287) Slowest Tests: -------------------------------------------------------------------------- 1200.09s: lldb-api :: tools/lldb-server/vCont-threads/TestGdbRemote_vContThreads.py 1200.06s: lldb-api :: tools/lldb-server/memory-allocation/TestGdbRemoteMemoryAllocation.py 409.58s: lldb-api :: tools/lldb-server/TestLldbGdbServer.py 283.34s: lldb-api :: api/multithreaded/TestMultithreaded.py 141.01s: lldb-api :: functionalities/completion/TestCompletion.py 125.41s: lldb-api :: lang/objc/exceptions/TestObjCExceptions.py 125.04s: lldb-api :: lang/objc/hidden-ivars/TestHiddenIvars.py 119.27s: lldb-api :: lang/objc/foundation/TestObjCMethods.py 117.95s: lldb-api :: lang/objc/objc-new-syntax/TestObjCNewSyntaxLiteral.py 113.48s: lldb-api :: lang/cpp/namespace/TestNamespaceLookup.py 109.80s: lldb-api :: types/TestLongTypesExpr.py 107.52s: lldb-api :: lang/objc/real-definition/TestRealDefinition.py 99.71s: lldb-api :: functionalities/data-formatter/compactvectors/TestCompactVectors.py 91.82s: lldb-api :: functionalities/gdb_remote_client/TestWasm.py 90.94s: lldb-api :: commands/expression/import-std-module/stack/TestStackFromStdModule.py 90.39s: lldb-api :: lang/objc/objc-new-syntax/TestObjCNewSyntaxDictionary.py 89.99s: lldb-api :: lang/objc/objc-new-syntax/TestObjCNewSyntaxArray.py 89.12s: lldb-api :: commands/expression/import-std-module/queue/TestQueueFromStdModule.py 81.50s: lldb-api :: commands/settings/TestSettings.py 80.07s: lldb-api :: tools/lldb-server/TestGdbRemoteThreadsInStopReply.py

Hide Details

Tests Times: -------------------------------------------------------------------------- [ Range ] :: [ Percentage ] :: [ Count ] -------------------------------------------------------------------------- [1200s,1300s) :: [ ] :: [ 2/2287] [1100s,1200s) :: [ ] :: [ 0/2287] [1000s,1100s) :: [ ] :: [ 0/2287] [ 900s,1000s) :: [ ] :: [ 0/2287] [ 800s, 900s) :: [ ] :: [ 0/2287] [ 700s, 800s) :: [ ] :: [ 0/2287] [ 600s, 700s) :: [ ] :: [ 0/2287] [ 500s, 600s) :: [ ] :: [ 0/2287] [ 400s, 500s) :: [ ] :: [ 1/2287] [ 300s, 400s) :: [ ] :: [ 1/2287] [ 200s, 300s) :: [ ] :: [ 0/2287] [ 100s, 200s) :: [ ] :: [ 9/2287] [ 0s, 100s) :: [*************************************** ] :: [2274/2287] -------------------------------------------------------------------------- ******************** Timed Out Tests (2): lldb-api :: tools/lldb-server/memory-allocation/TestGdbRemoteMemoryAllocation.py lldb-api :: tools/lldb-server/vCont-threads/TestGdbRemote_vContThreads.py

Hide Details

Hide Details

Testing Time: 4445.46s Unsupported : 206 Passed : 2069 Expectedly Failed: 10 Timed Out : 2 FAILED: tools/lldb/test/CMakeFiles/check-lldb cd /Users/buildslave/jenkins/workspace/lldb-cmake-sanitized/lldb-build/tools/lldb/test && /usr/local/Frameworks/Python.framework/Versions/3.7/bin/python3.7 /Users/buildslave/jenkins/workspace/lldb-cmake-sanitized/lldb-build/./bin/llvm-lit -v --time-tests --shuffle --xunit-xml-output=/Users/buildslave/jenkins/workspace/lldb-cmake-sanitized/test/results.xml -v -j 4 --timeout 1200 /Users/buildslave/jenkins/workspace/lldb-cmake-sanitized/lldb-build/tools/lldb/test ninja: build stopped: subcommand failed. Command failed: Command '['/usr/bin/env', 'TERM=vt100', '/usr/local/bin/ninja', '-v', 'check-lldb']' returned non-zero exit status 1. Command: ['/usr/bin/env', 'TERM=vt100', '/usr/local/bin/ninja', '-v', 'check-lldb'] [Pipeline] } [Pipeline] // timeout [Pipeline] } [Pipeline] // stage [Pipeline] stage [Pipeline] { (Declarative: Post Actions) [Pipeline] scanForIssues [Clang (LLVM based)] Sleeping for 5 seconds due to JENKINS-32191... [Clang (LLVM based)] Parsing console log (workspace: '/Users/buildslave/jenkins/workspace/lldb-cmake-sanitized') [Clang (LLVM based)] Successfully parsed console log [Clang (LLVM based)] -> found 0 issues (skipped 0 duplicates) [Clang (LLVM based)] Skipping post processing [Clang (LLVM based)] No filter has been set, publishing all 0 issues [Clang (LLVM based)] Repository miner is not configured, skipping repository mining [Pipeline] junit Recording test results [Checks API] No suitable checks publisher found. [Pipeline] } [Pipeline] // stage [Pipeline] } [Pipeline] // withEnv [Pipeline] } [Pipeline] // node [Pipeline] End of Pipeline ERROR: script returned exit code 1 Finished: FAILURE