FailedConsole Output

Skipping 9,085 KB.. Full Log
PASS: lldb-unit :: Utility/./UtilityTests/BroadcasterTest.EventTypeHasListeners (767 of 2288)
PASS: lldb-unit :: Symbol/./SymbolTests/TestScratchTypeSystemClang.InferSubASTFromLangOpts (768 of 2288)
PASS: lldb-api :: functionalities/load_unload/TestLoadUnload.py (769 of 2288)
PASS: lldb-api :: lang/c/blocks/TestBlocks.py (770 of 2288)
PASS: lldb-shell :: SymbolFile/NativePDB/bitfields.cpp (771 of 2288)
PASS: lldb-api :: functionalities/inferior-crashing/TestInferiorCrashingStep.py (772 of 2288)
PASS: lldb-unit :: Utility/./UtilityTests/StreamTeeTest.AppendStream (773 of 2288)
PASS: lldb-unit :: ScriptInterpreter/Python/./ScriptInterpreterPythonTests/PythonDataObjectsTest.TestPythonCallableCheck (774 of 2288)
PASS: lldb-api :: commands/expression/import-std-module/unique_ptr/TestUniquePtrFromStdModule.py (775 of 2288)
PASS: lldb-unit :: Host/./HostTests/SocketTests/SocketTest.TCPListen0GetPort/ipv4 (776 of 2288)
PASS: lldb-shell :: SymbolFile/DWARF/x86/debug_line-relative_path.s (777 of 2288)
PASS: lldb-api :: functionalities/data-formatter/format-propagation/TestFormatPropagation.py (778 of 2288)
PASS: lldb-unit :: Symbol/./SymbolTests/TestTypeSystemClang.TestGetTypeClassTypeOf (779 of 2288)
PASS: lldb-unit :: Utility/./UtilityTests/StringExtractorTest.GetU64LittleEndian (780 of 2288)
UNSUPPORTED: lldb-api :: commands/trace/TestTraceLoad.py (781 of 2288)
PASS: lldb-api :: commands/command/script/TestCommandScript.py (782 of 2288)
PASS: lldb-api :: commands/expression/top-level/TestTopLevelExprs.py (783 of 2288)
PASS: lldb-unit :: ObjectFile/PECOFF/./ObjectFilePECOFFTests/PECallFrameInfoTest.Frame_reg_eh (784 of 2288)
PASS: lldb-api :: functionalities/inferior-assert/TestInferiorAssert.py (785 of 2288)
PASS: lldb-unit :: Symbol/./SymbolTests/DWARFCallFrameInfoTest.Basic_dwarf4 (786 of 2288)
PASS: lldb-shell :: Quit/TestQuitExitCodeImplicit0.test (787 of 2288)
PASS: lldb-unit :: Utility/./UtilityTests/StringListTest.GetMaxStringLengthMixed (788 of 2288)
PASS: lldb-shell :: SymbolFile/DWARF/x86/DW_AT_data_bit_offset-DW_OP_stack_value.s (789 of 2288)
PASS: lldb-unit :: Core/./LLDBCoreTests/StreamCallbackTest.Callback (790 of 2288)
PASS: lldb-shell :: Driver/TestUseColor.test (791 of 2288)
PASS: lldb-unit :: Utility/./UtilityTests/BinaryStreamTest.PutSLEB128Zero (792 of 2288)
PASS: lldb-shell :: SymbolFile/DWARF/x86/debug-types-line-tables.s (793 of 2288)
PASS: lldb-api :: functionalities/data-formatter/data-formatter-caching/TestDataFormatterCaching.py (794 of 2288)
UNSUPPORTED: lldb-shell :: Unwind/eh-frame-small-fde.test (795 of 2288)
PASS: lldb-unit :: Utility/./UtilityTests/ArgsTest.TestTrailingBackslash (796 of 2288)
PASS: lldb-unit :: Utility/./UtilityTests/FileSpecTest.FileAndDirectoryComponents (797 of 2288)
PASS: lldb-unit :: Language/Highlighting/./HighlighterTests/HighlighterTest.DefaultHighlighterWithCursorOutOfBounds (798 of 2288)
PASS: lldb-api :: tools/lldb-server/TestAppleSimulatorOSType.py (799 of 2288)
PASS: lldb-unit :: DataFormatter/./LLDBFormatterTests/TypeMatcherTests.RegexMatchPart (800 of 2288)
PASS: lldb-api :: lang/c/complex_int/TestComplexInt.py (801 of 2288)
PASS: lldb-api :: commands/expression/import_base_class_when_class_has_derived_member/TestImportBaseClassWhenClassHasDerivedMember.py (802 of 2288)
PASS: lldb-api :: functionalities/breakpoint/cpp_exception/TestCPPExceptionBreakpoint.py (803 of 2288)
UNSUPPORTED: lldb-api :: tools/lldb-server/libraries-svr4/TestGdbRemoteLibrariesSvr4Support.py (804 of 2288)
PASS: lldb-api :: tools/lldb-server/TestGdbRemoteExitCode.py (805 of 2288)
PASS: lldb-unit :: Utility/./UtilityTests/PassiveReplayTest.InstrumentedBarRef (806 of 2288)
PASS: lldb-unit :: Utility/./UtilityTests/DataExtractorTest.GetULEB128_bit63 (807 of 2288)
PASS: lldb-unit :: Process/Utility/./ProcessUtilityTests/ProcSMapTests/LinuxProcSMapsTestFixture.ParseSMapRegions/0 (808 of 2288)
PASS: lldb-unit :: Utility/./UtilityTests/VMRange.IsValid (809 of 2288)
PASS: lldb-unit :: Symbol/./SymbolTests/TestClangASTImporter.CopyDeclTagDecl (810 of 2288)
PASS: lldb-unit :: Utility/./UtilityTests/XcodeSDKTest.MergeTest (811 of 2288)
PASS: lldb-api :: commands/expression/import-std-module/vector-bool/TestVectorBoolFromStdModule.py (812 of 2288)
PASS: lldb-unit :: Utility/./UtilityTests/UriParserTest.Minimal (813 of 2288)
PASS: lldb-api :: lang/cpp/multiple-inheritance/TestCppMultipleInheritance.py (814 of 2288)
PASS: lldb-api :: functionalities/float-display/TestFloatDisplay.py (815 of 2288)
PASS: lldb-unit :: Process/minidump/./LLDBMinidumpTests/MinidumpParserTest.GetThreadContext_x86_32_wow64 (816 of 2288)
PASS: lldb-unit :: Host/./HostTests/MainLoopTest.ReadObject (817 of 2288)
PASS: lldb-unit :: Utility/./UtilityTests/ConstStringTest.CompareConstString (818 of 2288)
PASS: lldb-api :: tools/lldb-vscode/breakpoint/TestVSCode_setBreakpoints.py (819 of 2288)
PASS: lldb-unit :: Symbol/./SymbolTests/DWARFCallFrameInfoTest.Basic_eh (820 of 2288)
PASS: lldb-shell :: SymbolFile/DWARF/x86/split-dwarf-multiple-cu.ll (821 of 2288)
PASS: lldb-shell :: ObjectFile/wasm/stripped-debug-sections.yaml (822 of 2288)
PASS: lldb-unit :: Symbol/./SymbolTests/TestTypeSystemClang.TestGetEnumIntegerTypeInvalid (823 of 2288)
PASS: lldb-api :: functionalities/data-formatter/data-formatter-objc/TestDataFormatterObjCCF.py (824 of 2288)
PASS: lldb-unit :: Utility/./UtilityTests/GeneratorTest.GetOrCreate (825 of 2288)
PASS: lldb-unit :: UnwindAssembly/x86/./UnwindAssemblyx86Tests/Testx86AssemblyInspectionEngine.TestPushEBP (826 of 2288)
PASS: lldb-api :: lang/objc/foundation/TestObjCMethods2.py (827 of 2288)
UNSUPPORTED: lldb-shell :: ScriptInterpreter/Lua/io.test (828 of 2288)
PASS: lldb-unit :: ObjectFile/PECOFF/./ObjectFilePECOFFTests/PECallFrameInfoTest.Chained_eh (829 of 2288)
PASS: lldb-api :: commands/expression/import_builtin_fileid/TestImportBuiltinFileID.py (830 of 2288)
UNSUPPORTED: lldb-api :: iohandler/completion/TestIOHandlerCompletion.py (831 of 2288)
PASS: lldb-unit :: Core/./LLDBCoreTests/RichManglingContextTest.SwitchProvider (832 of 2288)
PASS: lldb-unit :: Utility/./UtilityTests/UriParserTest.BracketedHostnameWithPortIPv6 (833 of 2288)
PASS: lldb-api :: python_api/sberror/TestSBError.py (834 of 2288)
PASS: lldb-api :: commands/expression/entry-bp/TestExprEntryBP.py (835 of 2288)
PASS: lldb-shell :: Reproducer/TestFinalize.test (836 of 2288)
PASS: lldb-unit :: Utility/./UtilityTests/StringExtractorTest.GetHexBytes_OddPair2 (837 of 2288)
PASS: lldb-shell :: Commands/command-script-import.test (838 of 2288)
PASS: lldb-api :: functionalities/breakpoint/serialize/TestBreakpointSerialization.py (839 of 2288)
PASS: lldb-shell :: SymbolFile/DWARF/x86/limit-debug-info.s (840 of 2288)
UNSUPPORTED: lldb-api :: functionalities/darwin_log/filter/exact_match/subsystem/TestDarwinLogFilterMatchSubsystem.py (841 of 2288)
PASS: lldb-unit :: Utility/./UtilityTests/StringExtractorTest.GetHexU8_Exact_NoEof (842 of 2288)
PASS: lldb-api :: commands/expression/context-object/TestContextObject.py (843 of 2288)
PASS: lldb-unit :: Utility/./UtilityTests/ProcessInstanceInfo.Dump (844 of 2288)
UNSUPPORTED: lldb-api :: benchmarks/libcxxlist/TestBenchmarkLibcxxList.py (845 of 2288)
PASS: lldb-api :: api/multithreaded/TestMultithreaded.py (846 of 2288)
PASS: lldb-api :: commands/frame/var/TestFrameVar.py (847 of 2288)
PASS: lldb-unit :: Utility/./UtilityTests/LogTest.Register (848 of 2288)
PASS: lldb-unit :: Utility/./UtilityTests/StreamTest.AddressRange (849 of 2288)
PASS: lldb-api :: commands/log/basic/TestLogging.py (850 of 2288)
PASS: lldb-unit :: Utility/./UtilityTests/AnsiTerminal.Unknown (851 of 2288)
PASS: lldb-unit :: UnwindAssembly/x86/./UnwindAssemblyx86Tests/Testx86AssemblyInspectionEngine.TestPopR12 (852 of 2288)
PASS: lldb-unit :: ObjectFile/Breakpad/./ObjectFileBreakpadTests/Record.classify (853 of 2288)
PASS: lldb-unit :: Utility/./UtilityTests/LogChannelEnabledTest.LogGetLogThread (854 of 2288)
PASS: lldb-shell :: ScriptInterpreter/Python/scripted_breakpoint_lua.test (855 of 2288)
PASS: lldb-api :: lang/objc/objc-optimized/TestObjcOptimized.py (856 of 2288)
PASS: lldb-api :: functionalities/load_using_paths/TestLoadUsingPaths.py (857 of 2288)
PASS: lldb-unit :: Utility/./UtilityTests/ArgsTest.TestSingleArg (858 of 2288)
UNSUPPORTED: lldb-shell :: Register/aarch64-fp-read.test (859 of 2288)
PASS: lldb-unit :: ScriptInterpreter/Python/./ScriptInterpreterPythonTests/PythonDataObjectsTest.TestPythonTupleInitializerList (860 of 2288)
PASS: lldb-api :: python_api/value/empty_class/TestValueAPIEmptyClass.py (861 of 2288)
PASS: lldb-unit :: Process/minidump/./LLDBMinidumpTests/MinidumpParserTest.GetFilteredModuleList (862 of 2288)
PASS: lldb-api :: lang/objc/objc-stepping/TestObjCStepping.py (863 of 2288)
PASS: lldb-shell :: Breakpoint/jit-loader_jitlink_elf.test (864 of 2288)
PASS: lldb-unit :: Utility/./UtilityTests/StreamTest.ShiftOperatorChars (865 of 2288)
PASS: lldb-api :: python_api/watchpoint/watchlocation/TestTargetWatchAddress.py (866 of 2288)
UNSUPPORTED: lldb-shell :: Register/x86-64-gp-write.test (867 of 2288)
PASS: lldb-api :: commands/target/auto-install-main-executable/TestAutoInstallMainExecutable.py (868 of 2288)
PASS: lldb-unit :: Symbol/./SymbolTests/TestTypeSystemClang.TestUnifyAccessSpecifiers (869 of 2288)
PASS: lldb-api :: functionalities/data-formatter/data-formatter-objc/nsindexpath/TestDataFormatterNSIndexPath.py (870 of 2288)
PASS: lldb-unit :: Target/./TargetTests/ModuleCacheTest.GetAndPut (871 of 2288)
UNSUPPORTED: lldb-shell :: SymbolFile/dissassemble-entry-point.s (872 of 2288)
PASS: lldb-unit :: SymbolFile/NativePDB/./SymbolFileNativePDBTests/PDBFPOProgramToDWARFExpressionTests.InvalidOpBinary (873 of 2288)
PASS: lldb-unit :: Utility/./UtilityTests/DataExtractorTest.GetMaxS64 (874 of 2288)
PASS: lldb-api :: functionalities/data-formatter/data-formatter-objc/TestDataFormatterObjNSException.py (875 of 2288)
PASS: lldb-api :: functionalities/data-formatter/summary-string-onfail/Test-rdar-9974002.py (876 of 2288)
PASS: lldb-shell :: Commands/command-regex-unalias.test (877 of 2288)
PASS: lldb-api :: functionalities/thread/concurrent_events/TestConcurrentManyCrash.py (878 of 2288)
PASS: lldb-api :: lang/cpp/char8_t/TestCxxChar8_t.py (879 of 2288)
PASS: lldb-shell :: ObjectFile/PECOFF/dep-modules.yaml (880 of 2288)
PASS: lldb-api :: functionalities/gdb_remote_client/TestArmRegisterDefinition.py (881 of 2288)
PASS: lldb-shell :: SymbolFile/DWARF/x86/gnu-style-compression.cpp (882 of 2288)
PASS: lldb-unit :: Interpreter/./InterpreterTests/CompletionTest.DirCompletionAbsolute (883 of 2288)
PASS: lldb-shell :: ObjectFile/ELF/minidebuginfo-corrupt-xz.yaml (884 of 2288)
PASS: lldb-api :: functionalities/data-formatter/vector-types/TestVectorTypesFormatting.py (885 of 2288)
PASS: lldb-api :: functionalities/data-formatter/data-formatter-stl/libcxx/multimap/TestDataFormatterLibccMultiMap.py (886 of 2288)
PASS: lldb-api :: commands/target/select/TestTargetSelect.py (887 of 2288)
PASS: lldb-api :: commands/expression/weak_symbols/TestWeakSymbols.py (888 of 2288)
PASS: lldb-unit :: Utility/./UtilityTests/StringExtractorTest.GetHexU8_Underflow2 (889 of 2288)
PASS: lldb-api :: commands/platform/sdk/TestPlatformSDK.py (890 of 2288)
PASS: lldb-shell :: Minidump/memory-region.yaml (891 of 2288)
PASS: lldb-unit :: Utility/./UtilityTests/GeneratorTest.YamlMultiProvider (892 of 2288)
PASS: lldb-unit :: Host/./HostTests/SocketTests/SocketTest.UDPConnect/ipv6 (893 of 2288)
PASS: lldb-api :: tools/lldb-vscode/evaluate/TestVSCode_evaluate.py (894 of 2288)
PASS: lldb-api :: lang/objcxx/objcxx-ivar-vector/TestIvarVector.py (895 of 2288)
PASS: lldb-api :: commands/expression/test/TestExprs2.py (896 of 2288)
UNSUPPORTED: lldb-api :: functionalities/thread/break_after_join/TestBreakAfterJoin.py (897 of 2288)
UNSUPPORTED: lldb-api :: functionalities/breakpoint/breakpoint_callback_command_source/TestBreakpointCallbackCommandSource.py (898 of 2288)
PASS: lldb-api :: lang/objc/orderedset/TestOrderedSet.py (899 of 2288)
PASS: lldb-unit :: Process/gdb-remote/./ProcessGdbRemoteTests/GDBRemoteCommunicationServerTest.SendErrorResponse_Status (900 of 2288)
UNSUPPORTED: lldb-api :: functionalities/tty/TestTerminal.py (901 of 2288)
PASS: lldb-api :: commands/target/dump-symtab-demangle/TestDumpSymtabDemangle.py (902 of 2288)
PASS: lldb-api :: lang/objc/objc-static-method/TestObjCStaticMethod.py (903 of 2288)
PASS: lldb-unit :: Utility/./UtilityTests/StringExtractorTest.GetHexBytesAvail_OddPair (904 of 2288)
UNSUPPORTED: lldb-api :: functionalities/asan/TestMemoryHistory.py (905 of 2288)
PASS: lldb-unit :: Process/gdb-remote/./ProcessGdbRemoteTests/GDBRemoteCommunicationClientTest.GetMemoryRegionInfoInvalidResponse (906 of 2288)
PASS: lldb-unit :: SymbolFile/DWARF/./SymbolFileDWARFTests/SymbolFileDWARFTests.ParseArangesSkipErrors (907 of 2288)
PASS: lldb-unit :: Host/./HostTests/NativeProcessProtocolTest.SetBreakpoint (908 of 2288)
PASS: lldb-shell :: ObjectFile/PECOFF/basic-info-arm64.yaml (909 of 2288)
PASS: lldb-api :: commands/expression/completion/TestExprCompletion.py (910 of 2288)
PASS: lldb-shell :: Breakpoint/debug_rnglist_rlestartend.test (911 of 2288)
PASS: lldb-api :: functionalities/thread/exit_during_break/TestExitDuringBreak.py (912 of 2288)
PASS: lldb-unit :: Utility/./UtilityTests/StringLexerTest.HasAtLeast (913 of 2288)
UNSUPPORTED: lldb-shell :: SymbolFile/PDB/func-symbols.test (914 of 2288)
PASS: lldb-shell :: SymbolFile/DWARF/x86/debug_ranges_and_rnglists.test (915 of 2288)
PASS: lldb-api :: commands/frame/diagnose/complicated-expression/TestComplicatedExpression.py (916 of 2288)
PASS: lldb-shell :: ObjectFile/ELF/basic-info.yaml (917 of 2288)
PASS: lldb-api :: functionalities/data-formatter/refpointer-recursion/TestDataFormatterRefPtrRecursion.py (918 of 2288)
PASS: lldb-api :: commands/command/source/TestCommandSource.py (919 of 2288)
PASS: lldb-unit :: UnwindAssembly/x86/./UnwindAssemblyx86Tests/Testx86AssemblyInspectionEngine.Test32bitFramelessBigStackFrame (920 of 2288)
PASS: lldb-unit :: Utility/./UtilityTests/VASprintfTest.BufferResize (921 of 2288)
PASS: lldb-unit :: Signals/./SignalsTests/UnixSignalsTest.VersionChange (922 of 2288)
PASS: lldb-unit :: SymbolFile/DWARF/./SymbolFileDWARFTests/SymbolFileDWARFTests.TestAbbrevValidAttrNullForm (923 of 2288)
PASS: lldb-unit :: Breakpoint/./LLDBBreakpointTests/BreakpointIDTest.StringIsBreakpointName (924 of 2288)
UNSUPPORTED: lldb-api :: commands/gui/breakpoints/TestGuiBreakpoints.py (925 of 2288)
PASS: lldb-api :: functionalities/thread/concurrent_events/TestConcurrentSignalBreak.py (926 of 2288)
PASS: lldb-shell :: SymbolFile/DWARF/x86/find-basic-namespace.cpp (927 of 2288)
PASS: lldb-shell :: ObjectFile/PECOFF/sections.yaml (928 of 2288)
PASS: lldb-unit :: Utility/./UtilityTests/StringExtractorTest.DecodeHexU8_InvalidHex (929 of 2288)
PASS: lldb-api :: commands/apropos/with-process/TestAproposWithProcess.py (930 of 2288)
PASS: lldb-unit :: DataFormatter/./LLDBFormatterTests/StringPrinterTests.CxxASCII (931 of 2288)
PASS: lldb-api :: functionalities/breakpoint/breakpoint_set_restart/TestBreakpointSetRestart.py (932 of 2288)
UNSUPPORTED: lldb-api :: commands/gui/viewlarge/TestGuiViewLarge.py (933 of 2288)
PASS: lldb-shell :: Driver/TestSingleQuote.test (934 of 2288)
PASS: lldb-api :: commands/expression/import-std-module/vector-of-vectors/TestVectorOfVectorsFromStdModule.py (935 of 2288)
PASS: lldb-unit :: Expression/./ExpressionTests/DWARFExpression.DW_OP_unknown (936 of 2288)
PASS: lldb-unit :: Utility/./UtilityTests/FileSpecTest.EqualDotsPosix (937 of 2288)
PASS: lldb-api :: commands/frame/diagnose/local-variable/TestLocalVariable.py (938 of 2288)
PASS: lldb-api :: commands/frame/diagnose/array/TestArray.py (939 of 2288)
UNSUPPORTED: lldb-shell :: SymbolFile/PDB/calling-conventions.test (940 of 2288)
PASS: lldb-api :: commands/statistics/basic/TestStats.py (941 of 2288)
PASS: lldb-api :: sanity/TestModuleCacheSanity.py (942 of 2288)
PASS: lldb-shell :: ObjectFile/ELF/netbsd-core-amd64.test (943 of 2288)
PASS: lldb-api :: lang/objc/foundation/TestSymbolTable.py (944 of 2288)
PASS: lldb-api :: functionalities/tail_call_frames/ambiguous_tail_call_seq1/TestAmbiguousTailCallSeq1.py (945 of 2288)
UNSUPPORTED: lldb-api :: functionalities/exec/TestExec.py (946 of 2288)
PASS: lldb-shell :: Process/UnsupportedLanguage.test (947 of 2288)
PASS: lldb-unit :: Utility/./UtilityTests/AnsiTerminal.Empty (948 of 2288)
PASS: lldb-api :: commands/expression/diagnostics/TestExprDiagnostics.py (949 of 2288)
PASS: lldb-unit :: Symbol/./SymbolTests/TestTypeSystemClang.TestGetEnumIntegerTypeBasicTypes (950 of 2288)
PASS: lldb-shell :: ObjectFile/PECOFF/basic-info.yaml (951 of 2288)
PASS: lldb-unit :: Utility/./UtilityTests/StreamTest.PutRawBytesToLittleEndian (952 of 2288)
PASS: lldb-api :: functionalities/data-formatter/data-formatter-stl/libcxx/optional/TestDataFormatterLibcxxOptional.py (953 of 2288)
PASS: lldb-api :: functionalities/load_lazy/TestLoadUsingLazyBind.py (954 of 2288)
UNSUPPORTED: lldb-api :: functionalities/signal/handle-segv/TestHandleSegv.py (955 of 2288)
PASS: lldb-unit :: Utility/./UtilityTests/CompletionRequest.FakeLastArg (956 of 2288)
PASS: lldb-unit :: Utility/./UtilityTests/ReproducerTest.SetReplay (957 of 2288)
PASS: lldb-unit :: Symbol/./SymbolTests/TestClangASTImporter.MetadataPropagationIndirectImport (958 of 2288)
PASS: lldb-api :: python_api/module_section/TestModuleAndSection.py (959 of 2288)
PASS: lldb-unit :: Interpreter/./InterpreterTests/TestProperties.DeepCopy (960 of 2288)
UNSUPPORTED: lldb-api :: functionalities/longjmp/TestLongjmp.py (961 of 2288)
PASS: lldb-api :: functionalities/gdb_remote_client/TestNoWatchpointSupportInfo.py (962 of 2288)
PASS: lldb-unit :: debugserver/./debugserverTests/JSON.Parse (963 of 2288)
PASS: lldb-unit :: Utility/./UtilityTests/RangeTest.ContainsRangeStartingFromZero (964 of 2288)
PASS: lldb-shell :: SymbolFile/DWARF/x86/debug-types-address-ranges.s (965 of 2288)
PASS: lldb-unit :: Utility/./UtilityTests/Flags.Test (966 of 2288)
PASS: lldb-api :: lang/objc/objc-class-method/TestObjCClassMethod.py (967 of 2288)
UNSUPPORTED: lldb-shell :: Register/x86-64-xmm16-write.test (968 of 2288)
PASS: lldb-shell :: SymbolFile/DWARF/x86/dwarf5-partial-index.cpp (969 of 2288)
PASS: lldb-shell :: ObjectFile/ELF/section-types.yaml (970 of 2288)
PASS: lldb-unit :: Expression/./ExpressionTests/DiagnosticManagerTest.GetStringMultipleDiags (971 of 2288)
PASS: lldb-shell :: Reproducer/Functionalities/TestImageList.test (972 of 2288)
PASS: lldb-unit :: Utility/./UtilityTests/StringExtractorTest.GetHexBytesAvail (973 of 2288)
PASS: lldb-unit :: Language/Highlighting/./HighlighterTests/HighlighterTest.ClangCommas (974 of 2288)
PASS: lldb-shell :: Watchpoint/SetErrorCases.test (975 of 2288)
PASS: lldb-api :: lang/cpp/template-specialization-type/TestTemplateSpecializationType.py (976 of 2288)
PASS: lldb-unit :: Process/minidump/./LLDBMinidumpTests/MinidumpParserTest.FindMemoryRangeWithFullMemoryMinidump (977 of 2288)
PASS: lldb-unit :: Process/minidump/./LLDBMinidumpTests/MinidumpParserTest.GetPidWow64 (978 of 2288)
PASS: lldb-api :: functionalities/thread/concurrent_events/TestConcurrentTwoWatchpointsOneSignal.py (979 of 2288)
PASS: lldb-api :: commands/expression/import-std-module/retry-with-std-module/TestRetryWithStdModule.py (980 of 2288)
PASS: lldb-api :: lang/cpp/auto/TestCPPAuto.py (981 of 2288)
PASS: lldb-api :: lang/objc/objc-checker/TestObjCCheckers.py (982 of 2288)
UNSUPPORTED: lldb-shell :: ScriptInterpreter/Lua/lua-python.test (983 of 2288)
PASS: lldb-unit :: Utility/./UtilityTests/BinaryStreamTest.PutULEB128FiveBytes (984 of 2288)
UNSUPPORTED: lldb-api :: functionalities/data-formatter/data-formatter-stl/libstdcpp/smart_ptr/TestDataFormatterStdSmartPtr.py (985 of 2288)
PASS: lldb-api :: lang/objc/objc_direct-methods/TestObjCDirectMethods.py (986 of 2288)
PASS: lldb-unit :: Utility/./UtilityTests/FileSpecTest.OperatorBool (987 of 2288)
PASS: lldb-api :: functionalities/data-formatter/data-formatter-advanced/TestDataFormatterAdv.py (988 of 2288)
PASS: lldb-unit :: Utility/./UtilityTests/CompletionRequest.ShiftArguments (989 of 2288)
PASS: lldb-api :: python_api/process/TestProcessAPI.py (990 of 2288)
PASS: lldb-shell :: Minidump/no-process-id.yaml (991 of 2288)
PASS: lldb-api :: functionalities/data-formatter/data-formatter-python-synth/TestDataFormatterPythonSynth.py (992 of 2288)
PASS: lldb-api :: commands/expression/ignore-artificial-constructors/TestIgnoreArtificialConstructors.py (993 of 2288)
PASS: lldb-unit :: Expression/./ExpressionTests/DiagnosticManagerTest.AppendMessageAttachToLastDiag (994 of 2288)
PASS: lldb-shell :: SymbolFile/NativePDB/ast-methods.cpp (995 of 2288)
PASS: lldb-api :: functionalities/breakpoint/consecutive_breakpoints/TestConsecutiveBreakpoints.py (996 of 2288)
PASS: lldb-unit :: Utility/./UtilityTests/ConstStringTest.CompareStringRef (997 of 2288)
PASS: lldb-api :: functionalities/thread/concurrent_events/TestConcurrentTwoWatchpointsOneBreakpoint.py (998 of 2288)
PASS: lldb-api :: commands/expression/char/TestExprsChar.py (999 of 2288)
PASS: lldb-api :: python_api/interpreter/TestCommandInterpreterAPI.py (1000 of 2288)
PASS: lldb-unit :: Utility/./UtilityTests/StringListTest.AppendListCStringArrayEmpty (1001 of 2288)
UNSUPPORTED: lldb-api :: commands/trace/TestTraceDumpInstructions.py (1002 of 2288)
PASS: lldb-unit :: UnwindAssembly/x86/./UnwindAssemblyx86Tests/Testx86AssemblyInspectionEngine.TestLEAVE (1003 of 2288)
PASS: lldb-api :: functionalities/limit-debug-info/TestLimitDebugInfo.py (1004 of 2288)
PASS: lldb-unit :: ScriptInterpreter/Python/./ScriptInterpreterPythonTests/PythonDataObjectsTest.TestPythonListManipulation (1005 of 2288)
UNSUPPORTED: lldb-api :: linux/thread/create_during_instruction_step/TestCreateDuringInstructionStep.py (1006 of 2288)
UNSUPPORTED: lldb-api :: functionalities/data-formatter/data-formatter-stl/libstdcpp/unique_ptr/TestDataFormatterStdUniquePtr.py (1007 of 2288)
PASS: lldb-unit :: Utility/./UtilityTests/DataExtractorTest.UncommonAddressSize (1008 of 2288)
PASS: lldb-api :: functionalities/breakpoint/breakpoint_by_file_colon_line/TestBreakpointByFileColonLine.py (1009 of 2288)
PASS: lldb-unit :: Utility/./UtilityTests/ArgsTest.ReplaceArgumentAtIndexOutOfRange (1010 of 2288)
PASS: lldb-api :: lang/cpp/class-template-parameter-pack/TestClassTemplateParameterPack.py (1011 of 2288)
PASS: lldb-api :: commands/target/stop-hook/enable/TestTargetStopHookEnable.py (1012 of 2288)
PASS: lldb-unit :: Utility/./UtilityTests/BinaryStreamTest.PutULEB128SevenBytes (1013 of 2288)
PASS: lldb-api :: functionalities/data-formatter/data-formatter-objc/TestDataFormatterObjCNSData.py (1014 of 2288)
PASS: lldb-api :: functionalities/data-formatter/data-formatter-cpp/TestDataFormatterCpp.py (1015 of 2288)
UNSUPPORTED: lldb-api :: commands/expression/multiline-navigation/TestMultilineNavigation.py (1016 of 2288)
PASS: lldb-shell :: SymbolFile/DWARF/x86/debug_line-tombstone.s (1017 of 2288)
PASS: lldb-unit :: Symbol/./SymbolTests/TestTypeSystemClang.TestGetBasicTypeFromEnum (1018 of 2288)
PASS: lldb-api :: macosx/load-kext/TestLoadKext.py (1019 of 2288)
PASS: lldb-api :: lang/cpp/char1632_t/TestChar1632T.py (1020 of 2288)
PASS: lldb-api :: commands/expression/unicode-in-variable/TestUnicodeInVariable.py (1021 of 2288)
PASS: lldb-unit :: Utility/./UtilityTests/StringExtractorTest.GetNameColonValueContainsColon (1022 of 2288)
PASS: lldb-shell :: ObjectFile/Breakpad/sections-trailing-func.test (1023 of 2288)
PASS: lldb-api :: lang/c/conflicting-symbol/TestConflictingSymbol.py (1024 of 2288)
PASS: lldb-api :: tools/lldb-server/TestGdbRemoteKill.py (1025 of 2288)
PASS: lldb-api :: commands/expression/import-std-module/empty-module/TestEmptyStdModule.py (1026 of 2288)
PASS: lldb-api :: commands/frame/recognizer/TestFrameRecognizer.py (1027 of 2288)
PASS: lldb-shell :: Settings/TestStopCommandSourceOnError.test (1028 of 2288)
PASS: lldb-unit :: Utility/./UtilityTests/ArgsTest.TestQuotedUnknownEscape (1029 of 2288)
PASS: lldb-shell :: ObjectFile/MachO/lc_version_min.yaml (1030 of 2288)
PASS: lldb-unit :: Language/Highlighting/./HighlighterTests/HighlighterTest.ClangCursorPosAfterOtherToken (1031 of 2288)
PASS: lldb-unit :: Symbol/./SymbolTests/TestTypeSystemClang.TestConvertAccessTypeToAccessSpecifier (1032 of 2288)
PASS: lldb-unit :: Utility/./UtilityTests/StringLexerTest.PutBack (1033 of 2288)
PASS: lldb-api :: functionalities/breakpoint/breakpoint_command/TestBreakpointCommand.py (1034 of 2288)
PASS: lldb-unit :: Core/./LLDBCoreTests/UniqueCStringMap.NoDefaultConstructor (1035 of 2288)
PASS: lldb-api :: commands/expression/dont_allow_jit/TestAllowJIT.py (1036 of 2288)
PASS: lldb-unit :: Utility/./UtilityTests/StringExtractorTest.GetHexBytes (1037 of 2288)
UNSUPPORTED: lldb-api :: commands/expression/call-restarts/TestCallThatRestarts.py (1038 of 2288)
PASS: lldb-unit :: Interpreter/./InterpreterTests/OptionValueArgs.DeepCopy (1039 of 2288)
PASS: lldb-api :: python_api/sblaunchinfo/TestSBLaunchInfo.py (1040 of 2288)
PASS: lldb-api :: python_api/frame/inlines/TestInlinedFrame.py (1041 of 2288)
PASS: lldb-shell :: ObjectFile/PECOFF/sections-names.yaml (1042 of 2288)
UNSUPPORTED: lldb-api :: functionalities/unwind/standard/TestStandardUnwind.py (1043 of 2288)
PASS: lldb-api :: functionalities/gdb_remote_client/TestTargetXMLArch.py (1044 of 2288)
PASS: lldb-api :: lang/cpp/std-function-step-into-callable/TestStdFunctionStepIntoCallable.py (1045 of 2288)
PASS: lldb-unit :: ScriptInterpreter/Python/./ScriptInterpreterPythonTests/PythonDataObjectsTest.TestPythonTupleSize (1046 of 2288)
PASS: lldb-api :: functionalities/data-formatter/boolreference/TestFormattersBoolRefPtr.py (1047 of 2288)
PASS: lldb-api :: commands/target/modules/search-paths/insert/TestTargetModulesSearchpathsInsert.py (1048 of 2288)
PASS: lldb-shell :: Settings/TestFrameFormatColor.test (1049 of 2288)
PASS: lldb-unit :: Language/CLanguages/./LanguageCLanguagesTests/CLanguages.LookupCLanguagesByLanguageType (1050 of 2288)
PASS: lldb-api :: python_api/thread/TestThreadAPI.py (1051 of 2288)
PASS: lldb-shell :: SymbolFile/NativePDB/nested-types.cpp (1052 of 2288)
PASS: lldb-api :: functionalities/breakpoint/breakpoint_names/TestBreakpointNames.py (1053 of 2288)
PASS: lldb-api :: commands/apropos/basic/TestApropos.py (1054 of 2288)
PASS: lldb-api :: functionalities/thread/concurrent_events/TestConcurrentSignalDelayWatch.py (1055 of 2288)
PASS: lldb-unit :: Utility/./UtilityTests/StringListTest.GetMaxStringLengthEmpty (1056 of 2288)
PASS: lldb-api :: lang/cpp/template-arguments/TestCppTemplateArguments.py (1057 of 2288)
PASS: lldb-unit :: Utility/./UtilityTests/OptionsWithRawTest.LeadingSpaceArgs (1058 of 2288)
PASS: lldb-api :: functionalities/mtc/simple/TestMTCSimple.py (1059 of 2288)
PASS: lldb-unit :: Utility/./UtilityTests/UUIDTest.SetFromStringRef (1060 of 2288)
PASS: lldb-shell :: Unwind/eh-frame-dwarf-unwind.test (1061 of 2288)
PASS: lldb-unit :: Utility/./UtilityTests/StreamTest.PutBytesAsRawHex8ToLittleEndian (1062 of 2288)
PASS: lldb-api :: functionalities/gdb_remote_client/TestNoGPacketSupported.py (1063 of 2288)
PASS: lldb-api :: functionalities/data-formatter/data-formatter-stl/libcxx/shared_ptr/TestDataFormatterLibcxxSharedPtr.py (1064 of 2288)
PASS: lldb-unit :: Language/Highlighting/./HighlighterTests/HighlighterTest.ClangPPDirectives (1065 of 2288)
PASS: lldb-unit :: DataFormatter/./LLDBFormatterTests/TypeMatcherTests.ExactName (1066 of 2288)
PASS: lldb-unit :: SymbolFile/DWARF/./SymbolFileDWARFTests/DWARFASTParserClangTests.EnsureAllDIEsInDeclContextHaveBeenParsedParsesOnlyMatchingEntries (1067 of 2288)
PASS: lldb-unit :: ScriptInterpreter/Python/./ScriptInterpreterPythonTests/PythonDataObjectsTest.TestPythonByteArray (1068 of 2288)
PASS: lldb-unit :: Symbol/./SymbolTests/DWARFCallFrameInfoTest.Basic_dwarf3 (1069 of 2288)
UNSUPPORTED: lldb-shell :: SymbolFile/PDB/expressions.test (1070 of 2288)
PASS: lldb-shell :: SymbolFile/NativePDB/locate-pdb.cpp (1071 of 2288)
PASS: lldb-api :: lang/objc/objc-new-syntax/TestObjCNewSyntaxArray.py (1072 of 2288)
PASS: lldb-shell :: SymbolFile/DWARF/x86/debug_loc_and_loclists.s (1073 of 2288)
PASS: lldb-unit :: Utility/./UtilityTests/VMRange.SetEndAddress (1074 of 2288)
PASS: lldb-unit :: Utility/./UtilityTests/CompletionRequest.TryCompleteCurrentArgBad (1075 of 2288)
PASS: lldb-unit :: Utility/./UtilityTests/UriParserTest.TypicalPortPathIPv4 (1076 of 2288)
PASS: lldb-unit :: Utility/./UtilityTests/StreamTest.PutMaxHex64ByteOrderBig (1077 of 2288)
PASS: lldb-unit :: Utility/./UtilityTests/ScalarTest.Getters (1078 of 2288)
PASS: lldb-api :: functionalities/thread/step_until/TestStepUntil.py (1079 of 2288)
PASS: lldb-unit :: Utility/./UtilityTests/StreamTeeTest.SetStreamAtIndexOverwrite (1080 of 2288)
PASS: lldb-unit :: Language/Highlighting/./HighlighterTests/HighlighterTest.Keywords (1081 of 2288)
PASS: lldb-api :: tools/lldb-server/TestGdbRemote_vCont.py (1082 of 2288)
PASS: lldb-unit :: Utility/./UtilityTests/SerializationRountripTest.SerializeDeserializeCStringArray (1083 of 2288)
PASS: lldb-unit :: Utility/./UtilityTests/Flags.IsClear (1084 of 2288)
PASS: lldb-unit :: Utility/./UtilityTests/ScalarTest.RightShiftOperator (1085 of 2288)
PASS: lldb-unit :: ScriptInterpreter/Python/./ScriptInterpreterPythonTests/PythonDataObjectsTest.TestDictionaryResolutionWithDot (1086 of 2288)
PASS: lldb-api :: commands/breakpoint/set/func-regex/TestBreakpointRegexError.py (1087 of 2288)
PASS: lldb-api :: functionalities/breakpoint/inlined_breakpoints/TestInlinedBreakpoints.py (1088 of 2288)
PASS: lldb-api :: commands/expression/expr-in-syscall/TestExpressionInSyscall.py (1089 of 2288)
PASS: lldb-api :: tools/lldb-server/commandline/TestGdbRemoteConnection.py (1090 of 2288)
PASS: lldb-unit :: Utility/./UtilityTests/StatusTest.ErrorConstructor (1091 of 2288)
PASS: lldb-unit :: Utility/./UtilityTests/ArgsTest.ReplaceArgumentAtIndexShort (1092 of 2288)
PASS: lldb-shell :: Driver/TestFile.test (1093 of 2288)
PASS: lldb-shell :: SymbolFile/DWARF/x86/split-dwarf-inlining.cpp (1094 of 2288)
PASS: lldb-api :: functionalities/inline-stepping/TestInlineStepping.py (1095 of 2288)
UNSUPPORTED: lldb-shell :: SymbolFile/DWARF/x86/DW_TAG_variable-DW_AT_decl_file-DW_AT_abstract_origin-crosscu1.s (1096 of 2288)
PASS: lldb-api :: test_utils/TestPExpectTest.py (1097 of 2288)
PASS: lldb-api :: lang/cpp/overloaded-functions/TestOverloadedFunctions.py (1098 of 2288)
PASS: lldb-unit :: Utility/./UtilityTests/StringListTest.JoinThree (1099 of 2288)
PASS: lldb-api :: lang/cpp/this_class_type_mixing/TestThisClassTypeMixing.py (1100 of 2288)
PASS: lldb-unit :: Core/./LLDBCoreTests/CommunicationTest.SynchronizeWhileClosing (1101 of 2288)
PASS: lldb-api :: lang/cpp/template/TestTemplateArgs.py (1102 of 2288)
PASS: lldb-api :: lang/cpp/nsimport/TestCppNsImport.py (1103 of 2288)
PASS: lldb-unit :: Utility/./UtilityTests/StringExtractorTest.GetHexU8_InvalidHex (1104 of 2288)
UNSUPPORTED: lldb-api :: functionalities/thread/concurrent_events/TestConcurrentManySignals.py (1105 of 2288)
PASS: lldb-unit :: Utility/./UtilityTests/StringListTest.JoinMultiCharSeparator (1106 of 2288)
PASS: lldb-shell :: ObjectFile/ELF/duplicate-section.yaml (1107 of 2288)
PASS: lldb-api :: python_api/function_symbol/TestDisasmAPI.py (1108 of 2288)
PASS: lldb-unit :: UnwindAssembly/x86/./UnwindAssemblyx86Tests/Testx86AssemblyInspectionEngine.TestSpArithx86_64Augmented (1109 of 2288)
PASS: lldb-api :: python_api/sbvalue_persist/TestSBValuePersist.py (1110 of 2288)
PASS: lldb-shell :: Reproducer/TestDSYM.test (1111 of 2288)
PASS: lldb-unit :: Process/gdb-remote/./ProcessGdbRemoteTests/GDBRemoteCommunicationClientTest.GetQOffsets (1112 of 2288)
PASS: lldb-unit :: ObjectFile/Breakpad/./ObjectFileBreakpadTests/LineRecord.parse (1113 of 2288)
PASS: lldb-unit :: Host/./HostTests/File.GetStreamFromDescriptor (1114 of 2288)
PASS: lldb-api :: lang/cpp/elaborated-types/TestElaboratedTypes.py (1115 of 2288)
UNSUPPORTED: lldb-shell :: Reproducer/TestLuaImport.test (1116 of 2288)
PASS: lldb-shell :: ObjectFile/ELF/many-sections.s (1117 of 2288)
PASS: lldb-api :: functionalities/tail_call_frames/sbapi_support/TestTailCallFrameSBAPI.py (1118 of 2288)
PASS: lldb-shell :: ObjectFile/wasm/unified-debug-sections.yaml (1119 of 2288)
PASS: lldb-api :: lang/cpp/bitfields/TestCppBitfields.py (1120 of 2288)
UNSUPPORTED: lldb-shell :: Register/x86-zmm-read.test (1121 of 2288)
PASS: lldb-api :: commands/expression/import-std-module/shared_ptr/TestSharedPtrFromStdModule.py (1122 of 2288)
PASS: lldb-unit :: Utility/./UtilityTests/DataExtractorTest.GetFloatUnaligned (1123 of 2288)
PASS: lldb-unit :: API/./APITests/SBCommandInterpreterTest.MultiWordCommand (1124 of 2288)
PASS: lldb-api :: commands/expression/inline-namespace/TestInlineNamespace.py (1125 of 2288)
PASS: lldb-unit :: Utility/./UtilityTests/StreamTest.PutBytesAsRawHex8ToMixedEndian (1126 of 2288)
PASS: lldb-api :: functionalities/breakpoint/address_breakpoints/TestAddressBreakpoints.py (1127 of 2288)
PASS: lldb-unit :: Expression/./ExpressionTests/DiagnosticManagerTest.GetStringSeverityLabels (1128 of 2288)
PASS: lldb-unit :: Process/minidump/./LLDBMinidumpTests/RegisterContextMinidump.CheckRegisterContextMinidump_ARM (1129 of 2288)
PASS: lldb-shell :: SymbolFile/DWARF/dwo-relative-path.s (1130 of 2288)
PASS: lldb-unit :: Utility/./UtilityTests/ProcessInfoTest.Constructor (1131 of 2288)
PASS: lldb-api :: functionalities/data-formatter/data-formatter-stl/libcxx/multiset/TestDataFormatterLibcxxMultiSet.py (1132 of 2288)
PASS: lldb-unit :: Expression/./ExpressionTests/DiagnosticManagerTest.AddDiagnostic (1133 of 2288)
PASS: lldb-unit :: SymbolFile/NativePDB/./SymbolFileNativePDBTests/PDBFPOProgramToDWARFExpressionTests.UnresolvedCyclicRegisterAssignmentReference (1134 of 2288)
PASS: lldb-unit :: Utility/./UtilityTests/StreamTest.AddressRangeEmptyRange (1135 of 2288)
PASS: lldb-shell :: SymbolFile/NativePDB/source-list.cpp (1136 of 2288)
PASS: lldb-unit :: Process/gdb-remote/./ProcessGdbRemoteTests/GDBRemoteClientBaseTest.SendContinueAndAsyncPacket (1137 of 2288)
PASS: lldb-unit :: tools/lldb-server/tests/./LLDBServerTests/TestBase.LaunchModePreservesEnvironment (1138 of 2288)
PASS: lldb-unit :: UnwindAssembly/x86/./UnwindAssemblyx86Tests/Testx86AssemblyInspectionEngine.TestReturnDetect (1139 of 2288)
PASS: lldb-unit :: ScriptInterpreter/Python/./ScriptInterpreterPythonTests/PythonDataObjectsTest.TestPythonTupleValues (1140 of 2288)
PASS: lldb-unit :: Utility/./UtilityTests/ArgsTest.ReplaceArgumentAtIndexFarOutOfRange (1141 of 2288)
PASS: lldb-api :: functionalities/thread/concurrent_events/TestConcurrentCrashWithWatchpoint.py (1142 of 2288)
PASS: lldb-unit :: Utility/./UtilityTests/StringListTest.AppendStringMove (1143 of 2288)
UNSUPPORTED: lldb-api :: functionalities/data-formatter/data-formatter-stl/libstdcpp/tuple/TestDataFormatterStdTuple.py (1144 of 2288)
TIMEOUT: lldb-api :: tools/lldb-server/vCont-threads/TestGdbRemote_vContThreads.py (1145 of 2288)
******************** TEST 'lldb-api :: tools/lldb-server/vCont-threads/TestGdbRemote_vContThreads.py' FAILED ********************
Script:
--
/Users/buildslave/jenkins/workspace/lldb-cmake-sanitized/lldb-build/lldb-test-build.noindex/copied-python /Users/buildslave/jenkins/workspace/lldb-cmake-sanitized/llvm-project/lldb/test/API/dotest.py -u CXXFLAGS -u CFLAGS --codesign-identity lldb_codesign --arch x86_64 --build-dir /Users/buildslave/jenkins/workspace/lldb-cmake-sanitized/lldb-build/lldb-test-build.noindex -t --env TERM=vt100 --env LLVM_LIBS_DIR=/Users/buildslave/jenkins/workspace/lldb-cmake-sanitized/lldb-build/./lib --inferior-env ASAN_OPTIONS=detect_stack_use_after_return=1 --inferior-env DYLD_INSERT_LIBRARIES=/Users/buildslave/jenkins/workspace/lldb-cmake-sanitized/host-compiler/lib/clang/13.0.0/lib/darwin/libclang_rt.asan_osx_dynamic.dylib --arch x86_64 --build-dir /Users/buildslave/jenkins/workspace/lldb-cmake-sanitized/lldb-build/lldb-test-build.noindex --lldb-module-cache-dir /Users/buildslave/jenkins/workspace/lldb-cmake-sanitized/lldb-build/lldb-test-build.noindex/module-cache-lldb/lldb-api --clang-module-cache-dir /Users/buildslave/jenkins/workspace/lldb-cmake-sanitized/lldb-build/lldb-test-build.noindex/module-cache-clang/lldb-api --executable /Users/buildslave/jenkins/workspace/lldb-cmake-sanitized/lldb-build/./bin/lldb --compiler /Users/buildslave/jenkins/workspace/lldb-cmake-sanitized/lldb-build/./bin/clang --dsymutil /Users/buildslave/jenkins/workspace/lldb-cmake-sanitized/lldb-build/./bin/dsymutil --llvm-tools-dir /Users/buildslave/jenkins/workspace/lldb-cmake-sanitized/lldb-build/./bin --lldb-libs-dir /Users/buildslave/jenkins/workspace/lldb-cmake-sanitized/lldb-build/./lib /Users/buildslave/jenkins/workspace/lldb-cmake-sanitized/llvm-project/lldb/test/API/tools/lldb-server/vCont-threads -p TestGdbRemote_vContThreads.py
--
Exit Code: -9
Timeout: Reached timeout of 1200 seconds

Hide Details

Command Output (stdout): -- lldb version 13.0.99 (http://labmaster3.local/git/llvm-project.git revision 5c729750a6d75df4eeb3eaad72e0b4e93ea27c0e) clang revision 5c729750a6d75df4eeb3eaad72e0b4e93ea27c0e llvm revision 5c729750a6d75df4eeb3eaad72e0b4e93ea27c0e

Hide Details

--

Hide Details

******************** PASS: lldb-api :: commands/frame/diagnose/virtual-method-call/TestDiagnoseDereferenceVirtualMethodCall.py (1146 of 2288) PASS: lldb-unit :: Utility/./UtilityTests/RegisterValueTest.GetScalarValue (1147 of 2288) PASS: lldb-shell :: SymbolFile/DWARF/x86/debug_rnglists.s (1148 of 2288) PASS: lldb-unit :: Utility/./UtilityTests/StreamTest.PutHex32ByteOrderBig (1149 of 2288) PASS: lldb-shell :: ObjectFile/MachO/lc_build_version_notools.yaml (1150 of 2288) PASS: lldb-unit :: Utility/./UtilityTests/RangeTest.ContainsAddr (1151 of 2288) PASS: lldb-shell :: ScriptInterpreter/Python/sb_address_exception.test (1152 of 2288) PASS: lldb-shell :: SymbolFile/DWARF/clang-ast-from-dwarf-objc-property.m (1153 of 2288) PASS: lldb-unit :: Utility/./UtilityTests/StreamTest.PutPtr (1154 of 2288) PASS: lldb-unit :: SymbolFile/DWARF/./SymbolFileDWARFTests/XcodeSDKModuleTests.TestModuleGetXcodeSDK (1155 of 2288) PASS: lldb-api :: functionalities/target_var/no_vars/TestTargetVarNoVars.py (1156 of 2288) PASS: lldb-shell :: Minidump/dump-all.test (1157 of 2288) PASS: lldb-api :: lang/objc/foundation/TestObjCMethodsString.py (1158 of 2288) PASS: lldb-shell :: SymbolFile/DWARF/x86/DW_AT_decl_file-DW_AT_specification-crosscu.s (1159 of 2288) PASS: lldb-api :: commands/watchpoints/watchpoint_events/TestWatchpointEvents.py (1160 of 2288) PASS: lldb-api :: functionalities/postmortem/elf-core/thread_crash/TestLinuxCoreThreads.py (1161 of 2288) PASS: lldb-unit :: Utility/./UtilityTests/StringListTest.JoinEmpty (1162 of 2288) PASS: lldb-unit :: Utility/./UtilityTests/BinaryStreamTest.PutSLEB128ThreeBytes (1163 of 2288) PASS: lldb-unit :: Utility/./UtilityTests/VMRange.Clear (1164 of 2288) PASS: lldb-unit :: Process/gdb-remote/./ProcessGdbRemoteTests/PortMapTest.AllowPort (1165 of 2288) PASS: lldb-api :: macosx/debugserver-exit-code/TestDebugServerExitCode.py (1166 of 2288) PASS: lldb-unit :: Utility/./UtilityTests/StringListTest.LongestCommonPrefixDuplicateElement (1167 of 2288) PASS: lldb-shell :: ScriptInterpreter/Python/Crashlog/json.test (1168 of 2288) PASS: lldb-shell :: ObjectFile/PECOFF/basic-info-arm.yaml (1169 of 2288) UNSUPPORTED: lldb-api :: functionalities/darwin_log/filter/regex/message/TestDarwinLogFilterRegexMessage.py (1170 of 2288) PASS: lldb-unit :: Process/minidump/./LLDBMinidumpTests/RegisterContextMinidump.ConvertMinidumpContext_x86_32 (1171 of 2288) PASS: lldb-shell :: ObjectFile/ELF/compressed-sections.yaml (1172 of 2288) PASS: lldb-unit :: Host/./HostTests/SocketTests/SocketTest.TCPGetAddress/ipv6 (1173 of 2288) PASS: lldb-shell :: Breakpoint/debug_rnglistx_rlex.test (1174 of 2288) PASS: lldb-unit :: Utility/./UtilityTests/StreamTest.PutCharNull (1175 of 2288) PASS: lldb-unit :: Utility/./UtilityTests/AnsiTerminal.AtStart (1176 of 2288) PASS: lldb-unit :: Utility/./UtilityTests/StringExtractorTest.DecodeHexU8_Exact (1177 of 2288) PASS: lldb-api :: tools/lldb-vscode/launch/TestVSCode_launch.py (1178 of 2288) PASS: lldb-api :: functionalities/data-formatter/data-formatter-stl/libcxx/vector/TestDataFormatterLibcxxVector.py (1179 of 2288) PASS: lldb-unit :: Expression/./ExpressionTests/ClangExpressionDeclMapTest.TestUnknownIdentifierLookup (1180 of 2288) PASS: lldb-unit :: Utility/./UtilityTests/StringListTest.ShiftMove (1181 of 2288) PASS: lldb-unit :: UnwindAssembly/x86/./UnwindAssemblyx86Tests/Testx86AssemblyInspectionEngine.TestSpillRegToStackViaMOVi386 (1182 of 2288) PASS: lldb-shell :: Reproducer/Functionalities/TestExpressionEvaluation.test (1183 of 2288) PASS: lldb-api :: functionalities/thread/concurrent_events/TestConcurrentCrashWithBreak.py (1184 of 2288) PASS: lldb-api :: commands/expression/save_jit_objects/TestSaveJITObjects.py (1185 of 2288) PASS: lldb-unit :: Platform/./LLDBPlatformTests/PlatformAppleSimulatorTest.TestSimHasSimEnvionament (1186 of 2288) PASS: lldb-api :: functionalities/step-avoids-no-debug/TestStepNoDebug.py (1187 of 2288) PASS: lldb-api :: functionalities/gdb_remote_client/TestRemoteRegNums.py (1188 of 2288) PASS: lldb-api :: tools/lldb-server/inferior-crash/TestGdbRemoteSegFault.py (1189 of 2288) UNSUPPORTED: lldb-shell :: SymbolFile/PDB/udt-layout.test (1190 of 2288) PASS: lldb-api :: functionalities/thread/concurrent_events/TestConcurrentBreakpointOneDelayBreakpointThreads.py (1191 of 2288) PASS: lldb-unit :: Target/./TargetTests/PathMappingListTest.RelativeTests (1192 of 2288) PASS: lldb-shell :: SymbolFile/DWARF/x86/dwarf5-debug_line.s (1193 of 2288) PASS: lldb-api :: lang/objc/exceptions/TestObjCExceptions.py (1194 of 2288) XFAIL: lldb-shell :: Expr/nodefaultlib.cpp (1195 of 2288) PASS: lldb-unit :: Utility/./UtilityTests/StringExtractorTest.GetHexU8_Exact (1196 of 2288) PASS: lldb-unit :: Utility/./UtilityTests/BinaryStreamTest.PutULEB128Zero (1197 of 2288) PASS: lldb-unit :: Utility/./UtilityTests/RegularExpression.Match (1198 of 2288) PASS: lldb-unit :: Utility/./UtilityTests/StreamTest.ShiftOperatorPtr (1199 of 2288) PASS: lldb-api :: lang/cpp/covariant-return-types/TestCovariantReturnTypes.py (1200 of 2288) PASS: lldb-api :: lang/c/shared_lib/TestSharedLib.py (1201 of 2288) PASS: lldb-unit :: Utility/./UtilityTests/UriParserTest.BracketedHostnamePort (1202 of 2288) PASS: lldb-shell :: ScriptInterpreter/Python/Crashlog/text.test (1203 of 2288) PASS: lldb-api :: lang/objc/objc-ivar-stripped/TestObjCIvarStripped.py (1204 of 2288) PASS: lldb-shell :: SymbolFile/DWARF/x86/dwp.s (1205 of 2288) PASS: lldb-unit :: SymbolFile/DWARF/./SymbolFileDWARFTests/DWARFUnitTest.MissingSentinel (1206 of 2288) UNSUPPORTED: lldb-shell :: Register/x86-gp-read.test (1207 of 2288) UNSUPPORTED: lldb-api :: lang/objc/ptr_refs/TestPtrRefsObjC.py (1208 of 2288) PASS: lldb-unit :: Process/gdb-remote/./ProcessGdbRemoteTests/GDBRemoteCommunicationClientTest.GetModulesInfoInvalidResponse (1209 of 2288) PASS: lldb-unit :: Utility/./UtilityTests/StringExtractorTest.DecodeHexU8_Extra (1210 of 2288) PASS: lldb-unit :: Process/gdb-remote/./ProcessGdbRemoteTests/GDBRemoteClientBaseTest.SendContinueDelegateStructuredDataReceipt (1211 of 2288) PASS: lldb-shell :: Reproducer/TestDriverOptions.test (1212 of 2288) PASS: lldb-api :: functionalities/data-formatter/data-formatter-stl/libcxx/tuple/TestDataFormatterLibcxxTuple.py (1213 of 2288) PASS: lldb-api :: functionalities/target_var/TestTargetVar.py (1214 of 2288) PASS: lldb-unit :: Process/gdb-remote/./ProcessGdbRemoteTests/GDBRemoteCommunicationServerTest.SendErrorResponse_UnimplementedError (1215 of 2288) PASS: lldb-api :: api/multiple-targets/TestMultipleTargets.py (1216 of 2288) PASS: lldb-unit :: DataFormatter/./LLDBFormatterTests/StringPrinterTests.SwiftUTF8 (1217 of 2288) UNSUPPORTED: lldb-api :: functionalities/data-formatter/data-formatter-stl/libstdcpp/vector/TestDataFormatterStdVector.py (1218 of 2288) PASS: lldb-api :: functionalities/thread/concurrent_events/TestConcurrentWatchpointWithDelayWatchpointThreads.py (1219 of 2288) PASS: lldb-unit :: Utility/./UtilityTests/UriParserTest.SchemeHostSeparator2 (1220 of 2288) PASS: lldb-api :: functionalities/breakpoint/breakpoint_language/TestBreakpointLanguage.py (1221 of 2288) PASS: lldb-api :: functionalities/data-formatter/data-formatter-enum-format/TestDataFormatterEnumFormat.py (1222 of 2288) PASS: lldb-unit :: Language/Highlighting/./HighlighterTests/HighlighterTest.ClangCursorPos (1223 of 2288) PASS: lldb-api :: python_api/value_var_update/TestValueVarUpdate.py (1224 of 2288) PASS: lldb-api :: commands/expression/no-deadlock/TestExprDoesntBlock.py (1225 of 2288) PASS: lldb-api :: types/TestIntegerType.py (1226 of 2288) PASS: lldb-unit :: Utility/./UtilityTests/TimerTest.CategoryTimes (1227 of 2288) PASS: lldb-api :: lang/c/const_variables/TestConstVariables.py (1228 of 2288) PASS: lldb-api :: lang/objc/objc-struct-return/TestObjCStructReturn.py (1229 of 2288) PASS: lldb-shell :: SymbolFile/DWARF/x86/dwp-debug-types.s (1230 of 2288) PASS: lldb-unit :: Utility/./UtilityTests/FileSpecTest.Yaml (1231 of 2288) PASS: lldb-api :: functionalities/gdb_remote_client/TestProcessConnect.py (1232 of 2288) PASS: lldb-unit :: Utility/./UtilityTests/OptionsWithRawTest.UnterminatedQuote (1233 of 2288) UNSUPPORTED: lldb-shell :: ScriptInterpreter/Lua/quit.test (1234 of 2288) PASS: lldb-api :: commands/quit/TestQuit.py (1235 of 2288) PASS: lldb-api :: commands/expression/test/TestExprs.py (1236 of 2288) UNSUPPORTED: lldb-api :: functionalities/thread/create_during_step/TestCreateDuringStep.py (1237 of 2288) PASS: lldb-unit :: ScriptInterpreter/Python/./ScriptInterpreterPythonTests/PythonDataObjectsTest.TestPythonDictionaryManipulation (1238 of 2288) PASS: lldb-unit :: Utility/./UtilityTests/UriParserTest.Empty (1239 of 2288) PASS: lldb-shell :: SymbolFile/DWARF/x86/childless-compile-unit.s (1240 of 2288) PASS: lldb-api :: macosx/nslog/TestDarwinNSLogOutput.py (1241 of 2288) PASS: lldb-api :: types/TestDoubleTypes.py (1242 of 2288) PASS: lldb-unit :: Utility/./UtilityTests/StringExtractorTest.GetHexU8_InvalidHex_NoEof (1243 of 2288) PASS: lldb-unit :: Utility/./UtilityTests/CompletionRequest.Constructor (1244 of 2288) PASS: lldb-api :: lang/cpp/dynamic-value-same-basename/TestDynamicValueSameBase.py (1245 of 2288) PASS: lldb-shell :: Minidump/disassemble-no-module.yaml (1246 of 2288) UNSUPPORTED: lldb-api :: commands/expression/macros/TestMacros.py (1247 of 2288) PASS: lldb-unit :: Utility/./UtilityTests/StringLexerTest.NextIf (1248 of 2288) PASS: lldb-api :: lang/objcxx/class-name-clash/TestNameClash.py (1249 of 2288) PASS: lldb-api :: macosx/thread-names/TestInterruptThreadNames.py (1250 of 2288) PASS: lldb-unit :: Utility/./UtilityTests/RangeTest.Copy (1251 of 2288) UNSUPPORTED: lldb-shell :: Register/x86-db-read.test (1252 of 2288) PASS: lldb-api :: sanity/TestSettingSkipping.py (1253 of 2288) UNSUPPORTED: lldb-shell :: SymbolFile/PDB/ast-restore.test (1254 of 2288) PASS: lldb-unit :: UnwindAssembly/x86/./UnwindAssemblyx86Tests/Testx86AssemblyInspectionEngine.TestPopEBP (1255 of 2288) PASS: lldb-api :: lang/cpp/this/TestCPPThis.py (1256 of 2288) PASS: lldb-api :: functionalities/gdb_remote_client/TestStopPCs.py (1257 of 2288) PASS: lldb-shell :: ObjectFile/ELF/gnu-debuglink.yaml (1258 of 2288) PASS: lldb-api :: commands/reproducer/invalid-args/TestInvalidArgsReproducer.py (1259 of 2288) PASS: lldb-unit :: Symbol/./SymbolTests/TestClangASTImporter.MetadataPropagationAfterCopying (1260 of 2288) PASS: lldb-unit :: Utility/./UtilityTests/ListenerTest.GetEventWait (1261 of 2288) UNSUPPORTED: lldb-api :: functionalities/darwin_log/filter/regex/subsystem/TestDarwinLogFilterRegexSubsystem.py (1262 of 2288) PASS: lldb-unit :: Utility/./UtilityTests/ScalarTest.SetValueFromData (1263 of 2288) PASS: lldb-unit :: Utility/./UtilityTests/RangeTest.Slide (1264 of 2288) PASS: lldb-api :: lang/cpp/typeof/TestTypeOfDeclTypeExpr.py (1265 of 2288) UNSUPPORTED: lldb-shell :: ScriptInterpreter/Lua/print.test (1266 of 2288) UNSUPPORTED: lldb-shell :: Register/x86-ymm-read.test (1267 of 2288) PASS: lldb-unit :: Expression/./ExpressionTests/CppModuleConfigurationTest.Linux (1268 of 2288) PASS: lldb-unit :: Host/./HostTests/FileSystemTest.Exists (1269 of 2288) PASS: lldb-api :: functionalities/postmortem/wow64_minidump/TestWow64MiniDump.py (1270 of 2288) PASS: lldb-api :: functionalities/breakpoint/move_nearest/TestMoveNearest.py (1271 of 2288) PASS: lldb-unit :: Utility/./UtilityTests/ArchSpecTest.TestSetTriple (1272 of 2288) PASS: lldb-api :: lang/cpp/exceptions/TestCPPExceptionBreakpoints.py (1273 of 2288) PASS: lldb-api :: functionalities/data-formatter/pyobjsynthprovider/TestPyObjSynthProvider.py (1274 of 2288) PASS: lldb-unit :: Utility/./UtilityTests/VMRange.CollectionContains (1275 of 2288) UNSUPPORTED: lldb-api :: functionalities/thread/thread_specific_break_plus_condition/TestThreadSpecificBpPlusCondition.py (1276 of 2288) PASS: lldb-unit :: Utility/./UtilityTests/ScalarTest.ExtractBitfield (1277 of 2288) PASS: lldb-unit :: Utility/./UtilityTests/StringListTest.AppendList (1278 of 2288) PASS: lldb-unit :: tools/lldb-server/tests/./LLDBServerTests/StandardStartupTest.TestStopReplyContainsThreadPcs (1279 of 2288) PASS: lldb-api :: tools/lldb-server/TestGdbRemoteExpeditedRegisters.py (1280 of 2288) PASS: lldb-api :: functionalities/breakpoint/breakpoint_by_line_and_column/TestBreakpointByLineAndColumn.py (1281 of 2288) PASS: lldb-api :: lang/c/local_types/TestUseClosestType.py (1282 of 2288) UNSUPPORTED: lldb-api :: linux/add-symbols/TestTargetSymbolsAddCommand.py (1283 of 2288) PASS: lldb-unit :: Utility/./UtilityTests/RegularExpression.Empty (1284 of 2288) PASS: lldb-api :: lang/cpp/static_methods/TestCPPStaticMethods.py (1285 of 2288) PASS: lldb-api :: lang/objc/global_ptrs/TestGlobalObjects.py (1286 of 2288) PASS: lldb-unit :: Process/gdb-remote/./ProcessGdbRemoteTests/GDBRemoteClientBaseTest.SendPacketAndReceiveResponseWithOutputSupport (1287 of 2288) PASS: lldb-shell :: Reproducer/TestHomeDir.test (1288 of 2288) PASS: lldb-unit :: UnwindAssembly/x86/./UnwindAssemblyx86Tests/Testx86AssemblyInspectionEngine.TestPopR13 (1289 of 2288) UNSUPPORTED: lldb-api :: commands/watchpoints/multi_watchpoint_slots/TestWatchpointMultipleSlots.py (1290 of 2288) PASS: lldb-api :: functionalities/recursion/TestValueObjectRecursion.py (1291 of 2288) PASS: lldb-api :: commands/expression/persistent_ptr_update/TestPersistentPtrUpdate.py (1292 of 2288) PASS: lldb-shell :: SymbolFile/DWARF/x86/apple-index-is-used.cpp (1293 of 2288) PASS: lldb-unit :: Utility/./UtilityTests/StreamTeeTest.CopyConstructor (1294 of 2288) PASS: lldb-unit :: Utility/./UtilityTests/StringListTest.InsertStringAtIndexMove (1295 of 2288) PASS: lldb-api :: macosx/add-dsym/TestAddDsymMidExecutionCommand.py (1296 of 2288) PASS: lldb-api :: macosx/profile_vrs_detach/TestDetachVrsProfile.py (1297 of 2288) PASS: lldb-api :: commands/expression/anonymous-struct/TestCallUserAnonTypedef.py (1298 of 2288) PASS: lldb-api :: python_api/debugger/TestDebuggerAPI.py (1299 of 2288) PASS: lldb-unit :: SymbolFile/NativePDB/./SymbolFileNativePDBTests/PDBFPOProgramToDWARFExpressionTests.DependencyChain (1300 of 2288) PASS: lldb-unit :: Host/./HostTests/NativeProcessProtocolTest.ReadCStringFromMemory (1301 of 2288) PASS: lldb-api :: functionalities/postmortem/minidump/TestMiniDump.py (1302 of 2288) PASS: lldb-api :: macosx/lc-note/firmware-corefile/TestFirmwareCorefiles.py (1303 of 2288) PASS: lldb-unit :: Utility/./UtilityTests/BinaryStreamTest.PutULEB128TwoBytes (1304 of 2288) PASS: lldb-api :: functionalities/thread/thread_specific_break/TestThreadSpecificBreakpoint.py (1305 of 2288) UNSUPPORTED: lldb-api :: functionalities/darwin_log/filter/exact_match/category/TestDarwinLogFilterMatchCategory.py (1306 of 2288) PASS: lldb-unit :: Host/./HostTests/SocketTests/SocketTest.UDPConnect/ipv4 (1307 of 2288) PASS: lldb-api :: lang/objc/modules-non-objc-target/TestObjCModulesNonObjCTarget.py (1308 of 2288) PASS: lldb-api :: python_api/sbtype_typeclass/TestSBTypeTypeClass.py (1309 of 2288) UNSUPPORTED: lldb-api :: benchmarks/stepping/TestSteppingSpeed.py (1310 of 2288) PASS: lldb-unit :: Utility/./UtilityTests/StringListTest.AppendStringCString (1311 of 2288) PASS: lldb-shell :: Reproducer/Functionalities/TestStepping.test (1312 of 2288) UNSUPPORTED: lldb-shell :: ScriptInterpreter/Lua/nested_sessions.test (1313 of 2288) PASS: lldb-unit :: Utility/./UtilityTests/CompletionRequest.TestCompletionOwnership (1314 of 2288) PASS: lldb-unit :: Utility/./UtilityTests/StringListTest.InsertStringAtIndexEnd (1315 of 2288) PASS: lldb-unit :: ObjectFile/Breakpad/./ObjectFileBreakpadTests/ModuleRecord.parse (1316 of 2288) PASS: lldb-api :: python_api/process/read-mem-cstring/TestReadMemCString.py (1317 of 2288) PASS: lldb-shell :: BuildScript/toolchain-clang.test (1318 of 2288) UNSUPPORTED: lldb-shell :: SymbolFile/NativePDB/local-variables.cpp (1319 of 2288) PASS: lldb-unit :: ScriptInterpreter/Python/./ScriptInterpreterPythonTests/PythonDataObjectsTest.TestCallable (1320 of 2288) PASS: lldb-api :: functionalities/tail_call_frames/thread_step_out_message/TestArtificialFrameStepOutMessage.py (1321 of 2288) PASS: lldb-unit :: Host/./HostTests/PipeTest.OpenAsReader (1322 of 2288) PASS: lldb-api :: lang/c/offsetof/TestOffsetof.py (1323 of 2288) PASS: lldb-shell :: Breakpoint/split-dwarf-5-addrbase.test (1324 of 2288) PASS: lldb-shell :: ObjectFile/PECOFF/symbol.yaml (1325 of 2288) PASS: lldb-unit :: Process/minidump/./LLDBMinidumpTests/MinidumpParserTest.GetLinuxProcStatus_no_stream (1326 of 2288) PASS: lldb-unit :: Utility/./UtilityTests/DataExtractorTest.GetCStrAtNullOffset (1327 of 2288) PASS: lldb-unit :: Utility/./UtilityTests/StreamTeeTest.GetStreamAtIndexOutOfBounds (1328 of 2288) PASS: lldb-unit :: SymbolFile/NativePDB/./SymbolFileNativePDBTests/PDBFPOProgramToDWARFExpressionTests.UnresolvedDependentCyclicRegisterAssignmentReference (1329 of 2288) PASS: lldb-shell :: Register/x86-64-read.test (1330 of 2288) PASS: lldb-shell :: Quit/TestQuitExitCodeNonInt.test (1331 of 2288) UNSUPPORTED: lldb-api :: functionalities/darwin_log/source/debug/TestDarwinLogSourceDebug.py (1332 of 2288) PASS: lldb-api :: commands/platform/basic/TestPlatformCommand.py (1333 of 2288) PASS: lldb-api :: lang/c/record_decl_in_expr/TestRecordDeclInExpr.py (1334 of 2288) PASS: lldb-unit :: Utility/./UtilityTests/StringExtractorGDBRemoteTest.GetPidTid (1335 of 2288) PASS: lldb-unit :: Core/./LLDBCoreTests/MangledTest.EmptyForInvalidName (1336 of 2288) PASS: lldb-unit :: Utility/./UtilityTests/ArgsTest.TestQuotedTrailingBackslash (1337 of 2288) PASS: lldb-api :: commands/expression/import-std-module/weak_ptr-dbg-info-content/TestDbgInfoContentWeakPtrFromStdModule.py (1338 of 2288) PASS: lldb-unit :: Utility/./UtilityTests/UriParserTest.MinimalPort (1339 of 2288) PASS: lldb-shell :: ObjectFile/ELF/short-build-id.yaml (1340 of 2288) PASS: lldb-unit :: Symbol/./SymbolTests/TestTypeSystemClang.TestGetTypeClassTypeOfExpr (1341 of 2288) PASS: lldb-unit :: Language/Highlighting/./HighlighterTests/HighlighterTest.DefaultHighlighterWithCursor (1342 of 2288) PASS: lldb-api :: functionalities/deleted-executable/TestDeletedExecutable.py (1343 of 2288) PASS: lldb-unit :: Utility/./UtilityTests/TimeoutTest.Construction (1344 of 2288) PASS: lldb-unit :: ObjectFile/ELF/./ObjectFileELFTests/ObjectFileELFTest.GetSymtab_NoSymEntryPointArmAddressClass (1345 of 2288) PASS: lldb-unit :: Utility/./UtilityTests/LogChannelTest.Enable (1346 of 2288) PASS: lldb-api :: commands/platform/basic/TestPlatformPython.py (1347 of 2288) PASS: lldb-api :: python_api/frame/get-variables/TestGetVariables.py (1348 of 2288) PASS: lldb-shell :: Reproducer/TestFileRepro.test (1349 of 2288) PASS: lldb-api :: functionalities/stop-on-sharedlibrary-load/TestStopOnSharedlibraryEvents.py (1350 of 2288) PASS: lldb-api :: python_api/lldbutil/iter/TestRegistersIterator.py (1351 of 2288) PASS: lldb-unit :: Process/./ProcessEventDataTests/ProcessEventDataTest.DoOnRemoval (1352 of 2288) PASS: lldb-unit :: Utility/./UtilityTests/StringListTest.SplitIntoLinesSingleTrailingCR (1353 of 2288) UNSUPPORTED: lldb-api :: functionalities/data-formatter/data-formatter-stl/libstdcpp/map/TestDataFormatterStdMap.py (1354 of 2288) PASS: lldb-unit :: Utility/./UtilityTests/SharedCluster.ClusterManager (1355 of 2288) UNSUPPORTED: lldb-api :: functionalities/tsan/cpp_global_location/TestTsanCPPGlobalLocation.py (1356 of 2288) PASS: lldb-api :: lang/cpp/operator-overload/TestOperatorOverload.py (1357 of 2288) PASS: lldb-api :: commands/expression/import-std-module/deque-basic/TestDequeFromStdModule.py (1358 of 2288) PASS: lldb-unit :: Process/Utility/./ProcessUtilityTests/ProcSMapTests/LinuxProcSMapsTestFixture.ParseSMapRegions/2 (1359 of 2288) PASS: lldb-unit :: Language/Highlighting/./HighlighterTests/HighlighterTest.ClangScalarLiterals (1360 of 2288) PASS: lldb-unit :: Utility/./UtilityTests/StringExtractorTest.GetNameColonValueNoSemicolon (1361 of 2288) PASS: lldb-api :: tools/lldb-vscode/step/TestVSCode_step.py (1362 of 2288) PASS: lldb-api :: lang/cpp/nested-class-other-compilation-unit/TestNestedClassWithParentInAnotherCU.py (1363 of 2288) PASS: lldb-unit :: Utility/./UtilityTests/TimerTest.CategoryTimes2 (1364 of 2288) PASS: lldb-api :: commands/expression/issue_11588/Test11588.py (1365 of 2288) PASS: lldb-api :: lang/c/shared_lib_stripped_symbols/TestSharedLibStrippedSymbols.py (1366 of 2288) PASS: lldb-api :: lang/cpp/modules-import/TestCXXModulesImport.py (1367 of 2288) PASS: lldb-unit :: Utility/./UtilityTests/StringExtractorTest.DecodeHexU8_InvalidHex2 (1368 of 2288) PASS: lldb-api :: functionalities/data-formatter/ostypeformatting/TestFormattersOsType.py (1369 of 2288) PASS: lldb-unit :: Utility/./UtilityTests/ArgsTest.ReplaceArgumentAtIndexEqual (1370 of 2288) PASS: lldb-api :: functionalities/data-formatter/data-formatter-stl/libcxx/set/TestDataFormatterLibcxxSet.py (1371 of 2288) PASS: lldb-unit :: Utility/./UtilityTests/RangeTest.SlideZero (1372 of 2288) PASS: lldb-unit :: Process/gdb-remote/./ProcessGdbRemoteTests/GDBRemoteClientBaseTest.InterruptNoResponse (1373 of 2288) PASS: lldb-shell :: Process/Optimization.test (1374 of 2288) PASS: lldb-unit :: Utility/./UtilityTests/UUIDTest.RelationalOperators (1375 of 2288) PASS: lldb-unit :: Target/./TargetTests/ModuleCacheTest.GetAndPutStrangeHostname (1376 of 2288) PASS: lldb-unit :: Utility/./UtilityTests/ArgsTest.TestAppendArg (1377 of 2288) PASS: lldb-shell :: Driver/TestPositionalArgs.test (1378 of 2288) PASS: lldb-unit :: Utility/./UtilityTests/UriParserTest.BracketedHostnameWithColon (1379 of 2288) PASS: lldb-api :: commands/expression/codegen-crash-typedefdecl-not-in_declcontext/TestCodegenCrashTypedefDeclNotInDeclContext.py (1380 of 2288) PASS: lldb-unit :: Utility/./UtilityTests/ArgsTest.EscapeLLDBCommandArgument (1381 of 2288) PASS: lldb-unit :: UnwindAssembly/x86/./UnwindAssemblyx86Tests/Testx86AssemblyInspectionEngine.TestPopRBPWithREX (1382 of 2288) PASS: lldb-shell :: Settings/TestFrameFormatMangling.test (1383 of 2288) PASS: lldb-unit :: Process/Utility/./ProcessUtilityTests/ProcMapTests/LinuxProcMapsTestFixture.ParseMapRegions/6 (1384 of 2288) PASS: lldb-shell :: Minidump/Windows/broken-unwind.test (1385 of 2288) PASS: lldb-api :: lang/objc/objc-super/TestObjCSuper.py (1386 of 2288) UNSUPPORTED: lldb-api :: commands/watchpoints/hello_watchlocation/TestWatchLocation.py (1387 of 2288) PASS: lldb-unit :: Host/./HostTests/SocketTests/SocketTest.TCPListen0ConnectAccept/ipv4 (1388 of 2288) PASS: lldb-unit :: Utility/./UtilityTests/DataExtractorTest.PeekData (1389 of 2288) PASS: lldb-api :: python_api/file_handle/TestFileHandle.py (1390 of 2288) PASS: lldb-unit :: Utility/./UtilityTests/ArgsTest.Yaml (1391 of 2288) PASS: lldb-shell :: Reproducer/TestReuseDirectory.test (1392 of 2288) PASS: lldb-api :: commands/frame/diagnose/bad-reference/TestBadReference.py (1393 of 2288) PASS: lldb-api :: commands/breakpoint/command/list/TestBreakpointCommandList.py (1394 of 2288) PASS: lldb-api :: lang/cpp/unicode-literals/TestUnicodeLiterals.py (1395 of 2288) PASS: lldb-api :: commands/process/attach/attach_denied/TestAttachDenied.py (1396 of 2288) PASS: lldb-unit :: Process/Utility/./ProcessUtilityTests/ProcSMapTests/LinuxProcSMapsTestFixture.ParseSMapRegions/7 (1397 of 2288) UNSUPPORTED: lldb-api :: lang/objc/foundation/TestFoundationDisassembly.py (1398 of 2288) PASS: lldb-unit :: Utility/./UtilityTests/ScalarTest.GetValue (1399 of 2288) PASS: lldb-shell :: ObjectFile/ELF/PT_LOAD-overlap-PT_INTERP.yaml (1400 of 2288) PASS: lldb-api :: macosx/queues/TestQueues.py (1401 of 2288) PASS: lldb-unit :: SymbolFile/NativePDB/./SymbolFileNativePDBTests/PDBFPOProgramToDWARFExpressionTests.UnknownOp (1402 of 2288) PASS: lldb-api :: lang/objc/objc-dyn-sbtype/TestObjCDynamicSBType.py (1403 of 2288) PASS: lldb-api :: functionalities/thread/num_threads/TestNumThreads.py (1404 of 2288) UNSUPPORTED: lldb-api :: benchmarks/libcxxmap/TestBenchmarkLibcxxMap.py (1405 of 2288) PASS: lldb-api :: python_api/default-constructor/TestDefaultConstructorForAPIObjects.py (1406 of 2288) PASS: lldb-unit :: Utility/./UtilityTests/RangeDataVector.CustomSort (1407 of 2288) PASS: lldb-api :: functionalities/pointer_num_children/TestPointerNumChildren.py (1408 of 2288) PASS: lldb-api :: lang/cpp/class_types/TestClassTypesDisassembly.py (1409 of 2288) PASS: lldb-unit :: Symbol/./SymbolTests/TestTypeSystemClang.TestBuiltinTypeForEncodingAndBitSize (1410 of 2288) PASS: lldb-unit :: Symbol/./SymbolTests/TestTypeSystemClang.TestNotDeletingUserCopyCstrDueToMoveCStr (1411 of 2288) PASS: lldb-api :: commands/target/create-deps/TestTargetCreateDeps.py (1412 of 2288) PASS: lldb-unit :: Utility/./UtilityTests/StreamTest.PutULEB128 (1413 of 2288) PASS: lldb-shell :: SymbolFile/DWARF/x86/find-qualified-variable.cpp (1414 of 2288) PASS: lldb-shell :: Reproducer/TestVerify.test (1415 of 2288) PASS: lldb-api :: lang/objc/warnings-in-expr-parser/TestObjCWarningsInExprParser.py (1416 of 2288) PASS: lldb-api :: arm/emulation/TestEmulations.py (1417 of 2288) PASS: lldb-api :: functionalities/data-formatter/data-formatter-globals/TestDataFormatterGlobals.py (1418 of 2288) PASS: lldb-api :: tools/lldb-server/TestGdbRemoteThreadsInStopReply.py (1419 of 2288) PASS: lldb-api :: tools/lldb-server/TestGdbRemoteAttach.py (1420 of 2288) PASS: lldb-api :: functionalities/data-formatter/type_summary_list_arg/TestTypeSummaryListArg.py (1421 of 2288) PASS: lldb-unit :: Interpreter/./InterpreterTests/OptionValueString.DeepCopy (1422 of 2288) PASS: lldb-unit :: Utility/./UtilityTests/LogChannelEnabledTest.LogThread (1423 of 2288) PASS: lldb-api :: functionalities/gdb_remote_client/TestPlatformClient.py (1424 of 2288) PASS: lldb-api :: macosx/simulator/TestSimulatorPlatform.py (1425 of 2288) PASS: lldb-api :: lang/c/vla/TestVLA.py (1426 of 2288) PASS: lldb-unit :: Utility/./UtilityTests/StreamTest.AddressPrefix (1427 of 2288) PASS: lldb-unit :: Utility/./UtilityTests/UriParserTest.BracketedHostname (1428 of 2288) XFAIL: lldb-shell :: Register/x86-mm-xmm-read.test (1429 of 2288) PASS: lldb-unit :: Symbol/./SymbolTests/TestClangASTImporter.CopyTypeTagDecl (1430 of 2288) PASS: lldb-api :: functionalities/gdb_remote_client/TestRestartBug.py (1431 of 2288) PASS: lldb-api :: lang/cpp/chained-calls/TestCppChainedCalls.py (1432 of 2288) PASS: lldb-api :: commands/process/attach-resume/TestAttachResume.py (1433 of 2288) PASS: lldb-unit :: UnwindAssembly/x86/./UnwindAssemblyx86Tests/Testx86AssemblyInspectionEngine.TestPushR15 (1434 of 2288) UNSUPPORTED: lldb-shell :: SymbolFile/Breakpad/stack-cfi-arm.yaml (1435 of 2288) PASS: lldb-api :: functionalities/non-overlapping-index-variable-i/TestIndexVariable.py (1436 of 2288) PASS: lldb-api :: commands/watchpoints/watchpoint_disable/TestWatchpointDisable.py (1437 of 2288) UNSUPPORTED: lldb-shell :: ObjectFile/ELF/minidebuginfo-no-lzma.yaml (1438 of 2288) PASS: lldb-api :: lang/objcxx/cxx-bridged-po/TestObjCXXBridgedPO.py (1439 of 2288) PASS: lldb-unit :: Utility/./UtilityTests/DataExtractorTest.GetCStrAtEnd (1440 of 2288) PASS: lldb-unit :: Process/gdb-remote/./ProcessGdbRemoteTests/GDBRemoteCommunicationServerTest.SendErrorResponse_ErrorList (1441 of 2288) PASS: lldb-api :: lang/cpp/subst_template_type_param/TestSubstTemplateTypeParam.py (1442 of 2288) PASS: lldb-api :: lang/objcxx/cpp_keywords_enabled/TestObjCppKeywordsEnabled.py (1443 of 2288) PASS: lldb-unit :: Utility/./UtilityTests/StringListTest.ForRangeEmpty (1444 of 2288) PASS: lldb-unit :: Language/Highlighting/./HighlighterTests/HighlighterTest.ClangIdentifiers (1445 of 2288) PASS: lldb-unit :: Utility/./UtilityTests/VMRange.Reset (1446 of 2288) PASS: lldb-api :: lang/objc/modules-compile-error/TestModulesCompileError.py (1447 of 2288) UNSUPPORTED: lldb-shell :: ScriptInterpreter/Lua/command_script_import.test (1448 of 2288) UNSUPPORTED: lldb-api :: functionalities/data-formatter/data-formatter-stl/libstdcpp/iterator/TestDataFormatterStdIterator.py (1449 of 2288) PASS: lldb-unit :: UnwindAssembly/x86/./UnwindAssemblyx86Tests/Testx86AssemblyInspectionEngine.TestPopR14 (1450 of 2288) UNSUPPORTED: lldb-api :: functionalities/darwin_log/filter/regex/activity-chain/TestDarwinLogFilterRegexActivityChain.py (1451 of 2288) UNSUPPORTED: lldb-shell :: BuildScript/toolchain-msvc.test (1452 of 2288) PASS: lldb-shell :: Minidump/memory-region-from-module.yaml (1453 of 2288) PASS: lldb-api :: functionalities/data-formatter/nsarraysynth/TestNSArraySynthetic.py (1454 of 2288) PASS: lldb-api :: api/command-return-object/TestSBCommandReturnObject.py (1455 of 2288) PASS: lldb-unit :: Process/./ProcessEventDataTests/ProcessEventDataTest.ShouldStop (1456 of 2288) PASS: lldb-unit :: Utility/./UtilityTests/UriParserTest.SchemeHostSeparator (1457 of 2288) PASS: lldb-shell :: SymbolFile/DWARF/x86/DW_OP_piece-struct.s (1458 of 2288) PASS: lldb-api :: functionalities/data-formatter/type_summary_list_script/TestTypeSummaryListScript.py (1459 of 2288) PASS: lldb-unit :: UnwindAssembly/x86/./UnwindAssemblyx86Tests/Testx86AssemblyInspectionEngine.TestSimple32bitFrameFunction (1460 of 2288) PASS: lldb-api :: lang/cpp/thread_local/TestThreadLocal.py (1461 of 2288) PASS: lldb-api :: commands/target/create-no-such-arch/TestNoSuchArch.py (1462 of 2288) PASS: lldb-unit :: ScriptInterpreter/Python/./ScriptInterpreterPythonTests/PythonDataObjectsTest.TestBorrowedReferences (1463 of 2288) UNSUPPORTED: lldb-shell :: ObjectFile/ELF/minidebuginfo-set-and-hit-breakpoint.test (1464 of 2288) PASS: lldb-unit :: Utility/./UtilityTests/RecordReplayTest.InstrumentedFoo (1465 of 2288) PASS: lldb-api :: functionalities/thread/concurrent_events/TestConcurrentSignalDelayBreak.py (1466 of 2288) PASS: lldb-unit :: Language/Highlighting/./HighlighterTests/HighlighterTest.ClangTrailingBackslashBeforeNewline (1467 of 2288) PASS: lldb-unit :: Host/./HostTests/MainLoopTest.DetectsEOF (1468 of 2288) PASS: lldb-unit :: Utility/./UtilityTests/StreamTest.QuotedCString (1469 of 2288) PASS: lldb-api :: commands/expression/import-std-module/list-dbg-info-content/TestDbgInfoContentListFromStdModule.py (1470 of 2288) PASS: lldb-api :: commands/expression/rdar42038760/TestScalarURem.py (1471 of 2288) PASS: lldb-unit :: Utility/./UtilityTests/CompletionRequest.TryCompleteCurrentArgMode (1472 of 2288) UNSUPPORTED: lldb-api :: functionalities/tsan/thread_leak/TestTsanThreadLeak.py (1473 of 2288) UNSUPPORTED: lldb-api :: commands/gui/basic/TestGuiBasic.py (1474 of 2288) PASS: lldb-api :: commands/expression/context-object-objc/TestContextObjectObjc.py (1475 of 2288) PASS: lldb-shell :: Settings/TestLineMarkerColor.test (1476 of 2288) PASS: lldb-unit :: Utility/./UtilityTests/StringListTest.InsertStringAtIndexStdString (1477 of 2288) PASS: lldb-unit :: Language/Highlighting/./HighlighterTests/HighlighterTest.HighlighterSelectionType (1478 of 2288) UNSUPPORTED: lldb-shell :: SymbolFile/DWARF/x86/DW_TAG_GNU_call_site-DW_AT_low_pc.s (1479 of 2288) PASS: lldb-unit :: Expression/./ExpressionTests/CppModuleConfigurationTest.Xcode (1480 of 2288) PASS: lldb-api :: functionalities/thread/concurrent_events/TestConcurrentCrashWithSignal.py (1481 of 2288) PASS: lldb-unit :: Utility/./UtilityTests/UriParserTest.MinimalPath (1482 of 2288) PASS: lldb-unit :: ScriptInterpreter/Python/./ScriptInterpreterPythonTests/PythonDataObjectsTest.TestExceptions (1483 of 2288) PASS: lldb-unit :: Utility/./UtilityTests/RangeTest.LessThanInvalid (1484 of 2288) PASS: lldb-unit :: Target/./TargetTests/PathMappingListTest.AbsoluteTests (1485 of 2288) PASS: lldb-api :: functionalities/source-map/TestTargetSourceMap.py (1486 of 2288) PASS: lldb-api :: lang/c/unions/TestUnionMembers.py (1487 of 2288) PASS: lldb-unit :: Utility/./UtilityTests/BinaryStreamTest.PutSLEB128SevenBytes (1488 of 2288) PASS: lldb-shell :: SymbolFile/DWARF/x86/dir-separator-no-comp-dir-relative-name.s (1489 of 2288) PASS: lldb-unit :: Utility/./UtilityTests/UUIDTest.Validity (1490 of 2288) PASS: lldb-unit :: Utility/./UtilityTests/StreamTest.AddressNoSuffix (1491 of 2288) PASS: lldb-unit :: Utility/./UtilityTests/NameMatchesTest.StartsWith (1492 of 2288) PASS: lldb-api :: functionalities/dlopen_other_executable/TestDlopenOtherExecutable.py (1493 of 2288) PASS: lldb-shell :: SymbolFile/DWARF/x86/dwarf5-implicit-const.s (1494 of 2288) UNSUPPORTED: lldb-api :: functionalities/darwin_log/filter/regex/activity/TestDarwinLogFilterRegexActivity.py (1495 of 2288) PASS: lldb-unit :: Utility/./UtilityTests/ArgsTest.GetShellSafeArgument (1496 of 2288) PASS: lldb-unit :: Utility/./UtilityTests/StreamTest.PutHex64ByteOrderBig (1497 of 2288) PASS: lldb-shell :: ScriptInterpreter/Python/scripted_breakpoint.test (1498 of 2288) PASS: lldb-unit :: Utility/./UtilityTests/StringListTest.AppendListCStringArray (1499 of 2288) PASS: lldb-unit :: Utility/./UtilityTests/ArgsTest.StringListConstructor (1500 of 2288) PASS: lldb-api :: functionalities/postmortem/elf-core/TestLinuxCore.py (1501 of 2288) UNSUPPORTED: lldb-api :: benchmarks/expression/TestRepeatedExprs.py (1502 of 2288) UNSUPPORTED: lldb-shell :: SymbolFile/PDB/pointers.test (1503 of 2288) UNSUPPORTED: lldb-api :: functionalities/darwin_log/basic/TestDarwinLogBasic.py (1504 of 2288) PASS: lldb-unit :: Language/Highlighting/./HighlighterTests/HighlighterTest.ClangTrailingBackslashWithWhitespace (1505 of 2288) PASS: lldb-api :: commands/log/invalid-args/TestInvalidArgsLog.py (1506 of 2288) PASS: lldb-shell :: Driver/TestError.test (1507 of 2288) PASS: lldb-api :: python_api/value/change_values/TestChangeValueAPI.py (1508 of 2288) PASS: lldb-unit :: Utility/./UtilityTests/CompletionRequest.DuplicateFilteringWithComments (1509 of 2288) PASS: lldb-api :: lang/objc/foundation/TestRuntimeTypes.py (1510 of 2288) PASS: lldb-unit :: Utility/./UtilityTests/UriParserTest.SchemeHostSeparator4 (1511 of 2288) UNSUPPORTED: lldb-shell :: SymbolFile/PDB/compilands.test (1512 of 2288) PASS: lldb-api :: commands/expression/call-function/TestCallUserDefinedFunction.py (1513 of 2288) PASS: lldb-unit :: Utility/./UtilityTests/StringExtractorTest.GetNameColonValueSuccess (1514 of 2288) PASS: lldb-api :: commands/platform/file/read/TestPlatformFileRead.py (1515 of 2288) PASS: lldb-api :: functionalities/history/TestHistoryRecall.py (1516 of 2288) PASS: lldb-unit :: Interpreter/./InterpreterTests/OptionValueFileColonLine.setFromString (1517 of 2288) PASS: lldb-unit :: Utility/./UtilityTests/ArgsTest.TestInsertArg (1518 of 2288) PASS: lldb-unit :: Core/./LLDBCoreTests/SourceFileCache.FindSourceFileFound (1519 of 2288) PASS: lldb-unit :: Expression/./ExpressionTests/DiagnosticManagerTest.PutString (1520 of 2288) PASS: lldb-unit :: Language/Highlighting/./HighlighterTests/HighlighterTest.Colons (1521 of 2288) PASS: lldb-shell :: SymbolFile/DWARF/x86/debug_rnglists-dwo.s (1522 of 2288) PASS: lldb-unit :: SymbolFile/DWARF/./SymbolFileDWARFTests/SymbolFileDWARFTests.TestAbbrevOrder1Start1 (1523 of 2288) PASS: lldb-shell :: Reproducer/TestSynchronous.test (1524 of 2288) PASS: lldb-unit :: UnwindAssembly/x86/./UnwindAssemblyx86Tests/Testx86AssemblyInspectionEngine.Test32bitFramelessSmallStackFrame (1525 of 2288) PASS: lldb-shell :: Reproducer/TestMultipleTargets.test (1526 of 2288) PASS: lldb-unit :: Utility/./UtilityTests/DataExtractorTest.GetBitfield (1527 of 2288) UNSUPPORTED: lldb-api :: functionalities/ubsan/user-expression/TestUbsanUserExpression.py (1528 of 2288) PASS: lldb-unit :: Process/gdb-remote/./ProcessGdbRemoteTests/GDBRemoteCommunicationClientTest.SendTraceSupportedPacket (1529 of 2288) PASS: lldb-api :: commands/expression/dollar-in-variable/TestDollarInVariable.py (1530 of 2288) PASS: lldb-api :: lang/objc/real-definition/TestRealDefinition.py (1531 of 2288) PASS: lldb-unit :: UnwindAssembly/x86/./UnwindAssemblyx86Tests/Testx86AssemblyInspectionEngine.TestPopR15 (1532 of 2288) PASS: lldb-unit :: Symbol/./SymbolTests/TestTypeSystemClang.TemplateArguments (1533 of 2288) PASS: lldb-unit :: Expression/./ExpressionTests/DWARFExpression.DW_OP_piece (1534 of 2288) PASS: lldb-api :: functionalities/testid/TestTestId.py (1535 of 2288) PASS: lldb-shell :: Reproducer/TestDiscard.test (1536 of 2288) PASS: lldb-shell :: Commands/command-stop-hook-output.test (1537 of 2288) PASS: lldb-api :: lang/objc/objc-static-method-stripped/TestObjCStaticMethodStripped.py (1538 of 2288) PASS: lldb-api :: commands/expression/cast_int_to_anonymous_enum/TestCastIntToAnonymousEnum.py (1539 of 2288) PASS: lldb-api :: python_api/sbvalue_const_addrof/TestSBValueConstAddrOf.py (1540 of 2288) PASS: lldb-unit :: Utility/./UtilityTests/XcodeSDKTest.FindXcodeContentsDirectoryInPath (1541 of 2288) PASS: lldb-api :: functionalities/thread/concurrent_events/TestConcurrentTwoBreakpointsOneWatchpoint.py (1542 of 2288) PASS: lldb-api :: macosx/dyld-trie-symbols/TestDyldTrieSymbols.py (1543 of 2288) PASS: lldb-unit :: Process/minidump/./LLDBMinidumpTests/MinidumpParserTest.GetMemoryRegionInfoFromMemoryList (1544 of 2288) PASS: lldb-api :: commands/help/TestHelp.py (1545 of 2288) PASS: lldb-unit :: Utility/./UtilityTests/RegularExpression.Invalid (1546 of 2288) PASS: lldb-shell :: SymbolFile/DWARF/x86/dwarf5-debug_line-file-index.s (1547 of 2288) PASS: lldb-shell :: Settings/TestSettingsSet.test (1548 of 2288) PASS: lldb-api :: macosx/DBGSourcePathRemapping/TestDSYMSourcePathRemapping.py (1549 of 2288) PASS: lldb-api :: functionalities/data-formatter/data-formatter-stl/libcxx/queue/TestDataFormatterLibcxxQueue.py (1550 of 2288) PASS: lldb-shell :: SymbolFile/DWARF/x86/dwarf5-index-is-used.cpp (1551 of 2288) PASS: lldb-shell :: Quit/TestQuitExitCode30.test (1552 of 2288) PASS: lldb-api :: functionalities/breakpoint/auto_continue/TestBreakpointAutoContinue.py (1553 of 2288) PASS: lldb-api :: commands/gui/invalid-args/TestInvalidArgsGui.py (1554 of 2288) PASS: lldb-api :: functionalities/data-formatter/var-in-aggregate-misuse/TestVarInAggregateMisuse.py (1555 of 2288) PASS: lldb-api :: commands/expression/timeout/TestCallWithTimeout.py (1556 of 2288) PASS: lldb-unit :: UnwindAssembly/x86/./UnwindAssemblyx86Tests/Testx86AssemblyInspectionEngine.TestSubESP (1557 of 2288) PASS: lldb-api :: lang/c/complex/TestComplexC99.py (1558 of 2288) UNSUPPORTED: lldb-api :: lang/cpp/printf/TestPrintf.py (1559 of 2288) PASS: lldb-unit :: Utility/./UtilityTests/XcodeSDKTest.ParseTest (1560 of 2288) PASS: lldb-shell :: Breakpoint/dummy-target.test (1561 of 2288) PASS: lldb-api :: commands/expression/static-initializers/TestStaticInitializers.py (1562 of 2288) PASS: lldb-api :: lang/objc/modules-app-update/TestClangModulesAppUpdate.py (1563 of 2288) PASS: lldb-unit :: SymbolFile/NativePDB/./SymbolFileNativePDBTests/PDBFPOProgramToDWARFExpressionTests.MissingTargetRegister (1564 of 2288) PASS: lldb-api :: functionalities/tail_call_frames/unambiguous_sequence/TestUnambiguousTailCalls.py (1565 of 2288) PASS: lldb-api :: commands/frame/diagnose/dereference-this/TestDiagnoseDereferenceThis.py (1566 of 2288) PASS: lldb-api :: functionalities/thread/concurrent_events/TestConcurrentCrashWithWatchpointBreakpointSignal.py (1567 of 2288) PASS: lldb-unit :: Utility/./UtilityTests/DataExtractorTest.GetDouble (1568 of 2288) PASS: lldb-api :: functionalities/optimized_code/TestNoASanExceptionAfterEvalOP_piece.py (1569 of 2288) PASS: lldb-unit :: Utility/./UtilityTests/StatusTest.ErrorConversion (1570 of 2288) PASS: lldb-unit :: Host/./HostTests/File.GetWaitableHandleFileno (1571 of 2288) PASS: lldb-api :: commands/target/basic/TestTargetCommand.py (1572 of 2288) PASS: lldb-api :: commands/disassemble/basic/TestDisassembleBreakpoint.py (1573 of 2288) PASS: lldb-shell :: SymbolFile/DWARF/x86/find-variable-dwo.cpp (1574 of 2288) PASS: lldb-unit :: Process/Utility/./ProcessUtilityTests/ProcMapTests/LinuxProcMapsTestFixture.ParseMapRegions/1 (1575 of 2288) PASS: lldb-unit :: Utility/./UtilityTests/StringExtractorTest.DecodeHexU8_Underflow2 (1576 of 2288) PASS: lldb-unit :: Host/./HostTests/HostInfoTest.GetAugmentedArchSpec (1577 of 2288) PASS: lldb-unit :: UnwindAssembly/x86/./UnwindAssemblyx86Tests/Testx86AssemblyInspectionEngine.TestAddRSP (1578 of 2288) UNSUPPORTED: lldb-shell :: Subprocess/clone-follow-parent-wp.test (1579 of 2288) PASS: lldb-api :: types/TestDoubleTypesExpr.py (1580 of 2288) PASS: lldb-api :: lang/objc/single-entry-dictionary/TestObjCSingleEntryDictionary.py (1581 of 2288) PASS: lldb-unit :: Utility/./UtilityTests/CompletionRequest.DuplicateFiltering (1582 of 2288) PASS: lldb-unit :: Utility/./UtilityTests/FileSpecTest.RemoveLastPathComponent (1583 of 2288) PASS: lldb-unit :: Process/Utility/./ProcessUtilityTests/ProcMapTests/LinuxProcMapsTestFixture.ParseMapRegions/4 (1584 of 2288) PASS: lldb-api :: functionalities/data-formatter/data-formatter-skip-summary/TestDataFormatterSkipSummary.py (1585 of 2288) PASS: lldb-unit :: Utility/./UtilityTests/RecordReplayTest.InstrumentedBarRef (1586 of 2288) PASS: lldb-api :: lang/cpp/global_variables/TestCPPGlobalVariables.py (1587 of 2288) PASS: lldb-unit :: Symbol/./SymbolTests/TestTypeSystemClang.TestGetTypeClassDeclType (1588 of 2288) PASS: lldb-unit :: UnwindAssembly/x86/./UnwindAssemblyx86Tests/Testx86AssemblyInspectionEngine.TestPopEDI (1589 of 2288) PASS: lldb-api :: lang/cpp/unsigned_types/TestUnsignedTypes.py (1590 of 2288) PASS: lldb-shell :: BuildScript/compiler-full-path.test (1591 of 2288) PASS: lldb-unit :: Editline/./EditlineTests/EditlineTestFixture.EditlineReceivesSingleLineText (1592 of 2288) PASS: lldb-unit :: Expression/./ExpressionTests/CppModuleConfigurationTest.AmbiguousLibCpp (1593 of 2288) PASS: lldb-api :: functionalities/thread/concurrent_events/TestConcurrentTwoBreakpointsOneDelaySignal.py (1594 of 2288) PASS: lldb-api :: functionalities/thread/concurrent_events/TestConcurrentDelayedCrashWithBreakpointSignal.py (1595 of 2288) UNSUPPORTED: lldb-shell :: Unwind/split-machine-functions.test (1596 of 2288) PASS: lldb-unit :: UnwindAssembly/x86/./UnwindAssemblyx86Tests/Testx86AssemblyInspectionEngine.TestSimple64bitFrameFunction (1597 of 2288) PASS: lldb-unit :: Utility/./UtilityTests/StringExtractorTest.GetNameColonValueNoColon (1598 of 2288) PASS: lldb-api :: lang/objc/objc-property/TestObjCProperty.py (1599 of 2288) UNSUPPORTED: lldb-api :: commands/watchpoints/variable_out_of_scope/TestWatchedVarHitWhenInScope.py (1600 of 2288) PASS: lldb-api :: api/check_public_api_headers/TestPublicAPIHeaders.py (1601 of 2288) PASS: lldb-unit :: UnwindAssembly/x86/./UnwindAssemblyx86Tests/Testx86AssemblyInspectionEngine.TestPopEBX (1602 of 2288) PASS: lldb-shell :: SymbolFile/NativePDB/ast-types.cpp (1603 of 2288) PASS: lldb-api :: tools/lldb-vscode/runInTerminal/TestVSCode_runInTerminal.py (1604 of 2288) UNSUPPORTED: lldb-api :: lang/objc/rdar-12408181/TestRdar12408181.py (1605 of 2288) PASS: lldb-unit :: Utility/./UtilityTests/OptionsWithRawTest.WhitespaceInput (1606 of 2288) PASS: lldb-unit :: Host/./HostTests/FileActionTest.Open (1607 of 2288) PASS: lldb-unit :: SymbolFile/DWARF/./SymbolFileDWARFTests/SymbolFileDWARFTests.TestAbilitiesForDWARF (1608 of 2288) PASS: lldb-shell :: ObjectFile/PECOFF/invalid-export-table.yaml (1609 of 2288) PASS: lldb-shell :: SymbolFile/DWARF/x86/DW_AT_const_value.s (1610 of 2288) PASS: lldb-api :: functionalities/gdb_remote_client/TestGDBRemoteDiskFileCompletion.py (1611 of 2288) PASS: lldb-shell :: SymbolFile/DWARF/x86/DW_TAG_basic_type_DW_ATE_UTF_nonC.ll (1612 of 2288) PASS: lldb-unit :: Symbol/./SymbolTests/SymbolsTest.TerminateLocateExecutableSymbolFileForUnknownExecutableAndUnknownSymbolFile (1613 of 2288) PASS: lldb-api :: lang/c/strings/TestCStrings.py (1614 of 2288) PASS: lldb-shell :: Driver/TestNoUseColor.test (1615 of 2288) PASS: lldb-api :: functionalities/process_crash_info/TestProcessCrashInfo.py (1616 of 2288) PASS: lldb-shell :: SymbolFile/NativePDB/disassembly.cpp (1617 of 2288) UNSUPPORTED: lldb-api :: commands/register/register/intel_xtended_registers/mpx_bound_violation/TestBoundViolation.py (1618 of 2288) PASS: lldb-api :: commands/expression/import-std-module/deque-dbg-info-content/TestDbgInfoContentDequeFromStdModule.py (1619 of 2288) PASS: lldb-api :: tools/lldb-server/TestGdbRemoteHostInfo.py (1620 of 2288) PASS: lldb-unit :: UnwindAssembly/x86/./UnwindAssemblyx86Tests/Testx86AssemblyInspectionEngine.TestPushR14 (1621 of 2288) PASS: lldb-api :: commands/frame/select/TestFrameSelect.py (1622 of 2288) PASS: lldb-api :: commands/expression/import-std-module/list/TestListFromStdModule.py (1623 of 2288) PASS: lldb-api :: lang/cpp/break-on-initializers/TestBreakOnCPP11Initializers.py (1624 of 2288) PASS: lldb-unit :: Process/gdb-remote/./ProcessGdbRemoteTests/GDBRemoteClientBaseTest.SendContinueAndInterrupt (1625 of 2288) PASS: lldb-unit :: Utility/./UtilityTests/FileSpecTest.Equal (1626 of 2288) PASS: lldb-api :: functionalities/multidebugger_commands/TestMultipleDebuggersCommands.py (1627 of 2288) PASS: lldb-unit :: Utility/./UtilityTests/ArchSpecTest.MergeFromMachOUnknown (1628 of 2288) PASS: lldb-api :: macosx/version_zero/TestGetVersionZeroVersion.py (1629 of 2288) PASS: lldb-unit :: Utility/./UtilityTests/SerializationRountripTest.SerializeDeserializePodPointers (1630 of 2288) PASS: lldb-unit :: Utility/./UtilityTests/UriParserTest.MinimalPortPath (1631 of 2288) PASS: lldb-unit :: Process/minidump/./LLDBMinidumpTests/MinidumpParserTest.GetMemoryRegionInfoLinuxMapsError (1632 of 2288) UNSUPPORTED: lldb-api :: functionalities/thread/state/TestThreadStates.py (1633 of 2288) PASS: lldb-unit :: Symbol/./SymbolTests/TestClangASTImporter.DeportDeclTagDecl (1634 of 2288) PASS: lldb-unit :: Utility/./UtilityTests/StreamTest.Indent (1635 of 2288) PASS: lldb-api :: python_api/sbenvironment/TestSBEnvironment.py (1636 of 2288) UNSUPPORTED: lldb-api :: functionalities/breakpoint/breakpoint_in_delayslot/TestAvoidBreakpointInDelaySlot.py (1637 of 2288) PASS: lldb-unit :: Utility/./UtilityTests/StringListTest.JoinSingle (1638 of 2288) PASS: lldb-shell :: ObjectFile/ELF/PT_LOAD-overlap-PT_TLS.yaml (1639 of 2288) PASS: lldb-api :: commands/expression/options/TestExprOptions.py (1640 of 2288) PASS: lldb-unit :: Utility/./UtilityTests/NameMatchesTest.Ignore (1641 of 2288) PASS: lldb-unit :: Symbol/./SymbolTests/LineEntryTest.GetSameLineContiguousAddressRangeOneInline (1642 of 2288) PASS: lldb-unit :: Process/gdb-remote/./ProcessGdbRemoteTests/GDBRemoteCommunicationClientTest.TestPacketSpeedJSON (1643 of 2288) PASS: lldb-shell :: SymbolFile/DWARF/x86/subprogram_ranges.test (1644 of 2288) PASS: lldb-unit :: Utility/./UtilityTests/StringListTest.Join (1645 of 2288) PASS: lldb-shell :: Driver/TestConvenienceVariables.test (1646 of 2288) PASS: lldb-unit :: Process/gdb-remote/./ProcessGdbRemoteTests/GDBRemoteCommunicationClientTest.SendSignalsToIgnore (1647 of 2288) PASS: lldb-api :: functionalities/thread/concurrent_events/TestConcurrentWatchBreakDelay.py (1648 of 2288) PASS: lldb-unit :: Utility/./UtilityTests/DataExtractorTest.GetDoubleUnaligned (1649 of 2288) PASS: lldb-api :: lang/cpp/class-template-non-type-parameter-pack/TestClassTemplateNonTypeParameterPack.py (1650 of 2288) PASS: lldb-shell :: Subprocess/fork-follow-parent.test (1651 of 2288) PASS: lldb-unit :: Utility/./UtilityTests/StateTest.Formatv (1652 of 2288) UNSUPPORTED: lldb-api :: functionalities/darwin_log/format/TestDarwinLogMessageFormat.py (1653 of 2288) PASS: lldb-shell :: VSCode/TestOptions.test (1654 of 2288) UNSUPPORTED: lldb-api :: benchmarks/frame_variable/TestFrameVariableResponse.py (1655 of 2288) PASS: lldb-shell :: ObjectFile/ELF/section-types-edgecases.yaml (1656 of 2288) PASS: lldb-unit :: Expression/./ExpressionTests/CppModuleConfigurationTest.IgnoreLibStdCpp (1657 of 2288) PASS: lldb-api :: tools/lldb-server/register-reading/TestGdbRemoteGPacket.py (1658 of 2288) PASS: lldb-unit :: Utility/./UtilityTests/StringExtractorTest.GetHexBytesAvail_Partial (1659 of 2288) PASS: lldb-api :: commands/expression/persistent_variables/TestPersistentVariables.py (1660 of 2288) PASS: lldb-unit :: Process/Utility/./ProcessUtilityTests/ProcMapTests/LinuxProcMapsTestFixture.ParseMapRegions/8 (1661 of 2288) PASS: lldb-shell :: SymbolFile/DWARF/x86/debug-types-dwarf5.s (1662 of 2288) PASS: lldb-api :: macosx/find-dsym/deep-bundle/TestDeepBundle.py (1663 of 2288) PASS: lldb-shell :: Commands/command-thread-select.test (1664 of 2288) PASS: lldb-unit :: Platform/Android/./AdbClientTests/AdbClientTest.CreateByDeviceId (1665 of 2288) PASS: lldb-api :: commands/target/stop-hook/disable/TestTargetStopHookDisable.py (1666 of 2288) PASS: lldb-api :: functionalities/breakpoint/objc/TestObjCBreakpoints.py (1667 of 2288) PASS: lldb-api :: functionalities/data-formatter/data-formatter-stl/libcxx/list/loop/TestDataFormatterLibcxxListLoop.py (1668 of 2288) PASS: lldb-api :: functionalities/breakpoint/breakpoint_ids/TestBreakpointIDs.py (1669 of 2288) PASS: lldb-shell :: SymbolFile/Breakpad/line-table-edgecases.test (1670 of 2288) PASS: lldb-shell :: ObjectFile/ELF/build-id-case.yaml (1671 of 2288) PASS: lldb-unit :: Utility/./UtilityTests/BinaryStreamTest.PutULEB128EightBytes (1672 of 2288) PASS: lldb-api :: commands/expression/invalid-args/TestInvalidArgsExpression.py (1673 of 2288) PASS: lldb-api :: lang/objc/objc-new-syntax/TestObjCNewSyntaxLiteral.py (1674 of 2288) PASS: lldb-unit :: debugserver/./debugserverTests/RNBSocket.LoopBackConnectIPv6 (1675 of 2288) XFAIL: lldb-shell :: SymbolFile/DWARF/find-type-in-function.cpp (1676 of 2288) PASS: lldb-unit :: Process/minidump/./LLDBMinidumpTests/MinidumpParserTest.GetThreadContext_x86_64 (1677 of 2288) PASS: lldb-api :: lang/cpp/incomplete-types/TestCppIncompleteTypes.py (1678 of 2288) UNSUPPORTED: lldb-shell :: SymbolFile/NativePDB/typedefs.cpp (1679 of 2288) PASS: lldb-unit :: Utility/./UtilityTests/XcodeSDKTest.GetSDKTypeForTriple (1680 of 2288) PASS: lldb-unit :: Host/./HostTests/NativeProcessProtocolTest.SetBreakpointFailWrite (1681 of 2288) PASS: lldb-unit :: Platform/./LLDBPlatformTests/PlatformDarwinTest.TestParseVersionBuildDir (1682 of 2288) PASS: lldb-shell :: Quit/TestQuitExitCode0.test (1683 of 2288) UNSUPPORTED: lldb-api :: commands/register/register/intel_xtended_registers/TestMPXRegisters.py (1684 of 2288) PASS: lldb-unit :: Utility/./UtilityTests/ConstStringTest.FromMidOfBufferStringRef (1685 of 2288) PASS: lldb-api :: commands/expression/function_template_specialization_temp_args/TestFunctionTemplateSpecializationTempArgs.py (1686 of 2288) PASS: lldb-unit :: Language/Highlighting/./HighlighterTests/HighlighterTest.ClangTrailingBackslashMissingNewLine (1687 of 2288) PASS: lldb-api :: lang/cpp/accelerator-table/TestCPPAccelerator.py (1688 of 2288) PASS: lldb-unit :: Utility/./UtilityTests/ArgsTest.DoubleQuotedItem (1689 of 2288) PASS: lldb-unit :: Process/gdb-remote/./ProcessGdbRemoteTests/GDBRemoteCommunicationClientTest.GetModulesInfo (1690 of 2288) UNSUPPORTED: lldb-api :: commands/trace/multiple-threads/TestTraceStartStopMultipleThreads.py (1691 of 2288) PASS: lldb-unit :: Process/minidump/./LLDBMinidumpTests/MinidumpParserTest.MinidumpDuplicateModuleMappedSecond (1692 of 2288) PASS: lldb-unit :: Host/./HostTests/SocketTests/SocketTest.UDPGetConnectURI/ipv4 (1693 of 2288) PASS: lldb-api :: python_api/value/linked_list/TestValueAPILinkedList.py (1694 of 2288) PASS: lldb-api :: python_api/target/TestTargetAPI.py (1695 of 2288) PASS: lldb-api :: functionalities/step_scripted/TestStepScripted.py (1696 of 2288) PASS: lldb-api :: functionalities/data-formatter/array_typedef/TestArrayTypedef.py (1697 of 2288) PASS: lldb-api :: lang/objc/objc-foundation-dictionary-empty/TestNSDictionary0.py (1698 of 2288) PASS: lldb-unit :: Symbol/./SymbolTests/Type.CompilerContextPattern (1699 of 2288) PASS: lldb-api :: commands/watchpoints/watchpoint_commands/TestWatchpointCommands.py (1700 of 2288) PASS: lldb-unit :: Utility/./UtilityTests/StreamTest.PutHex64ByteOrderLittle (1701 of 2288) PASS: lldb-shell :: ObjectFile/PECOFF/section-types.yaml (1702 of 2288) PASS: lldb-shell :: Settings/TestDisassemblyFormat.test (1703 of 2288) PASS: lldb-unit :: Utility/./UtilityTests/StreamTest.PutCharWhitespace (1704 of 2288) PASS: lldb-unit :: UnwindAssembly/x86/./UnwindAssemblyx86Tests/Testx86AssemblyInspectionEngine.TestPushEDX (1705 of 2288) PASS: lldb-unit :: Core/./LLDBCoreTests/ModuleSpecTest.InvalidInMemoryBuffer (1706 of 2288) PASS: lldb-api :: lang/cpp/gmodules/TestWithModuleDebugging.py (1707 of 2288) PASS: lldb-api :: commands/expression/persist_objc_pointeetype/TestPersistObjCPointeeType.py (1708 of 2288) PASS: lldb-shell :: SymbolFile/DWARF/x86/dir-separator-posix.s (1709 of 2288) PASS: lldb-api :: macosx/builtin-debugtrap/TestBuiltinDebugTrap.py (1710 of 2288) PASS: lldb-unit :: Process/gdb-remote/./ProcessGdbRemoteTests/GDBRemoteClientBaseTest.SendContinueAndWait (1711 of 2288) UNSUPPORTED: lldb-api :: functionalities/gdb_remote_client/TestWasm.py (1712 of 2288) PASS: lldb-shell :: SymbolFile/DWARF/x86/find-inline-method.s (1713 of 2288) PASS: lldb-shell :: Reproducer/TestCrash.test (1714 of 2288) UNSUPPORTED: lldb-api :: iohandler/autosuggestion/TestAutosuggestion.py (1715 of 2288) PASS: lldb-api :: lang/c/local_variables/TestLocalVariables.py (1716 of 2288) PASS: lldb-api :: functionalities/data-formatter/data-formatter-stl/libcxx/map/TestDataFormatterLibccMap.py (1717 of 2288) UNSUPPORTED: lldb-api :: functionalities/darwin_log/filter/exact_match/activity/TestDarwinLogFilterMatchActivity.py (1718 of 2288) PASS: lldb-api :: python_api/hello_world/TestHelloWorld.py (1719 of 2288) PASS: lldb-unit :: ScriptInterpreter/Python/./ScriptInterpreterPythonTests/PythonDataObjectsTest.TestTypeNameResolutionNoDot (1720 of 2288) PASS: lldb-unit :: Utility/./UtilityTests/StringExtractorTest.GetHexU8_Underflow (1721 of 2288) PASS: lldb-unit :: Host/./HostTests/Host.GetEnvironment (1722 of 2288) UNSUPPORTED: lldb-shell :: ScriptInterpreter/Lua/watchpoint_callback.test (1723 of 2288) PASS: lldb-unit :: Utility/./UtilityTests/LogChannelTest.List (1724 of 2288) PASS: lldb-shell :: Register/x86-64-gp-read.test (1725 of 2288) PASS: lldb-api :: tools/lldb-server/TestGdbRemoteSingleStep.py (1726 of 2288) UNSUPPORTED: lldb-api :: lang/objc/modules-update/TestClangModulesUpdate.py (1727 of 2288) PASS: lldb-api :: functionalities/process_group/TestChangeProcessGroup.py (1728 of 2288) PASS: lldb-api :: commands/frame/diagnose/dereference-argument/TestDiagnoseDereferenceArgument.py (1729 of 2288) PASS: lldb-unit :: Host/./HostTests/SocketTests/SocketTest.DomainListenConnectAccept/ipv4 (1730 of 2288) XFAIL: lldb-shell :: Register/x86-fp-write.test (1731 of 2288) PASS: lldb-unit :: Process/gdb-remote/./ProcessGdbRemoteTests/GDBRemoteCommunicationTest.ReadPacket_checksum (1732 of 2288) PASS: lldb-unit :: ScriptInterpreter/Python/./ScriptInterpreterPythonTests/PythonDataObjectsTest.TestPythonListToStructuredList (1733 of 2288) PASS: lldb-unit :: Utility/./UtilityTests/PassiveReplayTest.InstrumentedBarPtr (1734 of 2288) PASS: lldb-api :: functionalities/breakpoint/debugbreak/TestDebugBreak.py (1735 of 2288) PASS: lldb-unit :: Host/./HostTests/FileSystemTest.OpenErrno (1736 of 2288) PASS: lldb-api :: tools/lldb-server/memory-allocation/TestGdbRemoteMemoryAllocation.py (1737 of 2288) PASS: lldb-api :: functionalities/completion/TestCompletion.py (1738 of 2288) PASS: lldb-unit :: ScriptInterpreter/Python/./ScriptInterpreterPythonTests/PythonDataObjectsTest.TestGlobalNameResolutionNoDot (1739 of 2288) PASS: lldb-unit :: Utility/./UtilityTests/StreamTest.PutHex16ByteOrderLittle (1740 of 2288) PASS: lldb-api :: functionalities/set-data/TestSetData.py (1741 of 2288) PASS: lldb-unit :: Utility/./UtilityTests/StringListTest.RemoveBlankLines (1742 of 2288) PASS: lldb-shell :: SymbolFile/DWARF/x86/debug_loc.s (1743 of 2288) PASS: lldb-api :: functionalities/unwind/sigtramp/TestSigtrampUnwind.py (1744 of 2288) PASS: lldb-unit :: Utility/./UtilityTests/SubsystemRAIITest.NormalSubsystem (1745 of 2288) PASS: lldb-shell :: SymbolFile/symbol-binding.test (1746 of 2288) PASS: lldb-unit :: Utility/./UtilityTests/StringListTest.AppendStringStdString (1747 of 2288) UNSUPPORTED: lldb-shell :: ScriptInterpreter/Lua/breakpoint_function_callback.test (1748 of 2288) PASS: lldb-unit :: Utility/./UtilityTests/RecordReplayTest.InstrumentedFooSameThis (1749 of 2288) PASS: lldb-api :: tools/lldb-server/thread-name/TestGdbRemoteThreadName.py (1750 of 2288) PASS: lldb-api :: lang/objc/objc-struct-argument/TestObjCStructArgument.py (1751 of 2288) PASS: lldb-shell :: ObjectFile/ELF/aarch64-relocations.yaml (1752 of 2288) PASS: lldb-unit :: Language/Highlighting/./HighlighterTests/HighlighterTest.ClangPreserveNewLine (1753 of 2288) UNSUPPORTED: lldb-api :: python_api/disassemble-raw-data/TestDisassemble_VST1_64.py (1754 of 2288) PASS: lldb-shell :: Minidump/Windows/Sigsegv/sigsegv.test (1755 of 2288) PASS: lldb-unit :: Utility/./UtilityTests/UriParserTest.BadPort2 (1756 of 2288) PASS: lldb-api :: lang/cpp/dynamic-value/TestCppValueCast.py (1757 of 2288) PASS: lldb-unit :: Utility/./UtilityTests/ArgsTest.TestArgv (1758 of 2288) PASS: lldb-api :: functionalities/data-formatter/data-formatter-stl/libcxx/vbool/TestDataFormatterLibcxxVBool.py (1759 of 2288) PASS: lldb-unit :: Process/minidump/./LLDBMinidumpTests/MinidumpParserTest.MinidumpDuplicateModuleMinAddress (1760 of 2288) PASS: lldb-api :: commands/settings/quoting/TestQuoting.py (1761 of 2288) PASS: lldb-unit :: UnwindAssembly/x86/./UnwindAssemblyx86Tests/Testx86AssemblyInspectionEngine.TestSpillRegToStackViaMOVx86_64 (1762 of 2288) UNSUPPORTED: lldb-api :: functionalities/data-formatter/data-formatter-stl/libstdcpp/list/TestDataFormatterStdList.py (1763 of 2288) PASS: lldb-api :: functionalities/abbreviation/TestAbbreviations.py (1764 of 2288) XFAIL: lldb-shell :: Register/x86-64-fp-write.test (1765 of 2288) PASS: lldb-unit :: Thread/./ThreadTests/ThreadTest.GetPrivateStopInfo (1766 of 2288) PASS: lldb-unit :: Utility/./UtilityTests/StreamTest.PutStringAsRawHex8 (1767 of 2288) PASS: lldb-api :: python_api/watchpoint/TestSetWatchpoint.py (1768 of 2288) PASS: lldb-api :: lang/cpp/stl/TestSTL.py (1769 of 2288) PASS: lldb-unit :: Editline/./EditlineTests/EditlineTestFixture.EditlineReceivesMultiLineText (1770 of 2288) PASS: lldb-api :: commands/watchpoints/watchpoint_count/TestWatchpointCount.py (1771 of 2288) XFAIL: lldb-shell :: Register/x86-64-fp-read.test (1772 of 2288) PASS: lldb-unit :: Host/./HostTests/MainLoopTest.UnmonitoredSignal (1773 of 2288) PASS: lldb-unit :: Utility/./UtilityTests/Flags.AllClear (1774 of 2288) PASS: lldb-api :: python_api/name_lookup/TestNameLookup.py (1775 of 2288) PASS: lldb-unit :: Utility/./UtilityTests/RangeTest.Clear (1776 of 2288) PASS: lldb-unit :: Utility/./UtilityTests/LogChannelEnabledTest.log_options (1777 of 2288) PASS: lldb-unit :: ObjectFile/Breakpad/./ObjectFileBreakpadTests/FuncRecord.parse (1778 of 2288) PASS: lldb-unit :: Language/Highlighting/./HighlighterTests/HighlighterTest.DefaultHighlighter (1779 of 2288) PASS: lldb-api :: lang/objc/modules-cache/TestClangModulesCache.py (1780 of 2288) PASS: lldb-shell :: Reproducer/Modules/TestModuleCXX.test (1781 of 2288) PASS: lldb-api :: tools/lldb-server/TestLldbGdbServer.py (1782 of 2288) PASS: lldb-unit :: UnwindAssembly/x86/./UnwindAssemblyx86Tests/Testx86AssemblyInspectionEngine.TestCALLNextInsn (1783 of 2288) PASS: lldb-unit :: Utility/./UtilityTests/EnvironmentTest.EnvpConversion (1784 of 2288) PASS: lldb-api :: functionalities/reproducers/attach/TestReproducerAttach.py (1785 of 2288) PASS: lldb-unit :: Utility/./UtilityTests/Flags.AnyClear (1786 of 2288) PASS: lldb-shell :: BuildScript/script-args.test (1787 of 2288) UNSUPPORTED: lldb-api :: arm/breakpoint-it/TestBreakpointIt.py (1788 of 2288) PASS: lldb-api :: api/listeners/TestListener.py (1789 of 2288) PASS: lldb-unit :: Core/./LLDBCoreTests/ModuleSpecTest.TestCOFFFile (1790 of 2288) PASS: lldb-api :: python_api/frame/TestFrames.py (1791 of 2288) PASS: lldb-unit :: Utility/./UtilityTests/DataExtractorTest.GetCStr (1792 of 2288) PASS: lldb-shell :: SymbolFile/DWARF/x86/array-sizes.s (1793 of 2288) PASS: lldb-api :: lang/cpp/static_member_type_depending_on_parent_size/TestStaticMemberTypeDependingOnParentSize.py (1794 of 2288) UNSUPPORTED: lldb-api :: python_api/event/TestEvents.py (1795 of 2288) PASS: lldb-unit :: Utility/./UtilityTests/StringLexerTest.GetUnlexed (1796 of 2288) PASS: lldb-unit :: Utility/./UtilityTests/StringListTest.LongestCommonPrefixEmpty (1797 of 2288) PASS: lldb-api :: tools/lldb-server/inferior-crash/TestGdbRemoteAbort.py (1798 of 2288) PASS: lldb-api :: macosx/universal/TestUniversal.py (1799 of 2288) PASS: lldb-api :: functionalities/lazy-loading/TestLazyLoading.py (1800 of 2288) PASS: lldb-unit :: Process/minidump/./LLDBMinidumpTests/MinidumpParserTest.GetMemoryRegionInfo (1801 of 2288) PASS: lldb-shell :: Commands/command-backtrace.test (1802 of 2288) PASS: lldb-shell :: SymbolFile/DWARF/x86/DW_AT_declaration-with-children.s (1803 of 2288) PASS: lldb-unit :: Utility/./UtilityTests/SerializationRountripTest.SerializeDeserializeObjectReference (1804 of 2288) PASS: lldb-api :: functionalities/var_path/TestVarPath.py (1805 of 2288) PASS: lldb-unit :: Utility/./UtilityTests/StreamTeeTest.Assignment (1806 of 2288) PASS: lldb-api :: functionalities/breakpoint/breakpoint_hit_count/TestBreakpointHitCount.py (1807 of 2288) PASS: lldb-unit :: Expression/./ExpressionTests/CppModuleConfigurationTest.AmbiguousCLib (1808 of 2288) PASS: lldb-api :: commands/process/signal/TestProcessSignal.py (1809 of 2288) PASS: lldb-api :: lang/cpp/function-qualifiers/TestCppFunctionQualifiers.py (1810 of 2288) PASS: lldb-api :: lang/cpp/type_lookup/TestCppTypeLookup.py (1811 of 2288) UNSUPPORTED: lldb-api :: iohandler/unicode/TestUnicode.py (1812 of 2288) PASS: lldb-shell :: SymbolFile/DWARF/x86/DW_TAG_variable-invalid_location.s (1813 of 2288) PASS: lldb-unit :: Utility/./UtilityTests/FileSpecTest.EqualDotsPosixRoot (1814 of 2288) PASS: lldb-unit :: DataFormatter/./LLDBFormatterTests/FormatManagerTests.CompatibleLangs (1815 of 2288) PASS: lldb-unit :: Host/./HostTests/FileSystemTest.GetByteSize (1816 of 2288) PASS: lldb-unit :: Expression/./ExpressionTests/CppModuleConfigurationTest.LinuxLocalLibCpp (1817 of 2288) PASS: lldb-unit :: Utility/./UtilityTests/OptionsWithRawTest.TerminatedQuote (1818 of 2288) PASS: lldb-api :: functionalities/tail_call_frames/cross_dso/TestCrossDSOTailCalls.py (1819 of 2288) PASS: lldb-unit :: Host/./HostTests/SocketAddressTest.GetAddressInfo (1820 of 2288) PASS: lldb-unit :: Process/gdb-remote/./ProcessGdbRemoteTests/PortMapTest.FreePort (1821 of 2288) PASS: lldb-shell :: SymbolFile/NativePDB/break-by-line.cpp (1822 of 2288) UNSUPPORTED: lldb-api :: lang/cpp/static_members/TestCPPStaticMembers.py (1823 of 2288) PASS: lldb-api :: python_api/type/TestTypeList.py (1824 of 2288) PASS: lldb-unit :: Process/minidump/./LLDBMinidumpTests/MinidumpParserTest.GetPidWindows (1825 of 2288) PASS: lldb-unit :: Symbol/./SymbolTests/TestTypeSystemClang.TestRemoveFastQualifiers (1826 of 2288) PASS: lldb-unit :: Utility/./UtilityTests/StringListTest.ShiftCString (1827 of 2288) PASS: lldb-api :: commands/session/history/TestSessionHistory.py (1828 of 2288) PASS: lldb-unit :: Utility/./UtilityTests/BinaryStreamTest.PutULEB128NineBytes (1829 of 2288) PASS: lldb-unit :: Language/Highlighting/./HighlighterTests/HighlighterTest.ClangSquareBrackets (1830 of 2288) PASS: lldb-api :: lang/cpp/offsetof/TestOffsetofCpp.py (1831 of 2288) PASS: lldb-api :: commands/expression/scoped_enums/TestScopedEnumType.py (1832 of 2288) PASS: lldb-shell :: ScriptInterpreter/Python/eof.test (1833 of 2288) PASS: lldb-api :: functionalities/data-formatter/varscript_formatting/TestDataFormatterVarScriptFormatting.py (1834 of 2288) PASS: lldb-unit :: ScriptInterpreter/Python/./ScriptInterpreterPythonTests/PythonDataObjectsTest.TestPythonStringToStr (1835 of 2288) PASS: lldb-api :: lang/cpp/bool/TestCPPBool.py (1836 of 2288) UNSUPPORTED: lldb-shell :: Register/aarch64-gp-read.test (1837 of 2288) PASS: lldb-api :: lang/cpp/diamond/TestDiamond.py (1838 of 2288) PASS: lldb-unit :: Utility/./UtilityTests/RangeTest.ContainsEndInclusiveInvalid (1839 of 2288) PASS: lldb-api :: lang/cpp/operators/TestCppOperators.py (1840 of 2288) PASS: lldb-unit :: Utility/./UtilityTests/StructuredDataTest.StringDump (1841 of 2288) PASS: lldb-shell :: ObjectFile/PECOFF/uuid.yaml (1842 of 2288) PASS: lldb-unit :: Target/./TargetTests/ModuleCacheTest.GetAndPutUuidExists (1843 of 2288) PASS: lldb-api :: tools/lldb-server/TestGdbRemoteProcessInfo.py (1844 of 2288) PASS: lldb-unit :: Utility/./UtilityTests/XcodeSDKTest.SDKSupportsModules (1845 of 2288) PASS: lldb-api :: tools/lldb-vscode/coreFile/TestVSCode_coreFile.py (1846 of 2288) PASS: lldb-api :: functionalities/pre_run_dylibs/TestPreRunDylibs.py (1847 of 2288) PASS: lldb-api :: functionalities/fat_archives/TestFatArchives.py (1848 of 2288) PASS: lldb-unit :: Utility/./UtilityTests/OptionsWithRawTest.ArgsButNoLeadingDash (1849 of 2288) PASS: lldb-api :: lang/cpp/trivial_abi/TestTrivialABI.py (1850 of 2288) PASS: lldb-api :: functionalities/tail_call_frames/ambiguous_tail_call_seq2/TestAmbiguousTailCallSeq2.py (1851 of 2288) UNSUPPORTED: lldb-api :: functionalities/tsan/thread_numbers/TestTsanThreadNumbers.py (1852 of 2288) PASS: lldb-api :: functionalities/abbreviation/TestCommonShortSpellings.py (1853 of 2288) PASS: lldb-unit :: UnwindAssembly/x86/./UnwindAssemblyx86Tests/Testx86AssemblyInspectionEngine.TestPushECX (1854 of 2288) PASS: lldb-unit :: Platform/./LLDBPlatformTests/PlatformDarwinTest.FindComponentInPath (1855 of 2288) PASS: lldb-unit :: UnwindAssembly/x86/./UnwindAssemblyx86Tests/Testx86AssemblyInspectionEngine.TestPushEDI (1856 of 2288) PASS: lldb-unit :: ObjectFile/Breakpad/./ObjectFileBreakpadTests/StackWinRecord.parse (1857 of 2288) PASS: lldb-unit :: Utility/./UtilityTests/FileSpecTest.IsRelative (1858 of 2288) PASS: lldb-unit :: Utility/./UtilityTests/IndexToObjectTest.ObjectForIndex (1859 of 2288) PASS: lldb-unit :: Utility/./UtilityTests/DataExtractorTest.GetFloat (1860 of 2288) PASS: lldb-api :: commands/expression/deleting-implicit-copy-constructor/TestDeletingImplicitCopyConstructor.py (1861 of 2288) PASS: lldb-api :: functionalities/data-formatter/stringprinter/TestStringPrinter.py (1862 of 2288) PASS: lldb-shell :: ScriptInterpreter/Python/fail_breakpoint_oneline.test (1863 of 2288) PASS: lldb-shell :: SymbolFile/NativePDB/globals-fundamental.cpp (1864 of 2288) PASS: lldb-unit :: Utility/./UtilityTests/ConstStringTest.UpdateMangledCounterpart (1865 of 2288) PASS: lldb-api :: commands/expression/import-std-module/missing-module-sources/TestStdModuleSourcesMissing.py (1866 of 2288) PASS: lldb-api :: lang/cpp/llvm-style/TestLLVMStyle.py (1867 of 2288) PASS: lldb-api :: python_api/watchpoint/condition/TestWatchpointConditionAPI.py (1868 of 2288) PASS: lldb-unit :: Utility/./UtilityTests/RangeTest.SetRangeBase (1869 of 2288) PASS: lldb-api :: commands/expression/pr35310/TestExprsBug35310.py (1870 of 2288) PASS: lldb-api :: lang/objc/self/TestObjCSelf.py (1871 of 2288) PASS: lldb-unit :: Language/Highlighting/./HighlighterTests/HighlighterTest.ClangCursorOutOfBounds (1872 of 2288) PASS: lldb-api :: lang/cpp/virtual-functions/TestCppVirtualFunctions.py (1873 of 2288) PASS: lldb-unit :: Utility/./UtilityTests/StreamTest.PutCString (1874 of 2288) PASS: lldb-shell :: Breakpoint/single-file-split-dwarf.test (1875 of 2288) PASS: lldb-api :: lang/cpp/gmodules-templates/TestGModules.py (1876 of 2288) PASS: lldb-unit :: Utility/./UtilityTests/StringListTest.GetMaxStringLengthIncreasingSize (1877 of 2288) PASS: lldb-api :: functionalities/stats_api/TestStatisticsAPI.py (1878 of 2288) PASS: lldb-unit :: Utility/./UtilityTests/XcodeSDKTest.GetCanonicalNameAndConstruct (1879 of 2288) PASS: lldb-unit :: Utility/./UtilityTests/StreamTest.PutRawBytesToMixedEndian (1880 of 2288) PASS: lldb-unit :: Utility/./UtilityTests/Flags.Clear (1881 of 2288) PASS: lldb-api :: commands/expression/ir-interpreter-phi-nodes/TestIRInterpreterPHINodes.py (1882 of 2288) PASS: lldb-unit :: Utility/./UtilityTests/StringListTest.GetMaxStringLengthEqualSize (1883 of 2288) PASS: lldb-api :: commands/source/info/TestSourceInfo.py (1884 of 2288) PASS: lldb-api :: lang/c/enum_types/TestEnumTypes.py (1885 of 2288) PASS: lldb-unit :: Target/./TargetTests/ExecutionContextTest.GetByteOrder (1886 of 2288) PASS: lldb-unit :: Utility/./UtilityTests/RangeTest.EqualInvalid (1887 of 2288) PASS: lldb-api :: functionalities/thread/concurrent_events/TestConcurrentNWatchNBreak.py (1888 of 2288) PASS: lldb-shell :: Reproducer/TestDump.test (1889 of 2288) PASS: lldb-unit :: Process/minidump/./LLDBMinidumpTests/MinidumpParserTest.GetThreadsAndGetThreadContext (1890 of 2288) PASS: lldb-api :: lang/c/set_values/TestSetValues.py (1891 of 2288) UNSUPPORTED: lldb-shell :: ScriptInterpreter/Lua/independent_state.test (1892 of 2288) PASS: lldb-unit :: Utility/./UtilityTests/BinaryStreamTest.PutSLEB128OneByte (1893 of 2288) PASS: lldb-api :: commands/target/stop-hook/delete/TestTargetStopHookDelete.py (1894 of 2288) PASS: lldb-unit :: Host/./HostTests/NativeProcessProtocolTest.ReadMemoryWithoutTrap (1895 of 2288) PASS: lldb-shell :: SymbolFile/DWARF/x86/debug-types-missing-signature.test (1896 of 2288) PASS: lldb-api :: commands/frame/diagnose/dereference-function-return/TestDiagnoseDereferenceFunctionReturn.py (1897 of 2288) PASS: lldb-unit :: Utility/./UtilityTests/UriParserTest.TypicalPortPathIPv6 (1898 of 2288) PASS: lldb-api :: functionalities/gdb_remote_client/TestIOSSimulator.py (1899 of 2288) PASS: lldb-shell :: Driver/TestCommands.test (1900 of 2288) PASS: lldb-shell :: Commands/command-disassemble-process.yaml (1901 of 2288) PASS: lldb-unit :: ScriptInterpreter/Python/./ScriptInterpreterPythonTests/PythonDataObjectsTest.TestObjectAttributes (1902 of 2288) PASS: lldb-api :: lang/objc/objc-baseclass-sbtype/TestObjCBaseClassSBType.py (1903 of 2288) PASS: lldb-api :: lang/c/global_variables/TestGlobalVariables.py (1904 of 2288) PASS: lldb-api :: functionalities/rerun/TestRerun.py (1905 of 2288) PASS: lldb-api :: functionalities/breakpoint/source_regexp/TestSourceRegexBreakpoints.py (1906 of 2288) PASS: lldb-unit :: Utility/./UtilityTests/ArgsTest.ReplaceArgumentAtIndexLonger (1907 of 2288) PASS: lldb-unit :: Utility/./UtilityTests/FileSpecTest.PrependPathComponent (1908 of 2288) PASS: lldb-unit :: Utility/./UtilityTests/RangeTest.ContainsEndInclusive (1909 of 2288) PASS: lldb-unit :: UnwindAssembly/x86/./UnwindAssemblyx86Tests/Testx86AssemblyInspectionEngine.TestSimplei386ugmented (1910 of 2288) PASS: lldb-api :: lang/objc/bitfield_ivars/TestBitfieldIvars.py (1911 of 2288) PASS: lldb-api :: functionalities/thread/jump/TestThreadJump.py (1912 of 2288) PASS: lldb-api :: commands/expression/xvalue/TestXValuePrinting.py (1913 of 2288) PASS: lldb-unit :: Symbol/./SymbolTests/TestTypeSystemClang.TestGetEnumIntegerTypeUnexpectedType (1914 of 2288) PASS: lldb-unit :: SymbolFile/DWARF/./SymbolFileDWARFTests/SymbolFileDWARFTests.TestAbbrevMissingTerminator (1915 of 2288) PASS: lldb-api :: lang/cpp/class_types/TestClassTypes.py (1916 of 2288) PASS: lldb-unit :: Utility/./UtilityTests/BinaryStreamTest.PutSLEB128MaxValue (1917 of 2288) PASS: lldb-unit :: Utility/./UtilityTests/BinaryStreamTest.PutULEB128FourBytes (1918 of 2288) PASS: lldb-api :: functionalities/postmortem/minidump-new/TestMiniDumpNew.py (1919 of 2288) PASS: lldb-unit :: Expression/./ExpressionTests/CppModuleConfigurationTest.UnrelatedLibrary (1920 of 2288) UNSUPPORTED: lldb-api :: benchmarks/expression/TestExpressionCmd.py (1921 of 2288) PASS: lldb-unit :: Utility/./UtilityTests/SerializationRountripTest.SerializeDeserializePod (1922 of 2288) PASS: lldb-unit :: Utility/./UtilityTests/OptionsWithRawTest.EmptySuffix (1923 of 2288) PASS: lldb-api :: functionalities/thread/concurrent_events/TestConcurrentBreakpointDelayBreakpointOneSignal.py (1924 of 2288) PASS: lldb-unit :: Utility/./UtilityTests/StreamTest.PutMaxHex64ByteOrderLittle (1925 of 2288) PASS: lldb-unit :: UnwindAssembly/x86/./UnwindAssemblyx86Tests/Testx86AssemblyInspectionEngine.Test32BitOnlyInstruction (1926 of 2288) PASS: lldb-unit :: UnwindAssembly/x86/./UnwindAssemblyx86Tests/Testx86AssemblyInspectionEngine.TestSubRSP (1927 of 2288) PASS: lldb-unit :: Expression/./ExpressionTests/DiagnosticManagerTest.GetStringNoDiags (1928 of 2288) PASS: lldb-unit :: Target/./TargetTests/MCBasedABI.MapRegisterName (1929 of 2288) PASS: lldb-unit :: Utility/./UtilityTests/DataExtractorTest.GetCStrUnterminated (1930 of 2288) PASS: lldb-api :: commands/expression/completion-in-lambda-and-unnamed-class/TestCompletionInLambdaAndUnnamedClass.py (1931 of 2288) PASS: lldb-unit :: Process/minidump/./LLDBMinidumpTests/MinidumpParserTest.GetExceptionStream (1932 of 2288) PASS: lldb-api :: lang/c/step_over_no_deadlock/TestStepOverDoesntBlock.py (1933 of 2288) PASS: lldb-unit :: debugserver/./debugserverTests/RNBSocket.LoopBackListenIPv6 (1934 of 2288) PASS: lldb-unit :: Utility/./UtilityTests/SubsystemRAIITest.SubsystemWithErrorFailure (1935 of 2288) PASS: lldb-unit :: Language/CPlusPlus/./LanguageCPlusPlusTests/CPlusPlusLanguage.FindAlternateFunctionManglings (1936 of 2288) UNSUPPORTED: lldb-shell :: SymbolFile/PDB/typedefs.test (1937 of 2288) PASS: lldb-unit :: Utility/./UtilityTests/DeserializerTest.HasData (1938 of 2288) UNSUPPORTED: lldb-shell :: SymbolFile/NativePDB/ast-functions-msvc.cpp (1939 of 2288) PASS: lldb-unit :: Language/Highlighting/./HighlighterTests/HighlighterTest.ClangBraces (1940 of 2288) PASS: lldb-shell :: Commands/CommandScriptImmediateOutput/CommandScriptImmediateOutputFile.test (1941 of 2288) PASS: lldb-api :: functionalities/data-formatter/data-formatter-synthval/TestDataFormatterSynthVal.py (1942 of 2288) UNSUPPORTED: lldb-shell :: Breakpoint/ppc64-localentry.test (1943 of 2288) PASS: lldb-unit :: Utility/./UtilityTests/OptionsWithRawTest.SingleWhitespaceInput (1944 of 2288) PASS: lldb-api :: functionalities/thread/concurrent_events/TestConcurrentWatchBreak.py (1945 of 2288) PASS: lldb-unit :: Utility/./UtilityTests/RecordReplayTest.ValidSequence (1946 of 2288) PASS: lldb-unit :: Expression/./ExpressionTests/DWARFExpressionMockProcessTest.DW_OP_deref (1947 of 2288) PASS: lldb-api :: lang/cpp/extern_c/TestExternCSymbols.py (1948 of 2288) PASS: lldb-api :: commands/add-dsym/uuid/TestAddDsymCommand.py (1949 of 2288) PASS: lldb-unit :: Host/./HostTests/FileSystemTest.EmptyTest (1950 of 2288) PASS: lldb-shell :: Commands/command-disassemble.s (1951 of 2288) PASS: lldb-shell :: Driver/TestRepl.test (1952 of 2288) PASS: lldb-api :: functionalities/gdb_remote_client/TestNestedRegDefinitions.py (1953 of 2288) PASS: lldb-unit :: Utility/./UtilityTests/StringExtractorTest.GetHexBytesAvail_FullString (1954 of 2288) PASS: lldb-shell :: SymbolFile/Breakpad/symtab-macho.test (1955 of 2288) PASS: lldb-api :: lang/cpp/inlines/TestInlines.py (1956 of 2288) XFAIL: lldb-shell :: Register/x86-mm-xmm-write.test (1957 of 2288) PASS: lldb-shell :: SymbolFile/Breakpad/unwind-via-stack-win-no-memory-info.yaml (1958 of 2288) PASS: lldb-shell :: Error/assert.test (1959 of 2288) PASS: lldb-unit :: Utility/./UtilityTests/BinaryStreamTest.PutSLEB128FiveBytes (1960 of 2288) PASS: lldb-api :: functionalities/show_location/TestShowLocationDwarf5.py (1961 of 2288) PASS: lldb-shell :: SymbolFile/NativePDB/function-types-calling-conv.cpp (1962 of 2288) PASS: lldb-unit :: Utility/./UtilityTests/Flags.AnySet (1963 of 2288) PASS: lldb-shell :: ObjectFile/PDB/object.test (1964 of 2288) PASS: lldb-unit :: Symbol/./SymbolTests/TestClangASTImporter.DeportTypeTagDecl (1965 of 2288) PASS: lldb-api :: functionalities/type_get_module/TestTypeGetModule.py (1966 of 2288) PASS: lldb-api :: functionalities/data-formatter/data-formatter-ptr-to-array/TestPtrToArrayFormatting.py (1967 of 2288) PASS: lldb-unit :: Host/./HostTests/Host.WaitStatusFormat (1968 of 2288) PASS: lldb-unit :: Utility/./UtilityTests/ArchSpecTest.TripleComponentsWereSpecified (1969 of 2288) PASS: lldb-shell :: Expr/TestIRMemoryMap.test (1970 of 2288) PASS: lldb-api :: functionalities/data-formatter/data-formatter-categories/TestDataFormatterCategories.py (1971 of 2288) PASS: lldb-api :: macosx/safe-to-func-call/TestSafeFuncCalls.py (1972 of 2288) PASS: lldb-api :: functionalities/data-formatter/ptr_ref_typedef/TestPtrRef2Typedef.py (1973 of 2288) PASS: lldb-api :: commands/disassemble/basic/TestFrameDisassemble.py (1974 of 2288) PASS: lldb-shell :: Register/x86-64-ymm-read.test (1975 of 2288) PASS: lldb-unit :: Utility/./UtilityTests/RangeTest.NotEqual (1976 of 2288) UNSUPPORTED: lldb-shell :: SymbolFile/PDB/vbases.test (1977 of 2288) PASS: lldb-shell :: ScriptInterpreter/None/import_module.test (1978 of 2288) PASS: lldb-api :: commands/expression/completion-crash-incomplete-record/TestCompletionCrashIncompleteRecord.py (1979 of 2288) PASS: lldb-shell :: SymbolFile/DWARF/clang-ast-from-dwarf-unamed-and-anon-structs.cpp (1980 of 2288) PASS: lldb-unit :: Expression/./ExpressionTests/CppModuleConfigurationTest.LibCppV2 (1981 of 2288) PASS: lldb-unit :: Utility/./UtilityTests/StringExtractorTest.GetHexBytesAvail_OddPair2 (1982 of 2288) PASS: lldb-unit :: Utility/./UtilityTests/ArgsTest.BareSingleQuote (1983 of 2288) PASS: lldb-api :: functionalities/data-formatter/language_category_updates/TestDataFormatterLanguageCategoryUpdates.py (1984 of 2288) PASS: lldb-api :: functionalities/thread/concurrent_events/TestConcurrentBreakpointsDelayedBreakpointOneWatchpoint.py (1985 of 2288) PASS: lldb-unit :: Utility/./UtilityTests/StringExtractorTest.GetHexU8_Extra (1986 of 2288) PASS: lldb-api :: lang/mixed/TestMixedLanguages.py (1987 of 2288) PASS: lldb-api :: functionalities/data-formatter/data-formatter-objc/TestDataFormatterObjCKVO.py (1988 of 2288) PASS: lldb-api :: macosx/find-app-in-bundle/TestFindAppInBundle.py (1989 of 2288) PASS: lldb-unit :: Utility/./UtilityTests/ScalarTest.Scalar_512 (1990 of 2288) PASS: lldb-shell :: SymbolFile/DWARF/x86/compilercontext.ll (1991 of 2288) PASS: lldb-api :: functionalities/data-formatter/compactvectors/TestCompactVectors.py (1992 of 2288) PASS: lldb-api :: commands/target/stop-hooks/TestStopHooks.py (1993 of 2288) PASS: lldb-unit :: UnwindAssembly/x86/./UnwindAssemblyx86Tests/Testx86AssemblyInspectionEngine.TestPushRBPWithREX (1994 of 2288) PASS: lldb-shell :: ScriptInterpreter/Python/command_import.test (1995 of 2288) PASS: lldb-unit :: UnwindAssembly/x86/./UnwindAssemblyx86Tests/Testx86AssemblyInspectionEngine.TestPushR12 (1996 of 2288) PASS: lldb-unit :: Expression/./ExpressionTests/DiagnosticManagerTest.AppendMessageNoDiag (1997 of 2288) PASS: lldb-shell :: SymbolFile/DWARF/x86/dwp-separate-debug-file.cpp (1998 of 2288) PASS: lldb-shell :: ObjectFile/ELF/section-addresses.yaml (1999 of 2288) UNSUPPORTED: lldb-shell :: Register/x86-zmm-write.test (2000 of 2288) PASS: lldb-api :: commands/command/delete/TestCommandDelete.py (2001 of 2288) PASS: lldb-unit :: Process/minidump/./LLDBMinidumpTests/MinidumpParserTest.GetMemoryRegionInfoLinuxMaps (2002 of 2288) PASS: lldb-unit :: UnwindAssembly/x86/./UnwindAssemblyx86Tests/Testx86AssemblyInspectionEngine.TestPopRBP (2003 of 2288) PASS: lldb-api :: functionalities/memory-region/TestMemoryRegion.py (2004 of 2288) PASS: lldb-api :: lang/cpp/const_this/TestConstThis.py (2005 of 2288) PASS: lldb-api :: functionalities/wrong_commands/TestWrongCommands.py (2006 of 2288) UNSUPPORTED: lldb-api :: functionalities/ubsan/basic/TestUbsanBasic.py (2007 of 2288) PASS: lldb-unit :: Symbol/./SymbolTests/TestTypeSystemClang.TestDisplayNameEmpty (2008 of 2288) PASS: lldb-api :: functionalities/data-formatter/data-formatter-stl/libcxx/bitset/TestDataFormatterLibcxxBitset.py (2009 of 2288) PASS: lldb-unit :: Utility/./UtilityTests/VMRange.ContainsAddr (2010 of 2288) PASS: lldb-unit :: Utility/./UtilityTests/SerializationRountripTest.SerializeDeserializePodReferences (2011 of 2288) PASS: lldb-shell :: Minidump/Windows/find-module.test (2012 of 2288) PASS: lldb-shell :: SymbolFile/DWARF/x86/win-i386-line-table.s (2013 of 2288) PASS: lldb-unit :: ScriptInterpreter/Python/./ScriptInterpreterPythonTests/PythonDataObjectsTest.TestPythonListValueEquality (2014 of 2288) PASS: lldb-api :: lang/cpp/unique-types/TestUniqueTypes.py (2015 of 2288) PASS: lldb-unit :: Signals/./SignalsTests/UnixSignalsTest.GetFilteredSignals (2016 of 2288) PASS: lldb-unit :: Utility/./UtilityTests/StreamTeeTest.Constructor2Streams (2017 of 2288) UNSUPPORTED: lldb-api :: benchmarks/turnaround/TestCompileRunToBreakpointTurnaround.py (2018 of 2288) PASS: lldb-unit :: Process/Utility/./ProcessUtilityTests/ProcSMapTests/LinuxProcSMapsTestFixture.ParseSMapRegions/4 (2019 of 2288) PASS: lldb-unit :: Utility/./UtilityTests/StringLexerTest.Peek (2020 of 2288) PASS: lldb-api :: commands/session/save/TestSessionSave.py (2021 of 2288) PASS: lldb-api :: functionalities/target-new-solib-notifications/TestModuleLoadedNotifys.py (2022 of 2288) PASS: lldb-unit :: ScriptInterpreter/Python/./ScriptInterpreterPythonTests/PythonDataObjectsTest.TestExtractingUInt64ThroughStructuredData (2023 of 2288) PASS: lldb-shell :: SymbolFile/DWARF/x86/debug_loc-aslr.s (2024 of 2288) PASS: lldb-unit :: Symbol/./SymbolTests/Type.GetTypeScopeAndBasename (2025 of 2288) PASS: lldb-api :: functionalities/unwind/zeroth_frame/TestZerothFrame.py (2026 of 2288) PASS: lldb-api :: functionalities/gdb_remote_client/TestRecognizeBreakpoint.py (2027 of 2288) UNSUPPORTED: lldb-shell :: Register/x86-ymm-write.test (2028 of 2288) UNSUPPORTED: lldb-shell :: Register/x86-64-ymm16-write.test (2029 of 2288) PASS: lldb-shell :: ObjectFile/wasm/embedded-debug-sections.yaml (2030 of 2288) UNSUPPORTED: lldb-api :: tools/lldb-server/TestGdbRemoteAuxvSupport.py (2031 of 2288) PASS: lldb-api :: functionalities/data-formatter/data-formatter-synth/TestDataFormatterSynth.py (2032 of 2288) PASS: lldb-unit :: Utility/./UtilityTests/LogChannelEnabledTest.LogVerboseThread (2033 of 2288) PASS: lldb-api :: functionalities/breakpoint/breakpoint_command/TestBreakpointCommandsFromPython.py (2034 of 2288) PASS: lldb-api :: commands/expression/radar_9673664/TestExprHelpExamples.py (2035 of 2288) PASS: lldb-unit :: UnwindAssembly/x86/./UnwindAssemblyx86Tests/Testx86AssemblyInspectionEngine.TestAddESP (2036 of 2288) PASS: lldb-unit :: Utility/./UtilityTests/StringListTest.Assignment (2037 of 2288) PASS: lldb-unit :: SymbolFile/DWARF/./SymbolFileDWARFTests/SymbolFileDWARFTests.ParseAranges (2038 of 2288) PASS: lldb-api :: lang/objc/foundation/TestConstStrings.py (2039 of 2288) PASS: lldb-unit :: Signals/./SignalsTests/UnixSignalsTest.Iteration (2040 of 2288) PASS: lldb-unit :: Process/gdb-remote/./ProcessGdbRemoteTests/GDBRemoteCommunicationClientTest.ReadRegister (2041 of 2288) PASS: lldb-unit :: Utility/./UtilityTests/RangeTest.ContainsAddrInvalid (2042 of 2288) PASS: lldb-api :: driver/batch_mode/TestBatchMode.py (2043 of 2288) PASS: lldb-unit :: Utility/./UtilityTests/StreamTest.AddressRangeSize (2044 of 2288) PASS: lldb-unit :: Utility/./UtilityTests/StringExtractorTest.GetHexU8_Underflow2_NoEof (2045 of 2288) PASS: lldb-shell :: SymbolFile/DWARF/anon_class_w_and_wo_export_symbols.ll (2046 of 2288) PASS: lldb-unit :: UnwindAssembly/x86/./UnwindAssemblyx86Tests/Testx86AssemblyInspectionEngine.Test64bitFramelessSmallStackFrame (2047 of 2288) PASS: lldb-api :: functionalities/thread/concurrent_events/TestConcurrentTwoBreakpointThreads.py (2048 of 2288) PASS: lldb-unit :: Utility/./UtilityTests/EventTest.DumpEventDataBytes (2049 of 2288) PASS: lldb-api :: functionalities/data-formatter/builtin-formats/TestBuiltinFormats.py (2050 of 2288) PASS: lldb-unit :: Utility/./UtilityTests/StringExtractorTest.GetHexBytes_OddPair (2051 of 2288) PASS: lldb-api :: functionalities/thread/exit_during_expression/TestExitDuringExpression.py (2052 of 2288) PASS: lldb-unit :: Process/Utility/./ProcessUtilityTests/RegisterContext_x86Test.FullToAbridgedTagWord (2053 of 2288) PASS: lldb-shell :: Reproducer/TestPythonImport.test (2054 of 2288) PASS: lldb-unit :: Expression/./ExpressionTests/CppModuleConfigurationTest.MissingUsrInclude (2055 of 2288) UNSUPPORTED: lldb-shell :: Unwind/unwind-plan-dwarf-dump.test (2056 of 2288) PASS: lldb-api :: commands/expression/rdar44436068/Test128BitsInteger.py (2057 of 2288) PASS: lldb-api :: commands/expression/unwind_expression/TestUnwindExpression.py (2058 of 2288) PASS: lldb-unit :: ObjectFile/ELF/./ObjectFileELFTests/ObjectFileELFTest.GetModuleSpecifications_EarlySectionHeaders (2059 of 2288) PASS: lldb-shell :: Reproducer/TestWorkingDir.test (2060 of 2288) PASS: lldb-api :: lang/objc/modules-objc-property/TestModulesObjCProperty.py (2061 of 2288) PASS: lldb-unit :: Utility/./UtilityTests/ArgsTest.TestSingleArgWithQuotedSpace (2062 of 2288) PASS: lldb-unit :: Utility/./UtilityTests/RangeTest.LessThan (2063 of 2288) PASS: lldb-api :: python_api/sbplatform/TestSBPlatform.py (2064 of 2288) PASS: lldb-unit :: Host/./HostTests/FileSystemTest.Resolve (2065 of 2288) PASS: lldb-unit :: ObjectFile/Breakpad/./ObjectFileBreakpadTests/FileRecord.parse (2066 of 2288) PASS: lldb-api :: lang/cpp/stl/TestStdCXXDisassembly.py (2067 of 2288) PASS: lldb-shell :: Commands/CommandScriptImmediateOutput/CommandScriptImmediateOutputConsole.test (2068 of 2288) PASS: lldb-api :: functionalities/unwind/noreturn/TestNoreturnUnwind.py (2069 of 2288) PASS: lldb-api :: commands/expression/call-function/TestCallBuiltinFunction.py (2070 of 2288) PASS: lldb-shell :: SymbolFile/DWARF/x86/find-basic-type.cpp (2071 of 2288) PASS: lldb-unit :: Process/Utility/./ProcessUtilityTests/ProcSMapTests/LinuxProcSMapsTestFixture.ParseSMapRegions/3 (2072 of 2288) PASS: lldb-unit :: Target/./TargetTests/ExecutionContextTest.GetByteOrderProcess (2073 of 2288) PASS: lldb-unit :: Symbol/./SymbolTests/TestTypeSystemClang.TestGetBasicTypeFromName (2074 of 2288) PASS: lldb-shell :: SymbolFile/Breakpad/unwind-via-raSearch.test (2075 of 2288) PASS: lldb-api :: commands/expression/import-std-module/shared_ptr-dbg-info-content/TestSharedPtrDbgInfoContentFromStdModule.py (2076 of 2288) PASS: lldb-shell :: SymbolFile/NativePDB/globals-bss.cpp (2077 of 2288) UNSUPPORTED: lldb-api :: arm/breakpoint-thumb-codesection/TestBreakpointThumbCodesection.py (2078 of 2288) PASS: lldb-unit :: Utility/./UtilityTests/BinaryStreamTest.PutSLEB128SixBytes (2079 of 2288) PASS: lldb-shell :: SymbolFile/DWARF/x86/dwarf5-split.s (2080 of 2288) PASS: lldb-unit :: Host/./HostTests/MainLoopTest.TerminatesImmediately (2081 of 2288) PASS: lldb-unit :: Utility/./UtilityTests/StringExtractorTest.GetU32LittleEndian (2082 of 2288) PASS: lldb-unit :: ObjectFile/Breakpad/./ObjectFileBreakpadTests/PublicRecord.parse (2083 of 2288) PASS: lldb-unit :: Utility/./UtilityTests/SerializationRountripTest.SerializeDeserializeCString (2084 of 2288) PASS: lldb-unit :: Utility/./UtilityTests/OptionsWithRawTest.MultiWordSuffix (2085 of 2288) PASS: lldb-shell :: Breakpoint/debug_addrx.test (2086 of 2288) PASS: lldb-shell :: ObjectFile/PECOFF/export-dllfunc.yaml (2087 of 2288) PASS: lldb-api :: functionalities/data-formatter/data-formatter-script/TestDataFormatterScript.py (2088 of 2288) PASS: lldb-unit :: ObjectFile/ELF/./ObjectFileELFTests/ObjectFileELFTest.GetSymtab_NoSymEntryPointArmThumbAddressClass (2089 of 2288) PASS: lldb-unit :: Utility/./UtilityTests/StringListTest.LongestCommonPrefix (2090 of 2288) PASS: lldb-api :: tools/lldb-server/signal-filtering/TestGdbRemote_QPassSignals.py (2091 of 2288) UNSUPPORTED: lldb-api :: linux/sepdebugsymlink/TestTargetSymbolsSepDebugSymlink.py (2092 of 2288) PASS: lldb-unit :: Utility/./UtilityTests/AnsiTerminal.AtEnd (2093 of 2288) PASS: lldb-unit :: Utility/./UtilityTests/ProcessInstanceInfoMatch.Name (2094 of 2288) PASS: lldb-unit :: Process/Utility/./ProcessUtilityTests/ProcMapTests/LinuxProcMapsTestFixture.ParseMapRegions/3 (2095 of 2288) PASS: lldb-api :: lang/cpp/default-template-args/TestDefaultTemplateArgs.py (2096 of 2288) PASS: lldb-api :: lang/objc/print-obj/TestPrintObj.py (2097 of 2288) PASS: lldb-unit :: Utility/./UtilityTests/StringListTest.SplitIntoLines (2098 of 2288) PASS: lldb-unit :: Utility/./UtilityTests/StreamTest.PutHex16ByteOrderBig (2099 of 2288) PASS: lldb-unit :: Utility/./UtilityTests/BinaryStreamTest.PutULEB128One (2100 of 2288) PASS: lldb-unit :: Utility/./UtilityTests/UriParserTest.BadPort (2101 of 2288) PASS: lldb-unit :: Process/minidump/./LLDBMinidumpTests/MinidumpParserTest.FindMemoryRange (2102 of 2288) PASS: lldb-unit :: Host/./HostTests/ConnectionFileDescriptorTest.TCPGetURIv4 (2103 of 2288) PASS: lldb-unit :: Language/Highlighting/./HighlighterTests/HighlighterTest.ClangStringLiterals (2104 of 2288) PASS: lldb-shell :: Minidump/fb-dump.test (2105 of 2288) PASS: lldb-api :: functionalities/data-formatter/data-formatter-stl/libcxx/unordered/TestDataFormatterUnordered.py (2106 of 2288) PASS: lldb-unit :: Target/./TargetTests/ExecutionContextTest.GetByteOrderTarget (2107 of 2288) PASS: lldb-api :: lang/cpp/namespace_conflicts/TestNamespaceConflicts.py (2108 of 2288) PASS: lldb-unit :: ScriptInterpreter/Python/./ScriptInterpreterPythonTests/PythonDataObjectsTest.TestPythonIntegerToStructuredInteger (2109 of 2288) PASS: lldb-shell :: SymbolFile/DWARF/deterministic-build.cpp (2110 of 2288) PASS: lldb-unit :: Utility/./UtilityTests/NameMatchesTest.Equals (2111 of 2288) PASS: lldb-api :: lang/objc/rdar-11355592/TestRdar11355592.py (2112 of 2288) PASS: lldb-unit :: Utility/./UtilityTests/RangeTest.DoesAdjoinOrIntersect (2113 of 2288) PASS: lldb-api :: commands/command/script/import/rdar-12586188/TestRdar12586188.py (2114 of 2288) PASS: lldb-api :: functionalities/data-formatter/data-formatter-stl/libcxx/atomic/TestLibCxxAtomic.py (2115 of 2288) UNSUPPORTED: lldb-api :: commands/expression/completion-crash-invalid-iterator/TestInvalidIteratorCompletionCrash.py (2116 of 2288) PASS: lldb-api :: commands/expression/two-files/TestObjCTypeQueryFromOtherCompileUnit.py (2117 of 2288) PASS: lldb-api :: functionalities/postmortem/elf-core/gcore/TestGCore.py (2118 of 2288) PASS: lldb-unit :: Utility/./UtilityTests/StringExtractorTest.InitMisc (2119 of 2288) PASS: lldb-unit :: Process/gdb-remote/./ProcessGdbRemoteTests/GDBRemoteClientBaseTest.SendContinueAndAsyncSignal (2120 of 2288) PASS: lldb-unit :: Utility/./UtilityTests/ScalarTest.LongLongAssigmentOperator (2121 of 2288) PASS: lldb-api :: lang/cpp/global_operators/TestCppGlobalOperators.py (2122 of 2288) PASS: lldb-api :: lang/cpp/symbols/TestSymbols.py (2123 of 2288) PASS: lldb-shell :: Settings/TestFrameFormatNoColor.test (2124 of 2288) PASS: lldb-api :: python_api/function_symbol/TestSymbolAPI.py (2125 of 2288) PASS: lldb-api :: functionalities/gdb_remote_client/TestMultiprocess.py (2126 of 2288) PASS: lldb-unit :: Utility/./UtilityTests/ProcessInstanceInfo.DumpTable (2127 of 2288) PASS: lldb-unit :: Utility/./UtilityTests/Flags.AllSet (2128 of 2288) UNSUPPORTED: lldb-api :: functionalities/darwin_log/filter/exact_match/message/TestDarwinLogFilterMatchMessage.py (2129 of 2288) PASS: lldb-api :: lang/cpp/frame-var-anon-unions/TestFrameVariableAnonymousUnions.py (2130 of 2288) PASS: lldb-unit :: Process/minidump/./LLDBMinidumpTests/MinidumpParserTest.GetMiscInfo_no_stream (2131 of 2288) PASS: lldb-unit :: UnwindAssembly/x86/./UnwindAssemblyx86Tests/Testx86AssemblyInspectionEngine.TestPush0 (2132 of 2288) PASS: lldb-shell :: ObjectFile/ELF/PT_LOAD.yaml (2133 of 2288) PASS: lldb-api :: functionalities/breakpoint/dummy_target_breakpoints/TestBreakpointsWithNoTargets.py (2134 of 2288) UNSUPPORTED: lldb-shell :: Expr/TestIRMemoryMapWindows.test (2135 of 2288) PASS: lldb-unit :: ScriptInterpreter/Python/./ScriptInterpreterPythonTests/PythonDataObjectsTest.TestRun (2136 of 2288) PASS: lldb-api :: macosx/order/TestOrderFile.py (2137 of 2288) PASS: lldb-unit :: Utility/./UtilityTests/RangeTest.Constructor (2138 of 2288) PASS: lldb-api :: sample_test/TestSampleInlineTest.py (2139 of 2288) PASS: lldb-shell :: ObjectFile/MachO/lc_build_version.yaml (2140 of 2288) PASS: lldb-api :: functionalities/breakpoint/breakpoint_options/TestBreakpointOptions.py (2141 of 2288) PASS: lldb-api :: commands/expression/radar_9531204/TestPrintfAfterUp.py (2142 of 2288) PASS: lldb-unit :: Utility/./UtilityTests/UriParserTest.SchemeHostSeparator3 (2143 of 2288) PASS: lldb-api :: types/TestFloatTypes.py (2144 of 2288) PASS: lldb-unit :: Utility/./UtilityTests/ArgsTest.TestUnknownEscape (2145 of 2288) PASS: lldb-unit :: Interpreter/./InterpreterTests/OptionArgParserTest.toBoolean (2146 of 2288) PASS: lldb-unit :: Utility/./UtilityTests/ScalarTest.ComparisonFloat (2147 of 2288) PASS: lldb-unit :: Utility/./UtilityTests/ArgsTest.TestOverwriteArgs (2148 of 2288) PASS: lldb-api :: commands/watchpoints/step_over_watchpoint/TestStepOverWatchpoint.py (2149 of 2288) PASS: lldb-unit :: Host/./HostTests/ConnectionFileDescriptorTest.TCPGetURIv6 (2150 of 2288) PASS: lldb-unit :: Process/minidump/./LLDBMinidumpTests/MinidumpParserTest.GetThreadContext_x86_32 (2151 of 2288) PASS: lldb-api :: commands/watchpoints/watchpoint_commands/condition/TestWatchpointConditionCmd.py (2152 of 2288) PASS: lldb-unit :: Utility/./UtilityTests/StringListTest.JoinNonSpace (2153 of 2288) PASS: lldb-api :: python_api/lldbutil/process/TestPrintStackTraces.py (2154 of 2288) PASS: lldb-unit :: Utility/./UtilityTests/StringExtractorTest.GetHexBytes_Partial (2155 of 2288) PASS: lldb-unit :: Utility/./UtilityTests/OptionsWithRawTest.ArgsButNoDelimiter (2156 of 2288) PASS: lldb-api :: lang/objc/modules-incomplete/TestIncompleteModules.py (2157 of 2288) PASS: lldb-api :: lang/objc/foundation/TestObjectDescriptionAPI.py (2158 of 2288) PASS: lldb-api :: functionalities/data-formatter/nsdictionarysynth/TestNSDictionarySynthetic.py (2159 of 2288) PASS: lldb-unit :: Utility/./UtilityTests/VMRange.ContainsRange (2160 of 2288) PASS: lldb-unit :: Utility/./UtilityTests/ArchSpecTest.MergeFrom (2161 of 2288) PASS: lldb-unit :: Expression/./ExpressionTests/DiagnosticManagerTest.GetStringBasic (2162 of 2288) PASS: lldb-api :: functionalities/data-formatter/user-format-vs-summary/TestUserFormatVsSummary.py (2163 of 2288) PASS: lldb-api :: functionalities/tail_call_frames/inlining_and_tail_calls/TestInliningAndTailCalls.py (2164 of 2288) PASS: lldb-unit :: Core/./LLDBCoreTests/ModuleSpecTest.TestMachOFile (2165 of 2288) UNSUPPORTED: lldb-api :: functionalities/tsan/multiple/TestTsanMultiple.py (2166 of 2288) UNSUPPORTED: lldb-shell :: ScriptInterpreter/Lua/breakpoint_callback.test (2167 of 2288) PASS: lldb-shell :: SymbolFile/NativePDB/break-by-function.cpp (2168 of 2288) UNSUPPORTED: lldb-shell :: ScriptInterpreter/Lua/persistent_state.test (2169 of 2288) PASS: lldb-shell :: Commands/command-regex-delete.test (2170 of 2288) PASS: lldb-shell :: SymbolFile/DWARF/x86/debug-names-compressed.cpp (2171 of 2288) PASS: lldb-api :: lang/objc/forward-decl/TestForwardDecl.py (2172 of 2288) PASS: lldb-shell :: Reproducer/Functionalities/TestDataFormatter.test (2173 of 2288) PASS: lldb-unit :: Thread/./ThreadTests/ThreadTest.SetStopInfo (2174 of 2288) PASS: lldb-shell :: SymbolFile/Breakpad/line-table-missing-file.test (2175 of 2288) PASS: lldb-unit :: Utility/./UtilityTests/ScalarTest.CastOperations (2176 of 2288) PASS: lldb-shell :: SymbolFile/NativePDB/ast-functions.cpp (2177 of 2288) PASS: lldb-unit :: UnwindAssembly/x86/./UnwindAssemblyx86Tests/Testx86AssemblyInspectionEngine.TestStackRealign32BitDisp_x86_64 (2178 of 2288) PASS: lldb-api :: commands/expression/vector_of_enums/TestVectorOfEnums.py (2179 of 2288) PASS: lldb-unit :: Target/./TargetTests/StackFrameRecognizerTest.NullModuleRegex (2180 of 2288) PASS: lldb-unit :: Utility/./UtilityTests/RangeTest.Equal (2181 of 2288) PASS: lldb-unit :: Utility/./UtilityTests/ArgsTest.AppendArguments (2182 of 2288) PASS: lldb-api :: commands/watchpoints/multiple_hits/TestMultipleHits.py (2183 of 2288) PASS: lldb-unit :: ScriptInterpreter/Python/./ScriptInterpreterPythonTests/PythonDataObjectsTest.TestInstanceNameResolutionNoDot (2184 of 2288) PASS: lldb-api :: lang/cpp/enum_types/TestCPP11EnumTypes.py (2185 of 2288) PASS: lldb-api :: commands/process/attach/TestProcessAttach.py (2186 of 2288) PASS: lldb-api :: functionalities/data-formatter/data-formatter-stl/libcxx/initializerlist/TestInitializerList.py (2187 of 2288) PASS: lldb-unit :: Utility/./UtilityTests/StringListTest.CopyListSingle (2188 of 2288) PASS: lldb-api :: functionalities/plugins/python_os_plugin/stepping_plugin_threads/TestOSPluginStepping.py (2189 of 2288) PASS: lldb-unit :: Utility/./UtilityTests/RangeTest.ContainsRange (2190 of 2288) PASS: lldb-unit :: Utility/./UtilityTests/StringListTest.GetSize (2191 of 2288) PASS: lldb-shell :: ObjectFile/ELF/riscv-arch.yaml (2192 of 2288) UNSUPPORTED: lldb-api :: functionalities/darwin_log/filter/regex/category/TestDarwinLogFilterRegexCategory.py (2193 of 2288) PASS: lldb-api :: commands/watchpoints/watchpoint_size/TestWatchpointSizes.py (2194 of 2288) PASS: lldb-unit :: Utility/./UtilityTests/StreamTest.PutBytesAsRawHex8ToBigEndian (2195 of 2288) PASS: lldb-shell :: ScriptInterpreter/Python/python.test (2196 of 2288) PASS: lldb-unit :: Host/./HostTests/SocketTests/SocketTest.TCPGetConnectURI/ipv4 (2197 of 2288) PASS: lldb-unit :: SymbolFile/NativePDB/./SymbolFileNativePDBTests/PDBFPOProgramToDWARFExpressionTests.SingleAssignmentRegisterRef (2198 of 2288) PASS: lldb-api :: functionalities/paths/TestPaths.py (2199 of 2288) PASS: lldb-unit :: Utility/./UtilityTests/ListenerTest.GetEventImmediate (2200 of 2288) UNSUPPORTED: lldb-api :: commands/platform/connect/TestPlatformConnect.py (2201 of 2288) PASS: lldb-api :: commands/expression/error-limit/TestExprErrorLimit.py (2202 of 2288) PASS: lldb-unit :: Utility/./UtilityTests/ScalarTest.Equality (2203 of 2288) PASS: lldb-unit :: Utility/./UtilityTests/StringListTest.InsertStringAtIndexOutOfBounds (2204 of 2288) UNSUPPORTED: lldb-shell :: ExecControl/StopHook/stop-hook-threads.test (2205 of 2288) PASS: lldb-api :: functionalities/thread/crash_during_step/TestCrashDuringStep.py (2206 of 2288) PASS: lldb-api :: functionalities/breakpoint/breakpoint_conditions/TestBreakpointConditions.py (2207 of 2288) PASS: lldb-unit :: Host/./HostTests/SocketAddressTest.Set (2208 of 2288) PASS: lldb-api :: commands/expression/import-std-module/vector/TestVectorFromStdModule.py (2209 of 2288) PASS: lldb-api :: commands/platform/process/list/TestProcessList.py (2210 of 2288) PASS: lldb-api :: python_api/symbol-context/TestSymbolContext.py (2211 of 2288) PASS: lldb-api :: functionalities/data-formatter/data-formatter-stl/libstdcpp/unique_ptr/invalid/TestDataFormatterInvalidStdUniquePtr.py (2212 of 2288) PASS: lldb-unit :: Language/Highlighting/./HighlighterTests/HighlighterTest.ClangComments (2213 of 2288) PASS: lldb-api :: functionalities/type_completion/TestTypeCompletion.py (2214 of 2288) PASS: lldb-shell :: Process/TestEnvironment.test (2215 of 2288) PASS: lldb-api :: functionalities/memory/read/TestMemoryRead.py (2216 of 2288) PASS: lldb-shell :: SymbolFile/Breakpad/symtab.test (2217 of 2288) PASS: lldb-shell :: Commands/command-breakpoint-col.test (2218 of 2288) PASS: lldb-shell :: SymbolFile/DWARF/x86/find-basic-function.cpp (2219 of 2288) PASS: lldb-shell :: Breakpoint/debug_rnglist_basic.test (2220 of 2288) PASS: lldb-unit :: Utility/./UtilityTests/FileSpecTest.GetPath (2221 of 2288) PASS: lldb-unit :: Utility/./UtilityTests/StringExtractorTest.GetHexBytes_Underflow (2222 of 2288) PASS: lldb-api :: functionalities/archives/TestBSDArchives.py (2223 of 2288) PASS: lldb-unit :: Process/gdb-remote/./ProcessGdbRemoteTests/PortMapTest.FreePortForProcess (2224 of 2288) PASS: lldb-unit :: Process/Utility/./ProcessUtilityTests/ProcSMapTests/LinuxProcSMapsTestFixture.ParseSMapRegions/5 (2225 of 2288) PASS: lldb-unit :: Utility/./UtilityTests/OptionsWithRawTest.EmptySuffixSingleWhitespace (2226 of 2288) PASS: lldb-shell :: ObjectFile/Breakpad/discontiguous-sections.test (2227 of 2288) PASS: lldb-shell :: Quit/TestQuitExitCodeTooManyArgs.test (2228 of 2288) PASS: lldb-api :: functionalities/postmortem/minidump-new/TestMiniDumpUUID.py (2229 of 2288) PASS: lldb-api :: commands/expression/import-std-module/conflicts/TestStdModuleWithConflicts.py (2230 of 2288) PASS: lldb-api :: commands/expression/import-std-module/no-std-module/TestMissingStdModule.py (2231 of 2288) PASS: lldb-unit :: Core/./LLDBCoreTests/MangledTest.NameIndexes_FindFunctionSymbols (2232 of 2288) PASS: lldb-unit :: UnwindAssembly/x86/./UnwindAssemblyx86Tests/Testx86AssemblyInspectionEngine.TestStackRealign8BitDisp_i386 (2233 of 2288) PASS: lldb-api :: commands/watchpoints/watchpoint_commands/command/TestWatchpointCommandLLDB.py (2234 of 2288) PASS: lldb-api :: functionalities/data-formatter/data-formatter-stl/libcxx/function/TestLibCxxFunction.py (2235 of 2288) PASS: lldb-unit :: Utility/./UtilityTests/ArchSpecTest.OperatorBool (2236 of 2288) PASS: lldb-unit :: UnwindAssembly/x86/./UnwindAssemblyx86Tests/Testx86AssemblyInspectionEngine.TestPushImm (2237 of 2288) PASS: lldb-api :: python_api/value/TestValueAPI.py (2238 of 2288) PASS: lldb-unit :: Target/./TargetTests/PathMappingListTest.RemapRoot (2239 of 2288) PASS: lldb-api :: lang/c/struct_types/TestStructTypes.py (2240 of 2288) PASS: lldb-shell :: BuildScript/modes.test (2241 of 2288) PASS: lldb-api :: functionalities/tail_call_frames/disambiguate_paths_to_common_sink/TestDisambiguatePathsToCommonSink.py (2242 of 2288) PASS: lldb-unit :: Utility/./UtilityTests/DataExtractorTest.GetMaxU64_unchecked (2243 of 2288) XFAIL: lldb-shell :: Register/x86-64-write.test (2244 of 2288) PASS: lldb-unit :: Utility/./UtilityTests/ReproducerTest.SetCapture (2245 of 2288) PASS: lldb-unit :: Host/./HostTests/NativeProcessProtocolTest.ReadCStringFromMemory_CrossPageBoundary (2246 of 2288) PASS: lldb-unit :: Utility/./UtilityTests/Flags.Reset (2247 of 2288) PASS: lldb-unit :: Core/./LLDBCoreTests/RichManglingContextTest.FromCxxMethodName (2248 of 2288) PASS: lldb-unit :: SymbolFile/DWARF/./SymbolFileDWARFTests/SymbolFileDWARFTests.ParseArangesIgnoreEmpty (2249 of 2288) UNSUPPORTED: lldb-shell :: Register/x86-64-ymm16-read.test (2250 of 2288) UNSUPPORTED: lldb-shell :: SymbolFile/PDB/class-layout.test (2251 of 2288) PASS: lldb-api :: macosx/macCatalyst/TestMacCatalyst.py (2252 of 2288) PASS: lldb-unit :: Interpreter/./InterpreterTests/OptionArgParserTest.toChar (2253 of 2288) PASS: lldb-unit :: Utility/./UtilityTests/ScalarTest.APIntConstructor (2254 of 2288) PASS: lldb-unit :: ScriptInterpreter/Python/./ScriptInterpreterPythonTests/PythonDataObjectsTest.TestPythonIntegerToStr (2255 of 2288) PASS: lldb-api :: lang/cpp/member-and-local-vars-with-same-name/TestMembersAndLocalsWithSameName.py (2256 of 2288) PASS: lldb-api :: commands/expression/import-std-module/basic/TestImportStdModule.py (2257 of 2288) PASS: lldb-api :: functionalities/memory/find/TestMemoryFind.py (2258 of 2288) PASS: lldb-unit :: Utility/./UtilityTests/AnsiTerminal.KnownPrefix (2259 of 2288) PASS: lldb-unit :: Utility/./UtilityTests/RegularExpression.Valid (2260 of 2288) PASS: lldb-unit :: Host/./HostTests/FileSystemTest.Readable (2261 of 2288) PASS: lldb-unit :: Utility/./UtilityTests/SubsystemRAIITest.SubsystemWithErrorSuccess (2262 of 2288) PASS: lldb-api :: functionalities/thread/concurrent_events/TestConcurrentDelaySignalWatch.py (2263 of 2288) PASS: lldb-api :: functionalities/data-formatter/setvaluefromcstring/TestSetValueFromCString.py (2264 of 2288) PASS: lldb-unit :: Utility/./UtilityTests/OptionsWithRawTest.EmptyArgsOnlySuffix (2265 of 2288) PASS: lldb-unit :: Process/minidump/./LLDBMinidumpTests/MinidumpParserTest.MinidumpDuplicateModuleSeparateCode (2266 of 2288) PASS: lldb-api :: lang/objc/foundation/TestObjCMethodsNSError.py (2267 of 2288) PASS: lldb-api :: commands/settings/TestSettings.py (2268 of 2288) UNSUPPORTED: lldb-api :: functionalities/darwin_log/source/info/TestDarwinLogSourceInfo.py (2269 of 2288) UNSUPPORTED: lldb-api :: tools/lldb-server/registers-target-xml-reading/TestGdbRemoteTargetXmlPacket.py (2270 of 2288) PASS: lldb-shell :: SymbolFile/DWARF/x86/DW_TAG_variable-DW_AT_const_value.s (2271 of 2288) PASS: lldb-api :: functionalities/jitloader_gdb/TestJITLoaderGDB.py (2272 of 2288) PASS: lldb-api :: lang/cpp/wchar_t/TestCxxWCharT.py (2273 of 2288) PASS: lldb-unit :: Utility/./UtilityTests/FileSpecTest.CopyByAppendingPathComponent (2274 of 2288) PASS: lldb-api :: lang/c/step-target/TestStepTarget.py (2275 of 2288) PASS: lldb-unit :: SymbolFile/DWARF/./SymbolFileDWARFTests/SymbolFileDWARFTests.ParseArangesNonzeroSegmentSize (2276 of 2288) PASS: lldb-api :: functionalities/breakpoint/breakpoint_command/TestRegexpBreakCommand.py (2277 of 2288) PASS: lldb-unit :: Process/minidump/./LLDBMinidumpTests/MinidumpParserTest.MinidumpDuplicateModuleMappedSecondHigh (2278 of 2288) PASS: lldb-unit :: Process/minidump/./LLDBMinidumpTests/MinidumpParserTest.GetMiscInfoWindows (2279 of 2288) PASS: lldb-unit :: Utility/./UtilityTests/BinaryStreamTest.PutSLEB128EightBytes (2280 of 2288) PASS: lldb-unit :: Language/Highlighting/./HighlighterTests/HighlighterTest.ClangUnterminatedString (2281 of 2288) PASS: lldb-api :: lang/objc/hidden-ivars/TestHiddenIvars.py (2282 of 2288) PASS: lldb-shell :: ObjectFile/ELF/minidebuginfo-find-symbols.yaml (2283 of 2288) PASS: lldb-unit :: Language/Highlighting/./HighlighterTests/HighlighterTest.ClangCursorPosInOtherToken (2284 of 2288) PASS: lldb-unit :: Expression/./ExpressionTests/CppModuleConfigurationTest.UnknownLibCppFile (2285 of 2288) PASS: lldb-api :: functionalities/value_md5_crash/TestValueMD5Crash.py (2286 of 2288) PASS: lldb-api :: functionalities/thread/step_out/TestThreadStepOut.py (2287 of 2288) PASS: lldb-api :: functionalities/return-value/TestReturnValue.py (2288 of 2288) Slowest Tests: -------------------------------------------------------------------------- 1200.03s: lldb-api :: tools/lldb-server/vCont-threads/TestGdbRemote_vContThreads.py 406.59s: lldb-api :: tools/lldb-server/TestLldbGdbServer.py 282.55s: lldb-api :: api/multithreaded/TestMultithreaded.py 137.62s: lldb-api :: functionalities/completion/TestCompletion.py 126.78s: lldb-api :: lang/objc/hidden-ivars/TestHiddenIvars.py 125.43s: lldb-api :: lang/objc/exceptions/TestObjCExceptions.py 121.61s: lldb-api :: lang/objc/foundation/TestObjCMethods.py 116.32s: lldb-api :: lang/objc/objc-new-syntax/TestObjCNewSyntaxLiteral.py 111.45s: lldb-api :: types/TestLongTypes.py 110.19s: lldb-api :: lang/cpp/namespace/TestNamespaceLookup.py 108.44s: lldb-api :: types/TestLongTypesExpr.py 107.67s: lldb-api :: lang/objc/real-definition/TestRealDefinition.py 93.72s: lldb-api :: commands/expression/import-std-module/queue/TestQueueFromStdModule.py 92.80s: lldb-api :: commands/expression/import-std-module/stack/TestStackFromStdModule.py 91.65s: lldb-api :: functionalities/gdb_remote_client/TestWasm.py 89.64s: lldb-api :: lang/objc/objc-new-syntax/TestObjCNewSyntaxArray.py 88.57s: lldb-api :: lang/objc/objc-new-syntax/TestObjCNewSyntaxDictionary.py 84.38s: lldb-api :: python_api/exprpath_synthetic/TestExprPathSynthetic.py 83.02s: lldb-api :: commands/settings/TestSettings.py 82.81s: lldb-api :: functionalities/data-formatter/data-formatter-objc/TestDataFormatterObjCNSContainer.py

Hide Details

Tests Times: -------------------------------------------------------------------------- [ Range ] :: [ Percentage ] :: [ Count ] -------------------------------------------------------------------------- [1200s,1300s) :: [ ] :: [ 1/2288] [1100s,1200s) :: [ ] :: [ 0/2288] [1000s,1100s) :: [ ] :: [ 0/2288] [ 900s,1000s) :: [ ] :: [ 0/2288] [ 800s, 900s) :: [ ] :: [ 0/2288] [ 700s, 800s) :: [ ] :: [ 0/2288] [ 600s, 700s) :: [ ] :: [ 0/2288] [ 500s, 600s) :: [ ] :: [ 0/2288] [ 400s, 500s) :: [ ] :: [ 1/2288] [ 300s, 400s) :: [ ] :: [ 1/2288] [ 200s, 300s) :: [ ] :: [ 0/2288] [ 100s, 200s) :: [ ] :: [ 11/2288] [ 0s, 100s) :: [*************************************** ] :: [2274/2288] -------------------------------------------------------------------------- ******************** Timed Out Tests (1): lldb-api :: tools/lldb-server/vCont-threads/TestGdbRemote_vContThreads.py

Hide Details

Hide Details

Testing Time: 4150.41s Unsupported : 206 Passed : 2071 Expectedly Failed: 10 Timed Out : 1 FAILED: tools/lldb/test/CMakeFiles/check-lldb cd /Users/buildslave/jenkins/workspace/lldb-cmake-sanitized/lldb-build/tools/lldb/test && /usr/local/Frameworks/Python.framework/Versions/3.7/bin/python3.7 /Users/buildslave/jenkins/workspace/lldb-cmake-sanitized/lldb-build/./bin/llvm-lit -v --time-tests --shuffle --xunit-xml-output=/Users/buildslave/jenkins/workspace/lldb-cmake-sanitized/test/results.xml -v -j 4 --timeout 1200 /Users/buildslave/jenkins/workspace/lldb-cmake-sanitized/lldb-build/tools/lldb/test ninja: build stopped: subcommand failed. Command failed: Command '['/usr/bin/env', 'TERM=vt100', '/usr/local/bin/ninja', '-v', 'check-lldb']' returned non-zero exit status 1. Command: ['/usr/bin/env', 'TERM=vt100', '/usr/local/bin/ninja', '-v', 'check-lldb'] [Pipeline] } [Pipeline] // timeout [Pipeline] } [Pipeline] // stage [Pipeline] stage [Pipeline] { (Declarative: Post Actions) [Pipeline] scanForIssues [Clang (LLVM based)] Sleeping for 5 seconds due to JENKINS-32191... [Clang (LLVM based)] Parsing console log (workspace: '/Users/buildslave/jenkins/workspace/lldb-cmake-sanitized') [Clang (LLVM based)] Successfully parsed console log [Clang (LLVM based)] -> found 2 issues (skipped 0 duplicates) [Clang (LLVM based)] Post processing issues on 'green-dragon-23' with source code encoding 'UTF-8' [Clang (LLVM based)] Creating SCM blamer to obtain author and commit information for affected files [Clang (LLVM based)] -> No blamer installed yet. You need to install the 'git-forensics' plugin to enable blaming for Git. [Clang (LLVM based)] Resolving file names for all issues in source directory '/Users/buildslave/jenkins/workspace/lldb-cmake-sanitized' [Clang (LLVM based)] -> resolved paths in source directory (1 found, 0 not found) [Clang (LLVM based)] Resolving module names from module definitions (build.xml, pom.xml, or Manifest.mf files) [Clang (LLVM based)] -> resolved module names for 2 issues [Clang (LLVM based)] Resolving package names (or namespaces) by parsing the affected files [Clang (LLVM based)] -> resolved package names of 1 affected files [Clang (LLVM based)] No filter has been set, publishing all 2 issues [Clang (LLVM based)] Creating fingerprints for all affected code blocks to track issues over different builds [Clang (LLVM based)] -> created fingerprints for 2 issues (skipped 0 issues) [Clang (LLVM based)] Copying affected files to Jenkins' build folder '/Users/Shared/Jenkins/Home/jobs/lldb-cmake-sanitized/builds/1825/files-with-issues' [Clang (LLVM based)] -> 1 copied, 0 not in workspace, 0 not-found, 0 with I/O error [Clang (LLVM based)] Repository miner is not configured, skipping repository mining [Pipeline] junit Recording test results [Checks API] No suitable checks publisher found. [Pipeline] } [Pipeline] // stage [Pipeline] } [Pipeline] // withEnv [Pipeline] } [Pipeline] // node [Pipeline] End of Pipeline ERROR: script returned exit code 1 Finished: FAILURE