Started 3 days 17 hr ago
Took 4 hr 13 min

Failed Build clang-d391013-gf583029da3d6-t21625-b21625.tar.gz (Jun 14, 2021 3:07:26 AM)

Issues

Found 2 issues:
Ninja target: 2mm.c.o
[4318/7685] /Users/buildslave/jenkins/workspace/test-suite-verify-machineinstrs-x86_64-O3/test-suite-build/tools/timeit --summary SingleSource/Benchmarks/Misc-C++/Large/CMakeFiles/ray.dir/ray.cpp.o.time /Users/buildslave/jenkins/workspace/test-suite-verify-machineinstrs-x86_64-O3/compiler/bin/clang++  -DNDEBUG  -B /Applications/Xcode.app/Contents/Developer/Toolchains/XcodeDefault.xctoolchain/usr/bin    -Wno-unused-command-line-argument -mllvm -verify-machineinstrs -O3 -arch x86_64 -isysroot /Applications/Xcode.app/Contents/Developer/Platforms/MacOSX.platform/Developer/SDKs/MacOSX10.15.sdk   -w -Werror=date-time -ffp-contract=off -DFMA_DISABLED=1 -ffp-contract=off -DFMA_DISABLED=1 -MD -MT SingleSource/Benchmarks/Misc-C++/Large/CMakeFiles/ray.dir/ray.cpp.o -MF SingleSource/Benchmarks/Misc-C++/Large/CMakeFiles/ray.dir/ray.cpp.o.d -o SingleSource/Benchmarks/Misc-C++/Large/CMakeFiles/ray.dir/ray.cpp.o -c /Users/buildslave/jenkins/workspace/test-suite-verify-machineinstrs-x86_64-O3/test-suite/SingleSource/Benchmarks/Misc-C++/Large/ray.cpp
[4319/7685] /Users/buildslave/jenkins/workspace/test-suite-verify-machineinstrs-x86_64-O3/test-suite-build/tools/timeit --summary SingleSource/Benchmarks/Polybench/datamining/correlation/CMakeFiles/correlation.dir/correlation.c.o.time /Users/buildslave/jenkins/workspace/test-suite-verify-machineinstrs-x86_64-O3/compiler/bin/clang -DFP_ABSTOLERANCE=1e-5 -DNDEBUG  -B /Applications/Xcode.app/Contents/Developer/Toolchains/XcodeDefault.xctoolchain/usr/bin    -Wno-unused-command-line-argument -mllvm -verify-machineinstrs -O3 -arch x86_64 -isysroot /Applications/Xcode.app/Contents/Developer/Platforms/MacOSX.platform/Developer/SDKs/MacOSX10.15.sdk   -w -Werror=date-time -I /Users/buildslave/jenkins/workspace/test-suite-verify-machineinstrs-x86_64-O3/test-suite/SingleSource/Benchmarks/Polybench/utilities -DPOLYBENCH_DUMP_ARRAYS -ffp-contract=off -DFMA_DISABLED=1 -ffp-contract=off -DFMA_DISABLED=1 -MD -MT SingleSource/Benchmarks/Polybench/datamining/correlation/CMakeFiles/correlation.dir/correlation.c.o -MF SingleSource/Benchmarks/Polybench/datamining/correlation/CMakeFiles/correlation.dir/correlation.c.o.d -o SingleSource/Benchmarks/Polybench/datamining/correlation/CMakeFiles/correlation.dir/correlation.c.o   -c /Users/buildslave/jenkins/workspace/test-suite-verify-machineinstrs-x86_64-O3/test-suite/SingleSource/Benchmarks/Polybench/datamining/correlation/correlation.c
[4320/7685] : && /Users/buildslave/jenkins/workspace/test-suite-verify-machineinstrs-x86_64-O3/test-suite-build/tools/timeit --summary SingleSource/Benchmarks/Misc-C++/Large/ray.link.time /Users/buildslave/jenkins/workspace/test-suite-verify-machineinstrs-x86_64-O3/compiler/bin/clang++  -B /Applications/Xcode.app/Contents/Developer/Toolchains/XcodeDefault.xctoolchain/usr/bin    -Wno-unused-command-line-argument -mllvm -verify-machineinstrs -O3 -arch x86_64 -isysroot /Applications/Xcode.app/Contents/Developer/Platforms/MacOSX.platform/Developer/SDKs/MacOSX10.15.sdk -Wl,-search_paths_first -Wl,-headerpad_max_install_names -B /Applications/Xcode.app/Contents/Developer/Toolchains/XcodeDefault.xctoolchain/usr/bin SingleSource/Benchmarks/Misc-C++/Large/CMakeFiles/ray.dir/ray.cpp.o  -o SingleSource/Benchmarks/Misc-C++/Large/ray  -Wl,-no_pie -lm && cd /Users/buildslave/jenkins/workspace/test-suite-verify-machineinstrs-x86_64-O3/test-suite-build/SingleSource/Benchmarks/Misc-C++/Large && /usr/local/Cellar/cmake/3.17.2/bin/cmake -E create_symlink /Users/buildslave/jenkins/workspace/test-suite-verify-machineinstrs-x86_64-O3/test-suite/SingleSource/Benchmarks/Misc-C++/Large/ray.reference_output /Users/buildslave/jenkins/workspace/test-suite-verify-machineinstrs-x86_64-O3/test-suite-build/SingleSource/Benchmarks/Misc-C++/Large/ray.reference_output
[4321/7685] : && /Users/buildslave/jenkins/workspace/test-suite-verify-machineinstrs-x86_64-O3/test-suite-build/tools/timeit --summary SingleSource/Benchmarks/Polybench/datamining/correlation/correlation.link.time /Users/buildslave/jenkins/workspace/test-suite-verify-machineinstrs-x86_64-O3/compiler/bin/clang -B /Applications/Xcode.app/Contents/Developer/Toolchains/XcodeDefault.xctoolchain/usr/bin    -Wno-unused-command-line-argument -mllvm -verify-machineinstrs -O3 -arch x86_64 -isysroot /Applications/Xcode.app/Contents/Developer/Platforms/MacOSX.platform/Developer/SDKs/MacOSX10.15.sdk -Wl,-search_paths_first -Wl,-headerpad_max_install_names -B /Applications/Xcode.app/Contents/Developer/Toolchains/XcodeDefault.xctoolchain/usr/bin SingleSource/Benchmarks/Polybench/datamining/correlation/CMakeFiles/correlation.dir/correlation.c.o  -o SingleSource/Benchmarks/Polybench/datamining/correlation/correlation  -Wl,-no_pie -lm && cd /Users/buildslave/jenkins/workspace/test-suite-verify-machineinstrs-x86_64-O3/test-suite-build/SingleSource/Benchmarks/Polybench/datamining/correlation && /usr/local/Cellar/cmake/3.17.2/bin/cmake -E create_symlink /Users/buildslave/jenkins/workspace/test-suite-verify-machineinstrs-x86_64-O3/test-suite/SingleSource/Benchmarks/Polybench/datamining/correlation/correlation.reference_output /Users/buildslave/jenkins/workspace/test-suite-verify-machineinstrs-x86_64-O3/test-suite-build/SingleSource/Benchmarks/Polybench/datamining/correlation/correlation.reference_output
[4322/7685] /Users/buildslave/jenkins/workspace/test-suite-verify-machineinstrs-x86_64-O3/test-suite-build/tools/timeit --summary SingleSource/Benchmarks/Polybench/linear-algebra/kernels/2mm/CMakeFiles/2mm.dir/2mm.c.o.time /Users/buildslave/jenkins/workspace/test-suite-verify-machineinstrs-x86_64-O3/compiler/bin/clang -DFP_ABSTOLERANCE=1e-5 -DNDEBUG  -B /Applications/Xcode.app/Contents/Developer/Toolchains/XcodeDefault.xctoolchain/usr/bin    -Wno-unused-command-line-argument -mllvm -verify-machineinstrs -O3 -arch x86_64 -isysroot /Applications/Xcode.app/Contents/Developer/Platforms/MacOSX.platform/Developer/SDKs/MacOSX10.15.sdk   -w -Werror=date-time -I /Users/buildslave/jenkins/workspace/test-suite-verify-machineinstrs-x86_64-O3/test-suite/SingleSource/Benchmarks/Polybench/utilities -DPOLYBENCH_DUMP_ARRAYS -ffp-contract=off -DFMA_DISABLED=1 -ffp-contract=off -DFMA_DISABLED=1 -MD -MT SingleSource/Benchmarks/Polybench/linear-algebra/kernels/2mm/CMakeFiles/2mm.dir/2mm.c.o -MF SingleSource/Benchmarks/Polybench/linear-algebra/kernels/2mm/CMakeFiles/2mm.dir/2mm.c.o.d -o SingleSource/Benchmarks/Polybench/linear-algebra/kernels/2mm/CMakeFiles/2mm.dir/2mm.c.o   -c /Users/buildslave/jenkins/workspace/test-suite-verify-machineinstrs-x86_64-O3/test-suite/SingleSource/Benchmarks/Polybench/linear-algebra/kernels/2mm/2mm.c
FAILED: SingleSource/Benchmarks/Polybench/linear-algebra/kernels/2mm/CMakeFiles/2mm.dir/2mm.c.o 
/Users/buildslave/jenkins/workspace/test-suite-verify-machineinstrs-x86_64-O3/test-suite-build/tools/timeit --summary SingleSource/Benchmarks/Polybench/linear-algebra/kernels/2mm/CMakeFiles/2mm.dir/2mm.c.o.time /Users/buildslave/jenkins/workspace/test-suite-verify-machineinstrs-x86_64-O3/compiler/bin/clang -DFP_ABSTOLERANCE=1e-5 -DNDEBUG  -B /Applications/Xcode.app/Contents/Developer/Toolchains/XcodeDefault.xctoolchain/usr/bin    -Wno-unused-command-line-argument -mllvm -verify-machineinstrs -O3 -arch x86_64 -isysroot /Applications/Xcode.app/Contents/Developer/Platforms/MacOSX.platform/Developer/SDKs/MacOSX10.15.sdk   -w -Werror=date-time -I /Users/buildslave/jenkins/workspace/test-suite-verify-machineinstrs-x86_64-O3/test-suite/SingleSource/Benchmarks/Polybench/utilities -DPOLYBENCH_DUMP_ARRAYS -ffp-contract=off -DFMA_DISABLED=1 -ffp-contract=off -DFMA_DISABLED=1 -MD -MT SingleSource/Benchmarks/Polybench/linear-algebra/kernels/2mm/CMakeFiles/2mm.dir/2mm.c.o -MF SingleSource/Benchmarks/Polybench/linear-algebra/kernels/2mm/CMakeFiles/2mm.dir/2mm.c.o.d -o SingleSource/Benchmarks/Polybench/linear-algebra/kernels/2mm/CMakeFiles/2mm.dir/2mm.c.o   -c /Users/buildslave/jenkins/workspace/test-suite-verify-machineinstrs-x86_64-O3/test-suite/SingleSource/Benchmarks/Polybench/linear-algebra/kernels/2mm/2mm.c
/Users/buildslave/jenkins/workspace/test-suite-verify-machineinstrs-x86_64-O3/test-suite/SingleSource/Benchmarks/Polybench/linear-algebra/kernels/2mm/2mm.c:195:31: error: use of undeclared identifier 'D_StrictFP'
2mm.c error: use of undeclared identifier 'D_StrictFP'
[4320/7685] : && /Users/buildslave/jenkins/workspace/test-suite-verify-machineinstrs-x86_64-O3/test-suite-build/tools/timeit --summary SingleSource/Benchmarks/Misc-C++/Large/ray.link.time /Users/buildslave/jenkins/workspace/test-suite-verify-machineinstrs-x86_64-O3/compiler/bin/clang++  -B /Applications/Xcode.app/Contents/Developer/Toolchains/XcodeDefault.xctoolchain/usr/bin    -Wno-unused-command-line-argument -mllvm -verify-machineinstrs -O3 -arch x86_64 -isysroot /Applications/Xcode.app/Contents/Developer/Platforms/MacOSX.platform/Developer/SDKs/MacOSX10.15.sdk -Wl,-search_paths_first -Wl,-headerpad_max_install_names -B /Applications/Xcode.app/Contents/Developer/Toolchains/XcodeDefault.xctoolchain/usr/bin SingleSource/Benchmarks/Misc-C++/Large/CMakeFiles/ray.dir/ray.cpp.o  -o SingleSource/Benchmarks/Misc-C++/Large/ray  -Wl,-no_pie -lm && cd /Users/buildslave/jenkins/workspace/test-suite-verify-machineinstrs-x86_64-O3/test-suite-build/SingleSource/Benchmarks/Misc-C++/Large && /usr/local/Cellar/cmake/3.17.2/bin/cmake -E create_symlink /Users/buildslave/jenkins/workspace/test-suite-verify-machineinstrs-x86_64-O3/test-suite/SingleSource/Benchmarks/Misc-C++/Large/ray.reference_output /Users/buildslave/jenkins/workspace/test-suite-verify-machineinstrs-x86_64-O3/test-suite-build/SingleSource/Benchmarks/Misc-C++/Large/ray.reference_output
[4321/7685] : && /Users/buildslave/jenkins/workspace/test-suite-verify-machineinstrs-x86_64-O3/test-suite-build/tools/timeit --summary SingleSource/Benchmarks/Polybench/datamining/correlation/correlation.link.time /Users/buildslave/jenkins/workspace/test-suite-verify-machineinstrs-x86_64-O3/compiler/bin/clang -B /Applications/Xcode.app/Contents/Developer/Toolchains/XcodeDefault.xctoolchain/usr/bin    -Wno-unused-command-line-argument -mllvm -verify-machineinstrs -O3 -arch x86_64 -isysroot /Applications/Xcode.app/Contents/Developer/Platforms/MacOSX.platform/Developer/SDKs/MacOSX10.15.sdk -Wl,-search_paths_first -Wl,-headerpad_max_install_names -B /Applications/Xcode.app/Contents/Developer/Toolchains/XcodeDefault.xctoolchain/usr/bin SingleSource/Benchmarks/Polybench/datamining/correlation/CMakeFiles/correlation.dir/correlation.c.o  -o SingleSource/Benchmarks/Polybench/datamining/correlation/correlation  -Wl,-no_pie -lm && cd /Users/buildslave/jenkins/workspace/test-suite-verify-machineinstrs-x86_64-O3/test-suite-build/SingleSource/Benchmarks/Polybench/datamining/correlation && /usr/local/Cellar/cmake/3.17.2/bin/cmake -E create_symlink /Users/buildslave/jenkins/workspace/test-suite-verify-machineinstrs-x86_64-O3/test-suite/SingleSource/Benchmarks/Polybench/datamining/correlation/correlation.reference_output /Users/buildslave/jenkins/workspace/test-suite-verify-machineinstrs-x86_64-O3/test-suite-build/SingleSource/Benchmarks/Polybench/datamining/correlation/correlation.reference_output
[4322/7685] /Users/buildslave/jenkins/workspace/test-suite-verify-machineinstrs-x86_64-O3/test-suite-build/tools/timeit --summary SingleSource/Benchmarks/Polybench/linear-algebra/kernels/2mm/CMakeFiles/2mm.dir/2mm.c.o.time /Users/buildslave/jenkins/workspace/test-suite-verify-machineinstrs-x86_64-O3/compiler/bin/clang -DFP_ABSTOLERANCE=1e-5 -DNDEBUG  -B /Applications/Xcode.app/Contents/Developer/Toolchains/XcodeDefault.xctoolchain/usr/bin    -Wno-unused-command-line-argument -mllvm -verify-machineinstrs -O3 -arch x86_64 -isysroot /Applications/Xcode.app/Contents/Developer/Platforms/MacOSX.platform/Developer/SDKs/MacOSX10.15.sdk   -w -Werror=date-time -I /Users/buildslave/jenkins/workspace/test-suite-verify-machineinstrs-x86_64-O3/test-suite/SingleSource/Benchmarks/Polybench/utilities -DPOLYBENCH_DUMP_ARRAYS -ffp-contract=off -DFMA_DISABLED=1 -ffp-contract=off -DFMA_DISABLED=1 -MD -MT SingleSource/Benchmarks/Polybench/linear-algebra/kernels/2mm/CMakeFiles/2mm.dir/2mm.c.o -MF SingleSource/Benchmarks/Polybench/linear-algebra/kernels/2mm/CMakeFiles/2mm.dir/2mm.c.o.d -o SingleSource/Benchmarks/Polybench/linear-algebra/kernels/2mm/CMakeFiles/2mm.dir/2mm.c.o   -c /Users/buildslave/jenkins/workspace/test-suite-verify-machineinstrs-x86_64-O3/test-suite/SingleSource/Benchmarks/Polybench/linear-algebra/kernels/2mm/2mm.c
FAILED: SingleSource/Benchmarks/Polybench/linear-algebra/kernels/2mm/CMakeFiles/2mm.dir/2mm.c.o 
/Users/buildslave/jenkins/workspace/test-suite-verify-machineinstrs-x86_64-O3/test-suite-build/tools/timeit --summary SingleSource/Benchmarks/Polybench/linear-algebra/kernels/2mm/CMakeFiles/2mm.dir/2mm.c.o.time /Users/buildslave/jenkins/workspace/test-suite-verify-machineinstrs-x86_64-O3/compiler/bin/clang -DFP_ABSTOLERANCE=1e-5 -DNDEBUG  -B /Applications/Xcode.app/Contents/Developer/Toolchains/XcodeDefault.xctoolchain/usr/bin    -Wno-unused-command-line-argument -mllvm -verify-machineinstrs -O3 -arch x86_64 -isysroot /Applications/Xcode.app/Contents/Developer/Platforms/MacOSX.platform/Developer/SDKs/MacOSX10.15.sdk   -w -Werror=date-time -I /Users/buildslave/jenkins/workspace/test-suite-verify-machineinstrs-x86_64-O3/test-suite/SingleSource/Benchmarks/Polybench/utilities -DPOLYBENCH_DUMP_ARRAYS -ffp-contract=off -DFMA_DISABLED=1 -ffp-contract=off -DFMA_DISABLED=1 -MD -MT SingleSource/Benchmarks/Polybench/linear-algebra/kernels/2mm/CMakeFiles/2mm.dir/2mm.c.o -MF SingleSource/Benchmarks/Polybench/linear-algebra/kernels/2mm/CMakeFiles/2mm.dir/2mm.c.o.d -o SingleSource/Benchmarks/Polybench/linear-algebra/kernels/2mm/CMakeFiles/2mm.dir/2mm.c.o   -c /Users/buildslave/jenkins/workspace/test-suite-verify-machineinstrs-x86_64-O3/test-suite/SingleSource/Benchmarks/Polybench/linear-algebra/kernels/2mm/2mm.c
/Users/buildslave/jenkins/workspace/test-suite-verify-machineinstrs-x86_64-O3/test-suite/SingleSource/Benchmarks/Polybench/linear-algebra/kernels/2mm/2mm.c:195:31: error: use of undeclared identifier 'D_StrictFP'
              POLYBENCH_ARRAY(D_StrictFP));
                              ^

Build Log

Changes
  1. [zorg] Cleanup clang-cmake-{armv7,aarch64}-quick bots (details / githubweb)
  2. [zorg] Build all targets on Linaro-maintained bots (details / githubweb)
  3. [zorg] Add AArch64 SVE vector-length-specific (VLS) bots (details / githubweb)
  4. [zorg] Rename Linaro's AArch64 and ARM bots to use consistent names (details / githubweb)
  5. [zorg] Remove settings that match defaults from Linaro bots (details / githubweb)
Changes
  1. AMD k8 family does not support SSE4.x which are required by x86-64-v2+ (details)
  2. [mlir][linalg] Lower PadTensorOp to InitTensorOp + FillOp + SubTensorInitOp (details)
  3. [mlir][linalg] Vectorize linalg.pad_op source copying (static source shape) (details)
  4. [mlir][linalg] Vectorize linalg.pad_op source copying (improved) (details)
  5. [LoopVectorize] precommit pr50686.ll for D104148 (details)
  6. Only consider built-in compound assignment operators for -Wunused-but-set-* (details)
  7. [mlir] Add ExpOp to Complex dialect. (details)
  8. [mlir][linalg] Lower PadTensorOps with non-constant pad value (details)
  9. [mlir][linalg] Add support for scalar input operands. (details)
  10. [mlir] Remove traits that require vector type support from ops in Complex dialect. (details)
  11. [VP] Binary floating-point intrinsics. (details)
  12. [flang] Add initial implementation for CPU_TIME (details)
  13. [llvm] remove Sequence::asSmallVector() (details)
  14. [clang][deps] NFC: Preserve the original frontend action (details)
  15. [libc] Add a set of elementary operations (details)
  16. [clang][modules][pch] Allow loading PCH with different modules cache path (details)
  17. Reland "[lldb] Set return status to failed when adding a command error" (details)
  18. [lldb] Add missing changes to a2363c0cf9b6a9a81c76ac652da667f73845d38b (details)
  19. [clang][deps] Handle precompiled headers' AST files (details)
  20. Revert "[libc] Add a set of elementary operations" (details)
  21. [lldb] Correct "else if" to "elif" in TestRegisters (details)
Changes
  1. [test-suite] Suppress FP_CONTRACT due to command line changes planned in D74436 (details / githubweb)

Started by upstream project relay-test-suite-verify-machineinstrs build number 10056
originally caused by:

This run spent:

  • 3 hr 39 min waiting;
  • 4 hr 13 min build duration;
  • 4 hr 14 min total from scheduled to completion.
Revision: 7b33ebd712c3a7d5d80f247bbc4ff844dc541304
  • refs/remotes/origin/main
Revision: f583029da3d6dbabe82f48b160227eb0120abd33
  • detached
Revision: f48d431f44610e339d00a33d57564c6029c4ff43
  • refs/remotes/origin/main
Revision: a52cf9f13240934991ba800d4188f61eb6816420
  • refs/remotes/origin/main

Identified problems

Compile Error

This build failed because of a compile error. Below is a list of all errors in the build log:
Indication 1

Ninja target failed

Below is a link to the first failed ninja target.
Indication 2