FailedConsole Output

Skipping 14,518 KB.. Full Log
PASS: LLVM-Unit :: Support/./SupportTests/CommandLineTest.OptionErrorMessageSuggest (73694 of 75189)
PASS: LLVM-Unit :: Support/./SupportTests/CommandLineTest.OptionErrorMessage (73695 of 75189)
PASS: LLVM-Unit :: Support/./SupportTests/CommandLineTest.LookupFailsInWrongSubCommand (73696 of 75189)
PASS: LLVM-Unit :: Support/./SupportTests/CommandLineTest.LongOptions (73697 of 75189)
PASS: LLVM-Unit :: Support/./SupportTests/CommandLineTest.PositionalEatArgsError (73698 of 75189)
PASS: LLVM-Unit :: Support/./SupportTests/CommandLineTest.OptionErrorMessageSuggestNoHidden (73699 of 75189)
PASS: LLVM-Unit :: Support/./SupportTests/AlignmentDeathTest.ComparisonsWithZero (73700 of 75189)
PASS: LLVM-Unit :: Support/./SupportTests/CommandLineTest.RecursiveResponseFiles (73701 of 75189)
PASS: LLVM-Unit :: Support/./SupportTests/CommandLineTest.ReadConfigFile (73702 of 75189)
PASS: LLVM-Unit :: Support/./SupportTests/CommandLineTest.PrefixOptions (73703 of 75189)
PASS: LLVM-Unit :: Support/./SupportTests/CommandLineTest.RemoveFromAllSubCommands (73704 of 75189)
PASS: LLVM-Unit :: Support/./SupportTests/CommandLineTest.ResponseFileWindows (73705 of 75189)
PASS: LLVM-Unit :: Support/./SupportTests/CommandLineTest.ReparseCommandLineOptions (73706 of 75189)
PASS: LLVM-Unit :: Support/./SupportTests/CommandLineTest.RemoveFromTopLevelSubCommand (73707 of 75189)
PASS: LLVM-Unit :: Support/./SupportTests/CommandLineTest.RemoveFromRegularSubCommand (73708 of 75189)
PASS: LLVM-Unit :: Support/./SupportTests/CommandLineTest.ResponseFiles (73709 of 75189)
PASS: LLVM-Unit :: Support/./SupportTests/CommandLineTest.TokenizeAndMarkEOLs (73710 of 75189)
PASS: LLVM-Unit :: Support/./SupportTests/CommandLineTest.ResponseFilesAtArguments (73711 of 75189)
PASS: LLVM-Unit :: Support/./SupportTests/CommandLineTest.TokenizeConfigFile1 (73712 of 75189)
PASS: LLVM-Unit :: Support/./SupportTests/CommandLineTest.SetDefautValue (73713 of 75189)
PASS: LLVM-Unit :: Support/./SupportTests/CommandLineTest.ResponseFileEOLs (73714 of 75189)
PASS: LLVM-Unit :: Support/./SupportTests/CommandLineTest.ResponseFileRelativePath (73715 of 75189)
PASS: LLVM-Unit :: Support/./SupportTests/CommandLineTest.SetValueInSubcategories (73716 of 75189)
PASS: LLVM-Unit :: Support/./SupportTests/CommandLineTest.TokenizeConfigFile10 (73717 of 75189)
PASS: LLVM-Unit :: Support/./SupportTests/CommandLineTest.TokenizeConfigFile3 (73718 of 75189)
PASS: LLVM-Unit :: Support/./SupportTests/CommandLineTest.TokenizeConfigFile2 (73719 of 75189)
PASS: LLVM-Unit :: Support/./SupportTests/CommandLineTest.TokenizeConfigFile11 (73720 of 75189)
PASS: LLVM-Unit :: Support/./SupportTests/CommandLineTest.TokenizeConfigFile4 (73721 of 75189)
PASS: LLVM-Unit :: Support/./SupportTests/CommandLineTest.TokenizeConfigFile6 (73722 of 75189)
PASS: LLVM-Unit :: Support/./SupportTests/CommandLineTest.TokenizeConfigFile7 (73723 of 75189)
PASS: LLVM-Unit :: Support/./SupportTests/CommandLineTest.TokenizeConfigFile5 (73724 of 75189)
PASS: LLVM-Unit :: Support/./SupportTests/CommandLineTest.TokenizeWindowsCommandLine1 (73725 of 75189)
PASS: LLVM-Unit :: Support/./SupportTests/CommandLineTest.TokenizeGNUCommandLine (73726 of 75189)
PASS: LLVM-Unit :: Support/./SupportTests/CommandLineTest.TokenizeConfigFile8 (73727 of 75189)
PASS: LLVM-Unit :: Support/./SupportTests/CommandLineTest.TokenizeConfigFile9 (73728 of 75189)
PASS: LLVM-Unit :: Support/./SupportTests/CommandLineTest.TokenizeWindowsCommandLineQuotedLastArgument (73729 of 75189)
PASS: LLVM-Unit :: Support/./SupportTests/CommandLineTest.TokenizeWindowsCommandLine2 (73730 of 75189)
PASS: LLVM-Unit :: Support/./SupportTests/CommandLineTest.UseMultipleCategories (73731 of 75189)
PASS: LLVM-Unit :: Support/./SupportTests/CommandLineTest.UseOptionCategory (73732 of 75189)
PASS: LLVM-Unit :: Support/./SupportTests/CompressionTest.ZlibCRC32 (73733 of 75189)
PASS: LLVM-Unit :: Support/./SupportTests/ConvertUTFTest.ConvertUTF16LittleEndianToUTF8String (73734 of 75189)
PASS: LLVM-Unit :: Support/./SupportTests/ConvertUTFTest.ConvertUTF16BigEndianToUTF8String (73735 of 75189)
PASS: LLVM-Unit :: Support/./SupportTests/CompressionTest.Zlib (73736 of 75189)
PASS: LLVM-Unit :: Support/./SupportTests/ConvertUTFTest.OddLengthInput (73737 of 75189)
PASS: LLVM-Unit :: Support/./SupportTests/ConvertUTFTest.Empty (73738 of 75189)
PASS: LLVM-Unit :: Support/./SupportTests/ConvertUTFTest.ConvertUTF8toWide (73739 of 75189)
PASS: LLVM-Unit :: Support/./SupportTests/ConvertUTFTest.ConvertUTF8ToUTF16String (73740 of 75189)
PASS: LLVM-Unit :: Support/./SupportTests/ConvertUTFTest.HasUTF16BOM (73741 of 75189)
PASS: LLVM-Unit :: Support/./SupportTests/ConvertUTFTest.UTF8ToUTF32PartialLenient (73742 of 75189)
PASS: LLVM-Unit :: Support/./SupportTests/CostTest.DefaultCtor (73743 of 75189)
PASS: LLVM-Unit :: Support/./SupportTests/CostTest.Operators (73744 of 75189)
PASS: LLVM-Unit :: Support/./SupportTests/ConvertUTFTest.UTF16WrappersForConvertUTF16ToUTF8String (73745 of 75189)
PASS: LLVM-Unit :: Support/./SupportTests/ConvertUTFTest.convertWideToUTF8 (73746 of 75189)
PASS: LLVM-Unit :: Support/./SupportTests/ConvertUTFTest.UTF8ToUTF32Lenient (73747 of 75189)
PASS: LLVM-Unit :: Support/./SupportTests/CrashRecoveryTest.Basic (73748 of 75189)
PASS: LLVM-Unit :: Support/./SupportTests/CrashRecoveryTest.Cleanup (73749 of 75189)
PASS: LLVM-Unit :: Support/./SupportTests/CrashRecoveryTest.LimitedStackTrace (73750 of 75189)
PASS: LLVM-Unit :: Support/./SupportTests/CrashRecoveryTest.DumpStackCleanup (73751 of 75189)
PASS: LLVM-Unit :: Support/./SupportTests/DJBTest.caseFolding (73752 of 75189)
PASS: LLVM-Unit :: Support/./SupportTests/CrashRecoveryTest.UnixCRCReturnCode (73753 of 75189)
PASS: LLVM-Unit :: Support/./SupportTests/DataExtractorTest.Cursor_takeError (73754 of 75189)
PASS: LLVM-Unit :: Support/./SupportTests/DJBTest.knownValuesLowerCase (73755 of 75189)
PASS: LLVM-Unit :: Support/./SupportTests/DJBTest.knownValuesUnicode (73756 of 75189)
PASS: LLVM-Unit :: Support/./SupportTests/DataExtractorTest.Cursor_chaining (73757 of 75189)
PASS: LLVM-Unit :: Support/./SupportTests/DataExtractorTest.Cursor_tell (73758 of 75189)
PASS: LLVM-Unit :: Support/./SupportTests/DataExtractorTest.GetBytes (73759 of 75189)
PASS: LLVM-Unit :: Support/./SupportTests/DataExtractorTest.LEB128 (73760 of 75189)
PASS: LLVM-Unit :: Support/./SupportTests/DataExtractorTest.FixedLengthString (73761 of 75189)
PASS: LLVM-Unit :: Support/./SupportTests/DataExtractorTest.OffsetOverflow (73762 of 75189)
PASS: LLVM-Unit :: Support/./SupportTests/DataExtractorTest.LEB128_error (73763 of 75189)
PASS: LLVM-Unit :: Support/./SupportTests/DataExtractorTest.SignedNumbers (73764 of 75189)
PASS: LLVM-Unit :: Support/./SupportTests/DataExtractorTest.Strings (73765 of 75189)
PASS: LLVM-Unit :: Support/./SupportTests/DataExtractorTest.UnsignedNumbers (73766 of 75189)
PASS: LLVM-Unit :: Support/./SupportTests/DataExtractorTest.eof (73767 of 75189)
PASS: LLVM-Unit :: Support/./SupportTests/DataExtractorTest.getU24 (73768 of 75189)
PASS: LLVM-Unit :: Support/./SupportTests/DataExtractorTest.skip (73769 of 75189)
PASS: LLVM-Unit :: Support/./SupportTests/DebugTest.Basic (73770 of 75189)
PASS: LLVM-Unit :: Support/./SupportTests/DataExtractorTest.getU8_vector (73771 of 75189)
PASS: LLVM-Unit :: Support/./SupportTests/DataExtractorTest.size (73772 of 75189)
PASS: LLVM-Unit :: Support/./SupportTests/DebugCounterTest.CounterCheck (73773 of 75189)
PASS: LLVM-Unit :: Support/./SupportTests/DivBuildAttr.testBuildAttr (73774 of 75189)
PASS: LLVM-Unit :: Support/./SupportTests/Endian.Read (73775 of 75189)
PASS: LLVM-Unit :: Support/./SupportTests/Endian.PackedEndianSpecificIntegral (73776 of 75189)
PASS: LLVM-Unit :: Support/./SupportTests/Endian.PacketEndianSpecificIntegralAsEnum (73777 of 75189)
PASS: LLVM-Unit :: Support/./SupportTests/Endian.ReadBitAligned (73778 of 75189)
PASS: LLVM-Unit :: Support/./SupportTests/Endian.Write (73779 of 75189)
PASS: LLVM-Unit :: Support/./SupportTests/Endian.WriteBitAligned (73780 of 75189)
PASS: LLVM-Unit :: Support/./SupportTests/EndianStream.WriteArrayLE (73781 of 75189)
PASS: LLVM-Unit :: Support/./SupportTests/EndianStream.WriteDoubleBE (73782 of 75189)
PASS: LLVM-Unit :: Support/./SupportTests/EndianStream.WriteDoubleLE (73783 of 75189)
PASS: LLVM-Unit :: Support/./SupportTests/EndianStream.WriteInt32BE (73784 of 75189)
PASS: LLVM-Unit :: Support/./SupportTests/EndianStream.WriteFloatBE (73785 of 75189)
PASS: LLVM-Unit :: Support/./SupportTests/EndianStream.WriteFloatArrayLE (73786 of 75189)
PASS: LLVM-Unit :: Support/./SupportTests/EndianStream.WriteFloatLE (73787 of 75189)
PASS: LLVM-Unit :: Support/./SupportTests/EndianStream.WriteVectorLE (73788 of 75189)
PASS: LLVM-Unit :: Support/./SupportTests/EndianStream.WriteInt64LE (73789 of 75189)
PASS: LLVM-Unit :: Support/./SupportTests/EndianStream.WriteInt64BE (73790 of 75189)
PASS: LLVM-Unit :: Support/./SupportTests/EnumSizeBuildAttr.testBuildAttr (73791 of 75189)
PASS: LLVM-Unit :: Support/./SupportTests/EndianStream.WriteInt32LE (73792 of 75189)
PASS: LLVM-Unit :: Support/./SupportTests/ErrnoTest.RetryAfterSignal (73793 of 75189)
PASS: LLVM-Unit :: Support/./SupportTests/Error.C_API (73794 of 75189)
PASS: LLVM-Unit :: Support/./SupportTests/Error.CantFailSuccess (73795 of 75189)
PASS: LLVM-Unit :: Support/./SupportTests/Error.CatchErrorFromHandler (73796 of 75189)
PASS: LLVM-Unit :: Support/./SupportTests/Error.CheckedExpectedInSuccessMode (73797 of 75189)
PASS: LLVM-Unit :: Support/./SupportTests/Error.CheckJoinErrors (73798 of 75189)
PASS: LLVM-Unit :: Support/./SupportTests/Error.CheckedSuccess (73799 of 75189)
PASS: LLVM-Unit :: Support/./SupportTests/Error.ConsumeSuccess (73800 of 75189)
PASS: LLVM-Unit :: Support/./SupportTests/Error.ConsumeError (73801 of 75189)
PASS: LLVM-Unit :: Support/./SupportTests/Error.ErrorAsOutParameterChecked (73802 of 75189)
PASS: LLVM-Unit :: Support/./SupportTests/Error.ErrorCodeConversions (73803 of 75189)
PASS: LLVM-Unit :: Support/./SupportTests/Error.ErrorMessage (73804 of 75189)
PASS: LLVM-Unit :: Support/./SupportTests/Error.AccessExpectedInFailureMode (73805 of 75189)
PASS: LLVM-Unit :: Support/./SupportTests/Error.ExpectedCovariance (73806 of 75189)
PASS: LLVM-Unit :: Support/./SupportTests/Error.ExitOnError (73807 of 75189)
PASS: LLVM-Unit :: Support/./SupportTests/Error.ExpectedWithReferenceType (73808 of 75189)
PASS: LLVM-Unit :: Support/./SupportTests/Error.ExpectedInFailureMode (73809 of 75189)
PASS: LLVM-Unit :: Support/./SupportTests/Error.FailedWithMessageMatcher (73810 of 75189)
PASS: LLVM-Unit :: Support/./SupportTests/Error.ErrorAsOutParameterUnchecked (73811 of 75189)
PASS: LLVM-Unit :: Support/./SupportTests/Error.FailedMatcher (73812 of 75189)
PASS: LLVM-Unit :: Support/./SupportTests/Error.FirstHandlerOnly (73813 of 75189)
PASS: LLVM-Unit :: Support/./SupportTests/DataExtractorDeathTest.Cursor (73814 of 75189)
PASS: LLVM-Unit :: Support/./SupportTests/Error.HandleCustomError (73815 of 75189)
PASS: LLVM-Unit :: Support/./SupportTests/Error.HandleCustomErrorWithCustomBaseClass (73816 of 75189)
PASS: LLVM-Unit :: Support/./SupportTests/Error.HandleExpectedHandledError (73817 of 75189)
PASS: LLVM-Unit :: Support/./SupportTests/Error.CantFailDeath (73818 of 75189)
PASS: LLVM-Unit :: Support/./SupportTests/Error.HandleExpectedUnhandledError (73819 of 75189)
PASS: LLVM-Unit :: Support/./SupportTests/Error.HandleExpectedSuccess (73820 of 75189)
PASS: LLVM-Unit :: Support/./SupportTests/Error.HandlerShadowing (73821 of 75189)
PASS: LLVM-Unit :: Support/./SupportTests/Error.HandlerTypeDeduction (73822 of 75189)
PASS: LLVM-Unit :: Support/./SupportTests/Error.FailureFromHandler (73823 of 75189)
PASS: LLVM-Unit :: Support/./SupportTests/Error.FileErrorTest (73824 of 75189)
PASS: LLVM-Unit :: Support/./SupportTests/Error.FailureToHandle (73825 of 75189)
PASS: LLVM-Unit :: Support/./SupportTests/Error.IsAHandling (73826 of 75189)
PASS: LLVM-Unit :: Support/./SupportTests/Error.Stream (73827 of 75189)
PASS: LLVM-Unit :: Support/./SupportTests/Error.HasValueMatcher (73828 of 75189)
PASS: LLVM-Unit :: Support/./SupportTests/Error.StringError (73829 of 75189)
PASS: LLVM-Unit :: Support/./SupportTests/Error.SubtypeStringErrorTest (73830 of 75189)
PASS: LLVM-Unit :: Support/./SupportTests/Error.SucceededMatcher (73831 of 75189)
PASS: LLVM-Unit :: Support/./SupportTests/Error.UncheckedExpectedInSuccessModeAccess (73832 of 75189)
PASS: LLVM-Unit :: Support/./SupportTests/Error.UncheckedError (73833 of 75189)
PASS: LLVM-Unit :: Support/./SupportTests/ErrorOr.Comparison (73834 of 75189)
PASS: LLVM-Unit :: Support/./SupportTests/Error.createStringError (73835 of 75189)
PASS: LLVM-Unit :: Support/./SupportTests/ErrorOr.Covariant (73836 of 75189)
PASS: LLVM-Unit :: Support/./SupportTests/ErrorOr.Types (73837 of 75189)
PASS: LLVM-Unit :: Support/./SupportTests/ErrorOr.ImplicitConversion (73838 of 75189)
PASS: LLVM-Unit :: Support/./SupportTests/ErrorOr.ImplicitConversionCausesMove (73839 of 75189)
PASS: LLVM-Unit :: Support/./SupportTests/ExtensibleRTTI.cast (73840 of 75189)
PASS: LLVM-Unit :: Support/./SupportTests/ErrorOr.ImplicitConversionNoAmbiguity (73841 of 75189)
PASS: LLVM-Unit :: Support/./SupportTests/ExtensibleRTTI.dyn_cast (73842 of 75189)
PASS: LLVM-Unit :: Support/./SupportTests/Error.UncheckedExpectedInSuccessModeAssignment (73843 of 75189)
PASS: LLVM-Unit :: Support/./SupportTests/Error.UncheckedSuccess (73844 of 75189)
PASS: LLVM-Unit :: Support/./SupportTests/Error.UncheckedExpectedInSuccessModeDestruction (73845 of 75189)
PASS: LLVM-Unit :: Support/./SupportTests/Error.UnhandledExpectedInFailureMode (73846 of 75189)
PASS: LLVM-Unit :: Support/./SupportTests/ErrorOr.SimpleValue (73847 of 75189)
PASS: LLVM-Unit :: Support/./SupportTests/ExtensibleRTTI.isa (73848 of 75189)
PASS: LLVM-Unit :: Support/./SupportTests/FP16BuildAttr.testBuildAttr (73849 of 75189)
PASS: LLVM-Unit :: Support/./SupportTests/FPDenormalBuildAttr.testBuildAttr (73850 of 75189)
PASS: LLVM-Unit :: Support/./SupportTests/FPArchBuildAttr.testBuildAttr (73851 of 75189)
PASS: LLVM-Unit :: Support/./SupportTests/FPExceptionsBuildAttr.testBuildAttr (73852 of 75189)
PASS: LLVM-Unit :: Support/./SupportTests/FPUserExceptionsBuildAttr.testBuildAttr (73853 of 75189)
PASS: LLVM-Unit :: Support/./SupportTests/FPHPBuildAttr.testBuildAttr (73854 of 75189)
PASS: LLVM-Unit :: Support/./SupportTests/FPNumberModelBuildAttr.testBuildAttr (73855 of 75189)
PASS: LLVM-Unit :: Support/./SupportTests/FSUniqueIDTest.equals (73856 of 75189)
PASS: LLVM-Unit :: Support/./SupportTests/FPRoundingBuildAttr.testBuildAttr (73857 of 75189)
PASS: LLVM-Unit :: Support/./SupportTests/FSUniqueIDTest.construct (73858 of 75189)
PASS: LLVM-Unit :: Support/./SupportTests/FSUniqueIDTest.less (73859 of 75189)
PASS: LLVM-Unit :: Support/./SupportTests/FileCollectorTest.Symlinks (73860 of 75189)
PASS: LLVM-Unit :: Support/./SupportTests/FileCollectorTest.addDirectory (73861 of 75189)
PASS: LLVM-Unit :: Support/./SupportTests/FileCollectorTest.addFile (73862 of 75189)
PASS: LLVM-Unit :: Support/./SupportTests/FileCollectorTest.recordVFSSymlinkAccesses (73863 of 75189)
PASS: LLVM-Unit :: Support/./SupportTests/FileSystemTest.CreateDir (73864 of 75189)
PASS: LLVM-Unit :: Support/./SupportTests/FileSystemTest.CreateAlways (73865 of 75189)
PASS: LLVM-Unit :: Support/./SupportTests/FileSystemTest.CreateNew (73866 of 75189)
PASS: LLVM-Unit :: Support/./SupportTests/FileSystemTest.DirectoryNotExecutable (73867 of 75189)
PASS: LLVM-Unit :: Support/./SupportTests/FileSystemTest.AppendSetsCorrectFileOffset (73868 of 75189)
PASS: LLVM-Unit :: Support/./SupportTests/FileCollectorTest.recordVFSAccesses (73869 of 75189)
PASS: LLVM-Unit :: Support/./SupportTests/FileCollectorTest.recordAndConstructDirectory (73870 of 75189)
PASS: LLVM-Unit :: Support/./SupportTests/FileSystemTest.BrokenSymlinkDirectoryIteration (73871 of 75189)
PASS: LLVM-Unit :: Support/./SupportTests/FileSystemTest.ExpandTilde (73872 of 75189)
PASS: LLVM-Unit :: Support/./SupportTests/FileSystemTest.DirectoryIteration (73873 of 75189)
PASS: LLVM-Unit :: Support/./SupportTests/FileCollectorTest.copyFiles (73874 of 75189)
PASS: LLVM-Unit :: Support/./SupportTests/FileOutputBuffer.Test (73875 of 75189)
PASS: LLVM-Unit :: Support/./SupportTests/FileSystemTest.OpenAlways (73876 of 75189)
PASS: LLVM-Unit :: Support/./SupportTests/FileSystemTest.MD5 (73877 of 75189)
PASS: LLVM-Unit :: Support/./SupportTests/FileSystemTest.OpenExisting (73878 of 75189)
PASS: LLVM-Unit :: Support/./SupportTests/FileSystemTest.OpenFileForRead (73879 of 75189)
PASS: LLVM-Unit :: Support/./SupportTests/FileSystemTest.ReadOnlyFileCantWrite (73880 of 75189)
PASS: LLVM-Unit :: Support/./SupportTests/FileSystemTest.ReadWriteFileCanReadOrWrite (73881 of 75189)
PASS: LLVM-Unit :: Support/./SupportTests/FileSystemTest.Resize (73882 of 75189)
PASS: LLVM-Unit :: Support/./SupportTests/FileSystemTest.RealPath (73883 of 75189)
PASS: LLVM-Unit :: Support/./SupportTests/FileSystemTest.RealPathNoReadPerm (73884 of 75189)
PASS: LLVM-Unit :: Support/./SupportTests/FileSystemTest.ResizeBeforeMapping (73885 of 75189)
PASS: LLVM-Unit :: Support/./SupportTests/FileSystemTest.Remove (73886 of 75189)
PASS: LLVM-Unit :: Support/./SupportTests/FileSystemTest.RespectUmask (73887 of 75189)
PASS: LLVM-Unit :: Support/./SupportTests/FileSystemTest.TempFileDiscardDiscard (73888 of 75189)
PASS: LLVM-Unit :: Support/./SupportTests/FileSystemTest.TempFileKeepDiscard (73889 of 75189)
PASS: LLVM-Unit :: Support/./SupportTests/FileSystemTest.TempFiles (73890 of 75189)
PASS: LLVM-Unit :: Support/./SupportTests/FileSystemTest.Unique (73891 of 75189)
PASS: LLVM-Unit :: Support/./SupportTests/FileSystemTest.WriteOnlyFileCantRead (73892 of 75189)
PASS: LLVM-Unit :: Support/./SupportTests/FileSystemTest.getUmask (73893 of 75189)
PASS: LLVM-Unit :: Support/./SupportTests/FileSystemTest.readNativeFile (73894 of 75189)
PASS: LLVM-Unit :: Support/./SupportTests/FileSystemTest.permissions (73895 of 75189)
PASS: LLVM-Unit :: Support/./SupportTests/FileSystemTest.set_current_path (73896 of 75189)
PASS: LLVM-Unit :: Support/./SupportTests/FileSystemTest.is_local (73897 of 75189)
PASS: LLVM-Unit :: Support/./SupportTests/FormatVariadicTest.Adapter (73898 of 75189)
PASS: LLVM-Unit :: Support/./SupportTests/FormatVariadicTest.BigTest (73899 of 75189)
PASS: LLVM-Unit :: Support/./SupportTests/FormatVariadicTest.BoolTest (73900 of 75189)
PASS: LLVM-Unit :: Support/./SupportTests/FileSystemTest.readNativeFileSlice (73901 of 75189)
PASS: LLVM-Unit :: Support/./SupportTests/FileSystemTest.FileMapping (73902 of 75189)
PASS: LLVM-Unit :: Support/./SupportTests/FormatVariadicTest.CustomPaddingCharacter (73903 of 75189)
PASS: LLVM-Unit :: Support/./SupportTests/FormatVariadicTest.CopiesAndMoves (73904 of 75189)
PASS: LLVM-Unit :: Support/./SupportTests/FormatVariadicTest.CharFormatting (73905 of 75189)
PASS: LLVM-Unit :: Support/./SupportTests/FormatVariadicTest.DefaultReplacementValues (73906 of 75189)
PASS: LLVM-Unit :: Support/./SupportTests/FormatVariadicTest.DoubleFormatting (73907 of 75189)
PASS: LLVM-Unit :: Support/./SupportTests/FormatVariadicTest.EscapedBrace (73908 of 75189)
PASS: LLVM-Unit :: Support/./SupportTests/FormatVariadicTest.EmptyFormatString (73909 of 75189)
PASS: LLVM-Unit :: Support/./SupportTests/FormatVariadicTest.FormatAdapter (73910 of 75189)
PASS: LLVM-Unit :: Support/./SupportTests/FormatVariadicTest.FormatFormatvObject (73911 of 75189)
PASS: LLVM-Unit :: Support/./SupportTests/FormatVariadicTest.FormatBasicTypesOneReplacement (73912 of 75189)
PASS: LLVM-Unit :: Support/./SupportTests/FormatVariadicTest.FormatError (73913 of 75189)
PASS: LLVM-Unit :: Support/./SupportTests/FormatVariadicTest.FormatNoReplacements (73914 of 75189)
PASS: LLVM-Unit :: Support/./SupportTests/FormatVariadicTest.FormatStreamable (73915 of 75189)
PASS: LLVM-Unit :: Support/./SupportTests/FormatVariadicTest.ImplicitConversions (73916 of 75189)
PASS: LLVM-Unit :: Support/./SupportTests/FormatVariadicTest.IntegralHexFormatting (73917 of 75189)
PASS: LLVM-Unit :: Support/./SupportTests/FormatVariadicTest.IntegralNumberFormatting (73918 of 75189)
PASS: LLVM-Unit :: Support/./SupportTests/FormatVariadicTest.MoveConstructor (73919 of 75189)
PASS: LLVM-Unit :: Support/./SupportTests/FormatVariadicTest.NoReplacements (73920 of 75189)
PASS: LLVM-Unit :: Support/./SupportTests/FormatVariadicTest.MultipleReplacements (73921 of 75189)
PASS: LLVM-Unit :: Support/./SupportTests/FormatVariadicTest.Range (73922 of 75189)
PASS: LLVM-Unit :: Support/./SupportTests/FormatVariadicTest.PointerFormatting (73923 of 75189)
PASS: LLVM-Unit :: Support/./SupportTests/FormatVariadicTest.StringFormatting (73924 of 75189)
PASS: LLVM-Unit :: Support/./SupportTests/FormatVariadicTest.ValidReplacementSequence (73925 of 75189)
PASS: LLVM-Unit :: Support/./SupportTests/GetOptionWidthTest.GetOptionWidthArgNameLonger (73926 of 75189)
PASS: LLVM-Unit :: Support/./SupportTests/GetOptionWidthTest.GetOptionWidthFirstOptionNameLonger (73927 of 75189)
PASS: LLVM-Unit :: Support/./SupportTests/GetOptionWidthTest.GetOptionWidthEmptyOptionNameLonger (73928 of 75189)
PASS: LLVM-Unit :: Support/./SupportTests/FileSystemTest.TempFileCollisions (73929 of 75189)
PASS: LLVM-Unit :: Support/./SupportTests/GetOptionWidthTest.GetOptionWidthValueOptionalEmptyOptionWithNoDescription (73930 of 75189)
PASS: LLVM-Unit :: Support/./SupportTests/GetOptionWidthTest.GetOptionWidthSecondOptionNameLonger (73931 of 75189)
PASS: LLVM-Unit :: Support/./SupportTests/GetOptionWidthTest.GetOptionWidthValueRequiredEmptyOptionWithNoDescription (73932 of 75189)
PASS: LLVM-Unit :: Support/./SupportTests/GlobPatternTest.BasicCharacterClass (73933 of 75189)
PASS: LLVM-Unit :: Support/./SupportTests/GlobPatternTest.Empty (73934 of 75189)
PASS: LLVM-Unit :: Support/./SupportTests/GlobPatternTest.BracketFrontOfCharacterClass (73935 of 75189)
PASS: LLVM-Unit :: Support/./SupportTests/GlobPatternTest.Escape (73936 of 75189)
PASS: LLVM-Unit :: Support/./SupportTests/GlobPatternTest.Glob (73937 of 75189)
PASS: LLVM-Unit :: Support/./SupportTests/GlobPatternTest.Invalid (73938 of 75189)
PASS: LLVM-Unit :: Support/./SupportTests/GlobPatternTest.ExtSym (73939 of 75189)
PASS: LLVM-Unit :: Support/./SupportTests/GlobPatternTest.IsTrivialMatchAll (73940 of 75189)
PASS: LLVM-Unit :: Support/./SupportTests/GlobPatternTest.NegatedCharacterClass (73941 of 75189)
PASS: LLVM-Unit :: Support/./SupportTests/GlobPatternTest.SpecialCharsInCharacterClass (73942 of 75189)
PASS: LLVM-Unit :: Support/./SupportTests/GlobPatternTest.Wildcard (73943 of 75189)
PASS: LLVM-Unit :: Support/./SupportTests/HostTest.NumPhysicalCores (73944 of 75189)
PASS: LLVM-Unit :: Support/./SupportTests/HardFPBuildAttr.testBuildAttr (73945 of 75189)
PASS: LLVM-Unit :: Support/./SupportTests/HostTest.DummyRunAndGetCommandOutputUse (73946 of 75189)
PASS: LLVM-Unit :: Support/./SupportTests/InMemoryFileSystemTest.AddFileInPlaceOfAHardLinkWithDifferentContent (73947 of 75189)
PASS: LLVM-Unit :: Support/./SupportTests/InMemoryFileSystemTest.AddDirectoryThenAddChild (73948 of 75189)
PASS: LLVM-Unit :: Support/./SupportTests/InMemoryFileSystemTest.AddFileInPlaceOfAHardLinkWithSameContent (73949 of 75189)
PASS: LLVM-Unit :: Support/./SupportTests/InMemoryFileSystemTest.AddFileWithGroup (73950 of 75189)
PASS: LLVM-Unit :: Support/./SupportTests/InMemoryFileSystemTest.AddFileWithFileType (73951 of 75189)
PASS: LLVM-Unit :: Support/./SupportTests/InMemoryFileSystemTest.AddFileWithUser (73952 of 75189)
PASS: LLVM-Unit :: Support/./SupportTests/InMemoryFileSystemTest.AddFileWithPerms (73953 of 75189)
PASS: LLVM-Unit :: Support/./SupportTests/InMemoryFileSystemTest.AddHardLinkFromADirectory (73954 of 75189)
PASS: LLVM-Unit :: Support/./SupportTests/InMemoryFileSystemTest.AddHardLinkToADirectory (73955 of 75189)
PASS: LLVM-Unit :: Support/./SupportTests/InMemoryFileSystemTest.AddHardLinkFromAFileThatWasAddedBefore (73956 of 75189)
PASS: LLVM-Unit :: Support/./SupportTests/InMemoryFileSystemTest.AddHardLinkInChainPattern (73957 of 75189)
PASS: LLVM-Unit :: Support/./SupportTests/InMemoryFileSystemTest.AddHardLinkToFile (73958 of 75189)
PASS: LLVM-Unit :: Support/./SupportTests/InMemoryFileSystemTest.AddHardLinkUnderAFile (73959 of 75189)
PASS: LLVM-Unit :: Support/./SupportTests/InMemoryFileSystemTest.AddHardLinkToAFileThatWasNotAddedBefore (73960 of 75189)
PASS: LLVM-Unit :: Support/./SupportTests/InMemoryFileSystemTest.DuplicatedFile (73961 of 75189)
PASS: LLVM-Unit :: Support/./SupportTests/InMemoryFileSystemTest.DirectoryIteration (73962 of 75189)
PASS: LLVM-Unit :: Support/./SupportTests/InMemoryFileSystemTest.AddSameHardLinkMoreThanOnce (73963 of 75189)
PASS: LLVM-Unit :: Support/./SupportTests/HostTest.getMacOSHostVersion (73964 of 75189)
PASS: LLVM-Unit :: Support/./SupportTests/InMemoryFileSystemTest.GetRealPath (73965 of 75189)
PASS: LLVM-Unit :: Support/./SupportTests/InMemoryFileSystemTest.IsEmpty (73966 of 75189)
PASS: LLVM-Unit :: Support/./SupportTests/InMemoryFileSystemTest.IsLocal (73967 of 75189)
PASS: LLVM-Unit :: Support/./SupportTests/InMemoryFileSystemTest.OverlayFile (73968 of 75189)
PASS: LLVM-Unit :: Support/./SupportTests/InMemoryFileSystemTest.RecursiveIterationWithHardLink (73969 of 75189)
PASS: LLVM-Unit :: Support/./SupportTests/InMemoryFileSystemTest.OpenFileForRead (73970 of 75189)
PASS: LLVM-Unit :: Support/./SupportTests/InMemoryFileSystemTest.OverlayFileNoOwn (73971 of 75189)
PASS: LLVM-Unit :: Support/./SupportTests/InMemoryFileSystemTest.WorkingDirectory (73972 of 75189)
PASS: LLVM-Unit :: Support/./SupportTests/InMemoryFileSystemTest.StatusName (73973 of 75189)
PASS: LLVM-Unit :: Support/./SupportTests/ItaniumManglingCanonicalizerTest.TestForwardTemplateReference (73974 of 75189)
PASS: LLVM-Unit :: Support/./SupportTests/ItaniumManglingCanonicalizerTest.TestCanonicalize (73975 of 75189)
PASS: LLVM-Unit :: Support/./SupportTests/InMemoryFileSystemTest.WindowsPath (73976 of 75189)
PASS: LLVM-Unit :: Support/./SupportTests/Initialize.MultipleThreads (73977 of 75189)
PASS: LLVM-Unit :: Support/./SupportTests/ItaniumManglingCanonicalizerTest.TestBadEquivalenceOrder (73978 of 75189)
PASS: LLVM-Unit :: Support/./SupportTests/ItaniumManglingCanonicalizerTest.TestInvalidManglings (73979 of 75189)
PASS: LLVM-Unit :: Support/./SupportTests/ItaniumManglingCanonicalizerTest.TestLookup (73980 of 75189)
PASS: LLVM-Unit :: Support/./SupportTests/JSONTest.Constructors (73981 of 75189)
PASS: LLVM-Unit :: Support/./SupportTests/JSONTest.CanonicalOutput (73982 of 75189)
PASS: LLVM-Unit :: Support/./SupportTests/JSONTest.Array (73983 of 75189)
PASS: LLVM-Unit :: Support/./SupportTests/JSONTest.Deserialize (73984 of 75189)
PASS: LLVM-Unit :: Support/./SupportTests/JSONTest.Escaping (73985 of 75189)
PASS: LLVM-Unit :: Support/./SupportTests/JSONTest.Inspection (73986 of 75189)
PASS: LLVM-Unit :: Support/./SupportTests/JSONTest.Integers (73987 of 75189)
PASS: LLVM-Unit :: Support/./SupportTests/JSONTest.Object (73988 of 75189)
PASS: LLVM-Unit :: Support/./SupportTests/JSONTest.Parse (73989 of 75189)
PASS: LLVM-Unit :: Support/./SupportTests/JSONTest.ParseDeserialize (73990 of 75189)
PASS: LLVM-Unit :: Support/./SupportTests/JSONTest.Path (73991 of 75189)
PASS: LLVM-Unit :: Support/./SupportTests/JSONTest.ParseErrors (73992 of 75189)
PASS: LLVM-Unit :: Support/./SupportTests/JSONTest.Stream (73993 of 75189)
PASS: LLVM-Unit :: Support/./SupportTests/JSONTest.PrettyPrinting (73994 of 75189)
PASS: LLVM-Unit :: Support/./SupportTests/JSONTest.StringOwnership (73995 of 75189)
PASS: LLVM-Unit :: Support/./SupportTests/JSONTest.UTF8 (73996 of 75189)
PASS: LLVM-Unit :: Support/./SupportTests/KnownBitsTest.GetMinMaxVal (73997 of 75189)
PASS: LLVM-Unit :: Support/./SupportTests/KnownBitsTest.GetSignedMinMaxVal (73998 of 75189)
PASS: LLVM-Unit :: Support/./SupportTests/KnownBitsTest.SExtOrTrunc (73999 of 75189)
PASS: LLVM-Unit :: Support/./SupportTests/KnownBitsTest.SExtInReg (74000 of 75189)
PASS: LLVM-Unit :: Support/./SupportTests/LEB128Test.DecodeInvalidSLEB128 (74001 of 75189)
PASS: LLVM-Unit :: Support/./SupportTests/LEB128Test.DecodeInvalidULEB128 (74002 of 75189)
PASS: LLVM-Unit :: Support/./SupportTests/LEB128Test.DecodeULEB128 (74003 of 75189)
PASS: LLVM-Unit :: Support/./SupportTests/LEB128Test.DecodeSLEB128 (74004 of 75189)
PASS: LLVM-Unit :: Support/./SupportTests/KnownBitsTest.UnaryExhaustive (74005 of 75189)
PASS: LLVM-Unit :: Support/./SupportTests/KnownBitsTest.CommonBitsSet (74006 of 75189)
PASS: LLVM-Unit :: Support/./SupportTests/KnownBitsTest.AddSubExhaustive (74007 of 75189)
PASS: LLVM-Unit :: Support/./SupportTests/LEB128Test.EncodeSLEB128 (74008 of 75189)
PASS: LLVM-Unit :: Support/./SupportTests/KnownBitsTest.ICmpExhaustive (74009 of 75189)
PASS: LLVM-Unit :: Support/./SupportTests/JSONTest.Types (74010 of 75189)
PASS: LLVM-Unit :: Support/./SupportTests/LEB128Test.SLEB128Size (74011 of 75189)
PASS: LLVM-Unit :: Support/./SupportTests/LEB128Test.ULEB128Size (74012 of 75189)
PASS: LLVM-Unit :: Support/./SupportTests/LEB128Test.EncodeULEB128 (74013 of 75189)
PASS: LLVM-Unit :: Support/./SupportTests/LineIteratorTest.CommentAndBlankSkipping (74014 of 75189)
PASS: LLVM-Unit :: Support/./SupportTests/KnownBitsTest.AddCarryExhaustive (74015 of 75189)
PASS: LLVM-Unit :: Support/./SupportTests/LineIteratorTest.Basic (74016 of 75189)
PASS: LLVM-Unit :: Support/./SupportTests/LineIteratorTest.BlankSkipping (74017 of 75189)
PASS: LLVM-Unit :: Support/./SupportTests/LineIteratorTest.BlankKeeping (74018 of 75189)
PASS: LLVM-Unit :: Support/./SupportTests/LineIteratorTest.CommentSkippingKeepBlanks (74019 of 75189)
PASS: LLVM-Unit :: Support/./SupportTests/LineIteratorTest.Ref (74020 of 75189)
PASS: LLVM-Unit :: Support/./SupportTests/LineIteratorTest.EmptyBuffers (74021 of 75189)
PASS: LLVM-Unit :: Support/./SupportTests/LinearPolyBase.Poly3D_Add (74022 of 75189)
PASS: LLVM-Unit :: Support/./SupportTests/LinearPolyBase.Poly3D_GetValue (74023 of 75189)
PASS: LLVM-Unit :: Support/./SupportTests/LinearPolyBase.Poly3D_Equality (74024 of 75189)
PASS: LLVM-Unit :: Support/./SupportTests/LinearPolyBase.Poly3D_Invert (74025 of 75189)
PASS: LLVM-Unit :: Support/./SupportTests/LinearPolyBase.Poly3D_isZero (74026 of 75189)
PASS: LLVM-Unit :: Support/./SupportTests/LinearPolyBase.Poly3D_Sub (74027 of 75189)
PASS: LLVM-Unit :: Support/./SupportTests/LinearPolyBase.Poly3D_Scale (74028 of 75189)
PASS: LLVM-Unit :: Support/./SupportTests/LockFileManagerTest.Basic (74029 of 75189)
PASS: LLVM-Unit :: Support/./SupportTests/MD5Test.MD5 (74030 of 75189)
PASS: LLVM-Unit :: Support/./SupportTests/MVEBuildAttr.testBuildAttr (74031 of 75189)
PASS: LLVM-Unit :: Support/./SupportTests/MD5HashTest.MD5 (74032 of 75189)
PASS: LLVM-Unit :: Support/./SupportTests/MPBuildAttr.testBuildAttr (74033 of 75189)
PASS: LLVM-Unit :: Support/./SupportTests/LockFileManagerTest.LinkLockExists (74034 of 75189)
PASS: LLVM-Unit :: Support/./SupportTests/ManagedStaticTest.CustomCreatorDeletor (74035 of 75189)
PASS: LLVM-Unit :: Support/./SupportTests/LockFileManagerTest.RelativePath (74036 of 75189)
PASS: LLVM-Unit :: Support/./SupportTests/KnownBitsTest.BinaryExhaustive (74037 of 75189)
PASS: LLVM-Unit :: Support/./SupportTests/ManagedStaticTest.NestedStatics (74038 of 75189)
PASS: LLVM-Unit :: Support/./SupportTests/MathExtras.DoubleBits (74039 of 75189)
PASS: LLVM-Unit :: Support/./SupportTests/MatchersTest.Optional (74040 of 75189)
PASS: LLVM-Unit :: Support/./SupportTests/MathExtras.CTLog2 (74041 of 75189)
PASS: LLVM-Unit :: Support/./SupportTests/MathExtras.FloatBits (74042 of 75189)
PASS: LLVM-Unit :: Support/./SupportTests/MathExtras.MinAlign (74043 of 75189)
PASS: LLVM-Unit :: Support/./SupportTests/MathExtras.IsShiftedInt (74044 of 75189)
PASS: LLVM-Unit :: Support/./SupportTests/MathExtras.IsShiftedUInt (74045 of 75189)
PASS: LLVM-Unit :: Support/./SupportTests/MathExtras.SaturatingMultiply (74046 of 75189)
PASS: LLVM-Unit :: Support/./SupportTests/MathExtras.PowerOf2Ceil (74047 of 75189)
PASS: LLVM-Unit :: Support/./SupportTests/MathExtras.SaturatingAdd (74048 of 75189)
PASS: LLVM-Unit :: Support/./SupportTests/MathExtras.PowerOf2Floor (74049 of 75189)
PASS: LLVM-Unit :: Support/./SupportTests/MathExtras.alignTo (74050 of 75189)
PASS: LLVM-Unit :: Support/./SupportTests/MathExtras.SaturatingMultiplyAdd (74051 of 75189)
PASS: LLVM-Unit :: Support/./SupportTests/MathExtras.NextPowerOf2 (74052 of 75189)
PASS: LLVM-Unit :: Support/./SupportTests/MathExtras.countLeadingOnes (74053 of 75189)
PASS: LLVM-Unit :: Support/./SupportTests/MathExtras.countTrailingZeros (74054 of 75189)
PASS: LLVM-Unit :: Support/./SupportTests/MathExtras.countLeadingZeros (74055 of 75189)
PASS: LLVM-Unit :: Support/./SupportTests/MathExtras.findLastSet (74056 of 75189)
PASS: LLVM-Unit :: Support/./SupportTests/MathExtras.findFirstSet (74057 of 75189)
PASS: LLVM-Unit :: Support/./SupportTests/MathExtras.isPowerOf2_32 (74058 of 75189)
PASS: LLVM-Unit :: Support/./SupportTests/MathExtras.isIntN (74059 of 75189)
PASS: LLVM-Unit :: Support/./SupportTests/MathExtras.isPowerOf2_64 (74060 of 75189)
PASS: LLVM-Unit :: Support/./SupportTests/MathExtras.maxIntN (74061 of 75189)
PASS: LLVM-Unit :: Support/./SupportTests/MathExtras.isUIntN (74062 of 75189)
PASS: LLVM-Unit :: Support/./SupportTests/MathExtras.maxUIntN (74063 of 75189)
PASS: LLVM-Unit :: Support/./SupportTests/MathExtras.minIntN (74064 of 75189)
PASS: LLVM-Unit :: Support/./SupportTests/MathExtras.onesMask (74065 of 75189)
PASS: LLVM-Unit :: Support/./SupportTests/MathExtras.reverseBits (74066 of 75189)
PASS: LLVM-Unit :: Support/./SupportTests/MemoryBufferRefTest.construct (74067 of 75189)
PASS: LLVM-Unit :: Support/./SupportTests/MemoryBufferRefTest.compareEquals (74068 of 75189)
PASS: LLVM-Unit :: Support/./SupportTests/MemoryBufferTest.NullTerminator4K (74069 of 75189)
PASS: LLVM-Unit :: Support/./SupportTests/MemoryBufferTest.copy (74070 of 75189)
PASS: LLVM-Unit :: Support/./SupportTests/MemoryBufferTest.get (74071 of 75189)
PASS: LLVM-Unit :: Support/./SupportTests/MemoryBufferTest.getOpenFile (74072 of 75189)
PASS: LLVM-Unit :: Support/./SupportTests/MemoryBufferTest.make_new (74073 of 75189)
PASS: LLVM-Unit :: Support/./SupportTests/MemoryBufferTest.mmapVolatileNoNull (74074 of 75189)
PASS: LLVM-Unit :: Support/./SupportTests/NativeFormatTest.BasicFloatingPointTests (74075 of 75189)
PASS: LLVM-Unit :: Support/./SupportTests/NativeFormatTest.BasicIntegerTests (74076 of 75189)
PASS: LLVM-Unit :: Support/./SupportTests/MemoryBufferTest.writeThroughFile (74077 of 75189)
PASS: LLVM-Unit :: Support/./SupportTests/NativeFormatTest.CommaTests (74078 of 75189)
PASS: LLVM-Unit :: Support/./SupportTests/NativeFormatTest.BoundaryTests (74079 of 75189)
PASS: LLVM-Unit :: Support/./SupportTests/MemoryBufferTest.writableSlice (74080 of 75189)
PASS: LLVM-Unit :: Support/./SupportTests/MemoryBufferTest.getOpenFileReopened (74081 of 75189)
PASS: LLVM-Unit :: Support/./SupportTests/NativeFormatTest.HexTests (74082 of 75189)
PASS: LLVM-Unit :: Support/./SupportTests/NativeFormatTest.IntegerTests (74083 of 75189)
PASS: LLVM-Unit :: Support/./SupportTests/OptimizedStructLayoutTest.Basic (74084 of 75189)
PASS: LLVM-Unit :: Support/./SupportTests/OptimizedStructLayoutTest.Gaps (74085 of 75189)
PASS: LLVM-Unit :: Support/./SupportTests/OptimizedStructLayoutTest.Greed (74086 of 75189)
PASS: LLVM-Unit :: Support/./SupportTests/OptimizedStructLayoutTest.GardenPath (74087 of 75189)
PASS: LLVM-Unit :: Support/./SupportTests/OptimizedStructLayoutTest.Jagged (74088 of 75189)
PASS: LLVM-Unit :: Support/./SupportTests/OptimizedStructLayoutTest.HighAlignment (74089 of 75189)
PASS: LLVM-Unit :: Support/./SupportTests/OptimizedStructLayoutTest.OddSize (74090 of 75189)
PASS: LLVM-Unit :: Support/./SupportTests/OverflowTest/0.AddNoOverflow (74091 of 75189)
PASS: LLVM-Unit :: Support/./SupportTests/OverflowTest/0.AddOverflowToMax (74092 of 75189)
PASS: LLVM-Unit :: Support/./SupportTests/OverflowTest/0.AddOverflowToMin (74093 of 75189)
PASS: LLVM-Unit :: Support/./SupportTests/MemoryBufferTest.slice (74094 of 75189)
PASS: LLVM-Unit :: Support/./SupportTests/OverflowTest/0.AddOverflowToNegative (74095 of 75189)
PASS: LLVM-Unit :: Support/./SupportTests/OverflowTest/0.AddOverflowToZero (74096 of 75189)
PASS: LLVM-Unit :: Support/./SupportTests/OverflowTest/0.MulNoOverflow (74097 of 75189)
PASS: LLVM-Unit :: Support/./SupportTests/OverflowTest/0.MulNoOverflowToMax (74098 of 75189)
PASS: LLVM-Unit :: Support/./SupportTests/OverflowTest/0.MulOverflowMax (74099 of 75189)
PASS: LLVM-Unit :: Support/./SupportTests/OverflowTest/0.MulOverflowToMin (74100 of 75189)
PASS: LLVM-Unit :: Support/./SupportTests/OverflowTest/0.MulResultZero (74101 of 75189)
PASS: LLVM-Unit :: Support/./SupportTests/OverflowTest/0.SubOverflowToMax (74102 of 75189)
PASS: LLVM-Unit :: Support/./SupportTests/OverflowTest/0.SubOverflowToMin (74103 of 75189)
PASS: LLVM-Unit :: Support/./SupportTests/OverflowTest/0.SubOverflowToNegative (74104 of 75189)
PASS: LLVM-Unit :: Support/./SupportTests/OverflowTest/0.SubNoOverflow (74105 of 75189)
PASS: LLVM-Unit :: Support/./SupportTests/OverflowTest/1.AddNoOverflow (74106 of 75189)
PASS: LLVM-Unit :: Support/./SupportTests/OverflowTest/1.AddOverflowToMin (74107 of 75189)
PASS: LLVM-Unit :: Support/./SupportTests/OverflowTest/0.SubOverflowToPositive (74108 of 75189)
PASS: LLVM-Unit :: Support/./SupportTests/MemoryBufferTest.createFromPipe (74109 of 75189)
PASS: LLVM-Unit :: Support/./SupportTests/OverflowTest/1.AddOverflowToMax (74110 of 75189)
PASS: LLVM-Unit :: Support/./SupportTests/OverflowTest/1.AddOverflowToNegative (74111 of 75189)
PASS: LLVM-Unit :: Support/./SupportTests/OverflowTest/1.AddOverflowToZero (74112 of 75189)
PASS: LLVM-Unit :: Support/./SupportTests/OverflowTest/1.MulNoOverflowToMax (74113 of 75189)
PASS: LLVM-Unit :: Support/./SupportTests/OverflowTest/1.MulNoOverflow (74114 of 75189)
PASS: LLVM-Unit :: Support/./SupportTests/OverflowTest/1.MulResultZero (74115 of 75189)
PASS: LLVM-Unit :: Support/./SupportTests/OverflowTest/1.MulOverflowToMin (74116 of 75189)
PASS: LLVM-Unit :: Support/./SupportTests/OverflowTest/1.MulOverflowMax (74117 of 75189)
PASS: LLVM-Unit :: Support/./SupportTests/OverflowTest/1.SubNoOverflow (74118 of 75189)
PASS: LLVM-Unit :: Support/./SupportTests/OverflowTest/1.SubOverflowToMin (74119 of 75189)
PASS: LLVM-Unit :: Support/./SupportTests/OverflowTest/1.SubOverflowToMax (74120 of 75189)
PASS: LLVM-Unit :: Support/./SupportTests/OverflowTest/1.SubOverflowToNegative (74121 of 75189)
PASS: LLVM-Unit :: Support/./SupportTests/OverflowTest/2.AddOverflowToMin (74122 of 75189)
PASS: LLVM-Unit :: Support/./SupportTests/OverflowTest/1.SubOverflowToPositive (74123 of 75189)
PASS: LLVM-Unit :: Support/./SupportTests/OverflowTest/2.AddNoOverflow (74124 of 75189)
PASS: LLVM-Unit :: Support/./SupportTests/OverflowTest/2.AddOverflowToMax (74125 of 75189)
PASS: LLVM-Unit :: Support/./SupportTests/OverflowTest/2.AddOverflowToNegative (74126 of 75189)
PASS: LLVM-Unit :: Support/./SupportTests/OverflowTest/2.AddOverflowToZero (74127 of 75189)
PASS: LLVM-Unit :: Support/./SupportTests/OverflowTest/2.MulNoOverflow (74128 of 75189)
PASS: LLVM-Unit :: Support/./SupportTests/OverflowTest/2.MulNoOverflowToMax (74129 of 75189)
PASS: LLVM-Unit :: Support/./SupportTests/OverflowTest/2.MulOverflowToMin (74130 of 75189)
PASS: LLVM-Unit :: Support/./SupportTests/OverflowTest/2.SubNoOverflow (74131 of 75189)
PASS: LLVM-Unit :: Support/./SupportTests/OverflowTest/2.MulOverflowMax (74132 of 75189)
PASS: LLVM-Unit :: Support/./SupportTests/OverflowTest/2.SubOverflowToNegative (74133 of 75189)
PASS: LLVM-Unit :: Support/./SupportTests/OverflowTest/2.MulResultZero (74134 of 75189)
PASS: LLVM-Unit :: Support/./SupportTests/OverflowTest/3.AddOverflowToNegative (74135 of 75189)
PASS: LLVM-Unit :: Support/./SupportTests/OverflowTest/2.SubOverflowToPositive (74136 of 75189)
PASS: LLVM-Unit :: Support/./SupportTests/OverflowTest/3.AddNoOverflow (74137 of 75189)
PASS: LLVM-Unit :: Support/./SupportTests/OverflowTest/2.SubOverflowToMax (74138 of 75189)
PASS: LLVM-Unit :: Support/./SupportTests/OverflowTest/2.SubOverflowToMin (74139 of 75189)
PASS: LLVM-Unit :: Support/./SupportTests/OverflowTest/3.AddOverflowToMin (74140 of 75189)
PASS: LLVM-Unit :: Support/./SupportTests/OverflowTest/3.AddOverflowToMax (74141 of 75189)
PASS: LLVM-Unit :: Support/./SupportTests/OverflowTest/3.AddOverflowToZero (74142 of 75189)
PASS: LLVM-Unit :: Support/./SupportTests/OverflowTest/3.MulNoOverflow (74143 of 75189)
PASS: LLVM-Unit :: Support/./SupportTests/OverflowTest/3.MulOverflowToMin (74144 of 75189)
PASS: LLVM-Unit :: Support/./SupportTests/OverflowTest/3.SubOverflowToMax (74145 of 75189)
PASS: LLVM-Unit :: Support/./SupportTests/OverflowTest/3.MulNoOverflowToMax (74146 of 75189)
PASS: LLVM-Unit :: Support/./SupportTests/OverflowTest/3.MulOverflowMax (74147 of 75189)
PASS: LLVM-Unit :: Support/./SupportTests/OverflowTest/3.SubNoOverflow (74148 of 75189)
PASS: LLVM-Unit :: Support/./SupportTests/OverflowTest/3.MulResultZero (74149 of 75189)
PASS: LLVM-Unit :: Support/./SupportTests/OverflowTest/3.SubOverflowToMin (74150 of 75189)
PASS: LLVM-Unit :: Support/./SupportTests/OverflowTest/4.AddNoOverflow (74151 of 75189)
PASS: LLVM-Unit :: Support/./SupportTests/OverflowTest/3.SubOverflowToNegative (74152 of 75189)
PASS: LLVM-Unit :: Support/./SupportTests/OverflowTest/4.AddOverflowToNegative (74153 of 75189)
PASS: LLVM-Unit :: Support/./SupportTests/OverflowTest/4.AddOverflowToMax (74154 of 75189)
PASS: LLVM-Unit :: Support/./SupportTests/OverflowTest/4.AddOverflowToMin (74155 of 75189)
PASS: LLVM-Unit :: Support/./SupportTests/OverflowTest/3.SubOverflowToPositive (74156 of 75189)
PASS: LLVM-Unit :: Support/./SupportTests/OverflowTest/4.AddOverflowToZero (74157 of 75189)
PASS: LLVM-Unit :: Support/./SupportTests/OverflowTest/4.MulOverflowToMin (74158 of 75189)
PASS: LLVM-Unit :: Support/./SupportTests/OverflowTest/4.MulNoOverflowToMax (74159 of 75189)
PASS: LLVM-Unit :: Support/./SupportTests/OverflowTest/4.MulResultZero (74160 of 75189)
PASS: LLVM-Unit :: Support/./SupportTests/OverflowTest/4.MulNoOverflow (74161 of 75189)
PASS: LLVM-Unit :: Support/./SupportTests/OverflowTest/4.SubNoOverflow (74162 of 75189)
PASS: LLVM-Unit :: Support/./SupportTests/OverflowTest/4.MulOverflowMax (74163 of 75189)
PASS: LLVM-Unit :: Support/./SupportTests/OverflowTest/4.SubOverflowToMax (74164 of 75189)
PASS: LLVM-Unit :: Support/./SupportTests/OverflowTest/4.SubOverflowToMin (74165 of 75189)
PASS: LLVM-Unit :: Support/./SupportTests/OverflowTest/4.SubOverflowToNegative (74166 of 75189)
PASS: LLVM-Unit :: Support/./SupportTests/OverflowTest/4.SubOverflowToPositive (74167 of 75189)
PASS: LLVM-Unit :: Support/./SupportTests/PCS_ConfigBuildAttr.testBuildAttr (74168 of 75189)
PASS: LLVM-Unit :: Support/./SupportTests/PCS_ROBuildAttr.testBuildAttr (74169 of 75189)
PASS: LLVM-Unit :: Support/./SupportTests/PCS_GOTBuildAttr.testBuildAttr (74170 of 75189)
PASS: LLVM-Unit :: Support/./SupportTests/PCS_R9BuildAttr.testBuildAttr (74171 of 75189)
PASS: LLVM-Unit :: Support/./SupportTests/PCS_RWBuildAttr.testBuildAttr (74172 of 75189)
PASS: LLVM-Unit :: Support/./SupportTests/ProcessTest.GetRandomNumberTest (74173 of 75189)
PASS: LLVM-Unit :: Support/./SupportTests/PrintOptionInfoTest.PrintOptionInfoMultilineValueDescription (74174 of 75189)
PASS: LLVM-Unit :: Support/./SupportTests/Parallel.ForEachError (74175 of 75189)
PASS: LLVM-Unit :: Support/./SupportTests/PCS_WCharBuildAttr.testBuildAttr (74176 of 75189)
PASS: LLVM-Unit :: Support/./SupportTests/PageSizeTest.PageSize (74177 of 75189)
PASS: LLVM-Unit :: Support/./SupportTests/PrintOptionInfoTest.PrintOptionInfoValueOptionalWithSentinel (74178 of 75189)
PASS: LLVM-Unit :: Support/./SupportTests/PrintOptionInfoTest.PrintOptionInfoEmptyValueDescription (74179 of 75189)
PASS: LLVM-Unit :: Support/./SupportTests/PrintOptionInfoTest.PrintOptionInfoValueOptionalWithSentinelWithHelp (74180 of 75189)
PASS: LLVM-Unit :: Support/./SupportTests/PrintOptionInfoTest.PrintOptionInfoValueOptionalWithoutSentinel (74181 of 75189)
PASS: LLVM-Unit :: Support/./SupportTests/ProcessTest.GetProcessIdTest (74182 of 75189)
PASS: LLVM-Unit :: Support/./SupportTests/PrintOptionInfoTest.PrintOptionInfoValueRequiredWithEmptyValueName (74183 of 75189)
PASS: LLVM-Unit :: Support/./SupportTests/Parallel.parallel_for (74184 of 75189)
PASS: LLVM-Unit :: Support/./SupportTests/ProgramTest.TestExecuteNegative (74185 of 75189)
PASS: LLVM-Unit :: Support/./SupportTests/ProxyFileSystemTest.Basic (74186 of 75189)
PASS: LLVM-Unit :: Support/./SupportTests/RegexTest.Backreferences (74187 of 75189)
PASS: LLVM-Unit :: Support/./SupportTests/ProgramTest.TestWriteWithSystemEncoding (74188 of 75189)
PASS: LLVM-Unit :: Support/./SupportTests/Parallel.TransformReduce (74189 of 75189)
PASS: LLVM-Unit :: Support/./SupportTests/ProgramEnvTest.CreateProcessTrailingSlash (74190 of 75189)
PASS: LLVM-Unit :: Support/./SupportTests/RegexTest.IsLiteralERE (74191 of 75189)
PASS: LLVM-Unit :: Support/./SupportTests/RegexTest.Escape (74192 of 75189)
PASS: LLVM-Unit :: Support/./SupportTests/RegexTest.Basics (74193 of 75189)
PASS: LLVM-Unit :: Support/./SupportTests/Parallel.sort (74194 of 75189)
PASS: LLVM-Unit :: Support/./SupportTests/ProgramEnvTest.TestExecuteAndWaitStatistics (74195 of 75189)
PASS: LLVM-Unit :: Support/./SupportTests/RegexTest.IsValid (74196 of 75189)
PASS: LLVM-Unit :: Support/./SupportTests/RegexTest.MatchInvalid (74197 of 75189)
PASS: LLVM-Unit :: Support/./SupportTests/RegexTest.MoveConstruct (74198 of 75189)
PASS: LLVM-Unit :: Support/./SupportTests/RegexTest.MoveAssign (74199 of 75189)
PASS: LLVM-Unit :: Support/./SupportTests/RegexTest.OssFuzz3727Regression (74200 of 75189)
PASS: LLVM-Unit :: Support/./SupportTests/RegexTest.Substitution (74201 of 75189)
PASS: LLVM-Unit :: Support/./SupportTests/RegexTest.NoArgConstructor (74202 of 75189)
PASS: LLVM-Unit :: Support/./SupportTests/ReverseIterationTest.DenseMapTest1 (74203 of 75189)
PASS: LLVM-Unit :: Support/./SupportTests/ReverseIterationTest.DenseMapTest2 (74204 of 75189)
PASS: LLVM-Unit :: Support/./SupportTests/SIMDBuildAttr.testBuildAttr (74205 of 75189)
PASS: LLVM-Unit :: Support/./SupportTests/ScaledNumberHelpersTest.compare (74206 of 75189)
PASS: LLVM-Unit :: Support/./SupportTests/ScaledNumberHelpersTest.arithmeticOperators (74207 of 75189)
PASS: LLVM-Unit :: Support/./SupportTests/SHA256Test.SHA256 (74208 of 75189)
PASS: LLVM-Unit :: Support/./SupportTests/ScaledNumberHelpersTest.getAdjusted (74209 of 75189)
PASS: LLVM-Unit :: Support/./SupportTests/ScaledNumberHelpersTest.getDifference (74210 of 75189)
PASS: LLVM-Unit :: Support/./SupportTests/ScaledNumberHelpersTest.getLg (74211 of 75189)
PASS: LLVM-Unit :: Support/./SupportTests/ScaledNumberHelpersTest.getLgCeiling (74212 of 75189)
PASS: LLVM-Unit :: Support/./SupportTests/ScaledNumberHelpersTest.getProduct (74213 of 75189)
PASS: LLVM-Unit :: Support/./SupportTests/ScaledNumberHelpersTest.getRounded (74214 of 75189)
PASS: LLVM-Unit :: Support/./SupportTests/ScaledNumberHelpersTest.getLgFloor (74215 of 75189)
PASS: LLVM-Unit :: Support/./SupportTests/ScaledNumberHelpersTest.getQuotient (74216 of 75189)
PASS: LLVM-Unit :: Support/./SupportTests/ScaledNumberHelpersTest.matchScales (74217 of 75189)
PASS: LLVM-Unit :: Support/./SupportTests/ScaledNumberHelpersTest.getSum (74218 of 75189)
PASS: LLVM-Unit :: Support/./SupportTests/ScaledNumberHelpersTest.toIntBug (74219 of 75189)
PASS: LLVM-Unit :: Support/./SupportTests/SourceMgrTest.BasicError (74220 of 75189)
PASS: LLVM-Unit :: Support/./SupportTests/SourceMgrTest.BasicNote (74221 of 75189)
PASS: LLVM-Unit :: Support/./SupportTests/SourceMgrTest.BasicRange (74222 of 75189)
PASS: LLVM-Unit :: Support/./SupportTests/SourceMgrTest.BasicFixit (74223 of 75189)
PASS: LLVM-Unit :: Support/./SupportTests/SourceMgrTest.BasicWarning (74224 of 75189)
PASS: LLVM-Unit :: Support/./SupportTests/SourceMgrTest.LocationAtEmptyBuffer (74225 of 75189)
PASS: LLVM-Unit :: Support/./SupportTests/SourceMgrTest.LocationAtEndOf255ByteBuffer (74226 of 75189)
PASS: LLVM-Unit :: Support/./SupportTests/SourceMgrTest.BasicRemark (74227 of 75189)
PASS: LLVM-Unit :: Support/./SupportTests/SourceMgrTest.FixitForTab (74228 of 75189)
PASS: LLVM-Unit :: Support/./SupportTests/SourceMgrTest.LocationAtEndOf255ByteBufferEndingInNewline (74229 of 75189)
PASS: LLVM-Unit :: Support/./SupportTests/SourceMgrTest.LocationAtEndOf256ByteBuffer (74230 of 75189)
PASS: LLVM-Unit :: Support/./SupportTests/SourceMgrTest.LocationAtEndOf256ByteBufferEndingInNewline (74231 of 75189)
PASS: LLVM-Unit :: Support/./SupportTests/SourceMgrTest.LocationAtEndOf257ByteBuffer (74232 of 75189)
PASS: LLVM-Unit :: Support/./SupportTests/SourceMgrTest.LocationAtEndOf257ByteBufferEndingInNewline (74233 of 75189)
PASS: LLVM-Unit :: Support/./SupportTests/SourceMgrTest.LocationAtEndOfLine (74234 of 75189)
PASS: LLVM-Unit :: Support/./SupportTests/SourceMgrTest.LocationBeforeEndOf255ByteBuffer (74235 of 75189)
PASS: LLVM-Unit :: Support/./SupportTests/SourceMgrTest.LocationAtNewline (74236 of 75189)
PASS: LLVM-Unit :: Support/./SupportTests/SourceMgrTest.LocationBeforeEndOf255ByteBufferEndingInNewline (74237 of 75189)
PASS: LLVM-Unit :: Support/./SupportTests/SourceMgrTest.LocationBeforeEndOf256ByteBufferEndingInNewline (74238 of 75189)
PASS: LLVM-Unit :: Support/./SupportTests/SourceMgrTest.LocationBeforeEndOf257ByteBuffer (74239 of 75189)
PASS: LLVM-Unit :: Support/./SupportTests/SourceMgrTest.LocationBeforeEndOf256ByteBuffer (74240 of 75189)
PASS: LLVM-Unit :: Support/./SupportTests/SourceMgrTest.LocationJustAfterSoleNewline (74241 of 75189)
PASS: LLVM-Unit :: Support/./SupportTests/SourceMgrTest.LocationBeforeEndOf257ByteBufferEndingInNewline (74242 of 75189)
PASS: LLVM-Unit :: Support/./SupportTests/SourceMgrTest.LocationJustAfterNonNewline (74243 of 75189)
PASS: LLVM-Unit :: Support/./SupportTests/ProgramEnvTest.TestLockFile (74244 of 75189)
PASS: LLVM-Unit :: Support/./SupportTests/SourceMgrTest.LocationJustOnSoleNewline (74245 of 75189)
PASS: LLVM-Unit :: Support/./SupportTests/SourceMgrTest.LocationOnEOLOfFirstLineOfMultiline (74246 of 75189)
PASS: LLVM-Unit :: Support/./SupportTests/SourceMgrTest.LocationOnFirstLineOfMultiline (74247 of 75189)
PASS: LLVM-Unit :: Support/./SupportTests/SourceMgrTest.LocationOnSecondLineOfMultilineNoSecondEOL (74248 of 75189)
PASS: LLVM-Unit :: Support/./SupportTests/SourceMgrTest.LocationPastEndOf256ByteBuffer (74249 of 75189)
PASS: LLVM-Unit :: Support/./SupportTests/SourceMgrTest.LocationOnEOLOfSecondSecondLineOfMultiline (74250 of 75189)
PASS: LLVM-Unit :: Support/./SupportTests/SourceMgrTest.LocationPastEndOf255ByteBuffer (74251 of 75189)
PASS: LLVM-Unit :: Support/./SupportTests/SourceMgrTest.LocationPastEndOf255ByteBufferEndingInNewline (74252 of 75189)
PASS: LLVM-Unit :: Support/./SupportTests/SourceMgrTest.LocationOnSecondLineOfMultiline (74253 of 75189)
PASS: LLVM-Unit :: Support/./SupportTests/SourceMgrTest.LocationPastEndOf256ByteBufferEndingInNewline (74254 of 75189)
PASS: LLVM-Unit :: Support/./SupportTests/SourceMgrTest.LocationPastEndOf257ByteBufferEndingInNewline (74255 of 75189)
PASS: LLVM-Unit :: Support/./SupportTests/SourceMgrTest.LocationPastEndOf257ByteBuffer (74256 of 75189)
PASS: LLVM-Unit :: Support/./SupportTests/SourceMgrTest.MultiLineRange (74257 of 75189)
PASS: LLVM-Unit :: Support/./SupportTests/SourceMgrTest.MultipleRanges (74258 of 75189)
PASS: LLVM-Unit :: Support/./SupportTests/SourceMgrTest.RangeWithTab (74259 of 75189)
PASS: LLVM-Unit :: Support/./SupportTests/SourceMgrTest.OverlappingRanges (74260 of 75189)
PASS: LLVM-Unit :: Support/./SupportTests/SpecialCaseListTest.Basic (74261 of 75189)
PASS: LLVM-Unit :: Support/./SupportTests/SpecialCaseListTest.EmptySpecialCaseList (74262 of 75189)
PASS: LLVM-Unit :: Support/./SupportTests/SpecialCaseListTest.CorrectErrorLineNumberWithBlankLine (74263 of 75189)
PASS: LLVM-Unit :: Support/./SupportTests/SpecialCaseListTest.EscapedSymbols (74264 of 75189)
PASS: LLVM-Unit :: Support/./SupportTests/SpecialCaseListTest.GlobalInit (74265 of 75189)
PASS: LLVM-Unit :: Support/./SupportTests/SpecialCaseListTest.InvalidSpecialCaseList (74266 of 75189)
PASS: LLVM-Unit :: Support/./SupportTests/SpecialCaseListTest.NoTrigramsInARule (74267 of 75189)
PASS: LLVM-Unit :: Support/./SupportTests/SpecialCaseListTest.MultipleExclusions (74268 of 75189)
PASS: LLVM-Unit :: Support/./SupportTests/SpecialCaseListTest.PopularTrigram (74269 of 75189)
PASS: LLVM-Unit :: Support/./SupportTests/SpecialCaseListTest.NoTrigramsInRules (74270 of 75189)
PASS: LLVM-Unit :: Support/./SupportTests/SpecialCaseListTest.RepetitiveRule (74271 of 75189)
PASS: LLVM-Unit :: Support/./SupportTests/SpecialCaseListTest.SpecialSymbolRule (74272 of 75189)
PASS: LLVM-Unit :: Support/./SupportTests/SpecialCaseListTest.Section (74273 of 75189)
PASS: LLVM-Unit :: Support/./SupportTests/SpecialCaseListTest.Substring (74274 of 75189)
PASS: LLVM-Unit :: Support/./SupportTests/SpecialCaseListTest.SectionRegexErrorHandling (74275 of 75189)
PASS: LLVM-Unit :: Support/./SupportTests/SuffixTreeTest.TestLongerRepetition (74276 of 75189)
PASS: LLVM-Unit :: Support/./SupportTests/SuffixTreeTest.TestSingleCharacterRepeat (74277 of 75189)
PASS: LLVM-Unit :: Support/./SupportTests/StackAlign.testAttribute (74278 of 75189)
PASS: LLVM-Unit :: Support/./SupportTests/SuffixTreeTest.TestExclusion (74279 of 75189)
PASS: LLVM-Unit :: Support/./SupportTests/SuffixTreeTest.TestSingleRepetition (74280 of 75189)
PASS: LLVM-Unit :: Support/./SupportTests/SuffixTreeTest.TestTandemRepeat (74281 of 75189)
PASS: LLVM-Unit :: Support/./SupportTests/Support.AbsolutePathIteratorEnd (74282 of 75189)
PASS: LLVM-Unit :: Support/./SupportTests/Support.ConfigDirectory (74283 of 75189)
PASS: LLVM-Unit :: Support/./SupportTests/Support.FilenameParent (74284 of 75189)
PASS: LLVM-Unit :: Support/./SupportTests/Support.NormalizePath (74285 of 75189)
PASS: LLVM-Unit :: Support/./SupportTests/Support.HomeDirectory (74286 of 75189)
PASS: LLVM-Unit :: Support/./SupportTests/Support.PathRoot (74287 of 75189)
PASS: LLVM-Unit :: Support/./SupportTests/Support.RemoveDots (74288 of 75189)
PASS: LLVM-Unit :: Support/./SupportTests/Support.RemoveLeadingDotSlash (74289 of 75189)
PASS: LLVM-Unit :: Support/./SupportTests/Support.PathIterator (74290 of 75189)
PASS: LLVM-Unit :: Support/./SupportTests/Support.Path (74291 of 75189)
PASS: LLVM-Unit :: Support/./SupportTests/Support.ReplacePathPrefix (74292 of 75189)
PASS: LLVM-Unit :: Support/./SupportTests/Support.TempDirectory (74293 of 75189)
PASS: LLVM-Unit :: Support/./SupportTests/SymbolRemappingReaderTest.BadMappingOrder (74294 of 75189)
PASS: LLVM-Unit :: Support/./SupportTests/SymbolRemappingReaderTest.DemanglingErrors (74295 of 75189)
PASS: LLVM-Unit :: Support/./SupportTests/SymbolRemappingReaderTest.ParseErrors (74296 of 75189)
PASS: LLVM-Unit :: Support/./SupportTests/SymbolRemappingReaderTest.RemappingsAdded (74297 of 75189)
PASS: LLVM-Unit :: Support/./SupportTests/T2EEBuildAttr.testBuildAttr (74298 of 75189)
PASS: LLVM-Unit :: Support/./SupportTests/TarWriterTest.Basics (74299 of 75189)
PASS: LLVM-Unit :: Support/./SupportTests/TarWriterTest.NoDuplicate (74300 of 75189)
PASS: LLVM-Unit :: Support/./SupportTests/TargetParserTest.AArch64ArchExtFeature (74301 of 75189)
PASS: LLVM-Unit :: Support/./SupportTests/TarWriterTest.Pax (74302 of 75189)
PASS: LLVM-Unit :: Support/./SupportTests/TargetParserTest.AArch64ArchFeatures (74303 of 75189)
PASS: LLVM-Unit :: Support/./SupportTests/TarWriterTest.Duplicate (74304 of 75189)
PASS: LLVM-Unit :: Support/./SupportTests/TarWriterTest.SingleFile (74305 of 75189)
PASS: LLVM-Unit :: Support/./SupportTests/TargetParserTest.AArch64ExtensionFeatures (74306 of 75189)
PASS: LLVM-Unit :: Support/./SupportTests/TargetParserTest.ARMArchExtDependencies (74307 of 75189)
PASS: LLVM-Unit :: Support/./SupportTests/TargetParserTest.ARMArchExtFeature (74308 of 75189)
PASS: LLVM-Unit :: Support/./SupportTests/TarWriterTest.LongFilename (74309 of 75189)
PASS: LLVM-Unit :: Support/./SupportTests/TargetParserTest.ARMExtensionFeatures (74310 of 75189)
PASS: LLVM-Unit :: Support/./SupportTests/TargetParserTest.ARMFPUNeonSupportLevel (74311 of 75189)
PASS: LLVM-Unit :: Support/./SupportTests/TargetParserTest.ARMFPUFeatures (74312 of 75189)
PASS: LLVM-Unit :: Support/./SupportTests/TargetParserTest.ARMFPURestriction (74313 of 75189)
PASS: LLVM-Unit :: Support/./SupportTests/TargetParserTest.ARMparseArchEndianAndISA (74314 of 75189)
PASS: LLVM-Unit :: Support/./SupportTests/TargetParserTest.testAArch64Arch (74315 of 75189)
PASS: LLVM-Unit :: Support/./SupportTests/TargetParserTest.ARMparseArchProfile (74316 of 75189)
PASS: LLVM-Unit :: Support/./SupportTests/TargetParserTest.ARMFPUVersion (74317 of 75189)
PASS: LLVM-Unit :: Support/./SupportTests/TargetParserTest.testAArch64CPUArchList (74318 of 75189)
PASS: LLVM-Unit :: Support/./SupportTests/TargetParserTest.ARMparseArchVersion (74319 of 75189)
PASS: LLVM-Unit :: Support/./SupportTests/TargetParserTest.testAArch64Extension (74320 of 75189)
PASS: LLVM-Unit :: Support/./SupportTests/TargetParserTest.ARMparseHWDiv (74321 of 75189)
PASS: LLVM-Unit :: Support/./SupportTests/TargetParserTest.testARMArch (74322 of 75189)
PASS: LLVM-Unit :: Support/./SupportTests/TargetParserTest.testARMCPUArchList (74323 of 75189)
PASS: LLVM-Unit :: Support/./SupportTests/TargetParserTest.testARMExtension (74324 of 75189)
PASS: LLVM-Unit :: Support/./SupportTests/TargetParserTest.testInvalidARMArch (74325 of 75189)
PASS: LLVM-Unit :: Support/./SupportTests/TaskQueueTest.FutureWithReturnValue (74326 of 75189)
PASS: LLVM-Unit :: Support/./SupportTests/TaskQueueTest.UnOrderedFutures (74327 of 75189)
PASS: LLVM-Unit :: Support/./SupportTests/ThreadPoolTest.AsyncBarrier (74328 of 75189)
PASS: LLVM-Unit :: Support/./SupportTests/ThreadPoolTest.Async (74329 of 75189)
PASS: LLVM-Unit :: Support/./SupportTests/ThreadLocalTest.Basics (74330 of 75189)
PASS: LLVM-Unit :: Support/./SupportTests/TaskQueueTest.OrderedFutures (74331 of 75189)
PASS: LLVM-Unit :: Support/./SupportTests/ThreadPoolTest.GetFuture (74332 of 75189)
PASS: LLVM-Unit :: Support/./SupportTests/ThreadPoolTest.PoolDestruction (74333 of 75189)
PASS: LLVM-Unit :: Support/./SupportTests/ThreadPoolTest.AsyncBarrierArgs (74334 of 75189)
PASS: LLVM-Unit :: Support/./SupportTests/Threading.AppleStackSize (74335 of 75189)
PASS: LLVM-Unit :: Support/./SupportTests/Threading.PhysicalConcurrency (74336 of 75189)
PASS: LLVM-Unit :: Support/./SupportTests/Threading.RunOnThreadSync (74337 of 75189)
PASS: LLVM-Unit :: Support/./SupportTests/ThumbISABuildAttr.testBuildAttr (74338 of 75189)
PASS: LLVM-Unit :: Support/./SupportTests/Threading.RunOnThreadSyncAsync (74339 of 75189)
PASS: LLVM-Unit :: Support/./SupportTests/TrailingObjects.OneArg (74340 of 75189)
PASS: LLVM-Unit :: Support/./SupportTests/ToolOutputFileTest.DashOpensOuts (74341 of 75189)
PASS: LLVM-Unit :: Support/./SupportTests/Timer.CheckIfTriggered (74342 of 75189)
PASS: LLVM-Unit :: Support/./SupportTests/TrailingObjects.TwoArg (74343 of 75189)
PASS: LLVM-Unit :: Support/./SupportTests/Timer.Additivity (74344 of 75189)
PASS: LLVM-Unit :: Support/./SupportTests/TrailingObjects.ThreeArg (74345 of 75189)
PASS: LLVM-Unit :: Support/./SupportTests/TrailingObjects.Realignment (74346 of 75189)
PASS: LLVM-Unit :: Support/./SupportTests/TrigramIndexTest.Backreference1 (74347 of 75189)
PASS: LLVM-Unit :: Support/./SupportTests/TrigramIndexTest.Basic (74348 of 75189)
PASS: LLVM-Unit :: Support/./SupportTests/TrigramIndexTest.Backreference2 (74349 of 75189)
PASS: LLVM-Unit :: Support/./SupportTests/TrigramIndexTest.Empty (74350 of 75189)
PASS: LLVM-Unit :: Support/./SupportTests/TrigramIndexTest.NoTrigramsInARule (74351 of 75189)
PASS: LLVM-Unit :: Support/./SupportTests/TrigramIndexTest.EscapedSymbols (74352 of 75189)
PASS: LLVM-Unit :: Support/./SupportTests/TrigramIndexTest.PopularTrigram (74353 of 75189)
PASS: LLVM-Unit :: Support/./SupportTests/TrigramIndexTest.PopularTrigram2 (74354 of 75189)
PASS: LLVM-Unit :: Support/./SupportTests/TrigramIndexTest.Sequence (74355 of 75189)
PASS: LLVM-Unit :: Support/./SupportTests/TrigramIndexTest.RepetitiveRule (74356 of 75189)
PASS: LLVM-Unit :: Support/./SupportTests/TrigramIndexTest.TooComplicatedRegex (74357 of 75189)
PASS: LLVM-Unit :: Support/./SupportTests/TrigramIndexTest.NoTrigramsInRules (74358 of 75189)
PASS: LLVM-Unit :: Support/./SupportTests/Triviality.ADT (74359 of 75189)
PASS: LLVM-Unit :: Support/./SupportTests/TrigramIndexTest.TooComplicatedRegex2 (74360 of 75189)
PASS: LLVM-Unit :: Support/./SupportTests/Triviality.Tester (74361 of 75189)
PASS: LLVM-Unit :: Support/./SupportTests/TypeNameTest.Names (74362 of 75189)
PASS: LLVM-Unit :: Support/./SupportTests/Unicode.columnWidthUTF8 (74363 of 75189)
PASS: LLVM-Unit :: Support/./SupportTests/Unicode.isPrintable (74364 of 75189)
PASS: LLVM-Unit :: Support/./SupportTests/UnalignedAccess.testAttribute (74365 of 75189)
PASS: LLVM-Unit :: Support/./SupportTests/UnivariateLinearPolyBase.Univariate3D_Equality (74366 of 75189)
PASS: LLVM-Unit :: Support/./SupportTests/MemoryBufferTest.getOpenFileNoReopen (74367 of 75189)
PASS: LLVM-Unit :: Support/./SupportTests/UnivariateLinearPolyBase.Univariate3D_GetValue (74368 of 75189)
PASS: LLVM-Unit :: Support/./SupportTests/UnivariateLinearPolyBase.Univariate3D_Scale (74369 of 75189)
PASS: LLVM-Unit :: Support/./SupportTests/UnivariateLinearPolyBase.Univariate3D_Invert (74370 of 75189)
PASS: LLVM-Unit :: Support/./SupportTests/UnivariateLinearPolyBase.Univariate3D_isZero (74371 of 75189)
PASS: LLVM-Unit :: Support/./SupportTests/VFSFromRemappedFilesTest.Basic (74372 of 75189)
PASS: LLVM-Unit :: Support/./SupportTests/VFPArgsBuildAttr.testBuildAttr (74373 of 75189)
PASS: LLVM-Unit :: Support/./SupportTests/VFSFromRemappedFilesTest.LastMappingWins (74374 of 75189)
PASS: LLVM-Unit :: Support/./SupportTests/UnivariateLinearPolyBase.Univariate3D_Sub (74375 of 75189)
PASS: LLVM-Unit :: Support/./SupportTests/UnivariateLinearPolyBase.Univariate3D_Add (74376 of 75189)
PASS: LLVM-Unit :: Support/./SupportTests/VFSFromYAMLTest.BasicVFSFromYAML (74377 of 75189)
PASS: LLVM-Unit :: Support/./SupportTests/VFSFromRemappedFilesTest.UseExternalNames (74378 of 75189)
PASS: LLVM-Unit :: Support/./SupportTests/VFSFromYAMLTest.CaseInsensitive (74379 of 75189)
PASS: LLVM-Unit :: Support/./SupportTests/VFSFromYAMLTest.CaseSensitive (74380 of 75189)
PASS: LLVM-Unit :: Support/./SupportTests/VFSFromYAMLTest.DirectoryIteration (74381 of 75189)
PASS: LLVM-Unit :: Support/./SupportTests/VFSFromYAMLTest.DirectoryIterationErrorInVFSLayer (74382 of 75189)
PASS: LLVM-Unit :: Support/./SupportTests/VFSFromYAMLTest.DirectoryIterationWithDuplicates (74383 of 75189)
PASS: LLVM-Unit :: Support/./SupportTests/VFSFromYAMLTest.DirectoryIterationSameDirMultipleEntries (74384 of 75189)
PASS: LLVM-Unit :: Support/./SupportTests/VFSFromYAMLTest.MappedFiles (74385 of 75189)
PASS: LLVM-Unit :: Support/./SupportTests/VFSFromYAMLTest.IllegalVFSFile (74386 of 75189)
PASS: LLVM-Unit :: Support/./SupportTests/VFSFromYAMLTest.GetRealPath (74387 of 75189)
PASS: LLVM-Unit :: Support/./SupportTests/VFSFromYAMLTest.MappedRoot (74388 of 75189)
PASS: LLVM-Unit :: Support/./SupportTests/VFSFromYAMLTest.MultiComponentPath (74389 of 75189)
PASS: LLVM-Unit :: Support/./SupportTests/VFSFromYAMLTest.NonFallthroughDirectoryIteration (74390 of 75189)
PASS: LLVM-Unit :: Support/./SupportTests/VFSFromYAMLTest.RecursiveDirectoryIterationLevel (74391 of 75189)
PASS: LLVM-Unit :: Support/./SupportTests/VFSFromYAMLTest.RelativePaths (74392 of 75189)
PASS: LLVM-Unit :: Support/./SupportTests/VFSFromYAMLTest.RemappedDirectoryOverlayNoFallthrough (74393 of 75189)
PASS: LLVM-Unit :: Support/./SupportTests/VFSFromYAMLTest.RemappedDirectoryOverlayNoExternalNames (74394 of 75189)
PASS: LLVM-Unit :: Support/./SupportTests/VFSFromYAMLTest.RemappedDirectoryOverlay (74395 of 75189)
PASS: LLVM-Unit :: Support/./SupportTests/VFSFromYAMLTest.UseExternalName (74396 of 75189)
PASS: LLVM-Unit :: Support/./SupportTests/VFSFromYAMLTest.VirtualWorkingDirectory (74397 of 75189)
PASS: LLVM-Unit :: Support/./SupportTests/VFSFromYAMLTest.TrailingSlashes (74398 of 75189)
PASS: LLVM-Unit :: Support/./SupportTests/VFSFromYAMLTest.WorkingDirectoryFallthroughInvalid (74399 of 75189)
PASS: LLVM-Unit :: Support/./SupportTests/VFSFromYAMLTest.WorkingDirectoryFallthrough (74400 of 75189)
PASS: LLVM-Unit :: Support/./SupportTests/VFSFromYAMLTest.WorkingDirectory (74401 of 75189)
PASS: LLVM-Unit :: Support/./SupportTests/VFSFromYAMLTest.YAMLVFSWriterTest (74402 of 75189)
PASS: LLVM-Unit :: Support/./SupportTests/VersionTuple.tryParse (74403 of 75189)
PASS: LLVM-Unit :: Support/./SupportTests/VersionTuple.getAsString (74404 of 75189)
PASS: LLVM-Unit :: Support/./SupportTests/VFSFromYAMLTest.YAMLVFSWriterTestHandleDirs (74405 of 75189)
PASS: LLVM-Unit :: Support/./SupportTests/VirtualFileSystemTest.BaseOnlyOverlay (74406 of 75189)
PASS: LLVM-Unit :: Support/./SupportTests/VFSFromYAMLTest.YAMLVFSWriterTest2 (74407 of 75189)
PASS: LLVM-Unit :: Support/./SupportTests/VFSFromYAMLTest.YAMLVFSWriterTest3 (74408 of 75189)
PASS: LLVM-Unit :: Support/./SupportTests/VirtualFileSystemTest.GetRealPathInOverlay (74409 of 75189)
PASS: LLVM-Unit :: Support/./SupportTests/VirtualFileSystemTest.HiddenInIteration (74410 of 75189)
PASS: LLVM-Unit :: Support/./SupportTests/VirtualFileSystemTest.BasicRealFSIteration (74411 of 75189)
PASS: LLVM-Unit :: Support/./SupportTests/VirtualFileSystemTest.BrokenSymlinkRealFSIteration (74412 of 75189)
PASS: LLVM-Unit :: Support/./SupportTests/VirtualFileSystemTest.BasicRealFSRecursiveIteration (74413 of 75189)
PASS: LLVM-Unit :: Support/./SupportTests/VirtualFileSystemTest.BasicRealFSRecursiveIterationNoPush (74414 of 75189)
PASS: LLVM-Unit :: Support/./SupportTests/VirtualFileSystemTest.BrokenSymlinkRealFSRecursiveIteration (74415 of 75189)
PASS: LLVM-Unit :: Support/./SupportTests/VirtualFileSystemTest.MergedDirPermissions (74416 of 75189)
PASS: LLVM-Unit :: Support/./SupportTests/VirtualFileSystemTest.OverlayDirsNonMerged (74417 of 75189)
PASS: LLVM-Unit :: Support/./SupportTests/VirtualFileSystemTest.OverlayFiles (74418 of 75189)
PASS: LLVM-Unit :: Support/./SupportTests/VirtualFileSystemTest.OverlayIteration (74419 of 75189)
PASS: LLVM-Unit :: Support/./SupportTests/VirtualFileSystemTest.OverlayIterator (74420 of 75189)
PASS: LLVM-Unit :: Support/./SupportTests/VirtualFileSystemTest.StatusQueries (74421 of 75189)
PASS: LLVM-Unit :: Support/./SupportTests/VirtualFileSystemTest.OverlayRecursiveIteration (74422 of 75189)
PASS: LLVM-Unit :: Support/./SupportTests/VirtualizationBuildAttr.testBuildAttr (74423 of 75189)
PASS: LLVM-Unit :: Support/./SupportTests/VirtualFileSystemTest.ThreeLevelIteration (74424 of 75189)
PASS: LLVM-Unit :: Support/./SupportTests/VirtualFileSystemTest.MultipleWorkingDirs (74425 of 75189)
PASS: LLVM-Unit :: Support/./SupportTests/WMMXArgsBuildAttr.testBuildAttr (74426 of 75189)
PASS: LLVM-Unit :: Support/./SupportTests/WMMXBuildAttr.testBuildAttr (74427 of 75189)
PASS: LLVM-Unit :: Support/./SupportTests/WithColorTest.ColorMode (74428 of 75189)
PASS: LLVM-Unit :: Support/./SupportTests/YAMLIO.MultilineStrings (74429 of 75189)
PASS: LLVM-Unit :: Support/./SupportTests/YAMLIO.NoQuotesForTab (74430 of 75189)
PASS: LLVM-Unit :: Support/./SupportTests/YAMLIO.TestAnchorMapError (74431 of 75189)
PASS: LLVM-Unit :: Support/./SupportTests/YAMLIO.Numeric (74432 of 75189)
PASS: LLVM-Unit :: Support/./SupportTests/YAMLIO.TestColorsReadError (74433 of 75189)
PASS: LLVM-Unit :: Support/./SupportTests/YAMLIO.SequenceElideTest (74434 of 75189)
PASS: LLVM-Unit :: Support/./SupportTests/YAMLIO.TestContainerSequenceMapRead (74435 of 75189)
PASS: LLVM-Unit :: Support/./SupportTests/YAMLIO.TestCustomMapping (74436 of 75189)
PASS: LLVM-Unit :: Support/./SupportTests/YAMLIO.TestCustomMappingStruct (74437 of 75189)
PASS: LLVM-Unit :: Support/./SupportTests/YAMLIO.TestDocRead (74438 of 75189)
PASS: LLVM-Unit :: Support/./SupportTests/YAMLIO.TestDirectiveMappingNoValue (74439 of 75189)
PASS: LLVM-Unit :: Support/./SupportTests/YAMLIO.TestEmptyAnchor (74440 of 75189)
PASS: LLVM-Unit :: Support/./SupportTests/YAMLIO.TestEmptyAlias (74441 of 75189)
PASS: LLVM-Unit :: Support/./SupportTests/YAMLIO.TestEmptyMapWrite (74442 of 75189)
PASS: LLVM-Unit :: Support/./SupportTests/YAMLIO.TestEmptySequenceWrite (74443 of 75189)
PASS: LLVM-Unit :: Support/./SupportTests/YAMLIO.TestEmptyStringFailsForMapWithRequiredFields (74444 of 75189)
PASS: LLVM-Unit :: Support/./SupportTests/YAMLIO.TestEnumRead (74445 of 75189)
PASS: LLVM-Unit :: Support/./SupportTests/YAMLIO.TestEscaped (74446 of 75189)
PASS: LLVM-Unit :: Support/./SupportTests/YAMLIO.TestEmptyStringSucceedsForSequence (74447 of 75189)
PASS: LLVM-Unit :: Support/./SupportTests/YAMLIO.TestFlagsRead (74448 of 75189)
PASS: LLVM-Unit :: Support/./SupportTests/YAMLIO.TestEmptyStringSucceedsForMapWithOptionalFields (74449 of 75189)
PASS: LLVM-Unit :: Support/./SupportTests/YAMLIO.TestFlagsReadError (74450 of 75189)
PASS: LLVM-Unit :: Support/./SupportTests/YAMLIO.TestFlowSequenceTokenErrors (74451 of 75189)
PASS: LLVM-Unit :: Support/./SupportTests/YAMLIO.TestGivenFilename (74452 of 75189)
PASS: LLVM-Unit :: Support/./SupportTests/YAMLIO.TestMalformedMapRead (74453 of 75189)
PASS: LLVM-Unit :: Support/./SupportTests/YAMLIO.TestMapRead (74454 of 75189)
PASS: LLVM-Unit :: Support/./SupportTests/YAMLIO.TestMalformedContainerSequenceMapRead (74455 of 75189)
PASS: LLVM-Unit :: Support/./SupportTests/YAMLIO.TestMalformedMapFailsGracefully (74456 of 75189)
PASS: LLVM-Unit :: Support/./SupportTests/YAMLIO.TestMapWithContext (74457 of 75189)
PASS: LLVM-Unit :: Support/./SupportTests/YAMLIO.TestReadBuiltInTypes (74458 of 75189)
PASS: LLVM-Unit :: Support/./SupportTests/YAMLIO.TestReadBuiltInTypesDoubleError (74459 of 75189)
PASS: LLVM-Unit :: Support/./SupportTests/YAMLIO.TestReadBuiltInTypesHex32Error (74460 of 75189)
PASS: LLVM-Unit :: Support/./SupportTests/YAMLIO.TestReadBuiltInTypesFloatError (74461 of 75189)
PASS: LLVM-Unit :: Support/./SupportTests/YAMLIO.TestReadBuiltInTypesHex16Error (74462 of 75189)
PASS: LLVM-Unit :: Support/./SupportTests/YAMLIO.TestReadBuiltInTypesHex8Error (74463 of 75189)
PASS: LLVM-Unit :: Support/./SupportTests/YAMLIO.TestReadBuiltInTypesHex64Error (74464 of 75189)
PASS: LLVM-Unit :: Support/./SupportTests/YAMLIO.TestReadBuiltInTypesUint64Error (74465 of 75189)
PASS: LLVM-Unit :: Support/./SupportTests/YAMLIO.TestReadBuiltInTypesUint32Error (74466 of 75189)
PASS: LLVM-Unit :: Support/./SupportTests/YAMLIO.TestReadBuiltInTypesint16OverError (74467 of 75189)
PASS: LLVM-Unit :: Support/./SupportTests/YAMLIO.TestReadBuiltInTypesint16UnderError (74468 of 75189)
PASS: LLVM-Unit :: Support/./SupportTests/YAMLIO.TestReadBuiltInTypesUint8Error (74469 of 75189)
PASS: LLVM-Unit :: Support/./SupportTests/YAMLIO.TestReadBuiltInTypesUint16Error (74470 of 75189)
PASS: LLVM-Unit :: Support/./SupportTests/YAMLIO.TestReadBuiltInTypesint32OverError (74471 of 75189)
PASS: LLVM-Unit :: Support/./SupportTests/YAMLIO.TestReadBuiltInTypesint32UnderError (74472 of 75189)
PASS: LLVM-Unit :: Support/./SupportTests/YAMLIO.TestReadBuiltInTypesint8OverError (74473 of 75189)
PASS: LLVM-Unit :: Support/./SupportTests/YAMLIO.TestReadBuiltInTypesint64UnderError (74474 of 75189)
PASS: LLVM-Unit :: Support/./SupportTests/YAMLIO.TestReadBuiltInTypesint8UnderError (74475 of 75189)
PASS: LLVM-Unit :: Support/./SupportTests/YAMLIO.TestReadKindAndFlagsSequence (74476 of 75189)
PASS: LLVM-Unit :: Support/./SupportTests/YAMLIO.TestReadBuiltInTypesint64OverError (74477 of 75189)
PASS: LLVM-Unit :: Support/./SupportTests/YAMLIO.TestReadEndianTypes (74478 of 75189)
PASS: LLVM-Unit :: Support/./SupportTests/YAMLIO.TestReadMySecondsSequence (74479 of 75189)
PASS: LLVM-Unit :: Support/./SupportTests/YAMLIO.TestReadWriteBlockScalarValue (74480 of 75189)
PASS: LLVM-Unit :: Support/./SupportTests/YAMLIO.TestReadEndianEnums (74481 of 75189)
PASS: LLVM-Unit :: Support/./SupportTests/YAMLIO.TestReadWriteBlockScalarDocuments (74482 of 75189)
PASS: LLVM-Unit :: Support/./SupportTests/YAMLIO.TestReadWriteBuiltInTypes (74483 of 75189)
PASS: LLVM-Unit :: Support/./SupportTests/YAMLIO.TestReadWriteEndianTypes (74484 of 75189)
PASS: LLVM-Unit :: Support/./SupportTests/YAMLIO.TestReadWriteEndianEnums (74485 of 75189)
PASS: LLVM-Unit :: Support/./SupportTests/YAMLIO.TestReadWriteFlags (74486 of 75189)
PASS: LLVM-Unit :: Support/./SupportTests/YAMLIO.TestReadWriteKindAndFlagsSequence (74487 of 75189)
PASS: LLVM-Unit :: Support/./SupportTests/YAMLIO.TestReadWriteMyFlowSequence (74488 of 75189)
PASS: LLVM-Unit :: Support/./SupportTests/YAMLIO.TestReadWriteMyCustomType (74489 of 75189)
PASS: LLVM-Unit :: Support/./SupportTests/YAMLIO.TestReadWriteMultilineStringType (74490 of 75189)
PASS: LLVM-Unit :: Support/./SupportTests/YAMLIO.TestReadWriteMyFlowMapping (74491 of 75189)
PASS: LLVM-Unit :: Support/./SupportTests/YAMLIO.TestReadWritePolymorphicMap (74492 of 75189)
PASS: LLVM-Unit :: Support/./SupportTests/YAMLIO.TestScannerNoNullEmpty (74493 of 75189)
PASS: LLVM-Unit :: Support/./SupportTests/YAMLIO.TestReadWriteStringTypes (74494 of 75189)
PASS: LLVM-Unit :: Support/./SupportTests/YAMLIO.TestReadWriteMySecondsSequence (74495 of 75189)
PASS: LLVM-Unit :: Support/./SupportTests/YAMLIO.TestReadWriteSequenceOfMyFlowSequence (74496 of 75189)
PASS: LLVM-Unit :: Support/./SupportTests/YAMLIO.TestReadWritePolymorphicSeq (74497 of 75189)
PASS: LLVM-Unit :: Support/./SupportTests/YAMLIO.TestScannerNoNullEmptyAlias (74498 of 75189)
PASS: LLVM-Unit :: Support/./SupportTests/YAMLIO.TestScannerNoNullDecodeInvalidUTF8 (74499 of 75189)
PASS: LLVM-Unit :: Support/./SupportTests/YAMLIO.TestReadWritePolymorphicScalar (74500 of 75189)
PASS: LLVM-Unit :: Support/./SupportTests/YAMLIO.TestScannerNoNullEmptyAnchor (74501 of 75189)
PASS: LLVM-Unit :: Support/./SupportTests/YAMLIO.TestScannerNoNullEmptyMap (74502 of 75189)
PASS: LLVM-Unit :: Support/./SupportTests/YAMLIO.TestScannerNoNullEmptySequence (74503 of 75189)
PASS: LLVM-Unit :: Support/./SupportTests/YAMLIO.TestScannerNoNullScalarUnbalancedDoubleQuote (74504 of 75189)
PASS: LLVM-Unit :: Support/./SupportTests/YAMLIO.TestScannerNoNullScanPlainScalarInFlow (74505 of 75189)
PASS: LLVM-Unit :: Support/./SupportTests/YAMLIO.TestScannerNoNullScalarUnbalancedSingleQuote (74506 of 75189)
PASS: LLVM-Unit :: Support/./SupportTests/YAMLIO.TestScannerNoNullSequenceOfNull (74507 of 75189)
PASS: LLVM-Unit :: Support/./SupportTests/YAMLIO.TestSequenceDocListWriteAndRead (74508 of 75189)
PASS: LLVM-Unit :: Support/./SupportTests/YAMLIO.TestScannerNoNullSimpleSequence (74509 of 75189)
PASS: LLVM-Unit :: Support/./SupportTests/YAMLIO.TestSequenceMapRead (74510 of 75189)
PASS: LLVM-Unit :: Support/./SupportTests/YAMLIO.TestScannerNoNullUnbalancedSequence (74511 of 75189)
PASS: LLVM-Unit :: Support/./SupportTests/YAMLIO.TestScannerNoNullUnbalancedMap (74512 of 75189)
PASS: LLVM-Unit :: Support/./SupportTests/YAMLIO.TestScannerUnexpectedCharacter (74513 of 75189)
PASS: LLVM-Unit :: Support/./SupportTests/YAMLIO.TestSequenceMapWriteAndRead (74514 of 75189)
PASS: LLVM-Unit :: Support/./SupportTests/YAMLIO.TestTaggedDocuments (74515 of 75189)
PASS: LLVM-Unit :: Support/./SupportTests/YAMLIO.TestUnescapeInfiniteLoop (74516 of 75189)
PASS: LLVM-Unit :: Support/./SupportTests/YAMLIO.TestTaggedDocumentsWriteAndRead (74517 of 75189)
PASS: LLVM-Unit :: Support/./SupportTests/YAMLIO.TestUnknownDirective (74518 of 75189)
PASS: LLVM-Unit :: Support/./SupportTests/YAMLIO.TestWrapFlow (74519 of 75189)
PASS: LLVM-Unit :: Support/./SupportTests/YAMLIO.TestValidatingInput (74520 of 75189)
PASS: LLVM-Unit :: Support/./SupportTests/YAMLParser.DiagnosticFilenameFromBufferID (74521 of 75189)
PASS: LLVM-Unit :: Support/./SupportTests/YAMLParser.DefaultDiagnosticFilename (74522 of 75189)
PASS: LLVM-Unit :: Support/./SupportTests/YAMLParser.DifferentNodesIteratorOperatorEquals (74523 of 75189)
PASS: LLVM-Unit :: Support/./SupportTests/YAMLParser.FailsIfNotClosingArray (74524 of 75189)
PASS: LLVM-Unit :: Support/./SupportTests/YAMLParser.FailsIfMissingColon (74525 of 75189)
PASS: LLVM-Unit :: Support/./SupportTests/YAMLParser.DifferentNodesIteratorOperatorNotEquals (74526 of 75189)
PASS: LLVM-Unit :: Support/./SupportTests/YAMLParser.FailsIfNotClosingObject (74527 of 75189)
PASS: LLVM-Unit :: Support/./SupportTests/YAMLParser.FailsOnMissingComma (74528 of 75189)
PASS: LLVM-Unit :: Support/./SupportTests/YAMLParser.FailsOnMissingQuote (74529 of 75189)
PASS: LLVM-Unit :: Support/./SupportTests/YAMLParser.ParsesArrayOfArrays (74530 of 75189)
PASS: LLVM-Unit :: Support/./SupportTests/YAMLParser.FlowSequenceTokensOutsideFlowSequence (74531 of 75189)
PASS: LLVM-Unit :: Support/./SupportTests/YAMLParser.HandlesNullValuesInKeyValueNodesGracefully (74532 of 75189)
PASS: LLVM-Unit :: Support/./SupportTests/YAMLParser.HandlesEndOfFileGracefully (74533 of 75189)
PASS: LLVM-Unit :: Support/./SupportTests/YAMLParser.NullTerminatedBlockScalars (74534 of 75189)
PASS: LLVM-Unit :: Support/./SupportTests/YAMLParser.ParsesBlockLiteralScalars (74535 of 75189)
PASS: LLVM-Unit :: Support/./SupportTests/YAMLParser.ParsesBools (74536 of 75189)
PASS: LLVM-Unit :: Support/./SupportTests/YAMLParser.ParsesEmptyObject (74537 of 75189)
PASS: LLVM-Unit :: Support/./SupportTests/YAMLParser.ParsesEmptyArray (74538 of 75189)
PASS: LLVM-Unit :: Support/./SupportTests/YAMLParser.ParsesEmptyString (74539 of 75189)
PASS: LLVM-Unit :: Support/./SupportTests/YAMLParser.ParsesEscapedQuotes (74540 of 75189)
PASS: LLVM-Unit :: Support/./SupportTests/YAMLParser.ParsesEmptyArrayWithWhitespace (74541 of 75189)
PASS: LLVM-Unit :: Support/./SupportTests/YAMLParser.ParsesMultipleKeyValuePairsInObject (74542 of 75189)
PASS: LLVM-Unit :: Support/./SupportTests/YAMLParser.ParsesObject (74543 of 75189)
PASS: LLVM-Unit :: Support/./SupportTests/YAMLParser.ParsesMultipleObjects (74544 of 75189)
PASS: LLVM-Unit :: Support/./SupportTests/YAMLParser.ParsesStrings (74545 of 75189)
PASS: LLVM-Unit :: Support/./SupportTests/YAMLParser.SameNodeIteratorOperatorEquals (74546 of 75189)
PASS: LLVM-Unit :: Support/./SupportTests/YAMLParser.WorksWithIteratorAlgorithms (74547 of 75189)
PASS: LLVM-Unit :: Support/./SupportTests/formatted_raw_ostreamTest.Test_LineColumn (74548 of 75189)
PASS: LLVM-Unit :: Support/./SupportTests/YAMLParser.ParsesSpacesInBetweenTokens (74549 of 75189)
PASS: LLVM-Unit :: Support/./SupportTests/formatted_raw_ostreamTest.Test_Tell (74550 of 75189)
PASS: LLVM-Unit :: Support/./SupportTests/YAMLParser.SameNodeIteratorOperatorNotEquals (74551 of 75189)
PASS: LLVM-Unit :: Support/./SupportTests/formatted_raw_ostreamTest.Test_UTF8TinyBuffer (74552 of 75189)
PASS: LLVM-Unit :: Support/./SupportTests/formatted_raw_ostreamTest.Test_UTF8 (74553 of 75189)
PASS: LLVM-Unit :: Support/./SupportTests/formatted_raw_ostreamTest.Test_UTF8Buffered (74554 of 75189)
PASS: LLVM-Unit :: Support/./SupportTests/formatted_raw_ostreamTest.Test_Flush (74555 of 75189)
PASS: LLVM-Unit :: Support/./SupportTests/getLinuxHostCPUName.AArch64 (74556 of 75189)
PASS: LLVM-Unit :: Support/./SupportTests/getLinuxHostCPUName.ARM (74557 of 75189)
PASS: LLVM-Unit :: Support/./SupportTests/getSwappedBytes.SignedRoundTrip (74558 of 75189)
PASS: LLVM-Unit :: Support/./SupportTests/getLinuxHostCPUName.s390x (74559 of 75189)
PASS: LLVM-Unit :: Support/./SupportTests/getSwappedBytes.int64_t (74560 of 75189)
PASS: LLVM-Unit :: Support/./SupportTests/getSwappedBytes.double (74561 of 75189)
PASS: LLVM-Unit :: Support/./SupportTests/getSwappedBytes.int16_t (74562 of 75189)
PASS: LLVM-Unit :: Support/./SupportTests/getSwappedBytes.int8_t (74563 of 75189)
PASS: LLVM-Unit :: Support/./SupportTests/getSwappedBytes.uint64_t (74564 of 75189)
PASS: LLVM-Unit :: Support/./SupportTests/getSwappedBytes.UnsignedRoundTrip (74565 of 75189)
PASS: LLVM-Unit :: Support/./SupportTests/getSwappedBytes.float (74566 of 75189)
PASS: LLVM-Unit :: Support/./SupportTests/getSwappedBytes.int32_t (74567 of 75189)
PASS: LLVM-Unit :: Support/./SupportTests/getSwappedBytes.uint32_t (74568 of 75189)
PASS: LLVM-Unit :: Support/./SupportTests/getSwappedBytes.uint16_t (74569 of 75189)
PASS: LLVM-Unit :: Support/./SupportTests/getSwappedBytes.uint8_t (74570 of 75189)
PASS: LLVM-Unit :: Support/./SupportTests/is_absolute_gnu.Works (74571 of 75189)
PASS: LLVM-Unit :: Support/./SupportTests/is_separator.Works (74572 of 75189)
PASS: LLVM-Unit :: Support/./SupportTests/raw_fd_streamTest.DynCast (74573 of 75189)
PASS: LLVM-Unit :: Support/./SupportTests/raw_ostreamTest.Colors (74574 of 75189)
PASS: LLVM-Unit :: Support/./SupportTests/raw_fd_ostreamTest.multiple_raw_fd_ostream_to_stdout (74575 of 75189)
PASS: LLVM-Unit :: Support/./SupportTests/raw_fd_streamTest.ReadAfterWrite (74576 of 75189)
PASS: LLVM-Unit :: Support/./SupportTests/raw_ostreamTest.FormatHex (74577 of 75189)
PASS: LLVM-Unit :: Support/./SupportTests/raw_ostreamTest.FormatDecimal (74578 of 75189)
PASS: LLVM-Unit :: Support/./SupportTests/raw_ostreamTest.TinyBuffer (74579 of 75189)
PASS: LLVM-Unit :: Support/./SupportTests/raw_ostreamTest.FormattedHexBytes (74580 of 75189)
PASS: LLVM-Unit :: Support/./SupportTests/raw_ostreamTest.BufferEdge (74581 of 75189)
PASS: LLVM-Unit :: Support/./SupportTests/raw_ostreamTest.Types_Buffered (74582 of 75189)
PASS: LLVM-Unit :: Support/./SupportTests/raw_ostreamTest.Justify (74583 of 75189)
PASS: LLVM-Unit :: Support/./SupportTests/raw_ostreamTest.Types_Unbuffered (74584 of 75189)
PASS: LLVM-Unit :: Support/./SupportTests/raw_ostreamTest.WriteEscaped (74585 of 75189)
PASS: LLVM-Unit :: Support/./SupportTests/raw_ostreamTest.flush_tied_to_stream_on_write (74586 of 75189)
PASS: LLVM-Unit :: Support/./SupportTests/raw_ostreamTest.reserve_stream (74587 of 75189)
PASS: LLVM-Unit :: Support/./SupportTests/raw_ostreamTest.writeToNonexistingPath (74588 of 75189)
PASS: LLVM-Unit :: Support/./SupportTests/raw_ostreamTest.writeToDevNull (74589 of 75189)
PASS: LLVM-Unit :: Support/./SupportTests/raw_ostreamTest.writeToStdOut (74590 of 75189)
PASS: LLVM-Unit :: Support/./SupportTests/raw_sha1_ostreamTest.Intermediate (74591 of 75189)
PASS: LLVM-Unit :: Support/./SupportTests/raw_sha1_ostreamTest.Reset (74592 of 75189)
PASS: LLVM-Unit :: Support/./SupportTests/raw_pwrite_ostreamTest.TestDevNull (74593 of 75189)
PASS: LLVM-Unit :: Support/./SupportTests/raw_ostreamTest.writeToOutputFile (74594 of 75189)
PASS: LLVM-Unit :: Support/./SupportTests/raw_sha1_ostreamTest.Basic (74595 of 75189)
PASS: LLVM-Unit :: Support/./SupportTests/rename.ExistingTemp (74596 of 75189)
PASS: LLVM-Unit :: Support/./SupportTests/raw_pwrite_ostreamTest.TestSVector (74597 of 75189)
PASS: LLVM-Unit :: Support/./SupportTests/raw_pwrite_ostreamTest.TestFD (74598 of 75189)
PASS: LLVM-Unit :: Support/./SupportTests/swapByteOrder.double (74599 of 75189)
PASS: LLVM-Unit :: Support/./SupportTests/sha1_hash_test.Basic (74600 of 75189)
PASS: LLVM-Unit :: Support/./SupportTests/swapByteOrder.int64_t (74601 of 75189)
PASS: LLVM-Unit :: Support/./SupportTests/sha1_hash_test.Update (74602 of 75189)
PASS: LLVM-Unit :: Support/./SupportTests/swapByteOrder.int8_t (74603 of 75189)
PASS: LLVM-Unit :: Support/./SupportTests/swapByteOrder.uint32_t (74604 of 75189)
PASS: LLVM-Unit :: Support/./SupportTests/swapByteOrder.float (74605 of 75189)
PASS: LLVM-Unit :: Support/./SupportTests/swapByteOrder.uint16_t (74606 of 75189)
PASS: LLVM-Unit :: Support/./SupportTests/swapByteOrder.int32_t (74607 of 75189)
PASS: LLVM-Unit :: Support/./SupportTests/swapByteOrder.int16_t (74608 of 75189)
PASS: LLVM-Unit :: Support/./SupportTests/rename.FileOpenedForReadingCanBeReplaced (74609 of 75189)
PASS: LLVM-Unit :: TableGen/./TableGenTests/Automata.NfaAutomatonAccepts (74610 of 75189)
PASS: LLVM-Unit :: TableGen/./TableGenTests/Automata.SimpleAutomatonAcceptsSequences (74611 of 75189)
PASS: LLVM-Unit :: TableGen/./TableGenTests/CodeExpander.EscapedExpansion (74612 of 75189)
PASS: LLVM-Unit :: TableGen/./TableGenTests/Automata.TupleAutomatonAccepts (74613 of 75189)
PASS: LLVM-Unit :: TableGen/./TableGenTests/Automata.SimpleAutomatonAcceptsFromInitialState (74614 of 75189)
PASS: LLVM-Unit :: Support/./SupportTests/swapByteOrder.uint64_t (74615 of 75189)
PASS: LLVM-Unit :: TableGen/./TableGenTests/CodeExpander.Escape (74616 of 75189)
PASS: LLVM-Unit :: TableGen/./TableGenTests/Automata.BinPackerAutomatonAccepts (74617 of 75189)
PASS: LLVM-Unit :: TableGen/./TableGenTests/Automata.BinPackerAutomatonExplains (74618 of 75189)
PASS: LLVM-Unit :: Support/./SupportTests/swapByteOrder.uint8_t (74619 of 75189)
PASS: LLVM-Unit :: Support/./SupportTests/writeFileAtomicallyTest.Test (74620 of 75189)
PASS: LLVM-Unit :: Support/./SupportTests/xxhashTest.Basic (74621 of 75189)
PASS: LLVM-Unit :: TableGen/./TableGenTests/CodeExpander.Indentation (74622 of 75189)
PASS: LLVM-Unit :: TableGen/./TableGenTests/CodeExpander.EscapedUnterminatedExpansion (74623 of 75189)
PASS: LLVM-Unit :: TableGen/./TableGenTests/CodeExpander.NoExpansions (74624 of 75189)
PASS: LLVM-Unit :: TableGen/./TableGenTests/CodeExpander.EscapedNotAnExpansion (74625 of 75189)
PASS: LLVM-Unit :: TableGen/./TableGenTests/CodeExpander.UndefinedExpansion (74626 of 75189)
PASS: LLVM-Unit :: TableGen/./TableGenTests/CodeExpander.UnterminatedExpansion (74627 of 75189)
PASS: LLVM-Unit :: TableGen/./TableGenTests/CodeExpander.NotAnExpansion (74628 of 75189)
PASS: LLVM-Unit :: Target/AArch64/./AArch64Tests/MatrixRegisterAliasing.Aliasing (74629 of 75189)
PASS: LLVM-Unit :: Target/AArch64/./AArch64Tests/InstSizes.PATCHPOINT (74630 of 75189)
PASS: LLVM-Unit :: Target/AArch64/./AArch64Tests/InstSizes.STACKMAP (74631 of 75189)
PASS: LLVM-Unit :: Target/AArch64/./AArch64Tests/InstSizes.TLSDESC_CALLSEQ (74632 of 75189)
PASS: LLVM-Unit :: Target/AArch64/./AArch64Tests/StackOffset.decomposeStackOffsetForFrameOffsets (74633 of 75189)
PASS: LLVM-Unit :: Target/ARM/./ARMTests/MachineInstrValidTailPredication.IsCorrect (74634 of 75189)
PASS: LLVM-Unit :: Target/ARM/./ARMTests/MachineInstr.HasSideEffects (74635 of 75189)
PASS: LLVM-Unit :: Target/ARM/./ARMTests/MachineInstructionDoubleWidthResult.IsCorrect (74636 of 75189)
PASS: LLVM-Unit :: Target/AArch64/./AArch64Tests/InstSizes.Authenticated (74637 of 75189)
PASS: LLVM-Unit :: Target/AMDGPU/./AMDGPUTests/AMDGPUExecMayBeModifiedBeforeAnyUse.TheTest (74638 of 75189)
PASS: LLVM-Unit :: Target/AMDGPU/./AMDGPUTests/AMDGPUDwarfRegMappingTests.TestWave32DwarfRegMapping (74639 of 75189)
PASS: LLVM-Unit :: Target/AMDGPU/./AMDGPUTests/AMDGPUDwarfRegMappingTests.TestWave64DwarfRegMapping (74640 of 75189)
PASS: LLVM-Unit :: Target/ARM/./ARMTests/MachineInstructionHorizontalReduction.IsCorrect (74641 of 75189)
PASS: LLVM-Unit :: Target/PowerPC/./PowerPCTests/AIXRelocModelTest.DefalutToPIC (74642 of 75189)
PASS: LLVM-Unit :: Target/ARM/./ARMTests/MachineInstructionRetainsPreviousHalfElement.IsCorrect (74643 of 75189)
PASS: LLVM-Unit :: Target/WebAssembly/./WebAssemblyTests/WebAssemblyExceptionInfoTest.TEST0 (74644 of 75189)
PASS: LLVM-Unit :: Target/WebAssembly/./WebAssemblyTests/WebAssemblyExceptionInfoTest.TEST1 (74645 of 75189)
PASS: LLVM-Unit :: TextAPI/./TextAPITests/TBDv1.MalformedFile1 (74646 of 75189)
PASS: LLVM-Unit :: TextAPI/./TextAPITests/TBDv1.MalformedFile2 (74647 of 75189)
PASS: LLVM-Unit :: TextAPI/./TextAPITests/TBDv1.Platform_bridgeOS (74648 of 75189)
PASS: LLVM-Unit :: TextAPI/./TextAPITests/TBDv1.Platform_iOS (74649 of 75189)
PASS: LLVM-Unit :: TextAPI/./TextAPITests/TBDv1.Platform_macOS (74650 of 75189)
PASS: LLVM-Unit :: TextAPI/./TextAPITests/TBDv1.Platform_tvOS (74651 of 75189)
PASS: LLVM-Unit :: TextAPI/./TextAPITests/TBDv1.Platform_watchOS (74652 of 75189)
PASS: LLVM-Unit :: TextAPI/./TextAPITests/TBDv1.ReadFile (74653 of 75189)
PASS: LLVM-Unit :: TextAPI/./TextAPITests/TBDv1.ReadFile2 (74654 of 75189)
PASS: LLVM-Unit :: TextAPI/./TextAPITests/TBDv1.Swift_1_0 (74655 of 75189)
PASS: LLVM-Unit :: TextAPI/./TextAPITests/TBDv1.Swift_2_0 (74656 of 75189)
PASS: LLVM-Unit :: TextAPI/./TextAPITests/TBDv1.Swift_1_1 (74657 of 75189)
PASS: LLVM-Unit :: TextAPI/./TextAPITests/TBDv1.Swift_3_0 (74658 of 75189)
PASS: LLVM-Unit :: TextAPI/./TextAPITests/TBDv1.Swift_4_0 (74659 of 75189)
PASS: LLVM-Unit :: TextAPI/./TextAPITests/TBDv1.Swift_5 (74660 of 75189)
PASS: LLVM-Unit :: TextAPI/./TextAPITests/TBDv1.Swift_99 (74661 of 75189)
PASS: LLVM-Unit :: Target/X86/./X86Tests/MachineSizeOptsTest.Test (74662 of 75189)
PASS: LLVM-Unit :: TextAPI/./TextAPITests/TBDv1.UnknownArchitecture (74663 of 75189)
PASS: LLVM-Unit :: TextAPI/./TextAPITests/TBDv1.UnknownPlatform (74664 of 75189)
PASS: LLVM-Unit :: TextAPI/./TextAPITests/TBDv1.WriteFile (74665 of 75189)
PASS: LLVM-Unit :: TextAPI/./TextAPITests/TBDv2.InvalidPlatform (74666 of 75189)
PASS: LLVM-Unit :: TextAPI/./TextAPITests/TBDv2.MalformedFile1 (74667 of 75189)
PASS: LLVM-Unit :: TextAPI/./TextAPITests/TBDv2.Platform_bridgeOS (74668 of 75189)
PASS: LLVM-Unit :: TextAPI/./TextAPITests/TBDv2.MalformedFile2 (74669 of 75189)
PASS: LLVM-Unit :: TextAPI/./TextAPITests/TBDv2.Platform_iOS (74670 of 75189)
PASS: LLVM-Unit :: TextAPI/./TextAPITests/TBDv2.Platform_macOS (74671 of 75189)
PASS: LLVM-Unit :: TextAPI/./TextAPITests/TBDv2.Platform_tvOS (74672 of 75189)
PASS: LLVM-Unit :: TextAPI/./TextAPITests/TBDv2.Platform_watchOS (74673 of 75189)
PASS: LLVM-Unit :: TextAPI/./TextAPITests/TBDv2.ReadFile2 (74674 of 75189)
PASS: LLVM-Unit :: TextAPI/./TextAPITests/TBDv2.ReadFile (74675 of 75189)
PASS: LLVM-Unit :: TextAPI/./TextAPITests/TBDv2.Swift_1_0 (74676 of 75189)
PASS: LLVM-Unit :: TextAPI/./TextAPITests/TBDv2.Swift_2_0 (74677 of 75189)
PASS: LLVM-Unit :: TextAPI/./TextAPITests/TBDv2.Swift_1_1 (74678 of 75189)
PASS: LLVM-Unit :: TextAPI/./TextAPITests/TBDv2.Swift_3_0 (74679 of 75189)
PASS: LLVM-Unit :: TextAPI/./TextAPITests/TBDv2.Swift_4_0 (74680 of 75189)
PASS: LLVM-Unit :: TextAPI/./TextAPITests/TBDv2.UnknownArchitecture (74681 of 75189)
PASS: LLVM-Unit :: TextAPI/./TextAPITests/TBDv2.Swift_99 (74682 of 75189)
PASS: LLVM-Unit :: TextAPI/./TextAPITests/TBDv2.Swift_5 (74683 of 75189)
PASS: LLVM-Unit :: TextAPI/./TextAPITests/TBDv2.UnknownPlatform (74684 of 75189)
PASS: LLVM-Unit :: TextAPI/./TextAPITests/TBDv2.WriteFile (74685 of 75189)
PASS: LLVM-Unit :: TextAPI/./TextAPITests/TBDv3.Arch_arm64e (74686 of 75189)
PASS: LLVM-Unit :: TextAPI/./TextAPITests/TBDv3.InterfaceEquality (74687 of 75189)
PASS: LLVM-Unit :: TextAPI/./TextAPITests/TBDv3.MalformedFile1 (74688 of 75189)
PASS: LLVM-Unit :: TextAPI/./TextAPITests/TBDv3.MalformedFile2 (74689 of 75189)
PASS: LLVM-Unit :: TextAPI/./TextAPITests/TBDv3.InterfaceInequality (74690 of 75189)
PASS: LLVM-Unit :: TextAPI/./TextAPITests/TBDv3.Platform_bridgeOS (74691 of 75189)
PASS: LLVM-Unit :: TextAPI/./TextAPITests/TBDv3.Platform_iOS (74692 of 75189)
PASS: LLVM-Unit :: Support/DynamicLibrary/./DynamicLibraryTests/DynamicLibrary.Overload (74693 of 75189)
PASS: LLVM-Unit :: TextAPI/./TextAPITests/TBDv3.Platform_iOSSim (74694 of 75189)
PASS: LLVM-Unit :: TextAPI/./TextAPITests/TBDv3.Platform_macCatalyst (74695 of 75189)
PASS: LLVM-Unit :: TextAPI/./TextAPITests/TBDv3.Platform_tvOS (74696 of 75189)
PASS: LLVM-Unit :: TextAPI/./TextAPITests/TBDv3.Platform_macOS (74697 of 75189)
PASS: LLVM-Unit :: TextAPI/./TextAPITests/TBDv3.Platform_watchOS (74698 of 75189)
PASS: LLVM-Unit :: TextAPI/./TextAPITests/TBDv3.Platform_tvOSSim (74699 of 75189)
PASS: LLVM-Unit :: TextAPI/./TextAPITests/TBDv3.Platform_watchOSSim (74700 of 75189)
PASS: LLVM-Unit :: TextAPI/./TextAPITests/TBDv3.ReadFile (74701 of 75189)
PASS: LLVM-Unit :: TextAPI/./TextAPITests/TBDv3.ReadMultipleDocuments (74702 of 75189)
PASS: LLVM-Unit :: TextAPI/./TextAPITests/TBDv3.Platform_zippered (74703 of 75189)
PASS: LLVM-Unit :: TextAPI/./TextAPITests/TBDv3.Swift_1_0 (74704 of 75189)
PASS: LLVM-Unit :: TextAPI/./TextAPITests/TBDv3.Swift_1_1 (74705 of 75189)
PASS: LLVM-Unit :: TextAPI/./TextAPITests/TBDv3.Swift_2_0 (74706 of 75189)
PASS: LLVM-Unit :: TextAPI/./TextAPITests/TBDv3.Swift_3_0 (74707 of 75189)
PASS: LLVM-Unit :: TextAPI/./TextAPITests/TBDv3.Swift_4_0 (74708 of 75189)
PASS: LLVM-Unit :: TextAPI/./TextAPITests/TBDv3.Swift_99 (74709 of 75189)
PASS: LLVM-Unit :: TextAPI/./TextAPITests/TBDv3.Swift_5 (74710 of 75189)
PASS: LLVM-Unit :: TextAPI/./TextAPITests/TBDv3.UnknownArchitecture (74711 of 75189)
PASS: LLVM-Unit :: TextAPI/./TextAPITests/TBDv3.UnknownPlatform (74712 of 75189)
PASS: LLVM-Unit :: TextAPI/./TextAPITests/TBDv3.WriteFile (74713 of 75189)
PASS: LLVM-Unit :: TextAPI/./TextAPITests/TBDv3.WriteMultipleDocuments (74714 of 75189)
PASS: LLVM-Unit :: TextAPI/./TextAPITests/TBDv4.InterfaceInequality (74715 of 75189)
PASS: LLVM-Unit :: TextAPI/./TextAPITests/TBDv4.InterfaceDiffVersionsEquality (74716 of 75189)
PASS: LLVM-Unit :: TextAPI/./TextAPITests/TBDv4.InterfaceEquality (74717 of 75189)
PASS: LLVM-Unit :: TextAPI/./TextAPITests/TBDv4.InvalidArchitecture (74718 of 75189)
PASS: LLVM-Unit :: TextAPI/./TextAPITests/TBDv4.InvalidPlatform (74719 of 75189)
PASS: LLVM-Unit :: TextAPI/./TextAPITests/TBDv4.MalformedFile1 (74720 of 75189)
PASS: LLVM-Unit :: TextAPI/./TextAPITests/TBDv4.MalformedFile2 (74721 of 75189)
PASS: LLVM-Unit :: TextAPI/./TextAPITests/TBDv4.MalformedFile3 (74722 of 75189)
PASS: LLVM-Unit :: TextAPI/./TextAPITests/TBDv4.MultipleTargets (74723 of 75189)
PASS: LLVM-Unit :: TextAPI/./TextAPITests/TBDv4.MultipleTargetsSamePlatform (74724 of 75189)
PASS: LLVM-Unit :: TextAPI/./TextAPITests/TBDv4.ReadFile (74725 of 75189)
PASS: LLVM-Unit :: TextAPI/./TextAPITests/TBDv4.MultipleTargetsSameArch (74726 of 75189)
PASS: LLVM-Unit :: TextAPI/./TextAPITests/TBDv4.Swift_1 (74727 of 75189)
PASS: LLVM-Unit :: TextAPI/./TextAPITests/TBDv4.Swift_2 (74728 of 75189)
PASS: LLVM-Unit :: TextAPI/./TextAPITests/TBDv4.Swift_5 (74729 of 75189)
PASS: LLVM-Unit :: TextAPI/./TextAPITests/TBDv4.ReadMultipleDocuments (74730 of 75189)
PASS: LLVM-Unit :: TextAPI/./TextAPITests/TBDv4.Swift_99 (74731 of 75189)
PASS: LLVM-Unit :: TextAPI/./TextAPITests/TBDv4.Target_arm_bridgeOS (74732 of 75189)
PASS: LLVM-Unit :: TextAPI/./TextAPITests/TBDv4.Target_arm_iOS (74733 of 75189)
PASS: LLVM-Unit :: TextAPI/./TextAPITests/TBDv4.Target_i386_driverkit (74734 of 75189)
PASS: LLVM-Unit :: TextAPI/./TextAPITests/TBDv4.Target_i386_watchos_simulator (74735 of 75189)
PASS: LLVM-Unit :: TextAPI/./TextAPITests/TBDv4.Target_maccatalyst (74736 of 75189)
PASS: LLVM-Unit :: TextAPI/./TextAPITests/TBDv4.Target_x86_ios (74737 of 75189)
PASS: LLVM-Unit :: TextAPI/./TextAPITests/TBDv4.Target_x86_ios_simulator (74738 of 75189)
PASS: LLVM-Unit :: TextAPI/./TextAPITests/TBDv4.Target_x86_macos (74739 of 75189)
PASS: LLVM-Unit :: TextAPI/./TextAPITests/TBDv4.Target_x86_tvos_simulator (74740 of 75189)
PASS: LLVM-Unit :: TextAPI/./TextAPITests/TBDv4.WriteFile (74741 of 75189)
PASS: LLVM-Unit :: TextAPI/./TextAPITests/TBDv4.WriteMultipleDocuments (74742 of 75189)
PASS: LLVM-Unit :: Transforms/IPO/./IPOTests/AttributorTestBase.TestCast (74743 of 75189)
PASS: LLVM-Unit :: Transforms/IPO/./IPOTests/AttributorTestBase.IRPPositionCallBaseContext (74744 of 75189)
PASS: LLVM-Unit :: Transforms/IPO/./IPOTests/LowerTypeTests.BitSetBuilder (74745 of 75189)
PASS: LLVM-Unit :: Transforms/IPO/./IPOTests/AttributorTestBase.AAReachabilityTest (74746 of 75189)
PASS: LLVM-Unit :: Transforms/IPO/./IPOTests/LowerTypeTests.ByteArrayBuilder (74747 of 75189)
PASS: LLVM-Unit :: Transforms/IPO/./IPOTests/WholeProgramDevirt.findLowestOffset (74748 of 75189)
PASS: LLVM-Unit :: Transforms/IPO/./IPOTests/WholeProgramDevirt.setReturnValues (74749 of 75189)
PASS: LLVM-Unit :: Transforms/IPO/./IPOTests/LowerTypeTests.GlobalLayoutBuilder (74750 of 75189)
PASS: LLVM-Unit :: Transforms/Scalar/./ScalarTests/LICMTest.TestSCEVInvalidationOnHoisting (74751 of 75189)
PASS: LLVM-Unit :: Transforms/Scalar/./ScalarTests/LoopPassManagerTest.Basic (74752 of 75189)
PASS: LLVM-Unit :: Transforms/Scalar/./ScalarTests/LoopPassManagerTest.FunctionPassInvalidationOfLoopAnalyses (74753 of 75189)
PASS: LLVM-Unit :: Transforms/Scalar/./ScalarTests/LoopPassManagerTest.HandleLoopNestPass (74754 of 75189)
PASS: LLVM-Unit :: Transforms/Scalar/./ScalarTests/LoopPassManagerTest.IndirectInvalidation (74755 of 75189)
PASS: LLVM-Unit :: Transforms/Utils/./UtilsTests/BasicBlockUtils.EliminateUnreachableBlocks (74756 of 75189)
PASS: LLVM-Unit :: Transforms/Utils/./UtilsTests/ASanStackFrameLayout.Test (74757 of 75189)
PASS: LLVM-Unit :: Transforms/Scalar/./ScalarTests/LoopPassManagerTest.IndirectOuterPassInvalidation (74758 of 75189)
PASS: LLVM-Unit :: Transforms/Scalar/./ScalarTests/LoopPassManagerTest.ModulePassInvalidationOfLoopAnalyses (74759 of 75189)
PASS: LLVM-Unit :: Transforms/Scalar/./ScalarTests/LoopPassManagerTest.LoopChildInsertion (74760 of 75189)
PASS: LLVM-Unit :: Transforms/Scalar/./ScalarTests/LoopPassManagerTest.InvalidationOfBundledAnalyses (74761 of 75189)
PASS: LLVM-Unit :: Transforms/Scalar/./ScalarTests/LoopPassManagerTest.LoopDeletion (74762 of 75189)
PASS: LLVM-Unit :: Transforms/Scalar/./ScalarTests/LoopPassManagerTest.LoopPeerInsertion (74763 of 75189)
PASS: LLVM-Unit :: Transforms/Utils/./UtilsTests/BasicBlockUtils.NoUnreachableBlocksToEliminate (74764 of 75189)
PASS: LLVM-Unit :: Transforms/Utils/./UtilsTests/BasicBlockUtils.SetEdgeProbability (74765 of 75189)
PASS: LLVM-Unit :: Transforms/Utils/./UtilsTests/BasicBlockUtils.SplitBlockPredecessors (74766 of 75189)
PASS: LLVM-Unit :: Transforms/Utils/./UtilsTests/BasicBlockUtils.SplitCriticalEdge (74767 of 75189)
PASS: LLVM-Unit :: Transforms/Utils/./UtilsTests/BasicBlockUtils.SplitEdge_ex2 (74768 of 75189)
PASS: LLVM-Unit :: Transforms/Utils/./UtilsTests/BasicBlockUtils.SplitEdge_ex1 (74769 of 75189)
PASS: LLVM-Unit :: Transforms/Utils/./UtilsTests/BasicBlockUtils.SplitEdge_ex3 (74770 of 75189)
PASS: LLVM-Unit :: Transforms/Utils/./UtilsTests/BasicBlockUtils.splitBasicBlockBefore_ex1 (74771 of 75189)
PASS: LLVM-Unit :: Transforms/Utils/./UtilsTests/BasicBlockUtils.SplitEdge_ex4 (74772 of 75189)
PASS: LLVM-Unit :: Transforms/Utils/./UtilsTests/BasicBlockUtils.SplitIndirectBrCriticalEdge (74773 of 75189)
PASS: LLVM-Unit :: Transforms/Utils/./UtilsTests/CallPromotionUtilsTest.TryPromoteCall (74774 of 75189)
PASS: LLVM-Unit :: Transforms/Utils/./UtilsTests/CallPromotionUtilsTest.TryPromoteCall_EmptyVTable (74775 of 75189)
PASS: LLVM-Unit :: Transforms/Utils/./UtilsTests/CallPromotionUtilsTest.TryPromoteCall_MemberFunctionCalls (74776 of 75189)
PASS: LLVM-Unit :: Transforms/Utils/./UtilsTests/CallPromotionUtilsTest.TryPromoteCall_Legality (74777 of 75189)
PASS: LLVM-Unit :: Support/DynamicLibrary/./DynamicLibraryTests/DynamicLibrary.Shutdown (74778 of 75189)
PASS: LLVM-Unit :: Transforms/Utils/./UtilsTests/CallPromotionUtilsTest.TryPromoteCall_NullFP (74779 of 75189)
PASS: LLVM-Unit :: Transforms/Utils/./UtilsTests/CallPromotionUtilsTest.TryPromoteCall_NoFPLoad (74780 of 75189)
PASS: LLVM-Unit :: Transforms/Utils/./UtilsTests/CallPromotionUtilsTest.TryPromoteCall_NoVTableInitFound (74781 of 75189)
PASS: LLVM-Unit :: Transforms/Utils/./UtilsTests/CallPromotionUtilsTest.TryPromoteCall_NoVTablePtrLoad (74782 of 75189)
PASS: LLVM-Unit :: Transforms/Utils/./UtilsTests/CloneFunc.DebugIntrinsics (74783 of 75189)
PASS: LLVM-Unit :: Transforms/Utils/./UtilsTests/CloneFunc.NewFunctionCreated (74784 of 75189)
PASS: LLVM-Unit :: Transforms/Utils/./UtilsTests/CloneFunction.CloneEmptyFunction (74785 of 75189)
PASS: LLVM-Unit :: Transforms/Utils/./UtilsTests/CloneFunc.Subprogram (74786 of 75189)
PASS: LLVM-Unit :: Transforms/Utils/./UtilsTests/CloneFunc.InstructionOwnership (74787 of 75189)
PASS: LLVM-Unit :: Transforms/Utils/./UtilsTests/CloneFunction.CloneFunctionToDifferentModule (74788 of 75189)
PASS: LLVM-Unit :: Support/./SupportTests/ProgramEnvTest.TestExecuteAndWaitTimeout (74789 of 75189)
PASS: LLVM-Unit :: Transforms/Utils/./UtilsTests/CloneFunction.CloneFunctionWithInalloca (74790 of 75189)
PASS: LLVM-Unit :: Transforms/Utils/./UtilsTests/CloneFunction.CloneFunctionWithSubprograms (74791 of 75189)
PASS: LLVM-Unit :: Transforms/Utils/./UtilsTests/BasicBlockUtils.splitBasicBlockBefore_ex2 (74792 of 75189)
PASS: LLVM-Unit :: Transforms/Utils/./UtilsTests/CloneInstruction.CallingConvention (74793 of 75189)
PASS: LLVM-Unit :: Transforms/Utils/./UtilsTests/CloneInstruction.DuplicateInstructionsToSplit (74794 of 75189)
PASS: LLVM-Unit :: Transforms/Utils/./UtilsTests/CloneInstruction.DuplicateInstructionsToSplitBlocksEq1 (74795 of 75189)
PASS: LLVM-Unit :: Transforms/Utils/./UtilsTests/CloneInstruction.DuplicateInstructionsToSplitBlocksEq2 (74796 of 75189)
PASS: LLVM-Unit :: Transforms/Utils/./UtilsTests/CloneInstruction.Exact (74797 of 75189)
PASS: LLVM-Unit :: Transforms/Utils/./UtilsTests/CloneInstruction.Inbounds (74798 of 75189)
PASS: LLVM-Unit :: Transforms/Utils/./UtilsTests/CloneModule.GlobalDebugInfo (74799 of 75189)
PASS: LLVM-Unit :: Transforms/Utils/./UtilsTests/CloneLoop.CloneLoopNest (74800 of 75189)
PASS: LLVM-Unit :: Transforms/Utils/./UtilsTests/CloneModule.Comdat (74801 of 75189)
PASS: LLVM-Unit :: Transforms/Utils/./UtilsTests/CloneModule.CompileUnit (74802 of 75189)
PASS: LLVM-Unit :: Transforms/Utils/./UtilsTests/CloneInstruction.OverflowBits (74803 of 75189)
PASS: LLVM-Unit :: Transforms/Utils/./UtilsTests/CloneInstruction.Attributes (74804 of 75189)
PASS: LLVM-Unit :: Transforms/Utils/./UtilsTests/CloneModule.Subprogram (74805 of 75189)
PASS: LLVM-Unit :: Transforms/Utils/./UtilsTests/CloneModule.GlobalMetadata (74806 of 75189)
PASS: LLVM-Unit :: Transforms/Utils/./UtilsTests/CloneModule.OldModuleUnchanged (74807 of 75189)
PASS: LLVM-Unit :: Transforms/Utils/./UtilsTests/CodeExtractor.ExitStub (74808 of 75189)
PASS: LLVM-Unit :: Transforms/Utils/./UtilsTests/CloneModule.Verify (74809 of 75189)
PASS: LLVM-Unit :: Transforms/Utils/./UtilsTests/CodeExtractor.ExitPHIOnePredFromRegion (74810 of 75189)
PASS: LLVM-Unit :: Transforms/Utils/./UtilsTests/CodeExtractor.StoreOutputInvokeResultAfterEHPad (74811 of 75189)
PASS: LLVM-Unit :: Transforms/Utils/./UtilsTests/CodeExtractor.ExtractAndInvalidateAssumptionCache (74812 of 75189)
PASS: LLVM-Unit :: Transforms/Utils/./UtilsTests/CodeMoverUtils.IsControlFlowEquivalentCondNestTest (74813 of 75189)
PASS: LLVM-Unit :: Transforms/Utils/./UtilsTests/CodeMoverUtils.IsControlFlowEquivalentNotPostdomTest (74814 of 75189)
PASS: LLVM-Unit :: Transforms/Utils/./UtilsTests/CodeExtractor.RemoveBitcastUsesFromOuterLifetimeMarkers (74815 of 75189)
PASS: LLVM-Unit :: Transforms/Utils/./UtilsTests/CodeMoverUtils.IsControlFlowEquivalentPointerTest (74816 of 75189)
PASS: LLVM-Unit :: Transforms/Utils/./UtilsTests/CodeExtractor.StoreOutputInvokeResultInExitStub (74817 of 75189)
PASS: LLVM-Unit :: Transforms/Utils/./UtilsTests/CodeMoverUtils.IsControlFlowEquivalentOppositeCondTest (74818 of 75189)
PASS: LLVM-Unit :: Transforms/Utils/./UtilsTests/CodeMoverUtils.IsControlFlowEquivalentImbalanceTest (74819 of 75189)
PASS: LLVM-Unit :: Transforms/Utils/./UtilsTests/CodeMoverUtils.IsControlFlowEquivalentSimpleTest (74820 of 75189)
PASS: LLVM-Unit :: Transforms/Utils/./UtilsTests/CodeMoverUtils.IsSafeToMoveTest1 (74821 of 75189)
PASS: LLVM-Unit :: Transforms/Utils/./UtilsTests/CodeMoverUtils.IsSafeToMoveTest2 (74822 of 75189)
PASS: LLVM-Unit :: Transforms/Utils/./UtilsTests/CodeMoverUtils.IsSafeToMoveTest3 (74823 of 75189)
PASS: LLVM-Unit :: Transforms/Utils/./UtilsTests/CodeMoverUtils.IsSafeToMoveTest4 (74824 of 75189)
PASS: LLVM-Unit :: Transforms/Utils/./UtilsTests/CodeMoverUtils.IsSafeToMoveTest6 (74825 of 75189)
PASS: LLVM-Unit :: Transforms/Utils/./UtilsTests/CodeMoverUtils.IsSafeToMoveTest5 (74826 of 75189)
PASS: LLVM-Unit :: Transforms/Utils/./UtilsTests/IntegerDivision.UDiv (74827 of 75189)
PASS: LLVM-Unit :: Transforms/Utils/./UtilsTests/FunctionComparatorTest.TestAPI (74828 of 75189)
PASS: LLVM-Unit :: Transforms/Utils/./UtilsTests/DebugInfoDummyAnalysis.PreserveOriginalDebugInfo (74829 of 75189)
PASS: LLVM-Unit :: Transforms/Utils/./UtilsTests/DebugInfoDrop.DropOriginalDebugInfo (74830 of 75189)
PASS: LLVM-Unit :: Transforms/Utils/./UtilsTests/IntegerDivision.SDiv (74831 of 75189)
PASS: LLVM-Unit :: Transforms/Utils/./UtilsTests/IntegerDivision.SRem64 (74832 of 75189)
PASS: LLVM-Unit :: Transforms/Utils/./UtilsTests/IntegerDivision.SRem (74833 of 75189)
PASS: LLVM-Unit :: Transforms/Utils/./UtilsTests/IntegerDivision.SDiv64 (74834 of 75189)
PASS: LLVM-Unit :: Transforms/Utils/./UtilsTests/DebugValueDrop.DropOriginalDebugValues (74835 of 75189)
PASS: LLVM-Unit :: Transforms/Utils/./UtilsTests/IntegerDivision.UDiv64 (74836 of 75189)
PASS: LLVM-Unit :: Transforms/Utils/./UtilsTests/Local.ChangeToUnreachable (74837 of 75189)
PASS: LLVM-Unit :: Transforms/Utils/./UtilsTests/Local.CanReplaceOperandWithVariable (74838 of 75189)
PASS: LLVM-Unit :: Transforms/Utils/./UtilsTests/IntegerDivision.URem64 (74839 of 75189)
PASS: LLVM-Unit :: Transforms/Utils/./UtilsTests/IntegerDivision.URem (74840 of 75189)
PASS: LLVM-Unit :: Transforms/Utils/./UtilsTests/Local.RecursivelyDeleteDeadPHINodes (74841 of 75189)
PASS: LLVM-Unit :: Transforms/Utils/./UtilsTests/Local.RemoveDuplicatePHINodes (74842 of 75189)
PASS: LLVM-Unit :: Transforms/Utils/./UtilsTests/Local.MergeBasicBlockIntoOnlyPred (74843 of 75189)
PASS: LLVM-Unit :: Transforms/Utils/./UtilsTests/Local.ConstantFoldTerminator (74844 of 75189)
PASS: LLVM-Unit :: Transforms/Utils/./UtilsTests/Local.SimplifyCFGWithNullAC (74845 of 75189)
PASS: LLVM-Unit :: Transforms/Utils/./UtilsTests/Local.RemoveUnreachableBlocks (74846 of 75189)
PASS: LLVM-Unit :: Transforms/Utils/./UtilsTests/Local.ReplaceAllDbgUsesWith (74847 of 75189)
PASS: LLVM-Unit :: Transforms/Utils/./UtilsTests/Local.ReplaceDbgDeclare (74848 of 75189)
PASS: LLVM-Unit :: Transforms/Utils/./UtilsTests/LoopRotate.MultiDeoptExit (74849 of 75189)
PASS: LLVM-Unit :: Transforms/Utils/./UtilsTests/LoopRotate.MultiDeoptExit_Nondup (74850 of 75189)
PASS: LLVM-Unit :: Transforms/Utils/./UtilsTests/LoopUtils.DeleteDeadLoopNest (74851 of 75189)
PASS: LLVM-Unit :: Transforms/Utils/./UtilsTests/ModuleUtils.AppendToUsedList1 (74852 of 75189)
PASS: LLVM-Unit :: Transforms/Utils/./UtilsTests/LoopUnrollRuntime.Latch (74853 of 75189)
PASS: LLVM-Unit :: Transforms/Utils/./UtilsTests/ModuleUtils.AppendToUsedList2 (74854 of 75189)
PASS: LLVM-Unit :: Transforms/Utils/./UtilsTests/SSAUpdaterBulk.Irreducible (74855 of 75189)
PASS: LLVM-Unit :: Transforms/Utils/./UtilsTests/SSAUpdaterBulk.SimpleMerge (74856 of 75189)
PASS: LLVM-Unit :: Transforms/Utils/./UtilsTests/SalvageDebugInfoTest.RecursiveInstDeletion (74857 of 75189)
PASS: LLVM-Unit :: Transforms/Utils/./UtilsTests/SalvageDebugInfoTest.RecursiveBlockSimplification (74858 of 75189)
PASS: LLVM-Unit :: Transforms/Utils/./UtilsTests/ScalarEvolutionExpanderTest.SCEVCacheNSW (74859 of 75189)
PASS: LLVM-Unit :: Transforms/Utils/./UtilsTests/ScalarEvolutionExpanderTest.SCEVCacheNUW (74860 of 75189)
PASS: LLVM-Unit :: Transforms/Utils/./UtilsTests/ScalarEvolutionExpanderTest.ExpandPtrTypeSCEV (74861 of 75189)
PASS: LLVM-Unit :: Transforms/Utils/./UtilsTests/ScalarEvolutionExpanderTest.ExpandNonIntegralPtrWithNullBase (74862 of 75189)
PASS: LLVM-Unit :: Transforms/Utils/./UtilsTests/ScalarEvolutionExpanderTest.SCEVExpandInsertCanonicalIV (74863 of 75189)
PASS: LLVM-Unit :: Transforms/Utils/./UtilsTests/ScalarEvolutionExpanderTest.SCEVExpanderIsSafeToExpandAt (74864 of 75189)
PASS: LLVM-Unit :: Transforms/Utils/./UtilsTests/ScalarEvolutionExpanderTest.SCEVExpandNonAffineAddRec (74865 of 75189)
PASS: LLVM-Unit :: Transforms/Utils/./UtilsTests/ScalarEvolutionExpanderTest.SCEVExpanderNSW (74866 of 75189)
PASS: LLVM-Unit :: Transforms/Utils/./UtilsTests/ScalarEvolutionExpanderTest.SCEVExpanderNUW (74867 of 75189)
PASS: LLVM-Unit :: Transforms/Utils/./UtilsTests/ScalarEvolutionExpanderTest.SCEVExpanderShlNSW (74868 of 75189)
PASS: LLVM-Unit :: Transforms/Utils/./UtilsTests/ValueMapperTest.mapMDNode (74869 of 75189)
PASS: LLVM-Unit :: Transforms/Utils/./UtilsTests/SizeOptsTest.Test (74870 of 75189)
PASS: LLVM-Unit :: Transforms/Utils/./UtilsTests/ScalarEvolutionExpanderTest.SCEVZeroExtendExprNonIntegral (74871 of 75189)
PASS: LLVM-Unit :: Transforms/Utils/./UtilsTests/VFABIAttrTest.Write (74872 of 75189)
PASS: LLVM-Unit :: Transforms/Utils/./UtilsTests/ValueMapperTest.mapMDNodeDistinct (74873 of 75189)
PASS: LLVM-Unit :: Transforms/Utils/./UtilsTests/ValueMapperTest.mapMDNodeCycle (74874 of 75189)
PASS: LLVM-Unit :: Transforms/Utils/./UtilsTests/ValueMapperTest.mapMDNodeDistinctOperands (74875 of 75189)
PASS: LLVM-Unit :: Transforms/Utils/./UtilsTests/ValueMapperTest.mapMDNodeSeededWithNull (74876 of 75189)
PASS: LLVM-Unit :: Transforms/Utils/./UtilsTests/ValueMapperTest.mapMDNodeDuplicatedCycle (74877 of 75189)
PASS: LLVM-Unit :: Transforms/Utils/./UtilsTests/ValueMapperTest.mapMDNodeUnresolved (74878 of 75189)
PASS: LLVM-Unit :: Transforms/Utils/./UtilsTests/ValueMapperTest.mapMDNodeSeeded (74879 of 75189)
PASS: LLVM-Unit :: Transforms/Utils/./UtilsTests/ValueMapperTest.mapMetadataConstantAsMetadata (74880 of 75189)
PASS: LLVM-Unit :: Transforms/Utils/./UtilsTests/ValueMapperTest.mapMetadataGetMappedMD (74881 of 75189)
PASS: LLVM-Unit :: Transforms/Utils/./UtilsTests/ValueMapperTest.mapMetadataNoModuleLevelChanges (74882 of 75189)
PASS: LLVM-Unit :: Transforms/Utils/./UtilsTests/ValueMapperTest.mapMetadataMDString (74883 of 75189)
PASS: LLVM-Unit :: Transforms/Utils/./UtilsTests/ValueMapperTest.mapMetadataNullMapGlobalWithIgnoreMissingLocals (74884 of 75189)
PASS: LLVM-Unit :: Transforms/Utils/./UtilsTests/ValueMapperTest.mapValueLocalAsMetadata (74885 of 75189)
PASS: LLVM-Unit :: Transforms/Utils/./UtilsTests/ValueMapperTest.mapValueLocalAsMetadataToConstant (74886 of 75189)
PASS: LLVM-Unit :: Transforms/Vectorize/./VectorizeTests/VPBasicBlockTest.getPlan (74887 of 75189)
PASS: LLVM-Unit :: Transforms/Vectorize/./VectorizeTests/VPBasicBlockTest.TraversingIteratorTest (74888 of 75189)
PASS: LLVM-Unit :: Transforms/Vectorize/./VectorizeTests/VPBasicBlockTest.print (74889 of 75189)
PASS: LLVM-Unit :: Transforms/Vectorize/./VectorizeTests/VPDoubleValueDefTest.traverseUseLists (74890 of 75189)
PASS: LLVM-Unit :: Transforms/Vectorize/./VectorizeTests/VPInstructionTest.insertBefore (74891 of 75189)
PASS: LLVM-Unit :: Transforms/Vectorize/./VectorizeTests/VPInstructionTest.eraseFromParent (74892 of 75189)
PASS: LLVM-Unit :: Transforms/Vectorize/./VectorizeTests/VPInstructionTest.moveAfter (74893 of 75189)
PASS: LLVM-Unit :: Transforms/Vectorize/./VectorizeTests/VPInstructionTest.releaseOperandsAtDeletion (74894 of 75189)
PASS: LLVM-Unit :: Transforms/Vectorize/./VectorizeTests/VPInstructionTest.replaceAllUsesWith (74895 of 75189)
PASS: LLVM-Unit :: Transforms/Vectorize/./VectorizeTests/VPInstructionTest.setOperand (74896 of 75189)
PASS: LLVM-Unit :: Transforms/Vectorize/./VectorizeTests/VPInstructionTest.moveBefore (74897 of 75189)
PASS: LLVM-Unit :: Transforms/Vectorize/./VectorizeTests/VPRecipeTest.CastVPBranchOnMaskRecipeToVPUser (74898 of 75189)
PASS: LLVM-Unit :: Transforms/Vectorize/./VectorizeTests/VPRecipeTest.CastVPBlendRecipeToVPUser (74899 of 75189)
PASS: LLVM-Unit :: Transforms/Vectorize/./VectorizeTests/VPRecipeTest.CastVPInstructionToVPUser (74900 of 75189)
PASS: LLVM-Unit :: Transforms/Vectorize/./VectorizeTests/VPRecipeTest.CastVPReductionRecipeToVPUser (74901 of 75189)
PASS: LLVM-Unit :: Transforms/Vectorize/./VectorizeTests/VPRecipeTest.CastVPInterleaveRecipeToVPUser (74902 of 75189)
PASS: LLVM-Unit :: Transforms/Vectorize/./VectorizeTests/VPRecipeTest.CastVPWidenCallRecipeToVPUserAndVPDef (74903 of 75189)
PASS: LLVM-Unit :: Transforms/Vectorize/./VectorizeTests/VPRecipeTest.CastVPWidenMemoryInstructionRecipeToVPUserAndVPDef (74904 of 75189)
PASS: LLVM-Unit :: Transforms/Vectorize/./VectorizeTests/VPRecipeTest.CastVPWidenRecipeToVPUser (74905 of 75189)
PASS: LLVM-Unit :: Transforms/Vectorize/./VectorizeTests/VPRecipeTest.CastVPReplicateRecipeToVPUser (74906 of 75189)
PASS: LLVM-Unit :: Transforms/Vectorize/./VectorizeTests/VPRecipeTest.CastVPWidenGEPRecipeToVPUserAndVPDef (74907 of 75189)
PASS: LLVM-Unit :: Transforms/Vectorize/./VectorizeTests/VPRecipeTest.CastVPWidenSelectRecipeToVPUserAndVPDef (74908 of 75189)
PASS: LLVM-Unit :: Transforms/Vectorize/./VectorizeTests/VPRecipeTest.MayHaveSideEffectsAndMayReadWriteMemory (74909 of 75189)
PASS: LLVM-Unit :: Transforms/Vectorize/./VectorizeTests/VPlanHCFGTest.testBuildHCFGInnerLoop (74910 of 75189)
PASS: LLVM-Unit :: Transforms/Vectorize/./VectorizeTests/VPlanHCFGTest.testVPInstructionToVPRecipesInner (74911 of 75189)
PASS: LLVM-Unit :: Transforms/Vectorize/./VectorizeTests/VPlanDominatorTreeTest.BasicVPBBDomination (74912 of 75189)
PASS: LLVM-Unit :: Transforms/Vectorize/./VectorizeTests/VPlanLoopInfo.BasicLoopInfoTest (74913 of 75189)
PASS: LLVM-Unit :: Transforms/Vectorize/./VectorizeTests/VPlanPredicatorTest.BasicPredicatorTest (74914 of 75189)
PASS: LLVM-Unit :: Transforms/Vectorize/./VectorizeTests/VPlanPredicatorTest.PredicatorNegOrTest (74915 of 75189)
PASS: LLVM-Unit :: Transforms/Vectorize/./VectorizeTests/VPlanSlpTest.testInstrsInDifferentBBs (74916 of 75189)
PASS: LLVM-Unit :: Transforms/Vectorize/./VectorizeTests/VPlanSlpTest.testSlpAtomicStore (74917 of 75189)
PASS: LLVM-Unit :: Transforms/Vectorize/./VectorizeTests/VPlanSlpTest.testSlpAtomicLoad (74918 of 75189)
PASS: LLVM-Unit :: Transforms/Vectorize/./VectorizeTests/VPlanSlpTest.testSlpReorder_1 (74919 of 75189)
PASS: LLVM-Unit :: Transforms/Vectorize/./VectorizeTests/VPlanSlpTest.testInstrsInDifferentBBs2 (74920 of 75189)
PASS: LLVM-Unit :: Transforms/Vectorize/./VectorizeTests/VPRecipeTest.dump (74921 of 75189)
PASS: LLVM-Unit :: Transforms/Utils/./UtilsTests/ValueMapperTest.mapMetadataLocalAsMetadata (74922 of 75189)
PASS: LLVM-Unit :: Transforms/Vectorize/./VectorizeTests/VPlanSlpTest.testSlpReorder_3 (74923 of 75189)
PASS: LLVM-Unit :: Transforms/Vectorize/./VectorizeTests/VPlanSlpTest.testSlpReorder_2 (74924 of 75189)
PASS: LLVM-Unit :: XRay/./XRayTests/FDRBlockIndexerTest.IndexBlocksV3 (74925 of 75189)
PASS: LLVM-Unit :: XRay/./XRayTests/FDRBlockVerifierTest.IgnoreRecordsAfterEOB (74926 of 75189)
PASS: LLVM-Unit :: XRay/./XRayTests/FDRBlockVerifierTest.MalformedV2 (74927 of 75189)
PASS: LLVM-Unit :: Transforms/Vectorize/./VectorizeTests/VPlanSlpTest.testSlpReorder_4 (74928 of 75189)
PASS: LLVM-Unit :: Transforms/Vectorize/./VectorizeTests/VPlanSlpTest.testSlpReuse_1 (74929 of 75189)
PASS: LLVM-Unit :: Transforms/Vectorize/./VectorizeTests/VPlanSlpTest.testSlpSimple_2 (74930 of 75189)
PASS: LLVM-Unit :: Transforms/Vectorize/./VectorizeTests/VPlanSlpTest.testSlpReuse_2 (74931 of 75189)
PASS: LLVM-Unit :: Transforms/Vectorize/./VectorizeTests/VPlanSlpTest.testSlpSimple_3 (74932 of 75189)
PASS: LLVM-Unit :: XRay/./XRayTests/FDRBlockVerifierTest.MissingBufferExtents (74933 of 75189)
PASS: LLVM-Unit :: XRay/./XRayTests/FDRBlockVerifierTest.MissingPIDRecord (74934 of 75189)
PASS: LLVM-Unit :: XRay/./XRayTests/FDRBlockVerifierTest.ValidBlocksV3 (74935 of 75189)
PASS: LLVM-Unit :: XRay/./XRayTests/FDRRecordPrinterTest.WriteFunctionRecordEnter (74936 of 75189)
PASS: LLVM-Unit :: XRay/./XRayTests/FDRRecordPrinterTest.WriteFunctionRecordExit (74937 of 75189)
PASS: LLVM-Unit :: XRay/./XRayTests/FDRRecordPrinterTest.WriteFunctionRecordTailExit (74938 of 75189)
PASS: LLVM-Unit :: XRay/./XRayTests/FDRRecordPrinterTest.WriteFunctionRecordEnterArg (74939 of 75189)
PASS: LLVM-Unit :: XRay/./XRayTests/FDRTraceWriterTest.WriteToStringBufferVersion1 (74940 of 75189)
PASS: LLVM-Unit :: XRay/./XRayTests/FDRTraceWriterTest.WriteToStringBufferVersion3 (74941 of 75189)
PASS: LLVM-Unit :: XRay/./XRayTests/FDRTraceWriterTest.WriteToStringBufferVersion2 (74942 of 75189)
PASS: LLVM-Unit :: XRay/./XRayTests/GraphTest.TestiVertexAccessOperator (74943 of 75189)
PASS: LLVM-Unit :: XRay/./XRayTests/GraphTest.TestConstruction (74944 of 75189)
PASS: LLVM-Unit :: XRay/./XRayTests/GraphTest.TestEdgeAccessOperator (74945 of 75189)
PASS: LLVM-Unit :: XRay/./XRayTests/GraphTest/0.TestCopyAssign (74946 of 75189)
PASS: LLVM-Unit :: XRay/./XRayTests/GraphTest/0.TestGraphVertex (74947 of 75189)
PASS: LLVM-Unit :: XRay/./XRayTests/GraphTest/0.TestGraphEdge (74948 of 75189)
PASS: LLVM-Unit :: XRay/./XRayTests/GraphTest/0.TestCopyConstructor (74949 of 75189)
PASS: LLVM-Unit :: XRay/./XRayTests/GraphTest/0.TestMoveConstructor (74950 of 75189)
PASS: LLVM-Unit :: XRay/./XRayTests/GraphTest/1.TestGraphEdge (74951 of 75189)
PASS: LLVM-Unit :: XRay/./XRayTests/GraphTest/1.TestCopyConstructor (74952 of 75189)
PASS: LLVM-Unit :: XRay/./XRayTests/ProfileTest.AddBlocks (74953 of 75189)
PASS: LLVM-Unit :: XRay/./XRayTests/GraphTest/1.TestCopyAssign (74954 of 75189)
PASS: LLVM-Unit :: XRay/./XRayTests/ProfileTest.CreateProfile (74955 of 75189)
PASS: LLVM-Unit :: XRay/./XRayTests/GraphTest/1.TestGraphVertex (74956 of 75189)
PASS: LLVM-Unit :: XRay/./XRayTests/GraphTest/1.TestMoveConstructor (74957 of 75189)
PASS: LLVM-Unit :: XRay/./XRayTests/ProfileTest.CopyProfile (74958 of 75189)
PASS: LLVM-Unit :: XRay/./XRayTests/ProfileTest.InternPath (74959 of 75189)
PASS: LLVM-Unit :: XRay/./XRayTests/ProfileTest.ExpandPath (74960 of 75189)
PASS: LLVM-Unit :: XRay/./XRayTests/ProfileTest.MergeProfilesByStack (74961 of 75189)
PASS: LLVM-Unit :: XRay/./XRayTests/ProfileTest.MergeProfilesByThread (74962 of 75189)
PASS: LLVM-Unit :: XRay/./XRayTests/ProfileTest.MergeProfilesByStackAccumulate (74963 of 75189)
PASS: LLVM-Unit :: XRay/./XRayTests/ProfileTest.MoveProfile (74964 of 75189)
PASS: LLVM-Unit :: XRay/./XRayTests/ProfileTest.MergeProfilesByThreadAccumulate (74965 of 75189)
PASS: LLVM-Unit :: XRay/./XRayTests/Records/PrinterTest/2.PrintsRecord (74966 of 75189)
PASS: LLVM-Unit :: XRay/./XRayTests/Records/PrinterTest/0.PrintsRecord (74967 of 75189)
PASS: LLVM-Unit :: XRay/./XRayTests/Records/PrinterTest/1.PrintsRecord (74968 of 75189)
PASS: LLVM-Unit :: XRay/./XRayTests/Records/PrinterTest/3.PrintsRecord (74969 of 75189)
PASS: LLVM-Unit :: XRay/./XRayTests/Records/PrinterTest/5.PrintsRecord (74970 of 75189)
PASS: LLVM-Unit :: XRay/./XRayTests/Records/PrinterTest/6.PrintsRecord (74971 of 75189)
PASS: LLVM-Unit :: XRay/./XRayTests/Records/PrinterTest/4.PrintsRecord (74972 of 75189)
PASS: LLVM-Unit :: XRay/./XRayTests/Records/PrinterTest/8.PrintsRecord (74973 of 75189)
PASS: LLVM-Unit :: XRay/./XRayTests/Records/PrinterTest/9.PrintsRecord (74974 of 75189)
PASS: LLVM-Unit :: XRay/./XRayTests/Records/PrinterTest/7.PrintsRecord (74975 of 75189)
PASS: LLVM-Unit :: XRay/./XRayTests/Records/RoundTripTest/0.RoundTripsSingleValue (74976 of 75189)
PASS: LLVM-Unit :: XRay/./XRayTests/Records/RoundTripTest/2.RoundTripsSingleValue (74977 of 75189)
PASS: LLVM-Unit :: XRay/./XRayTests/Records/RoundTripTest/4.RoundTripsSingleValue (74978 of 75189)
PASS: LLVM-Unit :: XRay/./XRayTests/Records/RoundTripTest/1.RoundTripsSingleValue (74979 of 75189)
PASS: LLVM-Unit :: XRay/./XRayTests/Records/RoundTripTest/3.RoundTripsSingleValue (74980 of 75189)
PASS: LLVM-Unit :: XRay/./XRayTests/Records/RoundTripTest/6.RoundTripsSingleValue (74981 of 75189)
PASS: LLVM-Unit :: XRay/./XRayTests/Records/RoundTripTestV5/1.RoundTripsSingleValue (74982 of 75189)
PASS: LLVM-Unit :: XRay/./XRayTests/Records/RoundTripTest/5.RoundTripsSingleValue (74983 of 75189)
PASS: LLVM-Unit :: XRay/./XRayTests/Records/RoundTripTestV5/0.RoundTripsSingleValue (74984 of 75189)
PASS: LLVM-Unit :: XRay/./XRayTests/Records/RoundTripTest/7.RoundTripsSingleValue (74985 of 75189)
PASS: LLVM-Unit :: XRay/./XRayTests/Records/RoundTripTestV5/4.RoundTripsSingleValue (74986 of 75189)
PASS: LLVM-Unit :: XRay/./XRayTests/Records/RoundTripTestV5/3.RoundTripsSingleValue (74987 of 75189)
PASS: LLVM-Unit :: XRay/./XRayTests/Records/RoundTripTestV5/2.RoundTripsSingleValue (74988 of 75189)
PASS: LLVM-Unit :: XRay/./XRayTests/Records/RoundTripTestV5/5.RoundTripsSingleValue (74989 of 75189)
PASS: LLVM-Unit :: XRay/./XRayTests/Records/RoundTripTestV5/6.RoundTripsSingleValue (74990 of 75189)
PASS: LLVM-Unit :: XRay/./XRayTests/Records/RoundTripTestV5/7.RoundTripsSingleValue (74991 of 75189)
PASS: LLVM-Unit :: XRay/./XRayTests/Records/RoundTripTestV5/8.RoundTripsSingleValue (74992 of 75189)
PASS: LLVM-Unit :: XRay/./XRayTests/XRayFDRTest.IndexAndVerifyBlocks (74993 of 75189)
PASS: LLVM-Unit :: XRay/./XRayTests/XRayFDRTest.BuilderAndBlockIndexer (74994 of 75189)
PASS: LLVM-Unit :: XRay/./XRayTests/XRayFDRTest.BuilderAndBlockVerifier (74995 of 75189)
PASS: LLVM-Unit :: tools/llvm-cfi-verify/./CFIVerifyTests/BasicAArch64FileAnalysisTest.AArch64BasicProtected (74996 of 75189)
PASS: LLVM-Unit :: tools/llvm-cfi-verify/./CFIVerifyTests/BasicAArch64FileAnalysisTest.AArch64BasicUnprotected (74997 of 75189)
PASS: LLVM-Unit :: tools/llvm-cfi-verify/./CFIVerifyTests/BasicAArch64FileAnalysisTest.AArch64ClobberBasic (74998 of 75189)
PASS: LLVM-Unit :: tools/llvm-cfi-verify/./CFIVerifyTests/BasicAArch64FileAnalysisTest.AArch64ClobberUnrelatedSecondLoad (74999 of 75189)
PASS: LLVM-Unit :: tools/llvm-cfi-verify/./CFIVerifyTests/BasicAArch64FileAnalysisTest.AArch64ClobberLoadAddBad2 (75000 of 75189)
PASS: LLVM-Unit :: tools/llvm-cfi-verify/./CFIVerifyTests/BasicAArch64FileAnalysisTest.AArch64ClobberLoadAddBad (75001 of 75189)
PASS: LLVM-Unit :: tools/llvm-cfi-verify/./CFIVerifyTests/BasicAArch64FileAnalysisTest.AArch64ClobberTwoLoads (75002 of 75189)
PASS: LLVM-Unit :: tools/llvm-cfi-verify/./CFIVerifyTests/BasicAArch64FileAnalysisTest.AArch64ClobberOneLoad (75003 of 75189)
PASS: LLVM-Unit :: tools/llvm-cfi-verify/./CFIVerifyTests/BasicAArch64FileAnalysisTest.AArch64GoodAndBadPaths (75004 of 75189)
PASS: LLVM-Unit :: tools/llvm-cfi-verify/./CFIVerifyTests/BasicAArch64FileAnalysisTest.AArch64ClobberUnrelatedLoads (75005 of 75189)
PASS: LLVM-Unit :: tools/llvm-cfi-verify/./CFIVerifyTests/BasicAArch64FileAnalysisTest.AArch64TwoPathsBadLoad1 (75006 of 75189)
PASS: LLVM-Unit :: tools/llvm-cfi-verify/./CFIVerifyTests/BasicAArch64FileAnalysisTest.AArch64ClobberLoadAddGood (75007 of 75189)
PASS: LLVM-Unit :: tools/llvm-cfi-verify/./CFIVerifyTests/BasicAArch64FileAnalysisTest.AArch64TwoPaths (75008 of 75189)
PASS: LLVM-Unit :: tools/llvm-cfi-verify/./CFIVerifyTests/BasicAArch64FileAnalysisTest.AArch64TwoPathsBadLoad2 (75009 of 75189)
PASS: LLVM-Unit :: tools/llvm-cfi-verify/./CFIVerifyTests/BasicGraphBuilderTest.BuildFlowGraphComplexExample (75010 of 75189)
PASS: LLVM-Unit :: tools/llvm-cfi-verify/./CFIVerifyTests/BasicGraphBuilderTest.BuildFlowGraphNoXrefs (75011 of 75189)
PASS: LLVM-Unit :: tools/llvm-cfi-verify/./CFIVerifyTests/BasicGraphBuilderTest.BuildFlowGraphFailures (75012 of 75189)
PASS: LLVM-Unit :: tools/llvm-cfi-verify/./CFIVerifyTests/BasicGraphBuilderTest.BuildFlowGraphLengthExceededUpwards (75013 of 75189)
PASS: LLVM-Unit :: tools/llvm-cfi-verify/./CFIVerifyTests/BasicGraphBuilderTest.BuildFlowGraphTestDualPathDualUd2 (75014 of 75189)
PASS: LLVM-Unit :: tools/llvm-cfi-verify/./CFIVerifyTests/BasicGraphBuilderTest.BuildFlowGraphConditionalInfiniteLoop (75015 of 75189)
PASS: LLVM-Unit :: tools/llvm-cfi-verify/./CFIVerifyTests/BasicGraphBuilderTest.BuildFlowGraphLengthExceededDownwards (75016 of 75189)
PASS: LLVM-Unit :: tools/llvm-cfi-verify/./CFIVerifyTests/BasicGraphBuilderTest.BuildFlowGraphTestDualPathSingleUd2 (75017 of 75189)
PASS: LLVM-Unit :: tools/llvm-cfi-verify/./CFIVerifyTests/BasicGraphBuilderTest.BuildFlowGraphNoFlowsToIndirection (75018 of 75189)
PASS: LLVM-Unit :: tools/llvm-cfi-verify/./CFIVerifyTests/BasicX86FileAnalysisTest.CFIProtectionBasicFallthroughToUd2 (75019 of 75189)
PASS: LLVM-Unit :: tools/llvm-cfi-verify/./CFIVerifyTests/BasicX86FileAnalysisTest.BasicDisassemblyTraversalTest (75020 of 75189)
PASS: LLVM-Unit :: tools/llvm-cfi-verify/./CFIVerifyTests/BasicGraphBuilderTest.BuildFlowGraphTestSinglePathJumpUd2 (75021 of 75189)
PASS: LLVM-Unit :: tools/llvm-cfi-verify/./CFIVerifyTests/BasicGraphBuilderTest.BuildFlowGraphWithRepeatedWork (75022 of 75189)
PASS: LLVM-Unit :: tools/llvm-cfi-verify/./CFIVerifyTests/BasicX86FileAnalysisTest.CFIProtectionBasicJumpToUd2 (75023 of 75189)
PASS: LLVM-Unit :: tools/llvm-cfi-verify/./CFIVerifyTests/BasicGraphBuilderTest.BuildFlowGraphUnconditionalInfiniteLoop (75024 of 75189)
PASS: LLVM-Unit :: tools/llvm-cfi-verify/./CFIVerifyTests/BasicGraphBuilderTest.BuildFlowGraphTestSinglePathFallthroughUd2 (75025 of 75189)
PASS: LLVM-Unit :: tools/llvm-cfi-verify/./CFIVerifyTests/BasicX86FileAnalysisTest.CFIProtectionInvalidTargets (75026 of 75189)
PASS: LLVM-Unit :: tools/llvm-cfi-verify/./CFIVerifyTests/BasicX86FileAnalysisTest.CFIProtectionClobberSinglePathExplicit (75027 of 75189)
PASS: LLVM-Unit :: tools/llvm-cfi-verify/./CFIVerifyTests/BasicX86FileAnalysisTest.CFIProtectionClobberSinglePathImplicit (75028 of 75189)
PASS: LLVM-Unit :: tools/llvm-cfi-verify/./CFIVerifyTests/BasicX86FileAnalysisTest.CFIProtectionGoodAndBadPaths (75029 of 75189)
PASS: LLVM-Unit :: tools/llvm-cfi-verify/./CFIVerifyTests/BasicX86FileAnalysisTest.CFIProtectionDualFailLimitDownwards (75030 of 75189)
PASS: LLVM-Unit :: tools/llvm-cfi-verify/./CFIVerifyTests/BasicX86FileAnalysisTest.CFIProtectionComplexExample (75031 of 75189)
PASS: LLVM-Unit :: tools/llvm-cfi-verify/./CFIVerifyTests/BasicX86FileAnalysisTest.CFIProtectionDualPathSingleUd2 (75032 of 75189)
PASS: LLVM-Unit :: tools/llvm-cfi-verify/./CFIVerifyTests/BasicX86FileAnalysisTest.CFIProtectionWithUnconditionalJumpInFallthrough (75033 of 75189)
PASS: LLVM-Unit :: tools/llvm-cfi-verify/./CFIVerifyTests/BasicX86FileAnalysisTest.CFIProtectionClobberSinglePathExplicit2 (75034 of 75189)
PASS: LLVM-Unit :: tools/llvm-cfi-verify/./CFIVerifyTests/BasicX86FileAnalysisTest.CFIProtectionDualPathUd2 (75035 of 75189)
PASS: LLVM-Unit :: tools/llvm-cfi-verify/./CFIVerifyTests/BasicX86FileAnalysisTest.ControlFlowXRefsTest (75036 of 75189)
PASS: LLVM-Unit :: tools/llvm-cfi-verify/./CFIVerifyTests/BasicX86FileAnalysisTest.CFIProtectionClobberDualPathImplicit (75037 of 75189)
PASS: LLVM-Unit :: tools/llvm-cfi-verify/./CFIVerifyTests/BasicX86FileAnalysisTest.CFITrapTest (75038 of 75189)
PASS: LLVM-Unit :: tools/llvm-cfi-verify/./CFIVerifyTests/BasicX86FileAnalysisTest.DefiniteNextInstructionTest (75039 of 75189)
PASS: LLVM-Unit :: tools/llvm-cfi-verify/./CFIVerifyTests/BasicX86FileAnalysisTest.CFIProtectionDualFailLimitUpwards (75040 of 75189)
PASS: LLVM-Unit :: tools/llvm-exegesis/./LLVMExegesisTests/ClusteringTest.Clusters3D_InvalidOrder (75041 of 75189)
PASS: LLVM-Unit :: tools/llvm-exegesis/./LLVMExegesisTests/ClusteringTest.Clusters3D (75042 of 75189)
PASS: LLVM-Unit :: tools/llvm-exegesis/./LLVMExegesisTests/ClusteringTest.Clusters3D_InvalidSize (75043 of 75189)
PASS: LLVM-Unit :: tools/llvm-exegesis/./LLVMExegesisTests/CombinationGenerator.LeftColumn (75044 of 75189)
PASS: LLVM-Unit :: tools/llvm-exegesis/./LLVMExegesisTests/ClusteringTest.Ordering2 (75045 of 75189)
PASS: LLVM-Unit :: tools/llvm-exegesis/./LLVMExegesisTests/CombinationGenerator.MiddleColumn (75046 of 75189)
PASS: LLVM-Unit :: tools/llvm-exegesis/./LLVMExegesisTests/ClusteringTest.Ordering1 (75047 of 75189)
PASS: LLVM-Unit :: tools/llvm-exegesis/./LLVMExegesisTests/CombinationGenerator.Column (75048 of 75189)
PASS: LLVM-Unit :: tools/llvm-exegesis/./LLVMExegesisTests/CombinationGenerator.RightColumn (75049 of 75189)
PASS: LLVM-Unit :: tools/llvm-exegesis/./LLVMExegesisTests/CombinationGenerator.Row (75050 of 75189)
PASS: LLVM-Unit :: tools/llvm-exegesis/./LLVMExegesisTests/ClusteringTest.Ordering (75051 of 75189)
PASS: LLVM-Unit :: tools/llvm-cfi-verify/./CFIVerifyTests/BasicX86FileAnalysisTest.PrevAndNextFromBadInst (75052 of 75189)
PASS: LLVM-Unit :: tools/llvm-cfi-verify/./CFIVerifyTests/BasicX86FileAnalysisTest.FallThroughTest (75053 of 75189)
PASS: LLVM-Unit :: tools/llvm-cfi-verify/./CFIVerifyTests/BasicX86FileAnalysisTest.UndefSearchLengthOneTestFarAway (75054 of 75189)
PASS: LLVM-Unit :: tools/llvm-cfi-verify/./CFIVerifyTests/BasicX86FileAnalysisTest.UndefSearchLengthOneTest (75055 of 75189)
PASS: LLVM-Unit :: tools/llvm-exegesis/./LLVMExegesisTests/CombinationGenerator.SideColumns (75056 of 75189)
PASS: LLVM-Unit :: tools/llvm-exegesis/./LLVMExegesisTests/CombinationGenerator.Square (75057 of 75189)
PASS: LLVM-Unit :: tools/llvm-exegesis/./LLVMExegesisTests/CombinationGenerator.Singleton (75058 of 75189)
PASS: LLVM-Unit :: tools/llvm-exegesis/./LLVMExegesisTests/PerfHelperTest.FunctionalTest (75059 of 75189)
PASS: LLVM-Unit :: tools/llvm-exegesis/./LLVMExegesisTests/RegisterValueTest.Half (75060 of 75189)
PASS: LLVM-Unit :: tools/llvm-exegesis/./LLVMExegesisTests/RegisterValueTest.Double (75061 of 75189)
PASS: LLVM-Unit :: tools/llvm-exegesis/./LLVMExegesisTests/RegisterValueTest.Single (75062 of 75189)
PASS: LLVM-Unit :: tools/llvm-exegesis/./LLVMExegesisTests/ScratchSpaceTest.Works (75063 of 75189)
PASS: LLVM-Unit :: tools/llvm-exegesis/AArch64/./LLVMExegesisAArch64Tests/AArch64TargetTest.SetRegToConstant (75064 of 75189)
PASS: LLVM-Unit :: tools/llvm-exegesis/AArch64/./LLVMExegesisAArch64Tests/AArch64TargetTest.DefaultPfmCounters (75065 of 75189)
PASS: LLVM-Unit :: tools/llvm-exegesis/Mips/./LLVMExegesisMipsTests/BenchmarkResultTest.PerInstructionStats (75066 of 75189)
PASS: LLVM-Unit :: tools/llvm-exegesis/Mips/./LLVMExegesisMipsTests/MipsTargetTest.DefaultPfmCounters (75067 of 75189)
PASS: LLVM-Unit :: tools/llvm-exegesis/Mips/./LLVMExegesisMipsTests/MipsTargetTest.SetGPR32RegTo16BitValue (75068 of 75189)
PASS: LLVM-Unit :: tools/llvm-exegesis/Mips/./LLVMExegesisMipsTests/MipsTargetTest.SetGPR32RegTo32BitValue (75069 of 75189)
PASS: LLVM-Unit :: tools/llvm-exegesis/Mips/./LLVMExegesisMipsTests/BenchmarkResultTest.WriteToAndReadFromDisk (75070 of 75189)
PASS: LLVM-Unit :: tools/llvm-exegesis/Mips/./LLVMExegesisMipsTests/MipsTargetTest.SetGPR64RegTo16BitValue (75071 of 75189)
PASS: LLVM-Unit :: tools/llvm-exegesis/Mips/./LLVMExegesisMipsTests/MipsTargetTest.SetGPR64RegTo32BitValue (75072 of 75189)
PASS: LLVM-Unit :: tools/llvm-exegesis/Mips/./LLVMExegesisMipsTests/ParallelSnippetGeneratorTest.MemoryUse (75073 of 75189)
PASS: LLVM-Unit :: tools/llvm-exegesis/Mips/./LLVMExegesisMipsTests/RegisterAliasingTest.TrackRegisterClass (75074 of 75189)
PASS: LLVM-Unit :: tools/llvm-exegesis/Mips/./LLVMExegesisMipsTests/RegisterAliasingTest.TrackSimpleRegister (75075 of 75189)
PASS: LLVM-Unit :: tools/llvm-exegesis/Mips/./LLVMExegesisMipsTests/RegisterAliasingTest.TrackRegisterClassCache (75076 of 75189)
PASS: LLVM-Unit :: tools/llvm-exegesis/Mips/./LLVMExegesisMipsTests/SerialSnippetGeneratorTest.ImplicitSelfDependencyThroughExplicitRegs (75077 of 75189)
PASS: LLVM-Unit :: tools/llvm-exegesis/PowerPC/./LLVMExegesisPowerPCTests/AnalysisTest.ComputeIdealizedProcResPressure_1ALUE (75078 of 75189)
PASS: LLVM-Unit :: tools/llvm-exegesis/PowerPC/./LLVMExegesisPowerPCTests/AnalysisTest.ComputeIdealizedProcResPressure_1ALU1IPAGEN (75079 of 75189)
PASS: LLVM-Unit :: tools/llvm-exegesis/PowerPC/./LLVMExegesisPowerPCTests/AnalysisTest.ComputeIdealizedProcResPressure_2ALU (75080 of 75189)
PASS: LLVM-Unit :: tools/llvm-exegesis/PowerPC/./LLVMExegesisPowerPCTests/ParallelSnippetGeneratorTest.MemoryUse (75081 of 75189)
PASS: LLVM-Unit :: tools/llvm-exegesis/PowerPC/./LLVMExegesisPowerPCTests/PowerPCTargetTest.DefaultPfmCounters (75082 of 75189)
PASS: LLVM-Unit :: tools/llvm-exegesis/PowerPC/./LLVMExegesisPowerPCTests/PowerPCTargetTest.SetRegToConstant (75083 of 75189)
PASS: LLVM-Unit :: tools/llvm-exegesis/PowerPC/./LLVMExegesisPowerPCTests/SerialSnippetGeneratorTest.ImplicitSelfDependencyThroughExplicitRegs (75084 of 75189)
PASS: LLVM-Unit :: tools/llvm-exegesis/Mips/./LLVMExegesisMipsTests/SerialSnippetGeneratorTest.ImplicitSelfDependencyThroughExplicitRegsForbidAll (75085 of 75189)
PASS: LLVM-Unit :: tools/llvm-exegesis/PowerPC/./LLVMExegesisPowerPCTests/SerialSnippetGeneratorTest.ImplicitSelfDependencyThroughTiedRegs (75086 of 75189)
PASS: LLVM-Unit :: tools/llvm-exegesis/X86/./LLVMExegesisX86Tests/BenchmarkResultTest.PerInstructionStats (75087 of 75189)
PASS: LLVM-Unit :: tools/llvm-exegesis/X86/./LLVMExegesisX86Tests/Core2Avx512TargetTest.FillMemoryOperands_ADD64rm (75088 of 75189)
PASS: LLVM-Unit :: tools/llvm-exegesis/X86/./LLVMExegesisX86Tests/Core2Avx512TargetTest.FillMemoryOperands_VGATHERDPSZ128rm (75089 of 75189)
PASS: LLVM-Unit :: tools/llvm-exegesis/X86/./LLVMExegesisX86Tests/Core2Avx512TargetTest.SetRegToVR128Value_Use_VMOVDQU32Z128rm (75090 of 75189)
PASS: LLVM-Unit :: tools/llvm-exegesis/X86/./LLVMExegesisX86Tests/Core2Avx512TargetTest.SetRegToVR256Value_Use_VMOVDQU32Z256rm (75091 of 75189)
PASS: LLVM-Unit :: tools/llvm-exegesis/X86/./LLVMExegesisX86Tests/Core2AvxTargetTest.SetRegToVR128Value_Use_VMOVDQUrm (75092 of 75189)
PASS: LLVM-Unit :: tools/llvm-exegesis/X86/./LLVMExegesisX86Tests/Core2AvxTargetTest.SetRegToVR256Value_Use_VMOVDQUYrm (75093 of 75189)
PASS: LLVM-Unit :: tools/llvm-exegesis/X86/./LLVMExegesisX86Tests/Core2Avx512TargetTest.SetRegToVR512Value (75094 of 75189)
PASS: LLVM-Unit :: tools/llvm-exegesis/X86/./LLVMExegesisX86Tests/Core2TargetTest.AllowAsBackToBack (75095 of 75189)
PASS: LLVM-Unit :: tools/llvm-exegesis/X86/./LLVMExegesisX86Tests/Core2TargetTest.NoHighByteRegs (75096 of 75189)
PASS: LLVM-Unit :: tools/llvm-exegesis/X86/./LLVMExegesisX86Tests/Core2TargetTest.SetFlags (75097 of 75189)
PASS: LLVM-Unit :: tools/llvm-exegesis/X86/./LLVMExegesisX86Tests/Core2TargetTest.SetRegToFP0_80Bits (75098 of 75189)
PASS: LLVM-Unit :: tools/llvm-exegesis/X86/./LLVMExegesisX86Tests/Core2TargetTest.SetRegToFP1_32Bits (75099 of 75189)
PASS: LLVM-Unit :: tools/llvm-exegesis/X86/./LLVMExegesisX86Tests/Core2TargetTest.SetRegToFP1_4Bits (75100 of 75189)
PASS: LLVM-Unit :: tools/llvm-exegesis/X86/./LLVMExegesisX86Tests/Core2TargetTest.SetRegToGR16Value (75101 of 75189)
PASS: LLVM-Unit :: tools/llvm-exegesis/X86/./LLVMExegesisX86Tests/Core2TargetTest.SetRegToGR32Value (75102 of 75189)
PASS: LLVM-Unit :: tools/llvm-exegesis/X86/./LLVMExegesisX86Tests/Core2TargetTest.SetRegToGR8Value (75103 of 75189)
PASS: LLVM-Unit :: tools/llvm-exegesis/X86/./LLVMExegesisX86Tests/Core2TargetTest.SetRegToGR64Value (75104 of 75189)
PASS: LLVM-Unit :: tools/llvm-exegesis/X86/./LLVMExegesisX86Tests/Core2TargetTest.SetRegToST0_32Bits (75105 of 75189)
PASS: LLVM-Unit :: tools/llvm-exegesis/X86/./LLVMExegesisX86Tests/BenchmarkResultTest.WriteToAndReadFromDisk (75106 of 75189)
PASS: LLVM-Unit :: tools/llvm-exegesis/X86/./LLVMExegesisX86Tests/Core2TargetTest.SetRegToST0_64Bits (75107 of 75189)
PASS: LLVM-Unit :: tools/llvm-exegesis/X86/./LLVMExegesisX86Tests/Core2TargetTest.SetRegToVR128Value_Use_MOVDQUrm (75108 of 75189)
PASS: LLVM-Unit :: tools/llvm-exegesis/X86/./LLVMExegesisX86Tests/Core2TargetTest.SetRegToST1_32Bits (75109 of 75189)
PASS: LLVM-Unit :: tools/llvm-exegesis/X86/./LLVMExegesisX86Tests/Core2TargetTest.SetRegToST0_80Bits (75110 of 75189)
PASS: LLVM-Unit :: tools/llvm-exegesis/X86/./LLVMExegesisX86Tests/Core2TargetTest.SetRegToVR64Value (75111 of 75189)
PASS: LLVM-Unit :: tools/llvm-exegesis/X86/./LLVMExegesisX86Tests/FakeSnippetGeneratorTest.ComputeRegisterInitialValuesAdd16ri (75112 of 75189)
PASS: LLVM-Unit :: tools/llvm-exegesis/X86/./LLVMExegesisX86Tests/FakeSnippetGeneratorTest.ComputeRegisterInitialValuesAdd64rr (75113 of 75189)
PASS: LLVM-Unit :: tools/llvm-exegesis/X86/./LLVMExegesisX86Tests/FakeSnippetGeneratorTest.MemoryUse_Movsb (75114 of 75189)
PASS: LLVM-Unit :: tools/llvm-exegesis/X86/./LLVMExegesisX86Tests/ParallelSnippetGeneratorTest.MOV16ms (75115 of 75189)
PASS: LLVM-Unit :: tools/llvm-exegesis/X86/./LLVMExegesisX86Tests/ParallelSnippetGeneratorTest.MemoryUse (75116 of 75189)
PASS: LLVM-Unit :: tools/llvm-exegesis/X86/./LLVMExegesisX86Tests/ParallelSnippetGeneratorTest.NoTiedVariables (75117 of 75189)
PASS: LLVM-Unit :: tools/llvm-exegesis/X86/./LLVMExegesisX86Tests/ParallelSnippetGeneratorTest.ParallelInstruction (75118 of 75189)
PASS: LLVM-Unit :: tools/llvm-exegesis/X86/./LLVMExegesisX86Tests/ParallelSnippetGeneratorTest.SerialInstruction (75119 of 75189)
PASS: LLVM-Unit :: tools/llvm-exegesis/X86/./LLVMExegesisX86Tests/RegisterAliasingTest.TrackRegisterClass (75120 of 75189)
PASS: LLVM-Unit :: tools/llvm-exegesis/X86/./LLVMExegesisX86Tests/ParallelSnippetGeneratorTest.StaticRenaming (75121 of 75189)
PASS: LLVM-Unit :: tools/llvm-exegesis/X86/./LLVMExegesisX86Tests/RegisterAliasingTest.TrackRegisterClassCache (75122 of 75189)
PASS: LLVM-Unit :: tools/llvm-exegesis/X86/./LLVMExegesisX86Tests/SchedClassResolutionTest.ComputeIdealizedProcResPressure_1P1_1P05_2P0156 (75123 of 75189)
PASS: LLVM-Unit :: tools/llvm-exegesis/X86/./LLVMExegesisX86Tests/SchedClassResolutionTest.ComputeIdealizedProcResPressure_2P0 (75124 of 75189)
PASS: LLVM-Unit :: tools/llvm-exegesis/X86/./LLVMExegesisX86Tests/RegisterAliasingTest.TrackSimpleRegister (75125 of 75189)
PASS: LLVM-Unit :: tools/llvm-exegesis/X86/./LLVMExegesisX86Tests/SchedClassResolutionTest.ComputeIdealizedProcResPressure_2P05 (75126 of 75189)
PASS: LLVM-Unit :: tools/llvm-exegesis/X86/./LLVMExegesisX86Tests/SchedClassResolutionTest.ComputeIdealizedProcResPressure_2P05_2P0156 (75127 of 75189)
PASS: LLVM-Unit :: tools/llvm-exegesis/X86/./LLVMExegesisX86Tests/SerialSnippetGeneratorTest.ImplicitSelfDependencyThroughExplicitRegs (75128 of 75189)
PASS: LLVM-Unit :: tools/llvm-exegesis/X86/./LLVMExegesisX86Tests/SerialSnippetGeneratorTest.DependencyThroughOtherOpcode (75129 of 75189)
PASS: LLVM-Unit :: tools/llvm-exegesis/X86/./LLVMExegesisX86Tests/SerialSnippetGeneratorTest.ImplicitSelfDependencyThroughImplicitReg (75130 of 75189)
PASS: LLVM-Unit :: tools/llvm-exegesis/X86/./LLVMExegesisX86Tests/SerialSnippetGeneratorTest.ImplicitSelfDependencyThroughTiedRegs (75131 of 75189)
PASS: LLVM-Unit :: tools/llvm-exegesis/X86/./LLVMExegesisX86Tests/SerialSnippetGeneratorTest.VCVTUSI642SDZrrb_Int (75132 of 75189)
PASS: LLVM-Unit :: tools/llvm-profgen/./LLVMProfgenTests/TestCompression.TestMaxDedupSize (75133 of 75189)
PASS: LLVM-Unit :: tools/llvm-exegesis/X86/./LLVMExegesisX86Tests/X86SnippetFileTest.BadDefregParam (75134 of 75189)
PASS: LLVM-Unit :: tools/llvm-exegesis/X86/./LLVMExegesisX86Tests/X86SnippetFileTest.MissingParam (75135 of 75189)
PASS: LLVM-Unit :: tools/llvm-exegesis/X86/./LLVMExegesisX86Tests/X86SnippetFileTest.NoAsmStreamer (75136 of 75189)
PASS: LLVM-Unit :: tools/llvm-exegesis/X86/./LLVMExegesisX86Tests/X86SnippetFileTest.NoDefregValue (75137 of 75189)
PASS: LLVM-Unit :: tools/llvm-profgen/./LLVMProfgenTests/TestCompression.TestNoSizeLimit1 (75138 of 75189)
PASS: LLVM-Unit :: tools/llvm-exegesis/X86/./LLVMExegesisX86Tests/X86SnippetRepetitorTest.Duplicate (75139 of 75189)
PASS: LLVM-Unit :: tools/llvm-exegesis/X86/./LLVMExegesisX86Tests/X86SnippetFileTest.Works (75140 of 75189)
PASS: LLVM-Unit :: tools/llvm-exegesis/X86/./LLVMExegesisX86Tests/X86SnippetRepetitorTest.Loop (75141 of 75189)
PASS: LLVM-Unit :: tools/llvm-profgen/./LLVMProfgenTests/TestCompression.TestNoSizeLimit2 (75142 of 75189)
PASS: LLVM-Unit :: tools/llvm-exegesis/X86/./LLVMExegesisX86Tests/SerialSnippetGeneratorTest.LAHF (75143 of 75189)
PASS: LLVM-Unit :: tools/llvm-exegesis/X86/./LLVMExegesisX86Tests/SerialSnippetGeneratorTest.ImplicitSelfDependencyThroughExplicitRegsForbidAll (75144 of 75189)
PASS: lit :: boolean-parsing.py (75145 of 75189)
PASS: lit :: custom-result-category.py (75146 of 75189)
PASS: lit :: parallelism-groups.py (75147 of 75189)
PASS: lit :: lld-features.py (75148 of 75189)
PASS: lit :: progress-bar.py (75149 of 75189)
PASS: lit :: googletest-discovery-failed.py (75150 of 75189)
PASS: lit :: shtest-encoding.py (75151 of 75189)
PASS: LLVM-Unit :: Support/./SupportTests/ProgramEnvTest.TestExecuteNoWait (75152 of 75189)
PASS: lit :: shell-parsing.py (75153 of 75189)
PASS: lit :: reorder.py (75154 of 75189)
PASS: lit :: show-used-features.py (75155 of 75189)
PASS: lit :: googletest-upstream-format.py (75156 of 75189)
PASS: lit :: ignore-fail.py (75157 of 75189)
PASS: lit :: shtest-format-argv0.py (75158 of 75189)
PASS: lit :: googletest-format.py (75159 of 75189)
PASS: lit :: shtest-keyword-parse-errors.py (75160 of 75189)
PASS: lit :: shtest-output-printing.py (75161 of 75189)
PASS: lit :: shtest-format.py (75162 of 75189)
PASS: lit :: shtest-run-at-line.py (75163 of 75189)
PASS: lit :: max-failures.py (75164 of 75189)
PASS: lit :: show-result-codes.py (75165 of 75189)
PASS: lit :: shtest-env.py (75166 of 75189)
PASS: lit :: test-data-micro.py (75167 of 75189)
PASS: lit :: unit/ShUtil.py (75168 of 75189)
PASS: lit :: test-data.py (75169 of 75189)
PASS: lit :: test-output-micro.py (75170 of 75189)
PASS: lit :: shtest-inject.py (75171 of 75189)
PASS: lit :: unit/TestRunner.py (75172 of 75189)
PASS: lit :: unparsed-requirements.py (75173 of 75189)
PASS: lit :: unittest-adaptor.py (75174 of 75189)
PASS: lit :: test-output.py (75175 of 75189)
PASS: lit :: lit-opts.py (75176 of 75189)
PASS: lit :: usage.py (75177 of 75189)
PASS: lit :: xunit-output.py (75178 of 75189)
PASS: lit :: use-llvm-tool.py (75179 of 75189)
PASS: lit :: allow-retries.py (75180 of 75189)
PASS: lit :: shtest-recursive-substitution.py (75181 of 75189)
PASS: lit :: xfail-cl.py (75182 of 75189)
PASS: lit :: googletest-timeout.py (75183 of 75189)
PASS: lit :: shtest-not.py (75184 of 75189)
PASS: lit :: discovery.py (75185 of 75189)
PASS: lit :: max-time.py (75186 of 75189)
PASS: lit :: shtest-timeout.py (75187 of 75189)
PASS: lit :: selecting.py (75188 of 75189)
PASS: lit :: shtest-shell.py (75189 of 75189)
********************
Failed Tests (1):
  LLVM :: CodeGen/AMDGPU/wave32.ll

Hide Details

Hide Details

Testing Time: 955.06s Skipped : 3 Unsupported : 859 Passed : 74132 Expectedly Failed: 194 Failed : 1 FAILED: CMakeFiles/check-all cd /Users/buildslave/jenkins/workspace/clang-stage1-RA/clang-build && /usr/local/Frameworks/Python.framework/Versions/3.7/bin/python3.7 /Users/buildslave/jenkins/workspace/clang-stage1-RA/clang-build/./bin/llvm-lit --xunit-xml-output=testresults.xunit.xml -v -vv --timeout=600 --param USE_Z3_SOLVER=0 /Users/buildslave/jenkins/workspace/clang-stage1-RA/clang-build/tools/clang/tools/extra/test /Users/buildslave/jenkins/workspace/clang-stage1-RA/clang-build/tools/clang/tools/extra/clangd/test/../unittests /Users/buildslave/jenkins/workspace/clang-stage1-RA/clang-build/tools/clang/tools/extra/clangd/test /Users/buildslave/jenkins/workspace/clang-stage1-RA/clang-build/tools/clang/test /Users/buildslave/jenkins/workspace/clang-stage1-RA/clang-build/utils/lit /Users/buildslave/jenkins/workspace/clang-stage1-RA/clang-build/test ninja: build stopped: cannot make progress due to previous errors. Command failed: Command '['/usr/local/bin/ninja', '-v', '-k', '0', 'check-all']' returned non-zero exit status 1 Command: ['/usr/local/bin/ninja', '-v', '-k', '0', 'check-all'] [Pipeline] } [Pipeline] // timeout [Pipeline] } [Pipeline] // stage [Pipeline] stage [Pipeline] { (Declarative: Post Actions) [Pipeline] scanForIssues [Clang (LLVM based)] Sleeping for 5 seconds due to JENKINS-32191... [Clang (LLVM based)] Parsing console log (workspace: '/Users/buildslave/jenkins/workspace/clang-stage1-RA') [Clang (LLVM based)] Successfully parsed console log [Clang (LLVM based)] -> found 10 issues (skipped 31 duplicates) [Clang (LLVM based)] [-ERROR-] Can't create fingerprints for some files: [Clang (LLVM based)] [-ERROR-] - '/Users/buildslave/jenkins/workspace/clang-stage1-RA/clang-build/tools/clang/sanitizer_common/sanitizer_mac.cpp', IO exception has been thrown: java.nio.file.NoSuchFileException: /Users/buildslave/jenkins/workspace/clang-stage1-RA/clang-build/tools/clang/sanitizer_common/sanitizer_mac.cpp [Clang (LLVM based)] [-ERROR-] - '/Users/buildslave/jenkins/workspace/clang-stage1-RA/clang-build/tools/clang/sanitizer_common/sanitizer_mac.cpp', IO exception has been thrown: java.nio.file.NoSuchFileException: /Users/buildslave/jenkins/workspace/clang-stage1-RA/clang-build/tools/clang/sanitizer_common/sanitizer_mac.cpp [Clang (LLVM based)] [-ERROR-] - '/Users/buildslave/jenkins/workspace/clang-stage1-RA/clang-build/tools/clang/sanitizer_common/sanitizer_mac.cpp', IO exception has been thrown: java.nio.file.NoSuchFileException: /Users/buildslave/jenkins/workspace/clang-stage1-RA/clang-build/tools/clang/sanitizer_common/sanitizer_mac.cpp [Clang (LLVM based)] [-ERROR-] - '/Users/buildslave/jenkins/workspace/clang-stage1-RA/clang-build/tools/clang/sanitizer_common/sanitizer_mac.cpp', IO exception has been thrown: java.nio.file.NoSuchFileException: /Users/buildslave/jenkins/workspace/clang-stage1-RA/clang-build/tools/clang/sanitizer_common/sanitizer_mac.cpp [Clang (LLVM based)] [-ERROR-] - '/Users/buildslave/jenkins/workspace/clang-stage1-RA/clang-build/tools/clang/sanitizer_common/sanitizer_mac.cpp', IO exception has been thrown: java.nio.file.NoSuchFileException: /Users/buildslave/jenkins/workspace/clang-stage1-RA/clang-build/tools/clang/sanitizer_common/sanitizer_mac.cpp [Clang (LLVM based)] [-ERROR-] - '/Users/buildslave/jenkins/workspace/clang-stage1-RA/clang-build/tools/clang/sanitizer_common/sanitizer_mac.cpp', IO exception has been thrown: java.nio.file.NoSuchFileException: /Users/buildslave/jenkins/workspace/clang-stage1-RA/clang-build/tools/clang/sanitizer_common/sanitizer_mac.cpp [Clang (LLVM based)] [-ERROR-] - '/Users/buildslave/jenkins/workspace/clang-stage1-RA/clang-build/tools/clang/sanitizer_common/sanitizer_mac.cpp', IO exception has been thrown: java.nio.file.NoSuchFileException: /Users/buildslave/jenkins/workspace/clang-stage1-RA/clang-build/tools/clang/sanitizer_common/sanitizer_mac.cpp [Clang (LLVM based)] [-ERROR-] - '/Users/buildslave/jenkins/workspace/clang-stage1-RA/clang-build/tools/clang/sanitizer_common/sanitizer_mac.cpp', IO exception has been thrown: java.nio.file.NoSuchFileException: /Users/buildslave/jenkins/workspace/clang-stage1-RA/clang-build/tools/clang/sanitizer_common/sanitizer_mac.cpp [Clang (LLVM based)] [-ERROR-] - '/Users/buildslave/jenkins/workspace/clang-stage1-RA/clang-build/tools/clang/runtime/compiler-rt-bins/llvm-lit: /Users/buildslave/jenkins/workspace/clang-stage1-RA/llvm-project/compiler-rt/test/lit.common.cfg.py', IO exception has been thrown: java.nio.file.NoSuchFileException: /Users/buildslave/jenkins/workspace/clang-stage1-RA/clang-build/tools/clang/runtime/compiler-rt-bins/llvm-lit: /Users/buildslave/jenkins/workspace/clang-stage1-RA/llvm-project/compiler-rt/test/lit.common.cfg.py [Clang (LLVM based)] Post processing issues on 'green-dragon-20' with source code encoding 'UTF-8' [Clang (LLVM based)] Creating SCM blamer to obtain author and commit information for affected files [Clang (LLVM based)] -> No blamer installed yet. You need to install the 'git-forensics' plugin to enable blaming for Git. [Clang (LLVM based)] Resolving file names for all issues in source directory '/Users/buildslave/jenkins/workspace/clang-stage1-RA' [Clang (LLVM based)] -> resolved paths in source directory (1 found, 2 not found) [Clang (LLVM based)] Resolving module names from module definitions (build.xml, pom.xml, or Manifest.mf files) [Clang (LLVM based)] -> resolved module names for 10 issues [Clang (LLVM based)] Resolving package names (or namespaces) by parsing the affected files [Clang (LLVM based)] -> resolved package names of 3 affected files [Clang (LLVM based)] No filter has been set, publishing all 10 issues [Clang (LLVM based)] Creating fingerprints for all affected code blocks to track issues over different builds [Clang (LLVM based)] -> created fingerprints for 1 issues (skipped 9 issues) [Clang (LLVM based)] Copying affected files to Jenkins' build folder '/Users/Shared/Jenkins/Home/jobs/clang-stage1-RA/builds/22727/files-with-issues' [Clang (LLVM based)] -> 1 copied, 0 not in workspace, 9 not-found, 0 with I/O error [Clang (LLVM based)] Repository miner is not configured, skipping repository mining [Pipeline] emailext Warning: kazu@google.com is not a recognized user, but sending mail anyway Warning: spatel@rotateright.com is not a recognized user, but sending mail anyway Warning: llvm-dev@redking.me.uk is not a recognized user, but sending mail anyway Warning: kazu@google.com is not a recognized user, but sending mail anyway Warning: spatel@rotateright.com is not a recognized user, but sending mail anyway Warning: llvm-dev@redking.me.uk is not a recognized user, but sending mail anyway

Hide Details

Begin Pre-Send Script... Sending email to: kazu@google.com spatel@rotateright.com llvm-dev@redking.me.uk Michael Spencer <michael_spencer@apple.com> Azhar Mohammed <azhar@apple.com>
[Pipeline] } [Pipeline] // stage [Pipeline] } [Pipeline] // withEnv [Pipeline] } [Pipeline] // node [Pipeline] End of Pipeline ERROR: script returned exit code 1 Finished: FAILURE