FailedConsole Output

Skipping 825 KB.. Full Log
Change dir to: /Users/buildslave/jenkins/workspace/lldb-cmake-sanitized/llvm-project/lldb/packages/Python/lldbsuite/test/functionalities/data-formatter/data-formatter-objc
runCmd: settings set symbols.enable-external-lookup false
output: 

Hide Details

runCmd: settings set plugin.process.gdb-remote.packet-timeout 60 output:

Hide Details

runCmd: settings set symbols.clang-modules-cache-path "/Users/buildslave/jenkins/workspace/lldb-cmake-sanitized/lldb-build/tools/lldb/lldb-test-build.noindex/module-cache-lldb/lldb-api" output:

Hide Details

runCmd: settings set use-color false output:

Hide Details

runCmd: thread list output: Process 27511 stopped * thread #1: tid = 0x24dcf1, 0x0000000100004852 a.out`main(argc=1, argv=0x00007ffeefbffc98) at main.m:623:6, queue = 'com.apple.main-thread', stop reason = breakpoint 1.1 thread #2: tid = 0x24dd67, 0x00007fff5c347afc libsystem_malloc.dylib`rack_region_insert + 302, queue = 'com.apple.libdispatch-manager' thread #3: tid = 0x24dd68, 0x00007fff5c2d25be libsystem_kernel.dylib`__workq_kernreturn + 10

Hide Details

Hide Details

Expecting sub string: stopped Matched

Hide Details

Expecting sub string: stop reason = breakpoint Matched

Hide Details

Adding tearDown hook: def cleanup(): self.runCmd('type format clear', check=False) self.runCmd('type summary clear', check=False) self.runCmd('type synth clear', check=False)

Hide Details

Hide Details

runCmd: frame variable immutableData mutableData data_ref mutable_data_ref mutable_string_ref concreteData concreteMutableData output: (NSData *) immutableData = 0x000000010020cdf0 (NSData *) mutableData = 0x000000010020ea30 (CFDataRef) data_ref = 0x000000010020ee30 (CFMutableDataRef) mutable_data_ref = 0x000000010020ee80 (CFMutableStringRef) mutable_string_ref = 0x000000010020eed0 (NSData *) concreteData = 0x000000010020eb40 (NSMutableData *) concreteMutableData = 0x000000010020ebb0

Hide Details

Hide Details

Expecting sub string: (NSData *) immutableData = Matched

Hide Details

Expecting sub string: 4 bytes Not matched

Hide Details

FAIL: LLDB (/Users/buildslave/jenkins/workspace/lldb-cmake-sanitized/host-compiler/bin/clang-10-x86_64) :: test_nsdata_with_run_command_dsym (TestDataFormatterObjCNSData.ObjCDataFormatterNSData) <bound method SBProcess.Kill of <lldb.SBProcess; proxy of <Swig Object of type 'lldb::SBProcess *' at 0x115bcd930> >>: success

Hide Details

Executing tearDown hook: def cleanup(): self.runCmd('type format clear', check=False) self.runCmd('type summary clear', check=False) self.runCmd('type synth clear', check=False)

Hide Details

Hide Details

runCmd: type format clear check of return status not required output:

Hide Details

runCmd: type summary clear check of return status not required output:

Hide Details

runCmd: type synth clear check of return status not required output:

Hide Details

runCmd: settings set symbols.enable-external-lookup false output:

Hide Details

runCmd: settings set plugin.process.gdb-remote.packet-timeout 60 output:

Hide Details

runCmd: settings set symbols.clang-modules-cache-path "/Users/buildslave/jenkins/workspace/lldb-cmake-sanitized/lldb-build/tools/lldb/lldb-test-build.noindex/module-cache-lldb/lldb-api" output:

Hide Details

runCmd: settings set use-color false output:

Hide Details

runCmd: thread list output: Process 29590 stopped * thread #1: tid = 0x24eb0d, 0x0000000100004852 a.out`main(argc=1, argv=0x00007ffeefbffc98) at main.m:623:6, queue = 'com.apple.main-thread', stop reason = breakpoint 1.1 thread #2: tid = 0x24ec42, 0x00007fff5c2d25be libsystem_kernel.dylib`__workq_kernreturn + 10 thread #3: tid = 0x24ec43, 0x00007fff5c2d25be libsystem_kernel.dylib`__workq_kernreturn + 10

Hide Details

Hide Details

Expecting sub string: stopped Matched

Hide Details

Expecting sub string: stop reason = breakpoint Matched

Hide Details

Adding tearDown hook: def cleanup(): self.runCmd('type format clear', check=False) self.runCmd('type summary clear', check=False) self.runCmd('type synth clear', check=False)

Hide Details

Hide Details

runCmd: frame variable immutableData mutableData data_ref mutable_data_ref mutable_string_ref concreteData concreteMutableData output: (NSData *) immutableData = 0x000000010020cdf0 4 bytes (NSData *) mutableData = 0x000000010020ea30 14 bytes (CFDataRef) data_ref = 0x000000010020ee30 @"5 bytes" (CFMutableDataRef) mutable_data_ref = 0x000000010020ee80 @"5 bytes" (CFMutableStringRef) mutable_string_ref = 0x000000010020eed0 @"Wish ya knew" (NSData *) concreteData = 0x000000010020eb40 100000 bytes (NSMutableData *) concreteMutableData = 0x000000010020ebb0 100000 bytes

Hide Details

Hide Details

Expecting sub string: (NSData *) immutableData = Matched

Hide Details

Expecting sub string: 4 bytes Matched

Hide Details

Expecting sub string: (NSData *) mutableData = Matched

Hide Details

Expecting sub string: 14 bytes Matched

Hide Details

Expecting sub string: (CFDataRef) data_ref = Matched

Hide Details

Expecting sub string: @"5 bytes" Matched

Hide Details

Expecting sub string: (CFMutableDataRef) mutable_data_ref = Matched

Hide Details

Expecting sub string: @"5 bytes" Matched

Hide Details

Expecting sub string: (CFMutableStringRef) mutable_string_ref = Matched

Hide Details

Expecting sub string: @"Wish ya knew" Matched

Hide Details

Expecting sub string: (NSData *) concreteData = Matched

Hide Details

Expecting sub string: 100000 bytes Matched

Hide Details

Expecting sub string: (NSMutableData *) concreteMutableData = Matched

Hide Details

Expecting sub string: 100000 bytes Matched

Hide Details

<bound method SBProcess.Kill of <lldb.SBProcess; proxy of <Swig Object of type 'lldb::SBProcess *' at 0x11586dd80> >>: success

Hide Details

Executing tearDown hook: def cleanup(): self.runCmd('type format clear', check=False) self.runCmd('type summary clear', check=False) self.runCmd('type synth clear', check=False)

Hide Details

Hide Details

runCmd: type format clear check of return status not required output:

Hide Details

runCmd: type summary clear check of return status not required output:

Hide Details

runCmd: type synth clear check of return status not required output:

Hide Details

PASS: LLDB (/Users/buildslave/jenkins/workspace/lldb-cmake-sanitized/host-compiler/bin/clang-10-x86_64) :: test_nsdata_with_run_command_dwarf (TestDataFormatterObjCNSData.ObjCDataFormatterNSData) UNSUPPORTED: LLDB (/Users/buildslave/jenkins/workspace/lldb-cmake-sanitized/host-compiler/bin/clang-10-x86_64) :: test_nsdata_with_run_command_dwo (TestDataFormatterObjCNSData.ObjCDataFormatterNSData) (test case does not fall in any category of interest for this run) runCmd: settings set symbols.enable-external-lookup false output:

Hide Details

runCmd: settings set plugin.process.gdb-remote.packet-timeout 60 output:

Hide Details

runCmd: settings set symbols.clang-modules-cache-path "/Users/buildslave/jenkins/workspace/lldb-cmake-sanitized/lldb-build/tools/lldb/lldb-test-build.noindex/module-cache-lldb/lldb-api" output:

Hide Details

runCmd: settings set use-color false output:

Hide Details

runCmd: thread list output: Process 30821 stopped * thread #1: tid = 0x24f287, 0x0000000100004852 a.out`main(argc=1, argv=0x00007ffeefbffc90) at main.m:623:6, queue = 'com.apple.main-thread', stop reason = breakpoint 1.1 thread #2: tid = 0x24f3a2, 0x00007fff5c2d25be libsystem_kernel.dylib`__workq_kernreturn + 10 thread #3: tid = 0x24f3a4, 0x00007fff5c2d25be libsystem_kernel.dylib`__workq_kernreturn + 10

Hide Details

Hide Details

Expecting sub string: stopped Matched

Hide Details

Expecting sub string: stop reason = breakpoint Matched

Hide Details

Adding tearDown hook: def cleanup(): self.runCmd('type format clear', check=False) self.runCmd('type summary clear', check=False) self.runCmd('type synth clear', check=False)

Hide Details

Hide Details

runCmd: frame variable immutableData mutableData data_ref mutable_data_ref mutable_string_ref concreteData concreteMutableData output: (NSData *) immutableData = 0x000000010030b0e0 4 bytes (NSData *) mutableData = 0x000000010030b920 14 bytes (CFDataRef) data_ref = 0x000000010030bd40 @"5 bytes" (CFMutableDataRef) mutable_data_ref = 0x000000010030bd90 @"5 bytes" (CFMutableStringRef) mutable_string_ref = 0x000000010030bde0 @"Wish ya knew" (NSData *) concreteData = 0x000000010030ba30 100000 bytes (NSMutableData *) concreteMutableData = 0x000000010030baa0 100000 bytes

Hide Details

Hide Details

Expecting sub string: (NSData *) immutableData = Matched

Hide Details

Expecting sub string: 4 bytes Matched

Hide Details

Expecting sub string: (NSData *) mutableData = Matched

Hide Details

Expecting sub string: 14 bytes Matched

Hide Details

Expecting sub string: (CFDataRef) data_ref = Matched

Hide Details

Expecting sub string: @"5 bytes" Matched

Hide Details

Expecting sub string: (CFMutableDataRef) mutable_data_ref = Matched

Hide Details

Expecting sub string: @"5 bytes" Matched

Hide Details

Expecting sub string: (CFMutableStringRef) mutable_string_ref = Matched

Hide Details

Expecting sub string: @"Wish ya knew" Matched

Hide Details

Expecting sub string: (NSData *) concreteData = Matched

Hide Details

Expecting sub string: 100000 bytes Matched

Hide Details

Expecting sub string: (NSMutableData *) concreteMutableData = Matched

Hide Details

Expecting sub string: 100000 bytes Matched

Hide Details

<bound method SBProcess.Kill of <lldb.SBProcess; proxy of <Swig Object of type 'lldb::SBProcess *' at 0x115bcd990> >>: success

Hide Details

Executing tearDown hook: def cleanup(): self.runCmd('type format clear', check=False) self.runCmd('type summary clear', check=False) self.runCmd('type synth clear', check=False)

Hide Details

Hide Details

runCmd: type format clear check of return status not required output:

Hide Details

runCmd: type summary clear check of return status not required output:

Hide Details

runCmd: type synth clear check of return status not required output:

Hide Details

PASS: LLDB (/Users/buildslave/jenkins/workspace/lldb-cmake-sanitized/host-compiler/bin/clang-10-x86_64) :: test_nsdata_with_run_command_gmodules (TestDataFormatterObjCNSData.ObjCDataFormatterNSData) Restore dir to: /Users/buildslave/jenkins/workspace/lldb-cmake-sanitized/lldb-build/tools/lldb/test ====================================================================== FAIL: test_nsdata_with_run_command_dsym (TestDataFormatterObjCNSData.ObjCDataFormatterNSData) Test formatters for NSData. ---------------------------------------------------------------------- Traceback (most recent call last): File "/Users/buildslave/jenkins/workspace/lldb-cmake-sanitized/llvm-project/lldb/packages/Python/lldbsuite/test/lldbtest.py", line 1748, in test_method return attrvalue(self) File "/Users/buildslave/jenkins/workspace/lldb-cmake-sanitized/llvm-project/lldb/packages/Python/lldbsuite/test/functionalities/data-formatter/data-formatter-objc/TestDataFormatterObjCNSData.py", line 21, in test_nsdata_with_run_command self.appkit_tester_impl(self.nsdata_data_formatter_commands) File "/Users/buildslave/jenkins/workspace/lldb-cmake-sanitized/llvm-project/lldb/packages/Python/lldbsuite/test/functionalities/data-formatter/data-formatter-objc/ObjCDataFormatterTestCase.py", line 21, in appkit_tester_impl commands() File "/Users/buildslave/jenkins/workspace/lldb-cmake-sanitized/llvm-project/lldb/packages/Python/lldbsuite/test/functionalities/data-formatter/data-formatter-objc/TestDataFormatterObjCNSData.py", line 34, in nsdata_data_formatter_commands ' 100000 bytes' File "/Users/buildslave/jenkins/workspace/lldb-cmake-sanitized/llvm-project/lldb/packages/Python/lldbsuite/test/lldbtest.py", line 2374, in expect msg if msg else EXP_MSG(str, output, exe)) AssertionError: False is not True : 'frame variable immutableData mutableData data_ref mutable_data_ref mutable_string_ref concreteData concreteMutableData' returns expected result, got '(NSData *) immutableData = 0x000000010020cdf0 (NSData *) mutableData = 0x000000010020ea30 (CFDataRef) data_ref = 0x000000010020ee30 (CFMutableDataRef) mutable_data_ref = 0x000000010020ee80 (CFMutableStringRef) mutable_string_ref = 0x000000010020eed0 (NSData *) concreteData = 0x000000010020eb40 (NSMutableData *) concreteMutableData = 0x000000010020ebb0' Config=x86_64-/Users/buildslave/jenkins/workspace/lldb-cmake-sanitized/host-compiler/bin/clang-10 ---------------------------------------------------------------------- Ran 4 tests in 59.281s

Hide Details

RESULT: FAILED (2 passes, 1 failures, 0 errors, 1 skipped, 0 expected failures, 0 unexpected successes)

Hide Details

******************** PASS: lldb-unit :: ObjectFile/Breakpad/./ObjectFileBreakpadTests/LineRecord.parse (495 of 1785) PASS: lldb-api :: functionalities/avoids-fd-leak/TestFdLeak.py (496 of 1785) PASS: lldb-api :: functionalities/object-file/TestImageListMultiArchitecture.py (497 of 1785) PASS: lldb-api :: commands/expression/dollar-in-variable/TestDollarInVariable.py (498 of 1785) PASS: lldb-shell :: ObjectFile/Breakpad/sections.test (499 of 1785) PASS: lldb-shell :: SymbolFile/NativePDB/break-by-line.cpp (500 of 1785) PASS: lldb-api :: python_api/process/io/TestProcessIO.py (501 of 1785) XFAIL: lldb-shell :: Register/x86-64-ymm-write.test (502 of 1785) PASS: lldb-unit :: Utility/./UtilityTests/UriParserTest.MinimalPort (503 of 1785) PASS: lldb-unit :: Process/gdb-remote/./ProcessGdbRemoteTests/GDBRemoteCommunicationClientTest.WriteRegisterNoSuffix (504 of 1785) PASS: lldb-shell :: ObjectFile/PECOFF/basic-info-arm64.yaml (505 of 1785) PASS: lldb-api :: tools/lldb-server/inferior-crash/TestGdbRemoteSegFault.py (506 of 1785) PASS: lldb-api :: lang/c/struct_types/TestStructTypes.py (507 of 1785) PASS: lldb-api :: functionalities/data-formatter/nsarraysynth/TestNSArraySynthetic.py (508 of 1785) PASS: lldb-unit :: UnwindAssembly/x86/./UnwindAssemblyx86Tests/Testx86AssemblyInspectionEngine.TestSpillRegToStackViaMOVx86_64 (509 of 1785) PASS: lldb-unit :: Utility/./UtilityTests/StringExtractorTest.GetHexU8_InvalidHex (510 of 1785) PASS: lldb-unit :: Utility/./UtilityTests/FileSpecTest.EqualDotsWindows (511 of 1785) PASS: lldb-api :: macosx/nslog/TestDarwinNSLogOutput.py (512 of 1785) PASS: lldb-shell :: SymbolFile/DWARF/deterministic-build.cpp (513 of 1785) PASS: lldb-api :: python_api/value/change_values/TestChangeValueAPI.py (514 of 1785) PASS: lldb-unit :: Core/./LLDBCoreTests/RichManglingContextTest.SwitchProvider (515 of 1785) PASS: lldb-unit :: Language/Highlighting/./HighlighterTests/HighlighterTest.ClangCursorPosBeforeOtherToken (516 of 1785) PASS: lldb-api :: functionalities/plugins/python_os_plugin/TestPythonOSPlugin.py (517 of 1785) PASS: lldb-api :: functionalities/data-formatter/data-formatter-stl/libcxx/string/TestDataFormatterLibcxxString.py (518 of 1785) PASS: lldb-unit :: Process/minidump/./LLDBMinidumpTests/MinidumpParserTest.GetPidWow64 (519 of 1785) PASS: lldb-api :: functionalities/breakpoint/breakpoint_locations/TestBreakpointLocations.py (520 of 1785) PASS: lldb-unit :: Process/gdb-remote/./ProcessGdbRemoteTests/GDBRemoteCommunicationClientTest.GetModulesInfo_UUID20 (521 of 1785) PASS: lldb-unit :: Language/Highlighting/./HighlighterTests/HighlighterTest.ClangEmptyInput (522 of 1785) PASS: lldb-unit :: Utility/./UtilityTests/SerializationRountripTest.SerializeDeserializeObjectPointer (523 of 1785) PASS: lldb-unit :: Utility/./UtilityTests/ArchSpecTest.TripleComponentsWereSpecified (524 of 1785) PASS: lldb-api :: lang/cpp/signed_types/TestSignedTypes.py (525 of 1785) PASS: lldb-api :: functionalities/data-formatter/data-formatter-objc/TestDataFormatterObjCNSBundle.py (526 of 1785) PASS: lldb-unit :: SymbolFile/NativePDB/./SymbolFileNativePDBTests/PDBFPOProgramToDWARFExpressionTests.DependencyChain (527 of 1785) PASS: lldb-shell :: Commands/command-backtrace.test (528 of 1785) PASS: lldb-unit :: Utility/./UtilityTests/UriParserTest.MinimalPortPath (529 of 1785) PASS: lldb-unit :: Utility/./UtilityTests/StringExtractorTest.GetU64LittleEndian (530 of 1785) UNSUPPORTED: lldb-api :: functionalities/darwin_log/source/debug/TestDarwinLogSourceDebug.py (531 of 1785) PASS: lldb-api :: macosx/function-starts/TestFunctionStarts.py (532 of 1785) PASS: lldb-unit :: Utility/./UtilityTests/StreamTest.ShiftOperatorStrings (533 of 1785) PASS: lldb-unit :: Utility/./UtilityTests/StringLexerTest.HasAtLeast (534 of 1785) PASS: lldb-unit :: Utility/./UtilityTests/StringExtractorTest.GetHexBytesAvail (535 of 1785) PASS: lldb-unit :: Utility/./UtilityTests/FileSpecTest.GetNormalizedPath (536 of 1785) PASS: lldb-unit :: Process/minidump/./LLDBMinidumpTests/MinidumpParserTest.GetMemoryRegionInfoFromMemory64List (537 of 1785) PASS: lldb-unit :: Utility/./UtilityTests/UUIDTest.SetFromStringRef (538 of 1785) PASS: lldb-unit :: Process/minidump/./LLDBMinidumpTests/MinidumpParserTest.GetLinuxProcStatus_no_stream (539 of 1785) UNSUPPORTED: lldb-api :: tools/lldb-vscode/step/TestVSCode_step.py (540 of 1785) PASS: lldb-api :: python_api/class_members/TestSBTypeClassMembers.py (541 of 1785) PASS: lldb-unit :: Utility/./UtilityTests/BinaryStreamTest.PutULEB128NineBytes (542 of 1785) PASS: lldb-api :: commands/expression/completion-in-lambda-and-unnnamed-class/TestCompletionInLambdaAndUnnamedClass.py (543 of 1785) PASS: lldb-api :: functionalities/dynamic_value_child_count/TestDynamicValueChildCount.py (544 of 1785) PASS: lldb-unit :: Utility/./UtilityTests/BroadcasterTest.BroadcastEvent (545 of 1785) PASS: lldb-shell :: Register/x86-64-gp-read.test (546 of 1785) PASS: lldb-api :: lang/objc/ptr_refs/TestPtrRefsObjC.py (547 of 1785) PASS: lldb-api :: functionalities/breakpoint/breakpoint_command/TestBreakpointCommand.py (548 of 1785) PASS: lldb-unit :: Symbol/./SymbolTests/TestClangASTContext.TestIsClangType (549 of 1785) PASS: lldb-unit :: Utility/./UtilityTests/GeneratorTest.Get (550 of 1785) PASS: lldb-api :: commands/expression/import-std-module/sysroot/TestStdModuleSysroot.py (551 of 1785) PASS: lldb-api :: commands/frame/diagnose/dereference-argument/TestDiagnoseDereferenceArgument.py (552 of 1785) PASS: lldb-api :: commands/expression/context-object-objc/TestContextObjectObjc.py (553 of 1785) PASS: lldb-api :: functionalities/thread/concurrent_events/TestConcurrentDelayWatchBreak.py (554 of 1785) PASS: lldb-shell :: SymbolFile/DWARF/gnu-style-compression.cpp (555 of 1785) PASS: lldb-api :: functionalities/show_location/TestShowLocationDwarf5.py (556 of 1785) PASS: lldb-unit :: Utility/./UtilityTests/StreamTest.PutChar (557 of 1785) UNSUPPORTED: lldb-api :: functionalities/darwin_log/filter/exact_match/activity-chain/TestDarwinLogFilterMatchActivityChain.py (558 of 1785) PASS: lldb-shell :: ObjectFile/ELF/netbsd-exec-8.99.30-amd64.yaml (559 of 1785) PASS: lldb-api :: functionalities/tsan/multiple/TestTsanMultiple.py (560 of 1785) PASS: lldb-unit :: Utility/./UtilityTests/BinaryStreamTest.PutSLEB128FiveBytes (561 of 1785) PASS: lldb-api :: commands/platform/process/TestProcessList.py (562 of 1785) PASS: lldb-api :: functionalities/data-formatter/dump_dynamic/TestDumpDynamic.py (563 of 1785) PASS: lldb-unit :: SymbolFile/NativePDB/./SymbolFileNativePDBTests/PDBFPOProgramToDWARFExpressionTests.InvalidOpBinary (564 of 1785) PASS: lldb-shell :: SymbolFile/DWARF/debug_ranges_and_rnglists.test (565 of 1785) PASS: lldb-shell :: ObjectFile/ELF/section-overlap.yaml (566 of 1785) UNSUPPORTED: lldb-api :: linux/sepdebugsymlink/TestTargetSymbolsSepDebugSymlink.py (567 of 1785) PASS: lldb-api :: functionalities/thread/concurrent_events/TestConcurrentTwoBreakpointThreads.py (568 of 1785) PASS: lldb-api :: functionalities/dead-strip/TestDeadStrip.py (569 of 1785) PASS: lldb-api :: lang/objc/radar-9691614/TestObjCMethodReturningBOOL.py (570 of 1785) PASS: lldb-unit :: Utility/./UtilityTests/StreamTest.ShiftOperatorUInts (571 of 1785) PASS: lldb-unit :: Utility/./UtilityTests/StringListTest.GetMaxStringLengthEqualSize (572 of 1785) UNSUPPORTED: lldb-shell :: SymbolFile/PDB/variables-locations.test (573 of 1785) PASS: lldb-unit :: Utility/./UtilityTests/Flags.AllSet (574 of 1785) PASS: lldb-unit :: Expression/./ExpressionTests/CppModuleConfigurationTest.MissingLibCpp (575 of 1785) PASS: lldb-api :: functionalities/data-formatter/data-formatter-disabling/TestDataFormatterDisabling.py (576 of 1785) PASS: lldb-api :: functionalities/breakpoint/cpp_exception/TestCPPExceptionBreakpoint.py (577 of 1785) PASS: lldb-unit :: Utility/./UtilityTests/ArgsTest.ReplaceArgumentAtIndexShort (578 of 1785) PASS: lldb-unit :: Utility/./UtilityTests/NameMatchesTest.Equals (579 of 1785) PASS: lldb-api :: functionalities/thread/concurrent_events/TestConcurrentDelaySignalWatch.py (580 of 1785) PASS: lldb-unit :: Utility/./UtilityTests/StreamTest.ChangingByteOrder (581 of 1785) PASS: lldb-api :: functionalities/completion/TestCompletion.py (582 of 1785) PASS: lldb-api :: functionalities/thread/concurrent_events/TestConcurrentWatchBreak.py (583 of 1785) PASS: lldb-unit :: Utility/./UtilityTests/StringExtractorTest.GetHexBytesAvail_Underflow (584 of 1785) PASS: lldb-api :: tools/lldb-server/TestGdbRemoteHostInfo.py (585 of 1785) PASS: lldb-unit :: Utility/./UtilityTests/ScalarTest.Division (586 of 1785) PASS: lldb-api :: lang/objc/objc-static-method-stripped/TestObjCStaticMethodStripped.py (587 of 1785) PASS: lldb-api :: lang/objc/hidden-ivars/TestHiddenIvars.py (588 of 1785) PASS: lldb-unit :: Utility/./UtilityTests/StringExtractorTest.GetU32LittleEndian (589 of 1785) PASS: lldb-unit :: Utility/./UtilityTests/ArgsTest.GetArgumentArrayRef (590 of 1785) PASS: lldb-unit :: SymbolFile/DWARF/./SymbolFileDWARFTests/SymbolFileDWARFTests.TestAbbrevOrder1Start1 (591 of 1785) PASS: lldb-unit :: Utility/./UtilityTests/LogChannelEnabledTest.log_options (592 of 1785) PASS: lldb-unit :: Symbol/./SymbolTests/TestClangASTContext.TestGetBasicTypeFromEnum (593 of 1785) PASS: lldb-unit :: Utility/./UtilityTests/RegularExpression.Empty (594 of 1785) PASS: lldb-api :: commands/expression/ir-interpreter/TestIRInterpreter.py (595 of 1785) UNSUPPORTED: lldb-shell :: SymbolFile/PDB/compilands.test (596 of 1785) UNSUPPORTED: lldb-api :: functionalities/darwin_log/filter/exact_match/subsystem/TestDarwinLogFilterMatchSubsystem.py (597 of 1785) PASS: lldb-shell :: Quit/TestQuitExitCodeHex0.test (598 of 1785) PASS: lldb-shell :: ObjectFile/PECOFF/export-dllfunc.yaml (599 of 1785) PASS: lldb-shell :: Expr/TestMultilineExpr.test (600 of 1785) PASS: lldb-unit :: Utility/./UtilityTests/VMRange.Clear (601 of 1785) PASS: lldb-api :: lang/cpp/char1632_t/TestChar1632T.py (602 of 1785) PASS: lldb-shell :: Breakpoint/jitbp_elf.test (603 of 1785) PASS: lldb-api :: functionalities/ubsan/basic/TestUbsanBasic.py (604 of 1785) PASS: lldb-unit :: Process/gdb-remote/./ProcessGdbRemoteTests/GDBRemoteClientBaseTest.SendContinueAndLateInterrupt (605 of 1785) PASS: lldb-unit :: Utility/./UtilityTests/ArgsTest.TestSingleArgWithQuotedSpace (606 of 1785) PASS: lldb-unit :: Language/Highlighting/./HighlighterTests/HighlighterTest.ClangPPDirectives (607 of 1785) PASS: lldb-unit :: Expression/./ExpressionTests/DiagnosticManagerTest.PutStringMultiple (608 of 1785) PASS: lldb-api :: types/TestFloatTypes.py (609 of 1785) PASS: lldb-unit :: Language/Highlighting/./HighlighterTests/HighlighterTest.FallbackHighlighter (610 of 1785) PASS: lldb-unit :: Host/./HostTests/FileSystemTest.GetByteSize (611 of 1785) PASS: lldb-api :: lang/cpp/static_methods/TestCPPStaticMethods.py (612 of 1785) PASS: lldb-unit :: UnwindAssembly/x86/./UnwindAssemblyx86Tests/Testx86AssemblyInspectionEngine.TestMovRSPtoRBP (613 of 1785) PASS: lldb-unit :: UnwindAssembly/x86/./UnwindAssemblyx86Tests/Testx86AssemblyInspectionEngine.TestPopEBX (614 of 1785) PASS: lldb-unit :: Core/./LLDBCoreTests/RichManglingContextTest.FromCxxMethodName (615 of 1785) PASS: lldb-unit :: Process/gdb-remote/./ProcessGdbRemoteTests/GDBRemoteClientBaseTest.SendContinueDelegateStructuredDataReceipt (616 of 1785) PASS: lldb-api :: lang/cpp/extern_c/TestExternCSymbols.py (617 of 1785) PASS: lldb-api :: macosx/thread-names/TestInterruptThreadNames.py (618 of 1785) PASS: lldb-api :: functionalities/thread/thread_specific_break/TestThreadSpecificBreakpoint.py (619 of 1785) PASS: lldb-api :: functionalities/tsan/basic/TestTsanBasic.py (620 of 1785) PASS: lldb-shell :: SymbolFile/Breakpad/line-table.test (621 of 1785) PASS: lldb-api :: functionalities/data-formatter/data-formatter-objc/TestDataFormatterObjCExpr.py (622 of 1785) PASS: lldb-api :: lang/objc/unicode-string/TestUnicodeString.py (623 of 1785) PASS: lldb-unit :: Utility/./UtilityTests/BinaryStreamTest.PutULEB128SevenBytes (624 of 1785) PASS: lldb-shell :: Commands/command-script-import.test (625 of 1785) PASS: lldb-api :: lang/c/step-target/TestStepTarget.py (626 of 1785) PASS: lldb-unit :: Utility/./UtilityTests/StringLexerTest.Next (627 of 1785) PASS: lldb-shell :: ObjectFile/ELF/base-address.yaml (628 of 1785) PASS: lldb-unit :: Utility/./UtilityTests/DataExtractorTest.GetMaxU64 (629 of 1785) PASS: lldb-api :: python_api/sbdata/TestSBData.py (630 of 1785) PASS: lldb-shell :: SymbolFile/Breakpad/unwind-via-stack-cfi.test (631 of 1785) PASS: lldb-unit :: Target/./TargetTests/ExecutionContextTest.GetByteOrderTarget (632 of 1785) PASS: lldb-unit :: Utility/./UtilityTests/OptionsWithRawTest.EmptySuffixSingleWhitespace (633 of 1785) PASS: lldb-unit :: Process/gdb-remote/./ProcessGdbRemoteTests/GDBRemoteCommunicationServerTest.SendErrorResponse_UnimplementedError (634 of 1785) PASS: lldb-api :: commands/expression/fixits/TestFixIts.py (635 of 1785) PASS: lldb-api :: functionalities/thread/concurrent_events/TestConcurrentDelayedCrashWithBreakpointSignal.py (636 of 1785) PASS: lldb-api :: macosx/safe-to-func-call/TestSafeFuncCalls.py (637 of 1785) PASS: lldb-shell :: SymbolFile/DWARF/find-basic-type.cpp (638 of 1785) PASS: lldb-unit :: Utility/./UtilityTests/ArgsTest.TestSingleQuotedArgWithSpace (639 of 1785) PASS: lldb-unit :: Host/./HostTests/SocketAddressTest.Set (640 of 1785) PASS: lldb-unit :: Utility/./UtilityTests/StringExtractorTest.GetHexU8_Underflow (641 of 1785) PASS: lldb-unit :: Utility/./UtilityTests/ScalarTest.RightShiftOperator (642 of 1785) PASS: lldb-api :: functionalities/gdb_remote_client/TestArmRegisterDefinition.py (643 of 1785) PASS: lldb-shell :: Python/crashlog.test (644 of 1785) PASS: lldb-shell :: Driver/TestCommands.test (645 of 1785) PASS: lldb-shell :: SymbolFile/DWARF/childless-compile-unit.s (646 of 1785) PASS: lldb-unit :: Utility/./UtilityTests/UriParserTest.BracketedHostname (647 of 1785) PASS: lldb-api :: lang/cpp/symbols/TestSymbols.py (648 of 1785) PASS: lldb-api :: lang/objc/objc-builtin-types/TestObjCBuiltinTypes.py (649 of 1785) PASS: lldb-api :: source-manager/TestSourceManager.py (650 of 1785) PASS: lldb-unit :: Host/./HostTests/Host.GetEnvironment (651 of 1785) PASS: lldb-unit :: UnwindAssembly/x86/./UnwindAssemblyx86Tests/Testx86AssemblyInspectionEngine.TestReturnDetect (652 of 1785) UNSUPPORTED: lldb-shell :: Register/x86-64-ymm16-write.test (653 of 1785) PASS: lldb-api :: functionalities/unwind/noreturn/module-end/TestNoReturnModuleEnd.py (654 of 1785) UNSUPPORTED: lldb-api :: lang/cpp/printf/TestPrintf.py (655 of 1785) PASS: lldb-shell :: ObjectFile/ELF/aarch64-relocations.yaml (656 of 1785) PASS: lldb-api :: lang/objc/blocks/TestObjCIvarsInBlocks.py (657 of 1785) PASS: lldb-api :: lang/c/shared_lib/TestSharedLib.py (658 of 1785) PASS: lldb-unit :: Utility/./UtilityTests/ArgsTest.TestArgv (659 of 1785) UNSUPPORTED: lldb-shell :: ExecControl/StopHook/stop-hook-threads.test (660 of 1785) PASS: lldb-api :: lang/cpp/incomplete-types/TestCppIncompleteTypes.py (661 of 1785) PASS: lldb-unit :: UnwindAssembly/x86/./UnwindAssemblyx86Tests/Testx86AssemblyInspectionEngine.TestPushR15 (662 of 1785) PASS: lldb-unit :: Expression/./ExpressionTests/CppModuleConfigurationTest.UnrelatedLibrary (663 of 1785) PASS: lldb-shell :: Settings/TestFrameFormatColor.test (664 of 1785) PASS: lldb-api :: commands/reproducer/invalid-args/TestInvalidArgsReproducer.py (665 of 1785) PASS: lldb-shell :: Breakpoint/debug_addrx.test (666 of 1785) PASS: lldb-api :: lang/cpp/dynamic-value/TestDynamicValue.py (667 of 1785) PASS: lldb-unit :: Expression/./ExpressionTests/DiagnosticManagerTest.AppendMessageAttachToLastDiag (668 of 1785) PASS: lldb-api :: lang/cpp/char8_t/TestCxxChar8_t.py (669 of 1785) PASS: lldb-unit :: Target/./TargetTests/MemoryRegionInfoTest.Formatv (670 of 1785) PASS: lldb-api :: commands/expression/import-std-module/forward_list-dbg-info-content/TestDbgInfoContentForwardList.py (671 of 1785) PASS: lldb-shell :: Quit/TestQuitExitCodeHexA.test (672 of 1785) PASS: lldb-unit :: Host/./HostTests/MainLoopTest.TerminatesImmediately (673 of 1785) PASS: lldb-shell :: Minidump/disassemble-no-module.yaml (674 of 1785) PASS: lldb-unit :: Utility/./UtilityTests/StructuredDataTest.StringDump (675 of 1785) PASS: lldb-api :: commands/platform/basic/TestPlatformPython.py (676 of 1785) PASS: lldb-api :: lang/cpp/lambdas/TestLambdas.py (677 of 1785) PASS: lldb-api :: functionalities/signal/TestSendSignal.py (678 of 1785) PASS: lldb-api :: python_api/value_var_update/TestValueVarUpdate.py (679 of 1785) PASS: lldb-unit :: Utility/./UtilityTests/ProcessInstanceInfoMatch.Name (680 of 1785) PASS: lldb-unit :: Host/./HostTests/ProcessLaunchInfoTest.Constructor (681 of 1785) PASS: lldb-unit :: ScriptInterpreter/Python/./ScriptInterpreterPythonTests/PythonDataObjectsTest.TestGlobalNameResolutionNoDot (682 of 1785) PASS: lldb-shell :: ObjectFile/PECOFF/basic-info-arm.yaml (683 of 1785) PASS: lldb-api :: python_api/signals/TestSignalsAPI.py (684 of 1785) PASS: lldb-unit :: SymbolFile/NativePDB/./SymbolFileNativePDBTests/PDBFPOProgramToDWARFExpressionTests.UnresolvedCyclicRegisterAssignmentReference (685 of 1785) PASS: lldb-unit :: Target/./TargetTests/ModuleCacheTest.GetAndPut (686 of 1785) PASS: lldb-api :: python_api/watchpoint/TestWatchpointIter.py (687 of 1785) PASS: lldb-unit :: ScriptInterpreter/Python/./ScriptInterpreterPythonTests/PythonExceptionStateTest.TestExceptionStateChecking (688 of 1785) PASS: lldb-api :: lang/objc/ivar-IMP/TestObjCiVarIMP.py (689 of 1785) PASS: lldb-shell :: Reproducer/Functionalities/TestImageList.test (690 of 1785) PASS: lldb-api :: functionalities/ubsan/user-expression/TestUbsanUserExpression.py (691 of 1785) PASS: lldb-api :: commands/frame/recognizer/TestFrameRecognizer.py (692 of 1785) UNSUPPORTED: lldb-api :: functionalities/process_save_core/TestProcessSaveCore.py (693 of 1785) PASS: lldb-api :: tools/lldb-server/TestGdbRemoteRegisterState.py (694 of 1785) PASS: lldb-unit :: Host/./HostTests/NativeProcessProtocolTest.SetBreakpointFailRead (695 of 1785) PASS: lldb-unit :: Utility/./UtilityTests/LogChannelEnabledTest.LogThread (696 of 1785) PASS: lldb-api :: lang/cpp/stl/TestSTL.py (697 of 1785) PASS: lldb-unit :: Utility/./UtilityTests/RangeTest.Constructor (698 of 1785) PASS: lldb-unit :: Utility/./UtilityTests/StringListTest.InsertStringAtIndexStdString (699 of 1785) PASS: lldb-unit :: Utility/./UtilityTests/UUIDTest.RelationalOperators (700 of 1785) PASS: lldb-unit :: Expression/./ExpressionTests/CppModuleConfigurationTest.IgnoreLibStdCpp (701 of 1785) PASS: lldb-api :: macosx/add-dsym/TestAddDsymMidExecutionCommand.py (702 of 1785) PASS: lldb-api :: lang/objc/single-entry-dictionary/TestObjCSingleEntryDictionary.py (703 of 1785) PASS: lldb-shell :: ObjectFile/ELF/PT_LOAD-overlap-PT_INTERP.yaml (704 of 1785) PASS: lldb-api :: python_api/debugger/TestDebuggerAPI.py (705 of 1785) PASS: lldb-unit :: Language/Highlighting/./HighlighterTests/HighlighterTest.ClangCursorPos (706 of 1785) PASS: lldb-api :: commands/frame/diagnose/dereference-function-return/TestDiagnoseDereferenceFunctionReturn.py (707 of 1785) PASS: lldb-unit :: Utility/./UtilityTests/StreamTest.PutCStringWithStringRef (708 of 1785) PASS: lldb-api :: lang/objc/modules-inline-functions/TestModulesInlineFunctions.py (709 of 1785) PASS: lldb-api :: functionalities/gdb_remote_client/TestRecognizeBreakpoint.py (710 of 1785) PASS: lldb-api :: functionalities/tail_call_frames/sbapi_support/TestTailCallFrameSBAPI.py (711 of 1785) PASS: lldb-api :: commands/expression/import-std-module/vector-basic/TestBasicVector.py (712 of 1785) PASS: lldb-unit :: Utility/./UtilityTests/ArgsTest.TestInsertArg (713 of 1785) PASS: lldb-unit :: UnwindAssembly/x86/./UnwindAssemblyx86Tests/Testx86AssemblyInspectionEngine.TestSpillRegToStackViaMOVi386 (714 of 1785) PASS: lldb-unit :: Symbol/./SymbolTests/SymbolsTest.LocateExecutableSymbolFileForUnknownExecutableAndMissingSymbolFile (715 of 1785) PASS: lldb-shell :: SymbolFile/DWARF/debug-types-dwarf5.s (716 of 1785) PASS: lldb-shell :: ObjectFile/Breakpad/breakpad-identification.test (717 of 1785) PASS: lldb-unit :: Utility/./UtilityTests/StringListTest.LongestCommonPrefixDuplicateElement (718 of 1785) PASS: lldb-unit :: Utility/./UtilityTests/StringExtractorTest.GetNameColonValueContainsColon (719 of 1785) PASS: lldb-api :: commands/command/script/TestCommandScript.py (720 of 1785) PASS: lldb-api :: functionalities/data-formatter/format-propagation/TestFormatPropagation.py (721 of 1785) PASS: lldb-unit :: Utility/./UtilityTests/OptionsWithRawTest.SingleWordSuffix (722 of 1785) PASS: lldb-api :: lang/c/set_values/TestSetValues.py (723 of 1785) PASS: lldb-unit :: Utility/./UtilityTests/StringListTest.LongestCommonPrefixEmpty (724 of 1785) PASS: lldb-unit :: Host/./HostTests/FileActionTest.Open (725 of 1785) UNSUPPORTED: lldb-shell :: ObjectFile/ELF/minidebuginfo-no-lzma.yaml (726 of 1785) UNSUPPORTED: lldb-shell :: Register/x86-gp-write.test (727 of 1785) PASS: lldb-unit :: Utility/./UtilityTests/StringExtractorTest.DecodeHexU8_Underflow (728 of 1785) PASS: lldb-shell :: BuildScript/toolchain-clang.test (729 of 1785) PASS: lldb-api :: commands/expression/import-std-module/list-dbg-info-content/TestDbgInfoContentList.py (730 of 1785) PASS: lldb-unit :: Expression/./ExpressionTests/CppModuleConfigurationTest.Linux (731 of 1785) UNSUPPORTED: lldb-api :: functionalities/data-formatter/data-formatter-stl/libstdcpp/vector/TestDataFormatterStdVector.py (732 of 1785) PASS: lldb-api :: lang/cpp/call-function/TestCallCPPFunction.py (733 of 1785) PASS: lldb-shell :: Breakpoint/implicit_const_form_support.test (734 of 1785) PASS: lldb-unit :: Interpreter/./InterpreterTests/CompletionTest.DirCompletionAbsolute (735 of 1785) PASS: lldb-api :: lang/c/unicode/TestUnicodeSymbols.py (736 of 1785) PASS: lldb-unit :: Utility/./UtilityTests/StringListTest.SplitIntoLinesSingleTrailingCR (737 of 1785) PASS: lldb-shell :: ObjectFile/PECOFF/dep-modules.yaml (738 of 1785) PASS: lldb-api :: lang/cpp/gmodules/TestWithModuleDebugging.py (739 of 1785) PASS: lldb-api :: commands/watchpoints/watchpoint_on_vectors/TestValueOfVectorVariable.py (740 of 1785) PASS: lldb-api :: lang/objc/modules-incomplete/TestIncompleteModules.py (741 of 1785) PASS: lldb-api :: commands/expression/entry-bp/TestExprEntryBP.py (742 of 1785) UNSUPPORTED: lldb-shell :: SymbolFile/PDB/vbases.test (743 of 1785) PASS: lldb-unit :: Utility/./UtilityTests/StatusTest.ErrorConversion (744 of 1785) UNSUPPORTED: lldb-shell :: SymbolFile/PDB/enums-layout.test (745 of 1785) PASS: lldb-api :: functionalities/data-formatter/data-formatter-globals/TestDataFormatterGlobals.py (746 of 1785) PASS: lldb-unit :: Expression/./ExpressionTests/DiagnosticManagerTest.AppendMessageNoDiag (747 of 1785) PASS: lldb-api :: lang/c/shared_lib_stripped_symbols/TestSharedLibStrippedSymbols.py (748 of 1785) PASS: lldb-api :: lang/cpp/namespace/TestNamespace.py (749 of 1785) PASS: lldb-shell :: Commands/command-regex-delete.test (750 of 1785) PASS: lldb-unit :: UnwindAssembly/x86/./UnwindAssemblyx86Tests/Testx86AssemblyInspectionEngine.TestPopR15 (751 of 1785) PASS: lldb-api :: functionalities/thread/concurrent_events/TestConcurrentWatchpointDelayWatchpointOneBreakpoint.py (752 of 1785) PASS: lldb-unit :: UnwindAssembly/x86/./UnwindAssemblyx86Tests/Testx86AssemblyInspectionEngine.TestPushR13 (753 of 1785) PASS: lldb-api :: python_api/objc_type/TestObjCType.py (754 of 1785) PASS: lldb-api :: commands/watchpoints/watchpoint_commands/command/TestWatchpointCommandPython.py (755 of 1785) PASS: lldb-shell :: ObjectFile/ELF/section-addresses.yaml (756 of 1785) PASS: lldb-unit :: Process/minidump/./LLDBMinidumpTests/MinidumpParserTest.GetLinuxProcStatus (757 of 1785) PASS: lldb-api :: functionalities/thread/concurrent_events/TestConcurrentTwoBreakpointsOneDelaySignal.py (758 of 1785) UNSUPPORTED: lldb-api :: commands/expression/call-restarts/TestCallThatRestarts.py (759 of 1785) PASS: lldb-unit :: Utility/./UtilityTests/VMRange.Comparison (760 of 1785) PASS: lldb-api :: lang/cpp/nested-class-other-compilation-unit/TestNestedClassWithParentInAnotherCU.py (761 of 1785) PASS: lldb-unit :: Utility/./UtilityTests/ListenerTest.GetEventWait (762 of 1785) PASS: lldb-shell :: SymbolFile/DWARF/parallel-indexing-stress.s (763 of 1785) PASS: lldb-api :: commands/expression/import-std-module/vector-bool/TestBoolVector.py (764 of 1785) PASS: lldb-api :: functionalities/load_unload/TestLoadUnload.py (765 of 1785) PASS: lldb-unit :: Utility/./UtilityTests/ArgsTest.TestSingleArg (766 of 1785) PASS: lldb-api :: lang/c/anonymous/TestAnonymous.py (767 of 1785) PASS: lldb-api :: functionalities/data-formatter/data-formatter-stl/libstdcpp/unique_ptr/invalid/TestDataFormatterInvalidStdUniquePtr.py (768 of 1785) PASS: lldb-api :: functionalities/postmortem/elf-core/gcore/TestGCore.py (769 of 1785) PASS: lldb-shell :: SymbolFile/DWARF/debug-types-basic.test (770 of 1785) PASS: lldb-unit :: SymbolFile/NativePDB/./SymbolFileNativePDBTests/PDBFPOProgramToDWARFExpressionTests.InvalidAssignmentSingle (771 of 1785) PASS: lldb-api :: functionalities/thread/num_threads/TestNumThreads.py (772 of 1785) UNSUPPORTED: lldb-api :: tools/lldb-server/platform-process-connect/TestPlatformProcessConnect.py (773 of 1785) PASS: lldb-api :: functionalities/thread/concurrent_events/TestConcurrentManyWatchpoints.py (774 of 1785) PASS: lldb-api :: functionalities/thread/crash_during_step/TestCrashDuringStep.py (775 of 1785) PASS: lldb-api :: functionalities/breakpoint/address_breakpoints/TestBadAddressBreakpoints.py (776 of 1785) PASS: lldb-unit :: Utility/./UtilityTests/StringListTest.JoinThree (777 of 1785) PASS: lldb-unit :: Utility/./UtilityTests/StringExtractorTest.GetHexU8_Underflow2 (778 of 1785) PASS: lldb-api :: commands/watchpoints/hello_watchpoint/TestMyFirstWatchpoint.py (779 of 1785) PASS: lldb-unit :: Utility/./UtilityTests/StructuredDataTest.ParseJSONFromFile (780 of 1785) PASS: lldb-api :: commands/expression/import-std-module/weak_ptr-dbg-info-content/TestDbgInfoContentWeakPtr.py (781 of 1785) PASS: lldb-unit :: ScriptInterpreter/Python/./ScriptInterpreterPythonTests/PythonDataObjectsTest.TestPythonStringToStr (782 of 1785) PASS: lldb-unit :: Host/./HostTests/NativeProcessProtocolTest.SetBreakpoint (783 of 1785) PASS: lldb-shell :: Commands/CommandScriptImmediateOutput/CommandScriptImmediateOutputFile.test (784 of 1785) UNSUPPORTED: lldb-api :: functionalities/exec/TestExec.py (785 of 1785) PASS: lldb-unit :: Utility/./UtilityTests/StreamTest.ShiftOperatorInts (786 of 1785) PASS: lldb-unit :: Process/gdb-remote/./ProcessGdbRemoteTests/GDBRemoteCommunicationServerTest.SendErrorResponse_ErrorList (787 of 1785) PASS: lldb-api :: commands/version/TestVersion.py (788 of 1785) PASS: lldb-unit :: Utility/./UtilityTests/RangeTest.LessThan (789 of 1785) PASS: lldb-shell :: SymbolFile/NativePDB/global-classes.cpp (790 of 1785) PASS: lldb-api :: lang/cpp/limit-debug-info/TestWithLimitDebugInfo.py (791 of 1785) PASS: lldb-unit :: Symbol/./SymbolTests/LineEntryTest.GetSameLineContiguousAddressRangeOneInline (792 of 1785) PASS: lldb-unit :: Utility/./UtilityTests/NameMatchesTest.EndsWith (793 of 1785) PASS: lldb-shell :: SymbolFile/Breakpad/line-table-missing-file.test (794 of 1785) PASS: lldb-api :: commands/log/basic/TestLogging.py (795 of 1785) PASS: lldb-unit :: UnwindAssembly/x86/./UnwindAssemblyx86Tests/Testx86AssemblyInspectionEngine.TestPushESI (796 of 1785) UNSUPPORTED: lldb-shell :: SymbolFile/PDB/func-symbols.test (797 of 1785) PASS: lldb-api :: commands/frame/diagnose/array/TestArray.py (798 of 1785) PASS: lldb-api :: functionalities/memory/read/TestMemoryRead.py (799 of 1785) PASS: lldb-unit :: tools/lldb-server/tests/./LLDBServerTests/TestBase.DebugserverEnv (800 of 1785) PASS: lldb-unit :: Utility/./UtilityTests/RegularExpression.Valid (801 of 1785) PASS: lldb-api :: lang/cpp/class_types/TestClassTypes.py (802 of 1785) PASS: lldb-unit :: UnwindAssembly/x86/./UnwindAssemblyx86Tests/Testx86AssemblyInspectionEngine.TestSpArithx86_64Augmented (803 of 1785) PASS: lldb-api :: functionalities/gdb_remote_client/TestStopPCs.py (804 of 1785) PASS: lldb-api :: functionalities/tsan/global_location/TestTsanGlobalLocation.py (805 of 1785) PASS: lldb-api :: commands/frame/diagnose/virtual-method-call/TestDiagnoseDereferenceVirtualMethodCall.py (806 of 1785) PASS: lldb-shell :: Driver/TestRepl.test (807 of 1785) PASS: lldb-unit :: Utility/./UtilityTests/StringListTest.AppendListCStringArrayEmpty (808 of 1785) PASS: lldb-api :: lang/c/modules/TestCModules.py (809 of 1785) PASS: lldb-unit :: Utility/./UtilityTests/ArgsTest.ReplaceArgumentAtIndexLonger (810 of 1785) PASS: lldb-api :: lang/objc/objc-static-method/TestObjCStaticMethod.py (811 of 1785) PASS: lldb-api :: functionalities/data-formatter/data-formatter-ptr-to-array/TestPtrToArrayFormatting.py (812 of 1785) PASS: lldb-unit :: Utility/./UtilityTests/DataExtractorTest.PeekData (813 of 1785) PASS: lldb-unit :: UnwindAssembly/x86/./UnwindAssemblyx86Tests/Testx86AssemblyInspectionEngine.TestSimplei386ugmented (814 of 1785) PASS: lldb-unit :: Language/Highlighting/./HighlighterTests/HighlighterTest.ClangIdentifiers (815 of 1785) UNSUPPORTED: lldb-shell :: Unwind/unwind-plan-dwarf-dump.test (816 of 1785) PASS: lldb-api :: commands/expression/call-throws/TestCallThatThrows.py (817 of 1785) PASS: lldb-unit :: Target/./TargetTests/ExecutionContextTest.GetByteOrder (818 of 1785) PASS: lldb-unit :: Process/gdb-remote/./ProcessGdbRemoteTests/GDBRemoteCommunicationClientTest.SaveRestoreRegistersNoSuffix (819 of 1785) PASS: lldb-shell :: Watchpoint/SetErrorCases.test (820 of 1785) PASS: lldb-unit :: debugserver/./debugserverTests/RNBSocket.LoopBackListenIPv4 (821 of 1785) PASS: lldb-api :: commands/target/create-deps/TestTargetCreateDeps.py (822 of 1785) PASS: lldb-api :: lang/objc/foundation/TestSymbolTable.py (823 of 1785) XFAIL: lldb-shell :: Unwind/prefer-debug-over-eh-frame.test (824 of 1785) PASS: lldb-api :: lang/cpp/class_types/TestClassTypesDisassembly.py (825 of 1785) PASS: lldb-api :: functionalities/param_entry_vals/basic_entry_values_x86_64/TestBasicEntryValuesX86_64.py (826 of 1785) PASS: lldb-unit :: Utility/./UtilityTests/VMRange.Reset (827 of 1785) PASS: lldb-unit :: Process/minidump/./LLDBMinidumpTests/MinidumpParserTest.FindMemoryRangeWithFullMemoryMinidump (828 of 1785) PASS: lldb-unit :: Utility/./UtilityTests/Flags.Test (829 of 1785) PASS: lldb-unit :: ScriptInterpreter/Python/./ScriptInterpreterPythonTests/PythonExceptionStateTest.TestDiscardSemantics (830 of 1785) UNSUPPORTED: lldb-api :: lang/cpp/static_members/TestCPPStaticMembers.py (831 of 1785) PASS: lldb-api :: macosx/version_zero/TestGetVersionZeroVersion.py (832 of 1785) PASS: lldb-api :: lang/objc/objc-dyn-sbtype/TestObjCDynamicSBType.py (833 of 1785) PASS: lldb-shell :: SymbolFile/DWARF/dir-separator-posix.s (834 of 1785) PASS: lldb-shell :: SymbolFile/NativePDB/ast-methods.cpp (835 of 1785) PASS: lldb-shell :: SymbolFile/DWARF/debug_rnglists.s (836 of 1785) PASS: lldb-api :: commands/expression/import-std-module/vector-of-vectors/TestVectorOfVectors.py (837 of 1785) PASS: lldb-api :: commands/expression/call-function/TestCallStopAndContinue.py (838 of 1785) PASS: lldb-unit :: Utility/./UtilityTests/ArgsTest.TestQuotedTrailingBackslash (839 of 1785) UNSUPPORTED: lldb-shell :: SymbolFile/target-symbols-add-unwind.test (840 of 1785) PASS: lldb-unit :: Target/./TargetTests/ModuleCacheTest.GetAndPutUuidExists (841 of 1785) PASS: lldb-api :: functionalities/fat_archives/TestFatArchives.py (842 of 1785) PASS: lldb-shell :: Unwind/eh-frame-dwarf-unwind.test (843 of 1785) PASS: lldb-unit :: Utility/./UtilityTests/DataExtractorTest.GetCStrUnterminated (844 of 1785) PASS: lldb-shell :: ObjectFile/MachO/symtab.yaml (845 of 1785) PASS: lldb-unit :: Utility/./UtilityTests/StreamTeeTest.SetStreamAtIndexOverwrite (846 of 1785) PASS: lldb-unit :: Language/Highlighting/./HighlighterTests/HighlighterTest.ClangCursorPosEndOfLine (847 of 1785) PASS: lldb-api :: lang/c/global_variables/TestGlobalVariables.py (848 of 1785) PASS: lldb-api :: functionalities/data-formatter/data-formatter-synthtype/TestDataFormatterSynthType.py (849 of 1785) PASS: lldb-api :: macosx/queues/TestQueues.py (850 of 1785) PASS: lldb-unit :: Utility/./UtilityTests/ScalarTest.CastOperations (851 of 1785) PASS: lldb-unit :: Utility/./UtilityTests/FileSpecTest.FormatFileSpec (852 of 1785) PASS: lldb-shell :: Breakpoint/debug_rnglist_basic.test (853 of 1785) PASS: lldb-api :: functionalities/data-formatter/data-formatter-stl/libcxx/set/TestDataFormatterLibcxxSet.py (854 of 1785) PASS: lldb-unit :: Utility/./UtilityTests/DataExtractorTest.GetMaxU64_unchecked (855 of 1785) PASS: lldb-api :: commands/frame/diagnose/complicated-expression/TestComplicatedExpression.py (856 of 1785) PASS: lldb-api :: functionalities/data-formatter/data-formatter-stl/libcxx/vbool/TestDataFormatterLibcxxVBool.py (857 of 1785) PASS: lldb-api :: functionalities/postmortem/minidump-new/TestMiniDumpNew.py (858 of 1785) PASS: lldb-unit :: Symbol/./SymbolTests/Type.CompilerContextPattern (859 of 1785) PASS: lldb-unit :: ScriptInterpreter/Python/./ScriptInterpreterPythonTests/PythonDataObjectsTest.TestObjectAttributes (860 of 1785) PASS: lldb-api :: functionalities/tail_call_frames/disambiguate_call_site/TestDisambiguateCallSite.py (861 of 1785) PASS: lldb-shell :: ObjectFile/ELF/minidebuginfo-find-symbols.yaml (862 of 1785) PASS: lldb-unit :: ObjectFile/Breakpad/./ObjectFileBreakpadTests/StackWinRecord.parse (863 of 1785) PASS: lldb-unit :: Utility/./UtilityTests/TimerTest.CategoryTimes (864 of 1785) PASS: lldb-unit :: Utility/./UtilityTests/ArgsTest.EscapeLLDBCommandArgument (865 of 1785) PASS: lldb-api :: commands/apropos/basic/TestApropos.py (866 of 1785) PASS: lldb-api :: commands/process/launch/TestProcessLaunch.py (867 of 1785) PASS: lldb-unit :: Host/./HostTests/MainLoopTest.Signal (868 of 1785) PASS: lldb-shell :: SymbolFile/DWARF/dwarf5-index-is-used.cpp (869 of 1785) PASS: lldb-api :: functionalities/tsan/thread_leak/TestTsanThreadLeak.py (870 of 1785) PASS: lldb-shell :: SymbolFile/DWARF/apple-index-is-used.cpp (871 of 1785) PASS: lldb-unit :: Symbol/./SymbolTests/TestClangASTContext.TestRecordHasFields (872 of 1785) PASS: lldb-api :: lang/cpp/namespace_definitions/TestNamespaceDefinitions.py (873 of 1785) PASS: lldb-api :: macosx/order/TestOrderFile.py (874 of 1785) PASS: lldb-api :: commands/frame/diagnose/dereference-this/TestDiagnoseDereferenceThis.py (875 of 1785) PASS: lldb-api :: functionalities/data-formatter/refpointer-recursion/TestDataFormatterRefPtrRecursion.py (876 of 1785) PASS: lldb-unit :: Breakpoint/./LLDBBreakpointTests/BreakpointIDTest.StringIsBreakpointName (877 of 1785) PASS: lldb-api :: macosx/indirect_symbol/TestIndirectSymbols.py (878 of 1785) PASS: lldb-unit :: SymbolFile/DWARF/./SymbolFileDWARFTests/SymbolFileDWARFTests.TestAbbrevMissingTerminator (879 of 1785) PASS: lldb-api :: lang/c/find_struct_type/TestFindStructTypes.py (880 of 1785) PASS: lldb-api :: functionalities/target_var/TestTargetVar.py (881 of 1785) PASS: lldb-api :: functionalities/thread/concurrent_events/TestConcurrentTwoBreakpointsOneWatchpoint.py (882 of 1785) PASS: lldb-unit :: Utility/./UtilityTests/BinaryStreamTest.PutULEB128One (883 of 1785) PASS: lldb-api :: functionalities/breakpoint/breakpoint_ignore_count/TestBreakpointIgnoreCount.py (884 of 1785) PASS: lldb-unit :: Utility/./UtilityTests/StringListTest.CopyList (885 of 1785) PASS: lldb-unit :: Utility/./UtilityTests/ArgsTest.DoubleQuotedItem (886 of 1785) PASS: lldb-api :: lang/c/unions/TestUnionMembers.py (887 of 1785) PASS: lldb-unit :: Host/./HostTests/SocketTest.TCPListen0GetPort (888 of 1785) PASS: lldb-unit :: Language/Highlighting/./HighlighterTests/HighlighterTest.ClangCommas (889 of 1785) PASS: lldb-api :: commands/expression/top-level/TestTopLevelExprs.py (890 of 1785) PASS: lldb-api :: python_api/lldbutil/TestSwigVersion.py (891 of 1785) PASS: lldb-shell :: ObjectFile/ELF/gnu-debuglink.yaml (892 of 1785) PASS: lldb-unit :: Utility/./UtilityTests/StreamTeeTest.GetStreamAtIndexOutOfBounds (893 of 1785) PASS: lldb-api :: lang/c/const_variables/TestConstVariables.py (894 of 1785) PASS: lldb-unit :: ScriptInterpreter/Python/./ScriptInterpreterPythonTests/PythonDataObjectsTest.TestPythonListToStructuredList (895 of 1785) PASS: lldb-api :: commands/expression/import-std-module/unique_ptr/TestUniquePtr.py (896 of 1785) PASS: lldb-unit :: Language/Highlighting/./HighlighterTests/HighlighterTest.ClangStringLiterals (897 of 1785) PASS: lldb-unit :: Utility/./UtilityTests/ArgsTest.ReplaceArgumentAtIndexEqual (898 of 1785) PASS: lldb-unit :: Utility/./UtilityTests/FileSpecTest.RemoveLastPathComponent (899 of 1785) PASS: lldb-unit :: Symbol/./SymbolTests/PostfixExpression.ParseFPOProgram (900 of 1785) PASS: lldb-api :: functionalities/thread/concurrent_events/TestConcurrentTwoWatchpointsOneDelayBreakpoint.py (901 of 1785) PASS: lldb-api :: functionalities/breakpoint/global_constructor/TestBreakpointInGlobalConstructor.py (902 of 1785) PASS: lldb-unit :: UnwindAssembly/x86/./UnwindAssemblyx86Tests/Testx86AssemblyInspectionEngine.TestPopRBP (903 of 1785) PASS: lldb-unit :: Language/Highlighting/./HighlighterTests/HighlighterTest.ClangBraces (904 of 1785) PASS: lldb-api :: functionalities/breakpoint/breakpoint_command/TestRegexpBreakCommand.py (905 of 1785) PASS: lldb-unit :: ScriptInterpreter/Python/./ScriptInterpreterPythonTests/PythonDataObjectsTest.TestInstanceNameResolutionNoDot (906 of 1785) PASS: lldb-unit :: Utility/./UtilityTests/RangeTest.DefaultConstructor (907 of 1785) PASS: lldb-api :: functionalities/data-formatter/data-formatter-stl/libcxx/tuple/TestDataFormatterLibcxxTuple.py (908 of 1785) PASS: lldb-unit :: Utility/./UtilityTests/DataExtractorTest.GetMaxS64 (909 of 1785) PASS: lldb-unit :: Process/gdb-remote/./ProcessGdbRemoteTests/GDBRemoteCommunicationClientTest.SendGetDataPacket (910 of 1785) PASS: lldb-unit :: Symbol/./SymbolTests/TestClangASTContext.TestBuiltinTypeForEncodingAndBitSize (911 of 1785) PASS: lldb-unit :: ScriptInterpreter/Python/./ScriptInterpreterPythonTests/PythonDataObjectsTest.TestPythonDictionaryToStructuredDictionary (912 of 1785) PASS: lldb-unit :: Utility/./UtilityTests/UUIDTest.Validity (913 of 1785) PASS: lldb-api :: lang/objc/conflicting-definition/TestConflictingDefinition.py (914 of 1785) PASS: lldb-api :: functionalities/inferior-crashing/TestInferiorCrashing.py (915 of 1785) PASS: lldb-unit :: Utility/./UtilityTests/Flags.AnySet (916 of 1785) PASS: lldb-unit :: Utility/./UtilityTests/IndexToObjectTest.ObjectForIndex (917 of 1785) PASS: lldb-unit :: Expression/./ExpressionTests/DiagnosticManagerTest.GetStringNoDiags (918 of 1785) PASS: lldb-api :: python_api/function_symbol/TestDisasmAPI.py (919 of 1785) PASS: lldb-api :: functionalities/data-formatter/data-formatter-objc/TestDataFormatterObjCNSURL.py (920 of 1785) PASS: lldb-unit :: Language/Highlighting/./HighlighterTests/HighlighterTest.DefaultHighlighterWithCursorOutOfBounds (921 of 1785) PASS: lldb-unit :: UnwindAssembly/x86/./UnwindAssemblyx86Tests/Testx86AssemblyInspectionEngine.TestPopR13 (922 of 1785) PASS: lldb-api :: lang/cpp/class-template-parameter-pack/TestClassTemplateParameterPack.py (923 of 1785) PASS: lldb-shell :: Reproducer/Functionalities/TestStepping.test (924 of 1785) PASS: lldb-unit :: Process/minidump/./LLDBMinidumpTests/MinidumpParserTest.MinidumpModuleOrder (925 of 1785) PASS: lldb-api :: lang/c/stepping/TestStepAndBreakpoints.py (926 of 1785) PASS: lldb-unit :: Signals/./SignalsTests/UnixSignalsTest.VersionChange (927 of 1785) PASS: lldb-unit :: Host/./HostTests/FileSystemTest.Exists (928 of 1785) PASS: lldb-unit :: SymbolFile/NativePDB/./SymbolFileNativePDBTests/PDBFPOProgramToDWARFExpressionTests.UnresolvedRegisterAssignmentReference (929 of 1785) UNSUPPORTED: lldb-api :: tools/lldb-vscode/breakpoint/TestVSCode_setBreakpoints.py (930 of 1785) UNSUPPORTED: lldb-api :: tools/lldb-server/libraries-svr4/TestGdbRemoteLibrariesSvr4Support.py (931 of 1785) PASS: lldb-api :: functionalities/abbreviation/TestCommonShortSpellings.py (932 of 1785) PASS: lldb-api :: commands/expression/namespace_local_var_same_name_cpp_and_c/TestNamespaceLocalVarSameNameCppAndC.py (933 of 1785) PASS: lldb-shell :: SymbolFile/DWARF/debug-types-address-ranges.s (934 of 1785) PASS: lldb-api :: functionalities/data-formatter/data-formatter-stl/libcxx/vector/TestDataFormatterLibcxxVector.py (935 of 1785) PASS: lldb-api :: python_api/lldbutil/process/TestPrintStackTraces.py (936 of 1785) UNSUPPORTED: lldb-api :: commands/expression/completion-crash-incomplete-record/TestCompletionCrashIncompleteRecord.py (937 of 1785) PASS: lldb-api :: commands/expression/import-std-module/conflicts/TestStdModuleWithConflicts.py (938 of 1785) PASS: lldb-api :: functionalities/data-formatter/varscript_formatting/TestDataFormatterVarScriptFormatting.py (939 of 1785) PASS: lldb-api :: api/multithreaded/TestMultithreaded.py (940 of 1785) PASS: lldb-unit :: Utility/./UtilityTests/CompletionRequest.ShiftArguments (941 of 1785) PASS: lldb-api :: functionalities/data-formatter/data-formatter-stl/libcxx/iterator/TestDataFormatterLibccIterator.py (942 of 1785) PASS: lldb-unit :: Utility/./UtilityTests/StreamTest.PutHex32ByteOrderLittle (943 of 1785) PASS: lldb-api :: functionalities/breakpoint/breakpoint_ids/TestBreakpointIDs.py (944 of 1785) PASS: lldb-api :: functionalities/inferior-crashing/recursive-inferior/TestRecursiveInferior.py (945 of 1785) UNSUPPORTED: lldb-api :: tools/lldb-vscode/variables/TestVSCode_variables.py (946 of 1785) PASS: lldb-unit :: Utility/./UtilityTests/StringExtractorTest.GetHexU8_Exact (947 of 1785) PASS: lldb-unit :: Expression/./ExpressionTests/ClangHostTest.ComputeClangResourceDirectory (948 of 1785) PASS: lldb-api :: lang/cpp/llvm-style/TestLLVMStyle.py (949 of 1785) UNSUPPORTED: lldb-api :: python_api/event/TestEvents.py (950 of 1785) PASS: lldb-api :: lang/c/enum_types/TestEnumTypes.py (951 of 1785) PASS: lldb-api :: functionalities/data-formatter/data-formatter-stl/libcxx/optional/TestDataFormatterLibcxxOptional.py (952 of 1785) PASS: lldb-unit :: Utility/./UtilityTests/StringListTest.JoinNonSpace (953 of 1785) PASS: lldb-unit :: Utility/./UtilityTests/FileSpecTest.AppendPathComponent (954 of 1785) PASS: lldb-unit :: UnwindAssembly/x86/./UnwindAssemblyx86Tests/Testx86AssemblyInspectionEngine.TestPushEAX (955 of 1785) PASS: lldb-api :: functionalities/gdb_remote_client/TestRestartBug.py (956 of 1785) PASS: lldb-api :: commands/watchpoints/watchpoint_disable/TestWatchpointDisable.py (957 of 1785) PASS: lldb-unit :: ScriptInterpreter/Python/./ScriptInterpreterPythonTests/PythonDataObjectsTest.TestPythonListManipulation (958 of 1785) PASS: lldb-unit :: Expression/./ExpressionTests/DiagnosticManagerTest.HasFixits (959 of 1785) PASS: lldb-unit :: Utility/./UtilityTests/StreamTest.PutCharNull (960 of 1785) PASS: lldb-api :: functionalities/float-display/TestFloatDisplay.py (961 of 1785) PASS: lldb-shell :: Driver/TestProcessAttach.test (962 of 1785) PASS: lldb-api :: lang/c/inlines/TestRedefinitionsInInlines.py (963 of 1785) PASS: lldb-shell :: ObjectFile/ELF/PT_LOAD-overlap-PT_TLS.yaml (964 of 1785) PASS: lldb-api :: commands/target/stop-hooks/TestStopHooks.py (965 of 1785) PASS: lldb-unit :: Host/./HostTests/FileSystemTest.Resolve (966 of 1785) PASS: lldb-unit :: Utility/./UtilityTests/StringLexerTest.GetUnlexed (967 of 1785) PASS: lldb-unit :: Utility/./UtilityTests/StringExtractorTest.InitEmpty (968 of 1785) PASS: lldb-unit :: Host/./HostTests/SocketTest.UDPConnect (969 of 1785) PASS: lldb-unit :: UnwindAssembly/x86/./UnwindAssemblyx86Tests/Testx86AssemblyInspectionEngine.TestPushR14 (970 of 1785) PASS: lldb-api :: python_api/watchpoint/TestWatchpointIgnoreCount.py (971 of 1785) PASS: lldb-api :: functionalities/thread/create_after_attach/TestCreateAfterAttach.py (972 of 1785) PASS: lldb-shell :: ObjectFile/ELF/build-id-case.yaml (973 of 1785) PASS: lldb-api :: types/TestDoubleTypesExpr.py (974 of 1785) PASS: lldb-api :: commands/command/script_alias/TestCommandScriptAlias.py (975 of 1785) PASS: lldb-unit :: SymbolFile/NativePDB/./SymbolFileNativePDBTests/PDBFPOProgramToDWARFExpressionTests.MissingTargetRegister (976 of 1785) PASS: lldb-unit :: Utility/./UtilityTests/Predicate.WaitForValueEqualTo (977 of 1785) PASS: lldb-unit :: Utility/./UtilityTests/UriParserTest.BracketedHostnamePort (978 of 1785) PASS: lldb-shell :: ObjectFile/Breakpad/sections-trailing-func.test (979 of 1785) PASS: lldb-unit :: Process/minidump/./LLDBMinidumpTests/MinidumpParserTest.GetThreadContext_x86_32_wow64 (980 of 1785) UNSUPPORTED: lldb-api :: commands/expression/completion-crash1/TestCompletionCrash1.py (981 of 1785) PASS: lldb-unit :: Language/CPlusPlus/./LanguageCPlusPlusTests/CPlusPlusLanguage.ExtractContextAndIdentifier (982 of 1785) PASS: lldb-unit :: ScriptInterpreter/Python/./ScriptInterpreterPythonTests/PythonDataObjectsTest.TestGlobalNameResolutionWithDot (983 of 1785) PASS: lldb-api :: tools/lldb-server/TestGdbRemote_qThreadStopInfo.py (984 of 1785) UNSUPPORTED: lldb-api :: functionalities/breakpoint/hardware_breakpoints/hardware_breakpoint_on_multiple_threads/TestHWBreakMultiThread.py (985 of 1785) PASS: lldb-api :: commands/expression/issue_11588/Test11588.py (986 of 1785) PASS: lldb-api :: commands/expression/persistent_variables/TestPersistentVariables.py (987 of 1785) PASS: lldb-unit :: Symbol/./SymbolTests/LineEntryTest.GetSameLineContiguousAddressRangeNoInlines (988 of 1785) UNSUPPORTED: lldb-api :: functionalities/darwin_log/source/info/TestDarwinLogSourceInfo.py (989 of 1785) PASS: lldb-api :: functionalities/jitloader_gdb/TestJITLoaderGDB.py (990 of 1785) PASS: lldb-api :: python_api/symbol-context/TestSymbolContext.py (991 of 1785) PASS: lldb-api :: lang/c/bitfields/TestBitfields.py (992 of 1785) PASS: lldb-api :: functionalities/data-formatter/data-formatter-script/TestDataFormatterScript.py (993 of 1785) PASS: lldb-unit :: Utility/./UtilityTests/NameMatchesTest.Contains (994 of 1785) PASS: lldb-unit :: Utility/./UtilityTests/StringListTest.AppendListCStringArray (995 of 1785) PASS: lldb-unit :: Host/./HostTests/NativeProcessProtocolTest.SetBreakpointFailWrite (996 of 1785) PASS: lldb-unit :: Utility/./UtilityTests/StringListTest.JoinMultiCharSeparator (997 of 1785) PASS: lldb-unit :: Core/./LLDBCoreTests/UniqueCStringMap.NoDefaultConstructor (998 of 1785) PASS: lldb-unit :: UnwindAssembly/x86/./UnwindAssemblyx86Tests/Testx86AssemblyInspectionEngine.Test32bitFramelessSmallStackFrame (999 of 1785) PASS: lldb-unit :: ScriptInterpreter/Python/./ScriptInterpreterPythonTests/PythonDataObjectsTest.TestPythonBytes (1000 of 1785) PASS: lldb-unit :: Process/gdb-remote/./ProcessGdbRemoteTests/GDBRemoteCommunicationClientTest.GetModulesInfoInvalidResponse (1001 of 1785) PASS: lldb-api :: python_api/name_lookup/TestNameLookup.py (1002 of 1785) PASS: lldb-unit :: UnwindAssembly/x86/./UnwindAssemblyx86Tests/Testx86AssemblyInspectionEngine.TestPopR12 (1003 of 1785) PASS: lldb-shell :: Settings/TestSettingsSet.test (1004 of 1785) PASS: lldb-api :: functionalities/data-formatter/data-formatter-objc/TestDataFormatterObjCPlain.py (1005 of 1785) PASS: lldb-unit :: Utility/./UtilityTests/DataExtractorTest.GetCStrAtNullOffset (1006 of 1785) UNSUPPORTED: lldb-api :: tools/lldb-vscode/launch/TestVSCode_launch.py (1007 of 1785) PASS: lldb-unit :: SymbolFile/NativePDB/./SymbolFileNativePDBTests/PDBFPOProgramToDWARFExpressionTests.SingleAssignmentRegisterRef (1008 of 1785) PASS: lldb-unit :: Utility/./UtilityTests/DataExtractorTest.GetCStr (1009 of 1785) PASS: lldb-shell :: SymbolFile/NativePDB/globals-bss.cpp (1010 of 1785) PASS: lldb-unit :: Utility/./UtilityTests/ScalarTest.ComparisonFloat (1011 of 1785) UNSUPPORTED: lldb-api :: functionalities/darwin_log/filter/regex/activity-chain/TestDarwinLogFilterRegexActivityChain.py (1012 of 1785) PASS: lldb-api :: functionalities/postmortem/netbsd-core/TestNetBSDCore.py (1013 of 1785) PASS: lldb-unit :: Core/./LLDBCoreTests/RichManglingContextTest.IPDRealloc (1014 of 1785) PASS: lldb-unit :: UnwindAssembly/x86/./UnwindAssemblyx86Tests/Testx86AssemblyInspectionEngine.TestPopEBP (1015 of 1785) PASS: lldb-api :: commands/expression/two-files/TestObjCTypeQueryFromOtherCompileUnit.py (1016 of 1785) PASS: lldb-unit :: Utility/./UtilityTests/OptionsWithRawTest.EmptyInput (1017 of 1785) PASS: lldb-shell :: SymbolFile/DWARF/compilercontext.ll (1018 of 1785) PASS: lldb-shell :: SymbolFile/Breakpad/symtab-macho.test (1019 of 1785) PASS: lldb-shell :: Settings/TestDisableColor.test (1020 of 1785) PASS: lldb-api :: lang/cpp/rvalue-references/TestRvalueReferences.py (1021 of 1785) PASS: lldb-unit :: Utility/./UtilityTests/StringListTest.LongestCommonPrefix (1022 of 1785) PASS: lldb-unit :: ScriptInterpreter/Python/./ScriptInterpreterPythonTests/PythonDataObjectsTest.TestCallable (1023 of 1785) PASS: lldb-api :: functionalities/thread/concurrent_events/TestConcurrentSignalDelayWatch.py (1024 of 1785) PASS: lldb-api :: python_api/watchpoint/watchlocation/TestSetWatchlocation.py (1025 of 1785) UNSUPPORTED: lldb-shell :: Breakpoint/ppc64-localentry.test (1026 of 1785) PASS: lldb-api :: tools/lldb-server/TestGdbRemoteProcessInfo.py (1027 of 1785) PASS: lldb-api :: tools/lldb-server/TestGdbRemoteExpeditedRegisters.py (1028 of 1785) PASS: lldb-api :: functionalities/data-formatter/data-formatter-synthval/TestDataFormatterSynthVal.py (1029 of 1785) PASS: lldb-unit :: Utility/./UtilityTests/ScalarTest.SetValueFromCString (1030 of 1785) PASS: lldb-api :: lang/objc/objc-foundation-dictionary-empty/TestNSDictionary0.py (1031 of 1785) PASS: lldb-unit :: Utility/./UtilityTests/StringExtractorTest.DecodeHexU8_InvalidHex (1032 of 1785) PASS: lldb-unit :: Utility/./UtilityTests/OptionsWithRawTest.UnterminatedQuote (1033 of 1785) PASS: lldb-api :: sanity/TestModuleCacheSanity.py (1034 of 1785) PASS: lldb-shell :: Register/x86-64-read.test (1035 of 1785) PASS: lldb-unit :: Core/./LLDBCoreTests/MangledTest.NameIndexes_FindFunctionSymbols (1036 of 1785) PASS: lldb-api :: functionalities/breakpoint/breakpoint_hit_count/TestBreakpointHitCount.py (1037 of 1785) PASS: lldb-unit :: Process/minidump/./LLDBMinidumpTests/MinidumpParserTest.GetExceptionStream (1038 of 1785) UNSUPPORTED: lldb-api :: tools/lldb-server/TestGdbRemoteAuxvSupport.py (1039 of 1785) PASS: lldb-unit :: Utility/./UtilityTests/TildeExpressionResolver.ResolveFullPath (1040 of 1785) PASS: lldb-api :: commands/command/script/import/TestImport.py (1041 of 1785) PASS: lldb-api :: functionalities/thread/concurrent_events/TestConcurrentSignalWatchBreak.py (1042 of 1785) PASS: lldb-api :: python_api/value/linked_list/TestValueAPILinkedList.py (1043 of 1785) PASS: lldb-unit :: Utility/./UtilityTests/VMRange.ContainsAddr (1044 of 1785) PASS: lldb-unit :: Utility/./UtilityTests/RecordReplayTest.InstrumentedBarPtr (1045 of 1785) PASS: lldb-shell :: Breakpoint/debug_rnglist_rlestartend.test (1046 of 1785) PASS: lldb-api :: functionalities/thread/step_out/TestThreadStepOut.py (1047 of 1785) PASS: lldb-api :: commands/command/invalid-args/TestInvalidArgsCommand.py (1048 of 1785) PASS: lldb-unit :: Utility/./UtilityTests/CompletionRequest.TryCompleteCurrentArgBad (1049 of 1785) PASS: lldb-unit :: ObjectFile/Breakpad/./ObjectFileBreakpadTests/PublicRecord.parse (1050 of 1785) PASS: lldb-api :: python_api/type/TestTypeList.py (1051 of 1785) PASS: lldb-unit :: Utility/./UtilityTests/Predicate.WaitForValueNotEqualTo (1052 of 1785) PASS: lldb-unit :: ScriptInterpreter/Python/./ScriptInterpreterPythonTests/PythonDataObjectsTest.TestPythonCallableCheck (1053 of 1785) PASS: lldb-unit :: Process/minidump/./LLDBMinidumpTests/MinidumpParserTest.GetThreadContext_x86_64 (1054 of 1785) PASS: lldb-shell :: Settings/TestModuleCacheSanity.test (1055 of 1785) PASS: lldb-unit :: Utility/./UtilityTests/RegisterValueTest.GetSet8 (1056 of 1785) UNSUPPORTED: lldb-api :: tools/lldb-vscode/breakpoint/TestVSCode_setFunctionBreakpoints.py (1057 of 1785) PASS: lldb-unit :: Process/minidump/./LLDBMinidumpTests/MinidumpParserTest.GetFilteredModuleList (1058 of 1785) PASS: lldb-unit :: Host/./HostTests/FileSystemTest.EnumerateDirectory (1059 of 1785) PASS: lldb-api :: functionalities/tsan/thread_numbers/TestTsanThreadNumbers.py (1060 of 1785) PASS: lldb-unit :: Utility/./UtilityTests/LogChannelEnabledTest.LogGetLogThread (1061 of 1785) PASS: lldb-unit :: UnwindAssembly/x86/./UnwindAssemblyx86Tests/Testx86AssemblyInspectionEngine.TestPushECX (1062 of 1785) UNSUPPORTED: lldb-shell :: SymbolFile/PDB/calling-conventions.test (1063 of 1785) PASS: lldb-unit :: Utility/./UtilityTests/ProcessInstanceInfo.DumpTable_invalidUID (1064 of 1785) PASS: lldb-shell :: SymbolFile/DWARF/debug-names-compressed.cpp (1065 of 1785) PASS: lldb-api :: lang/cpp/stl/TestStdCXXDisassembly.py (1066 of 1785) PASS: lldb-api :: lang/objc/foundation/TestObjCMethodsNSArray.py (1067 of 1785) PASS: lldb-shell :: SymbolFile/NativePDB/ast-types.cpp (1068 of 1785) PASS: lldb-api :: lang/cpp/offsetof/TestOffsetofCpp.py (1069 of 1785) PASS: lldb-unit :: Utility/./UtilityTests/LogChannelTest.EnableOptions (1070 of 1785) PASS: lldb-api :: python_api/disassemble-raw-data/TestDisassembleRawData.py (1071 of 1785) PASS: lldb-unit :: Utility/./UtilityTests/Flags.Clear (1072 of 1785) PASS: lldb-api :: functionalities/data-formatter/boolreference/TestFormattersBoolRefPtr.py (1073 of 1785) PASS: lldb-unit :: Utility/./UtilityTests/OptionsWithRawTest.ArgsButNoLeadingDash (1074 of 1785) PASS: lldb-api :: functionalities/modern-type-lookup/libcxx/TestLibCxxModernTypeLookup.py (1075 of 1785) PASS: lldb-unit :: Utility/./UtilityTests/StreamTest.PutCString (1076 of 1785) PASS: lldb-unit :: Host/./HostTests/MainLoopTest.UnmonitoredSignal (1077 of 1785) PASS: lldb-api :: commands/expression/import-std-module/vector-dbg-info-content/TestDbgInfoContentVector.py (1078 of 1785) PASS: lldb-api :: functionalities/postmortem/minidump/TestMiniDump.py (1079 of 1785) PASS: lldb-unit :: Symbol/./SymbolTests/PostfixExpression.ParseOneExpression (1080 of 1785) UNSUPPORTED: lldb-api :: commands/register/register/intel_xtended_registers/TestMPXRegisters.py (1081 of 1785) PASS: lldb-unit :: Utility/./UtilityTests/RangeTest.ContainsAddrInvalid (1082 of 1785) PASS: lldb-unit :: Process/minidump/./LLDBMinidumpTests/MinidumpParserTest.FindMemoryRange (1083 of 1785) PASS: lldb-unit :: Language/Highlighting/./HighlighterTests/HighlighterTest.Keywords (1084 of 1785) PASS: lldb-api :: lang/c/blocks/TestBlocks.py (1085 of 1785) PASS: lldb-api :: functionalities/thread/exit_during_break/TestExitDuringBreak.py (1086 of 1785) PASS: lldb-api :: functionalities/postmortem/elf-core/thread_crash/TestLinuxCoreThreads.py (1087 of 1785) UNSUPPORTED: lldb-api :: functionalities/thread/state/TestThreadStates.py (1088 of 1785) PASS: lldb-unit :: UnwindAssembly/x86/./UnwindAssemblyx86Tests/Testx86AssemblyInspectionEngine.TestPushEBX (1089 of 1785) PASS: lldb-api :: commands/quit/TestQuit.py (1090 of 1785) PASS: lldb-unit :: ScriptInterpreter/Python/./ScriptInterpreterPythonTests/PythonDataObjectsTest.TestPythonTupleInitializerList2 (1091 of 1785) PASS: lldb-unit :: Utility/./UtilityTests/FileSpecTest.EqualDotsPosix (1092 of 1785) PASS: lldb-shell :: Minidump/Windows/find-module.test (1093 of 1785) PASS: lldb-unit :: Interpreter/./InterpreterTests/CompletionTest.FileCompletionAbsolute (1094 of 1785) UNSUPPORTED: lldb-api :: functionalities/thread/multi_break/TestMultipleBreakpoints.py (1095 of 1785) PASS: lldb-api :: commands/log/invalid-args/TestInvalidArgsLog.py (1096 of 1785) PASS: lldb-api :: lang/objc/foundation/TestObjectDescriptionAPI.py (1097 of 1785) PASS: lldb-unit :: Process/gdb-remote/./ProcessGdbRemoteTests/GDBRemoteCommunicationTest.ReadPacket_checksum (1098 of 1785) PASS: lldb-unit :: Utility/./UtilityTests/StringListTest.InsertStringAtIndexEnd (1099 of 1785) PASS: lldb-unit :: Utility/./UtilityTests/ProcessInfoTest.Constructor (1100 of 1785) PASS: lldb-unit :: Utility/./UtilityTests/RangeTest.NotEqual (1101 of 1785) PASS: lldb-api :: functionalities/data-formatter/summary-string-onfail/Test-rdar-9974002.py (1102 of 1785) PASS: lldb-unit :: Utility/./UtilityTests/UriParserTest.TypicalPortPath (1103 of 1785) PASS: lldb-shell :: SymbolFile/DWARF/dwarf5-partial-index.cpp (1104 of 1785) PASS: lldb-api :: functionalities/breakpoint/cpp/TestCPPBreakpointLocations.py (1105 of 1785) PASS: lldb-unit :: Process/minidump/./LLDBMinidumpTests/MinidumpParserTest.GetArchitectureWindows (1106 of 1785) PASS: lldb-shell :: ObjectFile/Breakpad/uuid-matching-mac.test (1107 of 1785) PASS: lldb-shell :: ObjectFile/ELF/PT_LOAD.yaml (1108 of 1785) PASS: lldb-unit :: Utility/./UtilityTests/FileSpecTest.EqualDotsPosixRoot (1109 of 1785) PASS: lldb-unit :: ScriptInterpreter/Python/./ScriptInterpreterPythonTests/PythonDataObjectsTest.TestPythonByteArray (1110 of 1785) PASS: lldb-unit :: Utility/./UtilityTests/ArgsTest.BareSingleQuote (1111 of 1785) PASS: lldb-unit :: Utility/./UtilityTests/NameMatchesTest.RegularExpression (1112 of 1785) PASS: lldb-api :: functionalities/data-formatter/vector-types/TestVectorTypesFormatting.py (1113 of 1785) PASS: lldb-api :: functionalities/data-formatter/data-formatter-objc/TestDataFormatterObjCKVO.py (1114 of 1785) PASS: lldb-api :: lang/cpp/overloaded-functions/TestOverloadedFunctions.py (1115 of 1785) PASS: lldb-api :: functionalities/step_scripted/TestStepScripted.py (1116 of 1785) PASS: lldb-unit :: Utility/./UtilityTests/StreamTest.PutNHex8 (1117 of 1785) UNSUPPORTED: lldb-api :: functionalities/darwin_log/filter/regex/category/TestDarwinLogFilterRegexCategory.py (1118 of 1785) PASS: lldb-api :: functionalities/postmortem/wow64_minidump/TestWow64MiniDump.py (1119 of 1785) FAIL: lldb-api :: tools/lldb-server/register-reading/TestGdbRemoteGPacket.py (1120 of 1785) ******************** TEST 'lldb-api :: tools/lldb-server/register-reading/TestGdbRemoteGPacket.py' FAILED ******************** lldb version 10.0.99 (http://labmaster3.local/git/llvm-project.git revision bbbc873f83e4c723541cdbb13634c8de833bc507) clang revision 6456252dbf67f26f88873e92c0813ebf8a1f96a3 llvm revision 6456252dbf67f26f88873e92c0813ebf8a1f96a3 LLDB library dir: /Users/buildslave/jenkins/workspace/lldb-cmake-sanitized/lldb-build/bin LLDB import library dir: /Users/buildslave/jenkins/workspace/lldb-cmake-sanitized/lldb-build/bin libstdcxx tests will not be run because: Don't know how to build with libstdcxx on macosx Skipping following debug info categories: ['dwo']

Hide Details

Session logs for test failures/errors/unexpected successes will go into directory '/Users/buildslave/jenkins/workspace/lldb-cmake-sanitized/test/logs' Command invoked: /Users/buildslave/jenkins/workspace/lldb-cmake-sanitized/llvm-project/lldb/test/API/dotest.py --arch=x86_64 -s /Users/buildslave/jenkins/workspace/lldb-cmake-sanitized/lldb-build/lldb-test-traces -S nm -u CXXFLAGS -u CFLAGS --executable /Users/buildslave/jenkins/workspace/lldb-cmake-sanitized/lldb-build/./bin/lldb --dsymutil /Users/buildslave/jenkins/workspace/lldb-cmake-sanitized/lldb-build/./bin/dsymutil --filecheck /Users/buildslave/jenkins/workspace/lldb-cmake-sanitized/lldb-build/./bin/FileCheck -C /Users/buildslave/jenkins/workspace/lldb-cmake-sanitized/host-compiler/bin/clang --codesign-identity lldb_codesign --server /Users/buildslave/jenkins/workspace/lldb-cmake-sanitized/lldb-build/./bin/debugserver --arch x86_64 --build-dir /Users/buildslave/jenkins/workspace/lldb-cmake-sanitized/lldb-build/lldb-test-build.noindex -s=/Users/buildslave/jenkins/workspace/lldb-cmake-sanitized/test/logs -t --env TERM=vt100 --env LLVM_LIBS_DIR=/Users/buildslave/jenkins/workspace/lldb-cmake-sanitized/lldb-build/./lib --build-dir /Users/buildslave/jenkins/workspace/lldb-cmake-sanitized/lldb-build/tools/lldb/lldb-test-build.noindex --lldb-module-cache-dir /Users/buildslave/jenkins/workspace/lldb-cmake-sanitized/lldb-build/tools/lldb/lldb-test-build.noindex/module-cache-lldb/lldb-api --clang-module-cache-dir /Users/buildslave/jenkins/workspace/lldb-cmake-sanitized/lldb-build/tools/lldb/lldb-test-build.noindex/module-cache-clang/lldb-api /Users/buildslave/jenkins/workspace/lldb-cmake-sanitized/llvm-project/lldb/packages/Python/lldbsuite/test/tools/lldb-server/register-reading -p TestGdbRemoteGPacket.py Change dir to: /Users/buildslave/jenkins/workspace/lldb-cmake-sanitized/llvm-project/lldb/packages/Python/lldbsuite/test/tools/lldb-server/register-reading runCmd: settings set symbols.enable-external-lookup false output:

Hide Details

runCmd: settings set plugin.process.gdb-remote.packet-timeout 60 output:

Hide Details

runCmd: settings set symbols.clang-modules-cache-path "/Users/buildslave/jenkins/workspace/lldb-cmake-sanitized/lldb-build/tools/lldb/lldb-test-build.noindex/module-cache-lldb/lldb-api" output:

Hide Details

runCmd: settings set use-color false output:

Hide Details

Adding tearDown hook: def shutdown_named_pipe(): # Close the pipe. try: named_pipe.close() except: print("failed to close named pipe") None

Hide Details

# Delete the pipe. try: os.remove(named_pipe_path) except: print("failed to delete named pipe: {}".format(named_pipe_path)) None

Hide Details

# Delete the temp directory. try: os.rmdir(temp_dir) except: print( "failed to delete temp dir: {}, directory contents: '{}'".format( temp_dir, os.listdir(temp_dir))) None

Hide Details

Hide Details

Adding tearDown hook: def cleanupSubprocesses(self): # Ensure any subprocesses are cleaned up for p in self.subprocesses: p.terminate() del p del self.subprocesses[:] # Ensure any forked processes are cleaned up for pid in self.forkedProcessPids: if os.path.exists("/proc/" + str(pid)): os.kill(pid, signal.SIGTERM)

Hide Details

Hide Details

Adding tearDown hook: def shutdown_debug_monitor(): try: server.terminate() except: logger.warning( "failed to terminate server for debug monitor: {}; ignoring".format( sys.exc_info()[0]))

Hide Details

Hide Details

Adding tearDown hook: def shutdown_socket(): if sock: try: # send the kill packet so lldb-server shuts down gracefully sock.sendall(GdbRemoteTestCaseBase._GDBREMOTE_KILL_PACKET) except: logger.warning( "failed to send kill packet to debug monitor: {}; ignoring".format( sys.exc_info()[0]))

Hide Details

try: sock.close() except: logger.warning( "failed to close socket to debug monitor: {}; ignoring".format( sys.exc_info()[0]))

Hide Details

Hide Details

Adding tearDown hook: def cleanupSubprocesses(self): # Ensure any subprocesses are cleaned up for p in self.subprocesses: p.terminate() del p del self.subprocesses[:] # Ensure any forked processes are cleaned up for pid in self.forkedProcessPids: if os.path.exists("/proc/" + str(pid)): os.kill(pid, signal.SIGTERM)

Hide Details

Hide Details

FAIL: LLDB (/Users/buildslave/jenkins/workspace/lldb-cmake-sanitized/host-compiler/bin/clang-10-x86_64) :: test_g_packet_debugserver (TestGdbRemoteGPacket.TestGdbRemoteGPacket) Executing tearDown hook: def cleanupSubprocesses(self): # Ensure any subprocesses are cleaned up for p in self.subprocesses: p.terminate() del p del self.subprocesses[:] # Ensure any forked processes are cleaned up for pid in self.forkedProcessPids: if os.path.exists("/proc/" + str(pid)): os.kill(pid, signal.SIGTERM)

Hide Details

Hide Details

Executing tearDown hook: def shutdown_socket(): if sock: try: # send the kill packet so lldb-server shuts down gracefully sock.sendall(GdbRemoteTestCaseBase._GDBREMOTE_KILL_PACKET) except: logger.warning( "failed to send kill packet to debug monitor: {}; ignoring".format( sys.exc_info()[0]))

Hide Details

try: sock.close() except: logger.warning( "failed to close socket to debug monitor: {}; ignoring".format( sys.exc_info()[0]))

Hide Details

Hide Details

Executing tearDown hook: def shutdown_debug_monitor(): try: server.terminate() except: logger.warning( "failed to terminate server for debug monitor: {}; ignoring".format( sys.exc_info()[0]))

Hide Details

Hide Details

Executing tearDown hook: def cleanupSubprocesses(self): # Ensure any subprocesses are cleaned up for p in self.subprocesses: p.terminate() del p del self.subprocesses[:] # Ensure any forked processes are cleaned up for pid in self.forkedProcessPids: if os.path.exists("/proc/" + str(pid)): os.kill(pid, signal.SIGTERM)

Hide Details

Hide Details

Executing tearDown hook: def shutdown_named_pipe(): # Close the pipe. try: named_pipe.close() except: print("failed to close named pipe") None

Hide Details

# Delete the pipe. try: os.remove(named_pipe_path) except: print("failed to delete named pipe: {}".format(named_pipe_path)) None

Hide Details

# Delete the temp directory. try: os.rmdir(temp_dir) except: print( "failed to delete temp dir: {}, directory contents: '{}'".format( temp_dir, os.listdir(temp_dir))) None

Hide Details

Hide Details

runCmd: settings set symbols.enable-external-lookup false output:

Hide Details

runCmd: settings set plugin.process.gdb-remote.packet-timeout 60 output:

Hide Details

runCmd: settings set symbols.clang-modules-cache-path "/Users/buildslave/jenkins/workspace/lldb-cmake-sanitized/lldb-build/tools/lldb/lldb-test-build.noindex/module-cache-lldb/lldb-api" output:

Hide Details

runCmd: settings set use-color false output:

Hide Details

UNSUPPORTED: LLDB (/Users/buildslave/jenkins/workspace/lldb-cmake-sanitized/host-compiler/bin/clang-10-x86_64) :: test_g_returns_correct_data_no_suffix_llgs (TestGdbRemoteGPacket.TestGdbRemoteGPacket) (llgs tests) runCmd: settings set symbols.enable-external-lookup false output:

Hide Details

runCmd: settings set plugin.process.gdb-remote.packet-timeout 60 output:

Hide Details

runCmd: settings set symbols.clang-modules-cache-path "/Users/buildslave/jenkins/workspace/lldb-cmake-sanitized/lldb-build/tools/lldb/lldb-test-build.noindex/module-cache-lldb/lldb-api" output:

Hide Details

runCmd: settings set use-color false output:

Hide Details

UNSUPPORTED: LLDB (/Users/buildslave/jenkins/workspace/lldb-cmake-sanitized/host-compiler/bin/clang-10-x86_64) :: test_g_returns_correct_data_with_suffix_llgs (TestGdbRemoteGPacket.TestGdbRemoteGPacket) (llgs tests) Restore dir to: /Users/buildslave/jenkins/workspace/lldb-cmake-sanitized/lldb-build/tools/lldb/test ====================================================================== FAIL: test_g_packet_debugserver (TestGdbRemoteGPacket.TestGdbRemoteGPacket) ---------------------------------------------------------------------- Traceback (most recent call last): File "/Users/buildslave/jenkins/workspace/lldb-cmake-sanitized/llvm-project/lldb/packages/Python/lldbsuite/test/decorators.py", line 141, in wrapper func(*args, **kwargs) File "/Users/buildslave/jenkins/workspace/lldb-cmake-sanitized/llvm-project/lldb/packages/Python/lldbsuite/test/decorators.py", line 141, in wrapper func(*args, **kwargs) File "/Users/buildslave/jenkins/workspace/lldb-cmake-sanitized/llvm-project/lldb/packages/Python/lldbsuite/test/tools/lldb-server/register-reading/TestGdbRemoteGPacket.py", line 59, in test_g_packet_debugserver self.run_test_g_packet() File "/Users/buildslave/jenkins/workspace/lldb-cmake-sanitized/llvm-project/lldb/packages/Python/lldbsuite/test/tools/lldb-server/register-reading/TestGdbRemoteGPacket.py", line 41, in run_test_g_packet self.connect_to_debug_monitor() File "/Users/buildslave/jenkins/workspace/lldb-cmake-sanitized/llvm-project/lldb/packages/Python/lldbsuite/test/tools/lldb-server/gdbremote_testcase.py", line 417, in connect_to_debug_monitor server = self.launch_debug_monitor(attach_pid=attach_pid) File "/Users/buildslave/jenkins/workspace/lldb-cmake-sanitized/llvm-project/lldb/packages/Python/lldbsuite/test/tools/lldb-server/gdbremote_testcase.py", line 410, in launch_debug_monitor self.port = self.get_stub_port_from_named_socket(self._READ_TIMEOUT) File "/Users/buildslave/jenkins/workspace/lldb-cmake-sanitized/llvm-project/lldb/packages/Python/lldbsuite/test/tools/lldb-server/gdbremote_testcase.py", line 224, in get_stub_port_from_named_socket "no content to read on pipe") AssertionError: 0 == 0 : no content to read on pipe Config=x86_64-/Users/buildslave/jenkins/workspace/lldb-cmake-sanitized/host-compiler/bin/clang-10 ---------------------------------------------------------------------- Ran 3 tests in 8.695s

Hide Details

RESULT: FAILED (0 passes, 1 failures, 0 errors, 2 skipped, 0 expected failures, 0 unexpected successes)

Hide Details

******************** PASS: lldb-unit :: debugserver/./debugserverTests/RNBSocket.AnyListen (1121 of 1785) UNSUPPORTED: lldb-api :: functionalities/unwind/standard/TestStandardUnwind.py (1122 of 1785) PASS: lldb-unit :: tools/lldb-server/tests/./LLDBServerTests/TestBase.LaunchModePreservesEnvironment (1123 of 1785) PASS: lldb-api :: commands/frame/var-scope/TestFrameVariableScope.py (1124 of 1785) UNSUPPORTED: lldb-shell :: SymbolFile/PDB/function-level-linking.test (1125 of 1785) XFAIL: lldb-shell :: Register/x86-64-write.test (1126 of 1785) PASS: lldb-unit :: Expression/./ExpressionTests/DiagnosticManagerTest.GetStringMultiline (1127 of 1785) PASS: lldb-unit :: Host/./HostTests/ConnectionFileDescriptorTest.TCPGetURIv4 (1128 of 1785) PASS: lldb-api :: functionalities/data-formatter/data-formatter-smart-array/TestDataFormatterSmartArray.py (1129 of 1785) PASS: lldb-api :: functionalities/data-formatter/data-formatter-skip-summary/TestDataFormatterSkipSummary.py (1130 of 1785) PASS: lldb-api :: functionalities/type_completion/TestTypeCompletion.py (1131 of 1785) PASS: lldb-unit :: Utility/./UtilityTests/RangeTest.Slide (1132 of 1785) PASS: lldb-unit :: SymbolFile/DWARF/./SymbolFileDWARFTests/SymbolFileDWARFTests.TestAbbrevInvalidNULLTag (1133 of 1785) PASS: lldb-api :: commands/apropos/with-process/TestAproposWithProcess.py (1134 of 1785) PASS: lldb-unit :: Utility/./UtilityTests/StreamTest.PutPtr (1135 of 1785) PASS: lldb-unit :: Utility/./UtilityTests/ArchSpecTest.MergeFromMachOUnknown (1136 of 1785) PASS: lldb-api :: functionalities/breakpoint/serialize/TestBreakpointSerialization.py (1137 of 1785) PASS: lldb-shell :: Quit/TestQuitExitCodeImplicit0.test (1138 of 1785) PASS: lldb-api :: functionalities/process_group/TestChangeProcessGroup.py (1139 of 1785) PASS: lldb-unit :: Utility/./UtilityTests/StringExtractorTest.GetHexBytes_FullString (1140 of 1785) PASS: lldb-api :: macosx/find-dsym/deep-bundle/TestDeepBundle.py (1141 of 1785) PASS: lldb-api :: iohandler/completion/TestIOHandlerCompletion.py (1142 of 1785) PASS: lldb-api :: lang/cpp/enum_types/TestCPP11EnumTypes.py (1143 of 1785) PASS: lldb-api :: functionalities/breakpoint/auto_continue/TestBreakpointAutoContinue.py (1144 of 1785) PASS: lldb-shell :: SymbolFile/Breakpad/line-table-discontinuous-file-ids.test (1145 of 1785) PASS: lldb-shell :: Minidump/breakpad-symbols.test (1146 of 1785) PASS: lldb-unit :: UnwindAssembly/x86/./UnwindAssemblyx86Tests/Testx86AssemblyInspectionEngine.TestPushEBP (1147 of 1785) PASS: lldb-api :: commands/expression/import_builtin_fileid/TestImportBuiltinFileID.py (1148 of 1785) PASS: lldb-unit :: Utility/./UtilityTests/StringListTest.AppendStringStdString (1149 of 1785) PASS: lldb-shell :: Quit/TestQuitExitCode30.test (1150 of 1785) PASS: lldb-api :: functionalities/tail_call_frames/unambiguous_sequence/TestUnambiguousTailCalls.py (1151 of 1785) PASS: lldb-unit :: Utility/./UtilityTests/SerializationRountripTest.SerializeDeserializePodPointers (1152 of 1785) PASS: lldb-unit :: Utility/./UtilityTests/ReproducerTest.SetCapture (1153 of 1785) PASS: lldb-api :: commands/command/script/import/rdar-12586188/TestRdar12586188.py (1154 of 1785) PASS: lldb-api :: functionalities/thread/concurrent_events/TestConcurrentCrashWithWatchpoint.py (1155 of 1785) PASS: lldb-api :: functionalities/data-formatter/data-formatter-objc/TestDataFormatterObjCNSDate.py (1156 of 1785) PASS: lldb-api :: functionalities/thread/concurrent_events/TestConcurrentDelaySignalBreak.py (1157 of 1785) PASS: lldb-unit :: Core/./LLDBCoreTests/RichManglingContextTest.Basic (1158 of 1785) PASS: lldb-unit :: Host/./HostTests/NativeProcessProtocolTest.SetBreakpointFailVerify (1159 of 1785) PASS: lldb-shell :: Breakpoint/split-dwarf-5-addrbase.test (1160 of 1785) PASS: lldb-unit :: Utility/./UtilityTests/ReproducerTest.SetReplay (1161 of 1785) PASS: lldb-api :: functionalities/stats_api/TestStatisticsAPI.py (1162 of 1785) PASS: lldb-unit :: Utility/./UtilityTests/UriParserTest.SchemeHostSeparator (1163 of 1785) PASS: lldb-shell :: Settings/TestFrameFormatNoColor.test (1164 of 1785) PASS: lldb-api :: python_api/sbstructureddata/TestStructuredDataAPI.py (1165 of 1785) PASS: lldb-api :: macosx/universal/TestUniversal.py (1166 of 1785) PASS: lldb-api :: lang/objc/self/TestObjCSelf.py (1167 of 1785) UNSUPPORTED: lldb-shell :: SymbolFile/PDB/function-nested-block.test (1168 of 1785) PASS: lldb-unit :: Host/./HostTests/MainLoopTest.DetectsEOF (1169 of 1785) PASS: lldb-api :: functionalities/thread/concurrent_events/TestConcurrentWatchpointWithDelayWatchpointThreads.py (1170 of 1785) PASS: lldb-shell :: SymbolFile/Breakpad/line-table-mixed-path-styles.test (1171 of 1785) UNSUPPORTED: lldb-api :: benchmarks/stepping/TestSteppingSpeed.py (1172 of 1785) PASS: lldb-shell :: ObjectFile/PECOFF/subsections.yaml (1173 of 1785) PASS: lldb-api :: macosx/find-app-in-bundle/TestFindAppInBundle.py (1174 of 1785) UNSUPPORTED: lldb-api :: functionalities/darwin_log/filter/regex/subsystem/TestDarwinLogFilterRegexSubsystem.py (1175 of 1785) UNSUPPORTED: lldb-api :: functionalities/darwin_log/format/TestDarwinLogMessageFormat.py (1176 of 1785) PASS: lldb-unit :: Symbol/./SymbolTests/PostfixExpression.ToDWARF (1177 of 1785) PASS: lldb-shell :: SymbolFile/NativePDB/function-types-builtins.cpp (1178 of 1785) UNSUPPORTED: lldb-api :: functionalities/data-formatter/data-formatter-stl/libstdcpp/smart_ptr/TestDataFormatterStdSmartPtr.py (1179 of 1785) PASS: lldb-api :: functionalities/tail_call_frames/disambiguate_paths_to_common_sink/TestDisambiguatePathsToCommonSink.py (1180 of 1785) PASS: lldb-unit :: Utility/./UtilityTests/LogChannelEnabledTest.LLDB_LOG_ERROR (1181 of 1785) PASS: lldb-api :: functionalities/breakpoint/breakpoint_conditions/TestBreakpointConditions.py (1182 of 1785) PASS: lldb-unit :: Expression/./ExpressionTests/CppModuleConfigurationTest.Xcode (1183 of 1785) PASS: lldb-api :: commands/expression/persistent_types/TestPersistentTypes.py (1184 of 1785) PASS: lldb-api :: commands/expression/char/TestExprsChar.py (1185 of 1785) PASS: lldb-api :: types/TestIntegerTypes.py (1186 of 1785) PASS: lldb-api :: lang/objc/foundation/TestObjCMethods.py (1187 of 1785) PASS: lldb-shell :: Reproducer/TestFileRepro.test (1188 of 1785) PASS: lldb-unit :: Utility/./UtilityTests/ScalarTest.GetBytes (1189 of 1785) PASS: lldb-api :: functionalities/data-formatter/data-formatter-objc/nsstring/TestDataFormatterNSString.py (1190 of 1785) PASS: lldb-unit :: Utility/./UtilityTests/ConstStringTest.CompareConstString (1191 of 1785) PASS: lldb-unit :: Utility/./UtilityTests/ProcessInstanceInfo.DumpTable (1192 of 1785) PASS: lldb-api :: lang/cpp/const_this/TestConstThis.py (1193 of 1785) PASS: lldb-api :: lang/objc/foundation/TestObjCMethodsNSError.py (1194 of 1785) PASS: lldb-unit :: Language/CPlusPlus/./LanguageCPlusPlusTests/CPlusPlusLanguage.CPlusPlusNameParser (1195 of 1785) PASS: lldb-unit :: ScriptInterpreter/Python/./ScriptInterpreterPythonTests/PythonDataObjectsTest.TestPythonIntegerToStructuredInteger (1196 of 1785) PASS: lldb-api :: commands/expression/timeout/TestCallWithTimeout.py (1197 of 1785) PASS: lldb-unit :: Utility/./UtilityTests/OptionsWithRawTest.SingleWhitespaceInput (1198 of 1785) PASS: lldb-shell :: ObjectFile/ELF/PT_LOAD-overlap-section.yaml (1199 of 1785) PASS: lldb-unit :: Utility/./UtilityTests/DataExtractorTest.GetCStrEmpty (1200 of 1785) PASS: lldb-unit :: Process/minidump/./LLDBMinidumpTests/MinidumpParserTest.GetPidWindows (1201 of 1785) PASS: lldb-api :: lang/c/local_variables/TestLocalVariables.py (1202 of 1785) PASS: lldb-unit :: Utility/./UtilityTests/StringListTest.GetMaxStringLengthIncreasingSize (1203 of 1785) PASS: lldb-unit :: Utility/./UtilityTests/RangeTest.ContainsAddr (1204 of 1785) PASS: lldb-unit :: Utility/./UtilityTests/StreamTeeTest.GetStreamAtIndexOutOfBoundsEmpty (1205 of 1785) PASS: lldb-api :: commands/expression/import-std-module/list-basic/TestBasicList.py (1206 of 1785) PASS: lldb-api :: commands/watchpoints/watchpoint_events/TestWatchpointEvents.py (1207 of 1785) PASS: lldb-api :: functionalities/multiword-commands/TestMultiWordCommands.py (1208 of 1785) PASS: lldb-api :: functionalities/data-formatter/data-formatter-objc/TestDataFormatterObjCNSError.py (1209 of 1785) PASS: lldb-shell :: SymbolFile/DWARF/find-variable-dwo.cpp (1210 of 1785) PASS: lldb-shell :: ObjectFile/ELF/PT_TLS-overlap-PT_LOAD.yaml (1211 of 1785) PASS: lldb-shell :: SymbolFile/DWARF/split-dwarf-multiple-cu.ll (1212 of 1785) PASS: lldb-api :: functionalities/breakpoint/objc/TestObjCBreakpoints.py (1213 of 1785) PASS: lldb-unit :: Utility/./UtilityTests/LogChannelTest.List (1214 of 1785) PASS: lldb-api :: functionalities/data-formatter/data-formatter-objc/TestDataFormatterObjNSException.py (1215 of 1785) PASS: lldb-shell :: SymbolFile/DWARF/debug-types-line-tables.s (1216 of 1785) PASS: lldb-unit :: Process/minidump/./LLDBMinidumpTests/MinidumpParserTest.GetMemoryRegionInfo (1217 of 1785) PASS: lldb-unit :: Utility/./UtilityTests/CompletionRequest.TryCompleteCurrentArgMode (1218 of 1785) PASS: lldb-api :: types/TestFloatTypesExpr.py (1219 of 1785) UNSUPPORTED: lldb-api :: linux/add-symbols/TestTargetSymbolsAddCommand.py (1220 of 1785) PASS: lldb-unit :: Utility/./UtilityTests/RangeTest.Clear (1221 of 1785) PASS: lldb-api :: linux/builtin_trap/TestBuiltinTrap.py (1222 of 1785) PASS: lldb-api :: lang/objc/objc-ivar-offsets/TestObjCIvarOffsets.py (1223 of 1785) UNSUPPORTED: lldb-api :: macosx/macabi/TestMacABImacOSFramework.py (1224 of 1785) PASS: lldb-api :: python_api/value/TestValueAPI.py (1225 of 1785) PASS: lldb-unit :: Utility/./UtilityTests/OptionsWithRawTest.ArgsButNoDelimiter (1226 of 1785) PASS: lldb-unit :: ScriptInterpreter/Python/./ScriptInterpreterPythonTests/PythonDataObjectsTest.TestPythonTupleInitializerList (1227 of 1785) PASS: lldb-unit :: Utility/./UtilityTests/GeneratorTest.GetOrCreate (1228 of 1785) PASS: lldb-api :: functionalities/tail_call_frames/inlining_and_tail_calls/TestInliningAndTailCalls.py (1229 of 1785) PASS: lldb-shell :: Driver/TestConvenienceVariables.test (1230 of 1785) UNSUPPORTED: lldb-api :: functionalities/data-formatter/data-formatter-stl/libstdcpp/string/TestDataFormatterStdString.py (1231 of 1785) PASS: lldb-unit :: Utility/./UtilityTests/ScalarTest.Scalar_512 (1232 of 1785) PASS: lldb-unit :: Utility/./UtilityTests/UriParserTest.BadPort2 (1233 of 1785) PASS: lldb-unit :: Utility/./UtilityTests/StreamTest.PutRawBytesToMixedEndian (1234 of 1785) PASS: lldb-api :: functionalities/data-formatter/data-formatter-categories/TestDataFormatterCategories.py (1235 of 1785) PASS: lldb-api :: lang/cpp/breakpoint-commands/TestCPPBreakpointCommands.py (1236 of 1785) PASS: lldb-api :: macosx/find-dsym/bundle-with-dot-in-filename/TestBundleWithDotInFilename.py (1237 of 1785) PASS: lldb-unit :: UnwindAssembly/x86/./UnwindAssemblyx86Tests/Testx86AssemblyInspectionEngine.TestSubRSP (1238 of 1785) PASS: lldb-api :: commands/target/create-no-such-arch/TestNoSuchArch.py (1239 of 1785) PASS: lldb-unit :: Utility/./UtilityTests/ScalarTest.Comparison (1240 of 1785) PASS: lldb-api :: commands/expression/call-overridden-method/TestCallOverriddenMethod.py (1241 of 1785) PASS: lldb-api :: commands/command/nested_alias/TestNestedAlias.py (1242 of 1785) PASS: lldb-api :: lang/objc/objc-new-syntax/TestObjCNewSyntaxArray.py (1243 of 1785) PASS: lldb-unit :: Process/gdb-remote/./ProcessGdbRemoteTests/GDBRemoteCommunicationClientTest.SyncThreadState (1244 of 1785) PASS: lldb-unit :: ObjectFile/ELF/./ObjectFileELFTests/ObjectFileELFTest.GetSymtab_NoSymEntryPointArmAddressClass (1245 of 1785) PASS: lldb-unit :: Utility/./UtilityTests/VMRange.ContainsRange (1246 of 1785) PASS: lldb-api :: macosx/lc-note/kern-ver-str/TestKernVerStrLCNOTE.py (1247 of 1785) PASS: lldb-api :: lang/objc/objc-ivar-stripped/TestObjCIvarStripped.py (1248 of 1785) PASS: lldb-api :: api/multiple-targets/TestMultipleTargets.py (1249 of 1785) PASS: lldb-shell :: ObjectFile/MachO/lc_build_version.yaml (1250 of 1785) PASS: lldb-shell :: SymbolFile/NativePDB/disassembly.cpp (1251 of 1785) UNSUPPORTED: lldb-shell :: BuildScript/toolchain-clang-cl.test (1252 of 1785) PASS: lldb-shell :: ObjectFile/ELF/compressed-sections.yaml (1253 of 1785) PASS: lldb-api :: types/TestIntegerTypesExpr.py (1254 of 1785) UNSUPPORTED: lldb-api :: benchmarks/startup/TestStartupDelays.py (1255 of 1785) PASS: lldb-unit :: Utility/./UtilityTests/StateTest.Formatv (1256 of 1785) PASS: lldb-shell :: SymbolFile/Breakpad/symtab.test (1257 of 1785) PASS: lldb-api :: functionalities/thread/concurrent_events/TestConcurrentDelayedCrashWithBreakpointWatchpoint.py (1258 of 1785) PASS: lldb-unit :: Utility/./UtilityTests/RangeTest.EqualInvalid (1259 of 1785) PASS: lldb-shell :: Breakpoint/debug_rnglistx_rlex.test (1260 of 1785) PASS: lldb-api :: functionalities/data-formatter/data-formatter-stl/libcxx/bitset/TestDataFormatterLibcxxBitset.py (1261 of 1785) PASS: lldb-shell :: SymbolFile/NativePDB/break-by-function.cpp (1262 of 1785) PASS: lldb-api :: commands/expression/persistent_ptr_update/TestPersistentPtrUpdate.py (1263 of 1785) PASS: lldb-unit :: Utility/./UtilityTests/LogTest.LLDB_LOG_nullptr (1264 of 1785) PASS: lldb-api :: commands/process/attach/TestProcessAttach.py (1265 of 1785) PASS: lldb-api :: lang/cpp/function_refs/TestFunctionRefs.py (1266 of 1785) PASS: lldb-unit :: Host/./HostTests/TaskPoolTest.AddTask (1267 of 1785) PASS: lldb-api :: commands/expression/rdar42038760/TestScalarURem.py (1268 of 1785) PASS: lldb-unit :: ObjectFile/ELF/./ObjectFileELFTests/ObjectFileELFTest.GetSymtab_NoSymEntryPointArmThumbAddressClass (1269 of 1785) PASS: lldb-unit :: Symbol/./SymbolTests/DWARFCallFrameInfoTest.Basic_eh (1270 of 1785) PASS: lldb-shell :: ObjectFile/ELF/short-build-id.yaml (1271 of 1785) PASS: lldb-unit :: ScriptInterpreter/Python/./ScriptInterpreterPythonTests/PythonDataObjectsTest.TestPythonCallableInvoke (1272 of 1785) UNSUPPORTED: lldb-shell :: Register/x86-64-xmm16-write.test (1273 of 1785) UNSUPPORTED: lldb-api :: tools/lldb-vscode/breakpoint/TestVSCode_setExceptionBreakpoints.py (1274 of 1785) PASS: lldb-unit :: Utility/./UtilityTests/LogTest.Unregister (1275 of 1785) PASS: lldb-unit :: SymbolFile/NativePDB/./SymbolFileNativePDBTests/PDBFPOProgramToDWARFExpressionTests.UnsupportedRASearch (1276 of 1785) PASS: lldb-shell :: SymbolFile/NativePDB/nested-types.cpp (1277 of 1785) PASS: lldb-api :: commands/expression/save_jit_objects/TestSaveJITObjects.py (1278 of 1785) UNSUPPORTED: lldb-api :: commands/expression/completion-crash2/TestCompletionCrash2.py (1279 of 1785) PASS: lldb-unit :: UnwindAssembly/x86/./UnwindAssemblyx86Tests/Testx86AssemblyInspectionEngine.Test64bitFramelessBigStackFrame (1280 of 1785) PASS: lldb-unit :: Process/gdb-remote/./ProcessGdbRemoteTests/GDBRemoteClientBaseTest.SendContinueAndInterrupt (1281 of 1785) PASS: lldb-shell :: Driver/TestTarget.test (1282 of 1785) PASS: lldb-shell :: Register/x86-64-ymm-read.test (1283 of 1785) UNSUPPORTED: lldb-api :: tools/lldb-vscode/attach/TestVSCode_attach.py (1284 of 1785) PASS: lldb-unit :: Utility/./UtilityTests/StreamTeeTest.CopyConstructor (1285 of 1785) PASS: lldb-api :: python_api/value/empty_class/TestValueAPIEmptyClass.py (1286 of 1785) PASS: lldb-api :: commands/expression/import-std-module/deque-basic/TestBasicDeque.py (1287 of 1785) PASS: lldb-unit :: Utility/./UtilityTests/StringExtractorTest.GetU32BigEndian (1288 of 1785) PASS: lldb-unit :: Host/./HostTests/Host.WaitStatusFormat (1289 of 1785) PASS: lldb-api :: commands/process/attach/attach_denied/TestAttachDenied.py (1290 of 1785) PASS: lldb-api :: functionalities/mtc/simple/TestMTCSimple.py (1291 of 1785) PASS: lldb-unit :: Process/gdb-remote/./ProcessGdbRemoteTests/GDBRemoteCommunicationClientTest.SendGetTraceConfigPacket (1292 of 1785) UNSUPPORTED: lldb-api :: functionalities/darwin_log/basic/TestDarwinLogBasic.py (1293 of 1785) PASS: lldb-unit :: Expression/./ExpressionTests/DiagnosticManagerTest.GetStringMultipleDiags (1294 of 1785) PASS: lldb-api :: lang/objc/objc++/TestObjCXX.py (1295 of 1785) UNSUPPORTED: lldb-shell :: SymbolFile/dissassemble-entry-point.s (1296 of 1785) PASS: lldb-unit :: ScriptInterpreter/Python/./ScriptInterpreterPythonTests/PythonDataObjectsTest.TestModuleNameResolutionNoDot (1297 of 1785) PASS: lldb-api :: functionalities/tail_call_frames/disambiguate_tail_call_seq/TestDisambiguateTailCallSeq.py (1298 of 1785) UNSUPPORTED: lldb-shell :: SymbolFile/DWARF/debug-types-expressions.test (1299 of 1785) PASS: lldb-api :: lang/c/tls_globals/TestTlsGlobals.py (1300 of 1785) PASS: lldb-unit :: Utility/./UtilityTests/StreamTest.PutBytesAsRawHex8ToMixedEndian (1301 of 1785) PASS: lldb-unit :: Utility/./UtilityTests/ArgsTest.StringListConstructor (1302 of 1785) PASS: lldb-unit :: Core/./LLDBCoreTests/StreamCallbackTest.Callback (1303 of 1785) PASS: lldb-api :: functionalities/data-formatter/data-formatter-stl/libcxx/multiset/TestDataFormatterLibcxxMultiSet.py (1304 of 1785) PASS: lldb-unit :: Utility/./UtilityTests/ArchSpecTest.TestSetTriple (1305 of 1785) PASS: lldb-unit :: UnwindAssembly/x86/./UnwindAssemblyx86Tests/Testx86AssemblyInspectionEngine.TestStackRealign32BitDisp_x86_64 (1306 of 1785) FAIL: lldb-unit :: Utility/./UtilityTests/TimerTest.CategoryTimes2 (1307 of 1785) ******************** TEST 'lldb-unit :: Utility/./UtilityTests/TimerTest.CategoryTimes2' FAILED ******************** Note: Google Test filter = TimerTest.CategoryTimes2 [==========] Running 1 test from 1 test case. [----------] Global test environment set-up. [----------] 1 test from TimerTest [ RUN ] TimerTest.CategoryTimes2 /Users/buildslave/jenkins/workspace/lldb-cmake-sanitized/llvm-project/lldb/unittests/Utility/TimerTest.cpp:72: Failure Expected: (0.1) > (seconds2), actual: 1.000000e-01 vs 1.260661e-01 [ FAILED ] TimerTest.CategoryTimes2 (266 ms) [----------] 1 test from TimerTest (266 ms total)

Hide Details

[----------] Global test environment tear-down [==========] 1 test from 1 test case ran. (266 ms total) [ PASSED ] 0 tests. [ FAILED ] 1 test, listed below: [ FAILED ] TimerTest.CategoryTimes2

Hide Details

1 FAILED TEST

Hide Details

******************** UNSUPPORTED: lldb-shell :: SymbolFile/PDB/type-quals.test (1308 of 1785) PASS: lldb-unit :: UnwindAssembly/x86/./UnwindAssemblyx86Tests/Testx86AssemblyInspectionEngine.Test32BitOnlyInstruction (1309 of 1785) PASS: lldb-unit :: Utility/./UtilityTests/StringLexerTest.AdvanceIf (1310 of 1785) PASS: lldb-api :: python_api/default-constructor/TestDefaultConstructorForAPIObjects.py (1311 of 1785) PASS: lldb-shell :: SymbolFile/DWARF/debug-types-signature-loop.s (1312 of 1785) PASS: lldb-unit :: Process/gdb-remote/./ProcessGdbRemoteTests/GDBRemoteCommunicationClientTest.SendStopTracePacket (1313 of 1785) PASS: lldb-api :: functionalities/thread/concurrent_events/TestConcurrentTwoWatchpointsOneSignal.py (1314 of 1785) PASS: lldb-api :: functionalities/abbreviation/TestAbbreviations.py (1315 of 1785) PASS: lldb-api :: lang/cpp/class_static/TestStaticVariables.py (1316 of 1785) PASS: lldb-unit :: Host/./HostTests/TaskPoolTest.RunTasks (1317 of 1785) PASS: lldb-unit :: Utility/./UtilityTests/SerializationRountripTest.SerializeDeserializeObjectReference (1318 of 1785) PASS: lldb-shell :: ObjectFile/ELF/minidebuginfo-corrupt-xz.yaml (1319 of 1785) PASS: lldb-unit :: Utility/./UtilityTests/StatusTest.Formatv (1320 of 1785) PASS: lldb-unit :: Utility/./UtilityTests/RangeTest.Equal (1321 of 1785) PASS: lldb-api :: lang/c/vla/TestVLA.py (1322 of 1785) PASS: lldb-api :: lang/c/function_types/TestFunctionTypes.py (1323 of 1785) PASS: lldb-unit :: Utility/./UtilityTests/RangeTest.ContainsEndInclusiveInvalid (1324 of 1785) PASS: lldb-unit :: Utility/./UtilityTests/ConstStringTest.NullAndEmptyStates (1325 of 1785) PASS: lldb-api :: functionalities/gdb_remote_client/TestWriteMemory.py (1326 of 1785) PASS: lldb-unit :: Expression/./ExpressionTests/DiagnosticManagerTest.GetStringPreserveOrder (1327 of 1785) PASS: lldb-shell :: ObjectFile/PECOFF/uuid.yaml (1328 of 1785) PASS: lldb-shell :: Unwind/trap_frame_sym_ctx.test (1329 of 1785) PASS: lldb-unit :: Interpreter/./InterpreterTests/OptionArgParserTest.toBoolean (1330 of 1785) PASS: lldb-shell :: Host/TestCustomShell.test (1331 of 1785) PASS: lldb-api :: commands/command/delete/TestCommandDelete.py (1332 of 1785) PASS: lldb-unit :: Utility/./UtilityTests/RangeTest.ContainsRangeStartingFromZero (1333 of 1785) PASS: lldb-api :: commands/expression/po_verbosity/TestPoVerbosity.py (1334 of 1785) PASS: lldb-unit :: Utility/./UtilityTests/BinaryStreamTest.PutULEB128Zero (1335 of 1785) PASS: lldb-unit :: Utility/./UtilityTests/LogChannelTest.Disable (1336 of 1785) PASS: lldb-shell :: SymbolFile/DWARF/debug_aranges-empty-section.s (1337 of 1785) PASS: lldb-unit :: Utility/./UtilityTests/OptionsWithRawTest.WhitespaceSuffix (1338 of 1785) PASS: lldb-shell :: ObjectFile/ELF/section-types.yaml (1339 of 1785) PASS: lldb-unit :: Utility/./UtilityTests/ArgsTest.TestMultipleArgs (1340 of 1785) PASS: lldb-api :: python_api/sblaunchinfo/TestSBLaunchInfo.py (1341 of 1785) UNSUPPORTED: lldb-api :: benchmarks/expression/TestExpressionCmd.py (1342 of 1785) PASS: lldb-api :: functionalities/breakpoint/consecutive_breakpoints/TestConsecutiveBreakpoints.py (1343 of 1785) PASS: lldb-unit :: UnwindAssembly/x86/./UnwindAssemblyx86Tests/Testx86AssemblyInspectionEngine.TestStackRealignMSVC_i386 (1344 of 1785) PASS: lldb-api :: python_api/lldbutil/iter/TestLLDBIterator.py (1345 of 1785) PASS: lldb-api :: functionalities/data-formatter/nsdictionarysynth/TestNSDictionarySynthetic.py (1346 of 1785) PASS: lldb-unit :: UnwindAssembly/x86/./UnwindAssemblyx86Tests/Testx86AssemblyInspectionEngine.TestPopRBPWithREX (1347 of 1785) PASS: lldb-api :: python_api/symbol-context/two-files/TestSymbolContextTwoFiles.py (1348 of 1785) PASS: lldb-unit :: Expression/./ExpressionTests/ClangHostTest.MacOSX (1349 of 1785) PASS: lldb-unit :: ObjectFile/ELF/./ObjectFileELFTests/ObjectFileELFTest.SectionsResolveConsistently (1350 of 1785) PASS: lldb-api :: lang/cpp/thread_local/TestThreadLocal.py (1351 of 1785) PASS: lldb-unit :: Process/gdb-remote/./ProcessGdbRemoteTests/GDBRemoteCommunicationClientTest.ReadRegister (1352 of 1785) PASS: lldb-shell :: SymbolFile/DWARF/find-basic-namespace.cpp (1353 of 1785) PASS: lldb-api :: python_api/breakpoint/TestBreakpointAPI.py (1354 of 1785) PASS: lldb-api :: lang/objc/objc-runtime-ivars/TestRuntimeIvars.py (1355 of 1785) UNSUPPORTED: lldb-api :: functionalities/tty/TestTerminal.py (1356 of 1785) PASS: lldb-unit :: Utility/./UtilityTests/VASprintfTest.NoBufferResize (1357 of 1785) PASS: lldb-shell :: SymbolFile/DWARF/dwarf5_locations.s (1358 of 1785) PASS: lldb-unit :: Utility/./UtilityTests/UriParserTest.BracketedHostnameWithColon (1359 of 1785) PASS: lldb-unit :: SymbolFile/NativePDB/./SymbolFileNativePDBTests/PDBFPOProgramToDWARFExpressionTests.MultipleIndependentAssignments (1360 of 1785) PASS: lldb-unit :: Language/Highlighting/./HighlighterTests/HighlighterTest.HighlighterSelectionPath (1361 of 1785) PASS: lldb-unit :: tools/lldb-server/tests/./LLDBServerTests/StandardStartupTest.TestStopReplyContainsThreadPcs (1362 of 1785) PASS: lldb-unit :: Utility/./UtilityTests/CompletionRequest.DuplicateFilteringWithComments (1363 of 1785) UNSUPPORTED: lldb-api :: functionalities/data-formatter/data-formatter-stl/libstdcpp/tuple/TestDataFormatterStdTuple.py (1364 of 1785) PASS: lldb-unit :: Host/./HostTests/NativeProcessProtocolTest.ReadCStringFromMemory_CrossPageBoundary (1365 of 1785) PASS: lldb-unit :: Utility/./UtilityTests/RegularExpression.CopyAssignment (1366 of 1785) PASS: lldb-api :: functionalities/data-formatter/data-formatter-stl/libcxx/variant/TestDataFormatterLibcxxVariant.py (1367 of 1785) PASS: lldb-shell :: SymbolFile/DWARF/find-method.cpp (1368 of 1785) UNSUPPORTED: lldb-api :: functionalities/thread/create_during_step/TestCreateDuringStep.py (1369 of 1785) PASS: lldb-unit :: Utility/./UtilityTests/ArchSpecTest.Compatibility (1370 of 1785) PASS: lldb-api :: functionalities/data-formatter/typedef_array/TestTypedefArray.py (1371 of 1785) PASS: lldb-api :: lang/objc/objc-checker/TestObjCCheckers.py (1372 of 1785) PASS: lldb-api :: lang/objc/global_ptrs/TestGlobalObjects.py (1373 of 1785) PASS: lldb-unit :: Utility/./UtilityTests/NameMatchesTest.Ignore (1374 of 1785) PASS: lldb-api :: functionalities/data-formatter/ptr_ref_typedef/TestPtrRef2Typedef.py (1375 of 1785) PASS: lldb-api :: lang/cpp/dynamic-value/TestCppValueCast.py (1376 of 1785) PASS: lldb-unit :: Utility/./UtilityTests/LogChannelEnabledTest.LogVerboseThread (1377 of 1785) PASS: lldb-unit :: Utility/./UtilityTests/StringExtractorTest.GetHexBytes_OddPair (1378 of 1785) PASS: lldb-unit :: Utility/./UtilityTests/OptionsWithRawTest.WhitespaceInput (1379 of 1785) PASS: lldb-unit :: Utility/./UtilityTests/StringExtractorTest.GetNameColonValueNoColon (1380 of 1785) PASS: lldb-unit :: Utility/./UtilityTests/StringListTest.CopyListEmpty (1381 of 1785) PASS: lldb-unit :: Utility/./UtilityTests/StreamTeeTest.Assignment (1382 of 1785) PASS: lldb-unit :: Utility/./UtilityTests/ConstStringTest.UpdateMangledCounterpart (1383 of 1785) PASS: lldb-unit :: ScriptInterpreter/Python/./ScriptInterpreterPythonTests/PythonDataObjectsTest.TestPythonTupleSize (1384 of 1785) PASS: lldb-unit :: ScriptInterpreter/Python/./ScriptInterpreterPythonTests/PythonExceptionStateTest.TestAutoRestoreChanged (1385 of 1785) PASS: lldb-api :: lang/cpp/wchar_t/TestCxxWCharT.py (1386 of 1785) UNSUPPORTED: lldb-api :: functionalities/breakpoint/breakpoint_in_delayslot/TestAvoidBreakpointInDelaySlot.py (1387 of 1785) PASS: lldb-unit :: UnwindAssembly/x86/./UnwindAssemblyx86Tests/Testx86AssemblyInspectionEngine.TestAddRSP (1388 of 1785) PASS: lldb-api :: lang/c/stepping/TestThreadStepping.py (1389 of 1785) PASS: lldb-unit :: Process/minidump/./LLDBMinidumpTests/MinidumpParserTest.GetMemory (1390 of 1785) PASS: lldb-shell :: SymbolFile/DWARF/debug_ranges.s (1391 of 1785) PASS: lldb-api :: functionalities/thread/concurrent_events/TestConcurrentSignalNWatchNBreak.py (1392 of 1785) PASS: lldb-shell :: SymbolFile/sizeless-symbol.test (1393 of 1785) PASS: lldb-unit :: Expression/./ExpressionTests/DiagnosticManagerTest.FixedExpression (1394 of 1785) PASS: lldb-unit :: Utility/./UtilityTests/AnsiTerminal.Empty (1395 of 1785) PASS: lldb-shell :: SymbolFile/DWARF/debug_loc.s (1396 of 1785) PASS: lldb-api :: commands/expression/context-object/TestContextObject.py (1397 of 1785) PASS: lldb-unit :: Utility/./UtilityTests/StreamTest.PutStringAsRawHex8 (1398 of 1785) PASS: lldb-unit :: Utility/./UtilityTests/RangeTest.ContainsRange (1399 of 1785) PASS: lldb-unit :: Symbol/./SymbolTests/LineEntryTest.GetSameLineContiguousAddressRangeNestedInline (1400 of 1785) PASS: lldb-unit :: Utility/./UtilityTests/StringListTest.InsertStringAtIndexMove (1401 of 1785) PASS: lldb-api :: lang/cpp/scope/TestCppScope.py (1402 of 1785) PASS: lldb-unit :: Utility/./UtilityTests/BinaryStreamTest.PutULEB128MaxValue (1403 of 1785) PASS: lldb-api :: commands/expression/inline-namespace/TestInlineNamespace.py (1404 of 1785) PASS: lldb-api :: tools/lldb-server/commandline/TestStubReverseConnect.py (1405 of 1785) PASS: lldb-unit :: Utility/./UtilityTests/TimerTest.CategoryTimesStats (1406 of 1785) PASS: lldb-api :: lang/cpp/operators/TestCppOperators.py (1407 of 1785) PASS: lldb-unit :: ScriptInterpreter/Python/./ScriptInterpreterPythonTests/PythonDataObjectsTest.TestPythonInteger (1408 of 1785) PASS: lldb-api :: functionalities/postmortem/elf-core/TestLinuxCore.py (1409 of 1785) PASS: lldb-shell :: Quit/TestQuitExitCodeTooManyArgs.test (1410 of 1785) PASS: lldb-unit :: Host/./HostTests/FileSystemTest.GetPermissions (1411 of 1785) UNSUPPORTED: lldb-shell :: Process/Windows/exception_access_violation.cpp (1412 of 1785) PASS: lldb-api :: functionalities/inline-stepping/TestInlineStepping.py (1413 of 1785) PASS: lldb-api :: lang/c/register_variables/TestRegisterVariables.py (1414 of 1785) PASS: lldb-shell :: Reproducer/Functionalities/TestDataFormatter.test (1415 of 1785) PASS: lldb-shell :: Quit/TestQuitExitCode-30.test (1416 of 1785) PASS: lldb-api :: functionalities/data-formatter/data-formatter-stl/libcxx/forward_list/TestDataFormatterLibcxxForwardList.py (1417 of 1785) PASS: lldb-unit :: Utility/./UtilityTests/RecordReplayTest.InstrumentedFooSameThis (1418 of 1785) UNSUPPORTED: lldb-api :: functionalities/thread/thread_specific_break_plus_condition/TestThreadSpecificBpPlusCondition.py (1419 of 1785) PASS: lldb-unit :: UnwindAssembly/x86/./UnwindAssemblyx86Tests/Testx86AssemblyInspectionEngine.TestStackRealign8BitDisp_i386 (1420 of 1785) PASS: lldb-api :: functionalities/thread/step_until/TestStepUntil.py (1421 of 1785) PASS: lldb-unit :: Expression/./ExpressionTests/CppModuleConfigurationTest.MissingUsrInclude (1422 of 1785) UNSUPPORTED: lldb-api :: tools/lldb-server/thread-name/TestGdbRemoteThreadName.py (1423 of 1785) PASS: lldb-unit :: Utility/./UtilityTests/RangeTest.Copy (1424 of 1785) PASS: lldb-api :: macosx/load-kext/TestLoadKext.py (1425 of 1785) PASS: lldb-unit :: Host/./HostTests/NativeProcessProtocolTest.ReadCStringFromMemory_MaxSize (1426 of 1785) UNSUPPORTED: lldb-shell :: Register/x86-gp-read.test (1427 of 1785) PASS: lldb-unit :: Signals/./SignalsTests/UnixSignalsTest.Iteration (1428 of 1785) PASS: lldb-shell :: Minidump/Windows/Sigsegv/sigsegv.test (1429 of 1785) PASS: lldb-unit :: Utility/./UtilityTests/AnsiTerminal.Unknown (1430 of 1785) PASS: lldb-unit :: Process/minidump/./LLDBMinidumpTests/MinidumpParserTest.MinidumpDuplicateModuleMinAddress (1431 of 1785) PASS: lldb-api :: functionalities/tail_call_frames/ambiguous_tail_call_seq2/TestAmbiguousTailCallSeq2.py (1432 of 1785) UNSUPPORTED: lldb-api :: functionalities/data-formatter/data-formatter-stl/libstdcpp/map/TestDataFormatterStdMap.py (1433 of 1785) PASS: lldb-unit :: Utility/./UtilityTests/RangeTest.SizeTypes (1434 of 1785) PASS: lldb-unit :: UnwindAssembly/x86/./UnwindAssemblyx86Tests/Testx86AssemblyInspectionEngine.TestPushRBPWithREX (1435 of 1785) PASS: lldb-shell :: Settings/TestSettingsWrite.test (1436 of 1785) PASS: lldb-api :: lang/cpp/global_operators/TestCppGlobalOperators.py (1437 of 1785) PASS: lldb-unit :: Utility/./UtilityTests/RangeTest.ContainsEndInclusive (1438 of 1785) PASS: lldb-api :: driver/batch_mode/TestBatchMode.py (1439 of 1785) PASS: lldb-unit :: Utility/./UtilityTests/SerializationRountripTest.SerializeDeserializePod (1440 of 1785) PASS: lldb-unit :: Process/gdb-remote/./ProcessGdbRemoteTests/GDBRemoteClientBaseTest.SendContinueAndWait (1441 of 1785) PASS: lldb-unit :: Utility/./UtilityTests/StreamTeeTest.Flush (1442 of 1785) PASS: lldb-unit :: ScriptInterpreter/Python/./ScriptInterpreterPythonTests/PythonDataObjectsTest.TestPythonDictionaryValueEquality (1443 of 1785) PASS: lldb-unit :: Utility/./UtilityTests/StringExtractorTest.GetHexBytesAvail_OddPair2 (1444 of 1785) PASS: lldb-unit :: Utility/./UtilityTests/ArchSpecTest.OperatorBool (1445 of 1785) UNSUPPORTED: lldb-api :: functionalities/data-formatter/data-formatter-stl/libstdcpp/vbool/TestDataFormatterStdVBool.py (1446 of 1785) PASS: lldb-api :: commands/disassemble/basic/TestDisassembleBreakpoint.py (1447 of 1785) PASS: lldb-api :: functionalities/data-formatter/language_category_updates/TestDataFormatterLanguageCategoryUpdates.py (1448 of 1785) PASS: lldb-unit :: Utility/./UtilityTests/RangeTest.NotEqualInvalid (1449 of 1785) PASS: lldb-shell :: SymbolFile/DWARF/find-function-regex.cpp (1450 of 1785) PASS: lldb-api :: functionalities/inferior-crashing/TestInferiorCrashingStep.py (1451 of 1785) PASS: lldb-api :: functionalities/tail_call_frames/ambiguous_tail_call_seq1/TestAmbiguousTailCallSeq1.py (1452 of 1785) PASS: lldb-api :: functionalities/memory/find/TestMemoryFind.py (1453 of 1785) PASS: lldb-unit :: SymbolFile/DWARF/./SymbolFileDWARFTests/SymbolFileDWARFTests.TestAbbrevValidAttrNullForm (1454 of 1785) UNSUPPORTED: lldb-api :: commands/watchpoints/variable_out_of_scope/TestWatchedVarHitWhenInScope.py (1455 of 1785) PASS: lldb-unit :: ScriptInterpreter/Python/./ScriptInterpreterPythonTests/PythonDataObjectsTest.TestExtractingUInt64ThroughStructuredData (1456 of 1785) PASS: lldb-api :: functionalities/breakpoint/breakpoint_by_line_and_column/TestBreakpointByLineAndColumn.py (1457 of 1785) PASS: lldb-unit :: Utility/./UtilityTests/StringListTest.Assignment (1458 of 1785) PASS: lldb-unit :: Host/./HostTests/ConnectionFileDescriptorTest.TCPGetURIv6 (1459 of 1785) PASS: lldb-unit :: Target/./TargetTests/ExecutionContextTest.GetByteOrderProcess (1460 of 1785) PASS: lldb-unit :: Process/gdb-remote/./ProcessGdbRemoteTests/GDBRemoteClientBaseTest.SendContinueAndAsyncPacket (1461 of 1785) PASS: lldb-shell :: SymbolFile/Breakpad/unwind-via-raSearch.test (1462 of 1785) PASS: lldb-unit :: Process/minidump/./LLDBMinidumpTests/MinidumpParserTest.GetThreadsAndGetThreadContext (1463 of 1785) PASS: lldb-unit :: Utility/./UtilityTests/StringExtractorTest.GetHexU8_Exact_NoEof (1464 of 1785) PASS: lldb-unit :: UnwindAssembly/x86/./UnwindAssemblyx86Tests/Testx86AssemblyInspectionEngine.TestPushEDX (1465 of 1785) PASS: lldb-unit :: debugserver/./debugserverTests/RNBSocket.LoopBackConnectIPv6 (1466 of 1785) PASS: lldb-unit :: Utility/./UtilityTests/StringLexerTest.Peek (1467 of 1785) UNSUPPORTED: lldb-api :: lang/cpp/function-template-parameter-pack/TestFunctionTemplateParameterPack.py (1468 of 1785) PASS: lldb-unit :: Utility/./UtilityTests/StringLexerTest.PutBack (1469 of 1785) UNSUPPORTED: lldb-shell :: SymbolFile/NativePDB/typedefs.cpp (1470 of 1785) PASS: lldb-unit :: Language/CPlusPlus/./LanguageCPlusPlusTests/CPlusPlusLanguage.MethodNameParsing (1471 of 1785) UNSUPPORTED: lldb-api :: api/multiple-debuggers/TestMultipleDebuggers.py (1472 of 1785) PASS: lldb-unit :: ScriptInterpreter/Python/./ScriptInterpreterPythonTests/PythonDataObjectsTest.TestPythonDictionaryManipulation (1473 of 1785) PASS: lldb-unit :: ScriptInterpreter/Python/./ScriptInterpreterPythonTests/PythonDataObjectsTest.TestPythonIntegerToStr (1474 of 1785) UNSUPPORTED: lldb-shell :: Breakpoint/case-insensitive.test (1475 of 1785) PASS: lldb-unit :: UnwindAssembly/x86/./UnwindAssemblyx86Tests/Testx86AssemblyInspectionEngine.TestPopEDI (1476 of 1785) PASS: lldb-api :: lang/cpp/exceptions/TestCPPExceptionBreakpoints.py (1477 of 1785) PASS: lldb-unit :: Core/./LLDBCoreTests/MangledTest.ResultForValidName (1478 of 1785) PASS: lldb-unit :: Utility/./UtilityTests/UUIDTest.StringConverion (1479 of 1785) UNSUPPORTED: lldb-shell :: Register/x86-zmm-write.test (1480 of 1785) PASS: lldb-unit :: Process/gdb-remote/./ProcessGdbRemoteTests/GDBRemoteCommunicationClientTest.GetMemoryRegionInfo (1481 of 1785) PASS: lldb-api :: functionalities/gdb_remote_client/TestGDBRemoteClient.py (1482 of 1785) PASS: lldb-unit :: Process/minidump/./LLDBMinidumpTests/RegisterContextMinidump.CheckRegisterContextMinidump_ARM (1483 of 1785) PASS: lldb-api :: functionalities/source-map/TestTargetSourceMap.py (1484 of 1785) PASS: lldb-api :: python_api/frame/inlines/TestInlinedFrame.py (1485 of 1785) PASS: lldb-api :: commands/frame/diagnose/bad-reference/TestBadReference.py (1486 of 1785) PASS: lldb-unit :: Utility/./UtilityTests/DataExtractorTest.GetBitfield (1487 of 1785) PASS: lldb-api :: functionalities/breakpoint/source_regexp/TestSourceRegexBreakpoints.py (1488 of 1785) PASS: lldb-api :: functionalities/data-formatter/data-formatter-objc/TestDataFormatterObjCCF.py (1489 of 1785) PASS: lldb-api :: functionalities/data-formatter/data-formatter-objc/TestDataFormatterObjCNSContainer.py (1490 of 1785) PASS: lldb-api :: functionalities/step-avoids-no-debug/TestStepNoDebug.py (1491 of 1785) PASS: lldb-api :: commands/expression/formatters/TestFormatters.py (1492 of 1785) PASS: lldb-unit :: ScriptInterpreter/Python/./ScriptInterpreterPythonTests/PythonDataObjectsTest.TestPythonStringToStructuredString (1493 of 1785) PASS: lldb-api :: lang/objc/objc-ivar-protocols/TestIvarProtocols.py (1494 of 1785) PASS: lldb-shell :: SymbolFile/NativePDB/s_constant.cpp (1495 of 1785) PASS: lldb-api :: commands/expression/completion/TestExprCompletion.py (1496 of 1785) PASS: lldb-unit :: Utility/./UtilityTests/StringExtractorTest.GetHexBytesAvail_OddPair (1497 of 1785) PASS: lldb-unit :: SymbolFile/DWARF/./SymbolFileDWARFTests/SymbolFileDWARFTests.TestAbilitiesForDWARF (1498 of 1785) PASS: lldb-unit :: Host/./HostTests/HostInfoTest.GetHostname (1499 of 1785) PASS: lldb-unit :: Utility/./UtilityTests/ArchSpecTest.TestParseMachCPUDashSubtypeTripleExtra (1500 of 1785) PASS: lldb-shell :: ObjectFile/ELF/many-sections.s (1501 of 1785) PASS: lldb-api :: functionalities/data-formatter/data-formatter-stl/libcxx/atomic/TestLibCxxAtomic.py (1502 of 1785) PASS: lldb-shell :: Expr/TestTypeOfDeclTypeExpr.test (1503 of 1785) PASS: lldb-unit :: Expression/./ExpressionTests/CppModuleConfigurationTest.AmbiguousCLib (1504 of 1785) PASS: lldb-unit :: Host/./HostTests/File.GetStreamFromDescriptor (1505 of 1785) PASS: lldb-shell :: SymbolFile/DWARF/find-inline-method.s (1506 of 1785) PASS: lldb-unit :: Utility/./UtilityTests/StreamTest.PutCharWhitespace (1507 of 1785) PASS: lldb-unit :: Core/./LLDBCoreTests/MangledTest.EmptyForInvalidName (1508 of 1785) PASS: lldb-api :: lang/objc/objc-stepping/TestObjCStepping.py (1509 of 1785) PASS: lldb-unit :: Utility/./UtilityTests/FileSpecTest.PrependPathComponent (1510 of 1785) PASS: lldb-api :: functionalities/var_path/TestVarPath.py (1511 of 1785) PASS: lldb-unit :: Utility/./UtilityTests/BinaryStreamTest.PutSLEB128TwoBytes (1512 of 1785) PASS: lldb-api :: lang/objc/foundation/TestRuntimeTypes.py (1513 of 1785) UNSUPPORTED: lldb-shell :: Expr/TestIRMemoryMapWindows.test (1514 of 1785) PASS: lldb-unit :: Target/./TargetTests/PathMappingListTest.RelativeTests (1515 of 1785) PASS: lldb-shell :: Driver/LocalLLDBInit.test (1516 of 1785) PASS: lldb-unit :: ScriptInterpreter/Python/./ScriptInterpreterPythonTests/PythonExceptionStateTest.TestResetSemantics (1517 of 1785) PASS: lldb-unit :: Utility/./UtilityTests/StreamTeeTest.Write (1518 of 1785) PASS: lldb-api :: functionalities/data-formatter/compactvectors/TestCompactVectors.py (1519 of 1785) PASS: lldb-unit :: Utility/./UtilityTests/UriParserTest.PortOverflow (1520 of 1785) PASS: lldb-unit :: Utility/./UtilityTests/StringExtractorTest.GetHexBytesAvail_FullString (1521 of 1785) PASS: lldb-unit :: Utility/./UtilityTests/AnsiTerminal.AtEnd (1522 of 1785) PASS: lldb-api :: functionalities/wrong_commands/TestWrongCommands.py (1523 of 1785) PASS: lldb-unit :: Utility/./UtilityTests/BinaryStreamTest.PutSLEB128MaxValue (1524 of 1785) PASS: lldb-unit :: Utility/./UtilityTests/StreamTest.ShiftOperatorPtr (1525 of 1785) PASS: lldb-api :: functionalities/data-formatter/data-formatter-stl/libcxx/multimap/TestDataFormatterLibccMultiMap.py (1526 of 1785) PASS: lldb-api :: functionalities/thread/concurrent_events/TestConcurrentBreakpointsDelayedBreakpointOneWatchpoint.py (1527 of 1785) UNSUPPORTED: lldb-api :: functionalities/darwin_log/filter/exact_match/category/TestDarwinLogFilterMatchCategory.py (1528 of 1785) PASS: lldb-unit :: SymbolFile/DWARF/./SymbolFileDWARFTests/SymbolFileDWARFTests.TestAbbrevNullAttrValidForm (1529 of 1785) PASS: lldb-unit :: Utility/./UtilityTests/RecordReplayTest.InstrumentedFoo (1530 of 1785) PASS: lldb-unit :: Utility/./UtilityTests/RegularExpression.Match (1531 of 1785) XFAIL: lldb-shell :: Register/x86-mm-xmm-write.test (1532 of 1785) PASS: lldb-api :: lang/mixed/TestMixedLanguages.py (1533 of 1785) PASS: lldb-api :: functionalities/data-formatter/type_summary_list_arg/TestTypeSummaryListArg.py (1534 of 1785) PASS: lldb-api :: functionalities/data-formatter/data-formatter-stl/libcxx/map/TestDataFormatterLibccMap.py (1535 of 1785) PASS: lldb-api :: python_api/watchpoint/condition/TestWatchpointConditionAPI.py (1536 of 1785) PASS: lldb-api :: commands/expression/argument_passing_restrictions/TestArgumentPassingRestrictions.py (1537 of 1785) UNSUPPORTED: lldb-api :: tools/lldb-server/signal-filtering/TestGdbRemote_QPassSignals.py (1538 of 1785) PASS: lldb-unit :: SymbolFile/NativePDB/./SymbolFileNativePDBTests/PDBFPOProgramToDWARFExpressionTests.UnresolvedRegisterReference (1539 of 1785) PASS: lldb-unit :: Process/gdb-remote/./ProcessGdbRemoteTests/GDBRemoteCommunicationServerTest.SendErrorResponse_StringError (1540 of 1785) PASS: lldb-api :: functionalities/data-formatter/nssetsynth/TestNSSetSynthetic.py (1541 of 1785) PASS: lldb-api :: functionalities/data-formatter/data-formatter-synth/TestDataFormatterSynth.py (1542 of 1785) PASS: lldb-unit :: Utility/./UtilityTests/AnsiTerminal.KnownPrefix (1543 of 1785) UNSUPPORTED: lldb-api :: functionalities/thread/break_after_join/TestBreakAfterJoin.py (1544 of 1785) PASS: lldb-unit :: Utility/./UtilityTests/StringListTest.DefaultConstructor (1545 of 1785) PASS: lldb-unit :: Utility/./UtilityTests/StringExtractorTest.GetHexU8_Underflow_NoEof (1546 of 1785) PASS: lldb-api :: functionalities/data-formatter/ostypeformatting/TestFormattersOsType.py (1547 of 1785) PASS: lldb-api :: commands/expression/unicode-in-variable/TestUnicodeInVariable.py (1548 of 1785) PASS: lldb-unit :: ObjectFile/Breakpad/./ObjectFileBreakpadTests/FileRecord.parse (1549 of 1785) PASS: lldb-unit :: UnwindAssembly/x86/./UnwindAssemblyx86Tests/Testx86AssemblyInspectionEngine.TestAddESP (1550 of 1785) UNSUPPORTED: lldb-api :: functionalities/darwin_log/filter/regex/message/TestDarwinLogFilterRegexMessage.py (1551 of 1785) PASS: lldb-api :: functionalities/thread/concurrent_events/TestConcurrentManyCrash.py (1552 of 1785) UNSUPPORTED: lldb-shell :: Register/aarch64-fp-read.test (1553 of 1785) PASS: lldb-shell :: ObjectFile/ELF/PT_LOAD-empty.yaml (1554 of 1785) PASS: lldb-unit :: Language/Highlighting/./HighlighterTests/HighlighterTest.ClangCursorOutOfBounds (1555 of 1785) PASS: lldb-unit :: Process/gdb-remote/./ProcessGdbRemoteTests/GDBRemoteClientBaseTest.InterruptNoResponse (1556 of 1785) PASS: lldb-unit :: Utility/./UtilityTests/StringListTest.ShiftStdString (1557 of 1785) PASS: lldb-api :: lang/cpp/template/TestTemplateArgs.py (1558 of 1785) PASS: lldb-api :: lang/cpp/nsimport/TestCppNsImport.py (1559 of 1785) PASS: lldb-api :: lang/objc/objc-baseclass-sbtype/TestObjCBaseClassSBType.py (1560 of 1785) PASS: lldb-shell :: Minidump/dump-all.test (1561 of 1785) PASS: lldb-api :: functionalities/set-data/TestSetData.py (1562 of 1785) PASS: lldb-unit :: Process/gdb-remote/./ProcessGdbRemoteTests/GDBRemoteCommunicationClientTest.WriteRegister (1563 of 1785) PASS: lldb-unit :: ScriptInterpreter/Python/./ScriptInterpreterPythonTests/PythonExceptionStateTest.TestAcquisitionSemantics (1564 of 1785) PASS: lldb-api :: functionalities/multidebugger_commands/TestMultipleDebuggersCommands.py (1565 of 1785) PASS: lldb-api :: lang/cpp/member-and-local-vars-with-same-name/TestMembersAndLocalsWithSameName.py (1566 of 1785) PASS: lldb-unit :: Utility/./UtilityTests/ArgsTest.TestOverwriteArgs (1567 of 1785) PASS: lldb-unit :: Language/Highlighting/./HighlighterTests/HighlighterTest.ClangCursorPosAfterOtherToken (1568 of 1785) PASS: lldb-unit :: Process/minidump/./LLDBMinidumpTests/MinidumpParserTest.GetMemoryRegionInfoFromMemoryList (1569 of 1785) PASS: lldb-api :: functionalities/inferior-changed/TestInferiorChanged.py (1570 of 1785) PASS: lldb-unit :: Utility/./UtilityTests/ScalarTest.GetValue (1571 of 1785) PASS: lldb-unit :: Utility/./UtilityTests/RangeTest.SlideZero (1572 of 1785) PASS: lldb-api :: functionalities/gdb_remote_client/TestTargetXMLArch.py (1573 of 1785) PASS: lldb-shell :: SymbolFile/Breakpad/stack-cfi-parsing.test (1574 of 1785) PASS: lldb-unit :: Utility/./UtilityTests/UserIDResolver.GetGroupName (1575 of 1785) PASS: lldb-api :: commands/expression/radar_9673664/TestExprHelpExamples.py (1576 of 1785) PASS: lldb-api :: commands/expression/function_template_specialization_temp_args/TestFunctionTemplateSpecializationTempArgs.py (1577 of 1785) PASS: lldb-unit :: Process/minidump/./LLDBMinidumpTests/MinidumpParserTest.InvalidMinidump (1578 of 1785) PASS: lldb-unit :: Utility/./UtilityTests/BinaryStreamTest.PutSLEB128ThreeBytes (1579 of 1785) UNSUPPORTED: lldb-api :: tools/lldb-vscode/stackTrace/TestVSCode_stackTrace.py (1580 of 1785) PASS: lldb-api :: functionalities/data-formatter/data-formatter-stl/libcxx/list/loop/TestDataFormatterLibcxxListLoop.py (1581 of 1785) UNSUPPORTED: lldb-api :: functionalities/unwind/ehframe/TestEhFrameUnwind.py (1582 of 1785) PASS: lldb-api :: lang/objc/exceptions/TestObjCExceptions.py (1583 of 1785) PASS: lldb-api :: commands/expression/pr35310/TestExprsBug35310.py (1584 of 1785) PASS: lldb-unit :: Utility/./UtilityTests/ScalarTest.Promotion (1585 of 1785) PASS: lldb-unit :: Host/./HostTests/SocketTest.TCPGetConnectURI (1586 of 1785) PASS: lldb-shell :: SymbolFile/NativePDB/globals-fundamental.cpp (1587 of 1785) PASS: lldb-api :: sample_test/TestSampleTest.py (1588 of 1785) PASS: lldb-api :: commands/expression/expr-in-syscall/TestExpressionInSyscall.py (1589 of 1785) PASS: lldb-api :: commands/watchpoints/watchpoint_set_command/TestWatchLocationWithWatchSet.py (1590 of 1785) PASS: lldb-api :: commands/expression/import-std-module/weak_ptr/TestWeakPtr.py (1591 of 1785) PASS: lldb-api :: python_api/findvalue_duplist/TestSBFrameFindValue.py (1592 of 1785) PASS: lldb-unit :: Utility/./UtilityTests/StreamTest.PutHex8 (1593 of 1785) PASS: lldb-api :: python_api/sbvalue_const_addrof/TestSBValueConstAddrOf.py (1594 of 1785) PASS: lldb-api :: tools/lldb-server/TestGdbRemoteAttach.py (1595 of 1785) PASS: lldb-unit :: Utility/./UtilityTests/Flags.IsClear (1596 of 1785) PASS: lldb-unit :: Utility/./UtilityTests/ConstStringTest.format_provider (1597 of 1785) PASS: lldb-unit :: Utility/./UtilityTests/FileSpecTest.CopyByAppendingPathComponent (1598 of 1785) PASS: lldb-unit :: Expression/./ExpressionTests/CppModuleConfigurationTest.AmbiguousLibCpp (1599 of 1785) PASS: lldb-shell :: Reproducer/TestRelativePath.test (1600 of 1785) PASS: lldb-unit :: Utility/./UtilityTests/BinaryStreamTest.PutULEB128TwoBytes (1601 of 1785) PASS: lldb-shell :: SymbolFile/NativePDB/function-types-classes.cpp (1602 of 1785) PASS: lldb-api :: commands/watchpoints/watchpoint_commands/TestWatchpointCommands.py (1603 of 1785) PASS: lldb-shell :: ObjectFile/MachO/subsections.yaml (1604 of 1785) PASS: lldb-unit :: UnwindAssembly/x86/./UnwindAssemblyx86Tests/Testx86AssemblyInspectionEngine.TestSubESP (1605 of 1785) PASS: lldb-api :: lang/cpp/namespace_conflicts/TestNamespaceConflicts.py (1606 of 1785) PASS: lldb-shell :: Settings/TestStopCommandSourceOnError.test (1607 of 1785) UNSUPPORTED: lldb-shell :: Register/x86-ymm-read.test (1608 of 1785) PASS: lldb-api :: commands/expression/calculator_mode/TestCalculatorMode.py (1609 of 1785) PASS: lldb-unit :: UnwindAssembly/x86/./UnwindAssemblyx86Tests/Testx86AssemblyInspectionEngine.TestSimple64bitFrameFunction (1610 of 1785) PASS: lldb-api :: functionalities/data-formatter/data-formatter-proper-plurals/TestFormattersOneIsSingular.py (1611 of 1785) PASS: lldb-shell :: ExecControl/StopHook/stop-hook.test (1612 of 1785) PASS: lldb-api :: python_api/interpreter/TestRunCommandInterpreterAPI.py (1613 of 1785) UNSUPPORTED: lldb-api :: commands/gui/basic/TestGuiBasic.py (1614 of 1785) PASS: lldb-api :: macosx/duplicate-archive-members/TestDuplicateMembers.py (1615 of 1785) UNSUPPORTED: lldb-shell :: BuildScript/toolchain-msvc.test (1616 of 1785) PASS: lldb-shell :: Process/TestEnvironment.test (1617 of 1785) PASS: lldb-unit :: Utility/./UtilityTests/SerializationRountripTest.SerializeDeserializePodReferences (1618 of 1785) PASS: lldb-api :: lang/cpp/modules-import/TestCXXModulesImport.py (1619 of 1785) PASS: lldb-api :: api/log/TestAPILog.py (1620 of 1785) PASS: lldb-api :: lang/cpp/accelerator-table/TestCPPAccelerator.py (1621 of 1785) PASS: lldb-unit :: Utility/./UtilityTests/StatusTest.ErrorConstructor (1622 of 1785) PASS: lldb-unit :: Utility/./UtilityTests/DataExtractorTest.GetCStrAtEnd (1623 of 1785) UNSUPPORTED: lldb-shell :: SymbolFile/PDB/udt-layout.test (1624 of 1785) PASS: lldb-api :: commands/expression/radar_8638051/Test8638051.py (1625 of 1785) PASS: lldb-unit :: Utility/./UtilityTests/OptionsWithRawTest.QuotedSuffix (1626 of 1785) PASS: lldb-unit :: Utility/./UtilityTests/StringListTest.GetMaxStringLengthMixed (1627 of 1785) PASS: lldb-unit :: Utility/./UtilityTests/ArgsTest.GetQuotedCommandString (1628 of 1785) UNSUPPORTED: lldb-api :: commands/register/register/intel_xtended_registers/mpx_bound_violation/TestBoundViolation.py (1629 of 1785) PASS: lldb-unit :: Utility/./UtilityTests/Flags.GetBitSize (1630 of 1785) PASS: lldb-unit :: Utility/./UtilityTests/CompletionRequest.TryCompleteCurrentArgGood (1631 of 1785) PASS: lldb-api :: functionalities/deleted-executable/TestDeletedExecutable.py (1632 of 1785) PASS: lldb-unit :: Utility/./UtilityTests/TimerTest.CategoryTimesNested (1633 of 1785) PASS: lldb-api :: python_api/sbvalue_persist/TestSBValuePersist.py (1634 of 1785) PASS: lldb-api :: functionalities/gdb_remote_client/TestNestedRegDefinitions.py (1635 of 1785) PASS: lldb-api :: functionalities/data-formatter/parray/TestPrintArray.py (1636 of 1785) PASS: lldb-shell :: ObjectFile/ELF/section-types-edgecases.yaml (1637 of 1785) PASS: lldb-unit :: Expression/./ExpressionTests/DWARFExpression.DW_OP_convert (1638 of 1785) UNSUPPORTED: lldb-api :: functionalities/signal/handle-segv/TestHandleSegv.py (1639 of 1785) PASS: lldb-unit :: Language/Highlighting/./HighlighterTests/HighlighterTest.Colons (1640 of 1785) PASS: lldb-api :: lang/objc/rdar-11355592/TestRdar11355592.py (1641 of 1785) PASS: lldb-unit :: UnwindAssembly/x86/./UnwindAssemblyx86Tests/Testx86AssemblyInspectionEngine.TestPopESI (1642 of 1785) PASS: lldb-api :: functionalities/data-formatter/data-formatter-named-summaries/TestDataFormatterNamedSummaries.py (1643 of 1785) UNSUPPORTED: lldb-shell :: Register/x86-64-xmm16-read.test (1644 of 1785) PASS: lldb-api :: commands/expression/xvalue/TestXValuePrinting.py (1645 of 1785) PASS: lldb-unit :: Expression/./ExpressionTests/DiagnosticManagerTest.PutString (1646 of 1785) PASS: lldb-unit :: Utility/./UtilityTests/TimeoutTest.Construction (1647 of 1785) UNSUPPORTED: lldb-api :: tools/lldb-server/TestGdbRemoteModuleInfo.py (1648 of 1785) PASS: lldb-shell :: Settings/TestEchoCommands.test (1649 of 1785) PASS: lldb-unit :: Utility/./UtilityTests/ConstStringTest.MangledCounterpart (1650 of 1785) PASS: lldb-api :: functionalities/pre_run_dylibs/TestPreRunDylibs.py (1651 of 1785) PASS: lldb-shell :: SymbolFile/DWARF/forward-declarations.s (1652 of 1785) PASS: lldb-unit :: Utility/./UtilityTests/FileSpecTest.GuessPathStyle (1653 of 1785) PASS: lldb-api :: python_api/section/TestSectionAPI.py (1654 of 1785) PASS: lldb-unit :: SymbolFile/NativePDB/./SymbolFileNativePDBTests/PDBFPOProgramToDWARFExpressionTests.UnresolvedDependentCyclicRegisterAssignmentReference (1655 of 1785) PASS: lldb-unit :: Process/gdb-remote/./ProcessGdbRemoteTests/GDBRemoteCommunicationClientTest.SendStartTracePacket (1656 of 1785) PASS: lldb-unit :: Utility/./UtilityTests/StringExtractorTest.GetHexBytes_Partial (1657 of 1785) PASS: lldb-api :: functionalities/recursion/TestValueObjectRecursion.py (1658 of 1785) PASS: lldb-api :: lang/cpp/trivial_abi/TestTrivialABI.py (1659 of 1785) UNSUPPORTED: lldb-api :: functionalities/data-formatter/data-formatter-stl/libstdcpp/unique_ptr/TestDataFormatterStdUniquePtr.py (1660 of 1785) PASS: lldb-api :: functionalities/inferior-crashing/recursive-inferior/TestRecursiveInferiorStep.py (1661 of 1785) PASS: lldb-unit :: Utility/./UtilityTests/StringListTest.CopyListSingle (1662 of 1785) PASS: lldb-shell :: SymbolFile/NativePDB/function-types-calling-conv.cpp (1663 of 1785) PASS: lldb-unit :: Utility/./UtilityTests/VMRange.CollectionContains (1664 of 1785) PASS: lldb-unit :: Utility/./UtilityTests/AnsiTerminal.WhiteSpace (1665 of 1785) PASS: lldb-api :: python_api/frame/TestFrames.py (1666 of 1785) PASS: lldb-api :: commands/expression/anonymous-struct/TestCallUserAnonTypedef.py (1667 of 1785) PASS: lldb-shell :: Driver/TestFile.test (1668 of 1785) PASS: lldb-api :: lang/objc/objc-struct-return/TestObjCStructReturn.py (1669 of 1785) PASS: lldb-api :: lang/cpp/inlines/TestInlines.py (1670 of 1785) PASS: lldb-unit :: Process/gdb-remote/./ProcessGdbRemoteTests/GDBRemoteCommunicationClientTest.SendGetMetaDataPacket (1671 of 1785) PASS: lldb-shell :: SymbolFile/NativePDB/tag-types.cpp (1672 of 1785) PASS: lldb-unit :: Utility/./UtilityTests/StringListTest.GetMaxStringLengthEmpty (1673 of 1785) PASS: lldb-unit :: Expression/./ExpressionTests/DiagnosticManagerTest.AppendMessageSubsequentDiags (1674 of 1785) PASS: lldb-api :: tools/lldb-server/TestGdbRemoteThreadsInStopReply.py (1675 of 1785) PASS: lldb-api :: commands/frame/language/TestGuessLanguage.py (1676 of 1785) PASS: lldb-shell :: SymbolFile/NativePDB/source-list.cpp (1677 of 1785) PASS: lldb-unit :: ScriptInterpreter/Python/./ScriptInterpreterPythonTests/PythonDataObjectsTest.TestBorrowedReferences (1678 of 1785) PASS: lldb-api :: functionalities/breakpoint/breakpoint_set_restart/TestBreakpointSetRestart.py (1679 of 1785) PASS: lldb-api :: functionalities/gdb_remote_client/TestNoWatchpointSupportInfo.py (1680 of 1785) PASS: lldb-shell :: Reproducer/TestWorkingDir.test (1681 of 1785) PASS: lldb-unit :: Utility/./UtilityTests/StringListTest.InsertStringAtIndexStart (1682 of 1785) PASS: lldb-unit :: Symbol/./SymbolTests/TestClangASTContext.TestUnifyAccessSpecifiers (1683 of 1785) PASS: lldb-api :: functionalities/inferior-assert/TestInferiorAssert.py (1684 of 1785) PASS: lldb-shell :: SymbolFile/DWARF/debug-types-dwo-cross-reference.cpp (1685 of 1785) PASS: lldb-unit :: Host/./HostTests/FileSystemTest.Readable (1686 of 1785) PASS: lldb-api :: python_api/thread/TestThreadAPI.py (1687 of 1785) PASS: lldb-api :: functionalities/signal/raise/TestRaise.py (1688 of 1785) PASS: lldb-api :: lang/cpp/template-function/TestTemplateFunctions.py (1689 of 1785) PASS: lldb-api :: lang/cpp/gmodules-templates/TestGModules.py (1690 of 1785) PASS: lldb-shell :: Commands/command-source.test (1691 of 1785) PASS: lldb-unit :: Utility/./UtilityTests/DeserializerTest.HasData (1692 of 1785) PASS: lldb-api :: functionalities/thread/concurrent_events/TestConcurrentBreakpointOneDelayBreakpointThreads.py (1693 of 1785) PASS: lldb-api :: functionalities/thread/concurrent_events/TestConcurrentCrashWithBreak.py (1694 of 1785) PASS: lldb-shell :: BuildScript/script-args.test (1695 of 1785) PASS: lldb-api :: commands/expression/rdar44436068/Test128BitsInteger.py (1696 of 1785) PASS: lldb-unit :: ObjectFile/PECOFF/./ObjectFilePECOFFTests/PECallFrameInfoTest.Basic_eh (1697 of 1785) PASS: lldb-unit :: Utility/./UtilityTests/StreamTest.PutULEB128 (1698 of 1785) PASS: lldb-shell :: Driver/TestCore.test (1699 of 1785) PASS: lldb-unit :: Utility/./UtilityTests/StreamTeeTest.SetStreamAtIndexOutOfBounds (1700 of 1785) PASS: lldb-unit :: Editline/./EditlineTests/EditlineTestFixture.EditlineReceivesMultiLineText (1701 of 1785) PASS: lldb-unit :: Utility/./UtilityTests/RangeTest.LessThanInvalid (1702 of 1785) PASS: lldb-unit :: Utility/./UtilityTests/BinaryStreamTest.PutSLEB128OneByte (1703 of 1785) PASS: lldb-unit :: Utility/./UtilityTests/BinaryStreamTest.PutSLEB128One (1704 of 1785) PASS: lldb-unit :: Utility/./UtilityTests/StringListTest.AppendStringCString (1705 of 1785) PASS: lldb-unit :: UnwindAssembly/x86/./UnwindAssemblyx86Tests/Testx86AssemblyInspectionEngine.TestPushRBP (1706 of 1785) PASS: lldb-api :: tools/lldb-server/TestAppleSimulatorOSType.py (1707 of 1785) PASS: lldb-unit :: Utility/./UtilityTests/CompletionRequest.TestCompletionOwnership (1708 of 1785) PASS: lldb-api :: commands/expression/weak_symbols/TestWeakSymbols.py (1709 of 1785) PASS: lldb-api :: lang/cpp/chained-calls/TestCppChainedCalls.py (1710 of 1785) PASS: lldb-api :: lang/objcxx/cxx-bridged-po/TestObjCXXBridgedPO.py (1711 of 1785) PASS: lldb-api :: commands/expression/options/TestExprOptions.py (1712 of 1785) UNSUPPORTED: lldb-api :: benchmarks/libcxxmap/TestBenchmarkLibcxxMap.py (1713 of 1785) PASS: lldb-unit :: Utility/./UtilityTests/RangeTest.DoesIntersect (1714 of 1785) PASS: lldb-api :: functionalities/tail_call_frames/thread_step_out_message/TestArtificialFrameStepOutMessage.py (1715 of 1785) PASS: lldb-api :: arm/emulation/TestEmulations.py (1716 of 1785) PASS: lldb-unit :: Symbol/./SymbolTests/TestClangASTContext.TestConvertAccessTypeToAccessSpecifier (1717 of 1785) PASS: lldb-unit :: Process/minidump/./LLDBMinidumpTests/MinidumpParserTest.GetPid (1718 of 1785) PASS: lldb-unit :: Utility/./UtilityTests/ScalarTest.APIntConstructor (1719 of 1785) PASS: lldb-shell :: ObjectFile/ELF/PT_LOAD-overlap.yaml (1720 of 1785) PASS: lldb-unit :: Utility/./UtilityTests/StringListTest.RemoveBlankLines (1721 of 1785) PASS: lldb-api :: sample_test/TestSampleInlineTest.py (1722 of 1785) PASS: lldb-api :: commands/watchpoints/multiple_hits/TestMultipleHits.py (1723 of 1785) PASS: lldb-api :: functionalities/backticks/TestBackticksWithoutATarget.py (1724 of 1785) PASS: lldb-api :: functionalities/data-formatter/stringprinter/TestStringPrinter.py (1725 of 1785) PASS: lldb-shell :: SymbolFile/DWARF/debug-line-basic.s (1726 of 1785) PASS: lldb-unit :: SymbolFile/DWARF/./SymbolFileDWARFTests/SymbolFileDWARFTests.TestAbbrevOutOfOrder (1727 of 1785) PASS: lldb-api :: python_api/lldbutil/iter/TestRegistersIterator.py (1728 of 1785) PASS: lldb-api :: commands/process/attach-resume/TestAttachResume.py (1729 of 1785) PASS: lldb-unit :: Utility/./UtilityTests/StreamTest.PutMaxHex64ByteOrderBig (1730 of 1785) PASS: lldb-unit :: Utility/./UtilityTests/ArgsTest.TestQuotedUnknownEscape (1731 of 1785) PASS: lldb-unit :: SymbolFile/NativePDB/./SymbolFileNativePDBTests/PDBFPOProgramToDWARFExpressionTests.InvalidOpUnary (1732 of 1785) PASS: lldb-api :: commands/expression/radar_9531204/TestPrintfAfterUp.py (1733 of 1785) PASS: lldb-api :: commands/platform/basic/TestPlatformCommand.py (1734 of 1785) PASS: lldb-api :: python_api/rdar-12481949/Test-rdar-12481949.py (1735 of 1785) PASS: lldb-unit :: Language/Highlighting/./HighlighterTests/HighlighterTest.ClangSquareBrackets (1736 of 1785) PASS: lldb-unit :: Host/./HostTests/FileSystemTest.OpenErrno (1737 of 1785) PASS: lldb-api :: commands/expression/import-std-module/deque-dbg-info-content/TestDbgInfoContentDeque.py (1738 of 1785) PASS: lldb-unit :: UnwindAssembly/x86/./UnwindAssemblyx86Tests/Testx86AssemblyInspectionEngine.TestCALLNextInsn (1739 of 1785) PASS: lldb-unit :: Utility/./UtilityTests/VMRange.IsValid (1740 of 1785) PASS: lldb-unit :: UnwindAssembly/x86/./UnwindAssemblyx86Tests/Testx86AssemblyInspectionEngine.TestPushRBX (1741 of 1785) PASS: lldb-unit :: UnwindAssembly/x86/./UnwindAssemblyx86Tests/Testx86AssemblyInspectionEngine.TestLEAVE (1742 of 1785) PASS: lldb-unit :: Host/./HostTests/SocketTest.TCPListen0ConnectAccept (1743 of 1785) UNSUPPORTED: lldb-shell :: Register/x86-64-zmm-write.test (1744 of 1785) PASS: lldb-shell :: SymbolFile/DWARF/find-basic-variable.cpp (1745 of 1785) PASS: lldb-unit :: Utility/./UtilityTests/StringListTest.ShiftCString (1746 of 1785) PASS: lldb-unit :: ScriptInterpreter/Python/./ScriptInterpreterPythonTests/PythonDataObjectsTest.TestPythonTupleToStructuredList (1747 of 1785) PASS: lldb-unit :: Utility/./UtilityTests/ScalarTest.Equality (1748 of 1785) PASS: lldb-unit :: Utility/./UtilityTests/BinaryStreamTest.PutULEB128OneByte (1749 of 1785) PASS: lldb-unit :: UnwindAssembly/x86/./UnwindAssemblyx86Tests/Testx86AssemblyInspectionEngine.TestDisassemblyJunkBytes (1750 of 1785) PASS: lldb-unit :: Host/./HostTests/SocketTest.DecodeHostAndPort (1751 of 1785) PASS: lldb-unit :: Utility/./UtilityTests/CompletionRequest.DuplicateFiltering (1752 of 1785) PASS: lldb-unit :: Process/gdb-remote/./ProcessGdbRemoteTests/GDBRemoteCommunicationServerTest.SendErrorResponse_Status (1753 of 1785) PASS: lldb-unit :: debugserver/./debugserverTests/RNBSocket.LoopBackListenIPv6 (1754 of 1785) PASS: lldb-api :: commands/command/source/TestCommandSource.py (1755 of 1785) PASS: lldb-unit :: Utility/./UtilityTests/EnvironmentTest.EnvpConversion (1756 of 1785) PASS: lldb-shell :: Reproducer/TestGDBRemoteRepro.test (1757 of 1785) PASS: lldb-unit :: Process/gdb-remote/./ProcessGdbRemoteTests/GDBRemoteClientBaseTest.SendPacketAndReceiveResponseWithOutputSupport (1758 of 1785) PASS: lldb-unit :: Utility/./UtilityTests/VMRange.SetEndAddress (1759 of 1785) PASS: lldb-api :: functionalities/postmortem/mach-core/TestMachCore.py (1760 of 1785) PASS: lldb-unit :: Expression/./ExpressionTests/DWARFExpression.DW_OP_pick (1761 of 1785) PASS: lldb-unit :: Utility/./UtilityTests/BinaryStreamTest.PutULEB128FiveBytes (1762 of 1785) PASS: lldb-unit :: Utility/./UtilityTests/StringExtractorTest.GetHexU8_InvalidHex_NoEof (1763 of 1785) PASS: lldb-api :: python_api/module_section/TestModuleAndSection.py (1764 of 1785) PASS: lldb-unit :: Utility/./UtilityTests/StringExtractorTest.InitMisc (1765 of 1785) PASS: lldb-api :: functionalities/data-formatter/pyobjsynthprovider/TestPyObjSynthProvider.py (1766 of 1785) PASS: lldb-api :: commands/watchpoints/watchpoint_commands/condition/TestWatchpointConditionCmd.py (1767 of 1785) PASS: lldb-api :: functionalities/breakpoint/inlined_breakpoints/TestInlinedBreakpoints.py (1768 of 1785) PASS: lldb-unit :: ScriptInterpreter/Python/./ScriptInterpreterPythonTests/PythonDataObjectsTest.TestPythonListValueEquality (1769 of 1785) PASS: lldb-unit :: Utility/./UtilityTests/EnvironmentTest.EnvpConstruction (1770 of 1785) PASS: lldb-shell :: SymbolFile/DWARF/dir-separator-no-comp-dir-relative-name.s (1771 of 1785) PASS: lldb-api :: commands/expression/persist_objc_pointeetype/TestPersistObjCPointeeType.py (1772 of 1785) PASS: lldb-api :: lang/objcxx/objcxx-ivar-vector/TestIvarVector.py (1773 of 1785) PASS: lldb-api :: functionalities/thread/concurrent_events/TestConcurrentSignalWatch.py (1774 of 1785) PASS: lldb-api :: commands/expression/import-std-module/no-std-module/TestMissingStdModule.py (1775 of 1785) PASS: lldb-api :: commands/settings/quoting/TestQuoting.py (1776 of 1785) PASS: lldb-api :: lang/objc/objc-new-syntax/TestObjCNewSyntaxDictionary.py (1777 of 1785) PASS: lldb-api :: api/check_public_api_headers/TestPublicAPIHeaders.py (1778 of 1785) PASS: lldb-api :: lang/objc/foundation/TestObjCMethodsString.py (1779 of 1785) PASS: lldb-api :: commands/target/basic/TestTargetCommand.py (1780 of 1785) PASS: lldb-api :: python_api/watchpoint/watchlocation/TestTargetWatchAddress.py (1781 of 1785) PASS: lldb-api :: lang/cpp/namespace/TestNamespaceLookup.py (1782 of 1785) PASS: lldb-api :: lang/objc/real-definition/TestRealDefinition.py (1783 of 1785) PASS: lldb-api :: lang/objc/objc-new-syntax/TestObjCNewSyntaxLiteral.py (1784 of 1785) PASS: lldb-api :: lang/objc/foundation/TestFoundationDisassembly.py (1785 of 1785) Testing Time: 1850.78s ******************** Failing Tests (3): lldb-api :: functionalities/data-formatter/data-formatter-objc/TestDataFormatterObjCNSData.py lldb-api :: tools/lldb-server/register-reading/TestGdbRemoteGPacket.py lldb-unit :: Utility/./UtilityTests/TimerTest.CategoryTimes2

Hide Details

Hide Details

Slowest Tests: -------------------------------------------------------------------------- 110.82s: lldb-api :: python_api/target/TestTargetAPI.py 112.30s: lldb-api :: commands/expression/import-std-module/stack/TestStack.py 112.98s: lldb-api :: api/check_public_api_headers/TestPublicAPIHeaders.py 120.80s: lldb-api :: functionalities/return-value/TestReturnValue.py 127.61s: lldb-api :: lang/objc/objc-new-syntax/TestObjCNewSyntaxDictionary.py 131.09s: lldb-api :: lang/cpp/namespace/TestNamespaceLookup.py 133.25s: lldb-api :: lang/c/anonymous/TestAnonymous.py 135.31s: lldb-api :: lang/objc/objc-new-syntax/TestObjCNewSyntaxArray.py 140.72s: lldb-api :: functionalities/recursion/TestValueObjectRecursion.py 148.31s: lldb-api :: functionalities/inferior-crashing/TestInferiorCrashingStep.py 167.76s: lldb-api :: lang/objc/exceptions/TestObjCExceptions.py 198.95s: lldb-api :: lang/objc/foundation/TestObjCMethods.py 206.35s: lldb-api :: functionalities/load_unload/TestLoadUnload.py 209.36s: lldb-api :: lang/cpp/enum_types/TestCPP11EnumTypes.py 219.08s: lldb-api :: tools/lldb-server/TestLldbGdbServer.py 242.87s: lldb-api :: lang/objc/hidden-ivars/TestHiddenIvars.py 249.70s: lldb-api :: api/multithreaded/TestMultithreaded.py 388.29s: lldb-api :: types/TestIntegerTypes.py 466.77s: lldb-api :: lang/objc/foundation/TestFoundationDisassembly.py 570.86s: lldb-api :: types/TestIntegerTypesExpr.py

Hide Details

Tests Times: -------------------------------------------------------------------------- [ Range ] :: [ Percentage ] :: [ Count ] -------------------------------------------------------------------------- [ 0s, 50s) :: [************************************ ] :: [1646/1785] [ 50s,100s) :: [** ] :: [ 115/1785] [100s,150s) :: [ ] :: [ 13/1785] [150s,200s) :: [ ] :: [ 2/1785] [200s,250s) :: [ ] :: [ 4/1785] [250s,300s) :: [ ] :: [ 2/1785] [300s,350s) :: [ ] :: [ 0/1785] [350s,400s) :: [ ] :: [ 0/1785] [400s,450s) :: [ ] :: [ 1/1785] [450s,500s) :: [ ] :: [ 1/1785] [500s,550s) :: [ ] :: [ 0/1785] [550s,600s) :: [ ] :: [ 1/1785] Expected Passes : 1635 Expected Failures : 6 Unsupported Tests : 141 Unexpected Failures: 3 FAILED: tools/lldb/test/CMakeFiles/check-lldb-lit cd /Users/buildslave/jenkins/workspace/lldb-cmake-sanitized/lldb-build/tools/lldb/test && /usr/bin/python /Users/buildslave/jenkins/workspace/lldb-cmake-sanitized/lldb-build/./bin/llvm-lit -v --time-tests --shuffle --xunit-xml-output=/Users/buildslave/jenkins/workspace/lldb-cmake-sanitized/test/results.xml -v --timeout 1200 /Users/buildslave/jenkins/workspace/lldb-cmake-sanitized/lldb-build/tools/lldb/test ninja: build stopped: subcommand failed. Command failed Command: ['/usr/bin/env', 'TERM=vt100', '/usr/local/bin/ninja', '-v', 'check-lldb'] [Pipeline] } [Pipeline] // timeout [Pipeline] } [Pipeline] // stage [Pipeline] stage [Pipeline] { (Declarative: Post Actions) [Pipeline] scanForIssues No credentials specified [Clang (LLVM based)] Sleeping for 5 seconds due to JENKINS-32191... [Clang (LLVM based)] Parsing console log (workspace: '/Users/buildslave/jenkins/workspace/lldb-cmake-sanitized') [Pipeline] junit Recording test results [Pipeline] } [Pipeline] // stage [Pipeline] } [Pipeline] // withEnv [Pipeline] } [Pipeline] // node [Pipeline] End of Pipeline [BFA] Scanning build for known causes... [BFA] Found failure cause(s): [BFA] Regression test failed from category Test [BFA] Ninja target failed from category Compile [BFA] Done. 0s ERROR: script returned exit code 1 Finished: FAILURE