Console Output

Skipping 8,333 KB.. Full Log

Hide Details

PASS: LLDB (/Users/buildslave/jenkins/workspace/lldb-cmake-sanitized/lldb-build/bin/clang-10-x86_64) :: test_python_dwarf (TestThreadStepOut.ThreadStepOutTestCase) UNSUPPORTED: LLDB (/Users/buildslave/jenkins/workspace/lldb-cmake-sanitized/lldb-build/bin/clang-10-x86_64) :: test_python_dwo (TestThreadStepOut.ThreadStepOutTestCase) (test case does not fall in any category of interest for this run) runCmd: settings set symbols.enable-external-lookup false output:

Hide Details

runCmd: settings set plugin.process.gdb-remote.packet-timeout 60 output:

Hide Details

runCmd: settings set symbols.clang-modules-cache-path "/Users/buildslave/jenkins/workspace/lldb-cmake-sanitized/lldb-build/lldb-test-build.noindex/module-cache-lldb/lldb-api" output:

Hide Details

runCmd: settings set use-color false output:

Hide Details

runCmd: settings set target.env-vars ASAN_OPTIONS=detect_stack_use_after_return=1 DYLD_INSERT_LIBRARIES=/Users/buildslave/jenkins/workspace/lldb-cmake-sanitized/host-compiler/lib/clang/11.0.0/lib/darwin/libclang_rt.asan_osx_dynamic.dylib output:

Hide Details

runCmd: settings set target.env-vars ASAN_OPTIONS=detect_stack_use_after_return=1 DYLD_INSERT_LIBRARIES=/Users/buildslave/jenkins/workspace/lldb-cmake-sanitized/host-compiler/lib/clang/11.0.0/lib/darwin/libclang_rt.asan_osx_dynamic.dylib output:

Hide Details

FAIL: LLDB (/Users/buildslave/jenkins/workspace/lldb-cmake-sanitized/lldb-build/bin/clang-10-x86_64) :: test_python_gmodules (TestThreadStepOut.ThreadStepOutTestCase) <bound method SBProcess.Kill of <lldb.SBProcess; proxy of <Swig Object of type 'lldb::SBProcess *' at 0x11e860300> >>: success

Hide Details

runCmd: settings set symbols.enable-external-lookup false output:

Hide Details

runCmd: settings set plugin.process.gdb-remote.packet-timeout 60 output:

Hide Details

runCmd: settings set symbols.clang-modules-cache-path "/Users/buildslave/jenkins/workspace/lldb-cmake-sanitized/lldb-build/lldb-test-build.noindex/module-cache-lldb/lldb-api" output:

Hide Details

runCmd: settings set use-color false output:

Hide Details

runCmd: settings set target.env-vars ASAN_OPTIONS=detect_stack_use_after_return=1 DYLD_INSERT_LIBRARIES=/Users/buildslave/jenkins/workspace/lldb-cmake-sanitized/host-compiler/lib/clang/11.0.0/lib/darwin/libclang_rt.asan_osx_dynamic.dylib output:

Hide Details

runCmd: settings set target.env-vars ASAN_OPTIONS=detect_stack_use_after_return=1 DYLD_INSERT_LIBRARIES=/Users/buildslave/jenkins/workspace/lldb-cmake-sanitized/host-compiler/lib/clang/11.0.0/lib/darwin/libclang_rt.asan_osx_dynamic.dylib output:

Hide Details

runCmd: thread select 2 output:

Hide Details

runCmd: thread step-out -m all-threads output: Process 16580 stopped * thread #2, stop reason = step out

Hide Details

frame #0: 0x0000000100000b9e a.out`thread_func() at main.cpp:30:5 27 pseudo_barrier_wait(g_barrier); 28 29 // Do something -> 30 step_out_of_here(); // Expect to stop here after step-out (clang) ^ 31 32 // Return 33 return NULL; // Expect to stop here after step-out (icc and gcc; arm64)

Hide Details

Hide Details

Hide Details

runCmd: process status output: Process 16580 stopped * thread #2, stop reason = step out

Hide Details

frame #0: 0x0000000100000b9e a.out`thread_func() at main.cpp:30:5 27 pseudo_barrier_wait(g_barrier); 28 29 // Do something -> 30 step_out_of_here(); // Expect to stop here after step-out (clang) ^ 31 32 // Return 33 return NULL; // Expect to stop here after step-out (icc and gcc; arm64)

Hide Details

Hide Details

Expecting sub string: stop reason = step out Matched

Hide Details

runCmd: thread list output: Process 16580 stopped thread #1: tid = 0x306705, 0x00007fff77c3536a libsystem_kernel.dylib`__ulock_wait + 10, queue = 'com.apple.main-thread' * thread #2: tid = 0x306794, 0x0000000100000b9e a.out`thread_func() at main.cpp:30:5, stop reason = step out

Hide Details

thread #3: tid = 0x306795, 0x0000000100000b9e a.out`thread_func() at main.cpp:30:5

Hide Details

Hide Details

Expecting sub string: * thread #2 Matched

Hide Details

runCmd: thread backtrace all output: thread #1, queue = 'com.apple.main-thread' frame #0: 0x00007fff77c3536a libsystem_kernel.dylib`__ulock_wait + 10 frame #1: 0x00007fff77cf070b libsystem_pthread.dylib`_pthread_join + 356 frame #2: 0x00007fff7521a978 libc++.1.dylib`std::__1::thread::join() + 24 frame #3: 0x0000000100000c62 a.out`main at main.cpp:46:14 frame #4: 0x00007fff77afa085 libdyld.dylib`start + 1 * thread #2, stop reason = step out

Hide Details

* frame #0: 0x0000000100000b9e a.out`thread_func() at main.cpp:30:5 frame #1: 0x0000000100001ad7 a.out`decltype(__f=0x00006020000000d8)()>(fp)()) std::__1::__invoke<void* (*)()>(void* (*&&)()) at type_traits:3539:1 frame #2: 0x0000000100001a45 a.out`void std::__1::__thread_execute<std::__1::unique_ptr<std::__1::__thread_struct, std::__1::default_delete<std::__1::__thread_struct> >, void* (*)()>(__t=size=2, (null)=__tuple_indices<> @ 0x000070000fdf0eb8)()>&, std::__1::__tuple_indices<>) at thread:273:5 frame #3: 0x0000000100001266 a.out`void* std::__1::__thread_proxy<std::__1::tuple<std::__1::unique_ptr<std::__1::__thread_struct, std::__1::default_delete<std::__1::__thread_struct> >, void* (*)()> >(__vp=0x00006020000000d0) at thread:284:5 frame #4: 0x00007fff77cec33d libsystem_pthread.dylib`_pthread_body + 126 frame #5: 0x00007fff77cef2a7 libsystem_pthread.dylib`_pthread_start + 70 frame #6: 0x00007fff77ceb425 libsystem_pthread.dylib`thread_start + 13 thread #3 frame #0: 0x0000000100000b9e a.out`thread_func() at main.cpp:30:5 frame #1: 0x0000000100001ad7 a.out`decltype(__f=0x0000602000000118)()>(fp)()) std::__1::__invoke<void* (*)()>(void* (*&&)()) at type_traits:3539:1 frame #2: 0x0000000100001a45 a.out`void std::__1::__thread_execute<std::__1::unique_ptr<std::__1::__thread_struct, std::__1::default_delete<std::__1::__thread_struct> >, void* (*)()>(__t=size=2, (null)=__tuple_indices<> @ 0x000070000fe73eb8)()>&, std::__1::__tuple_indices<>) at thread:273:5 frame #3: 0x0000000100001266 a.out`void* std::__1::__thread_proxy<std::__1::tuple<std::__1::unique_ptr<std::__1::__thread_struct, std::__1::default_delete<std::__1::__thread_struct> >, void* (*)()> >(__vp=0x0000602000000110) at thread:284:5 frame #4: 0x00007fff77cec33d libsystem_pthread.dylib`_pthread_body + 126 frame #5: 0x00007fff77cef2a7 libsystem_pthread.dylib`_pthread_start + 70 frame #6: 0x00007fff77ceb425 libsystem_pthread.dylib`thread_start + 13

Hide Details

Hide Details

Expecting sub string: main.cpp:30 Matched

Hide Details

<bound method SBProcess.Kill of <lldb.SBProcess; proxy of <Swig Object of type 'lldb::SBProcess *' at 0x107ba6600> >>: success

Hide Details

PASS: LLDB (/Users/buildslave/jenkins/workspace/lldb-cmake-sanitized/lldb-build/bin/clang-10-x86_64) :: test_step_all_threads_dsym (TestThreadStepOut.ThreadStepOutTestCase) runCmd: settings set symbols.enable-external-lookup false output:

Hide Details

runCmd: settings set plugin.process.gdb-remote.packet-timeout 60 output:

Hide Details

runCmd: settings set symbols.clang-modules-cache-path "/Users/buildslave/jenkins/workspace/lldb-cmake-sanitized/lldb-build/lldb-test-build.noindex/module-cache-lldb/lldb-api" output:

Hide Details

runCmd: settings set use-color false output:

Hide Details

runCmd: settings set target.env-vars ASAN_OPTIONS=detect_stack_use_after_return=1 DYLD_INSERT_LIBRARIES=/Users/buildslave/jenkins/workspace/lldb-cmake-sanitized/host-compiler/lib/clang/11.0.0/lib/darwin/libclang_rt.asan_osx_dynamic.dylib output:

Hide Details

runCmd: settings set target.env-vars ASAN_OPTIONS=detect_stack_use_after_return=1 DYLD_INSERT_LIBRARIES=/Users/buildslave/jenkins/workspace/lldb-cmake-sanitized/host-compiler/lib/clang/11.0.0/lib/darwin/libclang_rt.asan_osx_dynamic.dylib output:

Hide Details

runCmd: thread select 2 output:

Hide Details

runCmd: thread step-out -m all-threads output: Process 17294 stopped * thread #2, stop reason = step out

Hide Details

frame #0: 0x0000000100000b9e a.out`thread_func() at main.cpp:30:5 27 pseudo_barrier_wait(g_barrier); 28 29 // Do something -> 30 step_out_of_here(); // Expect to stop here after step-out (clang) ^ 31 32 // Return 33 return NULL; // Expect to stop here after step-out (icc and gcc; arm64)

Hide Details

Hide Details

Hide Details

runCmd: process status output: Process 17294 stopped * thread #2, stop reason = step out

Hide Details

frame #0: 0x0000000100000b9e a.out`thread_func() at main.cpp:30:5 27 pseudo_barrier_wait(g_barrier); 28 29 // Do something -> 30 step_out_of_here(); // Expect to stop here after step-out (clang) ^ 31 32 // Return 33 return NULL; // Expect to stop here after step-out (icc and gcc; arm64)

Hide Details

Hide Details

Expecting sub string: stop reason = step out Matched

Hide Details

runCmd: thread list output: Process 17294 stopped thread #1: tid = 0x306c3b, 0x00007fff77c3536a libsystem_kernel.dylib`__ulock_wait + 10, queue = 'com.apple.main-thread' * thread #2: tid = 0x306cb2, 0x0000000100000b9e a.out`thread_func() at main.cpp:30:5, stop reason = step out

Hide Details

thread #3: tid = 0x306cb3, 0x0000000100000b9e a.out`thread_func() at main.cpp:30:5

Hide Details

Hide Details

Expecting sub string: * thread #2 Matched

Hide Details

runCmd: thread backtrace all output: thread #1, queue = 'com.apple.main-thread' frame #0: 0x00007fff77c3536a libsystem_kernel.dylib`__ulock_wait + 10 frame #1: 0x00007fff77cf070b libsystem_pthread.dylib`_pthread_join + 356 frame #2: 0x00007fff7521a978 libc++.1.dylib`std::__1::thread::join() + 24 frame #3: 0x0000000100000c62 a.out`main at main.cpp:46:14 frame #4: 0x00007fff77afa085 libdyld.dylib`start + 1 * thread #2, stop reason = step out

Hide Details

* frame #0: 0x0000000100000b9e a.out`thread_func() at main.cpp:30:5 frame #1: 0x0000000100001ad7 a.out`decltype(__f=0x00006020000000d8)()>(fp)()) std::__1::__invoke<void* (*)()>(void* (*&&)()) at type_traits:3539:1 frame #2: 0x0000000100001a45 a.out`void std::__1::__thread_execute<std::__1::unique_ptr<std::__1::__thread_struct, std::__1::default_delete<std::__1::__thread_struct> >, void* (*)()>(__t=size=2, (null)=__tuple_indices<> @ 0x000070000c51deb8)()>&, std::__1::__tuple_indices<>) at thread:273:5 frame #3: 0x0000000100001266 a.out`void* std::__1::__thread_proxy<std::__1::tuple<std::__1::unique_ptr<std::__1::__thread_struct, std::__1::default_delete<std::__1::__thread_struct> >, void* (*)()> >(__vp=0x00006020000000d0) at thread:284:5 frame #4: 0x00007fff77cec33d libsystem_pthread.dylib`_pthread_body + 126 frame #5: 0x00007fff77cef2a7 libsystem_pthread.dylib`_pthread_start + 70 frame #6: 0x00007fff77ceb425 libsystem_pthread.dylib`thread_start + 13 thread #3 frame #0: 0x0000000100000b9e a.out`thread_func() at main.cpp:30:5 frame #1: 0x0000000100001ad7 a.out`decltype(__f=0x0000602000000118)()>(fp)()) std::__1::__invoke<void* (*)()>(void* (*&&)()) at type_traits:3539:1 frame #2: 0x0000000100001a45 a.out`void std::__1::__thread_execute<std::__1::unique_ptr<std::__1::__thread_struct, std::__1::default_delete<std::__1::__thread_struct> >, void* (*)()>(__t=size=2, (null)=__tuple_indices<> @ 0x000070000c5a0eb8)()>&, std::__1::__tuple_indices<>) at thread:273:5 frame #3: 0x0000000100001266 a.out`void* std::__1::__thread_proxy<std::__1::tuple<std::__1::unique_ptr<std::__1::__thread_struct, std::__1::default_delete<std::__1::__thread_struct> >, void* (*)()> >(__vp=0x0000602000000110) at thread:284:5 frame #4: 0x00007fff77cec33d libsystem_pthread.dylib`_pthread_body + 126 frame #5: 0x00007fff77cef2a7 libsystem_pthread.dylib`_pthread_start + 70 frame #6: 0x00007fff77ceb425 libsystem_pthread.dylib`thread_start + 13

Hide Details

Hide Details

Expecting sub string: main.cpp:30 Matched

Hide Details

<bound method SBProcess.Kill of <lldb.SBProcess; proxy of <Swig Object of type 'lldb::SBProcess *' at 0x11e8603f0> >>: success

Hide Details

PASS: LLDB (/Users/buildslave/jenkins/workspace/lldb-cmake-sanitized/lldb-build/bin/clang-10-x86_64) :: test_step_all_threads_dwarf (TestThreadStepOut.ThreadStepOutTestCase) UNSUPPORTED: LLDB (/Users/buildslave/jenkins/workspace/lldb-cmake-sanitized/lldb-build/bin/clang-10-x86_64) :: test_step_all_threads_dwo (TestThreadStepOut.ThreadStepOutTestCase) (test case does not fall in any category of interest for this run) runCmd: settings set symbols.enable-external-lookup false output:

Hide Details

runCmd: settings set plugin.process.gdb-remote.packet-timeout 60 output:

Hide Details

runCmd: settings set symbols.clang-modules-cache-path "/Users/buildslave/jenkins/workspace/lldb-cmake-sanitized/lldb-build/lldb-test-build.noindex/module-cache-lldb/lldb-api" output:

Hide Details

runCmd: settings set use-color false output:

Hide Details

runCmd: settings set target.env-vars ASAN_OPTIONS=detect_stack_use_after_return=1 DYLD_INSERT_LIBRARIES=/Users/buildslave/jenkins/workspace/lldb-cmake-sanitized/host-compiler/lib/clang/11.0.0/lib/darwin/libclang_rt.asan_osx_dynamic.dylib output:

Hide Details

runCmd: settings set target.env-vars ASAN_OPTIONS=detect_stack_use_after_return=1 DYLD_INSERT_LIBRARIES=/Users/buildslave/jenkins/workspace/lldb-cmake-sanitized/host-compiler/lib/clang/11.0.0/lib/darwin/libclang_rt.asan_osx_dynamic.dylib output:

Hide Details

runCmd: thread select 2 output:

Hide Details

runCmd: thread step-out -m all-threads output: Process 17685 stopped * thread #2, stop reason = step out

Hide Details

frame #0: 0x0000000100000b9e a.out`thread_func() at main.cpp:30:5 27 pseudo_barrier_wait(g_barrier); 28 29 // Do something -> 30 step_out_of_here(); // Expect to stop here after step-out (clang) ^ 31 32 // Return 33 return NULL; // Expect to stop here after step-out (icc and gcc; arm64)

Hide Details

Hide Details

Hide Details

runCmd: process status output: Process 17685 stopped * thread #2, stop reason = step out

Hide Details

frame #0: 0x0000000100000b9e a.out`thread_func() at main.cpp:30:5 27 pseudo_barrier_wait(g_barrier); 28 29 // Do something -> 30 step_out_of_here(); // Expect to stop here after step-out (clang) ^ 31 32 // Return 33 return NULL; // Expect to stop here after step-out (icc and gcc; arm64)

Hide Details

Hide Details

Expecting sub string: stop reason = step out Matched

Hide Details

runCmd: thread list output: Process 17685 stopped thread #1: tid = 0x306f68, 0x00007fff77c3536a libsystem_kernel.dylib`__ulock_wait + 10, queue = 'com.apple.main-thread' * thread #2: tid = 0x307003, 0x0000000100000b9e a.out`thread_func() at main.cpp:30:5, stop reason = step out

Hide Details

thread #3: tid = 0x307004, 0x0000000100000b9e a.out`thread_func() at main.cpp:30:5

Hide Details

Hide Details

Expecting sub string: * thread #2 Matched

Hide Details

runCmd: thread backtrace all output: thread #1, queue = 'com.apple.main-thread' frame #0: 0x00007fff77c3536a libsystem_kernel.dylib`__ulock_wait + 10 frame #1: 0x00007fff77cf070b libsystem_pthread.dylib`_pthread_join + 356 frame #2: 0x00007fff7521a978 libc++.1.dylib`std::__1::thread::join() + 24 frame #3: 0x0000000100000c62 a.out`main at main.cpp:46:14 frame #4: 0x00007fff77afa085 libdyld.dylib`start + 1 * thread #2, stop reason = step out

Hide Details

* frame #0: 0x0000000100000b9e a.out`thread_func() at main.cpp:30:5 frame #1: 0x0000000100001ad7 a.out`decltype(__f=0x00006020000000d8)()>(fp)()) std::__1::__invoke<void* (*)()>(void* (*&&)()) at type_traits:3539:1 frame #2: 0x0000000100001a45 a.out`void std::__1::__thread_execute<std::__1::unique_ptr<std::__1::__thread_struct, std::__1::default_delete<std::__1::__thread_struct> >, void* (*)()>(__t=size=2, (null)=__tuple_indices<> @ 0x00007000007b4eb8)()>&, std::__1::__tuple_indices<>) at thread:273:5 frame #3: 0x0000000100001266 a.out`void* std::__1::__thread_proxy<std::__1::tuple<std::__1::unique_ptr<std::__1::__thread_struct, std::__1::default_delete<std::__1::__thread_struct> >, void* (*)()> >(__vp=0x00006020000000d0) at thread:284:5 frame #4: 0x00007fff77cec33d libsystem_pthread.dylib`_pthread_body + 126 frame #5: 0x00007fff77cef2a7 libsystem_pthread.dylib`_pthread_start + 70 frame #6: 0x00007fff77ceb425 libsystem_pthread.dylib`thread_start + 13 thread #3 frame #0: 0x0000000100000b9e a.out`thread_func() at main.cpp:30:5 frame #1: 0x0000000100001ad7 a.out`decltype(__f=0x0000602000000118)()>(fp)()) std::__1::__invoke<void* (*)()>(void* (*&&)()) at type_traits:3539:1 frame #2: 0x0000000100001a45 a.out`void std::__1::__thread_execute<std::__1::unique_ptr<std::__1::__thread_struct, std::__1::default_delete<std::__1::__thread_struct> >, void* (*)()>(__t=size=2, (null)=__tuple_indices<> @ 0x0000700000837eb8)()>&, std::__1::__tuple_indices<>) at thread:273:5 frame #3: 0x0000000100001266 a.out`void* std::__1::__thread_proxy<std::__1::tuple<std::__1::unique_ptr<std::__1::__thread_struct, std::__1::default_delete<std::__1::__thread_struct> >, void* (*)()> >(__vp=0x0000602000000110) at thread:284:5 frame #4: 0x00007fff77cec33d libsystem_pthread.dylib`_pthread_body + 126 frame #5: 0x00007fff77cef2a7 libsystem_pthread.dylib`_pthread_start + 70 frame #6: 0x00007fff77ceb425 libsystem_pthread.dylib`thread_start + 13

Hide Details

Hide Details

Expecting sub string: main.cpp:30 Matched

Hide Details

<bound method SBProcess.Kill of <lldb.SBProcess; proxy of <Swig Object of type 'lldb::SBProcess *' at 0x107bba0c0> >>: success

Hide Details

PASS: LLDB (/Users/buildslave/jenkins/workspace/lldb-cmake-sanitized/lldb-build/bin/clang-10-x86_64) :: test_step_all_threads_gmodules (TestThreadStepOut.ThreadStepOutTestCase) runCmd: settings set symbols.enable-external-lookup false output:

Hide Details

runCmd: settings set plugin.process.gdb-remote.packet-timeout 60 output:

Hide Details

runCmd: settings set symbols.clang-modules-cache-path "/Users/buildslave/jenkins/workspace/lldb-cmake-sanitized/lldb-build/lldb-test-build.noindex/module-cache-lldb/lldb-api" output:

Hide Details

runCmd: settings set use-color false output:

Hide Details

runCmd: settings set target.env-vars ASAN_OPTIONS=detect_stack_use_after_return=1 DYLD_INSERT_LIBRARIES=/Users/buildslave/jenkins/workspace/lldb-cmake-sanitized/host-compiler/lib/clang/11.0.0/lib/darwin/libclang_rt.asan_osx_dynamic.dylib output:

Hide Details

runCmd: settings set target.env-vars ASAN_OPTIONS=detect_stack_use_after_return=1 DYLD_INSERT_LIBRARIES=/Users/buildslave/jenkins/workspace/lldb-cmake-sanitized/host-compiler/lib/clang/11.0.0/lib/darwin/libclang_rt.asan_osx_dynamic.dylib output:

Hide Details

runCmd: thread select 2 output:

Hide Details

runCmd: thread step-out -m this-thread output: Process 18386 stopped * thread #2, stop reason = step out

Hide Details

frame #0: 0x0000000100000b9e a.out`thread_func() at main.cpp:30:5 27 pseudo_barrier_wait(g_barrier); 28 29 // Do something -> 30 step_out_of_here(); // Expect to stop here after step-out (clang) ^ 31 32 // Return 33 return NULL; // Expect to stop here after step-out (icc and gcc; arm64) thread #3, stop reason = breakpoint 1.1 frame #0: 0x0000000100000b44 a.out`step_out_of_here() at main.cpp:20:10 17 volatile int g_test = 0; 18 19 void step_out_of_here() { -> 20 g_test += 5; // Set breakpoint here ^ 21 } 22 23 void *

Hide Details

Hide Details

Hide Details

runCmd: process status output: Process 18386 stopped * thread #2, stop reason = step out

Hide Details

frame #0: 0x0000000100000b9e a.out`thread_func() at main.cpp:30:5 27 pseudo_barrier_wait(g_barrier); 28 29 // Do something -> 30 step_out_of_here(); // Expect to stop here after step-out (clang) ^ 31 32 // Return 33 return NULL; // Expect to stop here after step-out (icc and gcc; arm64) thread #3, stop reason = breakpoint 1.1 frame #0: 0x0000000100000b44 a.out`step_out_of_here() at main.cpp:20:10 17 volatile int g_test = 0; 18 19 void step_out_of_here() { -> 20 g_test += 5; // Set breakpoint here ^ 21 } 22 23 void *

Hide Details

Hide Details

Expecting sub string: stop reason = step out Matched

Hide Details

runCmd: thread list output: Process 18386 stopped thread #1: tid = 0x307522, 0x00007fff77c32d32 libsystem_kernel.dylib`swtch_pri + 10, queue = 'com.apple.main-thread' * thread #2: tid = 0x307627, 0x0000000100000b9e a.out`thread_func() at main.cpp:30:5, stop reason = step out

Hide Details

thread #3: tid = 0x307628, 0x0000000100000b44 a.out`step_out_of_here() at main.cpp:20:10, stop reason = breakpoint 1.1

Hide Details

Hide Details

Expecting sub string: * thread #2 Matched

Hide Details

runCmd: thread backtrace all output: thread #1, queue = 'com.apple.main-thread' frame #0: 0x00007fff77c32d32 libsystem_kernel.dylib`swtch_pri + 10 frame #1: 0x00007fff77ceeef3 libsystem_pthread.dylib`sched_yield + 11 frame #2: 0x0000000100145bc9 libclang_rt.asan_osx_dynamic.dylib`__sanitizer::internal_sched_yield() + 9 frame #3: 0x0000000100128b55 libclang_rt.asan_osx_dynamic.dylib`wrap_pthread_create + 277 frame #4: 0x00000001000011e4 a.out`std::__1::__libcpp_thread_create(__t=0x00007ffeefbff498, __func=(a.out`void* std::__1::__thread_proxy<std::__1::tuple<std::__1::unique_ptr<std::__1::__thread_struct, std::__1::default_delete<std::__1::__thread_struct> >, void* (*)()> >(void*) at thread:279), __arg=0x0000602000000110)(void*), void*) at __threading_support:394:10 frame #5: 0x000000010000101b a.out`std::__1::thread::thread<void* (&)(), void>(this=0x00007ffeefbff498, __f=0x0000000100000b60)()) at thread:300:16 frame #6: 0x0000000100000d1d a.out`std::__1::thread::thread<void* (&)(), void>(this=0x00007ffeefbff498, __f=0x0000000100000b60)()) at thread:292:1 frame #7: 0x0000000100000c54 a.out`main at main.cpp:43:17 frame #8: 0x00007fff77afa085 libdyld.dylib`start + 1 * thread #2, stop reason = step out

Hide Details

* frame #0: 0x0000000100000b9e a.out`thread_func() at main.cpp:30:5 frame #1: 0x0000000100001ad7 a.out`decltype(__f=0x00006020000000d8)()>(fp)()) std::__1::__invoke<void* (*)()>(void* (*&&)()) at type_traits:3539:1 frame #2: 0x0000000100001a45 a.out`void std::__1::__thread_execute<std::__1::unique_ptr<std::__1::__thread_struct, std::__1::default_delete<std::__1::__thread_struct> >, void* (*)()>(__t=size=2, (null)=__tuple_indices<> @ 0x000070000a75aeb8)()>&, std::__1::__tuple_indices<>) at thread:273:5 frame #3: 0x0000000100001266 a.out`void* std::__1::__thread_proxy<std::__1::tuple<std::__1::unique_ptr<std::__1::__thread_struct, std::__1::default_delete<std::__1::__thread_struct> >, void* (*)()> >(__vp=0x00006020000000d0) at thread:284:5 frame #4: 0x00007fff77cec33d libsystem_pthread.dylib`_pthread_body + 126 frame #5: 0x00007fff77cef2a7 libsystem_pthread.dylib`_pthread_start + 70 frame #6: 0x00007fff77ceb425 libsystem_pthread.dylib`thread_start + 13 thread #3, stop reason = breakpoint 1.1 frame #0: 0x0000000100000b44 a.out`step_out_of_here() at main.cpp:20:10 frame #1: 0x0000000100000b9e a.out`thread_func() at main.cpp:30:5 frame #2: 0x0000000100001ad7 a.out`decltype(__f=0x0000602000000118)()>(fp)()) std::__1::__invoke<void* (*)()>(void* (*&&)()) at type_traits:3539:1 frame #3: 0x0000000100001a45 a.out`void std::__1::__thread_execute<std::__1::unique_ptr<std::__1::__thread_struct, std::__1::default_delete<std::__1::__thread_struct> >, void* (*)()>(__t=size=2, (null)=__tuple_indices<> @ 0x000070000a7ddeb8)()>&, std::__1::__tuple_indices<>) at thread:273:5 frame #4: 0x0000000100001266 a.out`void* std::__1::__thread_proxy<std::__1::tuple<std::__1::unique_ptr<std::__1::__thread_struct, std::__1::default_delete<std::__1::__thread_struct> >, void* (*)()> >(__vp=0x0000602000000110) at thread:284:5 frame #5: 0x00007fff77cec33d libsystem_pthread.dylib`_pthread_body + 126 frame #6: 0x00007fff77cef2a7 libsystem_pthread.dylib`_pthread_start + 70 frame #7: 0x00007fff77ceb425 libsystem_pthread.dylib`thread_start + 13

Hide Details

Hide Details

Expecting sub string: main.cpp:30 Matched

Hide Details

Expecting sub string: main.cpp:20 Matched

Hide Details

<bound method SBProcess.Kill of <lldb.SBProcess; proxy of <Swig Object of type 'lldb::SBProcess *' at 0x11e860300> >>: success

Hide Details

PASS: LLDB (/Users/buildslave/jenkins/workspace/lldb-cmake-sanitized/lldb-build/bin/clang-10-x86_64) :: test_step_single_thread_dsym (TestThreadStepOut.ThreadStepOutTestCase) runCmd: settings set symbols.enable-external-lookup false output:

Hide Details

runCmd: settings set plugin.process.gdb-remote.packet-timeout 60 output:

Hide Details

runCmd: settings set symbols.clang-modules-cache-path "/Users/buildslave/jenkins/workspace/lldb-cmake-sanitized/lldb-build/lldb-test-build.noindex/module-cache-lldb/lldb-api" output:

Hide Details

runCmd: settings set use-color false output:

Hide Details

runCmd: settings set target.env-vars ASAN_OPTIONS=detect_stack_use_after_return=1 DYLD_INSERT_LIBRARIES=/Users/buildslave/jenkins/workspace/lldb-cmake-sanitized/host-compiler/lib/clang/11.0.0/lib/darwin/libclang_rt.asan_osx_dynamic.dylib output:

Hide Details

runCmd: settings set target.env-vars ASAN_OPTIONS=detect_stack_use_after_return=1 DYLD_INSERT_LIBRARIES=/Users/buildslave/jenkins/workspace/lldb-cmake-sanitized/host-compiler/lib/clang/11.0.0/lib/darwin/libclang_rt.asan_osx_dynamic.dylib output:

Hide Details

runCmd: thread select 2 output:

Hide Details

runCmd: thread step-out -m this-thread output: Process 19270 stopped * thread #2, stop reason = step out

Hide Details

frame #0: 0x0000000100000b9e a.out`thread_func() at main.cpp:30:5 27 pseudo_barrier_wait(g_barrier); 28 29 // Do something -> 30 step_out_of_here(); // Expect to stop here after step-out (clang) ^ 31 32 // Return 33 return NULL; // Expect to stop here after step-out (icc and gcc; arm64) thread #3, stop reason = breakpoint 1.1 frame #0: 0x0000000100000b44 a.out`step_out_of_here() at main.cpp:20:10 17 volatile int g_test = 0; 18 19 void step_out_of_here() { -> 20 g_test += 5; // Set breakpoint here ^ 21 } 22 23 void *

Hide Details

Hide Details

Hide Details

runCmd: process status output: Process 19270 stopped * thread #2, stop reason = step out

Hide Details

frame #0: 0x0000000100000b9e a.out`thread_func() at main.cpp:30:5 27 pseudo_barrier_wait(g_barrier); 28 29 // Do something -> 30 step_out_of_here(); // Expect to stop here after step-out (clang) ^ 31 32 // Return 33 return NULL; // Expect to stop here after step-out (icc and gcc; arm64) thread #3, stop reason = breakpoint 1.1 frame #0: 0x0000000100000b44 a.out`step_out_of_here() at main.cpp:20:10 17 volatile int g_test = 0; 18 19 void step_out_of_here() { -> 20 g_test += 5; // Set breakpoint here ^ 21 } 22 23 void *

Hide Details

Hide Details

Expecting sub string: stop reason = step out Matched

Hide Details

runCmd: thread list output: Process 19270 stopped thread #1: tid = 0x307b4a, 0x00007fff77c3536a libsystem_kernel.dylib`__ulock_wait + 10, queue = 'com.apple.main-thread' * thread #2: tid = 0x307bd1, 0x0000000100000b9e a.out`thread_func() at main.cpp:30:5, stop reason = step out

Hide Details

thread #3: tid = 0x307bd2, 0x0000000100000b44 a.out`step_out_of_here() at main.cpp:20:10, stop reason = breakpoint 1.1

Hide Details

Hide Details

Expecting sub string: * thread #2 Matched

Hide Details

runCmd: thread backtrace all output: thread #1, queue = 'com.apple.main-thread' frame #0: 0x00007fff77c3536a libsystem_kernel.dylib`__ulock_wait + 10 frame #1: 0x00007fff77cf070b libsystem_pthread.dylib`_pthread_join + 356 frame #2: 0x00007fff7521a978 libc++.1.dylib`std::__1::thread::join() + 24 frame #3: 0x0000000100000c62 a.out`main at main.cpp:46:14 frame #4: 0x00007fff77afa085 libdyld.dylib`start + 1 * thread #2, stop reason = step out

Hide Details

* frame #0: 0x0000000100000b9e a.out`thread_func() at main.cpp:30:5 frame #1: 0x0000000100001ad7 a.out`decltype(__f=0x00006020000000d8)()>(fp)()) std::__1::__invoke<void* (*)()>(void* (*&&)()) at type_traits:3539:1 frame #2: 0x0000000100001a45 a.out`void std::__1::__thread_execute<std::__1::unique_ptr<std::__1::__thread_struct, std::__1::default_delete<std::__1::__thread_struct> >, void* (*)()>(__t=size=2, (null)=__tuple_indices<> @ 0x0000700000f68eb8)()>&, std::__1::__tuple_indices<>) at thread:273:5 frame #3: 0x0000000100001266 a.out`void* std::__1::__thread_proxy<std::__1::tuple<std::__1::unique_ptr<std::__1::__thread_struct, std::__1::default_delete<std::__1::__thread_struct> >, void* (*)()> >(__vp=0x00006020000000d0) at thread:284:5 frame #4: 0x00007fff77cec33d libsystem_pthread.dylib`_pthread_body + 126 frame #5: 0x00007fff77cef2a7 libsystem_pthread.dylib`_pthread_start + 70 frame #6: 0x00007fff77ceb425 libsystem_pthread.dylib`thread_start + 13 thread #3, stop reason = breakpoint 1.1 frame #0: 0x0000000100000b44 a.out`step_out_of_here() at main.cpp:20:10 frame #1: 0x0000000100000b9e a.out`thread_func() at main.cpp:30:5 frame #2: 0x0000000100001ad7 a.out`decltype(__f=0x0000602000000118)()>(fp)()) std::__1::__invoke<void* (*)()>(void* (*&&)()) at type_traits:3539:1 frame #3: 0x0000000100001a45 a.out`void std::__1::__thread_execute<std::__1::unique_ptr<std::__1::__thread_struct, std::__1::default_delete<std::__1::__thread_struct> >, void* (*)()>(__t=size=2, (null)=__tuple_indices<> @ 0x0000700000febeb8)()>&, std::__1::__tuple_indices<>) at thread:273:5 frame #4: 0x0000000100001266 a.out`void* std::__1::__thread_proxy<std::__1::tuple<std::__1::unique_ptr<std::__1::__thread_struct, std::__1::default_delete<std::__1::__thread_struct> >, void* (*)()> >(__vp=0x0000602000000110) at thread:284:5 frame #5: 0x00007fff77cec33d libsystem_pthread.dylib`_pthread_body + 126 frame #6: 0x00007fff77cef2a7 libsystem_pthread.dylib`_pthread_start + 70 frame #7: 0x00007fff77ceb425 libsystem_pthread.dylib`thread_start + 13

Hide Details

Hide Details

Expecting sub string: main.cpp:30 Matched

Hide Details

Expecting sub string: main.cpp:20 Matched

Hide Details

<bound method SBProcess.Kill of <lldb.SBProcess; proxy of <Swig Object of type 'lldb::SBProcess *' at 0x11e1d07e0> >>: success

Hide Details

PASS: LLDB (/Users/buildslave/jenkins/workspace/lldb-cmake-sanitized/lldb-build/bin/clang-10-x86_64) :: test_step_single_thread_dwarf (TestThreadStepOut.ThreadStepOutTestCase) UNSUPPORTED: LLDB (/Users/buildslave/jenkins/workspace/lldb-cmake-sanitized/lldb-build/bin/clang-10-x86_64) :: test_step_single_thread_dwo (TestThreadStepOut.ThreadStepOutTestCase) (test case does not fall in any category of interest for this run) runCmd: settings set symbols.enable-external-lookup false output:

Hide Details

runCmd: settings set plugin.process.gdb-remote.packet-timeout 60 output:

Hide Details

runCmd: settings set symbols.clang-modules-cache-path "/Users/buildslave/jenkins/workspace/lldb-cmake-sanitized/lldb-build/lldb-test-build.noindex/module-cache-lldb/lldb-api" output:

Hide Details

runCmd: settings set use-color false output:

Hide Details

runCmd: settings set target.env-vars ASAN_OPTIONS=detect_stack_use_after_return=1 DYLD_INSERT_LIBRARIES=/Users/buildslave/jenkins/workspace/lldb-cmake-sanitized/host-compiler/lib/clang/11.0.0/lib/darwin/libclang_rt.asan_osx_dynamic.dylib output:

Hide Details

runCmd: settings set target.env-vars ASAN_OPTIONS=detect_stack_use_after_return=1 DYLD_INSERT_LIBRARIES=/Users/buildslave/jenkins/workspace/lldb-cmake-sanitized/host-compiler/lib/clang/11.0.0/lib/darwin/libclang_rt.asan_osx_dynamic.dylib output:

Hide Details

runCmd: thread select 2 output:

Hide Details

runCmd: thread step-out -m this-thread output: Process 19857 stopped * thread #2, stop reason = step out

Hide Details

frame #0: 0x0000000100000b9e a.out`thread_func() at main.cpp:30:5 27 pseudo_barrier_wait(g_barrier); 28 29 // Do something -> 30 step_out_of_here(); // Expect to stop here after step-out (clang) ^ 31 32 // Return 33 return NULL; // Expect to stop here after step-out (icc and gcc; arm64) thread #3, stop reason = breakpoint 1.1 frame #0: 0x0000000100000b44 a.out`step_out_of_here() at main.cpp:20:10 17 volatile int g_test = 0; 18 19 void step_out_of_here() { -> 20 g_test += 5; // Set breakpoint here ^ 21 } 22 23 void *

Hide Details

Hide Details

Hide Details

runCmd: process status output: Process 19857 stopped * thread #2, stop reason = step out

Hide Details

frame #0: 0x0000000100000b9e a.out`thread_func() at main.cpp:30:5 27 pseudo_barrier_wait(g_barrier); 28 29 // Do something -> 30 step_out_of_here(); // Expect to stop here after step-out (clang) ^ 31 32 // Return 33 return NULL; // Expect to stop here after step-out (icc and gcc; arm64) thread #3, stop reason = breakpoint 1.1 frame #0: 0x0000000100000b44 a.out`step_out_of_here() at main.cpp:20:10 17 volatile int g_test = 0; 18 19 void step_out_of_here() { -> 20 g_test += 5; // Set breakpoint here ^ 21 } 22 23 void *

Hide Details

Hide Details

Expecting sub string: stop reason = step out Matched

Hide Details

runCmd: thread list output: Process 19857 stopped thread #1: tid = 0x307fb4, 0x00007fff77c3536a libsystem_kernel.dylib`__ulock_wait + 10, queue = 'com.apple.main-thread' * thread #2: tid = 0x30802f, 0x0000000100000b9e a.out`thread_func() at main.cpp:30:5, stop reason = step out

Hide Details

thread #3: tid = 0x308030, 0x0000000100000b44 a.out`step_out_of_here() at main.cpp:20:10, stop reason = breakpoint 1.1

Hide Details

Hide Details

Expecting sub string: * thread #2 Matched

Hide Details

runCmd: thread backtrace all output: thread #1, queue = 'com.apple.main-thread' frame #0: 0x00007fff77c3536a libsystem_kernel.dylib`__ulock_wait + 10 frame #1: 0x00007fff77cf070b libsystem_pthread.dylib`_pthread_join + 356 frame #2: 0x00007fff7521a978 libc++.1.dylib`std::__1::thread::join() + 24 frame #3: 0x0000000100000c62 a.out`main at main.cpp:46:14 frame #4: 0x00007fff77afa085 libdyld.dylib`start + 1 * thread #2, stop reason = step out

Hide Details

* frame #0: 0x0000000100000b9e a.out`thread_func() at main.cpp:30:5 frame #1: 0x0000000100001ad7 a.out`decltype(__f=0x00006020000000d8)()>(fp)()) std::__1::__invoke<void* (*)()>(void* (*&&)()) at type_traits:3539:1 frame #2: 0x0000000100001a45 a.out`void std::__1::__thread_execute<std::__1::unique_ptr<std::__1::__thread_struct, std::__1::default_delete<std::__1::__thread_struct> >, void* (*)()>(__t=size=2, (null)=__tuple_indices<> @ 0x000070000f2d6eb8)()>&, std::__1::__tuple_indices<>) at thread:273:5 frame #3: 0x0000000100001266 a.out`void* std::__1::__thread_proxy<std::__1::tuple<std::__1::unique_ptr<std::__1::__thread_struct, std::__1::default_delete<std::__1::__thread_struct> >, void* (*)()> >(__vp=0x00006020000000d0) at thread:284:5 frame #4: 0x00007fff77cec33d libsystem_pthread.dylib`_pthread_body + 126 frame #5: 0x00007fff77cef2a7 libsystem_pthread.dylib`_pthread_start + 70 frame #6: 0x00007fff77ceb425 libsystem_pthread.dylib`thread_start + 13 thread #3, stop reason = breakpoint 1.1 frame #0: 0x0000000100000b44 a.out`step_out_of_here() at main.cpp:20:10 frame #1: 0x0000000100000b9e a.out`thread_func() at main.cpp:30:5 frame #2: 0x0000000100001ad7 a.out`decltype(__f=0x0000602000000118)()>(fp)()) std::__1::__invoke<void* (*)()>(void* (*&&)()) at type_traits:3539:1 frame #3: 0x0000000100001a45 a.out`void std::__1::__thread_execute<std::__1::unique_ptr<std::__1::__thread_struct, std::__1::default_delete<std::__1::__thread_struct> >, void* (*)()>(__t=size=2, (null)=__tuple_indices<> @ 0x000070000f359eb8)()>&, std::__1::__tuple_indices<>) at thread:273:5 frame #4: 0x0000000100001266 a.out`void* std::__1::__thread_proxy<std::__1::tuple<std::__1::unique_ptr<std::__1::__thread_struct, std::__1::default_delete<std::__1::__thread_struct> >, void* (*)()> >(__vp=0x0000602000000110) at thread:284:5 frame #5: 0x00007fff77cec33d libsystem_pthread.dylib`_pthread_body + 126 frame #6: 0x00007fff77cef2a7 libsystem_pthread.dylib`_pthread_start + 70 frame #7: 0x00007fff77ceb425 libsystem_pthread.dylib`thread_start + 13

Hide Details

Hide Details

Expecting sub string: main.cpp:30 Matched

Hide Details

Expecting sub string: main.cpp:20 Matched

Hide Details

<bound method SBProcess.Kill of <lldb.SBProcess; proxy of <Swig Object of type 'lldb::SBProcess *' at 0x11e8603f0> >>: success

Hide Details

PASS: LLDB (/Users/buildslave/jenkins/workspace/lldb-cmake-sanitized/lldb-build/bin/clang-10-x86_64) :: test_step_single_thread_gmodules (TestThreadStepOut.ThreadStepOutTestCase) Restore dir to: /Users/buildslave/jenkins/workspace/lldb-cmake-sanitized/lldb-build/tools/lldb/test ====================================================================== ERROR: test_python_gmodules (TestThreadStepOut.ThreadStepOutTestCase) Test thread step out on one thread via Python API (dwarf). ---------------------------------------------------------------------- Traceback (most recent call last): File "/Users/buildslave/jenkins/workspace/lldb-cmake-sanitized/llvm-project/lldb/packages/Python/lldbsuite/test/lldbtest.py", line 1732, in test_method return attrvalue(self) File "/Users/buildslave/jenkins/workspace/lldb-cmake-sanitized/llvm-project/lldb/packages/Python/lldbsuite/test/decorators.py", line 110, in wrapper func(*args, **kwargs) File "/Users/buildslave/jenkins/workspace/lldb-cmake-sanitized/llvm-project/lldb/packages/Python/lldbsuite/test/decorators.py", line 110, in wrapper func(*args, **kwargs) File "/Users/buildslave/jenkins/workspace/lldb-cmake-sanitized/llvm-project/lldb/packages/Python/lldbsuite/test/decorators.py", line 110, in wrapper func(*args, **kwargs) File "/Users/buildslave/jenkins/workspace/lldb-cmake-sanitized/llvm-project/lldb/packages/Python/lldbsuite/test/functionalities/thread/step_out/TestThreadStepOut.py", line 64, in test_python self.step_out_test(self.step_out_with_python) File "/Users/buildslave/jenkins/workspace/lldb-cmake-sanitized/llvm-project/lldb/packages/Python/lldbsuite/test/functionalities/thread/step_out/TestThreadStepOut.py", line 148, in step_out_test bkpt_threads = lldbutil.continue_to_breakpoint(bkpt) TypeError: continue_to_breakpoint() missing 1 required positional argument: 'bkpt' Config=x86_64-/Users/buildslave/jenkins/workspace/lldb-cmake-sanitized/lldb-build/bin/clang-10 ---------------------------------------------------------------------- Ran 12 tests in 142.057s

Hide Details

RESULT: FAILED (8 passes, 0 failures, 1 errors, 3 skipped, 0 expected failures, 0 unexpected successes)

Hide Details

******************** PASS: lldb-api :: lang/cpp/virtual-overload/TestVirtualOverload.py (1338 of 1893) PASS: lldb-shell :: ScriptInterpreter/None/none.test (1339 of 1893) PASS: lldb-shell :: ObjectFile/PECOFF/uuid.yaml (1340 of 1893) PASS: lldb-unit :: Process/gdb-remote/./ProcessGdbRemoteTests/GDBRemoteClientBaseTest.SendContinueAndLateInterrupt (1341 of 1893) PASS: lldb-unit :: Editline/./EditlineTests/EditlineTestFixture.EditlineReceivesSingleLineText (1342 of 1893) PASS: lldb-unit :: Utility/./UtilityTests/ArgsTest.TestUnknownEscape (1343 of 1893) PASS: lldb-api :: lang/objcxx/cxx-bridged-po/TestObjCXXBridgedPO.py (1344 of 1893) PASS: lldb-api :: functionalities/memory/find/TestMemoryFind.py (1345 of 1893) PASS: lldb-unit :: Symbol/./SymbolTests/SymbolsTest.TerminateLocateExecutableSymbolFileForUnknownExecutableAndUnknownSymbolFile (1346 of 1893) PASS: lldb-unit :: Process/gdb-remote/./ProcessGdbRemoteTests/GDBRemoteCommunicationClientTest.GetModulesInfoInvalidResponse (1347 of 1893) PASS: lldb-unit :: ScriptInterpreter/Python/./ScriptInterpreterPythonTests/PythonDataObjectsTest.TestPythonListValueEquality (1348 of 1893) PASS: lldb-shell :: SymbolFile/DWARF/parallel-indexing-stress.s (1349 of 1893) PASS: lldb-unit :: Utility/./UtilityTests/StringListTest.InsertStringAtIndexMove (1350 of 1893) PASS: lldb-unit :: Utility/./UtilityTests/AnsiTerminal.Empty (1351 of 1893) PASS: lldb-api :: functionalities/gdb_remote_client/TestTargetXMLArch.py (1352 of 1893) PASS: lldb-shell :: SymbolFile/DWARF/deterministic-build.cpp (1353 of 1893) PASS: lldb-shell :: SymbolFile/Breakpad/line-table-mixed-path-styles.test (1354 of 1893) UNSUPPORTED: lldb-shell :: SymbolFile/target-symbols-add-unwind.test (1355 of 1893) PASS: lldb-api :: lang/cpp/namespace/TestNamespaceLookup.py (1356 of 1893) PASS: lldb-unit :: Signals/./SignalsTests/UnixSignalsTest.Iteration (1357 of 1893) UNSUPPORTED: lldb-api :: functionalities/unwind/standard/TestStandardUnwind.py (1358 of 1893) PASS: lldb-shell :: ScriptInterpreter/None/import_module.test (1359 of 1893) PASS: lldb-api :: functionalities/data-formatter/data-formatter-proper-plurals/TestFormattersOneIsSingular.py (1360 of 1893) PASS: lldb-api :: functionalities/data-formatter/poarray/TestPrintObjectArray.py (1361 of 1893) PASS: lldb-unit :: Utility/./UtilityTests/StructuredDataTest.ParseJSONFromFile (1362 of 1893) PASS: lldb-api :: lang/c/shared_lib_stripped_symbols/TestSharedLibStrippedSymbols.py (1363 of 1893) PASS: lldb-shell :: ObjectFile/ELF/PT_LOAD-overlap-PT_TLS.yaml (1364 of 1893) PASS: lldb-api :: lang/c/modules/TestCModules.py (1365 of 1893) PASS: lldb-api :: lang/cpp/modules-import/TestCXXModulesImport.py (1366 of 1893) PASS: lldb-api :: tools/lldb-server/TestGdbRemoteThreadsInStopReply.py (1367 of 1893) PASS: lldb-unit :: Utility/./UtilityTests/UriParserTest.SchemeHostSeparator2 (1368 of 1893) PASS: lldb-api :: lang/objc/foundation/TestConstStrings.py (1369 of 1893) PASS: lldb-api :: python_api/watchpoint/watchlocation/TestTargetWatchAddress.py (1370 of 1893) PASS: lldb-api :: commands/frame/diagnose/array/TestArray.py (1371 of 1893) PASS: lldb-unit :: Utility/./UtilityTests/StringExtractorTest.GetHexU8_Extra_NoEof (1372 of 1893) PASS: lldb-unit :: ScriptInterpreter/Python/./ScriptInterpreterPythonTests/PythonDataObjectsTest.TestDictionaryResolutionWithDot (1373 of 1893) PASS: lldb-shell :: Breakpoint/debug_rnglist_offset_pair.test (1374 of 1893) PASS: lldb-shell :: Heap/heap-cstr.test (1375 of 1893) PASS: lldb-unit :: debugserver/./debugserverTests/RNBSocket.LoopBackConnectIPv4 (1376 of 1893) PASS: lldb-unit :: Utility/./UtilityTests/StringExtractorTest.InitMisc (1377 of 1893) PASS: lldb-api :: functionalities/tail_call_frames/thread_step_out_message/TestArtificialFrameStepOutMessage.py (1378 of 1893) PASS: lldb-unit :: UnwindAssembly/x86/./UnwindAssemblyx86Tests/Testx86AssemblyInspectionEngine.TestPushEDI (1379 of 1893) PASS: lldb-unit :: Target/./TargetTests/ExecutionContextTest.GetByteOrderTarget (1380 of 1893) PASS: lldb-shell :: Quit/TestQuitExitCodeHex0.test (1381 of 1893) PASS: lldb-unit :: Utility/./UtilityTests/SerializationRountripTest.SerializeDeserializeCString (1382 of 1893) PASS: lldb-shell :: ObjectFile/ELF/minidebuginfo-find-symbols.yaml (1383 of 1893) PASS: lldb-api :: functionalities/data-formatter/varscript_formatting/TestDataFormatterVarScriptFormatting.py (1384 of 1893) PASS: lldb-api :: functionalities/data-formatter/data-formatter-smart-array/TestDataFormatterSmartArray.py (1385 of 1893) PASS: lldb-shell :: Settings/TestFrameFormatNoColor.test (1386 of 1893) XFAIL: lldb-shell :: SymbolFile/DWARF/find-type-in-function.cpp (1387 of 1893) PASS: lldb-api :: functionalities/breakpoint/require_hw_breakpoints/TestRequireHWBreakpoints.py (1388 of 1893) PASS: lldb-api :: functionalities/thread/concurrent_events/TestConcurrentSignalDelayWatch.py (1389 of 1893) PASS: lldb-unit :: Process/gdb-remote/./ProcessGdbRemoteTests/GDBRemoteClientBaseTest.SendContinueAndInterrupt (1390 of 1893) PASS: lldb-api :: commands/expression/persist_objc_pointeetype/TestPersistObjCPointeeType.py (1391 of 1893) PASS: lldb-api :: functionalities/breakpoint/objc/TestObjCBreakpoints.py (1392 of 1893) PASS: lldb-api :: commands/expression/persistent_types/TestPersistentTypes.py (1393 of 1893) PASS: lldb-api :: lang/objc/foundation/TestObjCMethodsString.py (1394 of 1893) PASS: lldb-unit :: Utility/./UtilityTests/RegularExpression.CopyAssignment (1395 of 1893) PASS: lldb-unit :: Utility/./UtilityTests/StringListTest.InsertStringAtIndexOutOfBounds (1396 of 1893) PASS: lldb-api :: commands/expression/save_jit_objects/TestSaveJITObjects.py (1397 of 1893) PASS: lldb-api :: lang/objc/rdar-10967107/TestRdar10967107.py (1398 of 1893) PASS: lldb-api :: python_api/formatters/TestFormattersSBAPI.py (1399 of 1893) PASS: lldb-api :: tools/lldb-server/TestGdbRemote_qThreadStopInfo.py (1400 of 1893) PASS: lldb-shell :: SymbolFile/DWARF/find-qualified-variable.cpp (1401 of 1893) PASS: lldb-api :: commands/watchpoints/watchpoint_events/TestWatchpointEvents.py (1402 of 1893) PASS: lldb-api :: functionalities/data-formatter/data-formatter-stl/libstdcpp/unique_ptr/invalid/TestDataFormatterInvalidStdUniquePtr.py (1403 of 1893) PASS: lldb-unit :: ObjectFile/Breakpad/./ObjectFileBreakpadTests/InfoRecord.parse (1404 of 1893) UNSUPPORTED: lldb-api :: functionalities/data-formatter/data-formatter-stl/libstdcpp/unique_ptr/TestDataFormatterStdUniquePtr.py (1405 of 1893) PASS: lldb-api :: lang/cpp/incomplete-types/TestCppIncompleteTypes.py (1406 of 1893) PASS: lldb-unit :: Utility/./UtilityTests/LogChannelEnabledTest.LogThread (1407 of 1893) PASS: lldb-unit :: UnwindAssembly/x86/./UnwindAssemblyx86Tests/Testx86AssemblyInspectionEngine.TestPushEBX (1408 of 1893) PASS: lldb-shell :: Settings/TestDisableColor.test (1409 of 1893) PASS: lldb-api :: functionalities/memory-region/TestMemoryRegion.py (1410 of 1893) PASS: lldb-api :: lang/cpp/bool/TestCPPBool.py (1411 of 1893) PASS: lldb-unit :: Utility/./UtilityTests/StringExtractorTest.GetU64BigEndian (1412 of 1893) PASS: lldb-api :: functionalities/breakpoint/breakpoint_language/TestBreakpointLanguage.py (1413 of 1893) PASS: lldb-api :: types/TestDoubleTypes.py (1414 of 1893) PASS: lldb-shell :: ObjectFile/MachO/subsections.yaml (1415 of 1893) PASS: lldb-unit :: ScriptInterpreter/Python/./ScriptInterpreterPythonTests/PythonDataObjectsTest.TestGlobalNameResolutionWithDot (1416 of 1893) PASS: lldb-unit :: Utility/./UtilityTests/StringListTest.JoinMultiCharSeparator (1417 of 1893) PASS: lldb-shell :: SymbolFile/DWARF/debug-types-basic.test (1418 of 1893) PASS: lldb-api :: commands/register/register/register_command/TestRegisters.py (1419 of 1893) PASS: lldb-api :: commands/expression/call-function/TestCallStdStringFunction.py (1420 of 1893) PASS: lldb-api :: functionalities/gdb_remote_client/TestJLink6Armv7RegisterDefinition.py (1421 of 1893) PASS: lldb-unit :: Symbol/./SymbolTests/TestClangASTImporter.MetadataPropagationAfterCopying (1422 of 1893) PASS: lldb-api :: commands/expression/import_builtin_fileid/TestImportBuiltinFileID.py (1423 of 1893) PASS: lldb-api :: lang/objc/orderedset/TestOrderedSet.py (1424 of 1893) PASS: lldb-shell :: ObjectFile/MachO/symtab.yaml (1425 of 1893) PASS: lldb-unit :: Expression/./ExpressionTests/DiagnosticManagerTest.FixedExpression (1426 of 1893) PASS: lldb-api :: lang/cpp/limit-debug-info/TestWithLimitDebugInfo.py (1427 of 1893) PASS: lldb-api :: functionalities/thread/concurrent_events/TestConcurrentDelayedCrashWithBreakpointSignal.py (1428 of 1893) PASS: lldb-unit :: Host/./HostTests/MainLoopTest.Signal (1429 of 1893) PASS: lldb-unit :: Utility/./UtilityTests/FileSpecTest.GetPath (1430 of 1893) PASS: lldb-unit :: ScriptInterpreter/Python/./ScriptInterpreterPythonTests/PythonDataObjectsTest.TestBorrowedReferences (1431 of 1893) PASS: lldb-api :: types/TestShortTypeExpr.py (1432 of 1893) PASS: lldb-unit :: Utility/./UtilityTests/StreamTest.AddressPrefix (1433 of 1893) PASS: lldb-unit :: Process/gdb-remote/./ProcessGdbRemoteTests/GDBRemoteCommunicationClientTest.GetModulesInfo_UUID20 (1434 of 1893) PASS: lldb-api :: functionalities/object-file/TestImageListMultiArchitecture.py (1435 of 1893) PASS: lldb-unit :: Language/Highlighting/./HighlighterTests/HighlighterTest.Colons (1436 of 1893) PASS: lldb-api :: python_api/lldbutil/iter/TestLLDBIterator.py (1437 of 1893) PASS: lldb-api :: lang/c/local_types/TestUseClosestType.py (1438 of 1893) PASS: lldb-api :: functionalities/thread/concurrent_events/TestConcurrentDelayWatchBreak.py (1439 of 1893) UNSUPPORTED: lldb-shell :: ScriptInterpreter/Lua/breakpoint_callback.test (1440 of 1893) PASS: lldb-unit :: UnwindAssembly/x86/./UnwindAssemblyx86Tests/Testx86AssemblyInspectionEngine.TestPushR12 (1441 of 1893) PASS: lldb-unit :: Utility/./UtilityTests/StreamTeeTest.Constructor2Streams (1442 of 1893) UNSUPPORTED: lldb-api :: tools/lldb-server/platform-process-connect/TestPlatformProcessConnect.py (1443 of 1893) PASS: lldb-unit :: Process/gdb-remote/./ProcessGdbRemoteTests/GDBRemoteClientBaseTest.SendContinueAndAsyncPacket (1444 of 1893) PASS: lldb-unit :: Language/Highlighting/./HighlighterTests/HighlighterTest.ClangIdentifiers (1445 of 1893) PASS: lldb-api :: tools/lldb-server/TestAppleSimulatorOSType.py (1446 of 1893) PASS: lldb-shell :: SymbolFile/DWARF/gnu-style-compression.cpp (1447 of 1893) PASS: lldb-api :: lang/objc/objc-ivar-offsets/TestObjCIvarOffsets.py (1448 of 1893) PASS: lldb-api :: types/TestIntegerTypeExpr.py (1449 of 1893) PASS: lldb-unit :: Utility/./UtilityTests/ScalarTest.Equality (1450 of 1893) PASS: lldb-api :: functionalities/thread/concurrent_events/TestConcurrentManyBreakpoints.py (1451 of 1893) PASS: lldb-api :: commands/expression/unicode-in-variable/TestUnicodeInVariable.py (1452 of 1893) PASS: lldb-unit :: Utility/./UtilityTests/StringListTest.LongestCommonPrefixSingleElement (1453 of 1893) PASS: lldb-api :: functionalities/data-formatter/stringprinter/TestStringPrinter.py (1454 of 1893) PASS: lldb-unit :: Expression/./ExpressionTests/DiagnosticManagerTest.AppendMessageAttachToLastDiag (1455 of 1893) PASS: lldb-unit :: UnwindAssembly/x86/./UnwindAssemblyx86Tests/Testx86AssemblyInspectionEngine.TestPopRBX (1456 of 1893) PASS: lldb-api :: commands/platform/basic/TestPlatformCommand.py (1457 of 1893) PASS: lldb-api :: lang/c/inlines/TestRedefinitionsInInlines.py (1458 of 1893) PASS: lldb-unit :: Utility/./UtilityTests/UriParserTest.MinimalPath (1459 of 1893) PASS: lldb-api :: commands/expression/persistent_variables/TestPersistentVariables.py (1460 of 1893) PASS: lldb-shell :: BuildScript/compiler-full-path.test (1461 of 1893) PASS: lldb-api :: functionalities/data-formatter/data-formatter-cpp/TestDataFormatterCpp.py (1462 of 1893) PASS: lldb-api :: commands/expression/import-std-module/deque-dbg-info-content/TestDbgInfoContentDeque.py (1463 of 1893) PASS: lldb-unit :: Utility/./UtilityTests/UUIDTest.Validity (1464 of 1893) PASS: lldb-api :: functionalities/postmortem/netbsd-core/TestNetBSDCore.py (1465 of 1893) PASS: lldb-unit :: Utility/./UtilityTests/DataExtractorTest.GetMaxU64 (1466 of 1893) PASS: lldb-unit :: Utility/./UtilityTests/StreamTest.PutRawBytesToMixedEndian (1467 of 1893) PASS: lldb-api :: lang/cpp/member-and-local-vars-with-same-name/TestMembersAndLocalsWithSameName.py (1468 of 1893) PASS: lldb-unit :: UnwindAssembly/x86/./UnwindAssemblyx86Tests/Testx86AssemblyInspectionEngine.TestPopR14 (1469 of 1893) PASS: lldb-unit :: UnwindAssembly/x86/./UnwindAssemblyx86Tests/Testx86AssemblyInspectionEngine.TestPushECX (1470 of 1893) PASS: lldb-api :: commands/expression/options/TestExprOptions.py (1471 of 1893) PASS: lldb-unit :: Utility/./UtilityTests/UriParserTest.PortOverflow (1472 of 1893) PASS: lldb-api :: functionalities/breakpoint/comp_dir_symlink/TestCompDirSymLink.py (1473 of 1893) PASS: lldb-unit :: Utility/./UtilityTests/FileSpecTest.EqualDotsWindows (1474 of 1893) PASS: lldb-unit :: Utility/./UtilityTests/StringExtractorTest.GetHexBytes_Underflow (1475 of 1893) PASS: lldb-unit :: ScriptInterpreter/Python/./ScriptInterpreterPythonTests/PythonDataObjectsTest.TestGlobalNameResolutionNoDot (1476 of 1893) PASS: lldb-unit :: UnwindAssembly/x86/./UnwindAssemblyx86Tests/Testx86AssemblyInspectionEngine.TestMovRSPtoRBP (1477 of 1893) PASS: lldb-api :: lang/objc/objc++/TestObjCXX.py (1478 of 1893) UNSUPPORTED: lldb-api :: benchmarks/libcxxmap/TestBenchmarkLibcxxMap.py (1479 of 1893) PASS: lldb-unit :: Utility/./UtilityTests/DataExtractorTest.GetCStrEmpty (1480 of 1893) PASS: lldb-unit :: Language/Highlighting/./HighlighterTests/HighlighterTest.ClangEmptyInput (1481 of 1893) PASS: lldb-shell :: ObjectFile/ELF/section-types-edgecases.yaml (1482 of 1893) PASS: lldb-unit :: Symbol/./SymbolTests/TestClangASTContext.TestUnifyAccessSpecifiers (1483 of 1893) PASS: lldb-unit :: SymbolFile/NativePDB/./SymbolFileNativePDBTests/PDBFPOProgramToDWARFExpressionTests.DependencyChain (1484 of 1893) PASS: lldb-unit :: UnwindAssembly/x86/./UnwindAssemblyx86Tests/Testx86AssemblyInspectionEngine.TestDisassemblyMidFunctionEpilogues (1485 of 1893) PASS: lldb-unit :: Symbol/./SymbolTests/TestClangASTImporter.MetadataPropagationIndirectImport (1486 of 1893) PASS: lldb-api :: lang/c/stepping/TestThreadStepping.py (1487 of 1893) PASS: lldb-api :: lang/objc/objc-super/TestObjCSuper.py (1488 of 1893) PASS: lldb-unit :: Utility/./UtilityTests/StreamTest.PutSLEB128 (1489 of 1893) PASS: lldb-unit :: Utility/./UtilityTests/StringListTest.SplitIntoLinesSingleTrailingCR (1490 of 1893) PASS: lldb-api :: functionalities/data-formatter/type_summary_list_script/TestTypeSummaryListScript.py (1491 of 1893) PASS: lldb-api :: commands/settings/TestSettings.py (1492 of 1893) UNSUPPORTED: lldb-api :: android/platform/TestDefaultCacheLineSize.py (1493 of 1893) PASS: lldb-unit :: SymbolFile/NativePDB/./SymbolFileNativePDBTests/PDBFPOProgramToDWARFExpressionTests.InvalidAssignmentMultiple (1494 of 1893) PASS: lldb-shell :: SymbolFile/Breakpad/stack-cfi-parsing.test (1495 of 1893) PASS: lldb-api :: commands/expression/namespace_local_var_same_name_cpp_and_c/TestNamespaceLocalVarSameNameCppAndC.py (1496 of 1893) PASS: lldb-api :: functionalities/thread/backtrace_all/TestBacktraceAll.py (1497 of 1893) PASS: lldb-api :: lang/cpp/trivial_abi/TestTrivialABI.py (1498 of 1893) PASS: lldb-shell :: Minidump/disassemble-no-module.yaml (1499 of 1893) PASS: lldb-api :: functionalities/breakpoint/dummy_target_breakpoints/TestBreakpointsWithNoTargets.py (1500 of 1893) PASS: lldb-api :: commands/expression/rdar44436068/Test128BitsInteger.py (1501 of 1893) PASS: lldb-unit :: Utility/./UtilityTests/BroadcasterTest.EventTypeHasListeners (1502 of 1893) PASS: lldb-shell :: SymbolFile/DWARF/find-basic-type.cpp (1503 of 1893) PASS: lldb-unit :: Utility/./UtilityTests/UUIDTest.StringConverion (1504 of 1893) PASS: lldb-unit :: Utility/./UtilityTests/FileSpecTest.RemoveLastPathComponent (1505 of 1893) PASS: lldb-api :: functionalities/postmortem/minidump/TestMiniDump.py (1506 of 1893) PASS: lldb-unit :: Utility/./UtilityTests/RangeTest.DefaultConstructor (1507 of 1893) PASS: lldb-unit :: Utility/./UtilityTests/LogChannelEnabledTest.LLDB_LOG_ERROR (1508 of 1893) PASS: lldb-api :: functionalities/value_md5_crash/TestValueMD5Crash.py (1509 of 1893) PASS: lldb-api :: functionalities/data-formatter/nssetsynth/TestNSSetSynthetic.py (1510 of 1893) PASS: lldb-unit :: Process/gdb-remote/./ProcessGdbRemoteTests/GDBRemoteCommunicationClientTest.WriteRegister (1511 of 1893) PASS: lldb-unit :: Utility/./UtilityTests/ProcessInfoTest.Constructor (1512 of 1893) PASS: lldb-unit :: Utility/./UtilityTests/VASprintfTest.NoBufferResize (1513 of 1893) PASS: lldb-unit :: Interpreter/./InterpreterTests/CompletionTest.DirCompletionUsername (1514 of 1893) PASS: lldb-unit :: Utility/./UtilityTests/StringExtractorTest.GetHexU8_Underflow2_NoEof (1515 of 1893) PASS: lldb-unit :: SymbolFile/DWARF/./SymbolFileDWARFTests/SymbolFileDWARFTests.TestAbbrevValidAttrNullForm (1516 of 1893) PASS: lldb-api :: lang/c/conflicting-symbol/TestConflictingSymbol.py (1517 of 1893) PASS: lldb-unit :: Signals/./SignalsTests/UnixSignalsTest.GetInfo (1518 of 1893) PASS: lldb-unit :: Utility/./UtilityTests/LogChannelEnabledTest.log_options (1519 of 1893) PASS: lldb-api :: functionalities/data-formatter/compactvectors/TestCompactVectors.py (1520 of 1893) PASS: lldb-unit :: Symbol/./SymbolTests/LineEntryTest.GetSameLineContiguousAddressRangeOneInline (1521 of 1893) PASS: lldb-shell :: Unwind/eh-frame-dwarf-unwind.test (1522 of 1893) PASS: lldb-api :: commands/expression/completion-in-lambda-and-unnamed-class/TestCompletionInLambdaAndUnnamedClass.py (1523 of 1893) PASS: lldb-api :: lang/cpp/static_methods/TestCPPStaticMethods.py (1524 of 1893) UNSUPPORTED: lldb-shell :: ObjectFile/ELF/minidebuginfo-set-and-hit-breakpoint.test (1525 of 1893) PASS: lldb-api :: sample_test/TestSampleInlineTest.py (1526 of 1893) UNSUPPORTED: lldb-shell :: ScriptInterpreter/Lua/nested_sessions.test (1527 of 1893) PASS: lldb-api :: lang/cpp/unique-types/TestUniqueTypes.py (1528 of 1893) PASS: lldb-shell :: Driver/TestFile.test (1529 of 1893) PASS: lldb-shell :: ObjectFile/ELF/duplicate-section.yaml (1530 of 1893) PASS: lldb-unit :: SymbolFile/DWARF/./SymbolFileDWARFTests/SymbolFileDWARFTests.TestAbbrevInvalidNULLTag (1531 of 1893) PASS: lldb-api :: functionalities/thread/concurrent_events/TestConcurrentSignalWatchBreak.py (1532 of 1893) PASS: lldb-unit :: UnwindAssembly/x86/./UnwindAssemblyx86Tests/Testx86AssemblyInspectionEngine.TestPushR14 (1533 of 1893) PASS: lldb-unit :: UnwindAssembly/x86/./UnwindAssemblyx86Tests/Testx86AssemblyInspectionEngine.TestStackRealignMSVC_i386 (1534 of 1893) PASS: lldb-api :: functionalities/gdb_remote_client/TestRecognizeBreakpoint.py (1535 of 1893) PASS: lldb-shell :: Minidump/memory-region-from-module.yaml (1536 of 1893) PASS: lldb-api :: functionalities/wrong_commands/TestWrongCommands.py (1537 of 1893) PASS: lldb-api :: macosx/order/TestOrderFile.py (1538 of 1893) PASS: lldb-unit :: Host/./HostTests/SocketTest.UDPConnect (1539 of 1893) PASS: lldb-api :: lang/cpp/accelerator-table/TestCPPAccelerator.py (1540 of 1893) PASS: lldb-unit :: Utility/./UtilityTests/SerializationRountripTest.SerializeDeserializeObjectReference (1541 of 1893) PASS: lldb-unit :: SymbolFile/DWARF/./SymbolFileDWARFTests/SymbolFileDWARFTests.TestAbbrevOutOfOrder (1542 of 1893) PASS: lldb-unit :: Utility/./UtilityTests/CompletionRequest.ShiftArguments (1543 of 1893) PASS: lldb-api :: commands/frame/select/TestFrameSelect.py (1544 of 1893) PASS: lldb-unit :: Utility/./UtilityTests/DataExtractorTest.GetCStrUnterminated (1545 of 1893) PASS: lldb-unit :: Utility/./UtilityTests/StringExtractorTest.GetNameColonValueNoSemicolon (1546 of 1893) PASS: lldb-api :: functionalities/data-formatter/user-format-vs-summary/TestUserFormatVsSummary.py (1547 of 1893) PASS: lldb-shell :: SymbolFile/DWARF/dir-separator-no-comp-dir.s (1548 of 1893) PASS: lldb-unit :: Symbol/./SymbolTests/TestClangASTImporter.ImportInvalidType (1549 of 1893) PASS: lldb-api :: commands/expression/test/TestExprs.py (1550 of 1893) UNSUPPORTED: lldb-api :: functionalities/thread/multi_break/TestMultipleBreakpoints.py (1551 of 1893) PASS: lldb-unit :: Utility/./UtilityTests/StringListTest.SplitIntoLines (1552 of 1893) PASS: lldb-unit :: Language/Highlighting/./HighlighterTests/HighlighterTest.ClangStringLiterals (1553 of 1893) PASS: lldb-unit :: Utility/./UtilityTests/ArgsTest.TestSingleArgWithQuotedSpace (1554 of 1893) PASS: lldb-api :: functionalities/thread/concurrent_events/TestConcurrentBreakpointOneDelayBreakpointThreads.py (1555 of 1893) PASS: lldb-api :: commands/watchpoints/watchpoint_commands/TestWatchpointCommands.py (1556 of 1893) PASS: lldb-unit :: Utility/./UtilityTests/GeneratorTest.Get (1557 of 1893) PASS: lldb-unit :: Utility/./UtilityTests/StructuredDataTest.StringDump (1558 of 1893) PASS: lldb-unit :: Core/./LLDBCoreTests/MangledTest.NameIndexes_FindFunctionSymbols (1559 of 1893) PASS: lldb-unit :: Utility/./UtilityTests/ArgsTest.ReplaceArgumentAtIndexEqual (1560 of 1893) PASS: lldb-api :: functionalities/data-formatter/type_summary_list_arg/TestTypeSummaryListArg.py (1561 of 1893) PASS: lldb-unit :: debugserver/./debugserverTests/RNBSocket.AnyListen (1562 of 1893) PASS: lldb-unit :: Target/./TargetTests/MemoryRegionInfoTest.Formatv (1563 of 1893) PASS: lldb-api :: lang/c/array_types/TestArrayTypes.py (1564 of 1893) PASS: lldb-api :: python_api/watchpoint/TestWatchpointIter.py (1565 of 1893) PASS: lldb-unit :: Utility/./UtilityTests/Flags.AnySet (1566 of 1893) PASS: lldb-unit :: ObjectFile/ELF/./ObjectFileELFTests/ObjectFileELFTest.SectionsResolveConsistently (1567 of 1893) PASS: lldb-unit :: UnwindAssembly/x86/./UnwindAssemblyx86Tests/Testx86AssemblyInspectionEngine.TestPushExtended (1568 of 1893) PASS: lldb-unit :: Utility/./UtilityTests/RegisterValueTest.GetSet8 (1569 of 1893) PASS: lldb-api :: tools/lldb-vscode/breakpoint/TestVSCode_setBreakpoints.py (1570 of 1893) UNSUPPORTED: lldb-api :: commands/gui/basic/TestGuiBasic.py (1571 of 1893) PASS: lldb-api :: commands/target/create-deps/TestTargetCreateDeps.py (1572 of 1893) PASS: lldb-shell :: Settings/TestDisassemblyFormat.test (1573 of 1893) PASS: lldb-api :: functionalities/breakpoint/debugbreak/TestDebugBreak.py (1574 of 1893) PASS: lldb-unit :: UnwindAssembly/x86/./UnwindAssemblyx86Tests/Testx86AssemblyInspectionEngine.TestSimple32bitFrameFunction (1575 of 1893) PASS: lldb-unit :: Utility/./UtilityTests/BinaryStreamTest.PutULEB128FiveBytes (1576 of 1893) PASS: lldb-api :: commands/frame/var/TestFrameVar.py (1577 of 1893) UNSUPPORTED: lldb-shell :: Register/x86-zmm-write.test (1578 of 1893) PASS: lldb-shell :: Minidump/memory-region.yaml (1579 of 1893) PASS: lldb-unit :: Utility/./UtilityTests/RegularExpression.Valid (1580 of 1893) PASS: lldb-unit :: Host/./HostTests/MainLoopTest.DetectsEOF (1581 of 1893) PASS: lldb-unit :: Symbol/./SymbolTests/Type.GetTypeScopeAndBasename (1582 of 1893) UNSUPPORTED: lldb-shell :: SymbolFile/PDB/enums-layout.test (1583 of 1893) PASS: lldb-api :: macosx/queues/TestQueues.py (1584 of 1893) PASS: lldb-api :: functionalities/memory/read/TestMemoryRead.py (1585 of 1893) PASS: lldb-unit :: Utility/./UtilityTests/RegularExpression.Invalid (1586 of 1893) PASS: lldb-shell :: SymbolFile/Breakpad/symtab-macho.test (1587 of 1893) PASS: lldb-unit :: Symbol/./SymbolTests/TestClangASTContext.TestGetTypeClassDeclType (1588 of 1893) PASS: lldb-api :: functionalities/breakpoint/breakpoint_ids/TestBreakpointIDs.py (1589 of 1893) PASS: lldb-shell :: ObjectFile/ELF/section-permissions.yaml (1590 of 1893) PASS: lldb-api :: types/TestRecursiveTypes.py (1591 of 1893) UNSUPPORTED: lldb-api :: functionalities/thread/state/TestThreadStates.py (1592 of 1893) PASS: lldb-unit :: Utility/./UtilityTests/StreamTest.AddressRange (1593 of 1893) PASS: lldb-shell :: Expr/TestIRMemoryMap.test (1594 of 1893) PASS: lldb-api :: python_api/lldbutil/TestSwigVersion.py (1595 of 1893) UNSUPPORTED: lldb-shell :: SymbolFile/PDB/typedefs.test (1596 of 1893) PASS: lldb-api :: commands/watchpoints/watchpoint_commands/command/TestWatchpointCommandPython.py (1597 of 1893) PASS: lldb-api :: python_api/module_section/TestModuleAndSection.py (1598 of 1893) PASS: lldb-shell :: SymbolFile/DWARF/dwarf5-index-is-used.cpp (1599 of 1893) PASS: lldb-api :: functionalities/thread/concurrent_events/TestConcurrentDelaySignalBreak.py (1600 of 1893) PASS: lldb-shell :: Settings/TestFrameFormatMangling.test (1601 of 1893) PASS: lldb-unit :: Utility/./UtilityTests/StringListTest.JoinNonSpace (1602 of 1893) PASS: lldb-api :: python_api/disassemble-raw-data/TestDisassembleRawData.py (1603 of 1893) PASS: lldb-unit :: Process/minidump/./LLDBMinidumpTests/MinidumpParserTest.GetArchitectureWindows (1604 of 1893) PASS: lldb-api :: lang/cpp/thread_local/TestThreadLocal.py (1605 of 1893) PASS: lldb-shell :: Reproducer/TestCaptureEnvOverride.test (1606 of 1893) PASS: lldb-unit :: UnwindAssembly/x86/./UnwindAssemblyx86Tests/Testx86AssemblyInspectionEngine.TestPopEBX (1607 of 1893) PASS: lldb-unit :: Utility/./UtilityTests/StringLexerTest.GetUnlexed (1608 of 1893) PASS: lldb-unit :: Language/Highlighting/./HighlighterTests/HighlighterTest.FallbackHighlighter (1609 of 1893) PASS: lldb-api :: types/TestFloatTypesExpr.py (1610 of 1893) PASS: lldb-api :: lang/objc/blocks/TestObjCIvarsInBlocks.py (1611 of 1893) PASS: lldb-unit :: Process/minidump/./LLDBMinidumpTests/MinidumpParserTest.GetPidWow64 (1612 of 1893) PASS: lldb-unit :: ScriptInterpreter/Python/./ScriptInterpreterPythonTests/PythonDataObjectsTest.TestPythonDictionaryManipulation (1613 of 1893) PASS: lldb-api :: commands/expression/fixits/TestFixIts.py (1614 of 1893) PASS: lldb-api :: functionalities/data-formatter/data-formatter-enum-format/TestDataFormatterEnumFormat.py (1615 of 1893) PASS: lldb-unit :: Utility/./UtilityTests/TimerTest.CategoryTimesNested (1616 of 1893) PASS: lldb-unit :: SymbolFile/DWARF/./SymbolFileDWARFTests/SymbolFileDWARFTests.TestAbilitiesForDWARF (1617 of 1893) PASS: lldb-api :: lang/objc/foundation/TestRuntimeTypes.py (1618 of 1893) PASS: lldb-api :: functionalities/breakpoint/serialize/TestBreakpointSerialization.py (1619 of 1893) PASS: lldb-api :: python_api/frame/TestFrames.py (1620 of 1893) PASS: lldb-unit :: Symbol/./SymbolTests/LineEntryTest.GetSameLineContiguousAddressRangeNoInlines (1621 of 1893) PASS: lldb-api :: lang/objc/conflicting-definition/TestConflictingDefinition.py (1622 of 1893) PASS: lldb-unit :: Core/./LLDBCoreTests/RichManglingContextTest.SwitchProvider (1623 of 1893) PASS: lldb-api :: lang/cpp/function_refs/TestFunctionRefs.py (1624 of 1893) PASS: lldb-api :: commands/breakpoint/command/list/TestBreakpointCommandList.py (1625 of 1893) PASS: lldb-api :: functionalities/data-formatter/data-formatter-skip-summary/TestDataFormatterSkipSummary.py (1626 of 1893) PASS: lldb-unit :: Utility/./UtilityTests/StringExtractorTest.GetHexBytesAvail_OddPair (1627 of 1893) PASS: lldb-unit :: Utility/./UtilityTests/StreamTest.PutPtr (1628 of 1893) PASS: lldb-unit :: Core/./LLDBCoreTests/RichManglingContextTest.IPDRealloc (1629 of 1893) PASS: lldb-unit :: Utility/./UtilityTests/DataExtractorTest.GetCStrAtNullOffset (1630 of 1893) PASS: lldb-unit :: Utility/./UtilityTests/StringLexerTest.HasAtLeast (1631 of 1893) PASS: lldb-api :: functionalities/data-formatter/data-formatter-stl/libcxx/queue/TestDataFormatterLibcxxQueue.py (1632 of 1893) PASS: lldb-api :: functionalities/breakpoint/breakpoint_command/TestRegexpBreakCommand.py (1633 of 1893) PASS: lldb-api :: lang/c/strings/TestCStrings.py (1634 of 1893) PASS: lldb-unit :: Utility/./UtilityTests/StringListTest.GetMaxStringLengthIncreasingSize (1635 of 1893) PASS: lldb-unit :: ScriptInterpreter/Python/./ScriptInterpreterPythonTests/PythonDataObjectsTest.TestPythonByteArray (1636 of 1893) PASS: lldb-api :: commands/expression/import-std-module/vector-bool/TestBoolVector.py (1637 of 1893) PASS: lldb-api :: tools/lldb-vscode/breakpoint/TestVSCode_setFunctionBreakpoints.py (1638 of 1893) PASS: lldb-unit :: Utility/./UtilityTests/OptionsWithRawTest.QuotedSuffix (1639 of 1893) PASS: lldb-api :: commands/add-dsym/uuid/TestAddDsymCommand.py (1640 of 1893) PASS: lldb-api :: functionalities/data-formatter/data-formatter-stl/libcxx/atomic/TestLibCxxAtomic.py (1641 of 1893) PASS: lldb-api :: lang/objc/foundation/TestObjCMethods.py (1642 of 1893) PASS: lldb-unit :: Utility/./UtilityTests/TimeoutTest.Construction (1643 of 1893) PASS: lldb-unit :: Utility/./UtilityTests/StringExtractorTest.GetHexBytesAvail (1644 of 1893) FAIL: lldb-api :: functionalities/data-formatter/data-formatter-objc/TestDataFormatterObjCNSDate.py (1645 of 1893) ******************** TEST 'lldb-api :: functionalities/data-formatter/data-formatter-objc/TestDataFormatterObjCNSDate.py' FAILED ******************** lldb version 11.0.99 (http://labmaster3.local/git/llvm-project.git revision c1b13a1b17719aebace1b3be7a6ac7f90b1901a6) clang revision 936483fb7dd2c8c6b014516ff3b3cd13740e0518 llvm revision 936483fb7dd2c8c6b014516ff3b3cd13740e0518 LLDB library dir: /Users/buildslave/jenkins/workspace/lldb-cmake-sanitized/lldb-build/bin LLDB import library dir: /Users/buildslave/jenkins/workspace/lldb-cmake-sanitized/lldb-build/bin libstdcxx tests will not be run because: Don't know how to build with libstdcxx on macosx Skipping following debug info categories: ['dwo'] setting set target.prefer-dynamic-value no-dynamic-values AddressSanitizer report breakpoint hit. Use 'thread info -s' to get extended information about the report. AddressSanitizer report breakpoint hit. Use 'thread info -s' to get extended information about the report. AddressSanitizer report breakpoint hit. Use 'thread info -s' to get extended information about the report.

Hide Details

Session logs for test failures/errors/unexpected successes will go into directory '/Users/buildslave/jenkins/workspace/lldb-cmake-sanitized/test/logs' Command invoked: /Users/buildslave/jenkins/workspace/lldb-cmake-sanitized/llvm-project/lldb/test/API/dotest.py --arch x86_64 -s /Users/buildslave/jenkins/workspace/lldb-cmake-sanitized/lldb-build/lldb-test-traces -S nm -u CXXFLAGS -u CFLAGS --codesign-identity lldb_codesign --server /Users/buildslave/jenkins/workspace/lldb-cmake-sanitized/lldb-build/./bin/debugserver --arch x86_64 --build-dir /Users/buildslave/jenkins/workspace/lldb-cmake-sanitized/lldb-build/lldb-test-build.noindex -s=/Users/buildslave/jenkins/workspace/lldb-cmake-sanitized/test/logs -t --env TERM=vt100 --env LLVM_LIBS_DIR=/Users/buildslave/jenkins/workspace/lldb-cmake-sanitized/lldb-build/./lib --inferior-env ASAN_OPTIONS=detect_stack_use_after_return=1 --inferior-env DYLD_INSERT_LIBRARIES=/Users/buildslave/jenkins/workspace/lldb-cmake-sanitized/host-compiler/lib/clang/11.0.0/lib/darwin/libclang_rt.asan_osx_dynamic.dylib --build-dir /Users/buildslave/jenkins/workspace/lldb-cmake-sanitized/lldb-build/lldb-test-build.noindex --lldb-module-cache-dir /Users/buildslave/jenkins/workspace/lldb-cmake-sanitized/lldb-build/lldb-test-build.noindex/module-cache-lldb/lldb-api --clang-module-cache-dir /Users/buildslave/jenkins/workspace/lldb-cmake-sanitized/lldb-build/lldb-test-build.noindex/module-cache-clang/lldb-api --executable /Users/buildslave/jenkins/workspace/lldb-cmake-sanitized/lldb-build/./bin/lldb --compiler /Users/buildslave/jenkins/workspace/lldb-cmake-sanitized/lldb-build/./bin/clang --dsymutil /Users/buildslave/jenkins/workspace/lldb-cmake-sanitized/lldb-build/./bin/dsymutil --filecheck /Users/buildslave/jenkins/workspace/lldb-cmake-sanitized/lldb-build/./bin/FileCheck /Users/buildslave/jenkins/workspace/lldb-cmake-sanitized/llvm-project/lldb/packages/Python/lldbsuite/test/functionalities/data-formatter/data-formatter-objc -p TestDataFormatterObjCNSDate.py Change dir to: /Users/buildslave/jenkins/workspace/lldb-cmake-sanitized/llvm-project/lldb/packages/Python/lldbsuite/test/functionalities/data-formatter/data-formatter-objc runCmd: settings set symbols.enable-external-lookup false output:

Hide Details

runCmd: settings set plugin.process.gdb-remote.packet-timeout 60 output:

Hide Details

runCmd: settings set symbols.clang-modules-cache-path "/Users/buildslave/jenkins/workspace/lldb-cmake-sanitized/lldb-build/lldb-test-build.noindex/module-cache-lldb/lldb-api" output:

Hide Details

runCmd: settings set use-color false output:

Hide Details

runCmd: settings set target.env-vars ASAN_OPTIONS=detect_stack_use_after_return=1 DYLD_INSERT_LIBRARIES=/Users/buildslave/jenkins/workspace/lldb-cmake-sanitized/host-compiler/lib/clang/11.0.0/lib/darwin/libclang_rt.asan_osx_dynamic.dylib output:

Hide Details

runCmd: settings set target.env-vars ASAN_OPTIONS=detect_stack_use_after_return=1 DYLD_INSERT_LIBRARIES=/Users/buildslave/jenkins/workspace/lldb-cmake-sanitized/host-compiler/lib/clang/11.0.0/lib/darwin/libclang_rt.asan_osx_dynamic.dylib output:

Hide Details

FAIL: LLDB (/Users/buildslave/jenkins/workspace/lldb-cmake-sanitized/lldb-build/bin/clang-10-x86_64) :: test_nsdata_with_run_command_dsym (TestDataFormatterObjCNSDate.ObjCDataFormatterNSDate) <bound method SBProcess.Kill of <lldb.SBProcess; proxy of <Swig Object of type 'lldb::SBProcess *' at 0x10b7cf210> >>: success

Hide Details

runCmd: settings set symbols.enable-external-lookup false output:

Hide Details

runCmd: settings set plugin.process.gdb-remote.packet-timeout 60 output:

Hide Details

runCmd: settings set symbols.clang-modules-cache-path "/Users/buildslave/jenkins/workspace/lldb-cmake-sanitized/lldb-build/lldb-test-build.noindex/module-cache-lldb/lldb-api" output:

Hide Details

runCmd: settings set use-color false output:

Hide Details

runCmd: settings set target.env-vars ASAN_OPTIONS=detect_stack_use_after_return=1 DYLD_INSERT_LIBRARIES=/Users/buildslave/jenkins/workspace/lldb-cmake-sanitized/host-compiler/lib/clang/11.0.0/lib/darwin/libclang_rt.asan_osx_dynamic.dylib output:

Hide Details

runCmd: settings set target.env-vars ASAN_OPTIONS=detect_stack_use_after_return=1 DYLD_INSERT_LIBRARIES=/Users/buildslave/jenkins/workspace/lldb-cmake-sanitized/host-compiler/lib/clang/11.0.0/lib/darwin/libclang_rt.asan_osx_dynamic.dylib output:

Hide Details

FAIL: LLDB (/Users/buildslave/jenkins/workspace/lldb-cmake-sanitized/lldb-build/bin/clang-10-x86_64) :: test_nsdata_with_run_command_dwarf (TestDataFormatterObjCNSDate.ObjCDataFormatterNSDate) <bound method SBProcess.Kill of <lldb.SBProcess; proxy of <Swig Object of type 'lldb::SBProcess *' at 0x10b228630> >>: success

Hide Details

UNSUPPORTED: LLDB (/Users/buildslave/jenkins/workspace/lldb-cmake-sanitized/lldb-build/bin/clang-10-x86_64) :: test_nsdata_with_run_command_dwo (TestDataFormatterObjCNSDate.ObjCDataFormatterNSDate) (test case does not fall in any category of interest for this run) runCmd: settings set symbols.enable-external-lookup false output:

Hide Details

runCmd: settings set plugin.process.gdb-remote.packet-timeout 60 output:

Hide Details

runCmd: settings set symbols.clang-modules-cache-path "/Users/buildslave/jenkins/workspace/lldb-cmake-sanitized/lldb-build/lldb-test-build.noindex/module-cache-lldb/lldb-api" output:

Hide Details

runCmd: settings set use-color false output:

Hide Details

runCmd: settings set target.env-vars ASAN_OPTIONS=detect_stack_use_after_return=1 DYLD_INSERT_LIBRARIES=/Users/buildslave/jenkins/workspace/lldb-cmake-sanitized/host-compiler/lib/clang/11.0.0/lib/darwin/libclang_rt.asan_osx_dynamic.dylib output:

Hide Details

runCmd: settings set target.env-vars ASAN_OPTIONS=detect_stack_use_after_return=1 DYLD_INSERT_LIBRARIES=/Users/buildslave/jenkins/workspace/lldb-cmake-sanitized/host-compiler/lib/clang/11.0.0/lib/darwin/libclang_rt.asan_osx_dynamic.dylib output:

Hide Details

FAIL: LLDB (/Users/buildslave/jenkins/workspace/lldb-cmake-sanitized/lldb-build/bin/clang-10-x86_64) :: test_nsdata_with_run_command_gmodules (TestDataFormatterObjCNSDate.ObjCDataFormatterNSDate) <bound method SBProcess.Kill of <lldb.SBProcess; proxy of <Swig Object of type 'lldb::SBProcess *' at 0x10b7cf540> >>: success

Hide Details

Restore dir to: /Users/buildslave/jenkins/workspace/lldb-cmake-sanitized/lldb-build/tools/lldb/test ====================================================================== FAIL: test_nsdata_with_run_command_dsym (TestDataFormatterObjCNSDate.ObjCDataFormatterNSDate) Test formatters for NSData. ---------------------------------------------------------------------- Traceback (most recent call last): File "/Users/buildslave/jenkins/workspace/lldb-cmake-sanitized/llvm-project/lldb/packages/Python/lldbsuite/test/lldbtest.py", line 1732, in test_method return attrvalue(self) File "/Users/buildslave/jenkins/workspace/lldb-cmake-sanitized/llvm-project/lldb/packages/Python/lldbsuite/test/functionalities/data-formatter/data-formatter-objc/TestDataFormatterObjCNSDate.py", line 20, in test_nsdata_with_run_command self.appkit_tester_impl(self.nsdata_data_formatter_commands) File "/Users/buildslave/jenkins/workspace/lldb-cmake-sanitized/llvm-project/lldb/packages/Python/lldbsuite/test/functionalities/data-formatter/data-formatter-objc/ObjCDataFormatterTestCase.py", line 19, in appkit_tester_impl self.appkit_common_data_formatters_command() File "/Users/buildslave/jenkins/workspace/lldb-cmake-sanitized/llvm-project/lldb/packages/Python/lldbsuite/test/functionalities/data-formatter/data-formatter-objc/ObjCDataFormatterTestCase.py", line 26, in appkit_common_data_formatters_command lldb.SBFileSpec('main.m', False)) File "/Users/buildslave/jenkins/workspace/lldb-cmake-sanitized/llvm-project/lldb/packages/Python/lldbsuite/test/lldbutil.py", line 868, in run_to_source_breakpoint only_one_thread, extra_images) File "/Users/buildslave/jenkins/workspace/lldb-cmake-sanitized/llvm-project/lldb/packages/Python/lldbsuite/test/lldbutil.py", line 797, in run_to_breakpoint_do_run test.assertEqual(num_threads, 1, "Expected 1 thread to stop at breakpoint, %d did."%(num_threads)) AssertionError: 0 != 1 : Expected 1 thread to stop at breakpoint, 0 did. Config=x86_64-/Users/buildslave/jenkins/workspace/lldb-cmake-sanitized/lldb-build/bin/clang-10 ====================================================================== FAIL: test_nsdata_with_run_command_dwarf (TestDataFormatterObjCNSDate.ObjCDataFormatterNSDate) Test formatters for NSData. ---------------------------------------------------------------------- Traceback (most recent call last): File "/Users/buildslave/jenkins/workspace/lldb-cmake-sanitized/llvm-project/lldb/packages/Python/lldbsuite/test/lldbtest.py", line 1732, in test_method return attrvalue(self) File "/Users/buildslave/jenkins/workspace/lldb-cmake-sanitized/llvm-project/lldb/packages/Python/lldbsuite/test/functionalities/data-formatter/data-formatter-objc/TestDataFormatterObjCNSDate.py", line 20, in test_nsdata_with_run_command self.appkit_tester_impl(self.nsdata_data_formatter_commands) File "/Users/buildslave/jenkins/workspace/lldb-cmake-sanitized/llvm-project/lldb/packages/Python/lldbsuite/test/functionalities/data-formatter/data-formatter-objc/ObjCDataFormatterTestCase.py", line 19, in appkit_tester_impl self.appkit_common_data_formatters_command() File "/Users/buildslave/jenkins/workspace/lldb-cmake-sanitized/llvm-project/lldb/packages/Python/lldbsuite/test/functionalities/data-formatter/data-formatter-objc/ObjCDataFormatterTestCase.py", line 26, in appkit_common_data_formatters_command lldb.SBFileSpec('main.m', False)) File "/Users/buildslave/jenkins/workspace/lldb-cmake-sanitized/llvm-project/lldb/packages/Python/lldbsuite/test/lldbutil.py", line 868, in run_to_source_breakpoint only_one_thread, extra_images) File "/Users/buildslave/jenkins/workspace/lldb-cmake-sanitized/llvm-project/lldb/packages/Python/lldbsuite/test/lldbutil.py", line 797, in run_to_breakpoint_do_run test.assertEqual(num_threads, 1, "Expected 1 thread to stop at breakpoint, %d did."%(num_threads)) AssertionError: 0 != 1 : Expected 1 thread to stop at breakpoint, 0 did. Config=x86_64-/Users/buildslave/jenkins/workspace/lldb-cmake-sanitized/lldb-build/bin/clang-10 ====================================================================== FAIL: test_nsdata_with_run_command_gmodules (TestDataFormatterObjCNSDate.ObjCDataFormatterNSDate) Test formatters for NSData. ---------------------------------------------------------------------- Traceback (most recent call last): File "/Users/buildslave/jenkins/workspace/lldb-cmake-sanitized/llvm-project/lldb/packages/Python/lldbsuite/test/lldbtest.py", line 1732, in test_method return attrvalue(self) File "/Users/buildslave/jenkins/workspace/lldb-cmake-sanitized/llvm-project/lldb/packages/Python/lldbsuite/test/functionalities/data-formatter/data-formatter-objc/TestDataFormatterObjCNSDate.py", line 20, in test_nsdata_with_run_command self.appkit_tester_impl(self.nsdata_data_formatter_commands) File "/Users/buildslave/jenkins/workspace/lldb-cmake-sanitized/llvm-project/lldb/packages/Python/lldbsuite/test/functionalities/data-formatter/data-formatter-objc/ObjCDataFormatterTestCase.py", line 19, in appkit_tester_impl self.appkit_common_data_formatters_command() File "/Users/buildslave/jenkins/workspace/lldb-cmake-sanitized/llvm-project/lldb/packages/Python/lldbsuite/test/functionalities/data-formatter/data-formatter-objc/ObjCDataFormatterTestCase.py", line 26, in appkit_common_data_formatters_command lldb.SBFileSpec('main.m', False)) File "/Users/buildslave/jenkins/workspace/lldb-cmake-sanitized/llvm-project/lldb/packages/Python/lldbsuite/test/lldbutil.py", line 868, in run_to_source_breakpoint only_one_thread, extra_images) File "/Users/buildslave/jenkins/workspace/lldb-cmake-sanitized/llvm-project/lldb/packages/Python/lldbsuite/test/lldbutil.py", line 797, in run_to_breakpoint_do_run test.assertEqual(num_threads, 1, "Expected 1 thread to stop at breakpoint, %d did."%(num_threads)) AssertionError: 0 != 1 : Expected 1 thread to stop at breakpoint, 0 did. Config=x86_64-/Users/buildslave/jenkins/workspace/lldb-cmake-sanitized/lldb-build/bin/clang-10 ---------------------------------------------------------------------- Ran 4 tests in 84.622s

Hide Details

RESULT: FAILED (0 passes, 3 failures, 0 errors, 1 skipped, 0 expected failures, 0 unexpected successes)

Hide Details

******************** PASS: lldb-api :: lang/objc/objc_direct-methods/TestObjCDirectMethods.py (1646 of 1893) PASS: lldb-api :: commands/expression/entry-bp/TestExprEntryBP.py (1647 of 1893) PASS: lldb-api :: functionalities/data-formatter/data-formatter-named-summaries/TestDataFormatterNamedSummaries.py (1648 of 1893) PASS: lldb-unit :: Utility/./UtilityTests/ArgsTest.TestOverwriteArgs (1649 of 1893) PASS: lldb-api :: python_api/signals/TestSignalsAPI.py (1650 of 1893) PASS: lldb-api :: functionalities/signal/raise/TestRaise.py (1651 of 1893) PASS: lldb-api :: functionalities/step_scripted/TestStepScripted.py (1652 of 1893) UNSUPPORTED: lldb-api :: functionalities/thread/break_after_join/TestBreakAfterJoin.py (1653 of 1893) PASS: lldb-unit :: Utility/./UtilityTests/RangeTest.DoesIntersect (1654 of 1893) PASS: lldb-unit :: Host/./HostTests/TaskPoolTest.AddTask (1655 of 1893) UNSUPPORTED: lldb-shell :: ObjectFile/PECOFF/disassemble-thumb.yaml (1656 of 1893) PASS: lldb-unit :: Utility/./UtilityTests/RegularExpression.Empty (1657 of 1893) PASS: lldb-api :: python_api/target/TestTargetAPI.py (1658 of 1893) PASS: lldb-api :: commands/quit/TestQuit.py (1659 of 1893) UNSUPPORTED: lldb-api :: functionalities/darwin_log/filter/exact_match/activity-chain/TestDarwinLogFilterMatchActivityChain.py (1660 of 1893) PASS: lldb-api :: functionalities/data-formatter/data-formatter-synthval/TestDataFormatterSynthVal.py (1661 of 1893) PASS: lldb-shell :: Driver/TestSingleQuote.test (1662 of 1893) PASS: lldb-unit :: Expression/./ExpressionTests/DiagnosticManagerTest.GetStringBasic (1663 of 1893) PASS: lldb-unit :: Target/./TargetTests/PathMappingListTest.RelativeTests (1664 of 1893) PASS: lldb-api :: functionalities/inferior-crashing/recursive-inferior/TestRecursiveInferior.py (1665 of 1893) PASS: lldb-unit :: Utility/./UtilityTests/LogChannelTest.List (1666 of 1893) PASS: lldb-unit :: Utility/./UtilityTests/TimeoutTest.Format (1667 of 1893) PASS: lldb-unit :: Utility/./UtilityTests/VMRange.Ordering (1668 of 1893) UNSUPPORTED: lldb-shell :: SymbolFile/PDB/ast-restore.test (1669 of 1893) PASS: lldb-unit :: Process/minidump/./LLDBMinidumpTests/MinidumpParserTest.GetMemoryRegionInfoFromMemoryList (1670 of 1893) PASS: lldb-unit :: Utility/./UtilityTests/AnsiTerminal.WhiteSpace (1671 of 1893) PASS: lldb-api :: commands/expression/argument_passing_restrictions/TestArgumentPassingRestrictions.py (1672 of 1893) PASS: lldb-unit :: ObjectFile/Breakpad/./ObjectFileBreakpadTests/ModuleRecord.parse (1673 of 1893) PASS: lldb-shell :: SymbolFile/DWARF/clang-ast-from-dwarf-unamed-and-anon-structs.cpp (1674 of 1893) PASS: lldb-shell :: SymbolFile/DWARF/dir-separator-windows.s (1675 of 1893) PASS: lldb-unit :: SymbolFile/NativePDB/./SymbolFileNativePDBTests/PDBFPOProgramToDWARFExpressionTests.InvalidOpUnary (1676 of 1893) PASS: lldb-api :: lang/cpp/rvalue-references/TestRvalueReferences.py (1677 of 1893) PASS: lldb-api :: macosx/indirect_symbol/TestIndirectSymbols.py (1678 of 1893) PASS: lldb-unit :: Process/gdb-remote/./ProcessGdbRemoteTests/GDBRemoteCommunicationServerTest.SendErrorResponse_Status (1679 of 1893) PASS: lldb-shell :: SymbolFile/NativePDB/global-classes.cpp (1680 of 1893) PASS: lldb-api :: lang/objcxx/hide-runtime-values/TestObjCXXHideRuntimeValues.py (1681 of 1893) PASS: lldb-shell :: SymbolFile/DWARF/dwarf5-debug_line.s (1682 of 1893) PASS: lldb-unit :: Symbol/./SymbolTests/Type.CompilerContextPattern (1683 of 1893) PASS: lldb-unit :: Utility/./UtilityTests/StringExtractorTest.GetNameColonValueSuccess (1684 of 1893) PASS: lldb-unit :: Host/./HostTests/SocketTest.DomainListenConnectAccept (1685 of 1893) PASS: lldb-api :: functionalities/thread/concurrent_events/TestConcurrentBreakpointsDelayedBreakpointOneWatchpoint.py (1686 of 1893) PASS: lldb-unit :: Utility/./UtilityTests/StreamTest.PutHex16ByteOrderLittle (1687 of 1893) PASS: lldb-unit :: Expression/./ExpressionTests/CppModuleConfigurationTest.Linux (1688 of 1893) PASS: lldb-api :: commands/expression/import-std-module/stack/TestStack.py (1689 of 1893) PASS: lldb-unit :: Utility/./UtilityTests/StringListTest.AppendListCStringArray (1690 of 1893) PASS: lldb-unit :: tools/lldb-server/tests/./LLDBServerTests/TestBase.LaunchModePreservesEnvironment (1691 of 1893) PASS: lldb-api :: tools/lldb-server/TestGdbRemoteExitCode.py (1692 of 1893) XFAIL: lldb-shell :: Unwind/prefer-debug-over-eh-frame.test (1693 of 1893) PASS: lldb-shell :: SymbolFile/DWARF/clang-ast-from-dwarf-objc-property.m (1694 of 1893) PASS: lldb-api :: lang/cpp/template-function/TestTemplateFunctions.py (1695 of 1893) PASS: lldb-unit :: Utility/./UtilityTests/StringListTest.GetMaxStringLengthMixed (1696 of 1893) PASS: lldb-unit :: Language/CPlusPlus/./LanguageCPlusPlusTests/CPlusPlusLanguage.MethodNameParsing (1697 of 1893) PASS: lldb-unit :: Utility/./UtilityTests/ArgsTest.GetArgumentArrayRef (1698 of 1893) PASS: lldb-unit :: Utility/./UtilityTests/Flags.IsClear (1699 of 1893) UNSUPPORTED: lldb-api :: benchmarks/turnaround/TestCompileRunToBreakpointTurnaround.py (1700 of 1893) PASS: lldb-api :: functionalities/thread/concurrent_events/TestConcurrentTwoWatchpointsOneSignal.py (1701 of 1893) PASS: lldb-shell :: Quit/TestQuitExitCodeNonInt.test (1702 of 1893) PASS: lldb-api :: functionalities/breakpoint/breakpoint_command/TestBreakpointCommand.py (1703 of 1893) PASS: lldb-unit :: Process/minidump/./LLDBMinidumpTests/MinidumpParserTest.GetPid (1704 of 1893) PASS: lldb-unit :: Utility/./UtilityTests/FileSpecTest.Match (1705 of 1893) PASS: lldb-unit :: Utility/./UtilityTests/StreamTest.PutHex16ByteOrderBig (1706 of 1893) PASS: lldb-unit :: Utility/./UtilityTests/BinaryStreamTest.PutSLEB128ThreeBytes (1707 of 1893) PASS: lldb-api :: lang/cpp/llvm-style/TestLLVMStyle.py (1708 of 1893) PASS: lldb-api :: lang/c/const_variables/TestConstVariables.py (1709 of 1893) PASS: lldb-shell :: SymbolFile/NativePDB/s_constant.cpp (1710 of 1893) PASS: lldb-unit :: Symbol/./SymbolTests/TestClangASTImporter.RecordLayout (1711 of 1893) PASS: lldb-unit :: Utility/./UtilityTests/EventTest.DumpEventDataBytes (1712 of 1893) UNSUPPORTED: lldb-shell :: ScriptInterpreter/Lua/convenience_variables.test (1713 of 1893) PASS: lldb-shell :: SymbolFile/DWARF/split-dwarf-multiple-cu.ll (1714 of 1893) PASS: lldb-unit :: Host/./HostTests/Host.WaitStatusFormat (1715 of 1893) PASS: lldb-api :: functionalities/gdb_remote_client/TestRegDefinitionInParts.py (1716 of 1893) PASS: lldb-unit :: Utility/./UtilityTests/StringExtractorTest.DecodeHexU8_Underflow (1717 of 1893) PASS: lldb-api :: python_api/sbtype_typeclass/TestSBTypeTypeClass.py (1718 of 1893) PASS: lldb-unit :: Utility/./UtilityTests/BinaryStreamTest.PutULEB128SixBytes (1719 of 1893) PASS: lldb-unit :: Utility/./UtilityTests/StreamTeeTest.Constructor1Stream (1720 of 1893) PASS: lldb-unit :: Process/minidump/./LLDBMinidumpTests/MinidumpParserTest.MinidumpDuplicateModuleMinAddress (1721 of 1893) PASS: lldb-unit :: Symbol/./SymbolTests/TestClangASTContext.TestBuiltinTypeForEncodingAndBitSize (1722 of 1893) FAIL: lldb-api :: functionalities/data-formatter/data-formatter-objc/TestDataFormatterObjCNSURL.py (1723 of 1893) ******************** TEST 'lldb-api :: functionalities/data-formatter/data-formatter-objc/TestDataFormatterObjCNSURL.py' FAILED ******************** lldb version 11.0.99 (http://labmaster3.local/git/llvm-project.git revision c1b13a1b17719aebace1b3be7a6ac7f90b1901a6) clang revision 936483fb7dd2c8c6b014516ff3b3cd13740e0518 llvm revision 936483fb7dd2c8c6b014516ff3b3cd13740e0518 LLDB library dir: /Users/buildslave/jenkins/workspace/lldb-cmake-sanitized/lldb-build/bin LLDB import library dir: /Users/buildslave/jenkins/workspace/lldb-cmake-sanitized/lldb-build/bin libstdcxx tests will not be run because: Don't know how to build with libstdcxx on macosx Skipping following debug info categories: ['dwo'] setting set target.prefer-dynamic-value no-dynamic-values AddressSanitizer report breakpoint hit. Use 'thread info -s' to get extended information about the report. AddressSanitizer report breakpoint hit. Use 'thread info -s' to get extended information about the report. AddressSanitizer report breakpoint hit. Use 'thread info -s' to get extended information about the report.

Hide Details

Session logs for test failures/errors/unexpected successes will go into directory '/Users/buildslave/jenkins/workspace/lldb-cmake-sanitized/test/logs' Command invoked: /Users/buildslave/jenkins/workspace/lldb-cmake-sanitized/llvm-project/lldb/test/API/dotest.py --arch x86_64 -s /Users/buildslave/jenkins/workspace/lldb-cmake-sanitized/lldb-build/lldb-test-traces -S nm -u CXXFLAGS -u CFLAGS --codesign-identity lldb_codesign --server /Users/buildslave/jenkins/workspace/lldb-cmake-sanitized/lldb-build/./bin/debugserver --arch x86_64 --build-dir /Users/buildslave/jenkins/workspace/lldb-cmake-sanitized/lldb-build/lldb-test-build.noindex -s=/Users/buildslave/jenkins/workspace/lldb-cmake-sanitized/test/logs -t --env TERM=vt100 --env LLVM_LIBS_DIR=/Users/buildslave/jenkins/workspace/lldb-cmake-sanitized/lldb-build/./lib --inferior-env ASAN_OPTIONS=detect_stack_use_after_return=1 --inferior-env DYLD_INSERT_LIBRARIES=/Users/buildslave/jenkins/workspace/lldb-cmake-sanitized/host-compiler/lib/clang/11.0.0/lib/darwin/libclang_rt.asan_osx_dynamic.dylib --build-dir /Users/buildslave/jenkins/workspace/lldb-cmake-sanitized/lldb-build/lldb-test-build.noindex --lldb-module-cache-dir /Users/buildslave/jenkins/workspace/lldb-cmake-sanitized/lldb-build/lldb-test-build.noindex/module-cache-lldb/lldb-api --clang-module-cache-dir /Users/buildslave/jenkins/workspace/lldb-cmake-sanitized/lldb-build/lldb-test-build.noindex/module-cache-clang/lldb-api --executable /Users/buildslave/jenkins/workspace/lldb-cmake-sanitized/lldb-build/./bin/lldb --compiler /Users/buildslave/jenkins/workspace/lldb-cmake-sanitized/lldb-build/./bin/clang --dsymutil /Users/buildslave/jenkins/workspace/lldb-cmake-sanitized/lldb-build/./bin/dsymutil --filecheck /Users/buildslave/jenkins/workspace/lldb-cmake-sanitized/lldb-build/./bin/FileCheck /Users/buildslave/jenkins/workspace/lldb-cmake-sanitized/llvm-project/lldb/packages/Python/lldbsuite/test/functionalities/data-formatter/data-formatter-objc -p TestDataFormatterObjCNSURL.py Change dir to: /Users/buildslave/jenkins/workspace/lldb-cmake-sanitized/llvm-project/lldb/packages/Python/lldbsuite/test/functionalities/data-formatter/data-formatter-objc runCmd: settings set symbols.enable-external-lookup false output:

Hide Details

runCmd: settings set plugin.process.gdb-remote.packet-timeout 60 output:

Hide Details

runCmd: settings set symbols.clang-modules-cache-path "/Users/buildslave/jenkins/workspace/lldb-cmake-sanitized/lldb-build/lldb-test-build.noindex/module-cache-lldb/lldb-api" output:

Hide Details

runCmd: settings set use-color false output:

Hide Details

runCmd: settings set target.env-vars ASAN_OPTIONS=detect_stack_use_after_return=1 DYLD_INSERT_LIBRARIES=/Users/buildslave/jenkins/workspace/lldb-cmake-sanitized/host-compiler/lib/clang/11.0.0/lib/darwin/libclang_rt.asan_osx_dynamic.dylib output:

Hide Details

runCmd: settings set target.env-vars ASAN_OPTIONS=detect_stack_use_after_return=1 DYLD_INSERT_LIBRARIES=/Users/buildslave/jenkins/workspace/lldb-cmake-sanitized/host-compiler/lib/clang/11.0.0/lib/darwin/libclang_rt.asan_osx_dynamic.dylib output:

Hide Details

FAIL: LLDB (/Users/buildslave/jenkins/workspace/lldb-cmake-sanitized/lldb-build/bin/clang-10-x86_64) :: test_nsurl_with_run_command_dsym (TestDataFormatterObjCNSURL.ObjCDataFormatterNSURL) <bound method SBProcess.Kill of <lldb.SBProcess; proxy of <Swig Object of type 'lldb::SBProcess *' at 0x10b979210> >>: success

Hide Details

runCmd: settings set symbols.enable-external-lookup false output:

Hide Details

runCmd: settings set plugin.process.gdb-remote.packet-timeout 60 output:

Hide Details

runCmd: settings set symbols.clang-modules-cache-path "/Users/buildslave/jenkins/workspace/lldb-cmake-sanitized/lldb-build/lldb-test-build.noindex/module-cache-lldb/lldb-api" output:

Hide Details

runCmd: settings set use-color false output:

Hide Details

runCmd: settings set target.env-vars ASAN_OPTIONS=detect_stack_use_after_return=1 DYLD_INSERT_LIBRARIES=/Users/buildslave/jenkins/workspace/lldb-cmake-sanitized/host-compiler/lib/clang/11.0.0/lib/darwin/libclang_rt.asan_osx_dynamic.dylib output:

Hide Details

runCmd: settings set target.env-vars ASAN_OPTIONS=detect_stack_use_after_return=1 DYLD_INSERT_LIBRARIES=/Users/buildslave/jenkins/workspace/lldb-cmake-sanitized/host-compiler/lib/clang/11.0.0/lib/darwin/libclang_rt.asan_osx_dynamic.dylib output:

Hide Details

FAIL: LLDB (/Users/buildslave/jenkins/workspace/lldb-cmake-sanitized/lldb-build/bin/clang-10-x86_64) :: test_nsurl_with_run_command_dwarf (TestDataFormatterObjCNSURL.ObjCDataFormatterNSURL) <bound method SBProcess.Kill of <lldb.SBProcess; proxy of <Swig Object of type 'lldb::SBProcess *' at 0x10b3d0630> >>: success

Hide Details

UNSUPPORTED: LLDB (/Users/buildslave/jenkins/workspace/lldb-cmake-sanitized/lldb-build/bin/clang-10-x86_64) :: test_nsurl_with_run_command_dwo (TestDataFormatterObjCNSURL.ObjCDataFormatterNSURL) (test case does not fall in any category of interest for this run) runCmd: settings set symbols.enable-external-lookup false output:

Hide Details

runCmd: settings set plugin.process.gdb-remote.packet-timeout 60 output:

Hide Details

runCmd: settings set symbols.clang-modules-cache-path "/Users/buildslave/jenkins/workspace/lldb-cmake-sanitized/lldb-build/lldb-test-build.noindex/module-cache-lldb/lldb-api" output:

Hide Details

runCmd: settings set use-color false output:

Hide Details

runCmd: settings set target.env-vars ASAN_OPTIONS=detect_stack_use_after_return=1 DYLD_INSERT_LIBRARIES=/Users/buildslave/jenkins/workspace/lldb-cmake-sanitized/host-compiler/lib/clang/11.0.0/lib/darwin/libclang_rt.asan_osx_dynamic.dylib output:

Hide Details

runCmd: settings set target.env-vars ASAN_OPTIONS=detect_stack_use_after_return=1 DYLD_INSERT_LIBRARIES=/Users/buildslave/jenkins/workspace/lldb-cmake-sanitized/host-compiler/lib/clang/11.0.0/lib/darwin/libclang_rt.asan_osx_dynamic.dylib output:

Hide Details

FAIL: LLDB (/Users/buildslave/jenkins/workspace/lldb-cmake-sanitized/lldb-build/bin/clang-10-x86_64) :: test_nsurl_with_run_command_gmodules (TestDataFormatterObjCNSURL.ObjCDataFormatterNSURL) <bound method SBProcess.Kill of <lldb.SBProcess; proxy of <Swig Object of type 'lldb::SBProcess *' at 0x10b979540> >>: success

Hide Details

Restore dir to: /Users/buildslave/jenkins/workspace/lldb-cmake-sanitized/lldb-build/tools/lldb/test ====================================================================== FAIL: test_nsurl_with_run_command_dsym (TestDataFormatterObjCNSURL.ObjCDataFormatterNSURL) Test formatters for NSURL. ---------------------------------------------------------------------- Traceback (most recent call last): File "/Users/buildslave/jenkins/workspace/lldb-cmake-sanitized/llvm-project/lldb/packages/Python/lldbsuite/test/lldbtest.py", line 1732, in test_method return attrvalue(self) File "/Users/buildslave/jenkins/workspace/lldb-cmake-sanitized/llvm-project/lldb/packages/Python/lldbsuite/test/functionalities/data-formatter/data-formatter-objc/TestDataFormatterObjCNSURL.py", line 20, in test_nsurl_with_run_command self.appkit_tester_impl(self.nsurl_data_formatter_commands) File "/Users/buildslave/jenkins/workspace/lldb-cmake-sanitized/llvm-project/lldb/packages/Python/lldbsuite/test/functionalities/data-formatter/data-formatter-objc/ObjCDataFormatterTestCase.py", line 19, in appkit_tester_impl self.appkit_common_data_formatters_command() File "/Users/buildslave/jenkins/workspace/lldb-cmake-sanitized/llvm-project/lldb/packages/Python/lldbsuite/test/functionalities/data-formatter/data-formatter-objc/ObjCDataFormatterTestCase.py", line 26, in appkit_common_data_formatters_command lldb.SBFileSpec('main.m', False)) File "/Users/buildslave/jenkins/workspace/lldb-cmake-sanitized/llvm-project/lldb/packages/Python/lldbsuite/test/lldbutil.py", line 868, in run_to_source_breakpoint only_one_thread, extra_images) File "/Users/buildslave/jenkins/workspace/lldb-cmake-sanitized/llvm-project/lldb/packages/Python/lldbsuite/test/lldbutil.py", line 797, in run_to_breakpoint_do_run test.assertEqual(num_threads, 1, "Expected 1 thread to stop at breakpoint, %d did."%(num_threads)) AssertionError: 0 != 1 : Expected 1 thread to stop at breakpoint, 0 did. Config=x86_64-/Users/buildslave/jenkins/workspace/lldb-cmake-sanitized/lldb-build/bin/clang-10 ====================================================================== FAIL: test_nsurl_with_run_command_dwarf (TestDataFormatterObjCNSURL.ObjCDataFormatterNSURL) Test formatters for NSURL. ---------------------------------------------------------------------- Traceback (most recent call last): File "/Users/buildslave/jenkins/workspace/lldb-cmake-sanitized/llvm-project/lldb/packages/Python/lldbsuite/test/lldbtest.py", line 1732, in test_method return attrvalue(self) File "/Users/buildslave/jenkins/workspace/lldb-cmake-sanitized/llvm-project/lldb/packages/Python/lldbsuite/test/functionalities/data-formatter/data-formatter-objc/TestDataFormatterObjCNSURL.py", line 20, in test_nsurl_with_run_command self.appkit_tester_impl(self.nsurl_data_formatter_commands) File "/Users/buildslave/jenkins/workspace/lldb-cmake-sanitized/llvm-project/lldb/packages/Python/lldbsuite/test/functionalities/data-formatter/data-formatter-objc/ObjCDataFormatterTestCase.py", line 19, in appkit_tester_impl self.appkit_common_data_formatters_command() File "/Users/buildslave/jenkins/workspace/lldb-cmake-sanitized/llvm-project/lldb/packages/Python/lldbsuite/test/functionalities/data-formatter/data-formatter-objc/ObjCDataFormatterTestCase.py", line 26, in appkit_common_data_formatters_command lldb.SBFileSpec('main.m', False)) File "/Users/buildslave/jenkins/workspace/lldb-cmake-sanitized/llvm-project/lldb/packages/Python/lldbsuite/test/lldbutil.py", line 868, in run_to_source_breakpoint only_one_thread, extra_images) File "/Users/buildslave/jenkins/workspace/lldb-cmake-sanitized/llvm-project/lldb/packages/Python/lldbsuite/test/lldbutil.py", line 797, in run_to_breakpoint_do_run test.assertEqual(num_threads, 1, "Expected 1 thread to stop at breakpoint, %d did."%(num_threads)) AssertionError: 0 != 1 : Expected 1 thread to stop at breakpoint, 0 did. Config=x86_64-/Users/buildslave/jenkins/workspace/lldb-cmake-sanitized/lldb-build/bin/clang-10 ====================================================================== FAIL: test_nsurl_with_run_command_gmodules (TestDataFormatterObjCNSURL.ObjCDataFormatterNSURL) Test formatters for NSURL. ---------------------------------------------------------------------- Traceback (most recent call last): File "/Users/buildslave/jenkins/workspace/lldb-cmake-sanitized/llvm-project/lldb/packages/Python/lldbsuite/test/lldbtest.py", line 1732, in test_method return attrvalue(self) File "/Users/buildslave/jenkins/workspace/lldb-cmake-sanitized/llvm-project/lldb/packages/Python/lldbsuite/test/functionalities/data-formatter/data-formatter-objc/TestDataFormatterObjCNSURL.py", line 20, in test_nsurl_with_run_command self.appkit_tester_impl(self.nsurl_data_formatter_commands) File "/Users/buildslave/jenkins/workspace/lldb-cmake-sanitized/llvm-project/lldb/packages/Python/lldbsuite/test/functionalities/data-formatter/data-formatter-objc/ObjCDataFormatterTestCase.py", line 19, in appkit_tester_impl self.appkit_common_data_formatters_command() File "/Users/buildslave/jenkins/workspace/lldb-cmake-sanitized/llvm-project/lldb/packages/Python/lldbsuite/test/functionalities/data-formatter/data-formatter-objc/ObjCDataFormatterTestCase.py", line 26, in appkit_common_data_formatters_command lldb.SBFileSpec('main.m', False)) File "/Users/buildslave/jenkins/workspace/lldb-cmake-sanitized/llvm-project/lldb/packages/Python/lldbsuite/test/lldbutil.py", line 868, in run_to_source_breakpoint only_one_thread, extra_images) File "/Users/buildslave/jenkins/workspace/lldb-cmake-sanitized/llvm-project/lldb/packages/Python/lldbsuite/test/lldbutil.py", line 797, in run_to_breakpoint_do_run test.assertEqual(num_threads, 1, "Expected 1 thread to stop at breakpoint, %d did."%(num_threads)) AssertionError: 0 != 1 : Expected 1 thread to stop at breakpoint, 0 did. Config=x86_64-/Users/buildslave/jenkins/workspace/lldb-cmake-sanitized/lldb-build/bin/clang-10 ---------------------------------------------------------------------- Ran 4 tests in 88.610s

Hide Details

RESULT: FAILED (0 passes, 3 failures, 0 errors, 1 skipped, 0 expected failures, 0 unexpected successes)

Hide Details

******************** PASS: lldb-unit :: Utility/./UtilityTests/StringListTest.InsertStringAtIndexStart (1724 of 1893) PASS: lldb-api :: functionalities/data-formatter/synthcapping/TestSyntheticCapping.py (1725 of 1893) PASS: lldb-api :: functionalities/tail_call_frames/disambiguate_paths_to_common_sink/TestDisambiguatePathsToCommonSink.py (1726 of 1893) PASS: lldb-shell :: SymbolFile/DWARF/find-basic-variable.cpp (1727 of 1893) PASS: lldb-unit :: Expression/./ExpressionTests/ClangHostTest.ComputeClangResourceDirectory (1728 of 1893) PASS: lldb-shell :: Quit/TestQuitExitCodeImplicit0.test (1729 of 1893) PASS: lldb-shell :: Reproducer/TestGDBRemoteRepro.test (1730 of 1893) PASS: lldb-api :: commands/expression/class_template_specialization_empty_pack/TestClassTemplateSpecializationParametersHandling.py (1731 of 1893) FAIL: lldb-api :: tools/lldb-server/commandline/TestStubSetSID.py (1732 of 1893) ******************** TEST 'lldb-api :: tools/lldb-server/commandline/TestStubSetSID.py' FAILED ******************** lldb version 11.0.99 (http://labmaster3.local/git/llvm-project.git revision c1b13a1b17719aebace1b3be7a6ac7f90b1901a6) clang revision 936483fb7dd2c8c6b014516ff3b3cd13740e0518 llvm revision 936483fb7dd2c8c6b014516ff3b3cd13740e0518 LLDB library dir: /Users/buildslave/jenkins/workspace/lldb-cmake-sanitized/lldb-build/bin LLDB import library dir: /Users/buildslave/jenkins/workspace/lldb-cmake-sanitized/lldb-build/bin libstdcxx tests will not be run because: Don't know how to build with libstdcxx on macosx Skipping following debug info categories: ['dwo'] setting set target.prefer-dynamic-value no-dynamic-values

Hide Details

Session logs for test failures/errors/unexpected successes will go into directory '/Users/buildslave/jenkins/workspace/lldb-cmake-sanitized/test/logs' Command invoked: /Users/buildslave/jenkins/workspace/lldb-cmake-sanitized/llvm-project/lldb/test/API/dotest.py --arch x86_64 -s /Users/buildslave/jenkins/workspace/lldb-cmake-sanitized/lldb-build/lldb-test-traces -S nm -u CXXFLAGS -u CFLAGS --codesign-identity lldb_codesign --server /Users/buildslave/jenkins/workspace/lldb-cmake-sanitized/lldb-build/./bin/debugserver --arch x86_64 --build-dir /Users/buildslave/jenkins/workspace/lldb-cmake-sanitized/lldb-build/lldb-test-build.noindex -s=/Users/buildslave/jenkins/workspace/lldb-cmake-sanitized/test/logs -t --env TERM=vt100 --env LLVM_LIBS_DIR=/Users/buildslave/jenkins/workspace/lldb-cmake-sanitized/lldb-build/./lib --inferior-env ASAN_OPTIONS=detect_stack_use_after_return=1 --inferior-env DYLD_INSERT_LIBRARIES=/Users/buildslave/jenkins/workspace/lldb-cmake-sanitized/host-compiler/lib/clang/11.0.0/lib/darwin/libclang_rt.asan_osx_dynamic.dylib --build-dir /Users/buildslave/jenkins/workspace/lldb-cmake-sanitized/lldb-build/lldb-test-build.noindex --lldb-module-cache-dir /Users/buildslave/jenkins/workspace/lldb-cmake-sanitized/lldb-build/lldb-test-build.noindex/module-cache-lldb/lldb-api --clang-module-cache-dir /Users/buildslave/jenkins/workspace/lldb-cmake-sanitized/lldb-build/lldb-test-build.noindex/module-cache-clang/lldb-api --executable /Users/buildslave/jenkins/workspace/lldb-cmake-sanitized/lldb-build/./bin/lldb --compiler /Users/buildslave/jenkins/workspace/lldb-cmake-sanitized/lldb-build/./bin/clang --dsymutil /Users/buildslave/jenkins/workspace/lldb-cmake-sanitized/lldb-build/./bin/dsymutil --filecheck /Users/buildslave/jenkins/workspace/lldb-cmake-sanitized/lldb-build/./bin/FileCheck /Users/buildslave/jenkins/workspace/lldb-cmake-sanitized/llvm-project/lldb/packages/Python/lldbsuite/test/tools/lldb-server/commandline -p TestStubSetSID.py Change dir to: /Users/buildslave/jenkins/workspace/lldb-cmake-sanitized/llvm-project/lldb/packages/Python/lldbsuite/test/tools/lldb-server/commandline runCmd: settings set symbols.enable-external-lookup false output:

Hide Details

runCmd: settings set plugin.process.gdb-remote.packet-timeout 60 output:

Hide Details

runCmd: settings set symbols.clang-modules-cache-path "/Users/buildslave/jenkins/workspace/lldb-cmake-sanitized/lldb-build/lldb-test-build.noindex/module-cache-lldb/lldb-api" output:

Hide Details

runCmd: settings set use-color false output:

Hide Details

runCmd: settings set target.env-vars ASAN_OPTIONS=detect_stack_use_after_return=1 DYLD_INSERT_LIBRARIES=/Users/buildslave/jenkins/workspace/lldb-cmake-sanitized/host-compiler/lib/clang/11.0.0/lib/darwin/libclang_rt.asan_osx_dynamic.dylib output:

Hide Details

Adding tearDown hook: def shutdown_named_pipe(): # Close the pipe. try: named_pipe.close() except: print("failed to close named pipe") None

Hide Details

# Delete the pipe. try: os.remove(named_pipe_path) except: print("failed to delete named pipe: {}".format(named_pipe_path)) None

Hide Details

# Delete the temp directory. try: os.rmdir(temp_dir) except: print( "failed to delete temp dir: {}, directory contents: '{}'".format( temp_dir, os.listdir(temp_dir))) None

Hide Details

Hide Details

Adding tearDown hook: def cleanupSubprocesses(self): # Ensure any subprocesses are cleaned up for p in self.subprocesses: p.terminate() del p del self.subprocesses[:] # Ensure any forked processes are cleaned up for pid in self.forkedProcessPids: if os.path.exists("/proc/" + str(pid)): os.kill(pid, signal.SIGTERM)

Hide Details

Hide Details

FAIL: LLDB (/Users/buildslave/jenkins/workspace/lldb-cmake-sanitized/lldb-build/bin/clang-10-x86_64) :: test_sid_is_different_with_S_debugserver (TestStubSetSID.TestStubSetSIDTestCase) Executing tearDown hook: def cleanupSubprocesses(self): # Ensure any subprocesses are cleaned up for p in self.subprocesses: p.terminate() del p del self.subprocesses[:] # Ensure any forked processes are cleaned up for pid in self.forkedProcessPids: if os.path.exists("/proc/" + str(pid)): os.kill(pid, signal.SIGTERM)

Hide Details

Hide Details

Executing tearDown hook: def shutdown_named_pipe(): # Close the pipe. try: named_pipe.close() except: print("failed to close named pipe") None

Hide Details

# Delete the pipe. try: os.remove(named_pipe_path) except: print("failed to delete named pipe: {}".format(named_pipe_path)) None

Hide Details

# Delete the temp directory. try: os.rmdir(temp_dir) except: print( "failed to delete temp dir: {}, directory contents: '{}'".format( temp_dir, os.listdir(temp_dir))) None

Hide Details

Hide Details

runCmd: settings set symbols.enable-external-lookup false output:

Hide Details

runCmd: settings set plugin.process.gdb-remote.packet-timeout 60 output:

Hide Details

runCmd: settings set symbols.clang-modules-cache-path "/Users/buildslave/jenkins/workspace/lldb-cmake-sanitized/lldb-build/lldb-test-build.noindex/module-cache-lldb/lldb-api" output:

Hide Details

runCmd: settings set use-color false output:

Hide Details

runCmd: settings set target.env-vars ASAN_OPTIONS=detect_stack_use_after_return=1 DYLD_INSERT_LIBRARIES=/Users/buildslave/jenkins/workspace/lldb-cmake-sanitized/host-compiler/lib/clang/11.0.0/lib/darwin/libclang_rt.asan_osx_dynamic.dylib output:

Hide Details

UNSUPPORTED: LLDB (/Users/buildslave/jenkins/workspace/lldb-cmake-sanitized/lldb-build/bin/clang-10-x86_64) :: test_sid_is_different_with_S_llgs (TestStubSetSID.TestStubSetSIDTestCase) (llgs tests) runCmd: settings set symbols.enable-external-lookup false output:

Hide Details

runCmd: settings set plugin.process.gdb-remote.packet-timeout 60 output:

Hide Details

runCmd: settings set symbols.clang-modules-cache-path "/Users/buildslave/jenkins/workspace/lldb-cmake-sanitized/lldb-build/lldb-test-build.noindex/module-cache-lldb/lldb-api" output:

Hide Details

runCmd: settings set use-color false output:

Hide Details

runCmd: settings set target.env-vars ASAN_OPTIONS=detect_stack_use_after_return=1 DYLD_INSERT_LIBRARIES=/Users/buildslave/jenkins/workspace/lldb-cmake-sanitized/host-compiler/lib/clang/11.0.0/lib/darwin/libclang_rt.asan_osx_dynamic.dylib output:

Hide Details

Adding tearDown hook: def shutdown_named_pipe(): # Close the pipe. try: named_pipe.close() except: print("failed to close named pipe") None

Hide Details

# Delete the pipe. try: os.remove(named_pipe_path) except: print("failed to delete named pipe: {}".format(named_pipe_path)) None

Hide Details

# Delete the temp directory. try: os.rmdir(temp_dir) except: print( "failed to delete temp dir: {}, directory contents: '{}'".format( temp_dir, os.listdir(temp_dir))) None

Hide Details

Hide Details

Adding tearDown hook: def cleanupSubprocesses(self): # Ensure any subprocesses are cleaned up for p in self.subprocesses: p.terminate() del p del self.subprocesses[:] # Ensure any forked processes are cleaned up for pid in self.forkedProcessPids: if os.path.exists("/proc/" + str(pid)): os.kill(pid, signal.SIGTERM)

Hide Details

Hide Details

Executing tearDown hook: def cleanupSubprocesses(self): # Ensure any subprocesses are cleaned up for p in self.subprocesses: p.terminate() del p del self.subprocesses[:] # Ensure any forked processes are cleaned up for pid in self.forkedProcessPids: if os.path.exists("/proc/" + str(pid)): os.kill(pid, signal.SIGTERM)

Hide Details

Hide Details

Executing tearDown hook: def shutdown_named_pipe(): # Close the pipe. try: named_pipe.close() except: print("failed to close named pipe") None

Hide Details

# Delete the pipe. try: os.remove(named_pipe_path) except: print("failed to delete named pipe: {}".format(named_pipe_path)) None

Hide Details

# Delete the temp directory. try: os.rmdir(temp_dir) except: print( "failed to delete temp dir: {}, directory contents: '{}'".format( temp_dir, os.listdir(temp_dir))) None

Hide Details

Hide Details

PASS: LLDB (/Users/buildslave/jenkins/workspace/lldb-cmake-sanitized/lldb-build/bin/clang-10-x86_64) :: test_sid_is_different_with_setsid_debugserver (TestStubSetSID.TestStubSetSIDTestCase) runCmd: settings set symbols.enable-external-lookup false output:

Hide Details

runCmd: settings set plugin.process.gdb-remote.packet-timeout 60 output:

Hide Details

runCmd: settings set symbols.clang-modules-cache-path "/Users/buildslave/jenkins/workspace/lldb-cmake-sanitized/lldb-build/lldb-test-build.noindex/module-cache-lldb/lldb-api" output:

Hide Details

runCmd: settings set use-color false output:

Hide Details

runCmd: settings set target.env-vars ASAN_OPTIONS=detect_stack_use_after_return=1 DYLD_INSERT_LIBRARIES=/Users/buildslave/jenkins/workspace/lldb-cmake-sanitized/host-compiler/lib/clang/11.0.0/lib/darwin/libclang_rt.asan_osx_dynamic.dylib output:

Hide Details

UNSUPPORTED: LLDB (/Users/buildslave/jenkins/workspace/lldb-cmake-sanitized/lldb-build/bin/clang-10-x86_64) :: test_sid_is_different_with_setsid_llgs (TestStubSetSID.TestStubSetSIDTestCase) (llgs tests) runCmd: settings set symbols.enable-external-lookup false output:

Hide Details

runCmd: settings set plugin.process.gdb-remote.packet-timeout 60 output:

Hide Details

runCmd: settings set symbols.clang-modules-cache-path "/Users/buildslave/jenkins/workspace/lldb-cmake-sanitized/lldb-build/lldb-test-build.noindex/module-cache-lldb/lldb-api" output:

Hide Details

runCmd: settings set use-color false output:

Hide Details

runCmd: settings set target.env-vars ASAN_OPTIONS=detect_stack_use_after_return=1 DYLD_INSERT_LIBRARIES=/Users/buildslave/jenkins/workspace/lldb-cmake-sanitized/host-compiler/lib/clang/11.0.0/lib/darwin/libclang_rt.asan_osx_dynamic.dylib output:

Hide Details

Adding tearDown hook: def shutdown_named_pipe(): # Close the pipe. try: named_pipe.close() except: print("failed to close named pipe") None

Hide Details

# Delete the pipe. try: os.remove(named_pipe_path) except: print("failed to delete named pipe: {}".format(named_pipe_path)) None

Hide Details

# Delete the temp directory. try: os.rmdir(temp_dir) except: print( "failed to delete temp dir: {}, directory contents: '{}'".format( temp_dir, os.listdir(temp_dir))) None

Hide Details

Hide Details

Adding tearDown hook: def cleanupSubprocesses(self): # Ensure any subprocesses are cleaned up for p in self.subprocesses: p.terminate() del p del self.subprocesses[:] # Ensure any forked processes are cleaned up for pid in self.forkedProcessPids: if os.path.exists("/proc/" + str(pid)): os.kill(pid, signal.SIGTERM)

Hide Details

Hide Details

Executing tearDown hook: def cleanupSubprocesses(self): # Ensure any subprocesses are cleaned up for p in self.subprocesses: p.terminate() del p del self.subprocesses[:] # Ensure any forked processes are cleaned up for pid in self.forkedProcessPids: if os.path.exists("/proc/" + str(pid)): os.kill(pid, signal.SIGTERM)

Hide Details

Hide Details

Executing tearDown hook: def shutdown_named_pipe(): # Close the pipe. try: named_pipe.close() except: print("failed to close named pipe") None

Hide Details

# Delete the pipe. try: os.remove(named_pipe_path) except: print("failed to delete named pipe: {}".format(named_pipe_path)) None

Hide Details

# Delete the temp directory. try: os.rmdir(temp_dir) except: print( "failed to delete temp dir: {}, directory contents: '{}'".format( temp_dir, os.listdir(temp_dir))) None

Hide Details

Hide Details

PASS: LLDB (/Users/buildslave/jenkins/workspace/lldb-cmake-sanitized/lldb-build/bin/clang-10-x86_64) :: test_sid_is_same_without_setsid_debugserver (TestStubSetSID.TestStubSetSIDTestCase) runCmd: settings set symbols.enable-external-lookup false output:

Hide Details

runCmd: settings set plugin.process.gdb-remote.packet-timeout 60 output:

Hide Details

runCmd: settings set symbols.clang-modules-cache-path "/Users/buildslave/jenkins/workspace/lldb-cmake-sanitized/lldb-build/lldb-test-build.noindex/module-cache-lldb/lldb-api" output:

Hide Details

runCmd: settings set use-color false output:

Hide Details

runCmd: settings set target.env-vars ASAN_OPTIONS=detect_stack_use_after_return=1 DYLD_INSERT_LIBRARIES=/Users/buildslave/jenkins/workspace/lldb-cmake-sanitized/host-compiler/lib/clang/11.0.0/lib/darwin/libclang_rt.asan_osx_dynamic.dylib output:

Hide Details

UNSUPPORTED: LLDB (/Users/buildslave/jenkins/workspace/lldb-cmake-sanitized/lldb-build/bin/clang-10-x86_64) :: test_sid_is_same_without_setsid_llgs (TestStubSetSID.TestStubSetSIDTestCase) (llgs tests) Restore dir to: /Users/buildslave/jenkins/workspace/lldb-cmake-sanitized/lldb-build/tools/lldb/test ====================================================================== FAIL: test_sid_is_different_with_S_debugserver (TestStubSetSID.TestStubSetSIDTestCase) ---------------------------------------------------------------------- Traceback (most recent call last): File "/Users/buildslave/jenkins/workspace/lldb-cmake-sanitized/llvm-project/lldb/packages/Python/lldbsuite/test/decorators.py", line 140, in wrapper func(*args, **kwargs) File "/Users/buildslave/jenkins/workspace/lldb-cmake-sanitized/llvm-project/lldb/packages/Python/lldbsuite/test/decorators.py", line 140, in wrapper func(*args, **kwargs) File "/Users/buildslave/jenkins/workspace/lldb-cmake-sanitized/llvm-project/lldb/packages/Python/lldbsuite/test/tools/lldb-server/commandline/TestStubSetSID.py", line 78, in test_sid_is_different_with_S_debugserver self.sid_is_different_with_S() File "/Users/buildslave/jenkins/workspace/lldb-cmake-sanitized/llvm-project/lldb/packages/Python/lldbsuite/test/tools/lldb-server/commandline/TestStubSetSID.py", line 39, in sid_is_different_with_S stub_sid = self.get_stub_sid(["-S"]) File "/Users/buildslave/jenkins/workspace/lldb-cmake-sanitized/llvm-project/lldb/packages/Python/lldbsuite/test/tools/lldb-server/commandline/TestStubSetSID.py", line 25, in get_stub_sid server.pid, True)) AssertionError: False is not True Config=x86_64-/Users/buildslave/jenkins/workspace/lldb-cmake-sanitized/lldb-build/bin/clang-10 ---------------------------------------------------------------------- Ran 6 tests in 15.078s

Hide Details

RESULT: FAILED (2 passes, 1 failures, 0 errors, 3 skipped, 0 expected failures, 0 unexpected successes)

Hide Details

******************** PASS: lldb-unit :: Utility/./UtilityTests/StreamTest.PutHex32ByteOrderBig (1733 of 1893) PASS: lldb-unit :: ScriptInterpreter/Python/./ScriptInterpreterPythonTests/PythonDataObjectsTest.TestCallable (1734 of 1893) PASS: lldb-api :: lang/cpp/unsigned_types/TestUnsignedTypes.py (1735 of 1893) PASS: lldb-shell :: ObjectFile/Breakpad/discontiguous-sections.test (1736 of 1893) UNSUPPORTED: lldb-shell :: SymbolFile/PDB/function-nested-block.test (1737 of 1893) PASS: lldb-unit :: Utility/./UtilityTests/ReproducerTest.SetCapture (1738 of 1893) PASS: lldb-api :: functionalities/dead-strip/TestDeadStrip.py (1739 of 1893) PASS: lldb-unit :: Utility/./UtilityTests/StreamTest.PutMaxHex64ByteOrderLittle (1740 of 1893) UNSUPPORTED: lldb-api :: functionalities/tsan/global_location/TestTsanGlobalLocation.py (1741 of 1893) PASS: lldb-api :: commands/expression/import-std-module/forward_list-dbg-info-content/TestDbgInfoContentForwardList.py (1742 of 1893) PASS: lldb-api :: tools/lldb-server/TestGdbRemoteSingleStep.py (1743 of 1893) PASS: lldb-unit :: Utility/./UtilityTests/NameMatchesTest.EndsWith (1744 of 1893) PASS: lldb-unit :: ScriptInterpreter/Python/./ScriptInterpreterPythonTests/PythonDataObjectsTest.TestPythonTupleSize (1745 of 1893) PASS: lldb-unit :: ObjectFile/Breakpad/./ObjectFileBreakpadTests/FileRecord.parse (1746 of 1893) PASS: lldb-api :: lang/c/tls_globals/TestTlsGlobals.py (1747 of 1893) PASS: lldb-api :: functionalities/source-map/TestTargetSourceMap.py (1748 of 1893) PASS: lldb-unit :: Utility/./UtilityTests/VMRange.ContainsAddr (1749 of 1893) PASS: lldb-unit :: Utility/./UtilityTests/StreamTeeTest.Write (1750 of 1893) PASS: lldb-unit :: ScriptInterpreter/Python/./ScriptInterpreterPythonTests/PythonDataObjectsTest.TestPythonBoolean (1751 of 1893) PASS: lldb-unit :: Utility/./UtilityTests/FileSpecTest.Equal (1752 of 1893) PASS: lldb-unit :: Utility/./UtilityTests/StringExtractorTest.GetHexBytesAvail_OddPair2 (1753 of 1893) PASS: lldb-shell :: Settings/TestEchoCommands.test (1754 of 1893) PASS: lldb-unit :: SymbolFile/NativePDB/./SymbolFileNativePDBTests/PDBFPOProgramToDWARFExpressionTests.UnresolvedDependentCyclicRegisterAssignmentReference (1755 of 1893) PASS: lldb-unit :: Utility/./UtilityTests/OptionsWithRawTest.MultiWordSuffix (1756 of 1893) PASS: lldb-unit :: Host/./HostTests/FileSystemTest.GetPermissions (1757 of 1893) PASS: lldb-unit :: Expression/./ExpressionTests/CppModuleConfigurationTest.UnrelatedLibrary (1758 of 1893) PASS: lldb-shell :: SymbolFile/DWARF/debug-types-dwo-cross-reference.cpp (1759 of 1893) PASS: lldb-unit :: Symbol/./SymbolTests/PostfixExpression.ParseOneExpression (1760 of 1893) PASS: lldb-unit :: Utility/./UtilityTests/StreamTest.AddressRangeSize (1761 of 1893) UNSUPPORTED: lldb-api :: commands/register/register/intel_xtended_registers/mpx_offset_intersection/TestMPXOffsetIntersection.py (1762 of 1893) PASS: lldb-api :: commands/platform/basic/TestPlatformPython.py (1763 of 1893) PASS: lldb-shell :: ObjectFile/ELF/minidebuginfo-corrupt-xz.yaml (1764 of 1893) PASS: lldb-unit :: UnwindAssembly/x86/./UnwindAssemblyx86Tests/Testx86AssemblyInspectionEngine.TestPushEBP (1765 of 1893) PASS: lldb-unit :: tools/lldb-server/tests/./LLDBServerTests/StandardStartupTest.TestStopReplyContainsThreadPcs (1766 of 1893) PASS: lldb-api :: commands/expression/po_verbosity/TestPoVerbosity.py (1767 of 1893) PASS: lldb-api :: arm/emulation/TestEmulations.py (1768 of 1893) UNSUPPORTED: lldb-api :: benchmarks/stepping/TestSteppingSpeed.py (1769 of 1893) PASS: lldb-api :: python_api/frame/get-variables/TestGetVariables.py (1770 of 1893) PASS: lldb-unit :: Utility/./UtilityTests/RangeTest.ContainsAddrInvalid (1771 of 1893) PASS: lldb-shell :: ObjectFile/PECOFF/basic-info-arm.yaml (1772 of 1893) PASS: lldb-api :: commands/expression/unwind_expression/TestUnwindExpression.py (1773 of 1893) PASS: lldb-unit :: Utility/./UtilityTests/SerializationRountripTest.SerializeDeserializePodReferences (1774 of 1893) PASS: lldb-api :: functionalities/data-formatter/data-formatter-stl/libcxx/initializerlist/TestInitializerList.py (1775 of 1893) PASS: lldb-api :: lang/cpp/gmodules/TestWithModuleDebugging.py (1776 of 1893) PASS: lldb-api :: lang/objc/print-obj/TestPrintObj.py (1777 of 1893) PASS: lldb-api :: functionalities/data-formatter/parray/TestPrintArray.py (1778 of 1893) PASS: lldb-unit :: Utility/./UtilityTests/StringListTest.CopyListSingle (1779 of 1893) PASS: lldb-api :: commands/expression/scoped_enums/TestScopedEnumType.py (1780 of 1893) PASS: lldb-unit :: Utility/./UtilityTests/StreamTest.ShiftOperatorPtr (1781 of 1893) UNSUPPORTED: lldb-shell :: SymbolFile/DWARF/debug-types-expressions.test (1782 of 1893) PASS: lldb-api :: functionalities/thread/concurrent_events/TestConcurrentWatchBreakDelay.py (1783 of 1893) PASS: lldb-unit :: Utility/./UtilityTests/TildeExpressionResolver.ResolveFullPath (1784 of 1893) PASS: lldb-api :: functionalities/data-formatter/data-formatter-stl/libcxx/vbool/TestDataFormatterLibcxxVBool.py (1785 of 1893) PASS: lldb-unit :: Utility/./UtilityTests/ConstStringTest.UpdateMangledCounterpart (1786 of 1893) PASS: lldb-api :: macosx/version_zero/TestGetVersionZeroVersion.py (1787 of 1893) PASS: lldb-unit :: tools/lldb-server/tests/./LLDBServerTests/TestBase.DebugserverEnv (1788 of 1893) PASS: lldb-api :: commands/expression/import-std-module/vector-basic/TestBasicVector.py (1789 of 1893) PASS: lldb-api :: functionalities/thread/concurrent_events/TestConcurrentTwoBreakpointsOneSignal.py (1790 of 1893) PASS: lldb-api :: functionalities/dynamic_value_child_count/TestDynamicValueChildCount.py (1791 of 1893) PASS: lldb-shell :: SymbolFile/NativePDB/break-by-line.cpp (1792 of 1893) PASS: lldb-api :: functionalities/thread/crash_during_step/TestCrashDuringStep.py (1793 of 1893) PASS: lldb-unit :: ScriptInterpreter/Python/./ScriptInterpreterPythonTests/PythonDataObjectsTest.TestResetting (1794 of 1893) PASS: lldb-api :: commands/expression/no-deadlock/TestExprDoesntBlock.py (1795 of 1893) PASS: lldb-unit :: Utility/./UtilityTests/RangeTest.Slide (1796 of 1893) PASS: lldb-api :: functionalities/plugins/command_plugin/TestPluginCommands.py (1797 of 1893) PASS: lldb-api :: lang/objcxx/class-name-clash/TestNameClash.py (1798 of 1893) PASS: lldb-shell :: SymbolFile/DWARF/dwarf5_locations.s (1799 of 1893) PASS: lldb-api :: functionalities/breakpoint/breakpoint_names/TestBreakpointNames.py (1800 of 1893) PASS: lldb-api :: types/TestDoubleTypesExpr.py (1801 of 1893) PASS: lldb-api :: lang/c/unions/TestUnionMembers.py (1802 of 1893) PASS: lldb-api :: lang/cpp/namespace/TestNamespace.py (1803 of 1893) PASS: lldb-api :: lang/cpp/scope/TestCppScope.py (1804 of 1893) PASS: lldb-unit :: UnwindAssembly/x86/./UnwindAssemblyx86Tests/Testx86AssemblyInspectionEngine.Testi386IgnoredRegisters (1805 of 1893) PASS: lldb-api :: functionalities/breakpoint/address_breakpoints/TestBadAddressBreakpoints.py (1806 of 1893) PASS: lldb-api :: functionalities/data-formatter/nsarraysynth/TestNSArraySynthetic.py (1807 of 1893) PASS: lldb-unit :: Utility/./UtilityTests/StringLexerTest.AdvanceIf (1808 of 1893) PASS: lldb-shell :: SymbolFile/DWARF/array-sizes.s (1809 of 1893) PASS: lldb-api :: functionalities/avoids-fd-leak/TestFdLeak.py (1810 of 1893) PASS: lldb-shell :: Commands/CommandScriptImmediateOutput/CommandScriptImmediateOutputConsole.test (1811 of 1893) PASS: lldb-unit :: Utility/./UtilityTests/StringExtractorTest.DecodeHexU8_InvalidHex2 (1812 of 1893) PASS: lldb-unit :: UnwindAssembly/x86/./UnwindAssemblyx86Tests/Testx86AssemblyInspectionEngine.TestPush0 (1813 of 1893) PASS: lldb-api :: lang/c/set_values/TestSetValues.py (1814 of 1893) UNSUPPORTED: lldb-api :: commands/expression/call-restarts/TestCallThatRestarts.py (1815 of 1893) PASS: lldb-api :: lang/cpp/const_this/TestConstThis.py (1816 of 1893) UNSUPPORTED: lldb-api :: functionalities/darwin_log/format/TestDarwinLogMessageFormat.py (1817 of 1893) PASS: lldb-unit :: Utility/./UtilityTests/BinaryStreamTest.PutSLEB128NineBytes (1818 of 1893) PASS: lldb-api :: functionalities/thread/concurrent_events/TestConcurrentManyCrash.py (1819 of 1893) PASS: lldb-unit :: Utility/./UtilityTests/UriParserTest.BadPort (1820 of 1893) UNSUPPORTED: lldb-api :: tools/lldb-server/TestGdbRemote_vContThreads.py (1821 of 1893) PASS: lldb-unit :: Core/./LLDBCoreTests/MangledTest.ResultForValidName (1822 of 1893) PASS: lldb-unit :: Utility/./UtilityTests/VMRange.ContainsRange (1823 of 1893) PASS: lldb-shell :: SymbolFile/Breakpad/unwind-via-raSearch.test (1824 of 1893) PASS: lldb-shell :: SymbolFile/symbol-binding.test (1825 of 1893) PASS: lldb-api :: functionalities/tail_call_frames/disambiguate_tail_call_seq/TestDisambiguateTailCallSeq.py (1826 of 1893) PASS: lldb-api :: functionalities/data-formatter/data-formatter-stl/libcxx/list/TestDataFormatterLibcxxList.py (1827 of 1893) PASS: lldb-api :: functionalities/breakpoint/inlined_breakpoints/TestInlinedBreakpoints.py (1828 of 1893) PASS: lldb-shell :: ObjectFile/ELF/PT_LOAD-overlap-section.yaml (1829 of 1893) UNSUPPORTED: lldb-api :: tools/lldb-vscode/completions/TestVSCode_completions.py (1830 of 1893) PASS: lldb-unit :: ScriptInterpreter/Python/./ScriptInterpreterPythonTests/PythonDataObjectsTest.TestPythonDictionaryToStructuredDictionary (1831 of 1893) UNSUPPORTED: lldb-api :: terminal/TestEditline.py (1832 of 1893) PASS: lldb-api :: commands/frame/diagnose/local-variable/TestLocalVariable.py (1833 of 1893) PASS: lldb-api :: lang/objc/objc-static-method/TestObjCStaticMethod.py (1834 of 1893) PASS: lldb-unit :: Expression/./ExpressionTests/DiagnosticManagerTest.PutStringMultiple (1835 of 1893) FAIL: lldb-api :: tools/lldb-server/TestGdbRemoteAttach.py (1836 of 1893) ******************** TEST 'lldb-api :: tools/lldb-server/TestGdbRemoteAttach.py' FAILED ******************** lldb version 11.0.99 (http://labmaster3.local/git/llvm-project.git revision c1b13a1b17719aebace1b3be7a6ac7f90b1901a6) clang revision 936483fb7dd2c8c6b014516ff3b3cd13740e0518 llvm revision 936483fb7dd2c8c6b014516ff3b3cd13740e0518 LLDB library dir: /Users/buildslave/jenkins/workspace/lldb-cmake-sanitized/lldb-build/bin LLDB import library dir: /Users/buildslave/jenkins/workspace/lldb-cmake-sanitized/lldb-build/bin libstdcxx tests will not be run because: Don't know how to build with libstdcxx on macosx Skipping following debug info categories: ['dwo'] setting set target.prefer-dynamic-value no-dynamic-values

Hide Details

Session logs for test failures/errors/unexpected successes will go into directory '/Users/buildslave/jenkins/workspace/lldb-cmake-sanitized/test/logs' Command invoked: /Users/buildslave/jenkins/workspace/lldb-cmake-sanitized/llvm-project/lldb/test/API/dotest.py --arch x86_64 -s /Users/buildslave/jenkins/workspace/lldb-cmake-sanitized/lldb-build/lldb-test-traces -S nm -u CXXFLAGS -u CFLAGS --codesign-identity lldb_codesign --server /Users/buildslave/jenkins/workspace/lldb-cmake-sanitized/lldb-build/./bin/debugserver --arch x86_64 --build-dir /Users/buildslave/jenkins/workspace/lldb-cmake-sanitized/lldb-build/lldb-test-build.noindex -s=/Users/buildslave/jenkins/workspace/lldb-cmake-sanitized/test/logs -t --env TERM=vt100 --env LLVM_LIBS_DIR=/Users/buildslave/jenkins/workspace/lldb-cmake-sanitized/lldb-build/./lib --inferior-env ASAN_OPTIONS=detect_stack_use_after_return=1 --inferior-env DYLD_INSERT_LIBRARIES=/Users/buildslave/jenkins/workspace/lldb-cmake-sanitized/host-compiler/lib/clang/11.0.0/lib/darwin/libclang_rt.asan_osx_dynamic.dylib --build-dir /Users/buildslave/jenkins/workspace/lldb-cmake-sanitized/lldb-build/lldb-test-build.noindex --lldb-module-cache-dir /Users/buildslave/jenkins/workspace/lldb-cmake-sanitized/lldb-build/lldb-test-build.noindex/module-cache-lldb/lldb-api --clang-module-cache-dir /Users/buildslave/jenkins/workspace/lldb-cmake-sanitized/lldb-build/lldb-test-build.noindex/module-cache-clang/lldb-api --executable /Users/buildslave/jenkins/workspace/lldb-cmake-sanitized/lldb-build/./bin/lldb --compiler /Users/buildslave/jenkins/workspace/lldb-cmake-sanitized/lldb-build/./bin/clang --dsymutil /Users/buildslave/jenkins/workspace/lldb-cmake-sanitized/lldb-build/./bin/dsymutil --filecheck /Users/buildslave/jenkins/workspace/lldb-cmake-sanitized/lldb-build/./bin/FileCheck /Users/buildslave/jenkins/workspace/lldb-cmake-sanitized/llvm-project/lldb/packages/Python/lldbsuite/test/tools/lldb-server -p TestGdbRemoteAttach.py Change dir to: /Users/buildslave/jenkins/workspace/lldb-cmake-sanitized/llvm-project/lldb/packages/Python/lldbsuite/test/tools/lldb-server runCmd: settings set symbols.enable-external-lookup false output:

Hide Details

runCmd: settings set plugin.process.gdb-remote.packet-timeout 60 output:

Hide Details

runCmd: settings set symbols.clang-modules-cache-path "/Users/buildslave/jenkins/workspace/lldb-cmake-sanitized/lldb-build/lldb-test-build.noindex/module-cache-lldb/lldb-api" output:

Hide Details

runCmd: settings set use-color false output:

Hide Details

runCmd: settings set target.env-vars ASAN_OPTIONS=detect_stack_use_after_return=1 DYLD_INSERT_LIBRARIES=/Users/buildslave/jenkins/workspace/lldb-cmake-sanitized/host-compiler/lib/clang/11.0.0/lib/darwin/libclang_rt.asan_osx_dynamic.dylib output:

Hide Details

Adding tearDown hook: def shutdown_named_pipe(): # Close the pipe. try: named_pipe.close() except: print("failed to close named pipe") None

Hide Details

# Delete the pipe. try: os.remove(named_pipe_path) except: print("failed to delete named pipe: {}".format(named_pipe_path)) None

Hide Details

# Delete the temp directory. try: os.rmdir(temp_dir) except: print( "failed to delete temp dir: {}, directory contents: '{}'".format( temp_dir, os.listdir(temp_dir))) None

Hide Details

Hide Details

Adding tearDown hook: def shutdown_process_for_attach(): try: inferior.terminate() except: logger.warning( "failed to terminate inferior process for attach: {}; ignoring".format( sys.exc_info()[0]))

Hide Details

Hide Details

Adding tearDown hook: def cleanupSubprocesses(self): # Ensure any subprocesses are cleaned up for p in self.subprocesses: p.terminate() del p del self.subprocesses[:] # Ensure any forked processes are cleaned up for pid in self.forkedProcessPids: if os.path.exists("/proc/" + str(pid)): os.kill(pid, signal.SIGTERM)

Hide Details

Hide Details

Adding tearDown hook: def shutdown_debug_monitor(): try: server.terminate() except: logger.warning( "failed to terminate server for debug monitor: {}; ignoring".format( sys.exc_info()[0]))

Hide Details

Hide Details

Adding tearDown hook: def shutdown_socket(): if sock: try: # send the kill packet so lldb-server shuts down gracefully sock.sendall(GdbRemoteTestCaseBase._GDBREMOTE_KILL_PACKET) except: logger.warning( "failed to send kill packet to debug monitor: {}; ignoring".format( sys.exc_info()[0]))

Hide Details

try: sock.close() except: logger.warning( "failed to close socket to debug monitor: {}; ignoring".format( sys.exc_info()[0]))

Hide Details

Hide Details

FAIL: LLDB (/Users/buildslave/jenkins/workspace/lldb-cmake-sanitized/lldb-build/bin/clang-10-x86_64) :: test_attach_with_vAttach_debugserver (TestGdbRemoteAttach.TestGdbRemoteAttach) Executing tearDown hook: def shutdown_socket(): if sock: try: # send the kill packet so lldb-server shuts down gracefully sock.sendall(GdbRemoteTestCaseBase._GDBREMOTE_KILL_PACKET) except: logger.warning( "failed to send kill packet to debug monitor: {}; ignoring".format( sys.exc_info()[0]))

Hide Details

try: sock.close() except: logger.warning( "failed to close socket to debug monitor: {}; ignoring".format( sys.exc_info()[0]))

Hide Details

Hide Details

2020-01-15 07:54:08,010 WARNING failed to send kill packet to debug monitor: <class 'TypeError'>; ignoring Executing tearDown hook: def shutdown_debug_monitor(): try: server.terminate() except: logger.warning( "failed to terminate server for debug monitor: {}; ignoring".format( sys.exc_info()[0]))

Hide Details

Hide Details

Executing tearDown hook: def cleanupSubprocesses(self): # Ensure any subprocesses are cleaned up for p in self.subprocesses: p.terminate() del p del self.subprocesses[:] # Ensure any forked processes are cleaned up for pid in self.forkedProcessPids: if os.path.exists("/proc/" + str(pid)): os.kill(pid, signal.SIGTERM)

Hide Details

Hide Details

Executing tearDown hook: def shutdown_process_for_attach(): try: inferior.terminate() except: logger.warning( "failed to terminate inferior process for attach: {}; ignoring".format( sys.exc_info()[0]))

Hide Details

Hide Details

Executing tearDown hook: def shutdown_named_pipe(): # Close the pipe. try: named_pipe.close() except: print("failed to close named pipe") None

Hide Details

# Delete the pipe. try: os.remove(named_pipe_path) except: print("failed to delete named pipe: {}".format(named_pipe_path)) None

Hide Details

# Delete the temp directory. try: os.rmdir(temp_dir) except: print( "failed to delete temp dir: {}, directory contents: '{}'".format( temp_dir, os.listdir(temp_dir))) None

Hide Details

Hide Details

runCmd: settings set symbols.enable-external-lookup false output:

Hide Details

runCmd: settings set plugin.process.gdb-remote.packet-timeout 60 output:

Hide Details

runCmd: settings set symbols.clang-modules-cache-path "/Users/buildslave/jenkins/workspace/lldb-cmake-sanitized/lldb-build/lldb-test-build.noindex/module-cache-lldb/lldb-api" output:

Hide Details

runCmd: settings set use-color false output:

Hide Details

runCmd: settings set target.env-vars ASAN_OPTIONS=detect_stack_use_after_return=1 DYLD_INSERT_LIBRARIES=/Users/buildslave/jenkins/workspace/lldb-cmake-sanitized/host-compiler/lib/clang/11.0.0/lib/darwin/libclang_rt.asan_osx_dynamic.dylib output:

Hide Details

UNSUPPORTED: LLDB (/Users/buildslave/jenkins/workspace/lldb-cmake-sanitized/lldb-build/bin/clang-10-x86_64) :: test_attach_with_vAttach_llgs (TestGdbRemoteAttach.TestGdbRemoteAttach) (llgs tests) Restore dir to: /Users/buildslave/jenkins/workspace/lldb-cmake-sanitized/lldb-build/tools/lldb/test ====================================================================== FAIL: test_attach_with_vAttach_debugserver (TestGdbRemoteAttach.TestGdbRemoteAttach) ---------------------------------------------------------------------- Traceback (most recent call last): File "/Users/buildslave/jenkins/workspace/lldb-cmake-sanitized/llvm-project/lldb/packages/Python/lldbsuite/test/decorators.py", line 140, in wrapper func(*args, **kwargs) File "/Users/buildslave/jenkins/workspace/lldb-cmake-sanitized/llvm-project/lldb/packages/Python/lldbsuite/test/tools/lldb-server/TestGdbRemoteAttach.py", line 59, in test_attach_with_vAttach_debugserver self.attach_with_vAttach() File "/Users/buildslave/jenkins/workspace/lldb-cmake-sanitized/llvm-project/lldb/packages/Python/lldbsuite/test/tools/lldb-server/TestGdbRemoteAttach.py", line 27, in attach_with_vAttach inferior.pid, True)) AssertionError: False is not True Config=x86_64-/Users/buildslave/jenkins/workspace/lldb-cmake-sanitized/lldb-build/bin/clang-10 ---------------------------------------------------------------------- Ran 2 tests in 26.272s

Hide Details

RESULT: FAILED (0 passes, 1 failures, 0 errors, 1 skipped, 0 expected failures, 0 unexpected successes)

Hide Details

******************** PASS: lldb-shell :: ObjectFile/MachO/lc_build_version.yaml (1837 of 1893) PASS: lldb-api :: lang/c/struct_types/TestStructTypes.py (1838 of 1893) PASS: lldb-api :: commands/expression/cast_int_to_anonymous_enum/TestCastIntToAnonymousEnum.py (1839 of 1893) PASS: lldb-unit :: Expression/./ExpressionTests/CppModuleConfigurationTest.LinuxLocalLibCpp (1840 of 1893) PASS: lldb-unit :: Process/gdb-remote/./ProcessGdbRemoteTests/GDBRemoteCommunicationClientTest.SaveRestoreRegistersNoSuffix (1841 of 1893) PASS: lldb-api :: functionalities/breakpoint/breakpoint_hit_count/TestBreakpointHitCount.py (1842 of 1893) PASS: lldb-shell :: Minidump/Windows/Sigsegv/sigsegv.test (1843 of 1893) PASS: lldb-unit :: UnwindAssembly/x86/./UnwindAssemblyx86Tests/Testx86AssemblyInspectionEngine.TestPopEBP (1844 of 1893) PASS: lldb-shell :: SymbolFile/DWARF/debug_rnglists.s (1845 of 1893) PASS: lldb-api :: commands/expression/context-object/TestContextObject.py (1846 of 1893) PASS: lldb-api :: functionalities/fat_archives/TestFatArchives.py (1847 of 1893) PASS: lldb-unit :: Process/minidump/./LLDBMinidumpTests/MinidumpParserTest.GetMemory (1848 of 1893) PASS: lldb-unit :: UnwindAssembly/x86/./UnwindAssemblyx86Tests/Testx86AssemblyInspectionEngine.TestReturnDetect (1849 of 1893) PASS: lldb-api :: api/command-return-object/TestSBCommandReturnObject.py (1850 of 1893) PASS: lldb-api :: lang/objc/objc-ivar-stripped/TestObjCIvarStripped.py (1851 of 1893) PASS: lldb-api :: commands/command/script/TestCommandScript.py (1852 of 1893) PASS: lldb-api :: functionalities/target_var/TestTargetVar.py (1853 of 1893) PASS: lldb-unit :: Utility/./UtilityTests/UriParserTest.SchemeHostSeparator4 (1854 of 1893) PASS: lldb-api :: lang/c/offsetof/TestOffsetof.py (1855 of 1893) PASS: lldb-api :: python_api/process/read-mem-cstring/TestReadMemCString.py (1856 of 1893) UNSUPPORTED: lldb-api :: tools/lldb-server/thread-name/TestGdbRemoteThreadName.py (1857 of 1893) PASS: lldb-unit :: Language/CPlusPlus/./LanguageCPlusPlusTests/CPlusPlusLanguage.ExtractContextAndIdentifier (1858 of 1893) PASS: lldb-unit :: Signals/./SignalsTests/UnixSignalsTest.GetFilteredSignals (1859 of 1893) PASS: lldb-unit :: Utility/./UtilityTests/StreamTest.PutCString (1860 of 1893) PASS: lldb-unit :: Core/./LLDBCoreTests/RichManglingContextTest.FromCxxMethodName (1861 of 1893) PASS: lldb-api :: python_api/findvalue_duplist/TestSBFrameFindValue.py (1862 of 1893) PASS: lldb-unit :: Utility/./UtilityTests/LogChannelTest.Enable (1863 of 1893) PASS: lldb-unit :: SymbolFile/NativePDB/./SymbolFileNativePDBTests/PDBFPOProgramToDWARFExpressionTests.UnsupportedRASearch (1864 of 1893) UNSUPPORTED: lldb-shell :: ScriptInterpreter/Lua/command_script_import.test (1865 of 1893) PASS: lldb-api :: macosx/universal/TestUniversal.py (1866 of 1893) PASS: lldb-unit :: Utility/./UtilityTests/StringExtractorTest.DecodeHexU8_Extra (1867 of 1893) PASS: lldb-api :: lang/cpp/nested-class-other-compilation-unit/TestNestedClassWithParentInAnotherCU.py (1868 of 1893) PASS: lldb-unit :: Utility/./UtilityTests/UriParserTest.MinimalPort (1869 of 1893) PASS: lldb-api :: functionalities/inferior-crashing/recursive-inferior/TestRecursiveInferiorStep.py (1870 of 1893) PASS: lldb-api :: functionalities/data-formatter/data-formatter-objc/cmtime/TestDataFormatterCMTime.py (1871 of 1893) PASS: lldb-api :: functionalities/thread/concurrent_events/TestConcurrentDelayedCrashWithBreakpointWatchpoint.py (1872 of 1893) PASS: lldb-unit :: Symbol/./SymbolTests/TestClangASTContext.TestFunctionTemplateConstruction (1873 of 1893) PASS: lldb-unit :: ObjectFile/Breakpad/./ObjectFileBreakpadTests/Record.classify (1874 of 1893) PASS: lldb-api :: commands/expression/import-std-module/shared_ptr/TestSharedPtr.py (1875 of 1893) UNSUPPORTED: lldb-api :: lang/objc/rdar-12408181/TestRdar12408181.py (1876 of 1893) PASS: lldb-shell :: SymbolFile/DWARF/find-inline-method.s (1877 of 1893) PASS: lldb-unit :: Symbol/./SymbolTests/PostfixExpression.ToDWARF (1878 of 1893) PASS: lldb-api :: lang/objc/objc-dyn-sbtype/TestObjCDynamicSBType.py (1879 of 1893) PASS: lldb-api :: commands/expression/anonymous-struct/TestCallUserAnonTypedef.py (1880 of 1893) PASS: lldb-api :: commands/expression/xvalue/TestXValuePrinting.py (1881 of 1893) PASS: lldb-api :: functionalities/thread/concurrent_events/TestConcurrentNWatchNBreak.py (1882 of 1893) PASS: lldb-api :: commands/expression/import-std-module/weak_ptr-dbg-info-content/TestDbgInfoContentWeakPtr.py (1883 of 1893) PASS: lldb-api :: lang/objc/objc-static-method-stripped/TestObjCStaticMethodStripped.py (1884 of 1893) UNSUPPORTED: lldb-api :: lang/objc/bitfield_ivars/TestBitfieldIvars.py (1885 of 1893) PASS: lldb-api :: types/TestShortType.py (1886 of 1893) PASS: lldb-api :: commands/expression/call-throws/TestCallThatThrows.py (1887 of 1893) PASS: lldb-api :: tools/lldb-vscode/launch/TestVSCode_launch.py (1888 of 1893) PASS: lldb-api :: types/TestIntegerType.py (1889 of 1893) PASS: lldb-api :: types/TestCharType.py (1890 of 1893) PASS: lldb-api :: types/TestLongTypes.py (1891 of 1893) PASS: lldb-api :: lang/objc/exceptions/TestObjCExceptions.py (1892 of 1893) PASS: lldb-api :: tools/lldb-server/TestLldbGdbServer.py (1893 of 1893)

Hide Details

Testing Time: 3445.98s ******************** Failing Tests (15): lldb-api :: functionalities/data-formatter/data-formatter-objc/TestDataFormatterObjCNSBundle.py lldb-api :: functionalities/data-formatter/data-formatter-objc/TestDataFormatterObjCNSError.py lldb-api :: functionalities/data-formatter/data-formatter-objc/TestDataFormatterObjCPlain.py lldb-api :: functionalities/data-formatter/data-formatter-objc/TestDataFormatterObjCExpr.py lldb-api :: functionalities/data-formatter/data-formatter-objc/TestDataFormatterObjCCF.py lldb-api :: functionalities/data-formatter/data-formatter-objc/TestDataFormatterObjCNSData.py lldb-api :: functionalities/data-formatter/data-formatter-objc/TestDataFormatterObjCNSContainer.py lldb-api :: functionalities/data-formatter/data-formatter-objc/TestDataFormatterObjCKVO.py lldb-api :: functionalities/thread/step_out/TestThreadStepOut.py lldb-api :: functionalities/data-formatter/data-formatter-objc/TestDataFormatterObjNSException.py lldb-api :: tools/lldb-server/register-reading/TestGdbRemoteGPacket.py lldb-api :: functionalities/data-formatter/data-formatter-objc/TestDataFormatterObjCNSDate.py lldb-api :: functionalities/data-formatter/data-formatter-objc/TestDataFormatterObjCNSURL.py lldb-api :: tools/lldb-server/commandline/TestStubSetSID.py lldb-api :: tools/lldb-server/TestGdbRemoteAttach.py

Hide Details

Hide Details

Slowest Tests: -------------------------------------------------------------------------- 241.41s: lldb-api :: functionalities/inferior-crashing/TestInferiorCrashingStep.py 258.40s: lldb-api :: lang/c/anonymous/TestAnonymous.py 262.60s: lldb-api :: lang/objc/objc-new-syntax/TestObjCNewSyntaxArray.py 263.08s: lldb-api :: lang/objc/foundation/TestObjCMethodsNSError.py 268.61s: lldb-api :: lang/objc/objc-new-syntax/TestObjCNewSyntaxDictionary.py 268.62s: lldb-api :: lang/cpp/namespace/TestNamespace.py 283.75s: lldb-api :: python_api/target/TestTargetAPI.py 307.70s: lldb-api :: lang/objc/real-definition/TestRealDefinition.py 320.55s: lldb-api :: tools/lldb-server/TestGdbRemoteThreadsInStopReply.py 334.34s: lldb-api :: lang/objc/objc-new-syntax/TestObjCNewSyntaxLiteral.py 364.70s: lldb-api :: commands/target/basic/TestTargetCommand.py 393.08s: lldb-api :: functionalities/load_unload/TestLoadUnload.py 418.43s: lldb-api :: functionalities/return-value/TestReturnValue.py 448.35s: lldb-api :: types/TestLongTypesExpr.py 486.56s: lldb-api :: lang/objc/foundation/TestObjCMethods.py 518.65s: lldb-api :: tools/lldb-server/TestLldbGdbServer.py 534.56s: lldb-api :: api/multithreaded/TestMultithreaded.py 535.08s: lldb-api :: lang/objc/hidden-ivars/TestHiddenIvars.py 622.18s: lldb-api :: lang/cpp/namespace/TestNamespaceLookup.py 720.08s: lldb-api :: lang/cpp/enum_types/TestCPP11EnumTypes.py

Hide Details

Tests Times: -------------------------------------------------------------------------- [ Range ] :: [ Percentage ] :: [ Count ] -------------------------------------------------------------------------- [ 0s, 50s) :: [******************************* ] :: [1509/1893] [ 50s,100s) :: [***** ] :: [ 246/1893] [100s,150s) :: [* ] :: [ 78/1893] [150s,200s) :: [ ] :: [ 29/1893] [200s,250s) :: [ ] :: [ 11/1893] [250s,300s) :: [ ] :: [ 7/1893] [300s,350s) :: [ ] :: [ 3/1893] [350s,400s) :: [ ] :: [ 1/1893] [400s,450s) :: [ ] :: [ 2/1893] [450s,500s) :: [ ] :: [ 1/1893] [500s,550s) :: [ ] :: [ 2/1893] [550s,600s) :: [ ] :: [ 2/1893] [600s,650s) :: [ ] :: [ 1/1893] [650s,700s) :: [ ] :: [ 0/1893] [700s,750s) :: [ ] :: [ 1/1893] Expected Passes : 1710 Expected Failures : 6 Unsupported Tests : 162 Unexpected Failures: 15 FAILED: tools/lldb/test/CMakeFiles/check-lldb-lit cd /Users/buildslave/jenkins/workspace/lldb-cmake-sanitized/lldb-build/tools/lldb/test && /usr/local/bin/python /Users/buildslave/jenkins/workspace/lldb-cmake-sanitized/lldb-build/./bin/llvm-lit -v --time-tests --shuffle --xunit-xml-output=/Users/buildslave/jenkins/workspace/lldb-cmake-sanitized/test/results.xml -v --timeout 1200 /Users/buildslave/jenkins/workspace/lldb-cmake-sanitized/lldb-build/tools/lldb/test ninja: build stopped: subcommand failed. Command failed: Command '['/usr/bin/env', 'TERM=vt100', '/usr/local/bin/ninja', '-v', 'check-lldb']' returned non-zero exit status 1. Command: ['/usr/bin/env', 'TERM=vt100', '/usr/local/bin/ninja', '-v', 'check-lldb'] [Pipeline] } [Pipeline] // timeout [Pipeline] } [Pipeline] // stage [Pipeline] stage [Pipeline] { (Declarative: Post Actions) [Pipeline] scanForIssues No credentials specified [Clang (LLVM based)] Sleeping for 5 seconds due to JENKINS-32191... [Clang (LLVM based)] Parsing console log (workspace: '/Users/buildslave/jenkins/workspace/lldb-cmake-sanitized') [Pipeline] junit Recording test results [Pipeline] } [Pipeline] // stage [Pipeline] } [Pipeline] // withEnv [Pipeline] } [Pipeline] // node [Pipeline] End of Pipeline ERROR: script returned exit code 1 Finished: FAILURE