FailedConsole Output

Skipping 7,117 KB.. Full Log
PASS: lldb-unit :: Expression/./ExpressionTests/DiagnosticManagerTest.AddDiagnostic (1171 of 1893)
PASS: lldb-api :: functionalities/memory-region/TestMemoryRegion.py (1172 of 1893)
PASS: lldb-api :: functionalities/data-formatter/hexcaps/TestDataFormatterHexCaps.py (1173 of 1893)
PASS: lldb-unit :: Symbol/./SymbolTests/PostfixExpression.ParseOneExpression (1174 of 1893)
PASS: lldb-unit :: Utility/./UtilityTests/ScalarTest.GetValue (1175 of 1893)
PASS: lldb-shell :: ObjectFile/Breakpad/sections-trailing-func.test (1176 of 1893)
PASS: lldb-shell :: ObjectFile/ELF/many-sections.s (1177 of 1893)
PASS: lldb-api :: commands/command/nested_alias/TestNestedAlias.py (1178 of 1893)
PASS: lldb-api :: commands/watchpoints/watchpoint_events/TestWatchpointEvents.py (1179 of 1893)
PASS: lldb-api :: lang/cpp/global_operators/TestCppGlobalOperators.py (1180 of 1893)
PASS: lldb-api :: commands/expression/context-object-objc/TestContextObjectObjc.py (1181 of 1893)
PASS: lldb-unit :: Signals/./SignalsTests/UnixSignalsTest.GetFilteredSignals (1182 of 1893)
PASS: lldb-shell :: Unwind/trap_frame_sym_ctx.test (1183 of 1893)
PASS: lldb-api :: functionalities/thread/concurrent_events/TestConcurrentBreakpointsDelayedBreakpointOneWatchpoint.py (1184 of 1893)
PASS: lldb-unit :: Symbol/./SymbolTests/LineEntryTest.GetSameLineContiguousAddressRangeNestedInline (1185 of 1893)
PASS: lldb-api :: lang/c/vla/TestVLA.py (1186 of 1893)
PASS: lldb-unit :: Symbol/./SymbolTests/TestClangASTContext.TestIsClangType (1187 of 1893)
PASS: lldb-api :: commands/expression/function_template_specialization_temp_args/TestFunctionTemplateSpecializationTempArgs.py (1188 of 1893)
PASS: lldb-api :: lang/c/local_types/TestUseClosestType.py (1189 of 1893)
UNSUPPORTED: lldb-api :: linux/sepdebugsymlink/TestTargetSymbolsSepDebugSymlink.py (1190 of 1893)
PASS: lldb-api :: functionalities/data-formatter/data-formatter-python-synth/TestDataFormatterPythonSynth.py (1191 of 1893)
PASS: lldb-unit :: Process/minidump/./LLDBMinidumpTests/MinidumpParserTest.GetPid (1192 of 1893)
PASS: lldb-unit :: Process/gdb-remote/./ProcessGdbRemoteTests/GDBRemoteCommunicationClientTest.GetModulesInfoInvalidResponse (1193 of 1893)
PASS: lldb-unit :: Utility/./UtilityTests/StreamTest.PutSLEB128 (1194 of 1893)
PASS: lldb-unit :: Symbol/./SymbolTests/TestClangASTContext.TestGetTypeClassTypeOf (1195 of 1893)
PASS: lldb-unit :: Utility/./UtilityTests/RangeTest.SizeTypes (1196 of 1893)
PASS: lldb-shell :: Minidump/Windows/broken-unwind.test (1197 of 1893)
PASS: lldb-unit :: Process/minidump/./LLDBMinidumpTests/MinidumpParserTest.GetMemory (1198 of 1893)
PASS: lldb-shell :: SymbolFile/DWARF/win-i386-line-table.s (1199 of 1893)
PASS: lldb-api :: commands/expression/persist_objc_pointeetype/TestPersistObjCPointeeType.py (1200 of 1893)
PASS: lldb-unit :: Symbol/./SymbolTests/PostfixExpression.ToDWARF (1201 of 1893)
PASS: lldb-api :: functionalities/data-formatter/data-formatter-synth/TestDataFormatterSynth.py (1202 of 1893)
PASS: lldb-unit :: ScriptInterpreter/Python/./ScriptInterpreterPythonTests/PythonDataObjectsTest.TestExtractingUInt64ThroughStructuredData (1203 of 1893)
PASS: lldb-unit :: Utility/./UtilityTests/OptionsWithRawTest.EmptySuffixSingleWhitespace (1204 of 1893)
PASS: lldb-api :: lang/cpp/char8_t/TestCxxChar8_t.py (1205 of 1893)
PASS: lldb-api :: commands/expression/radar_8638051/Test8638051.py (1206 of 1893)
PASS: lldb-api :: functionalities/data-formatter/data-formatter-stl/libcxx/multimap/TestDataFormatterLibccMultiMap.py (1207 of 1893)
PASS: lldb-api :: functionalities/breakpoint/breakpoint_conditions/TestBreakpointConditions.py (1208 of 1893)
UNSUPPORTED: lldb-api :: terminal/TestEditline.py (1209 of 1893)
PASS: lldb-shell :: SymbolFile/DWARF/debug_rnglists-dwo.s (1210 of 1893)
PASS: lldb-unit :: Utility/./UtilityTests/BinaryStreamTest.PutSLEB128NineBytes (1211 of 1893)
PASS: lldb-api :: python_api/thread/TestThreadAPI.py (1212 of 1893)
PASS: lldb-api :: lang/cpp/modules-import/TestCXXModulesImport.py (1213 of 1893)
PASS: lldb-api :: commands/version/TestVersion.py (1214 of 1893)
PASS: lldb-unit :: Process/minidump/./LLDBMinidumpTests/MinidumpParserTest.GetMemoryRegionInfoFromMemory64List (1215 of 1893)
PASS: lldb-unit :: Utility/./UtilityTests/StringListTest.ForRangeEmpty (1216 of 1893)
PASS: lldb-unit :: ObjectFile/PECOFF/./ObjectFilePECOFFTests/PECallFrameInfoTest.Chained_eh (1217 of 1893)
PASS: lldb-unit :: Process/minidump/./LLDBMinidumpTests/MinidumpParserTest.FindMemoryRange (1218 of 1893)
PASS: lldb-api :: commands/expression/import-std-module/unique_ptr/TestUniquePtr.py (1219 of 1893)
PASS: lldb-unit :: Utility/./UtilityTests/StringListTest.ShiftStdString (1220 of 1893)
PASS: lldb-api :: functionalities/thread/concurrent_events/TestConcurrentSignalBreak.py (1221 of 1893)
PASS: lldb-api :: tools/lldb-server/TestAppleSimulatorOSType.py (1222 of 1893)
PASS: lldb-unit :: Language/Highlighting/./HighlighterTests/HighlighterTest.HighlighterSelectionType (1223 of 1893)
PASS: lldb-shell :: Register/x86-64-gp-read.test (1224 of 1893)
PASS: lldb-unit :: UnwindAssembly/x86/./UnwindAssemblyx86Tests/Testx86AssemblyInspectionEngine.TestPopEDI (1225 of 1893)
PASS: lldb-unit :: Expression/./ExpressionTests/CppModuleConfigurationTest.UnknownLibCppFile (1226 of 1893)
PASS: lldb-shell :: Process/TestEnvironment.test (1227 of 1893)
PASS: lldb-api :: commands/target/basic/TestTargetCommand.py (1228 of 1893)
PASS: lldb-unit :: Utility/./UtilityTests/ScalarTest.CastOperations (1229 of 1893)
PASS: lldb-unit :: Host/./HostTests/SocketAddressTest.GetAddressInfo (1230 of 1893)
PASS: lldb-shell :: SymbolFile/DWARF/debug-types-dwarf5.s (1231 of 1893)
PASS: lldb-unit :: Process/gdb-remote/./ProcessGdbRemoteTests/GDBRemoteCommunicationServerTest.SendErrorResponse_ErrorNumber (1232 of 1893)
PASS: lldb-unit :: Utility/./UtilityTests/NameMatchesTest.StartsWith (1233 of 1893)
PASS: lldb-unit :: Utility/./UtilityTests/StringListTest.InsertStringAtIndexOutOfBounds (1234 of 1893)
PASS: lldb-unit :: Utility/./UtilityTests/LogChannelEnabledTest.LogThread (1235 of 1893)
PASS: lldb-unit :: SymbolFile/NativePDB/./SymbolFileNativePDBTests/PDBFPOProgramToDWARFExpressionTests.InvalidAssignmentMultiple (1236 of 1893)
UNSUPPORTED: lldb-api :: benchmarks/frame_variable/TestFrameVariableResponse.py (1237 of 1893)
PASS: lldb-api :: tools/lldb-server/TestGdbRemoteKill.py (1238 of 1893)
PASS: lldb-api :: macosx/universal/TestUniversal.py (1239 of 1893)
PASS: lldb-shell :: Expr/TestTypeOfDeclTypeExpr.test (1240 of 1893)
PASS: lldb-api :: lang/objc/objc-new-syntax/TestObjCNewSyntaxDictionary.py (1241 of 1893)
PASS: lldb-unit :: Utility/./UtilityTests/ArgsTest.TestSingleArgWithQuotedSpace (1242 of 1893)
PASS: lldb-unit :: Utility/./UtilityTests/StringListTest.CopyListSingle (1243 of 1893)
PASS: lldb-shell :: Breakpoint/debug_rnglist_basic.test (1244 of 1893)
PASS: lldb-unit :: Utility/./UtilityTests/LogTest.LLDB_LOG_nullptr (1245 of 1893)
PASS: lldb-api :: functionalities/dead-strip/TestDeadStrip.py (1246 of 1893)
PASS: lldb-api :: functionalities/data-formatter/data-formatter-objc/cmtime/TestDataFormatterCMTime.py (1247 of 1893)
PASS: lldb-unit :: Utility/./UtilityTests/StringListTest.JoinSingle (1248 of 1893)
PASS: lldb-unit :: Utility/./UtilityTests/OptionsWithRawTest.SingleWhitespaceInput (1249 of 1893)
PASS: lldb-api :: functionalities/thread/concurrent_events/TestConcurrentTwoWatchpointsOneBreakpoint.py (1250 of 1893)
PASS: lldb-unit :: Target/./TargetTests/ExecutionContextTest.GetByteOrder (1251 of 1893)
PASS: lldb-api :: functionalities/lazy-loading/TestLazyLoading.py (1252 of 1893)
PASS: lldb-unit :: Utility/./UtilityTests/FileSpecTest.PrependPathComponent (1253 of 1893)
PASS: lldb-api :: lang/objc/foundation/TestObjCMethodsNSError.py (1254 of 1893)
PASS: lldb-unit :: ScriptInterpreter/Python/./ScriptInterpreterPythonTests/PythonDataObjectsTest.TestPythonDictionaryManipulation (1255 of 1893)
PASS: lldb-unit :: Utility/./UtilityTests/StringListTest.Clear (1256 of 1893)
PASS: lldb-shell :: SymbolFile/DWARF/find-variable-file.cpp (1257 of 1893)
PASS: lldb-shell :: SymbolFile/DWARF/find-function-regex.cpp (1258 of 1893)
PASS: lldb-unit :: Utility/./UtilityTests/StringLexerTest.NextIfList (1259 of 1893)
PASS: lldb-unit :: Utility/./UtilityTests/OptionsWithRawTest.ArgsButNoLeadingDash (1260 of 1893)
UNSUPPORTED: lldb-shell :: SymbolFile/PDB/udt-layout.test (1261 of 1893)
PASS: lldb-shell :: SymbolFile/DWARF/find-method-local-struct.cpp (1262 of 1893)
PASS: lldb-api :: functionalities/thread/backtrace_all/TestBacktraceAll.py (1263 of 1893)
PASS: lldb-api :: commands/expression/scoped_enums/TestScopedEnumType.py (1264 of 1893)
PASS: lldb-unit :: ObjectFile/Breakpad/./ObjectFileBreakpadTests/FuncRecord.parse (1265 of 1893)
PASS: lldb-unit :: Host/./HostTests/FileSystemTest.OpenErrno (1266 of 1893)
PASS: lldb-api :: functionalities/thread/concurrent_events/TestConcurrentDelaySignalWatch.py (1267 of 1893)
PASS: lldb-api :: lang/cpp/gmodules-templates/TestGModules.py (1268 of 1893)
PASS: lldb-unit :: Utility/./UtilityTests/StreamTest.PutULEB128 (1269 of 1893)
PASS: lldb-unit :: Utility/./UtilityTests/CompletionRequest.DuplicateFilteringWithComments (1270 of 1893)
PASS: lldb-api :: lang/c/step_over_no_deadlock/TestStepOverDoesntBlock.py (1271 of 1893)
PASS: lldb-shell :: ObjectFile/ELF/minidebuginfo-find-symbols.yaml (1272 of 1893)
PASS: lldb-api :: functionalities/thread/concurrent_events/TestConcurrentManyWatchpoints.py (1273 of 1893)
PASS: lldb-api :: functionalities/postmortem/mach-core/TestMachCore.py (1274 of 1893)
PASS: lldb-unit :: Utility/./UtilityTests/LogChannelTest.EnableOptions (1275 of 1893)
PASS: lldb-shell :: SymbolFile/DWARF/debug_ranges_and_rnglists.test (1276 of 1893)
PASS: lldb-api :: commands/process/attach-resume/TestAttachResume.py (1277 of 1893)
PASS: lldb-shell :: ObjectFile/ELF/netbsd-exec-8.99.30-amd64.yaml (1278 of 1893)
PASS: lldb-api :: functionalities/data-formatter/data-formatter-stl/libcxx/list/loop/TestDataFormatterLibcxxListLoop.py (1279 of 1893)
PASS: lldb-unit :: Utility/./UtilityTests/LogChannelEnabledTest.LogGetLogThread (1280 of 1893)
PASS: lldb-api :: functionalities/data-formatter/data-formatter-ptr-to-array/TestPtrToArrayFormatting.py (1281 of 1893)
PASS: lldb-unit :: UnwindAssembly/x86/./UnwindAssemblyx86Tests/Testx86AssemblyInspectionEngine.TestPopRBP (1282 of 1893)
PASS: lldb-api :: lang/cpp/operator-overload/TestOperatorOverload.py (1283 of 1893)
UNSUPPORTED: lldb-shell :: Register/x86-64-ymm16-read.test (1284 of 1893)
PASS: lldb-unit :: Host/./HostTests/File.GetStreamFromDescriptor (1285 of 1893)
PASS: lldb-unit :: ScriptInterpreter/Python/./ScriptInterpreterPythonTests/PythonDataObjectsTest.TestPythonListValueEquality (1286 of 1893)
PASS: lldb-api :: macosx/find-app-in-bundle/TestFindAppInBundle.py (1287 of 1893)
PASS: lldb-unit :: Utility/./UtilityTests/OptionsWithRawTest.WhitespaceSuffix (1288 of 1893)
PASS: lldb-api :: functionalities/data-formatter/user-format-vs-summary/TestUserFormatVsSummary.py (1289 of 1893)
PASS: lldb-unit :: Utility/./UtilityTests/StreamTeeTest.SetStreamAtIndexOutOfBounds (1290 of 1893)
PASS: lldb-shell :: Breakpoint/debug_rnglist_rlestartend.test (1291 of 1893)
PASS: lldb-api :: lang/cpp/rvalue-references/TestRvalueReferences.py (1292 of 1893)
PASS: lldb-unit :: Utility/./UtilityTests/ConstStringTest.FromMidOfBufferStringRef (1293 of 1893)
PASS: lldb-unit :: Utility/./UtilityTests/GeneratorTest.Get (1294 of 1893)
PASS: lldb-unit :: Utility/./UtilityTests/UriParserTest.LongPath (1295 of 1893)
UNSUPPORTED: lldb-shell :: Expr/TestIRMemoryMapWindows.test (1296 of 1893)
PASS: lldb-shell :: Reproducer/Functionalities/TestStepping.test (1297 of 1893)
PASS: lldb-api :: commands/watchpoints/step_over_watchpoint/TestStepOverWatchpoint.py (1298 of 1893)
PASS: lldb-api :: python_api/sbtype_typeclass/TestSBTypeTypeClass.py (1299 of 1893)
PASS: lldb-api :: lang/cpp/scope/TestCppScope.py (1300 of 1893)
PASS: lldb-unit :: Utility/./UtilityTests/StreamTest.AddressRangeSize (1301 of 1893)
PASS: lldb-unit :: Utility/./UtilityTests/StructuredDataTest.ParseJSONFromFile (1302 of 1893)
PASS: lldb-unit :: Utility/./UtilityTests/ProcessInstanceInfo.DumpTable (1303 of 1893)
PASS: lldb-unit :: Utility/./UtilityTests/StringListTest.LongestCommonPrefixEmpty (1304 of 1893)
PASS: lldb-unit :: UnwindAssembly/x86/./UnwindAssemblyx86Tests/Testx86AssemblyInspectionEngine.TestPushEBX (1305 of 1893)
PASS: lldb-api :: lang/objc/foundation/TestObjCMethodsNSArray.py (1306 of 1893)
PASS: lldb-shell :: SymbolFile/NativePDB/ast-types.cpp (1307 of 1893)
UNSUPPORTED: lldb-shell :: ObjectFile/ELF/minidebuginfo-set-and-hit-breakpoint.test (1308 of 1893)
PASS: lldb-api :: lang/objc/objc-baseclass-sbtype/TestObjCBaseClassSBType.py (1309 of 1893)
PASS: lldb-unit :: ObjectFile/Breakpad/./ObjectFileBreakpadTests/Record.classify (1310 of 1893)
PASS: lldb-unit :: Utility/./UtilityTests/StringExtractorTest.DecodeHexU8_InvalidHex (1311 of 1893)
PASS: lldb-shell :: SymbolFile/DWARF/split-dwarf-inlining.cpp (1312 of 1893)
UNSUPPORTED: lldb-api :: functionalities/process_save_core/TestProcessSaveCore.py (1313 of 1893)
PASS: lldb-unit :: Target/./TargetTests/ModuleCacheTest.GetAndPutStrangeHostname (1314 of 1893)
PASS: lldb-shell :: SymbolFile/DWARF/apple-index-is-used.cpp (1315 of 1893)
PASS: lldb-unit :: Utility/./UtilityTests/StringExtractorTest.GetU64BigEndian (1316 of 1893)
PASS: lldb-unit :: Symbol/./SymbolTests/TestClangASTContext.TestGetBasicTypeFromEnum (1317 of 1893)
PASS: lldb-unit :: Process/gdb-remote/./ProcessGdbRemoteTests/GDBRemoteCommunicationClientTest.ReadRegister (1318 of 1893)
PASS: lldb-unit :: UnwindAssembly/x86/./UnwindAssemblyx86Tests/Testx86AssemblyInspectionEngine.TestPopEBX (1319 of 1893)
PASS: lldb-shell :: ObjectFile/Breakpad/uuid-matching-mac.test (1320 of 1893)
PASS: lldb-api :: tools/lldb-vscode/attach/TestVSCode_attach.py (1321 of 1893)
PASS: lldb-unit :: Utility/./UtilityTests/Flags.Test (1322 of 1893)
PASS: lldb-api :: functionalities/thread/concurrent_events/TestConcurrentWatchBreak.py (1323 of 1893)
PASS: lldb-shell :: Expr/TestIRMemoryMap.test (1324 of 1893)
PASS: lldb-unit :: Utility/./UtilityTests/SerializationRountripTest.SerializeDeserializeCString (1325 of 1893)
PASS: lldb-shell :: Minidump/Windows/Sigsegv/sigsegv.test (1326 of 1893)
PASS: lldb-unit :: Utility/./UtilityTests/ListenerTest.GetEventWait (1327 of 1893)
PASS: lldb-unit :: Utility/./UtilityTests/StringLexerTest.GetUnlexed (1328 of 1893)
PASS: lldb-api :: terminal/TestSTTYBeforeAndAfter.py (1329 of 1893)
UNSUPPORTED: lldb-shell :: SymbolFile/PDB/variables-locations.test (1330 of 1893)
PASS: lldb-unit :: UnwindAssembly/x86/./UnwindAssemblyx86Tests/Testx86AssemblyInspectionEngine.Test64bitFramelessSmallStackFrame (1331 of 1893)
PASS: lldb-shell :: SymbolFile/DWARF/debug_ranges.s (1332 of 1893)
PASS: lldb-api :: functionalities/rerun/TestRerun.py (1333 of 1893)
PASS: lldb-unit :: Language/CPlusPlus/./LanguageCPlusPlusTests/CPlusPlusLanguage.ExtractContextAndIdentifier (1334 of 1893)
PASS: lldb-api :: functionalities/thread/concurrent_events/TestConcurrentTwoWatchpointThreads.py (1335 of 1893)
PASS: lldb-unit :: UnwindAssembly/x86/./UnwindAssemblyx86Tests/Testx86AssemblyInspectionEngine.TestCALLNextInsn (1336 of 1893)
PASS: lldb-api :: macosx/load-kext/TestLoadKext.py (1337 of 1893)
PASS: lldb-shell :: SymbolFile/NativePDB/break-by-line.cpp (1338 of 1893)
PASS: lldb-unit :: Utility/./UtilityTests/AnsiTerminal.Unknown (1339 of 1893)
PASS: lldb-unit :: ScriptInterpreter/Python/./ScriptInterpreterPythonTests/PythonDataObjectsTest.TestPythonTupleInitializerList2 (1340 of 1893)
PASS: lldb-unit :: Core/./LLDBCoreTests/MangledTest.ResultForValidName (1341 of 1893)
PASS: lldb-shell :: ObjectFile/PECOFF/dep-modules.yaml (1342 of 1893)
PASS: lldb-shell :: SymbolFile/Breakpad/line-table-edgecases.test (1343 of 1893)
PASS: lldb-shell :: Breakpoint/dummy-target.test (1344 of 1893)
PASS: lldb-api :: functionalities/thread/concurrent_events/TestConcurrentSignalDelayBreak.py (1345 of 1893)
PASS: lldb-unit :: Utility/./UtilityTests/StreamTest.PutRawBytesToLittleEndian (1346 of 1893)
PASS: lldb-api :: lang/cpp/class-template-parameter-pack/TestClassTemplateParameterPack.py (1347 of 1893)
PASS: lldb-api :: lang/objc/modules-update/TestClangModulesUpdate.py (1348 of 1893)
PASS: lldb-unit :: Process/gdb-remote/./ProcessGdbRemoteTests/GDBRemoteClientBaseTest.SendContinueDelegateStructuredDataReceipt (1349 of 1893)
PASS: lldb-api :: lang/objc/objc-struct-argument/TestObjCStructArgument.py (1350 of 1893)
PASS: lldb-unit :: ObjectFile/ELF/./ObjectFileELFTests/ObjectFileELFTest.GetSymtab_NoSymEntryPointArmThumbAddressClass (1351 of 1893)
PASS: lldb-api :: commands/settings/TestSettings.py (1352 of 1893)
PASS: lldb-api :: commands/expression/completion-in-lambda-and-unnamed-class/TestCompletionInLambdaAndUnnamedClass.py (1353 of 1893)
PASS: lldb-api :: lang/objc/modules-app-update/TestClangModulesAppUpdate.py (1354 of 1893)
FAIL: lldb-api :: functionalities/data-formatter/data-formatter-objc/TestDataFormatterObjCNSError.py (1355 of 1893)
******************** TEST 'lldb-api :: functionalities/data-formatter/data-formatter-objc/TestDataFormatterObjCNSError.py' FAILED ********************
lldb version 11.0.99 (http://labmaster3.local/git/llvm-project.git revision c1b13a1b17719aebace1b3be7a6ac7f90b1901a6)
  clang revision d629525597ebe3533d110ea288c2640f0dc24bf7
  llvm revision d629525597ebe3533d110ea288c2640f0dc24bf7
LLDB library dir: /Users/buildslave/jenkins/workspace/lldb-cmake-sanitized/lldb-build/bin
LLDB import library dir: /Users/buildslave/jenkins/workspace/lldb-cmake-sanitized/lldb-build/bin
libstdcxx tests will not be run because: Don't know how to build with libstdcxx on macosx
Skipping following debug info categories: ['dwo']
setting set target.prefer-dynamic-value no-dynamic-values
AddressSanitizer report breakpoint hit. Use 'thread info -s' to get extended information about the report.
AddressSanitizer report breakpoint hit. Use 'thread info -s' to get extended information about the report.
AddressSanitizer report breakpoint hit. Use 'thread info -s' to get extended information about the report.

Hide Details

Session logs for test failures/errors/unexpected successes will go into directory '/Users/buildslave/jenkins/workspace/lldb-cmake-sanitized/test/logs' Command invoked: /Users/buildslave/jenkins/workspace/lldb-cmake-sanitized/llvm-project/lldb/test/API/dotest.py --arch x86_64 -s /Users/buildslave/jenkins/workspace/lldb-cmake-sanitized/lldb-build/lldb-test-traces -S nm -u CXXFLAGS -u CFLAGS --codesign-identity lldb_codesign --server /Users/buildslave/jenkins/workspace/lldb-cmake-sanitized/lldb-build/./bin/debugserver --arch x86_64 --build-dir /Users/buildslave/jenkins/workspace/lldb-cmake-sanitized/lldb-build/lldb-test-build.noindex -s=/Users/buildslave/jenkins/workspace/lldb-cmake-sanitized/test/logs -t --env TERM=vt100 --env LLVM_LIBS_DIR=/Users/buildslave/jenkins/workspace/lldb-cmake-sanitized/lldb-build/./lib --inferior-env ASAN_OPTIONS=detect_stack_use_after_return=1 --inferior-env DYLD_INSERT_LIBRARIES=/Users/buildslave/jenkins/workspace/lldb-cmake-sanitized/host-compiler/lib/clang/11.0.0/lib/darwin/libclang_rt.asan_osx_dynamic.dylib --build-dir /Users/buildslave/jenkins/workspace/lldb-cmake-sanitized/lldb-build/lldb-test-build.noindex --lldb-module-cache-dir /Users/buildslave/jenkins/workspace/lldb-cmake-sanitized/lldb-build/lldb-test-build.noindex/module-cache-lldb/lldb-api --clang-module-cache-dir /Users/buildslave/jenkins/workspace/lldb-cmake-sanitized/lldb-build/lldb-test-build.noindex/module-cache-clang/lldb-api --executable /Users/buildslave/jenkins/workspace/lldb-cmake-sanitized/lldb-build/./bin/lldb --compiler /Users/buildslave/jenkins/workspace/lldb-cmake-sanitized/lldb-build/./bin/clang --dsymutil /Users/buildslave/jenkins/workspace/lldb-cmake-sanitized/lldb-build/./bin/dsymutil --filecheck /Users/buildslave/jenkins/workspace/lldb-cmake-sanitized/lldb-build/./bin/FileCheck /Users/buildslave/jenkins/workspace/lldb-cmake-sanitized/llvm-project/lldb/packages/Python/lldbsuite/test/functionalities/data-formatter/data-formatter-objc -p TestDataFormatterObjCNSError.py Change dir to: /Users/buildslave/jenkins/workspace/lldb-cmake-sanitized/llvm-project/lldb/packages/Python/lldbsuite/test/functionalities/data-formatter/data-formatter-objc runCmd: settings set symbols.enable-external-lookup false output:

Hide Details

runCmd: settings set plugin.process.gdb-remote.packet-timeout 60 output:

Hide Details

runCmd: settings set symbols.clang-modules-cache-path "/Users/buildslave/jenkins/workspace/lldb-cmake-sanitized/lldb-build/lldb-test-build.noindex/module-cache-lldb/lldb-api" output:

Hide Details

runCmd: settings set use-color false output:

Hide Details

runCmd: settings set target.env-vars ASAN_OPTIONS=detect_stack_use_after_return=1 DYLD_INSERT_LIBRARIES=/Users/buildslave/jenkins/workspace/lldb-cmake-sanitized/host-compiler/lib/clang/11.0.0/lib/darwin/libclang_rt.asan_osx_dynamic.dylib output:

Hide Details

runCmd: settings set target.env-vars ASAN_OPTIONS=detect_stack_use_after_return=1 DYLD_INSERT_LIBRARIES=/Users/buildslave/jenkins/workspace/lldb-cmake-sanitized/host-compiler/lib/clang/11.0.0/lib/darwin/libclang_rt.asan_osx_dynamic.dylib output:

Hide Details

FAIL: LLDB (/Users/buildslave/jenkins/workspace/lldb-cmake-sanitized/lldb-build/bin/clang-10-x86_64) :: test_nserror_with_run_command_dsym (TestDataFormatterObjCNSError.ObjCDataFormatterNSError) <bound method SBProcess.Kill of <lldb.SBProcess; proxy of <Swig Object of type 'lldb::SBProcess *' at 0x113412210> >>: success

Hide Details

runCmd: settings set symbols.enable-external-lookup false output:

Hide Details

runCmd: settings set plugin.process.gdb-remote.packet-timeout 60 output:

Hide Details

runCmd: settings set symbols.clang-modules-cache-path "/Users/buildslave/jenkins/workspace/lldb-cmake-sanitized/lldb-build/lldb-test-build.noindex/module-cache-lldb/lldb-api" output:

Hide Details

runCmd: settings set use-color false output:

Hide Details

runCmd: settings set target.env-vars ASAN_OPTIONS=detect_stack_use_after_return=1 DYLD_INSERT_LIBRARIES=/Users/buildslave/jenkins/workspace/lldb-cmake-sanitized/host-compiler/lib/clang/11.0.0/lib/darwin/libclang_rt.asan_osx_dynamic.dylib output:

Hide Details

runCmd: settings set target.env-vars ASAN_OPTIONS=detect_stack_use_after_return=1 DYLD_INSERT_LIBRARIES=/Users/buildslave/jenkins/workspace/lldb-cmake-sanitized/host-compiler/lib/clang/11.0.0/lib/darwin/libclang_rt.asan_osx_dynamic.dylib output:

Hide Details

FAIL: LLDB (/Users/buildslave/jenkins/workspace/lldb-cmake-sanitized/lldb-build/bin/clang-10-x86_64) :: test_nserror_with_run_command_dwarf (TestDataFormatterObjCNSError.ObjCDataFormatterNSError) <bound method SBProcess.Kill of <lldb.SBProcess; proxy of <Swig Object of type 'lldb::SBProcess *' at 0x112e68630> >>: success

Hide Details

UNSUPPORTED: LLDB (/Users/buildslave/jenkins/workspace/lldb-cmake-sanitized/lldb-build/bin/clang-10-x86_64) :: test_nserror_with_run_command_dwo (TestDataFormatterObjCNSError.ObjCDataFormatterNSError) (test case does not fall in any category of interest for this run) runCmd: settings set symbols.enable-external-lookup false output:

Hide Details

runCmd: settings set plugin.process.gdb-remote.packet-timeout 60 output:

Hide Details

runCmd: settings set symbols.clang-modules-cache-path "/Users/buildslave/jenkins/workspace/lldb-cmake-sanitized/lldb-build/lldb-test-build.noindex/module-cache-lldb/lldb-api" output:

Hide Details

runCmd: settings set use-color false output:

Hide Details

runCmd: settings set target.env-vars ASAN_OPTIONS=detect_stack_use_after_return=1 DYLD_INSERT_LIBRARIES=/Users/buildslave/jenkins/workspace/lldb-cmake-sanitized/host-compiler/lib/clang/11.0.0/lib/darwin/libclang_rt.asan_osx_dynamic.dylib output:

Hide Details

runCmd: settings set target.env-vars ASAN_OPTIONS=detect_stack_use_after_return=1 DYLD_INSERT_LIBRARIES=/Users/buildslave/jenkins/workspace/lldb-cmake-sanitized/host-compiler/lib/clang/11.0.0/lib/darwin/libclang_rt.asan_osx_dynamic.dylib output:

Hide Details

FAIL: LLDB (/Users/buildslave/jenkins/workspace/lldb-cmake-sanitized/lldb-build/bin/clang-10-x86_64) :: test_nserror_with_run_command_gmodules (TestDataFormatterObjCNSError.ObjCDataFormatterNSError) <bound method SBProcess.Kill of <lldb.SBProcess; proxy of <Swig Object of type 'lldb::SBProcess *' at 0x113412540> >>: success

Hide Details

Restore dir to: /Users/buildslave/jenkins/workspace/lldb-cmake-sanitized/lldb-build/tools/lldb/test ====================================================================== FAIL: test_nserror_with_run_command_dsym (TestDataFormatterObjCNSError.ObjCDataFormatterNSError) Test formatters for NSError. ---------------------------------------------------------------------- Traceback (most recent call last): File "/Users/buildslave/jenkins/workspace/lldb-cmake-sanitized/llvm-project/lldb/packages/Python/lldbsuite/test/lldbtest.py", line 1732, in test_method return attrvalue(self) File "/Users/buildslave/jenkins/workspace/lldb-cmake-sanitized/llvm-project/lldb/packages/Python/lldbsuite/test/functionalities/data-formatter/data-formatter-objc/TestDataFormatterObjCNSError.py", line 20, in test_nserror_with_run_command self.appkit_tester_impl(self.nserror_data_formatter_commands) File "/Users/buildslave/jenkins/workspace/lldb-cmake-sanitized/llvm-project/lldb/packages/Python/lldbsuite/test/functionalities/data-formatter/data-formatter-objc/ObjCDataFormatterTestCase.py", line 19, in appkit_tester_impl self.appkit_common_data_formatters_command() File "/Users/buildslave/jenkins/workspace/lldb-cmake-sanitized/llvm-project/lldb/packages/Python/lldbsuite/test/functionalities/data-formatter/data-formatter-objc/ObjCDataFormatterTestCase.py", line 26, in appkit_common_data_formatters_command lldb.SBFileSpec('main.m', False)) File "/Users/buildslave/jenkins/workspace/lldb-cmake-sanitized/llvm-project/lldb/packages/Python/lldbsuite/test/lldbutil.py", line 868, in run_to_source_breakpoint only_one_thread, extra_images) File "/Users/buildslave/jenkins/workspace/lldb-cmake-sanitized/llvm-project/lldb/packages/Python/lldbsuite/test/lldbutil.py", line 797, in run_to_breakpoint_do_run test.assertEqual(num_threads, 1, "Expected 1 thread to stop at breakpoint, %d did."%(num_threads)) AssertionError: 0 != 1 : Expected 1 thread to stop at breakpoint, 0 did. Config=x86_64-/Users/buildslave/jenkins/workspace/lldb-cmake-sanitized/lldb-build/bin/clang-10 ====================================================================== FAIL: test_nserror_with_run_command_dwarf (TestDataFormatterObjCNSError.ObjCDataFormatterNSError) Test formatters for NSError. ---------------------------------------------------------------------- Traceback (most recent call last): File "/Users/buildslave/jenkins/workspace/lldb-cmake-sanitized/llvm-project/lldb/packages/Python/lldbsuite/test/lldbtest.py", line 1732, in test_method return attrvalue(self) File "/Users/buildslave/jenkins/workspace/lldb-cmake-sanitized/llvm-project/lldb/packages/Python/lldbsuite/test/functionalities/data-formatter/data-formatter-objc/TestDataFormatterObjCNSError.py", line 20, in test_nserror_with_run_command self.appkit_tester_impl(self.nserror_data_formatter_commands) File "/Users/buildslave/jenkins/workspace/lldb-cmake-sanitized/llvm-project/lldb/packages/Python/lldbsuite/test/functionalities/data-formatter/data-formatter-objc/ObjCDataFormatterTestCase.py", line 19, in appkit_tester_impl self.appkit_common_data_formatters_command() File "/Users/buildslave/jenkins/workspace/lldb-cmake-sanitized/llvm-project/lldb/packages/Python/lldbsuite/test/functionalities/data-formatter/data-formatter-objc/ObjCDataFormatterTestCase.py", line 26, in appkit_common_data_formatters_command lldb.SBFileSpec('main.m', False)) File "/Users/buildslave/jenkins/workspace/lldb-cmake-sanitized/llvm-project/lldb/packages/Python/lldbsuite/test/lldbutil.py", line 868, in run_to_source_breakpoint only_one_thread, extra_images) File "/Users/buildslave/jenkins/workspace/lldb-cmake-sanitized/llvm-project/lldb/packages/Python/lldbsuite/test/lldbutil.py", line 797, in run_to_breakpoint_do_run test.assertEqual(num_threads, 1, "Expected 1 thread to stop at breakpoint, %d did."%(num_threads)) AssertionError: 0 != 1 : Expected 1 thread to stop at breakpoint, 0 did. Config=x86_64-/Users/buildslave/jenkins/workspace/lldb-cmake-sanitized/lldb-build/bin/clang-10 ====================================================================== FAIL: test_nserror_with_run_command_gmodules (TestDataFormatterObjCNSError.ObjCDataFormatterNSError) Test formatters for NSError. ---------------------------------------------------------------------- Traceback (most recent call last): File "/Users/buildslave/jenkins/workspace/lldb-cmake-sanitized/llvm-project/lldb/packages/Python/lldbsuite/test/lldbtest.py", line 1732, in test_method return attrvalue(self) File "/Users/buildslave/jenkins/workspace/lldb-cmake-sanitized/llvm-project/lldb/packages/Python/lldbsuite/test/functionalities/data-formatter/data-formatter-objc/TestDataFormatterObjCNSError.py", line 20, in test_nserror_with_run_command self.appkit_tester_impl(self.nserror_data_formatter_commands) File "/Users/buildslave/jenkins/workspace/lldb-cmake-sanitized/llvm-project/lldb/packages/Python/lldbsuite/test/functionalities/data-formatter/data-formatter-objc/ObjCDataFormatterTestCase.py", line 19, in appkit_tester_impl self.appkit_common_data_formatters_command() File "/Users/buildslave/jenkins/workspace/lldb-cmake-sanitized/llvm-project/lldb/packages/Python/lldbsuite/test/functionalities/data-formatter/data-formatter-objc/ObjCDataFormatterTestCase.py", line 26, in appkit_common_data_formatters_command lldb.SBFileSpec('main.m', False)) File "/Users/buildslave/jenkins/workspace/lldb-cmake-sanitized/llvm-project/lldb/packages/Python/lldbsuite/test/lldbutil.py", line 868, in run_to_source_breakpoint only_one_thread, extra_images) File "/Users/buildslave/jenkins/workspace/lldb-cmake-sanitized/llvm-project/lldb/packages/Python/lldbsuite/test/lldbutil.py", line 797, in run_to_breakpoint_do_run test.assertEqual(num_threads, 1, "Expected 1 thread to stop at breakpoint, %d did."%(num_threads)) AssertionError: 0 != 1 : Expected 1 thread to stop at breakpoint, 0 did. Config=x86_64-/Users/buildslave/jenkins/workspace/lldb-cmake-sanitized/lldb-build/bin/clang-10 ---------------------------------------------------------------------- Ran 4 tests in 88.158s

Hide Details

RESULT: FAILED (0 passes, 3 failures, 0 errors, 1 skipped, 0 expected failures, 0 unexpected successes)

Hide Details

******************** PASS: lldb-shell :: ObjectFile/ELF/PT_LOAD.yaml (1356 of 1893) PASS: lldb-unit :: Utility/./UtilityTests/StreamTest.ShiftOperatorChars (1357 of 1893) PASS: lldb-unit :: Utility/./UtilityTests/RangeTest.Union (1358 of 1893) PASS: lldb-api :: lang/objc/objc-dyn-sbtype/TestObjCDynamicSBType.py (1359 of 1893) PASS: lldb-unit :: Process/gdb-remote/./ProcessGdbRemoteTests/GDBRemoteClientBaseTest.SendContinueAndAsyncPacket (1360 of 1893) PASS: lldb-unit :: Symbol/./SymbolTests/DWARFCallFrameInfoTest.Basic_dwarf3 (1361 of 1893) PASS: lldb-unit :: Process/minidump/./LLDBMinidumpTests/MinidumpParserTest.GetLinuxProcStatus_no_stream (1362 of 1893) PASS: lldb-unit :: Process/gdb-remote/./ProcessGdbRemoteTests/GDBRemoteCommunicationClientTest.WriteRegisterNoSuffix (1363 of 1893) PASS: lldb-unit :: Utility/./UtilityTests/BinaryStreamTest.PutSLEB128SixBytes (1364 of 1893) PASS: lldb-shell :: Unwind/thread-step-out-ret-addr-check.test (1365 of 1893) PASS: lldb-shell :: Minidump/disassemble-no-module.yaml (1366 of 1893) PASS: lldb-unit :: Utility/./UtilityTests/FileSpecTest.Match (1367 of 1893) PASS: lldb-unit :: Signals/./SignalsTests/UnixSignalsTest.VersionChange (1368 of 1893) PASS: lldb-unit :: Utility/./UtilityTests/RecordReplayTest.InstrumentedFoo (1369 of 1893) PASS: lldb-unit :: Utility/./UtilityTests/StringListTest.SplitIntoLines (1370 of 1893) PASS: lldb-shell :: ObjectFile/ELF/section-overlap.yaml (1371 of 1893) UNSUPPORTED: lldb-api :: functionalities/darwin_log/filter/exact_match/message/TestDarwinLogFilterMatchMessage.py (1372 of 1893) FAIL: lldb-api :: functionalities/data-formatter/data-formatter-objc/TestDataFormatterObjCCF.py (1373 of 1893) ******************** TEST 'lldb-api :: functionalities/data-formatter/data-formatter-objc/TestDataFormatterObjCCF.py' FAILED ******************** lldb version 11.0.99 (http://labmaster3.local/git/llvm-project.git revision c1b13a1b17719aebace1b3be7a6ac7f90b1901a6) clang revision d629525597ebe3533d110ea288c2640f0dc24bf7 llvm revision d629525597ebe3533d110ea288c2640f0dc24bf7 LLDB library dir: /Users/buildslave/jenkins/workspace/lldb-cmake-sanitized/lldb-build/bin LLDB import library dir: /Users/buildslave/jenkins/workspace/lldb-cmake-sanitized/lldb-build/bin libstdcxx tests will not be run because: Don't know how to build with libstdcxx on macosx Skipping following debug info categories: ['dwo'] setting set target.prefer-dynamic-value no-dynamic-values AddressSanitizer report breakpoint hit. Use 'thread info -s' to get extended information about the report. AddressSanitizer report breakpoint hit. Use 'thread info -s' to get extended information about the report. AddressSanitizer report breakpoint hit. Use 'thread info -s' to get extended information about the report.

Hide Details

Session logs for test failures/errors/unexpected successes will go into directory '/Users/buildslave/jenkins/workspace/lldb-cmake-sanitized/test/logs' Command invoked: /Users/buildslave/jenkins/workspace/lldb-cmake-sanitized/llvm-project/lldb/test/API/dotest.py --arch x86_64 -s /Users/buildslave/jenkins/workspace/lldb-cmake-sanitized/lldb-build/lldb-test-traces -S nm -u CXXFLAGS -u CFLAGS --codesign-identity lldb_codesign --server /Users/buildslave/jenkins/workspace/lldb-cmake-sanitized/lldb-build/./bin/debugserver --arch x86_64 --build-dir /Users/buildslave/jenkins/workspace/lldb-cmake-sanitized/lldb-build/lldb-test-build.noindex -s=/Users/buildslave/jenkins/workspace/lldb-cmake-sanitized/test/logs -t --env TERM=vt100 --env LLVM_LIBS_DIR=/Users/buildslave/jenkins/workspace/lldb-cmake-sanitized/lldb-build/./lib --inferior-env ASAN_OPTIONS=detect_stack_use_after_return=1 --inferior-env DYLD_INSERT_LIBRARIES=/Users/buildslave/jenkins/workspace/lldb-cmake-sanitized/host-compiler/lib/clang/11.0.0/lib/darwin/libclang_rt.asan_osx_dynamic.dylib --build-dir /Users/buildslave/jenkins/workspace/lldb-cmake-sanitized/lldb-build/lldb-test-build.noindex --lldb-module-cache-dir /Users/buildslave/jenkins/workspace/lldb-cmake-sanitized/lldb-build/lldb-test-build.noindex/module-cache-lldb/lldb-api --clang-module-cache-dir /Users/buildslave/jenkins/workspace/lldb-cmake-sanitized/lldb-build/lldb-test-build.noindex/module-cache-clang/lldb-api --executable /Users/buildslave/jenkins/workspace/lldb-cmake-sanitized/lldb-build/./bin/lldb --compiler /Users/buildslave/jenkins/workspace/lldb-cmake-sanitized/lldb-build/./bin/clang --dsymutil /Users/buildslave/jenkins/workspace/lldb-cmake-sanitized/lldb-build/./bin/dsymutil --filecheck /Users/buildslave/jenkins/workspace/lldb-cmake-sanitized/lldb-build/./bin/FileCheck /Users/buildslave/jenkins/workspace/lldb-cmake-sanitized/llvm-project/lldb/packages/Python/lldbsuite/test/functionalities/data-formatter/data-formatter-objc -p TestDataFormatterObjCCF.py Change dir to: /Users/buildslave/jenkins/workspace/lldb-cmake-sanitized/llvm-project/lldb/packages/Python/lldbsuite/test/functionalities/data-formatter/data-formatter-objc runCmd: settings set symbols.enable-external-lookup false output:

Hide Details

runCmd: settings set plugin.process.gdb-remote.packet-timeout 60 output:

Hide Details

runCmd: settings set symbols.clang-modules-cache-path "/Users/buildslave/jenkins/workspace/lldb-cmake-sanitized/lldb-build/lldb-test-build.noindex/module-cache-lldb/lldb-api" output:

Hide Details

runCmd: settings set use-color false output:

Hide Details

runCmd: settings set target.env-vars ASAN_OPTIONS=detect_stack_use_after_return=1 DYLD_INSERT_LIBRARIES=/Users/buildslave/jenkins/workspace/lldb-cmake-sanitized/host-compiler/lib/clang/11.0.0/lib/darwin/libclang_rt.asan_osx_dynamic.dylib output:

Hide Details

runCmd: settings set target.env-vars ASAN_OPTIONS=detect_stack_use_after_return=1 DYLD_INSERT_LIBRARIES=/Users/buildslave/jenkins/workspace/lldb-cmake-sanitized/host-compiler/lib/clang/11.0.0/lib/darwin/libclang_rt.asan_osx_dynamic.dylib output:

Hide Details

FAIL: LLDB (/Users/buildslave/jenkins/workspace/lldb-cmake-sanitized/lldb-build/bin/clang-10-x86_64) :: test_coreframeworks_and_run_command_dsym (TestDataFormatterObjCCF.ObjCDataFormatterCF) <bound method SBProcess.Kill of <lldb.SBProcess; proxy of <Swig Object of type 'lldb::SBProcess *' at 0x11f76db10> >>: success

Hide Details

runCmd: settings set symbols.enable-external-lookup false output:

Hide Details

runCmd: settings set plugin.process.gdb-remote.packet-timeout 60 output:

Hide Details

runCmd: settings set symbols.clang-modules-cache-path "/Users/buildslave/jenkins/workspace/lldb-cmake-sanitized/lldb-build/lldb-test-build.noindex/module-cache-lldb/lldb-api" output:

Hide Details

runCmd: settings set use-color false output:

Hide Details

runCmd: settings set target.env-vars ASAN_OPTIONS=detect_stack_use_after_return=1 DYLD_INSERT_LIBRARIES=/Users/buildslave/jenkins/workspace/lldb-cmake-sanitized/host-compiler/lib/clang/11.0.0/lib/darwin/libclang_rt.asan_osx_dynamic.dylib output:

Hide Details

runCmd: settings set target.env-vars ASAN_OPTIONS=detect_stack_use_after_return=1 DYLD_INSERT_LIBRARIES=/Users/buildslave/jenkins/workspace/lldb-cmake-sanitized/host-compiler/lib/clang/11.0.0/lib/darwin/libclang_rt.asan_osx_dynamic.dylib output:

Hide Details

FAIL: LLDB (/Users/buildslave/jenkins/workspace/lldb-cmake-sanitized/lldb-build/bin/clang-10-x86_64) :: test_coreframeworks_and_run_command_dwarf (TestDataFormatterObjCCF.ObjCDataFormatterCF) <bound method SBProcess.Kill of <lldb.SBProcess; proxy of <Swig Object of type 'lldb::SBProcess *' at 0x108b00630> >>: success

Hide Details

UNSUPPORTED: LLDB (/Users/buildslave/jenkins/workspace/lldb-cmake-sanitized/lldb-build/bin/clang-10-x86_64) :: test_coreframeworks_and_run_command_dwo (TestDataFormatterObjCCF.ObjCDataFormatterCF) (test case does not fall in any category of interest for this run) runCmd: settings set symbols.enable-external-lookup false output:

Hide Details

runCmd: settings set plugin.process.gdb-remote.packet-timeout 60 output:

Hide Details

runCmd: settings set symbols.clang-modules-cache-path "/Users/buildslave/jenkins/workspace/lldb-cmake-sanitized/lldb-build/lldb-test-build.noindex/module-cache-lldb/lldb-api" output:

Hide Details

runCmd: settings set use-color false output:

Hide Details

runCmd: settings set target.env-vars ASAN_OPTIONS=detect_stack_use_after_return=1 DYLD_INSERT_LIBRARIES=/Users/buildslave/jenkins/workspace/lldb-cmake-sanitized/host-compiler/lib/clang/11.0.0/lib/darwin/libclang_rt.asan_osx_dynamic.dylib output:

Hide Details

runCmd: settings set target.env-vars ASAN_OPTIONS=detect_stack_use_after_return=1 DYLD_INSERT_LIBRARIES=/Users/buildslave/jenkins/workspace/lldb-cmake-sanitized/host-compiler/lib/clang/11.0.0/lib/darwin/libclang_rt.asan_osx_dynamic.dylib output:

Hide Details

FAIL: LLDB (/Users/buildslave/jenkins/workspace/lldb-cmake-sanitized/lldb-build/bin/clang-10-x86_64) :: test_coreframeworks_and_run_command_gmodules (TestDataFormatterObjCCF.ObjCDataFormatterCF) <bound method SBProcess.Kill of <lldb.SBProcess; proxy of <Swig Object of type 'lldb::SBProcess *' at 0x11f76db10> >>: success

Hide Details

Restore dir to: /Users/buildslave/jenkins/workspace/lldb-cmake-sanitized/lldb-build/tools/lldb/test ====================================================================== FAIL: test_coreframeworks_and_run_command_dsym (TestDataFormatterObjCCF.ObjCDataFormatterCF) Test formatters for Core OSX frameworks. ---------------------------------------------------------------------- Traceback (most recent call last): File "/Users/buildslave/jenkins/workspace/lldb-cmake-sanitized/llvm-project/lldb/packages/Python/lldbsuite/test/lldbtest.py", line 1732, in test_method return attrvalue(self) File "/Users/buildslave/jenkins/workspace/lldb-cmake-sanitized/llvm-project/lldb/packages/Python/lldbsuite/test/functionalities/data-formatter/data-formatter-objc/TestDataFormatterObjCCF.py", line 23, in test_coreframeworks_and_run_command lldb.SBFileSpec('main.m', False)) File "/Users/buildslave/jenkins/workspace/lldb-cmake-sanitized/llvm-project/lldb/packages/Python/lldbsuite/test/lldbutil.py", line 868, in run_to_source_breakpoint only_one_thread, extra_images) File "/Users/buildslave/jenkins/workspace/lldb-cmake-sanitized/llvm-project/lldb/packages/Python/lldbsuite/test/lldbutil.py", line 797, in run_to_breakpoint_do_run test.assertEqual(num_threads, 1, "Expected 1 thread to stop at breakpoint, %d did."%(num_threads)) AssertionError: 0 != 1 : Expected 1 thread to stop at breakpoint, 0 did. Config=x86_64-/Users/buildslave/jenkins/workspace/lldb-cmake-sanitized/lldb-build/bin/clang-10 ====================================================================== FAIL: test_coreframeworks_and_run_command_dwarf (TestDataFormatterObjCCF.ObjCDataFormatterCF) Test formatters for Core OSX frameworks. ---------------------------------------------------------------------- Traceback (most recent call last): File "/Users/buildslave/jenkins/workspace/lldb-cmake-sanitized/llvm-project/lldb/packages/Python/lldbsuite/test/lldbtest.py", line 1732, in test_method return attrvalue(self) File "/Users/buildslave/jenkins/workspace/lldb-cmake-sanitized/llvm-project/lldb/packages/Python/lldbsuite/test/functionalities/data-formatter/data-formatter-objc/TestDataFormatterObjCCF.py", line 23, in test_coreframeworks_and_run_command lldb.SBFileSpec('main.m', False)) File "/Users/buildslave/jenkins/workspace/lldb-cmake-sanitized/llvm-project/lldb/packages/Python/lldbsuite/test/lldbutil.py", line 868, in run_to_source_breakpoint only_one_thread, extra_images) File "/Users/buildslave/jenkins/workspace/lldb-cmake-sanitized/llvm-project/lldb/packages/Python/lldbsuite/test/lldbutil.py", line 797, in run_to_breakpoint_do_run test.assertEqual(num_threads, 1, "Expected 1 thread to stop at breakpoint, %d did."%(num_threads)) AssertionError: 0 != 1 : Expected 1 thread to stop at breakpoint, 0 did. Config=x86_64-/Users/buildslave/jenkins/workspace/lldb-cmake-sanitized/lldb-build/bin/clang-10 ====================================================================== FAIL: test_coreframeworks_and_run_command_gmodules (TestDataFormatterObjCCF.ObjCDataFormatterCF) Test formatters for Core OSX frameworks. ---------------------------------------------------------------------- Traceback (most recent call last): File "/Users/buildslave/jenkins/workspace/lldb-cmake-sanitized/llvm-project/lldb/packages/Python/lldbsuite/test/lldbtest.py", line 1732, in test_method return attrvalue(self) File "/Users/buildslave/jenkins/workspace/lldb-cmake-sanitized/llvm-project/lldb/packages/Python/lldbsuite/test/functionalities/data-formatter/data-formatter-objc/TestDataFormatterObjCCF.py", line 23, in test_coreframeworks_and_run_command lldb.SBFileSpec('main.m', False)) File "/Users/buildslave/jenkins/workspace/lldb-cmake-sanitized/llvm-project/lldb/packages/Python/lldbsuite/test/lldbutil.py", line 868, in run_to_source_breakpoint only_one_thread, extra_images) File "/Users/buildslave/jenkins/workspace/lldb-cmake-sanitized/llvm-project/lldb/packages/Python/lldbsuite/test/lldbutil.py", line 797, in run_to_breakpoint_do_run test.assertEqual(num_threads, 1, "Expected 1 thread to stop at breakpoint, %d did."%(num_threads)) AssertionError: 0 != 1 : Expected 1 thread to stop at breakpoint, 0 did. Config=x86_64-/Users/buildslave/jenkins/workspace/lldb-cmake-sanitized/lldb-build/bin/clang-10 ---------------------------------------------------------------------- Ran 4 tests in 91.279s

Hide Details

RESULT: FAILED (0 passes, 3 failures, 0 errors, 1 skipped, 0 expected failures, 0 unexpected successes)

Hide Details

******************** PASS: lldb-unit :: Utility/./UtilityTests/ArgsTest.BareSingleQuote (1374 of 1893) PASS: lldb-unit :: Expression/./ExpressionTests/DiagnosticManagerTest.GetStringNoDiags (1375 of 1893) PASS: lldb-unit :: Symbol/./SymbolTests/LineEntryTest.GetSameLineContiguousAddressRangeNoInlines (1376 of 1893) PASS: lldb-api :: functionalities/postmortem/minidump-new/TestMiniDumpNew.py (1377 of 1893) PASS: lldb-unit :: Symbol/./SymbolTests/TestClangASTContext.TestBuiltinTypeForEncodingAndBitSize (1378 of 1893) UNSUPPORTED: lldb-api :: functionalities/ubsan/basic/TestUbsanBasic.py (1379 of 1893) PASS: lldb-unit :: Process/minidump/./LLDBMinidumpTests/RegisterContextMinidump.CheckRegisterContextMinidump_ARM (1380 of 1893) PASS: lldb-unit :: ObjectFile/PECOFF/./ObjectFilePECOFFTests/PECallFrameInfoTest.Basic_eh (1381 of 1893) PASS: lldb-unit :: Host/./HostTests/ProcessLaunchInfoTest.Constructor (1382 of 1893) PASS: lldb-unit :: Utility/./UtilityTests/ScalarTest.ExtractBitfield (1383 of 1893) PASS: lldb-unit :: Utility/./UtilityTests/UriParserTest.BracketedHostnameWithColon (1384 of 1893) PASS: lldb-api :: commands/expression/options/TestExprOptions.py (1385 of 1893) PASS: lldb-unit :: Utility/./UtilityTests/StringExtractorTest.GetU64LittleEndian (1386 of 1893) PASS: lldb-unit :: Language/Highlighting/./HighlighterTests/HighlighterTest.Colons (1387 of 1893) PASS: lldb-api :: python_api/process/TestProcessAPI.py (1388 of 1893) PASS: lldb-api :: macosx/add-dsym/TestAddDsymMidExecutionCommand.py (1389 of 1893) UNSUPPORTED: lldb-api :: functionalities/tsan/thread_leak/TestTsanThreadLeak.py (1390 of 1893) PASS: lldb-api :: commands/watchpoints/watchpoint_commands/command/TestWatchpointCommandLLDB.py (1391 of 1893) PASS: lldb-unit :: UnwindAssembly/x86/./UnwindAssemblyx86Tests/Testx86AssemblyInspectionEngine.TestPushRBP (1392 of 1893) PASS: lldb-unit :: Process/minidump/./LLDBMinidumpTests/MinidumpParserTest.GetFilteredModuleList (1393 of 1893) PASS: lldb-api :: lang/objc/objc++/TestObjCXX.py (1394 of 1893) PASS: lldb-api :: functionalities/breakpoint/breakpoint_command/TestBreakpointCommand.py (1395 of 1893) PASS: lldb-unit :: Utility/./UtilityTests/LogChannelTest.Enable (1396 of 1893) PASS: lldb-api :: functionalities/mtc/simple/TestMTCSimple.py (1397 of 1893) PASS: lldb-unit :: UnwindAssembly/x86/./UnwindAssemblyx86Tests/Testx86AssemblyInspectionEngine.TestPush0 (1398 of 1893) PASS: lldb-api :: functionalities/tail_call_frames/disambiguate_call_site/TestDisambiguateCallSite.py (1399 of 1893) PASS: lldb-unit :: Utility/./UtilityTests/StreamTest.AddressNoSuffix (1400 of 1893) PASS: lldb-api :: lang/cpp/symbols/TestSymbols.py (1401 of 1893) PASS: lldb-unit :: Target/./TargetTests/PathMappingListTest.RelativeTests (1402 of 1893) PASS: lldb-api :: macosx/duplicate-archive-members/TestDuplicateMembers.py (1403 of 1893) PASS: lldb-unit :: Utility/./UtilityTests/StringExtractorTest.GetNameColonValueSuccess (1404 of 1893) PASS: lldb-api :: lang/cpp/bool/TestCPPBool.py (1405 of 1893) PASS: lldb-api :: lang/cpp/dynamic-value/TestDynamicValue.py (1406 of 1893) PASS: lldb-api :: python_api/sbvalue_const_addrof/TestSBValueConstAddrOf.py (1407 of 1893) UNSUPPORTED: lldb-api :: tools/lldb-server/TestGdbRemote_vContThreads.py (1408 of 1893) PASS: lldb-shell :: SymbolFile/DWARF/find-basic-type.cpp (1409 of 1893) PASS: lldb-api :: types/TestDoubleTypesExpr.py (1410 of 1893) PASS: lldb-shell :: Breakpoint/single-file-split-dwarf.test (1411 of 1893) UNSUPPORTED: lldb-api :: lang/objc/objc-dynamic-value/TestObjCDynamicValue.py (1412 of 1893) PASS: lldb-unit :: Utility/./UtilityTests/ArgsTest.StringListConstructor (1413 of 1893) PASS: lldb-api :: types/TestIntegerType.py (1414 of 1893) PASS: lldb-api :: commands/expression/import-std-module/forward_list-basic/TestBasicForwardList.py (1415 of 1893) PASS: lldb-unit :: Utility/./UtilityTests/StringListTest.ShiftCString (1416 of 1893) UNSUPPORTED: lldb-shell :: Register/x86-zmm-read.test (1417 of 1893) PASS: lldb-unit :: Utility/./UtilityTests/LogChannelEnabledTest.log_options (1418 of 1893) PASS: lldb-shell :: SymbolFile/NativePDB/globals-fundamental.cpp (1419 of 1893) PASS: lldb-api :: functionalities/thread/concurrent_events/TestConcurrentTwoBreakpointsOneDelaySignal.py (1420 of 1893) PASS: lldb-api :: functionalities/tail_call_frames/disambiguate_tail_call_seq/TestDisambiguateTailCallSeq.py (1421 of 1893) PASS: lldb-api :: lang/cpp/incomplete-types/TestCppIncompleteTypes.py (1422 of 1893) UNSUPPORTED: lldb-api :: functionalities/data-formatter/data-formatter-stl/libstdcpp/string/TestDataFormatterStdString.py (1423 of 1893) PASS: lldb-api :: lang/cpp/namespace_conflicts/TestNamespaceConflicts.py (1424 of 1893) PASS: lldb-unit :: Utility/./UtilityTests/UriParserTest.MinimalPath (1425 of 1893) PASS: lldb-api :: functionalities/gdb_remote_client/TestRegDefinitionInParts.py (1426 of 1893) PASS: lldb-unit :: Utility/./UtilityTests/RegularExpression.Match (1427 of 1893) PASS: lldb-unit :: Utility/./UtilityTests/DataExtractorTest.PeekData (1428 of 1893) PASS: lldb-shell :: ObjectFile/PECOFF/section-types.yaml (1429 of 1893) PASS: lldb-api :: python_api/lldbutil/frame/TestFrameUtils.py (1430 of 1893) PASS: lldb-api :: functionalities/data-formatter/data-formatter-stl/libcxx/iterator/TestDataFormatterLibccIterator.py (1431 of 1893) PASS: lldb-unit :: Interpreter/./InterpreterTests/CompletionTest.DirCompletionAbsolute (1432 of 1893) PASS: lldb-unit :: Utility/./UtilityTests/StringExtractorTest.GetHexBytes_Underflow (1433 of 1893) PASS: lldb-api :: lang/cpp/unsigned_types/TestUnsignedTypes.py (1434 of 1893) PASS: lldb-api :: functionalities/plugins/command_plugin/TestPluginCommands.py (1435 of 1893) UNSUPPORTED: lldb-api :: functionalities/darwin_log/filter/regex/activity-chain/TestDarwinLogFilterRegexActivityChain.py (1436 of 1893) UNSUPPORTED: lldb-api :: functionalities/data-formatter/data-formatter-stl/libstdcpp/vbool/TestDataFormatterStdVBool.py (1437 of 1893) PASS: lldb-api :: commands/frame/language/TestGuessLanguage.py (1438 of 1893) PASS: lldb-unit :: Utility/./UtilityTests/UriParserTest.BadPort (1439 of 1893) PASS: lldb-unit :: Utility/./UtilityTests/RegularExpression.CopyAssignment (1440 of 1893) PASS: lldb-shell :: SymbolFile/Breakpad/unwind-via-raSearch.test (1441 of 1893) PASS: lldb-shell :: ObjectFile/ELF/PT_LOAD-overlap-PT_TLS.yaml (1442 of 1893) PASS: lldb-unit :: ScriptInterpreter/Python/./ScriptInterpreterPythonTests/PythonDataObjectsTest.TestCallable (1443 of 1893) PASS: lldb-api :: functionalities/target-new-solib-notifications/TestModuleLoadedNotifys.py (1444 of 1893) PASS: lldb-unit :: Utility/./UtilityTests/ConstStringTest.NullAndEmptyStates (1445 of 1893) PASS: lldb-unit :: Expression/./ExpressionTests/CppModuleConfigurationTest.Xcode (1446 of 1893) PASS: lldb-unit :: Host/./HostTests/TaskPoolTest.TaskMap (1447 of 1893) FAIL: lldb-api :: functionalities/thread/step_out/TestThreadStepOut.py (1448 of 1893) ******************** TEST 'lldb-api :: functionalities/thread/step_out/TestThreadStepOut.py' FAILED ******************** lldb version 11.0.99 (http://labmaster3.local/git/llvm-project.git revision c1b13a1b17719aebace1b3be7a6ac7f90b1901a6) clang revision d629525597ebe3533d110ea288c2640f0dc24bf7 llvm revision d629525597ebe3533d110ea288c2640f0dc24bf7 LLDB library dir: /Users/buildslave/jenkins/workspace/lldb-cmake-sanitized/lldb-build/bin LLDB import library dir: /Users/buildslave/jenkins/workspace/lldb-cmake-sanitized/lldb-build/bin libstdcxx tests will not be run because: Don't know how to build with libstdcxx on macosx Skipping following debug info categories: ['dwo'] setting set target.prefer-dynamic-value no-dynamic-values

Hide Details

Session logs for test failures/errors/unexpected successes will go into directory '/Users/buildslave/jenkins/workspace/lldb-cmake-sanitized/test/logs' Command invoked: /Users/buildslave/jenkins/workspace/lldb-cmake-sanitized/llvm-project/lldb/test/API/dotest.py --arch x86_64 -s /Users/buildslave/jenkins/workspace/lldb-cmake-sanitized/lldb-build/lldb-test-traces -S nm -u CXXFLAGS -u CFLAGS --codesign-identity lldb_codesign --server /Users/buildslave/jenkins/workspace/lldb-cmake-sanitized/lldb-build/./bin/debugserver --arch x86_64 --build-dir /Users/buildslave/jenkins/workspace/lldb-cmake-sanitized/lldb-build/lldb-test-build.noindex -s=/Users/buildslave/jenkins/workspace/lldb-cmake-sanitized/test/logs -t --env TERM=vt100 --env LLVM_LIBS_DIR=/Users/buildslave/jenkins/workspace/lldb-cmake-sanitized/lldb-build/./lib --inferior-env ASAN_OPTIONS=detect_stack_use_after_return=1 --inferior-env DYLD_INSERT_LIBRARIES=/Users/buildslave/jenkins/workspace/lldb-cmake-sanitized/host-compiler/lib/clang/11.0.0/lib/darwin/libclang_rt.asan_osx_dynamic.dylib --build-dir /Users/buildslave/jenkins/workspace/lldb-cmake-sanitized/lldb-build/lldb-test-build.noindex --lldb-module-cache-dir /Users/buildslave/jenkins/workspace/lldb-cmake-sanitized/lldb-build/lldb-test-build.noindex/module-cache-lldb/lldb-api --clang-module-cache-dir /Users/buildslave/jenkins/workspace/lldb-cmake-sanitized/lldb-build/lldb-test-build.noindex/module-cache-clang/lldb-api --executable /Users/buildslave/jenkins/workspace/lldb-cmake-sanitized/lldb-build/./bin/lldb --compiler /Users/buildslave/jenkins/workspace/lldb-cmake-sanitized/lldb-build/./bin/clang --dsymutil /Users/buildslave/jenkins/workspace/lldb-cmake-sanitized/lldb-build/./bin/dsymutil --filecheck /Users/buildslave/jenkins/workspace/lldb-cmake-sanitized/lldb-build/./bin/FileCheck /Users/buildslave/jenkins/workspace/lldb-cmake-sanitized/llvm-project/lldb/packages/Python/lldbsuite/test/functionalities/thread/step_out -p TestThreadStepOut.py Change dir to: /Users/buildslave/jenkins/workspace/lldb-cmake-sanitized/llvm-project/lldb/packages/Python/lldbsuite/test/functionalities/thread/step_out runCmd: settings set symbols.enable-external-lookup false output:

Hide Details

runCmd: settings set plugin.process.gdb-remote.packet-timeout 60 output:

Hide Details

runCmd: settings set symbols.clang-modules-cache-path "/Users/buildslave/jenkins/workspace/lldb-cmake-sanitized/lldb-build/lldb-test-build.noindex/module-cache-lldb/lldb-api" output:

Hide Details

runCmd: settings set use-color false output:

Hide Details

runCmd: settings set target.env-vars ASAN_OPTIONS=detect_stack_use_after_return=1 DYLD_INSERT_LIBRARIES=/Users/buildslave/jenkins/workspace/lldb-cmake-sanitized/host-compiler/lib/clang/11.0.0/lib/darwin/libclang_rt.asan_osx_dynamic.dylib output:

Hide Details

runCmd: settings set target.env-vars ASAN_OPTIONS=detect_stack_use_after_return=1 DYLD_INSERT_LIBRARIES=/Users/buildslave/jenkins/workspace/lldb-cmake-sanitized/host-compiler/lib/clang/11.0.0/lib/darwin/libclang_rt.asan_osx_dynamic.dylib output:

Hide Details

<bound method SBProcess.Kill of <lldb.SBProcess; proxy of <Swig Object of type 'lldb::SBProcess *' at 0x123ad53f0> >>: success

Hide Details

PASS: LLDB (/Users/buildslave/jenkins/workspace/lldb-cmake-sanitized/lldb-build/bin/clang-10-x86_64) :: test_python_dsym (TestThreadStepOut.ThreadStepOutTestCase) runCmd: settings set symbols.enable-external-lookup false output:

Hide Details

runCmd: settings set plugin.process.gdb-remote.packet-timeout 60 output:

Hide Details

runCmd: settings set symbols.clang-modules-cache-path "/Users/buildslave/jenkins/workspace/lldb-cmake-sanitized/lldb-build/lldb-test-build.noindex/module-cache-lldb/lldb-api" output:

Hide Details

runCmd: settings set use-color false output:

Hide Details

runCmd: settings set target.env-vars ASAN_OPTIONS=detect_stack_use_after_return=1 DYLD_INSERT_LIBRARIES=/Users/buildslave/jenkins/workspace/lldb-cmake-sanitized/host-compiler/lib/clang/11.0.0/lib/darwin/libclang_rt.asan_osx_dynamic.dylib output:

Hide Details

runCmd: settings set target.env-vars ASAN_OPTIONS=detect_stack_use_after_return=1 DYLD_INSERT_LIBRARIES=/Users/buildslave/jenkins/workspace/lldb-cmake-sanitized/host-compiler/lib/clang/11.0.0/lib/darwin/libclang_rt.asan_osx_dynamic.dylib output:

Hide Details

<bound method SBProcess.Kill of <lldb.SBProcess; proxy of <Swig Object of type 'lldb::SBProcess *' at 0x10ce04630> >>: success

Hide Details

PASS: LLDB (/Users/buildslave/jenkins/workspace/lldb-cmake-sanitized/lldb-build/bin/clang-10-x86_64) :: test_python_dwarf (TestThreadStepOut.ThreadStepOutTestCase) UNSUPPORTED: LLDB (/Users/buildslave/jenkins/workspace/lldb-cmake-sanitized/lldb-build/bin/clang-10-x86_64) :: test_python_dwo (TestThreadStepOut.ThreadStepOutTestCase) (test case does not fall in any category of interest for this run) runCmd: settings set symbols.enable-external-lookup false output:

Hide Details

runCmd: settings set plugin.process.gdb-remote.packet-timeout 60 output:

Hide Details

runCmd: settings set symbols.clang-modules-cache-path "/Users/buildslave/jenkins/workspace/lldb-cmake-sanitized/lldb-build/lldb-test-build.noindex/module-cache-lldb/lldb-api" output:

Hide Details

runCmd: settings set use-color false output:

Hide Details

runCmd: settings set target.env-vars ASAN_OPTIONS=detect_stack_use_after_return=1 DYLD_INSERT_LIBRARIES=/Users/buildslave/jenkins/workspace/lldb-cmake-sanitized/host-compiler/lib/clang/11.0.0/lib/darwin/libclang_rt.asan_osx_dynamic.dylib output:

Hide Details

runCmd: settings set target.env-vars ASAN_OPTIONS=detect_stack_use_after_return=1 DYLD_INSERT_LIBRARIES=/Users/buildslave/jenkins/workspace/lldb-cmake-sanitized/host-compiler/lib/clang/11.0.0/lib/darwin/libclang_rt.asan_osx_dynamic.dylib output:

Hide Details

<bound method SBProcess.Kill of <lldb.SBProcess; proxy of <Swig Object of type 'lldb::SBProcess *' at 0x123ad5300> >>: success

Hide Details

PASS: LLDB (/Users/buildslave/jenkins/workspace/lldb-cmake-sanitized/lldb-build/bin/clang-10-x86_64) :: test_python_gmodules (TestThreadStepOut.ThreadStepOutTestCase) runCmd: settings set symbols.enable-external-lookup false output:

Hide Details

runCmd: settings set plugin.process.gdb-remote.packet-timeout 60 output:

Hide Details

runCmd: settings set symbols.clang-modules-cache-path "/Users/buildslave/jenkins/workspace/lldb-cmake-sanitized/lldb-build/lldb-test-build.noindex/module-cache-lldb/lldb-api" output:

Hide Details

runCmd: settings set use-color false output:

Hide Details

runCmd: settings set target.env-vars ASAN_OPTIONS=detect_stack_use_after_return=1 DYLD_INSERT_LIBRARIES=/Users/buildslave/jenkins/workspace/lldb-cmake-sanitized/host-compiler/lib/clang/11.0.0/lib/darwin/libclang_rt.asan_osx_dynamic.dylib output:

Hide Details

runCmd: settings set target.env-vars ASAN_OPTIONS=detect_stack_use_after_return=1 DYLD_INSERT_LIBRARIES=/Users/buildslave/jenkins/workspace/lldb-cmake-sanitized/host-compiler/lib/clang/11.0.0/lib/darwin/libclang_rt.asan_osx_dynamic.dylib output:

Hide Details

runCmd: thread select 2 output:

Hide Details

runCmd: thread step-out -m all-threads output: Process 48176 stopped * thread #2, stop reason = step out

Hide Details

frame #0: 0x0000000100000b9e a.out`thread_func() at main.cpp:30:5 27 pseudo_barrier_wait(g_barrier); 28 29 // Do something -> 30 step_out_of_here(); // Expect to stop here after step-out (clang) ^ 31 32 // Return 33 return NULL; // Expect to stop here after step-out (icc and gcc; arm64)

Hide Details

Hide Details

Hide Details

runCmd: process status output: Process 48176 stopped * thread #2, stop reason = step out

Hide Details

frame #0: 0x0000000100000b9e a.out`thread_func() at main.cpp:30:5 27 pseudo_barrier_wait(g_barrier); 28 29 // Do something -> 30 step_out_of_here(); // Expect to stop here after step-out (clang) ^ 31 32 // Return 33 return NULL; // Expect to stop here after step-out (icc and gcc; arm64)

Hide Details

Hide Details

Expecting sub string: stop reason = step out Matched

Hide Details

runCmd: thread list output: Process 48176 stopped thread #1: tid = 0x47d5cd, 0x00007fff77c32d32 libsystem_kernel.dylib`swtch_pri + 10, queue = 'com.apple.main-thread' * thread #2: tid = 0x47d6aa, 0x0000000100000b9e a.out`thread_func() at main.cpp:30:5, stop reason = step out

Hide Details

thread #3: tid = 0x47d6ac, 0x0000000100000b9e a.out`thread_func() at main.cpp:30:5

Hide Details

Hide Details

Expecting sub string: * thread #2 Matched

Hide Details

runCmd: thread backtrace all output: thread #1, queue = 'com.apple.main-thread' frame #0: 0x00007fff77c32d32 libsystem_kernel.dylib`swtch_pri + 10 frame #1: 0x00007fff77ceeef3 libsystem_pthread.dylib`sched_yield + 11 frame #2: 0x0000000100145bc9 libclang_rt.asan_osx_dynamic.dylib`__sanitizer::internal_sched_yield() + 9 frame #3: 0x0000000100128b55 libclang_rt.asan_osx_dynamic.dylib`wrap_pthread_create + 277 frame #4: 0x00000001000011e4 a.out`std::__1::__libcpp_thread_create(__t=0x00007ffeefbff4a8, __func=(a.out`void* std::__1::__thread_proxy<std::__1::tuple<std::__1::unique_ptr<std::__1::__thread_struct, std::__1::default_delete<std::__1::__thread_struct> >, void* (*)()> >(void*) at thread:279), __arg=0x0000602000000110)(void*), void*) at __threading_support:394:10 frame #5: 0x000000010000101b a.out`std::__1::thread::thread<void* (&)(), void>(this=0x00007ffeefbff4a8, __f=0x0000000100000b60)()) at thread:300:16 frame #6: 0x0000000100000d1d a.out`std::__1::thread::thread<void* (&)(), void>(this=0x00007ffeefbff4a8, __f=0x0000000100000b60)()) at thread:292:1 frame #7: 0x0000000100000c54 a.out`main at main.cpp:43:17 frame #8: 0x00007fff77afa085 libdyld.dylib`start + 1 * thread #2, stop reason = step out

Hide Details

* frame #0: 0x0000000100000b9e a.out`thread_func() at main.cpp:30:5 frame #1: 0x0000000100001ad7 a.out`decltype(__f=0x00006020000000d8)()>(fp)()) std::__1::__invoke<void* (*)()>(void* (*&&)()) at type_traits:3539:1 frame #2: 0x0000000100001a45 a.out`void std::__1::__thread_execute<std::__1::unique_ptr<std::__1::__thread_struct, std::__1::default_delete<std::__1::__thread_struct> >, void* (*)()>(__t=size=2, (null)=__tuple_indices<> @ 0x0000700007670eb8)()>&, std::__1::__tuple_indices<>) at thread:273:5 frame #3: 0x0000000100001266 a.out`void* std::__1::__thread_proxy<std::__1::tuple<std::__1::unique_ptr<std::__1::__thread_struct, std::__1::default_delete<std::__1::__thread_struct> >, void* (*)()> >(__vp=0x00006020000000d0) at thread:284:5 frame #4: 0x00007fff77cec33d libsystem_pthread.dylib`_pthread_body + 126 frame #5: 0x00007fff77cef2a7 libsystem_pthread.dylib`_pthread_start + 70 frame #6: 0x00007fff77ceb425 libsystem_pthread.dylib`thread_start + 13 thread #3 frame #0: 0x0000000100000b9e a.out`thread_func() at main.cpp:30:5 frame #1: 0x0000000100001ad7 a.out`decltype(__f=0x0000602000000118)()>(fp)()) std::__1::__invoke<void* (*)()>(void* (*&&)()) at type_traits:3539:1 frame #2: 0x0000000100001a45 a.out`void std::__1::__thread_execute<std::__1::unique_ptr<std::__1::__thread_struct, std::__1::default_delete<std::__1::__thread_struct> >, void* (*)()>(__t=size=2, (null)=__tuple_indices<> @ 0x00007000076f3eb8)()>&, std::__1::__tuple_indices<>) at thread:273:5 frame #3: 0x0000000100001266 a.out`void* std::__1::__thread_proxy<std::__1::tuple<std::__1::unique_ptr<std::__1::__thread_struct, std::__1::default_delete<std::__1::__thread_struct> >, void* (*)()> >(__vp=0x0000602000000110) at thread:284:5 frame #4: 0x00007fff77cec33d libsystem_pthread.dylib`_pthread_body + 126 frame #5: 0x00007fff77cef2a7 libsystem_pthread.dylib`_pthread_start + 70 frame #6: 0x00007fff77ceb425 libsystem_pthread.dylib`thread_start + 13

Hide Details

Hide Details

Expecting sub string: main.cpp:30 Matched

Hide Details

<bound method SBProcess.Kill of <lldb.SBProcess; proxy of <Swig Object of type 'lldb::SBProcess *' at 0x10ce04600> >>: success

Hide Details

PASS: LLDB (/Users/buildslave/jenkins/workspace/lldb-cmake-sanitized/lldb-build/bin/clang-10-x86_64) :: test_step_all_threads_dsym (TestThreadStepOut.ThreadStepOutTestCase) runCmd: settings set symbols.enable-external-lookup false output:

Hide Details

runCmd: settings set plugin.process.gdb-remote.packet-timeout 60 output:

Hide Details

runCmd: settings set symbols.clang-modules-cache-path "/Users/buildslave/jenkins/workspace/lldb-cmake-sanitized/lldb-build/lldb-test-build.noindex/module-cache-lldb/lldb-api" output:

Hide Details

runCmd: settings set use-color false output:

Hide Details

runCmd: settings set target.env-vars ASAN_OPTIONS=detect_stack_use_after_return=1 DYLD_INSERT_LIBRARIES=/Users/buildslave/jenkins/workspace/lldb-cmake-sanitized/host-compiler/lib/clang/11.0.0/lib/darwin/libclang_rt.asan_osx_dynamic.dylib output:

Hide Details

runCmd: settings set target.env-vars ASAN_OPTIONS=detect_stack_use_after_return=1 DYLD_INSERT_LIBRARIES=/Users/buildslave/jenkins/workspace/lldb-cmake-sanitized/host-compiler/lib/clang/11.0.0/lib/darwin/libclang_rt.asan_osx_dynamic.dylib output:

Hide Details

runCmd: thread select 2 output:

Hide Details

runCmd: thread step-out -m all-threads output: Process 48999 stopped * thread #2, stop reason = step out

Hide Details

frame #0: 0x0000000100000b9e a.out`thread_func() at main.cpp:30:5 27 pseudo_barrier_wait(g_barrier); 28 29 // Do something -> 30 step_out_of_here(); // Expect to stop here after step-out (clang) ^ 31 32 // Return 33 return NULL; // Expect to stop here after step-out (icc and gcc; arm64)

Hide Details

Hide Details

Hide Details

runCmd: process status output: Process 48999 stopped * thread #2, stop reason = step out

Hide Details

frame #0: 0x0000000100000b9e a.out`thread_func() at main.cpp:30:5 27 pseudo_barrier_wait(g_barrier); 28 29 // Do something -> 30 step_out_of_here(); // Expect to stop here after step-out (clang) ^ 31 32 // Return 33 return NULL; // Expect to stop here after step-out (icc and gcc; arm64)

Hide Details

Hide Details

Expecting sub string: stop reason = step out Matched

Hide Details

runCmd: thread list output: Process 48999 stopped thread #1: tid = 0x47dba8, 0x00007fff77c3536a libsystem_kernel.dylib`__ulock_wait + 10, queue = 'com.apple.main-thread' * thread #2: tid = 0x47dc25, 0x0000000100000b9e a.out`thread_func() at main.cpp:30:5, stop reason = step out

Hide Details

thread #3: tid = 0x47dc26, 0x0000000100000b9e a.out`thread_func() at main.cpp:30:5

Hide Details

Hide Details

Expecting sub string: * thread #2 Matched

Hide Details

runCmd: thread backtrace all output: thread #1, queue = 'com.apple.main-thread' frame #0: 0x00007fff77c3536a libsystem_kernel.dylib`__ulock_wait + 10 frame #1: 0x00007fff77cf070b libsystem_pthread.dylib`_pthread_join + 356 frame #2: 0x00007fff7521a978 libc++.1.dylib`std::__1::thread::join() + 24 frame #3: 0x0000000100000c62 a.out`main at main.cpp:46:14 frame #4: 0x00007fff77afa085 libdyld.dylib`start + 1 * thread #2, stop reason = step out

Hide Details

* frame #0: 0x0000000100000b9e a.out`thread_func() at main.cpp:30:5 frame #1: 0x0000000100001ad7 a.out`decltype(__f=0x00006020000000d8)()>(fp)()) std::__1::__invoke<void* (*)()>(void* (*&&)()) at type_traits:3539:1 frame #2: 0x0000000100001a45 a.out`void std::__1::__thread_execute<std::__1::unique_ptr<std::__1::__thread_struct, std::__1::default_delete<std::__1::__thread_struct> >, void* (*)()>(__t=size=2, (null)=__tuple_indices<> @ 0x000070000e555eb8)()>&, std::__1::__tuple_indices<>) at thread:273:5 frame #3: 0x0000000100001266 a.out`void* std::__1::__thread_proxy<std::__1::tuple<std::__1::unique_ptr<std::__1::__thread_struct, std::__1::default_delete<std::__1::__thread_struct> >, void* (*)()> >(__vp=0x00006020000000d0) at thread:284:5 frame #4: 0x00007fff77cec33d libsystem_pthread.dylib`_pthread_body + 126 frame #5: 0x00007fff77cef2a7 libsystem_pthread.dylib`_pthread_start + 70 frame #6: 0x00007fff77ceb425 libsystem_pthread.dylib`thread_start + 13 thread #3 frame #0: 0x0000000100000b9e a.out`thread_func() at main.cpp:30:5 frame #1: 0x0000000100001ad7 a.out`decltype(__f=0x0000602000000118)()>(fp)()) std::__1::__invoke<void* (*)()>(void* (*&&)()) at type_traits:3539:1 frame #2: 0x0000000100001a45 a.out`void std::__1::__thread_execute<std::__1::unique_ptr<std::__1::__thread_struct, std::__1::default_delete<std::__1::__thread_struct> >, void* (*)()>(__t=size=2, (null)=__tuple_indices<> @ 0x000070000e5d8eb8)()>&, std::__1::__tuple_indices<>) at thread:273:5 frame #3: 0x0000000100001266 a.out`void* std::__1::__thread_proxy<std::__1::tuple<std::__1::unique_ptr<std::__1::__thread_struct, std::__1::default_delete<std::__1::__thread_struct> >, void* (*)()> >(__vp=0x0000602000000110) at thread:284:5 frame #4: 0x00007fff77cec33d libsystem_pthread.dylib`_pthread_body + 126 frame #5: 0x00007fff77cef2a7 libsystem_pthread.dylib`_pthread_start + 70 frame #6: 0x00007fff77ceb425 libsystem_pthread.dylib`thread_start + 13

Hide Details

Hide Details

Expecting sub string: main.cpp:30 Matched

Hide Details

<bound method SBProcess.Kill of <lldb.SBProcess; proxy of <Swig Object of type 'lldb::SBProcess *' at 0x123ad53f0> >>: success

Hide Details

PASS: LLDB (/Users/buildslave/jenkins/workspace/lldb-cmake-sanitized/lldb-build/bin/clang-10-x86_64) :: test_step_all_threads_dwarf (TestThreadStepOut.ThreadStepOutTestCase) UNSUPPORTED: LLDB (/Users/buildslave/jenkins/workspace/lldb-cmake-sanitized/lldb-build/bin/clang-10-x86_64) :: test_step_all_threads_dwo (TestThreadStepOut.ThreadStepOutTestCase) (test case does not fall in any category of interest for this run) runCmd: settings set symbols.enable-external-lookup false output:

Hide Details

runCmd: settings set plugin.process.gdb-remote.packet-timeout 60 output:

Hide Details

runCmd: settings set symbols.clang-modules-cache-path "/Users/buildslave/jenkins/workspace/lldb-cmake-sanitized/lldb-build/lldb-test-build.noindex/module-cache-lldb/lldb-api" output:

Hide Details

runCmd: settings set use-color false output:

Hide Details

runCmd: settings set target.env-vars ASAN_OPTIONS=detect_stack_use_after_return=1 DYLD_INSERT_LIBRARIES=/Users/buildslave/jenkins/workspace/lldb-cmake-sanitized/host-compiler/lib/clang/11.0.0/lib/darwin/libclang_rt.asan_osx_dynamic.dylib output:

Hide Details

runCmd: settings set target.env-vars ASAN_OPTIONS=detect_stack_use_after_return=1 DYLD_INSERT_LIBRARIES=/Users/buildslave/jenkins/workspace/lldb-cmake-sanitized/host-compiler/lib/clang/11.0.0/lib/darwin/libclang_rt.asan_osx_dynamic.dylib output:

Hide Details

runCmd: thread select 2 output:

Hide Details

runCmd: thread step-out -m all-threads output: Process 49549 stopped * thread #2, stop reason = step out

Hide Details

frame #0: 0x0000000100000b9e a.out`thread_func() at main.cpp:30:5 27 pseudo_barrier_wait(g_barrier); 28 29 // Do something -> 30 step_out_of_here(); // Expect to stop here after step-out (clang) ^ 31 32 // Return 33 return NULL; // Expect to stop here after step-out (icc and gcc; arm64)

Hide Details

Hide Details

Hide Details

runCmd: process status output: Process 49549 stopped * thread #2, stop reason = step out

Hide Details

frame #0: 0x0000000100000b9e a.out`thread_func() at main.cpp:30:5 27 pseudo_barrier_wait(g_barrier); 28 29 // Do something -> 30 step_out_of_here(); // Expect to stop here after step-out (clang) ^ 31 32 // Return 33 return NULL; // Expect to stop here after step-out (icc and gcc; arm64)

Hide Details

Hide Details

Expecting sub string: stop reason = step out Matched

Hide Details

runCmd: thread list output: Process 49549 stopped thread #1: tid = 0x47df6f, 0x00007fff77c3536a libsystem_kernel.dylib`__ulock_wait + 10, queue = 'com.apple.main-thread' * thread #2: tid = 0x47e00c, 0x0000000100000b9e a.out`thread_func() at main.cpp:30:5, stop reason = step out

Hide Details

thread #3: tid = 0x47e00d, 0x0000000100000b9e a.out`thread_func() at main.cpp:30:5

Hide Details

Hide Details

Expecting sub string: * thread #2 Matched

Hide Details

runCmd: thread backtrace all output: thread #1, queue = 'com.apple.main-thread' frame #0: 0x00007fff77c3536a libsystem_kernel.dylib`__ulock_wait + 10 frame #1: 0x00007fff77cf070b libsystem_pthread.dylib`_pthread_join + 356 frame #2: 0x00007fff7521a978 libc++.1.dylib`std::__1::thread::join() + 24 frame #3: 0x0000000100000c62 a.out`main at main.cpp:46:14 frame #4: 0x00007fff77afa085 libdyld.dylib`start + 1 * thread #2, stop reason = step out

Hide Details

* frame #0: 0x0000000100000b9e a.out`thread_func() at main.cpp:30:5 frame #1: 0x0000000100001ad7 a.out`decltype(__f=0x00006020000000d8)()>(fp)()) std::__1::__invoke<void* (*)()>(void* (*&&)()) at type_traits:3539:1 frame #2: 0x0000000100001a45 a.out`void std::__1::__thread_execute<std::__1::unique_ptr<std::__1::__thread_struct, std::__1::default_delete<std::__1::__thread_struct> >, void* (*)()>(__t=size=2, (null)=__tuple_indices<> @ 0x000070000acd7eb8)()>&, std::__1::__tuple_indices<>) at thread:273:5 frame #3: 0x0000000100001266 a.out`void* std::__1::__thread_proxy<std::__1::tuple<std::__1::unique_ptr<std::__1::__thread_struct, std::__1::default_delete<std::__1::__thread_struct> >, void* (*)()> >(__vp=0x00006020000000d0) at thread:284:5 frame #4: 0x00007fff77cec33d libsystem_pthread.dylib`_pthread_body + 126 frame #5: 0x00007fff77cef2a7 libsystem_pthread.dylib`_pthread_start + 70 frame #6: 0x00007fff77ceb425 libsystem_pthread.dylib`thread_start + 13 thread #3 frame #0: 0x0000000100000b9e a.out`thread_func() at main.cpp:30:5 frame #1: 0x0000000100001ad7 a.out`decltype(__f=0x0000602000000118)()>(fp)()) std::__1::__invoke<void* (*)()>(void* (*&&)()) at type_traits:3539:1 frame #2: 0x0000000100001a45 a.out`void std::__1::__thread_execute<std::__1::unique_ptr<std::__1::__thread_struct, std::__1::default_delete<std::__1::__thread_struct> >, void* (*)()>(__t=size=2, (null)=__tuple_indices<> @ 0x000070000ad5aeb8)()>&, std::__1::__tuple_indices<>) at thread:273:5 frame #3: 0x0000000100001266 a.out`void* std::__1::__thread_proxy<std::__1::tuple<std::__1::unique_ptr<std::__1::__thread_struct, std::__1::default_delete<std::__1::__thread_struct> >, void* (*)()> >(__vp=0x0000602000000110) at thread:284:5 frame #4: 0x00007fff77cec33d libsystem_pthread.dylib`_pthread_body + 126 frame #5: 0x00007fff77cef2a7 libsystem_pthread.dylib`_pthread_start + 70 frame #6: 0x00007fff77ceb425 libsystem_pthread.dylib`thread_start + 13

Hide Details

Hide Details

Expecting sub string: main.cpp:30 Matched

Hide Details

<bound method SBProcess.Kill of <lldb.SBProcess; proxy of <Swig Object of type 'lldb::SBProcess *' at 0x10ce180c0> >>: success

Hide Details

PASS: LLDB (/Users/buildslave/jenkins/workspace/lldb-cmake-sanitized/lldb-build/bin/clang-10-x86_64) :: test_step_all_threads_gmodules (TestThreadStepOut.ThreadStepOutTestCase) runCmd: settings set symbols.enable-external-lookup false output:

Hide Details

runCmd: settings set plugin.process.gdb-remote.packet-timeout 60 output:

Hide Details

runCmd: settings set symbols.clang-modules-cache-path "/Users/buildslave/jenkins/workspace/lldb-cmake-sanitized/lldb-build/lldb-test-build.noindex/module-cache-lldb/lldb-api" output:

Hide Details

runCmd: settings set use-color false output:

Hide Details

runCmd: settings set target.env-vars ASAN_OPTIONS=detect_stack_use_after_return=1 DYLD_INSERT_LIBRARIES=/Users/buildslave/jenkins/workspace/lldb-cmake-sanitized/host-compiler/lib/clang/11.0.0/lib/darwin/libclang_rt.asan_osx_dynamic.dylib output:

Hide Details

runCmd: settings set target.env-vars ASAN_OPTIONS=detect_stack_use_after_return=1 DYLD_INSERT_LIBRARIES=/Users/buildslave/jenkins/workspace/lldb-cmake-sanitized/host-compiler/lib/clang/11.0.0/lib/darwin/libclang_rt.asan_osx_dynamic.dylib output:

Hide Details

runCmd: thread select 2 output:

Hide Details

runCmd: thread step-out -m this-thread output: Process 50520 stopped * thread #2, stop reason = step out

Hide Details

frame #0: 0x0000000100000b9e a.out`thread_func() at main.cpp:30:5 27 pseudo_barrier_wait(g_barrier); 28 29 // Do something -> 30 step_out_of_here(); // Expect to stop here after step-out (clang) ^ 31 32 // Return 33 return NULL; // Expect to stop here after step-out (icc and gcc; arm64) thread #3, stop reason = breakpoint 1.1 frame #0: 0x0000000100000b44 a.out`step_out_of_here() at main.cpp:20:10 17 volatile int g_test = 0; 18 19 void step_out_of_here() { -> 20 g_test += 5; // Set breakpoint here ^ 21 } 22 23 void *

Hide Details

Hide Details

Hide Details

runCmd: process status output: Process 50520 stopped * thread #2, stop reason = step out

Hide Details

frame #0: 0x0000000100000b9e a.out`thread_func() at main.cpp:30:5 27 pseudo_barrier_wait(g_barrier); 28 29 // Do something -> 30 step_out_of_here(); // Expect to stop here after step-out (clang) ^ 31 32 // Return 33 return NULL; // Expect to stop here after step-out (icc and gcc; arm64) thread #3, stop reason = breakpoint 1.1 frame #0: 0x0000000100000b44 a.out`step_out_of_here() at main.cpp:20:10 17 volatile int g_test = 0; 18 19 void step_out_of_here() { -> 20 g_test += 5; // Set breakpoint here ^ 21 } 22 23 void *

Hide Details

Hide Details

Expecting sub string: stop reason = step out Matched

Hide Details

runCmd: thread list output: Process 50520 stopped thread #1: tid = 0x47e649, 0x00007fff77c3536a libsystem_kernel.dylib`__ulock_wait + 10, queue = 'com.apple.main-thread' * thread #2: tid = 0x47e6fa, 0x0000000100000b9e a.out`thread_func() at main.cpp:30:5, stop reason = step out

Hide Details

thread #3: tid = 0x47e6fb, 0x0000000100000b44 a.out`step_out_of_here() at main.cpp:20:10, stop reason = breakpoint 1.1

Hide Details

Hide Details

Expecting sub string: * thread #2 Matched

Hide Details

runCmd: thread backtrace all output: thread #1, queue = 'com.apple.main-thread' frame #0: 0x00007fff77c3536a libsystem_kernel.dylib`__ulock_wait + 10 frame #1: 0x00007fff77cf070b libsystem_pthread.dylib`_pthread_join + 356 frame #2: 0x00007fff7521a978 libc++.1.dylib`std::__1::thread::join() + 24 frame #3: 0x0000000100000c62 a.out`main at main.cpp:46:14 frame #4: 0x00007fff77afa085 libdyld.dylib`start + 1 * thread #2, stop reason = step out

Hide Details

* frame #0: 0x0000000100000b9e a.out`thread_func() at main.cpp:30:5 frame #1: 0x0000000100001ad7 a.out`decltype(__f=0x00006020000000d8)()>(fp)()) std::__1::__invoke<void* (*)()>(void* (*&&)()) at type_traits:3539:1 frame #2: 0x0000000100001a45 a.out`void std::__1::__thread_execute<std::__1::unique_ptr<std::__1::__thread_struct, std::__1::default_delete<std::__1::__thread_struct> >, void* (*)()>(__t=size=2, (null)=__tuple_indices<> @ 0x0000700008a40eb8)()>&, std::__1::__tuple_indices<>) at thread:273:5 frame #3: 0x0000000100001266 a.out`void* std::__1::__thread_proxy<std::__1::tuple<std::__1::unique_ptr<std::__1::__thread_struct, std::__1::default_delete<std::__1::__thread_struct> >, void* (*)()> >(__vp=0x00006020000000d0) at thread:284:5 frame #4: 0x00007fff77cec33d libsystem_pthread.dylib`_pthread_body + 126 frame #5: 0x00007fff77cef2a7 libsystem_pthread.dylib`_pthread_start + 70 frame #6: 0x00007fff77ceb425 libsystem_pthread.dylib`thread_start + 13 thread #3, stop reason = breakpoint 1.1 frame #0: 0x0000000100000b44 a.out`step_out_of_here() at main.cpp:20:10 frame #1: 0x0000000100000b9e a.out`thread_func() at main.cpp:30:5 frame #2: 0x0000000100001ad7 a.out`decltype(__f=0x0000602000000118)()>(fp)()) std::__1::__invoke<void* (*)()>(void* (*&&)()) at type_traits:3539:1 frame #3: 0x0000000100001a45 a.out`void std::__1::__thread_execute<std::__1::unique_ptr<std::__1::__thread_struct, std::__1::default_delete<std::__1::__thread_struct> >, void* (*)()>(__t=size=2, (null)=__tuple_indices<> @ 0x0000700008ac3eb8)()>&, std::__1::__tuple_indices<>) at thread:273:5 frame #4: 0x0000000100001266 a.out`void* std::__1::__thread_proxy<std::__1::tuple<std::__1::unique_ptr<std::__1::__thread_struct, std::__1::default_delete<std::__1::__thread_struct> >, void* (*)()> >(__vp=0x0000602000000110) at thread:284:5 frame #5: 0x00007fff77cec33d libsystem_pthread.dylib`_pthread_body + 126 frame #6: 0x00007fff77cef2a7 libsystem_pthread.dylib`_pthread_start + 70 frame #7: 0x00007fff77ceb425 libsystem_pthread.dylib`thread_start + 13

Hide Details

Hide Details

Expecting sub string: main.cpp:30 Matched

Hide Details

Expecting sub string: main.cpp:20 Matched

Hide Details

<bound method SBProcess.Kill of <lldb.SBProcess; proxy of <Swig Object of type 'lldb::SBProcess *' at 0x123ad5300> >>: success

Hide Details

PASS: LLDB (/Users/buildslave/jenkins/workspace/lldb-cmake-sanitized/lldb-build/bin/clang-10-x86_64) :: test_step_single_thread_dsym (TestThreadStepOut.ThreadStepOutTestCase) runCmd: settings set symbols.enable-external-lookup false output:

Hide Details

runCmd: settings set plugin.process.gdb-remote.packet-timeout 60 output:

Hide Details

runCmd: settings set symbols.clang-modules-cache-path "/Users/buildslave/jenkins/workspace/lldb-cmake-sanitized/lldb-build/lldb-test-build.noindex/module-cache-lldb/lldb-api" output:

Hide Details

runCmd: settings set use-color false output:

Hide Details

runCmd: settings set target.env-vars ASAN_OPTIONS=detect_stack_use_after_return=1 DYLD_INSERT_LIBRARIES=/Users/buildslave/jenkins/workspace/lldb-cmake-sanitized/host-compiler/lib/clang/11.0.0/lib/darwin/libclang_rt.asan_osx_dynamic.dylib output:

Hide Details

runCmd: settings set target.env-vars ASAN_OPTIONS=detect_stack_use_after_return=1 DYLD_INSERT_LIBRARIES=/Users/buildslave/jenkins/workspace/lldb-cmake-sanitized/host-compiler/lib/clang/11.0.0/lib/darwin/libclang_rt.asan_osx_dynamic.dylib output:

Hide Details

FAIL: LLDB (/Users/buildslave/jenkins/workspace/lldb-cmake-sanitized/lldb-build/bin/clang-10-x86_64) :: test_step_single_thread_dwarf (TestThreadStepOut.ThreadStepOutTestCase) <bound method SBProcess.Kill of <lldb.SBProcess; proxy of <Swig Object of type 'lldb::SBProcess *' at 0x1234457e0> >>: success

Hide Details

UNSUPPORTED: LLDB (/Users/buildslave/jenkins/workspace/lldb-cmake-sanitized/lldb-build/bin/clang-10-x86_64) :: test_step_single_thread_dwo (TestThreadStepOut.ThreadStepOutTestCase) (test case does not fall in any category of interest for this run) runCmd: settings set symbols.enable-external-lookup false output:

Hide Details

runCmd: settings set plugin.process.gdb-remote.packet-timeout 60 output:

Hide Details

runCmd: settings set symbols.clang-modules-cache-path "/Users/buildslave/jenkins/workspace/lldb-cmake-sanitized/lldb-build/lldb-test-build.noindex/module-cache-lldb/lldb-api" output:

Hide Details

runCmd: settings set use-color false output:

Hide Details

runCmd: settings set target.env-vars ASAN_OPTIONS=detect_stack_use_after_return=1 DYLD_INSERT_LIBRARIES=/Users/buildslave/jenkins/workspace/lldb-cmake-sanitized/host-compiler/lib/clang/11.0.0/lib/darwin/libclang_rt.asan_osx_dynamic.dylib output:

Hide Details

runCmd: settings set target.env-vars ASAN_OPTIONS=detect_stack_use_after_return=1 DYLD_INSERT_LIBRARIES=/Users/buildslave/jenkins/workspace/lldb-cmake-sanitized/host-compiler/lib/clang/11.0.0/lib/darwin/libclang_rt.asan_osx_dynamic.dylib output:

Hide Details

runCmd: thread select 2 output:

Hide Details

runCmd: thread step-out -m this-thread output: Process 51742 stopped * thread #2, stop reason = step out

Hide Details

frame #0: 0x0000000100000b9e a.out`thread_func() at main.cpp:30:5 27 pseudo_barrier_wait(g_barrier); 28 29 // Do something -> 30 step_out_of_here(); // Expect to stop here after step-out (clang) ^ 31 32 // Return 33 return NULL; // Expect to stop here after step-out (icc and gcc; arm64) thread #3, stop reason = breakpoint 1.1 frame #0: 0x0000000100000b44 a.out`step_out_of_here() at main.cpp:20:10 17 volatile int g_test = 0; 18 19 void step_out_of_here() { -> 20 g_test += 5; // Set breakpoint here ^ 21 } 22 23 void *

Hide Details

Hide Details

Hide Details

runCmd: process status output: Process 51742 stopped * thread #2, stop reason = step out

Hide Details

frame #0: 0x0000000100000b9e a.out`thread_func() at main.cpp:30:5 27 pseudo_barrier_wait(g_barrier); 28 29 // Do something -> 30 step_out_of_here(); // Expect to stop here after step-out (clang) ^ 31 32 // Return 33 return NULL; // Expect to stop here after step-out (icc and gcc; arm64) thread #3, stop reason = breakpoint 1.1 frame #0: 0x0000000100000b44 a.out`step_out_of_here() at main.cpp:20:10 17 volatile int g_test = 0; 18 19 void step_out_of_here() { -> 20 g_test += 5; // Set breakpoint here ^ 21 } 22 23 void *

Hide Details

Hide Details

Expecting sub string: stop reason = step out Matched

Hide Details

runCmd: thread list output: Process 51742 stopped thread #1: tid = 0x47eeda, 0x00007fff77c3536a libsystem_kernel.dylib`__ulock_wait + 10, queue = 'com.apple.main-thread' * thread #2: tid = 0x47efdd, 0x0000000100000b9e a.out`thread_func() at main.cpp:30:5, stop reason = step out

Hide Details

thread #3: tid = 0x47efe0, 0x0000000100000b44 a.out`step_out_of_here() at main.cpp:20:10, stop reason = breakpoint 1.1

Hide Details

Hide Details

Expecting sub string: * thread #2 Matched

Hide Details

runCmd: thread backtrace all output: thread #1, queue = 'com.apple.main-thread' frame #0: 0x00007fff77c3536a libsystem_kernel.dylib`__ulock_wait + 10 frame #1: 0x00007fff77cf070b libsystem_pthread.dylib`_pthread_join + 356 frame #2: 0x00007fff7521a978 libc++.1.dylib`std::__1::thread::join() + 24 frame #3: 0x0000000100000c62 a.out`main at main.cpp:46:14 frame #4: 0x00007fff77afa085 libdyld.dylib`start + 1 * thread #2, stop reason = step out

Hide Details

* frame #0: 0x0000000100000b9e a.out`thread_func() at main.cpp:30:5 frame #1: 0x0000000100001ad7 a.out`decltype(__f=0x00006020000000d8)()>(fp)()) std::__1::__invoke<void* (*)()>(void* (*&&)()) at type_traits:3539:1 frame #2: 0x0000000100001a45 a.out`void std::__1::__thread_execute<std::__1::unique_ptr<std::__1::__thread_struct, std::__1::default_delete<std::__1::__thread_struct> >, void* (*)()>(__t=size=2, (null)=__tuple_indices<> @ 0x000070000b8b9eb8)()>&, std::__1::__tuple_indices<>) at thread:273:5 frame #3: 0x0000000100001266 a.out`void* std::__1::__thread_proxy<std::__1::tuple<std::__1::unique_ptr<std::__1::__thread_struct, std::__1::default_delete<std::__1::__thread_struct> >, void* (*)()> >(__vp=0x00006020000000d0) at thread:284:5 frame #4: 0x00007fff77cec33d libsystem_pthread.dylib`_pthread_body + 126 frame #5: 0x00007fff77cef2a7 libsystem_pthread.dylib`_pthread_start + 70 frame #6: 0x00007fff77ceb425 libsystem_pthread.dylib`thread_start + 13 thread #3, stop reason = breakpoint 1.1 frame #0: 0x0000000100000b44 a.out`step_out_of_here() at main.cpp:20:10 frame #1: 0x0000000100000b9e a.out`thread_func() at main.cpp:30:5 frame #2: 0x0000000100001ad7 a.out`decltype(__f=0x0000602000000118)()>(fp)()) std::__1::__invoke<void* (*)()>(void* (*&&)()) at type_traits:3539:1 frame #3: 0x0000000100001a45 a.out`void std::__1::__thread_execute<std::__1::unique_ptr<std::__1::__thread_struct, std::__1::default_delete<std::__1::__thread_struct> >, void* (*)()>(__t=size=2, (null)=__tuple_indices<> @ 0x000070000b93ceb8)()>&, std::__1::__tuple_indices<>) at thread:273:5 frame #4: 0x0000000100001266 a.out`void* std::__1::__thread_proxy<std::__1::tuple<std::__1::unique_ptr<std::__1::__thread_struct, std::__1::default_delete<std::__1::__thread_struct> >, void* (*)()> >(__vp=0x0000602000000110) at thread:284:5 frame #5: 0x00007fff77cec33d libsystem_pthread.dylib`_pthread_body + 126 frame #6: 0x00007fff77cef2a7 libsystem_pthread.dylib`_pthread_start + 70 frame #7: 0x00007fff77ceb425 libsystem_pthread.dylib`thread_start + 13

Hide Details

Hide Details

Expecting sub string: main.cpp:30 Matched

Hide Details

Expecting sub string: main.cpp:20 Matched

Hide Details

<bound method SBProcess.Kill of <lldb.SBProcess; proxy of <Swig Object of type 'lldb::SBProcess *' at 0x123ad53f0> >>: success

Hide Details

PASS: LLDB (/Users/buildslave/jenkins/workspace/lldb-cmake-sanitized/lldb-build/bin/clang-10-x86_64) :: test_step_single_thread_gmodules (TestThreadStepOut.ThreadStepOutTestCase) Restore dir to: /Users/buildslave/jenkins/workspace/lldb-cmake-sanitized/lldb-build/tools/lldb/test ====================================================================== ERROR: test_step_single_thread_dwarf (TestThreadStepOut.ThreadStepOutTestCase) Test thread step out on one thread via command interpreter. ---------------------------------------------------------------------- Traceback (most recent call last): File "/Users/buildslave/jenkins/workspace/lldb-cmake-sanitized/llvm-project/lldb/packages/Python/lldbsuite/test/lldbtest.py", line 1732, in test_method return attrvalue(self) File "/Users/buildslave/jenkins/workspace/lldb-cmake-sanitized/llvm-project/lldb/packages/Python/lldbsuite/test/decorators.py", line 110, in wrapper func(*args, **kwargs) File "/Users/buildslave/jenkins/workspace/lldb-cmake-sanitized/llvm-project/lldb/packages/Python/lldbsuite/test/decorators.py", line 110, in wrapper func(*args, **kwargs) File "/Users/buildslave/jenkins/workspace/lldb-cmake-sanitized/llvm-project/lldb/packages/Python/lldbsuite/test/decorators.py", line 110, in wrapper func(*args, **kwargs) File "/Users/buildslave/jenkins/workspace/lldb-cmake-sanitized/llvm-project/lldb/packages/Python/lldbsuite/test/functionalities/thread/step_out/TestThreadStepOut.py", line 31, in test_step_single_thread self.step_out_test(self.step_out_single_thread_with_cmd) File "/Users/buildslave/jenkins/workspace/lldb-cmake-sanitized/llvm-project/lldb/packages/Python/lldbsuite/test/functionalities/thread/step_out/TestThreadStepOut.py", line 148, in step_out_test bkpt_threads = lldbutil.continue_to_breakpoint(bkpt) TypeError: continue_to_breakpoint() missing 1 required positional argument: 'bkpt' Config=x86_64-/Users/buildslave/jenkins/workspace/lldb-cmake-sanitized/lldb-build/bin/clang-10 ---------------------------------------------------------------------- Ran 12 tests in 173.202s

Hide Details

RESULT: FAILED (8 passes, 0 failures, 1 errors, 3 skipped, 0 expected failures, 0 unexpected successes)

Hide Details

******************** PASS: lldb-unit :: Utility/./UtilityTests/BinaryStreamTest.PutULEB128SevenBytes (1449 of 1893) PASS: lldb-unit :: Utility/./UtilityTests/StringListTest.JoinEmpty (1450 of 1893) PASS: lldb-unit :: UnwindAssembly/x86/./UnwindAssemblyx86Tests/Testx86AssemblyInspectionEngine.TestPopESI (1451 of 1893) PASS: lldb-api :: functionalities/data-formatter/data-formatter-globals/TestDataFormatterGlobals.py (1452 of 1893) PASS: lldb-shell :: SymbolFile/DWARF/find-qualified-variable.cpp (1453 of 1893) PASS: lldb-shell :: ObjectFile/Breakpad/sections.test (1454 of 1893) UNSUPPORTED: lldb-api :: functionalities/longjmp/TestLongjmp.py (1455 of 1893) PASS: lldb-unit :: Utility/./UtilityTests/StreamTest.PutNHex8 (1456 of 1893) PASS: lldb-unit :: Editline/./EditlineTests/EditlineTestFixture.EditlineReceivesSingleLineText (1457 of 1893) PASS: lldb-shell :: SymbolFile/NativePDB/bitfields.cpp (1458 of 1893) PASS: lldb-unit :: Utility/./UtilityTests/AnsiTerminal.Twice (1459 of 1893) PASS: lldb-unit :: debugserver/./debugserverTests/RNBSocket.AnyListen (1460 of 1893) PASS: lldb-api :: functionalities/unwind/noreturn/TestNoreturnUnwind.py (1461 of 1893) PASS: lldb-api :: lang/cpp/call-function/TestCallCPPFunction.py (1462 of 1893) PASS: lldb-unit :: Language/Highlighting/./HighlighterTests/HighlighterTest.ClangIdentifiers (1463 of 1893) PASS: lldb-unit :: Expression/./ExpressionTests/ClangExpressionDeclMapTest.TestUnknownIdentifierLookup (1464 of 1893) UNSUPPORTED: lldb-api :: python_api/disassemble-raw-data/TestDisassemble_VST1_64.py (1465 of 1893) PASS: lldb-unit :: Expression/./ExpressionTests/CppModuleConfigurationTest.Sysroot (1466 of 1893) PASS: lldb-api :: lang/objcxx/class-name-clash/TestNameClash.py (1467 of 1893) PASS: lldb-shell :: Quit/TestQuitExitCode0.test (1468 of 1893) PASS: lldb-unit :: Utility/./UtilityTests/RangeTest.DoesAdjoinOrIntersect (1469 of 1893) PASS: lldb-unit :: Symbol/./SymbolTests/TestClangASTContext.TestFunctionTemplateInRecordConstruction (1470 of 1893) PASS: lldb-api :: lang/c/tls_globals/TestTlsGlobals.py (1471 of 1893) PASS: lldb-api :: functionalities/show_location/TestShowLocationDwarf5.py (1472 of 1893) PASS: lldb-api :: lang/cpp/nsimport/TestCppNsImport.py (1473 of 1893) PASS: lldb-unit :: Core/./LLDBCoreTests/StreamCallbackTest.Callback (1474 of 1893) PASS: lldb-api :: types/TestLongTypes.py (1475 of 1893) PASS: lldb-unit :: Language/Highlighting/./HighlighterTests/HighlighterTest.ClangUnterminatedString (1476 of 1893) PASS: lldb-api :: functionalities/inferior-crashing/TestInferiorCrashingStep.py (1477 of 1893) PASS: lldb-api :: lang/cpp/template-function/TestTemplateFunctions.py (1478 of 1893) PASS: lldb-api :: functionalities/inferior-crashing/TestInferiorCrashing.py (1479 of 1893) PASS: lldb-api :: tools/lldb-server/TestGdbRemoteAttach.py (1480 of 1893) UNSUPPORTED: lldb-api :: tools/lldb-vscode/completions/TestVSCode_completions.py (1481 of 1893) PASS: lldb-api :: python_api/formatters/TestFormattersSBAPI.py (1482 of 1893) PASS: lldb-unit :: Host/./HostTests/Host.GetEnvironment (1483 of 1893) UNSUPPORTED: lldb-shell :: Register/aarch64-gp-read.test (1484 of 1893) UNSUPPORTED: lldb-api :: benchmarks/stepping/TestSteppingSpeed.py (1485 of 1893) PASS: lldb-api :: functionalities/data-formatter/nssetsynth/TestNSSetSynthetic.py (1486 of 1893) PASS: lldb-api :: commands/expression/import-std-module/weak_ptr-dbg-info-content/TestDbgInfoContentWeakPtr.py (1487 of 1893) PASS: lldb-unit :: Utility/./UtilityTests/ProcessInstanceInfo.DumpTable_invalidUID (1488 of 1893) UNSUPPORTED: lldb-shell :: SymbolFile/PDB/typedefs.test (1489 of 1893) PASS: lldb-unit :: UnwindAssembly/x86/./UnwindAssemblyx86Tests/Testx86AssemblyInspectionEngine.Test32bitFramelessSmallStackFrame (1490 of 1893) PASS: lldb-unit :: Utility/./UtilityTests/StringListTest.CopyListEmpty (1491 of 1893) PASS: lldb-unit :: Utility/./UtilityTests/StructuredDataTest.StringDump (1492 of 1893) PASS: lldb-unit :: UnwindAssembly/x86/./UnwindAssemblyx86Tests/Testx86AssemblyInspectionEngine.TestPopRBX (1493 of 1893) PASS: lldb-unit :: Process/gdb-remote/./ProcessGdbRemoteTests/GDBRemoteCommunicationClientTest.WriteRegister (1494 of 1893) PASS: lldb-unit :: Utility/./UtilityTests/UUIDTest.SetFromStringRef (1495 of 1893) PASS: lldb-unit :: ScriptInterpreter/Python/./ScriptInterpreterPythonTests/PythonDataObjectsTest.TestPythonCallableInvoke (1496 of 1893) UNSUPPORTED: lldb-api :: tools/lldb-server/platform-process-connect/TestPlatformProcessConnect.py (1497 of 1893) PASS: lldb-shell :: Reproducer/TestSynchronous.test (1498 of 1893) PASS: lldb-api :: macosx/order/TestOrderFile.py (1499 of 1893) PASS: lldb-shell :: SymbolFile/Breakpad/line-table-missing-file.test (1500 of 1893) PASS: lldb-unit :: Process/gdb-remote/./ProcessGdbRemoteTests/GDBRemoteCommunicationClientTest.SendGetDataPacket (1501 of 1893) PASS: lldb-api :: functionalities/breakpoint/objc/TestObjCBreakpoints.py (1502 of 1893) PASS: lldb-shell :: Reproducer/TestReuseDirectory.test (1503 of 1893) PASS: lldb-unit :: UnwindAssembly/x86/./UnwindAssemblyx86Tests/Testx86AssemblyInspectionEngine.TestStackRealignMSVC_i386 (1504 of 1893) PASS: lldb-api :: macosx/function-starts/TestFunctionStarts.py (1505 of 1893) PASS: lldb-api :: lang/cpp/global_variables/TestCPPGlobalVariables.py (1506 of 1893) UNSUPPORTED: lldb-shell :: ScriptInterpreter/Lua/watchpoint_callback.test (1507 of 1893) PASS: lldb-api :: sample_test/TestSampleTest.py (1508 of 1893) PASS: lldb-shell :: ObjectFile/MachO/symtab.yaml (1509 of 1893) PASS: lldb-api :: functionalities/float-display/TestFloatDisplay.py (1510 of 1893) PASS: lldb-unit :: Utility/./UtilityTests/UriParserTest.SchemeHostSeparator2 (1511 of 1893) PASS: lldb-unit :: Process/minidump/./LLDBMinidumpTests/MinidumpParserTest.GetMiscInfoWindows (1512 of 1893) PASS: lldb-api :: commands/expression/call-function/TestCallBuiltinFunction.py (1513 of 1893) PASS: lldb-api :: functionalities/data-formatter/refpointer-recursion/TestDataFormatterRefPtrRecursion.py (1514 of 1893) PASS: lldb-api :: functionalities/data-formatter/synthupdate/TestSyntheticFilterRecompute.py (1515 of 1893) PASS: lldb-unit :: Expression/./ExpressionTests/DiagnosticManagerTest.AppendMessageAttachToLastDiag (1516 of 1893) PASS: lldb-unit :: Utility/./UtilityTests/OptionsWithRawTest.MultiWordSuffix (1517 of 1893) PASS: lldb-unit :: Utility/./UtilityTests/StringExtractorTest.GetU32BigEndian (1518 of 1893) PASS: lldb-api :: functionalities/data-formatter/data-formatter-advanced/TestDataFormatterAdv.py (1519 of 1893) UNSUPPORTED: lldb-api :: functionalities/darwin_log/filter/regex/subsystem/TestDarwinLogFilterRegexSubsystem.py (1520 of 1893) PASS: lldb-unit :: SymbolFile/DWARF/./SymbolFileDWARFTests/SymbolFileDWARFTests.TestAbbrevOutOfOrder (1521 of 1893) PASS: lldb-api :: functionalities/gdb_remote_client/TestNoGPacketSupported.py (1522 of 1893) PASS: lldb-unit :: Symbol/./SymbolTests/TestClangASTImporter.CopyDeclTagDecl (1523 of 1893) PASS: lldb-unit :: Utility/./UtilityTests/StringExtractorTest.GetHexU8_Extra (1524 of 1893) PASS: lldb-api :: lang/objc/modules-hash-mismatch/TestClangModulesHashMismatch.py (1525 of 1893) PASS: lldb-unit :: ScriptInterpreter/Python/./ScriptInterpreterPythonTests/PythonDataObjectsTest.TestPythonStringToStr (1526 of 1893) PASS: lldb-api :: lang/objc/objc_direct-methods/TestObjCDirectMethods.py (1527 of 1893) PASS: lldb-api :: tools/lldb-server/commandline/TestStubSetSID.py (1528 of 1893) PASS: lldb-unit :: UnwindAssembly/x86/./UnwindAssemblyx86Tests/Testx86AssemblyInspectionEngine.Test32bitFramelessBigStackFrame (1529 of 1893) UNSUPPORTED: lldb-api :: commands/watchpoints/hello_watchlocation/TestWatchLocation.py (1530 of 1893) UNSUPPORTED: lldb-api :: functionalities/thread/create_during_step/TestCreateDuringStep.py (1531 of 1893) PASS: lldb-api :: functionalities/thread/concurrent_events/TestConcurrentTwoWatchpointsOneSignal.py (1532 of 1893) PASS: lldb-api :: api/check_public_api_headers/TestPublicAPIHeaders.py (1533 of 1893) PASS: lldb-shell :: SymbolFile/DWARF/dir-separator-no-comp-dir.s (1534 of 1893) PASS: lldb-shell :: ObjectFile/Breakpad/breakpad-identification.test (1535 of 1893) PASS: lldb-shell :: ObjectFile/PECOFF/symbol.yaml (1536 of 1893) PASS: lldb-unit :: Utility/./UtilityTests/ArgsTest.ReplaceArgumentAtIndexFarOutOfRange (1537 of 1893) PASS: lldb-unit :: debugserver/./debugserverTests/RNBSocket.LoopBackConnectIPv4 (1538 of 1893) PASS: lldb-api :: commands/expression/import-std-module/deque-basic/TestBasicDeque.py (1539 of 1893) PASS: lldb-shell :: SymbolFile/DWARF/dir-separator-posix.s (1540 of 1893) PASS: lldb-unit :: Utility/./UtilityTests/RangeTest.ContainsRange (1541 of 1893) UNSUPPORTED: lldb-api :: functionalities/breakpoint/breakpoint_in_delayslot/TestAvoidBreakpointInDelaySlot.py (1542 of 1893) PASS: lldb-api :: lang/cpp/llvm-style/TestLLVMStyle.py (1543 of 1893) PASS: lldb-api :: functionalities/thread/concurrent_events/TestConcurrentSignalWatch.py (1544 of 1893) PASS: lldb-unit :: Utility/./UtilityTests/StringExtractorTest.GetHexU8_Underflow2 (1545 of 1893) PASS: lldb-api :: commands/expression/import-std-module/list-basic/TestBasicList.py (1546 of 1893) PASS: lldb-unit :: Process/gdb-remote/./ProcessGdbRemoteTests/GDBRemoteCommunicationClientTest.SendGetMetaDataPacket (1547 of 1893) PASS: lldb-api :: functionalities/tail_call_frames/ambiguous_tail_call_seq1/TestAmbiguousTailCallSeq1.py (1548 of 1893) PASS: lldb-api :: functionalities/breakpoint/address_breakpoints/TestAddressBreakpoints.py (1549 of 1893) PASS: lldb-unit :: Utility/./UtilityTests/StreamTest.PutHex32ByteOrderLittle (1550 of 1893) PASS: lldb-unit :: Utility/./UtilityTests/UriParserTest.BracketedHostnamePort (1551 of 1893) PASS: lldb-api :: commands/frame/diagnose/array/TestArray.py (1552 of 1893) PASS: lldb-api :: python_api/default-constructor/TestDefaultConstructorForAPIObjects.py (1553 of 1893) PASS: lldb-api :: functionalities/gdb_remote_client/TestThreadSelectionBug.py (1554 of 1893) PASS: lldb-api :: functionalities/type_lookup/TestTypeLookup.py (1555 of 1893) PASS: lldb-shell :: Reproducer/TestDump.test (1556 of 1893) PASS: lldb-unit :: Expression/./ExpressionTests/DWARFExpression.DW_OP_convert (1557 of 1893) PASS: lldb-unit :: Language/Highlighting/./HighlighterTests/HighlighterTest.ClangComments (1558 of 1893) PASS: lldb-unit :: Utility/./UtilityTests/RangeTest.ContainsRangeStartingFromZero (1559 of 1893) PASS: lldb-unit :: Utility/./UtilityTests/NameMatchesTest.Ignore (1560 of 1893) PASS: lldb-unit :: Utility/./UtilityTests/RangeTest.Clear (1561 of 1893) PASS: lldb-unit :: Utility/./UtilityTests/NameMatchesTest.EndsWith (1562 of 1893) PASS: lldb-unit :: ScriptInterpreter/Python/./ScriptInterpreterPythonTests/PythonDataObjectsTest.TestExceptions (1563 of 1893) PASS: lldb-api :: functionalities/gdb_remote_client/TestArmRegisterDefinition.py (1564 of 1893) PASS: lldb-unit :: UnwindAssembly/x86/./UnwindAssemblyx86Tests/Testx86AssemblyInspectionEngine.TestSimplex86_64Augmented (1565 of 1893) PASS: lldb-api :: functionalities/deleted-executable/TestDeletedExecutable.py (1566 of 1893) PASS: lldb-api :: functionalities/tail_call_frames/thread_step_out_or_return/TestSteppingOutWithArtificialFrames.py (1567 of 1893) PASS: lldb-unit :: Symbol/./SymbolTests/TestClangASTImporter.MetadataPropagation (1568 of 1893) PASS: lldb-api :: functionalities/breakpoint/inlined_breakpoints/TestInlinedBreakpoints.py (1569 of 1893) PASS: lldb-api :: commands/expression/completion-crash-incomplete-record/TestCompletionCrashIncompleteRecord.py (1570 of 1893) PASS: lldb-unit :: Target/./TargetTests/PathMappingListTest.RemapRoot (1571 of 1893) PASS: lldb-unit :: Utility/./UtilityTests/ReproducerTest.SetReplay (1572 of 1893) PASS: lldb-api :: functionalities/breakpoint/breakpoint_names/TestBreakpointNames.py (1573 of 1893) PASS: lldb-api :: lang/cpp/overloaded-functions/TestOverloadedFunctions.py (1574 of 1893) PASS: lldb-unit :: Utility/./UtilityTests/ArchSpecTest.OperatorBool (1575 of 1893) UNSUPPORTED: lldb-api :: commands/register/register/intel_xtended_registers/mpx_bound_violation/TestBoundViolation.py (1576 of 1893) PASS: lldb-unit :: SymbolFile/NativePDB/./SymbolFileNativePDBTests/PDBFPOProgramToDWARFExpressionTests.UnsupportedRASearch (1577 of 1893) PASS: lldb-api :: types/TestLongTypesExpr.py (1578 of 1893) UNSUPPORTED: lldb-api :: iohandler/unicode/TestUnicode.py (1579 of 1893) PASS: lldb-api :: functionalities/value_md5_crash/TestValueMD5Crash.py (1580 of 1893) PASS: lldb-unit :: Utility/./UtilityTests/LogChannelTest.Disable (1581 of 1893) PASS: lldb-unit :: Target/./TargetTests/ExecutionContextTest.GetByteOrderTarget (1582 of 1893) PASS: lldb-api :: commands/disassemble/basic/TestDisassembleBreakpoint.py (1583 of 1893) PASS: lldb-unit :: tools/lldb-server/tests/./LLDBServerTests/TestBase.LaunchModePreservesEnvironment (1584 of 1893) PASS: lldb-unit :: Symbol/./SymbolTests/TestClangASTContext.TestRemoveFastQualifiers (1585 of 1893) PASS: lldb-api :: commands/expression/dont_allow_jit/TestAllowJIT.py (1586 of 1893) UNSUPPORTED: lldb-shell :: Register/x86-gp-write.test (1587 of 1893) PASS: lldb-unit :: Utility/./UtilityTests/StreamTeeTest.Constructor1Stream (1588 of 1893) PASS: lldb-unit :: Language/Highlighting/./HighlighterTests/HighlighterTest.ClangBraces (1589 of 1893) PASS: lldb-unit :: Utility/./UtilityTests/RangeTest.EqualInvalid (1590 of 1893) UNSUPPORTED: lldb-shell :: Register/x86-64-xmm16-write.test (1591 of 1893) PASS: lldb-api :: commands/expression/import-std-module/sysroot/TestStdModuleSysroot.py (1592 of 1893) PASS: lldb-api :: functionalities/gdb_remote_client/TestRecognizeBreakpoint.py (1593 of 1893) PASS: lldb-unit :: Utility/./UtilityTests/RangeTest.DefaultConstructor (1594 of 1893) PASS: lldb-api :: functionalities/memory/find/TestMemoryFind.py (1595 of 1893) PASS: lldb-unit :: UnwindAssembly/x86/./UnwindAssemblyx86Tests/Testx86AssemblyInspectionEngine.TestAddRSP (1596 of 1893) PASS: lldb-api :: commands/expression/import-std-module/vector-of-vectors/TestVectorOfVectors.py (1597 of 1893) PASS: lldb-api :: commands/frame/diagnose/complicated-expression/TestComplicatedExpression.py (1598 of 1893) PASS: lldb-shell :: ObjectFile/PECOFF/export-dllfunc.yaml (1599 of 1893) PASS: lldb-unit :: Utility/./UtilityTests/StringExtractorTest.GetHexBytes_Partial (1600 of 1893) PASS: lldb-unit :: UnwindAssembly/x86/./UnwindAssemblyx86Tests/Testx86AssemblyInspectionEngine.TestPushEDI (1601 of 1893) PASS: lldb-api :: python_api/watchpoint/watchlocation/TestSetWatchlocation.py (1602 of 1893) PASS: lldb-unit :: Utility/./UtilityTests/BinaryStreamTest.PutULEB128NineBytes (1603 of 1893) PASS: lldb-api :: functionalities/gdb_remote_client/TestStopPCs.py (1604 of 1893) PASS: lldb-unit :: Utility/./UtilityTests/RecordReplayTest.InstrumentedBarPtr (1605 of 1893) PASS: lldb-shell :: Commands/CommandScriptImmediateOutput/CommandScriptImmediateOutputConsole.test (1606 of 1893) PASS: lldb-api :: commands/platform/basic/TestPlatformPython.py (1607 of 1893) UNSUPPORTED: lldb-api :: functionalities/data-formatter/data-formatter-stl/libstdcpp/vector/TestDataFormatterStdVector.py (1608 of 1893) PASS: lldb-unit :: Host/./HostTests/SocketTest.UDPGetConnectURI (1609 of 1893) PASS: lldb-api :: commands/process/launch-with-shellexpand/TestLaunchWithShellExpand.py (1610 of 1893) PASS: lldb-unit :: Host/./HostTests/SocketTest.DecodeHostAndPort (1611 of 1893) PASS: lldb-unit :: Process/gdb-remote/./ProcessGdbRemoteTests/GDBRemoteClientBaseTest.InterruptNoResponse (1612 of 1893) PASS: lldb-api :: commands/expression/calculator_mode/TestCalculatorMode.py (1613 of 1893) PASS: lldb-unit :: SymbolFile/NativePDB/./SymbolFileNativePDBTests/PDBFPOProgramToDWARFExpressionTests.UnknownOp (1614 of 1893) PASS: lldb-shell :: SymbolFile/NativePDB/globals-bss.cpp (1615 of 1893) PASS: lldb-unit :: Utility/./UtilityTests/ScalarTest.ComparisonFloat (1616 of 1893) PASS: lldb-api :: functionalities/unwind/sigtramp/TestSigtrampUnwind.py (1617 of 1893) PASS: lldb-unit :: Expression/./ExpressionTests/DWARFExpression.DW_OP_pick (1618 of 1893) PASS: lldb-api :: functionalities/breakpoint/global_constructor/TestBreakpointInGlobalConstructor.py (1619 of 1893) PASS: lldb-api :: lang/cpp/inlines/TestInlines.py (1620 of 1893) PASS: lldb-api :: functionalities/thread/concurrent_events/TestConcurrentDelayWatchBreak.py (1621 of 1893) PASS: lldb-api :: functionalities/thread/concurrent_events/TestConcurrentCrashWithWatchpointBreakpointSignal.py (1622 of 1893) PASS: lldb-api :: commands/expression/import-std-module/forward_list-dbg-info-content/TestDbgInfoContentForwardList.py (1623 of 1893) PASS: lldb-api :: functionalities/data-formatter/array_typedef/TestArrayTypedef.py (1624 of 1893) PASS: lldb-unit :: ScriptInterpreter/Python/./ScriptInterpreterPythonTests/PythonDataObjectsTest.TestPythonListManipulation (1625 of 1893) PASS: lldb-shell :: ObjectFile/MachO/lc_build_version_notools.yaml (1626 of 1893) PASS: lldb-unit :: Host/./HostTests/SocketTest.TCPGetAddress (1627 of 1893) PASS: lldb-api :: functionalities/data-formatter/data-formatter-stl/libcxx/list/TestDataFormatterLibcxxList.py (1628 of 1893) PASS: lldb-unit :: Interpreter/./InterpreterTests/CompletionTest.DirCompletionUsername (1629 of 1893) PASS: lldb-shell :: ObjectFile/MachO/lc_build_version.yaml (1630 of 1893) PASS: lldb-unit :: Expression/./ExpressionTests/CppModuleConfigurationTest.AmbiguousLibCpp (1631 of 1893) PASS: lldb-api :: python_api/function_symbol/TestSymbolAPI.py (1632 of 1893) PASS: lldb-unit :: Utility/./UtilityTests/Flags.GetBitSize (1633 of 1893) UNSUPPORTED: lldb-api :: functionalities/tsan/cpp_global_location/TestTsanCPPGlobalLocation.py (1634 of 1893) PASS: lldb-unit :: Utility/./UtilityTests/BinaryStreamTest.PutULEB128MaxValue (1635 of 1893) PASS: lldb-unit :: Utility/./UtilityTests/ArgsTest.TestMultipleArgs (1636 of 1893) PASS: lldb-unit :: UnwindAssembly/x86/./UnwindAssemblyx86Tests/Testx86AssemblyInspectionEngine.TestSpillRegToStackViaMOVx86_64 (1637 of 1893) PASS: lldb-shell :: ObjectFile/Breakpad/discontiguous-sections.test (1638 of 1893) PASS: lldb-unit :: Utility/./UtilityTests/StreamTest.PutRawBytesToMixedEndian (1639 of 1893) PASS: lldb-unit :: Process/gdb-remote/./ProcessGdbRemoteTests/GDBRemoteCommunicationClientTest.GetMemoryRegionInfoInvalidResponse (1640 of 1893) PASS: lldb-unit :: Utility/./UtilityTests/StringListTest.GetMaxStringLengthDecreasingSize (1641 of 1893) PASS: lldb-unit :: ScriptInterpreter/Python/./ScriptInterpreterPythonTests/PythonDataObjectsTest.TestPythonInteger (1642 of 1893) PASS: lldb-api :: tools/lldb-server/register-reading/TestGdbRemoteGPacket.py (1643 of 1893) PASS: lldb-unit :: Process/gdb-remote/./ProcessGdbRemoteTests/GDBRemoteCommunicationClientTest.TestPacketSpeedJSON (1644 of 1893) PASS: lldb-shell :: Quit/TestQuitExitCode30.test (1645 of 1893) PASS: lldb-unit :: Utility/./UtilityTests/UserIDResolver.GetUserName (1646 of 1893) PASS: lldb-unit :: Utility/./UtilityTests/RecordReplayTest.InstrumentedBar (1647 of 1893) PASS: lldb-unit :: Utility/./UtilityTests/UriParserTest.SchemeHostSeparator (1648 of 1893) PASS: lldb-api :: functionalities/thread/jump/TestThreadJump.py (1649 of 1893) PASS: lldb-shell :: Breakpoint/debug_addrx.test (1650 of 1893) PASS: lldb-unit :: Host/./HostTests/NativeProcessProtocolTest.SetBreakpointFailWrite (1651 of 1893) PASS: lldb-unit :: ScriptInterpreter/Python/./ScriptInterpreterPythonTests/PythonDataObjectsTest.TestObjectAttributes (1652 of 1893) PASS: lldb-unit :: ScriptInterpreter/Python/./ScriptInterpreterPythonTests/PythonDataObjectsTest.TestPythonTupleSize (1653 of 1893) PASS: lldb-unit :: Utility/./UtilityTests/BinaryStreamTest.PutSLEB128MaxValue (1654 of 1893) PASS: lldb-shell :: ObjectFile/ELF/PT_LOAD-overlap.yaml (1655 of 1893) PASS: lldb-shell :: Settings/TestSettingsWrite.test (1656 of 1893) PASS: lldb-unit :: Utility/./UtilityTests/SubsystemRAIITest.NormalSubsystem (1657 of 1893) PASS: lldb-unit :: Host/./HostTests/MainLoopTest.UnmonitoredSignal (1658 of 1893) PASS: lldb-api :: types/TestShortType.py (1659 of 1893) PASS: lldb-api :: commands/expression/codegen-crash-typedefdecl-not-in_declcontext/TestCodegenCrashTypedefDeclNotInDeclContext.py (1660 of 1893) PASS: lldb-unit :: Utility/./UtilityTests/OptionsWithRawTest.UnterminatedQuote (1661 of 1893) PASS: lldb-unit :: Utility/./UtilityTests/ArchSpecTest.Compatibility (1662 of 1893) PASS: lldb-unit :: Process/gdb-remote/./ProcessGdbRemoteTests/GDBRemoteCommunicationClientTest.GetMemoryRegionInfo (1663 of 1893) PASS: lldb-unit :: SymbolFile/DWARF/./SymbolFileDWARFTests/SymbolFileDWARFTests.TestAbbrevNullAttrValidForm (1664 of 1893) PASS: lldb-unit :: Expression/./ExpressionTests/DiagnosticManagerTest.PutStringMultiple (1665 of 1893) PASS: lldb-unit :: Interpreter/./InterpreterTests/OptionArgParserTest.toChar (1666 of 1893) PASS: lldb-api :: macosx/indirect_symbol/TestIndirectSymbols.py (1667 of 1893) PASS: lldb-unit :: Process/minidump/./LLDBMinidumpTests/MinidumpParserTest.GetArchitectureWindows (1668 of 1893) PASS: lldb-api :: commands/expression/import-std-module/unique_ptr-dbg-info-content/TestUniquePtrDbgInfoContent.py (1669 of 1893) PASS: lldb-unit :: Utility/./UtilityTests/StringExtractorTest.GetHexBytes_FullString (1670 of 1893) UNSUPPORTED: lldb-api :: tools/lldb-server/signal-filtering/TestGdbRemote_QPassSignals.py (1671 of 1893) PASS: lldb-api :: commands/expression/cast_int_to_anonymous_enum/TestCastIntToAnonymousEnum.py (1672 of 1893) PASS: lldb-api :: commands/expression/static-initializers/TestStaticInitializers.py (1673 of 1893) PASS: lldb-unit :: Utility/./UtilityTests/ScalarTest.Equality (1674 of 1893) PASS: lldb-unit :: Utility/./UtilityTests/UriParserTest.BracketedHostname (1675 of 1893) UNSUPPORTED: lldb-shell :: SymbolFile/DWARF/debug-types-expressions.test (1676 of 1893) PASS: lldb-api :: python_api/sbvalue_persist/TestSBValuePersist.py (1677 of 1893) PASS: lldb-unit :: Utility/./UtilityTests/StringListTest.SplitIntoLinesEmpty (1678 of 1893) PASS: lldb-unit :: Utility/./UtilityTests/StringExtractorTest.GetHexU8_InvalidHex_NoEof (1679 of 1893) PASS: lldb-unit :: Symbol/./SymbolTests/TestClangASTImporter.CopyTypeTagDecl (1680 of 1893) PASS: lldb-api :: python_api/symbol-context/two-files/TestSymbolContextTwoFiles.py (1681 of 1893) UNSUPPORTED: lldb-shell :: Register/x86-ymm-read.test (1682 of 1893) PASS: lldb-unit :: Language/CPlusPlus/./LanguageCPlusPlusTests/CPlusPlusLanguage.FindAlternateFunctionManglings (1683 of 1893) PASS: lldb-api :: functionalities/non-overlapping-index-variable-i/TestIndexVariable.py (1684 of 1893) PASS: lldb-unit :: Language/Highlighting/./HighlighterTests/HighlighterTest.ClangCursorPosEndOfLine (1685 of 1893) PASS: lldb-unit :: Language/Highlighting/./HighlighterTests/HighlighterTest.ClangCursorPosBeforeOtherToken (1686 of 1893) PASS: lldb-unit :: Utility/./UtilityTests/SerializationRountripTest.SerializeDeserializePod (1687 of 1893) PASS: lldb-api :: functionalities/data-formatter/data-formatter-smart-array/TestDataFormatterSmartArray.py (1688 of 1893) PASS: lldb-api :: macosx/DBGSourcePathRemapping/TestDSYMSourcePathRemapping.py (1689 of 1893) PASS: lldb-api :: commands/expression/anonymous-struct/TestCallUserAnonTypedef.py (1690 of 1893) PASS: lldb-api :: lang/cpp/trivial_abi/TestTrivialABI.py (1691 of 1893) PASS: lldb-shell :: BuildScript/modes.test (1692 of 1893) PASS: lldb-api :: functionalities/inferior-crashing/recursive-inferior/TestRecursiveInferiorStep.py (1693 of 1893) PASS: lldb-shell :: Expr/TestMultilineExpr.test (1694 of 1893) PASS: lldb-shell :: Settings/TestFrameFormatNoColor.test (1695 of 1893) PASS: lldb-api :: functionalities/data-formatter/data-formatter-synthtype/TestDataFormatterSynthType.py (1696 of 1893) PASS: lldb-shell :: Reproducer/TestMultipleTargets.test (1697 of 1893) PASS: lldb-unit :: Utility/./UtilityTests/StringListTest.SplitIntoLinesSingleTrailingCR (1698 of 1893) PASS: lldb-api :: lang/cpp/dynamic-value-same-basename/TestDynamicValueSameBase.py (1699 of 1893) PASS: lldb-unit :: Symbol/./SymbolTests/TestClangASTContext.TestFunctionTemplateConstruction (1700 of 1893) PASS: lldb-unit :: Host/./HostTests/FileSystemTest.EnumerateDirectory (1701 of 1893) PASS: lldb-unit :: Utility/./UtilityTests/ArgsTest.TestUnknownEscape (1702 of 1893) PASS: lldb-api :: lang/c/blocks/TestBlocks.py (1703 of 1893) PASS: lldb-unit :: Utility/./UtilityTests/ArchSpecTest.TestSetTriple (1704 of 1893) PASS: lldb-api :: macosx/find-dsym/bundle-with-dot-in-filename/TestBundleWithDotInFilename.py (1705 of 1893) PASS: lldb-api :: commands/expression/unwind_expression/TestUnwindExpression.py (1706 of 1893) PASS: lldb-unit :: Utility/./UtilityTests/FileSpecTest.CopyByAppendingPathComponent (1707 of 1893) PASS: lldb-unit :: Host/./HostTests/SocketTest.TCPListen0GetPort (1708 of 1893) PASS: lldb-shell :: BuildScript/toolchain-clang.test (1709 of 1893) PASS: lldb-api :: functionalities/wrong_commands/TestWrongCommands.py (1710 of 1893) PASS: lldb-shell :: Reproducer/TestDriverOptions.test (1711 of 1893) UNSUPPORTED: lldb-api :: lang/cpp/printf/TestPrintf.py (1712 of 1893) PASS: lldb-unit :: Utility/./UtilityTests/VMRange.Ordering (1713 of 1893) PASS: lldb-shell :: ScriptInterpreter/Python/crashlog.test (1714 of 1893) PASS: lldb-api :: commands/expression/no-deadlock/TestExprDoesntBlock.py (1715 of 1893) PASS: lldb-api :: python_api/frame/inlines/TestInlinedFrame.py (1716 of 1893) PASS: lldb-shell :: SymbolFile/DWARF/split-dwarf-multiple-cu.ll (1717 of 1893) PASS: lldb-api :: python_api/debugger/TestDebuggerAPI.py (1718 of 1893) PASS: lldb-api :: commands/expression/import-std-module/queue/TestQueue.py (1719 of 1893) PASS: lldb-unit :: Host/./HostTests/MainLoopTest.Signal (1720 of 1893) PASS: lldb-unit :: SymbolFile/DWARF/./SymbolFileDWARFTests/SymbolFileDWARFTests.TestAbbrevOrder1Start1 (1721 of 1893) PASS: lldb-unit :: Utility/./UtilityTests/AnsiTerminal.Basic (1722 of 1893) PASS: lldb-unit :: Symbol/./SymbolTests/TestClangASTContext.TestGetTypeClassTypeOfExpr (1723 of 1893) PASS: lldb-api :: functionalities/data-formatter/data-formatter-stl/libcxx/initializerlist/TestInitializerList.py (1724 of 1893) PASS: lldb-unit :: Utility/./UtilityTests/StreamTest.PutBytesAsRawHex8ToBigEndian (1725 of 1893) UNSUPPORTED: lldb-shell :: Minidump/Windows/arm-fp-unwind.test (1726 of 1893) PASS: lldb-unit :: Utility/./UtilityTests/StringExtractorTest.GetHexBytes_OddPair (1727 of 1893) PASS: lldb-unit :: Utility/./UtilityTests/StreamTest.PutHex16ByteOrderLittle (1728 of 1893) PASS: lldb-shell :: SymbolFile/NativePDB/function-types-classes.cpp (1729 of 1893) PASS: lldb-unit :: Process/minidump/./LLDBMinidumpTests/MinidumpParserTest.GetThreadContext_x86_32 (1730 of 1893) PASS: lldb-api :: functionalities/data-formatter/varscript_formatting/TestDataFormatterVarScriptFormatting.py (1731 of 1893) PASS: lldb-shell :: SymbolFile/DWARF/anon_class_w_and_wo_export_symbols.ll (1732 of 1893) PASS: lldb-shell :: Breakpoint/debug_rnglistx_rlex.test (1733 of 1893) PASS: lldb-shell :: SymbolFile/DWARF/debug-types-basic.test (1734 of 1893) PASS: lldb-shell :: SymbolFile/DWARF/debug_loclists-dwo.s (1735 of 1893) FAIL: lldb-api :: functionalities/data-formatter/data-formatter-objc/TestDataFormatterObjNSException.py (1736 of 1893) ******************** TEST 'lldb-api :: functionalities/data-formatter/data-formatter-objc/TestDataFormatterObjNSException.py' FAILED ******************** lldb version 11.0.99 (http://labmaster3.local/git/llvm-project.git revision c1b13a1b17719aebace1b3be7a6ac7f90b1901a6) clang revision d629525597ebe3533d110ea288c2640f0dc24bf7 llvm revision d629525597ebe3533d110ea288c2640f0dc24bf7 LLDB library dir: /Users/buildslave/jenkins/workspace/lldb-cmake-sanitized/lldb-build/bin LLDB import library dir: /Users/buildslave/jenkins/workspace/lldb-cmake-sanitized/lldb-build/bin libstdcxx tests will not be run because: Don't know how to build with libstdcxx on macosx Skipping following debug info categories: ['dwo'] setting set target.prefer-dynamic-value no-dynamic-values AddressSanitizer report breakpoint hit. Use 'thread info -s' to get extended information about the report. AddressSanitizer report breakpoint hit. Use 'thread info -s' to get extended information about the report. AddressSanitizer report breakpoint hit. Use 'thread info -s' to get extended information about the report.

Hide Details

Session logs for test failures/errors/unexpected successes will go into directory '/Users/buildslave/jenkins/workspace/lldb-cmake-sanitized/test/logs' Command invoked: /Users/buildslave/jenkins/workspace/lldb-cmake-sanitized/llvm-project/lldb/test/API/dotest.py --arch x86_64 -s /Users/buildslave/jenkins/workspace/lldb-cmake-sanitized/lldb-build/lldb-test-traces -S nm -u CXXFLAGS -u CFLAGS --codesign-identity lldb_codesign --server /Users/buildslave/jenkins/workspace/lldb-cmake-sanitized/lldb-build/./bin/debugserver --arch x86_64 --build-dir /Users/buildslave/jenkins/workspace/lldb-cmake-sanitized/lldb-build/lldb-test-build.noindex -s=/Users/buildslave/jenkins/workspace/lldb-cmake-sanitized/test/logs -t --env TERM=vt100 --env LLVM_LIBS_DIR=/Users/buildslave/jenkins/workspace/lldb-cmake-sanitized/lldb-build/./lib --inferior-env ASAN_OPTIONS=detect_stack_use_after_return=1 --inferior-env DYLD_INSERT_LIBRARIES=/Users/buildslave/jenkins/workspace/lldb-cmake-sanitized/host-compiler/lib/clang/11.0.0/lib/darwin/libclang_rt.asan_osx_dynamic.dylib --build-dir /Users/buildslave/jenkins/workspace/lldb-cmake-sanitized/lldb-build/lldb-test-build.noindex --lldb-module-cache-dir /Users/buildslave/jenkins/workspace/lldb-cmake-sanitized/lldb-build/lldb-test-build.noindex/module-cache-lldb/lldb-api --clang-module-cache-dir /Users/buildslave/jenkins/workspace/lldb-cmake-sanitized/lldb-build/lldb-test-build.noindex/module-cache-clang/lldb-api --executable /Users/buildslave/jenkins/workspace/lldb-cmake-sanitized/lldb-build/./bin/lldb --compiler /Users/buildslave/jenkins/workspace/lldb-cmake-sanitized/lldb-build/./bin/clang --dsymutil /Users/buildslave/jenkins/workspace/lldb-cmake-sanitized/lldb-build/./bin/dsymutil --filecheck /Users/buildslave/jenkins/workspace/lldb-cmake-sanitized/lldb-build/./bin/FileCheck /Users/buildslave/jenkins/workspace/lldb-cmake-sanitized/llvm-project/lldb/packages/Python/lldbsuite/test/functionalities/data-formatter/data-formatter-objc -p TestDataFormatterObjNSException.py Change dir to: /Users/buildslave/jenkins/workspace/lldb-cmake-sanitized/llvm-project/lldb/packages/Python/lldbsuite/test/functionalities/data-formatter/data-formatter-objc runCmd: settings set symbols.enable-external-lookup false output:

Hide Details

runCmd: settings set plugin.process.gdb-remote.packet-timeout 60 output:

Hide Details

runCmd: settings set symbols.clang-modules-cache-path "/Users/buildslave/jenkins/workspace/lldb-cmake-sanitized/lldb-build/lldb-test-build.noindex/module-cache-lldb/lldb-api" output:

Hide Details

runCmd: settings set use-color false output:

Hide Details

runCmd: settings set target.env-vars ASAN_OPTIONS=detect_stack_use_after_return=1 DYLD_INSERT_LIBRARIES=/Users/buildslave/jenkins/workspace/lldb-cmake-sanitized/host-compiler/lib/clang/11.0.0/lib/darwin/libclang_rt.asan_osx_dynamic.dylib output:

Hide Details

runCmd: settings set target.env-vars ASAN_OPTIONS=detect_stack_use_after_return=1 DYLD_INSERT_LIBRARIES=/Users/buildslave/jenkins/workspace/lldb-cmake-sanitized/host-compiler/lib/clang/11.0.0/lib/darwin/libclang_rt.asan_osx_dynamic.dylib output:

Hide Details

FAIL: LLDB (/Users/buildslave/jenkins/workspace/lldb-cmake-sanitized/lldb-build/bin/clang-10-x86_64) :: test_nsexception_with_run_command_dsym (TestDataFormatterObjNSException.ObjCDataFormatterNSException) <bound method SBProcess.Kill of <lldb.SBProcess; proxy of <Swig Object of type 'lldb::SBProcess *' at 0x125e3f210> >>: success

Hide Details

runCmd: settings set symbols.enable-external-lookup false output:

Hide Details

runCmd: settings set plugin.process.gdb-remote.packet-timeout 60 output:

Hide Details

runCmd: settings set symbols.clang-modules-cache-path "/Users/buildslave/jenkins/workspace/lldb-cmake-sanitized/lldb-build/lldb-test-build.noindex/module-cache-lldb/lldb-api" output:

Hide Details

runCmd: settings set use-color false output:

Hide Details

runCmd: settings set target.env-vars ASAN_OPTIONS=detect_stack_use_after_return=1 DYLD_INSERT_LIBRARIES=/Users/buildslave/jenkins/workspace/lldb-cmake-sanitized/host-compiler/lib/clang/11.0.0/lib/darwin/libclang_rt.asan_osx_dynamic.dylib output:

Hide Details

runCmd: settings set target.env-vars ASAN_OPTIONS=detect_stack_use_after_return=1 DYLD_INSERT_LIBRARIES=/Users/buildslave/jenkins/workspace/lldb-cmake-sanitized/host-compiler/lib/clang/11.0.0/lib/darwin/libclang_rt.asan_osx_dynamic.dylib output:

Hide Details

FAIL: LLDB (/Users/buildslave/jenkins/workspace/lldb-cmake-sanitized/lldb-build/bin/clang-10-x86_64) :: test_nsexception_with_run_command_dwarf (TestDataFormatterObjNSException.ObjCDataFormatterNSException) <bound method SBProcess.Kill of <lldb.SBProcess; proxy of <Swig Object of type 'lldb::SBProcess *' at 0x10f80a630> >>: success

Hide Details

UNSUPPORTED: LLDB (/Users/buildslave/jenkins/workspace/lldb-cmake-sanitized/lldb-build/bin/clang-10-x86_64) :: test_nsexception_with_run_command_dwo (TestDataFormatterObjNSException.ObjCDataFormatterNSException) (test case does not fall in any category of interest for this run) runCmd: settings set symbols.enable-external-lookup false output:

Hide Details

runCmd: settings set plugin.process.gdb-remote.packet-timeout 60 output:

Hide Details

runCmd: settings set symbols.clang-modules-cache-path "/Users/buildslave/jenkins/workspace/lldb-cmake-sanitized/lldb-build/lldb-test-build.noindex/module-cache-lldb/lldb-api" output:

Hide Details

runCmd: settings set use-color false output:

Hide Details

runCmd: settings set target.env-vars ASAN_OPTIONS=detect_stack_use_after_return=1 DYLD_INSERT_LIBRARIES=/Users/buildslave/jenkins/workspace/lldb-cmake-sanitized/host-compiler/lib/clang/11.0.0/lib/darwin/libclang_rt.asan_osx_dynamic.dylib output:

Hide Details

runCmd: settings set target.env-vars ASAN_OPTIONS=detect_stack_use_after_return=1 DYLD_INSERT_LIBRARIES=/Users/buildslave/jenkins/workspace/lldb-cmake-sanitized/host-compiler/lib/clang/11.0.0/lib/darwin/libclang_rt.asan_osx_dynamic.dylib output:

Hide Details

FAIL: LLDB (/Users/buildslave/jenkins/workspace/lldb-cmake-sanitized/lldb-build/bin/clang-10-x86_64) :: test_nsexception_with_run_command_gmodules (TestDataFormatterObjNSException.ObjCDataFormatterNSException) <bound method SBProcess.Kill of <lldb.SBProcess; proxy of <Swig Object of type 'lldb::SBProcess *' at 0x125e3f540> >>: success

Hide Details

Restore dir to: /Users/buildslave/jenkins/workspace/lldb-cmake-sanitized/lldb-build/tools/lldb/test ====================================================================== FAIL: test_nsexception_with_run_command_dsym (TestDataFormatterObjNSException.ObjCDataFormatterNSException) Test formatters for NSException. ---------------------------------------------------------------------- Traceback (most recent call last): File "/Users/buildslave/jenkins/workspace/lldb-cmake-sanitized/llvm-project/lldb/packages/Python/lldbsuite/test/lldbtest.py", line 1732, in test_method return attrvalue(self) File "/Users/buildslave/jenkins/workspace/lldb-cmake-sanitized/llvm-project/lldb/packages/Python/lldbsuite/test/functionalities/data-formatter/data-formatter-objc/TestDataFormatterObjNSException.py", line 20, in test_nsexception_with_run_command self.appkit_tester_impl(self.nsexception_data_formatter_commands) File "/Users/buildslave/jenkins/workspace/lldb-cmake-sanitized/llvm-project/lldb/packages/Python/lldbsuite/test/functionalities/data-formatter/data-formatter-objc/ObjCDataFormatterTestCase.py", line 19, in appkit_tester_impl self.appkit_common_data_formatters_command() File "/Users/buildslave/jenkins/workspace/lldb-cmake-sanitized/llvm-project/lldb/packages/Python/lldbsuite/test/functionalities/data-formatter/data-formatter-objc/ObjCDataFormatterTestCase.py", line 26, in appkit_common_data_formatters_command lldb.SBFileSpec('main.m', False)) File "/Users/buildslave/jenkins/workspace/lldb-cmake-sanitized/llvm-project/lldb/packages/Python/lldbsuite/test/lldbutil.py", line 868, in run_to_source_breakpoint only_one_thread, extra_images) File "/Users/buildslave/jenkins/workspace/lldb-cmake-sanitized/llvm-project/lldb/packages/Python/lldbsuite/test/lldbutil.py", line 797, in run_to_breakpoint_do_run test.assertEqual(num_threads, 1, "Expected 1 thread to stop at breakpoint, %d did."%(num_threads)) AssertionError: 0 != 1 : Expected 1 thread to stop at breakpoint, 0 did. Config=x86_64-/Users/buildslave/jenkins/workspace/lldb-cmake-sanitized/lldb-build/bin/clang-10 ====================================================================== FAIL: test_nsexception_with_run_command_dwarf (TestDataFormatterObjNSException.ObjCDataFormatterNSException) Test formatters for NSException. ---------------------------------------------------------------------- Traceback (most recent call last): File "/Users/buildslave/jenkins/workspace/lldb-cmake-sanitized/llvm-project/lldb/packages/Python/lldbsuite/test/lldbtest.py", line 1732, in test_method return attrvalue(self) File "/Users/buildslave/jenkins/workspace/lldb-cmake-sanitized/llvm-project/lldb/packages/Python/lldbsuite/test/functionalities/data-formatter/data-formatter-objc/TestDataFormatterObjNSException.py", line 20, in test_nsexception_with_run_command self.appkit_tester_impl(self.nsexception_data_formatter_commands) File "/Users/buildslave/jenkins/workspace/lldb-cmake-sanitized/llvm-project/lldb/packages/Python/lldbsuite/test/functionalities/data-formatter/data-formatter-objc/ObjCDataFormatterTestCase.py", line 19, in appkit_tester_impl self.appkit_common_data_formatters_command() File "/Users/buildslave/jenkins/workspace/lldb-cmake-sanitized/llvm-project/lldb/packages/Python/lldbsuite/test/functionalities/data-formatter/data-formatter-objc/ObjCDataFormatterTestCase.py", line 26, in appkit_common_data_formatters_command lldb.SBFileSpec('main.m', False)) File "/Users/buildslave/jenkins/workspace/lldb-cmake-sanitized/llvm-project/lldb/packages/Python/lldbsuite/test/lldbutil.py", line 868, in run_to_source_breakpoint only_one_thread, extra_images) File "/Users/buildslave/jenkins/workspace/lldb-cmake-sanitized/llvm-project/lldb/packages/Python/lldbsuite/test/lldbutil.py", line 797, in run_to_breakpoint_do_run test.assertEqual(num_threads, 1, "Expected 1 thread to stop at breakpoint, %d did."%(num_threads)) AssertionError: 0 != 1 : Expected 1 thread to stop at breakpoint, 0 did. Config=x86_64-/Users/buildslave/jenkins/workspace/lldb-cmake-sanitized/lldb-build/bin/clang-10 ====================================================================== FAIL: test_nsexception_with_run_command_gmodules (TestDataFormatterObjNSException.ObjCDataFormatterNSException) Test formatters for NSException. ---------------------------------------------------------------------- Traceback (most recent call last): File "/Users/buildslave/jenkins/workspace/lldb-cmake-sanitized/llvm-project/lldb/packages/Python/lldbsuite/test/lldbtest.py", line 1732, in test_method return attrvalue(self) File "/Users/buildslave/jenkins/workspace/lldb-cmake-sanitized/llvm-project/lldb/packages/Python/lldbsuite/test/functionalities/data-formatter/data-formatter-objc/TestDataFormatterObjNSException.py", line 20, in test_nsexception_with_run_command self.appkit_tester_impl(self.nsexception_data_formatter_commands) File "/Users/buildslave/jenkins/workspace/lldb-cmake-sanitized/llvm-project/lldb/packages/Python/lldbsuite/test/functionalities/data-formatter/data-formatter-objc/ObjCDataFormatterTestCase.py", line 19, in appkit_tester_impl self.appkit_common_data_formatters_command() File "/Users/buildslave/jenkins/workspace/lldb-cmake-sanitized/llvm-project/lldb/packages/Python/lldbsuite/test/functionalities/data-formatter/data-formatter-objc/ObjCDataFormatterTestCase.py", line 26, in appkit_common_data_formatters_command lldb.SBFileSpec('main.m', False)) File "/Users/buildslave/jenkins/workspace/lldb-cmake-sanitized/llvm-project/lldb/packages/Python/lldbsuite/test/lldbutil.py", line 868, in run_to_source_breakpoint only_one_thread, extra_images) File "/Users/buildslave/jenkins/workspace/lldb-cmake-sanitized/llvm-project/lldb/packages/Python/lldbsuite/test/lldbutil.py", line 797, in run_to_breakpoint_do_run test.assertEqual(num_threads, 1, "Expected 1 thread to stop at breakpoint, %d did."%(num_threads)) AssertionError: 0 != 1 : Expected 1 thread to stop at breakpoint, 0 did. Config=x86_64-/Users/buildslave/jenkins/workspace/lldb-cmake-sanitized/lldb-build/bin/clang-10 ---------------------------------------------------------------------- Ran 4 tests in 84.389s

Hide Details

RESULT: FAILED (0 passes, 3 failures, 0 errors, 1 skipped, 0 expected failures, 0 unexpected successes)

Hide Details

******************** UNSUPPORTED: lldb-shell :: SymbolFile/PDB/calling-conventions.test (1737 of 1893) PASS: lldb-api :: lang/c/modules/TestCModules.py (1738 of 1893) PASS: lldb-api :: commands/command/script_alias/TestCommandScriptAlias.py (1739 of 1893) PASS: lldb-api :: lang/cpp/accelerator-table/TestCPPAccelerator.py (1740 of 1893) PASS: lldb-unit :: Utility/./UtilityTests/FileSpecTest.Equal (1741 of 1893) PASS: lldb-api :: functionalities/pre_run_dylibs/TestPreRunDylibs.py (1742 of 1893) PASS: lldb-unit :: Utility/./UtilityTests/Flags.Clear (1743 of 1893) PASS: lldb-shell :: SymbolFile/NativePDB/function-types-builtins.cpp (1744 of 1893) UNSUPPORTED: lldb-api :: lang/objc/bitfield_ivars/TestBitfieldIvars.py (1745 of 1893) PASS: lldb-unit :: Utility/./UtilityTests/EventTest.DumpEventDataBytes (1746 of 1893) UNSUPPORTED: lldb-api :: linux/mix-dwo-and-regular-objects/TestMixedDwarfBinary.py (1747 of 1893) PASS: lldb-shell :: Settings/TestFrameFormatColor.test (1748 of 1893) PASS: lldb-shell :: Commands/command-regex-unalias.test (1749 of 1893) PASS: lldb-api :: functionalities/step-avoids-no-debug/TestStepNoDebug.py (1750 of 1893) PASS: lldb-unit :: Utility/./UtilityTests/StreamTest.PutStringAsRawHex8 (1751 of 1893) PASS: lldb-unit :: Expression/./ExpressionTests/CppModuleConfigurationTest.Linux (1752 of 1893) PASS: lldb-api :: lang/cpp/extern_c/TestExternCSymbols.py (1753 of 1893) PASS: lldb-api :: lang/objc/objc-static-method-stripped/TestObjCStaticMethodStripped.py (1754 of 1893) PASS: lldb-api :: commands/frame/recognizer/TestFrameRecognizer.py (1755 of 1893) PASS: lldb-shell :: ObjectFile/ELF/minidebuginfo-corrupt-xz.yaml (1756 of 1893) PASS: lldb-api :: functionalities/thread/concurrent_events/TestConcurrentDelayedCrashWithBreakpointWatchpoint.py (1757 of 1893) PASS: lldb-shell :: SymbolFile/DWARF/debug-types-signature-loop.s (1758 of 1893) PASS: lldb-api :: functionalities/thread/exit_during_step/TestExitDuringStep.py (1759 of 1893) PASS: lldb-api :: functionalities/inferior-crashing/recursive-inferior/TestRecursiveInferior.py (1760 of 1893) PASS: lldb-unit :: Utility/./UtilityTests/ArgsTest.ReplaceArgumentAtIndexOutOfRange (1761 of 1893) PASS: lldb-api :: tools/lldb-server/TestGdbRemoteHostInfo.py (1762 of 1893) PASS: lldb-unit :: Utility/./UtilityTests/StreamTest.PutHex16ByteOrderBig (1763 of 1893) PASS: lldb-unit :: Utility/./UtilityTests/StringListTest.AppendList (1764 of 1893) PASS: lldb-api :: lang/cpp/static_methods/TestCPPStaticMethods.py (1765 of 1893) PASS: lldb-api :: commands/disassemble/basic/TestFrameDisassemble.py (1766 of 1893) PASS: lldb-api :: commands/watchpoints/watchpoint_commands/condition/TestWatchpointConditionCmd.py (1767 of 1893) PASS: lldb-api :: commands/expression/timeout/TestCallWithTimeout.py (1768 of 1893) PASS: lldb-unit :: Utility/./UtilityTests/StringLexerTest.NextIf (1769 of 1893) PASS: lldb-api :: lang/cpp/this/TestCPPThis.py (1770 of 1893) PASS: lldb-shell :: Reproducer/TestFileRepro.test (1771 of 1893) PASS: lldb-api :: python_api/objc_type/TestObjCType.py (1772 of 1893) PASS: lldb-api :: functionalities/gdb_remote_client/TestPlatformClient.py (1773 of 1893) PASS: lldb-api :: commands/expression/weak_symbols/TestWeakSymbols.py (1774 of 1893) PASS: lldb-unit :: Utility/./UtilityTests/StringExtractorTest.InitMisc (1775 of 1893) PASS: lldb-api :: lang/objc/objc-class-method/TestObjCClassMethod.py (1776 of 1893) PASS: lldb-api :: lang/objc/objc-super/TestObjCSuper.py (1777 of 1893) PASS: lldb-api :: commands/expression/import-std-module/empty-module/TestEmptyStdModule.py (1778 of 1893) PASS: lldb-api :: tools/lldb-server/TestGdbRemoteThreadsInStopReply.py (1779 of 1893) PASS: lldb-unit :: Expression/./ExpressionTests/DiagnosticManagerTest.PutString (1780 of 1893) PASS: lldb-shell :: Settings/TestEchoCommands.test (1781 of 1893) UNSUPPORTED: lldb-shell :: ScriptInterpreter/Lua/lua.test (1782 of 1893) PASS: lldb-shell :: Settings/TestFrameFormatMangling.test (1783 of 1893) PASS: lldb-shell :: ObjectFile/PECOFF/basic-info-arm.yaml (1784 of 1893) PASS: lldb-api :: functionalities/object-file/TestImageListMultiArchitecture.py (1785 of 1893) PASS: lldb-unit :: UnwindAssembly/x86/./UnwindAssemblyx86Tests/Testx86AssemblyInspectionEngine.TestSubESP (1786 of 1893) UNSUPPORTED: lldb-shell :: SymbolFile/PDB/variables.test (1787 of 1893) PASS: lldb-unit :: Utility/./UtilityTests/StreamTeeTest.AppendStream (1788 of 1893) PASS: lldb-unit :: ScriptInterpreter/Python/./ScriptInterpreterPythonTests/PythonDataObjectsTest.TestPythonTupleInitializerList (1789 of 1893) PASS: lldb-api :: sample_test/TestSampleInlineTest.py (1790 of 1893) PASS: lldb-unit :: Symbol/./SymbolTests/PostfixExpression.ParseFPOProgram (1791 of 1893) PASS: lldb-unit :: Utility/./UtilityTests/RangeDataVector.CustomSort (1792 of 1893) PASS: lldb-unit :: Symbol/./SymbolTests/TestClangASTImporter.DeportDeclTagDecl (1793 of 1893) PASS: lldb-api :: functionalities/breakpoint/breakpoint_options/TestBreakpointOptions.py (1794 of 1893) PASS: lldb-api :: api/multiple-targets/TestMultipleTargets.py (1795 of 1893) PASS: lldb-api :: functionalities/data-formatter/dump_dynamic/TestDumpDynamic.py (1796 of 1893) PASS: lldb-unit :: Utility/./UtilityTests/TimeoutTest.Construction (1797 of 1893) UNSUPPORTED: lldb-api :: commands/expression/multiline-completion/TestMultilineCompletion.py (1798 of 1893) PASS: lldb-unit :: Utility/./UtilityTests/ArgsTest.TestTrailingBackslash (1799 of 1893) PASS: lldb-unit :: Utility/./UtilityTests/SubsystemRAIITest.SubsystemWithErrorFailure (1800 of 1893) PASS: lldb-shell :: Host/TestCustomShell.test (1801 of 1893) PASS: lldb-api :: api/command-return-object/TestSBCommandReturnObject.py (1802 of 1893) PASS: lldb-api :: lang/c/local_variables/TestLocalVariables.py (1803 of 1893) PASS: lldb-unit :: Utility/./UtilityTests/OptionsWithRawTest.QuotedSuffix (1804 of 1893) PASS: lldb-api :: functionalities/gdb_remote_client/TestWriteMemory.py (1805 of 1893) PASS: lldb-unit :: ScriptInterpreter/Python/./ScriptInterpreterPythonTests/PythonDataObjectsTest.TestPythonIntegerToStructuredInteger (1806 of 1893) PASS: lldb-api :: commands/help/TestHelp.py (1807 of 1893) PASS: lldb-unit :: Utility/./UtilityTests/BinaryStreamTest.PutULEB128FourBytes (1808 of 1893) PASS: lldb-api :: python_api/function_symbol/TestDisasmAPI.py (1809 of 1893) PASS: lldb-api :: functionalities/data-formatter/data-formatter-stl/libstdcpp/unique_ptr/invalid/TestDataFormatterInvalidStdUniquePtr.py (1810 of 1893) PASS: lldb-api :: lang/objc/rdar-11355592/TestRdar11355592.py (1811 of 1893) PASS: lldb-unit :: UnwindAssembly/x86/./UnwindAssemblyx86Tests/Testx86AssemblyInspectionEngine.TestSpArithx86_64Augmented (1812 of 1893) PASS: lldb-unit :: Utility/./UtilityTests/FileSpecTest.FormatFileSpec (1813 of 1893) PASS: lldb-unit :: Utility/./UtilityTests/DataExtractorTest.GetCStrEmpty (1814 of 1893) PASS: lldb-api :: lang/objc/objc-property/TestObjCProperty.py (1815 of 1893) PASS: lldb-api :: lang/c/global_variables/TestGlobalVariables.py (1816 of 1893) PASS: lldb-api :: commands/expression/persistent_types/TestNestedPersistentTypes.py (1817 of 1893) PASS: lldb-api :: commands/command/script/import/rdar-12586188/TestRdar12586188.py (1818 of 1893) PASS: lldb-unit :: Utility/./UtilityTests/FileSpecTest.EqualDotsWindows (1819 of 1893) PASS: lldb-unit :: Utility/./UtilityTests/StreamTest.PutPtr (1820 of 1893) PASS: lldb-unit :: SymbolFile/NativePDB/./SymbolFileNativePDBTests/PDBFPOProgramToDWARFExpressionTests.InvalidOpUnary (1821 of 1893) UNSUPPORTED: lldb-shell :: SymbolFile/NativePDB/local-variables.cpp (1822 of 1893) PASS: lldb-api :: tools/lldb-server/commandline/TestStubReverseConnect.py (1823 of 1893) PASS: lldb-unit :: Host/./HostTests/MainLoopTest.TerminatesImmediately (1824 of 1893) PASS: lldb-unit :: Utility/./UtilityTests/UriParserTest.SchemeHostSeparator4 (1825 of 1893) PASS: lldb-unit :: Language/Highlighting/./HighlighterTests/HighlighterTest.ClangCursorPosInOtherToken (1826 of 1893) PASS: lldb-unit :: Utility/./UtilityTests/StringListTest.JoinNonSpace (1827 of 1893) PASS: lldb-shell :: ObjectFile/PECOFF/invalid-export-table.yaml (1828 of 1893) PASS: lldb-unit :: ObjectFile/Breakpad/./ObjectFileBreakpadTests/StackWinRecord.parse (1829 of 1893) PASS: lldb-unit :: UnwindAssembly/x86/./UnwindAssemblyx86Tests/Testx86AssemblyInspectionEngine.TestPushESI (1830 of 1893) UNSUPPORTED: lldb-shell :: SymbolFile/PDB/pointers.test (1831 of 1893) PASS: lldb-shell :: Quit/TestQuitExitCodeHexA.test (1832 of 1893) PASS: lldb-unit :: Utility/./UtilityTests/VMRange.Comparison (1833 of 1893) PASS: lldb-api :: lang/c/enum_types/TestEnumTypes.py (1834 of 1893) PASS: lldb-shell :: ObjectFile/ELF/gnu-debuglink.yaml (1835 of 1893) PASS: lldb-shell :: ObjectFile/PECOFF/basic-info-arm64.yaml (1836 of 1893) UNSUPPORTED: lldb-api :: functionalities/data-formatter/data-formatter-stl/libstdcpp/smart_ptr/TestDataFormatterStdSmartPtr.py (1837 of 1893) PASS: lldb-unit :: ScriptInterpreter/Python/./ScriptInterpreterPythonTests/PythonDataObjectsTest.TestPythonIntegerToStr (1838 of 1893) PASS: lldb-shell :: SymbolFile/DWARF/dwarf5-debug_line.s (1839 of 1893) PASS: lldb-unit :: Process/minidump/./LLDBMinidumpTests/MinidumpParserTest.GetMemoryRegionInfo (1840 of 1893) PASS: lldb-unit :: Utility/./UtilityTests/ArgsTest.EscapeLLDBCommandArgument (1841 of 1893) PASS: lldb-unit :: Symbol/./SymbolTests/TestClangASTContext.TestConvertAccessTypeToAccessSpecifier (1842 of 1893) PASS: lldb-unit :: Utility/./UtilityTests/RangeTest.LessThan (1843 of 1893) PASS: lldb-shell :: Breakpoint/debug_rnglist_offset_pair.test (1844 of 1893) PASS: lldb-unit :: Host/./HostTests/SocketTest.DomainGetConnectURI (1845 of 1893) PASS: lldb-unit :: Platform/./LLDBPlatformTests/PlatformDarwinTest.TestParseVersionBuildDir (1846 of 1893) PASS: lldb-unit :: Process/gdb-remote/./ProcessGdbRemoteTests/GDBRemoteClientBaseTest.SendContinueAndWait (1847 of 1893) PASS: lldb-api :: python_api/value/linked_list/TestValueAPILinkedList.py (1848 of 1893) PASS: lldb-unit :: Process/minidump/./LLDBMinidumpTests/MinidumpParserTest.GetPidWindows (1849 of 1893) PASS: lldb-unit :: Utility/./UtilityTests/FileSpecTest.IsRelative (1850 of 1893) PASS: lldb-api :: lang/cpp/const_this/TestConstThis.py (1851 of 1893) PASS: lldb-api :: python_api/lldbutil/TestSwigVersion.py (1852 of 1893) PASS: lldb-api :: lang/cpp/class_types/TestClassTypes.py (1853 of 1893) PASS: lldb-shell :: Breakpoint/split-dwarf5-debug-stroffsets.test (1854 of 1893) PASS: lldb-api :: lang/objc/objc-builtin-types/TestObjCBuiltinTypes.py (1855 of 1893) PASS: lldb-unit :: UnwindAssembly/x86/./UnwindAssemblyx86Tests/Testx86AssemblyInspectionEngine.TestPushRBX (1856 of 1893) PASS: lldb-unit :: ScriptInterpreter/Python/./ScriptInterpreterPythonTests/PythonDataObjectsTest.TestPythonTupleValues (1857 of 1893) PASS: lldb-shell :: SymbolFile/DWARF/debug_ranges-missing-section.s (1858 of 1893) PASS: lldb-unit :: Language/Highlighting/./HighlighterTests/HighlighterTest.FallbackHighlighter (1859 of 1893) PASS: lldb-api :: types/TestFloatTypes.py (1860 of 1893) PASS: lldb-unit :: Utility/./UtilityTests/StringExtractorTest.GetHexBytesAvail_FullString (1861 of 1893) PASS: lldb-shell :: Minidump/memory-region-from-module.yaml (1862 of 1893) UNSUPPORTED: lldb-shell :: SymbolFile/PDB/ast-restore.test (1863 of 1893) PASS: lldb-unit :: Utility/./UtilityTests/StringListTest.AppendStringStdString (1864 of 1893) UNSUPPORTED: lldb-shell :: ScriptInterpreter/Lua/command_script_import.test (1865 of 1893) PASS: lldb-api :: types/TestRecursiveTypes.py (1866 of 1893) PASS: lldb-api :: functionalities/thread/concurrent_events/TestConcurrentManyBreakpoints.py (1867 of 1893) PASS: lldb-api :: lang/objc/objc-checker/TestObjCCheckers.py (1868 of 1893) PASS: lldb-api :: functionalities/breakpoint/breakpoint_command/TestBreakpointCommandsFromPython.py (1869 of 1893) PASS: lldb-unit :: Utility/./UtilityTests/StringExtractorTest.DecodeHexU8_Extra (1870 of 1893) PASS: lldb-unit :: Core/./LLDBCoreTests/MangledTest.EmptyForInvalidName (1871 of 1893) UNSUPPORTED: lldb-shell :: Register/x86-64-zmm-read.test (1872 of 1893) PASS: lldb-api :: commands/expression/xvalue/TestXValuePrinting.py (1873 of 1893) PASS: lldb-api :: lang/c/anonymous/TestAnonymous.py (1874 of 1893) PASS: lldb-unit :: Host/./HostTests/FileSystemTest.Resolve (1875 of 1893) PASS: lldb-api :: commands/apropos/with-process/TestAproposWithProcess.py (1876 of 1893) PASS: lldb-unit :: Utility/./UtilityTests/StringExtractorTest.DecodeHexU8_Underflow2 (1877 of 1893) PASS: lldb-api :: commands/expression/pr35310/TestExprsBug35310.py (1878 of 1893) PASS: lldb-unit :: Symbol/./SymbolTests/LineEntryTest.GetSameLineContiguousAddressRangeOneInline (1879 of 1893) PASS: lldb-api :: api/log/TestAPILog.py (1880 of 1893) PASS: lldb-api :: functionalities/thread/concurrent_events/TestConcurrentCrashWithBreak.py (1881 of 1893) PASS: lldb-api :: commands/expression/persistent_types/TestPersistentTypes.py (1882 of 1893) PASS: lldb-api :: lang/objc/radar-9691614/TestObjCMethodReturningBOOL.py (1883 of 1893) PASS: lldb-api :: lang/cpp/chained-calls/TestCppChainedCalls.py (1884 of 1893) PASS: lldb-api :: functionalities/conditional_break/TestConditionalBreak.py (1885 of 1893) PASS: lldb-api :: functionalities/inferior-assert/TestInferiorAssert.py (1886 of 1893) PASS: lldb-api :: python_api/lldbutil/iter/TestRegistersIterator.py (1887 of 1893) PASS: lldb-api :: functionalities/data-formatter/data-formatter-stl/libcxx/string/TestDataFormatterLibcxxString.py (1888 of 1893) PASS: lldb-api :: commands/expression/import-std-module/vector-dbg-info-content/TestDbgInfoContentVector.py (1889 of 1893) PASS: lldb-api :: lang/objc/modules/TestObjCModules.py (1890 of 1893) PASS: lldb-api :: python_api/target/TestTargetAPI.py (1891 of 1893) PASS: lldb-api :: lang/objc/foundation/TestObjCMethodsString.py (1892 of 1893) PASS: lldb-api :: tools/lldb-server/TestGdbRemote_qThreadStopInfo.py (1893 of 1893)

Hide Details

Testing Time: 3463.45s ******************** Failing Tests (13): lldb-api :: functionalities/data-formatter/data-formatter-objc/TestDataFormatterObjCKVO.py lldb-api :: functionalities/data-formatter/data-formatter-objc/TestDataFormatterObjCNSContainer.py lldb-api :: functionalities/data-formatter/data-formatter-objc/TestDataFormatterObjCNSURL.py lldb-api :: tools/lldb-server/TestLldbGdbServer.py lldb-api :: functionalities/data-formatter/data-formatter-objc/TestDataFormatterObjCExpr.py lldb-api :: functionalities/data-formatter/data-formatter-objc/TestDataFormatterObjCNSData.py lldb-api :: functionalities/data-formatter/data-formatter-objc/TestDataFormatterObjCNSBundle.py lldb-api :: functionalities/data-formatter/data-formatter-objc/TestDataFormatterObjCPlain.py lldb-api :: functionalities/data-formatter/data-formatter-objc/TestDataFormatterObjCNSDate.py lldb-api :: functionalities/data-formatter/data-formatter-objc/TestDataFormatterObjCNSError.py lldb-api :: functionalities/data-formatter/data-formatter-objc/TestDataFormatterObjCCF.py lldb-api :: functionalities/thread/step_out/TestThreadStepOut.py lldb-api :: functionalities/data-formatter/data-formatter-objc/TestDataFormatterObjNSException.py

Hide Details

Hide Details

Slowest Tests: -------------------------------------------------------------------------- 251.72s: lldb-api :: lang/objc/foundation/TestObjCMethodsNSError.py 252.17s: lldb-api :: lang/c/anonymous/TestAnonymous.py 259.39s: lldb-api :: lang/objc/objc-new-syntax/TestObjCNewSyntaxDictionary.py 271.59s: lldb-api :: commands/target/basic/TestTargetCommand.py 274.35s: lldb-api :: lang/cpp/namespace/TestNamespace.py 286.17s: lldb-api :: lang/objc/exceptions/TestObjCExceptions.py 293.58s: lldb-api :: types/TestIntegerTypeExpr.py 297.48s: lldb-api :: lang/objc/real-definition/TestRealDefinition.py 302.94s: lldb-api :: functionalities/inferior-crashing/TestInferiorCrashingStep.py 335.42s: lldb-api :: tools/lldb-server/TestGdbRemoteThreadsInStopReply.py 336.04s: lldb-api :: lang/objc/objc-new-syntax/TestObjCNewSyntaxLiteral.py 390.23s: lldb-api :: functionalities/return-value/TestReturnValue.py 405.98s: lldb-api :: types/TestLongTypes.py 453.54s: lldb-api :: lang/objc/foundation/TestObjCMethods.py 483.51s: lldb-api :: api/multithreaded/TestMultithreaded.py 489.05s: lldb-api :: types/TestLongTypesExpr.py 514.28s: lldb-api :: lang/objc/hidden-ivars/TestHiddenIvars.py 569.75s: lldb-api :: lang/cpp/namespace/TestNamespaceLookup.py 674.24s: lldb-api :: lang/cpp/enum_types/TestCPP11EnumTypes.py 753.68s: lldb-api :: tools/lldb-server/TestLldbGdbServer.py

Hide Details

Tests Times: -------------------------------------------------------------------------- [ Range ] :: [ Percentage ] :: [ Count ] -------------------------------------------------------------------------- [ 0s, 50s) :: [******************************** ] :: [1515/1893] [ 50s,100s) :: [**** ] :: [ 231/1893] [100s,150s) :: [* ] :: [ 82/1893] [150s,200s) :: [ ] :: [ 33/1893] [200s,250s) :: [ ] :: [ 9/1893] [250s,300s) :: [ ] :: [ 8/1893] [300s,350s) :: [ ] :: [ 4/1893] [350s,400s) :: [ ] :: [ 2/1893] [400s,450s) :: [ ] :: [ 2/1893] [450s,500s) :: [ ] :: [ 1/1893] [500s,550s) :: [ ] :: [ 3/1893] [550s,600s) :: [ ] :: [ 0/1893] [600s,650s) :: [ ] :: [ 1/1893] [650s,700s) :: [ ] :: [ 0/1893] [700s,750s) :: [ ] :: [ 1/1893] [750s,800s) :: [ ] :: [ 1/1893] Expected Passes : 1712 Expected Failures : 6 Unsupported Tests : 162 Unexpected Failures: 13 FAILED: tools/lldb/test/CMakeFiles/check-lldb-lit cd /Users/buildslave/jenkins/workspace/lldb-cmake-sanitized/lldb-build/tools/lldb/test && /usr/local/bin/python /Users/buildslave/jenkins/workspace/lldb-cmake-sanitized/lldb-build/./bin/llvm-lit -v --time-tests --shuffle --xunit-xml-output=/Users/buildslave/jenkins/workspace/lldb-cmake-sanitized/test/results.xml -v --timeout 1200 /Users/buildslave/jenkins/workspace/lldb-cmake-sanitized/lldb-build/tools/lldb/test ninja: build stopped: subcommand failed. Command failed: Command '['/usr/bin/env', 'TERM=vt100', '/usr/local/bin/ninja', '-v', 'check-lldb']' returned non-zero exit status 1. Command: ['/usr/bin/env', 'TERM=vt100', '/usr/local/bin/ninja', '-v', 'check-lldb'] [Pipeline] } [Pipeline] // timeout [Pipeline] } [Pipeline] // stage [Pipeline] stage [Pipeline] { (Declarative: Post Actions) [Pipeline] scanForIssues No credentials specified [Clang (LLVM based)] Sleeping for 5 seconds due to JENKINS-32191... [Clang (LLVM based)] Parsing console log (workspace: '/Users/buildslave/jenkins/workspace/lldb-cmake-sanitized') [Pipeline] junit Recording test results [Pipeline] } [Pipeline] // stage [Pipeline] } [Pipeline] // withEnv [Pipeline] } [Pipeline] // node [Pipeline] End of Pipeline ERROR: script returned exit code 1 Finished: FAILURE