Console Output

Skipping 14,255 KB.. Full Log
PASS: LLVM-Unit :: Support/./SupportTests/Error.Stream (72619 of 74057)
PASS: LLVM-Unit :: Support/./SupportTests/ErrorOr.Comparison (72620 of 74057)
PASS: LLVM-Unit :: Support/./SupportTests/Error.createStringError (72621 of 74057)
PASS: LLVM-Unit :: Support/./SupportTests/ErrorOr.Covariant (72622 of 74057)
PASS: LLVM-Unit :: Support/./SupportTests/ErrorOr.ImplicitConversionCausesMove (72623 of 74057)
PASS: LLVM-Unit :: Support/./SupportTests/ExtensibleRTTI.isa (72624 of 74057)
PASS: LLVM-Unit :: Support/./SupportTests/ErrorOr.ImplicitConversionNoAmbiguity (72625 of 74057)
PASS: LLVM-Unit :: Support/./SupportTests/ErrorOr.ImplicitConversion (72626 of 74057)
PASS: LLVM-Unit :: Support/./SupportTests/ErrorOr.SimpleValue (72627 of 74057)
PASS: LLVM-Unit :: Support/./SupportTests/ExtensibleRTTI.cast (72628 of 74057)
PASS: LLVM-Unit :: Support/./SupportTests/ExtensibleRTTI.dyn_cast (72629 of 74057)
PASS: LLVM-Unit :: Support/./SupportTests/ErrorOr.Types (72630 of 74057)
PASS: LLVM-Unit :: Support/./SupportTests/FPExceptionsBuildAttr.testBuildAttr (72631 of 74057)
PASS: LLVM-Unit :: Support/./SupportTests/FPArchBuildAttr.testBuildAttr (72632 of 74057)
PASS: LLVM-Unit :: Support/./SupportTests/FP16BuildAttr.testBuildAttr (72633 of 74057)
PASS: LLVM-Unit :: Support/./SupportTests/FPNumberModelBuildAttr.testBuildAttr (72634 of 74057)
PASS: LLVM-Unit :: Support/./SupportTests/FPRoundingBuildAttr.testBuildAttr (72635 of 74057)
PASS: LLVM-Unit :: Support/./SupportTests/FPDenormalBuildAttr.testBuildAttr (72636 of 74057)
PASS: LLVM-Unit :: Support/./SupportTests/FPUserExceptionsBuildAttr.testBuildAttr (72637 of 74057)
PASS: LLVM-Unit :: Support/./SupportTests/FPHPBuildAttr.testBuildAttr (72638 of 74057)
PASS: LLVM-Unit :: Support/./SupportTests/FSUniqueIDTest.construct (72639 of 74057)
PASS: LLVM-Unit :: Support/./SupportTests/FSUniqueIDTest.less (72640 of 74057)
PASS: LLVM-Unit :: Support/./SupportTests/FSUniqueIDTest.equals (72641 of 74057)
PASS: LLVM-Unit :: Support/./SupportTests/FileCollectorTest.addFile (72642 of 74057)
PASS: LLVM-Unit :: Support/./SupportTests/FileCollectorTest.addDirectory (72643 of 74057)
PASS: LLVM-Unit :: Support/./SupportTests/FileCollectorTest.Symlinks (72644 of 74057)
PASS: LLVM-Unit :: Support/./SupportTests/FileCollectorTest.recordAndConstructDirectory (72645 of 74057)
PASS: LLVM-Unit :: Support/./SupportTests/FileSystemTest.CreateNew (72646 of 74057)
PASS: LLVM-Unit :: Support/./SupportTests/FileCollectorTest.recordVFSSymlinkAccesses (72647 of 74057)
PASS: LLVM-Unit :: Support/./SupportTests/FileSystemTest.CreateAlways (72648 of 74057)
PASS: LLVM-Unit :: Support/./SupportTests/FileSystemTest.CreateDir (72649 of 74057)
PASS: LLVM-Unit :: Support/./SupportTests/FileCollectorTest.recordVFSAccesses (72650 of 74057)
PASS: LLVM-Unit :: Support/./SupportTests/FileSystemTest.AppendSetsCorrectFileOffset (72651 of 74057)
PASS: LLVM-Unit :: Support/./SupportTests/FileCollectorTest.copyFiles (72652 of 74057)
PASS: LLVM-Unit :: Support/./SupportTests/FileSystemTest.DirectoryNotExecutable (72653 of 74057)
PASS: LLVM-Unit :: Support/./SupportTests/FileSystemTest.ExpandTilde (72654 of 74057)
PASS: LLVM-Unit :: Support/./SupportTests/FileSystemTest.MD5 (72655 of 74057)
PASS: LLVM-Unit :: Support/./SupportTests/FileSystemTest.BrokenSymlinkDirectoryIteration (72656 of 74057)
PASS: LLVM-Unit :: Support/./SupportTests/FileSystemTest.FileMapping (72657 of 74057)
PASS: LLVM-Unit :: Support/./SupportTests/FileSystemTest.DirectoryIteration (72658 of 74057)
PASS: LLVM-Unit :: Support/./SupportTests/FileSystemTest.OpenAlways (72659 of 74057)
PASS: LLVM-Unit :: Support/./SupportTests/FileOutputBuffer.Test (72660 of 74057)
PASS: LLVM-Unit :: Support/./SupportTests/FileSystemTest.OpenExisting (72661 of 74057)
PASS: LLVM-Unit :: Support/./SupportTests/FileSystemTest.OpenFileForRead (72662 of 74057)
PASS: LLVM-Unit :: Support/./SupportTests/FileSystemTest.ReadOnlyFileCantWrite (72663 of 74057)
PASS: LLVM-Unit :: Support/./SupportTests/FileSystemTest.ReadWriteFileCanReadOrWrite (72664 of 74057)
PASS: LLVM-Unit :: Support/./SupportTests/FileSystemTest.RealPathNoReadPerm (72665 of 74057)
PASS: LLVM-Unit :: Support/./SupportTests/FileSystemTest.RealPath (72666 of 74057)
PASS: LLVM-Unit :: Support/./SupportTests/FileSystemTest.TempFileDiscardDiscard (72667 of 74057)
PASS: LLVM-Unit :: Support/./SupportTests/FileSystemTest.Remove (72668 of 74057)
PASS: LLVM-Unit :: Support/./SupportTests/FileSystemTest.RespectUmask (72669 of 74057)
PASS: LLVM-Unit :: Support/./SupportTests/FileSystemTest.Resize (72670 of 74057)
PASS: LLVM-Unit :: Support/./SupportTests/FileSystemTest.ResizeBeforeMapping (72671 of 74057)
PASS: LLVM-Unit :: Support/./SupportTests/FileSystemTest.Unique (72672 of 74057)
PASS: LLVM-Unit :: Support/./SupportTests/FileSystemTest.WriteOnlyFileCantRead (72673 of 74057)
PASS: LLVM-Unit :: Support/./SupportTests/FileSystemTest.TempFileKeepDiscard (72674 of 74057)
PASS: LLVM-Unit :: Support/./SupportTests/FileSystemTest.TempFiles (72675 of 74057)
PASS: LLVM-Unit :: Support/./SupportTests/FileSystemTest.getUmask (72676 of 74057)
PASS: LLVM-Unit :: Support/./SupportTests/FileSystemTest.readNativeFileSlice (72677 of 74057)
PASS: LLVM-Unit :: Support/./SupportTests/FileSystemTest.set_current_path (72678 of 74057)
PASS: LLVM-Unit :: Support/./SupportTests/FileSystemTest.permissions (72679 of 74057)
PASS: LLVM-Unit :: Support/./SupportTests/FileSystemTest.readNativeFile (72680 of 74057)
PASS: LLVM-Unit :: Support/./SupportTests/FileSystemTest.is_local (72681 of 74057)
PASS: LLVM-Unit :: Support/./SupportTests/FormatVariadicTest.BigTest (72682 of 74057)
PASS: LLVM-Unit :: Support/./SupportTests/FormatVariadicTest.Adapter (72683 of 74057)
PASS: LLVM-Unit :: Support/./SupportTests/FormatVariadicTest.BoolTest (72684 of 74057)
PASS: LLVM-Unit :: Support/./SupportTests/FormatVariadicTest.CharFormatting (72685 of 74057)
PASS: LLVM-Unit :: Support/./SupportTests/FormatVariadicTest.CopiesAndMoves (72686 of 74057)
PASS: LLVM-Unit :: Support/./SupportTests/FormatVariadicTest.CustomPaddingCharacter (72687 of 74057)
PASS: LLVM-Unit :: Support/./SupportTests/FormatVariadicTest.DefaultReplacementValues (72688 of 74057)
PASS: LLVM-Unit :: Support/./SupportTests/FormatVariadicTest.DoubleFormatting (72689 of 74057)
PASS: LLVM-Unit :: Support/./SupportTests/FormatVariadicTest.EscapedBrace (72690 of 74057)
PASS: LLVM-Unit :: Support/./SupportTests/FormatVariadicTest.EmptyFormatString (72691 of 74057)
PASS: LLVM-Unit :: Support/./SupportTests/FileSystemTest.TempFileCollisions (72692 of 74057)
PASS: LLVM-Unit :: Support/./SupportTests/FormatVariadicTest.FormatAdapter (72693 of 74057)
PASS: LLVM-Unit :: Support/./SupportTests/FormatVariadicTest.FormatBasicTypesOneReplacement (72694 of 74057)
PASS: LLVM-Unit :: Support/./SupportTests/FormatVariadicTest.FormatError (72695 of 74057)
PASS: LLVM-Unit :: Support/./SupportTests/FormatVariadicTest.FormatFormatvObject (72696 of 74057)
PASS: LLVM-Unit :: Support/./SupportTests/FormatVariadicTest.FormatNoReplacements (72697 of 74057)
PASS: LLVM-Unit :: Support/./SupportTests/FormatVariadicTest.FormatStreamable (72698 of 74057)
PASS: LLVM-Unit :: Support/./SupportTests/FormatVariadicTest.ImplicitConversions (72699 of 74057)
PASS: LLVM-Unit :: Support/./SupportTests/FormatVariadicTest.MultipleReplacements (72700 of 74057)
PASS: LLVM-Unit :: Support/./SupportTests/FormatVariadicTest.IntegralNumberFormatting (72701 of 74057)
PASS: LLVM-Unit :: Support/./SupportTests/FormatVariadicTest.IntegralHexFormatting (72702 of 74057)
PASS: LLVM-Unit :: Support/./SupportTests/FormatVariadicTest.NoReplacements (72703 of 74057)
PASS: LLVM-Unit :: Support/./SupportTests/FormatVariadicTest.MoveConstructor (72704 of 74057)
PASS: LLVM-Unit :: Support/./SupportTests/FormatVariadicTest.Range (72705 of 74057)
PASS: LLVM-Unit :: Support/./SupportTests/FormatVariadicTest.PointerFormatting (72706 of 74057)
PASS: LLVM-Unit :: Support/./SupportTests/FormatVariadicTest.StringFormatting (72707 of 74057)
PASS: LLVM-Unit :: Support/./SupportTests/FormatVariadicTest.ValidReplacementSequence (72708 of 74057)
PASS: LLVM-Unit :: Support/./SupportTests/GetOptionWidthTest.GetOptionWidthArgNameLonger (72709 of 74057)
PASS: LLVM-Unit :: Support/./SupportTests/GetOptionWidthTest.GetOptionWidthEmptyOptionNameLonger (72710 of 74057)
PASS: LLVM-Unit :: Support/./SupportTests/GetOptionWidthTest.GetOptionWidthFirstOptionNameLonger (72711 of 74057)
PASS: LLVM-Unit :: Support/./SupportTests/GetOptionWidthTest.GetOptionWidthSecondOptionNameLonger (72712 of 74057)
PASS: LLVM-Unit :: Support/./SupportTests/GetOptionWidthTest.GetOptionWidthValueRequiredEmptyOptionWithNoDescription (72713 of 74057)
PASS: LLVM-Unit :: Support/./SupportTests/GlobPatternTest.BasicCharacterClass (72714 of 74057)
PASS: LLVM-Unit :: Support/./SupportTests/GetOptionWidthTest.GetOptionWidthValueOptionalEmptyOptionWithNoDescription (72715 of 74057)
PASS: LLVM-Unit :: Support/./SupportTests/GlobPatternTest.BracketFrontOfCharacterClass (72716 of 74057)
PASS: LLVM-Unit :: Support/./SupportTests/GlobPatternTest.Empty (72717 of 74057)
PASS: LLVM-Unit :: Support/./SupportTests/GlobPatternTest.ExtSym (72718 of 74057)
PASS: LLVM-Unit :: Support/./SupportTests/GlobPatternTest.Glob (72719 of 74057)
PASS: LLVM-Unit :: Support/./SupportTests/GlobPatternTest.Escape (72720 of 74057)
PASS: LLVM-Unit :: Support/./SupportTests/GlobPatternTest.Invalid (72721 of 74057)
PASS: LLVM-Unit :: Support/./SupportTests/GlobPatternTest.IsTrivialMatchAll (72722 of 74057)
PASS: LLVM-Unit :: Support/./SupportTests/HashBuilderTest/0.HashStdTuple (72723 of 74057)
PASS: LLVM-Unit :: Support/./SupportTests/HashBuilderTest/0.HashArrayRefHashableDataTypes (72724 of 74057)
PASS: LLVM-Unit :: Support/./SupportTests/HashBuilderTest/0.AddRangeElements (72725 of 74057)
PASS: LLVM-Unit :: Support/./SupportTests/GlobPatternTest.SpecialCharsInCharacterClass (72726 of 74057)
PASS: LLVM-Unit :: Support/./SupportTests/HashBuilderTest/0.HashStdPair (72727 of 74057)
PASS: LLVM-Unit :: Support/./SupportTests/HashBuilderTest/0.HashArrayRef (72728 of 74057)
PASS: LLVM-Unit :: Support/./SupportTests/HardFPBuildAttr.testBuildAttr (72729 of 74057)
PASS: LLVM-Unit :: Support/./SupportTests/HashBuilderTest/0.AddHashableData (72730 of 74057)
PASS: LLVM-Unit :: Support/./SupportTests/HashBuilderTest/0.HashRangeWithForwardIterator (72731 of 74057)
PASS: LLVM-Unit :: Support/./SupportTests/HashBuilderTest/0.HashStdString (72732 of 74057)
PASS: LLVM-Unit :: Support/./SupportTests/HashBuilderTest/0.HashArrayRefNonHashableDataTypes (72733 of 74057)
PASS: LLVM-Unit :: Support/./SupportTests/GlobPatternTest.NegatedCharacterClass (72734 of 74057)
PASS: LLVM-Unit :: Support/./SupportTests/HashBuilderTest/0.HashUserDefinedStruct (72735 of 74057)
PASS: LLVM-Unit :: Support/./SupportTests/HashBuilderTest/0.HashStringRef (72736 of 74057)
PASS: LLVM-Unit :: Support/./SupportTests/GlobPatternTest.Wildcard (72737 of 74057)
PASS: LLVM-Unit :: Support/./SupportTests/HashBuilderTest/0.VariadicHelpers (72738 of 74057)
PASS: LLVM-Unit :: Support/./SupportTests/HashBuilderTest/1.AddRangeElements (72739 of 74057)
PASS: LLVM-Unit :: Support/./SupportTests/HashBuilderTest/1.HashStdPair (72740 of 74057)
PASS: LLVM-Unit :: Support/./SupportTests/HashBuilderTest/1.HashArrayRefHashableDataTypes (72741 of 74057)
PASS: LLVM-Unit :: Support/./SupportTests/HashBuilderTest/1.HashArrayRef (72742 of 74057)
PASS: LLVM-Unit :: Support/./SupportTests/HashBuilderTest/1.HashUserDefinedStruct (72743 of 74057)
PASS: LLVM-Unit :: Support/./SupportTests/HashBuilderTest/1.HashArrayRefNonHashableDataTypes (72744 of 74057)
PASS: LLVM-Unit :: Support/./SupportTests/HashBuilderTest/1.HashStdString (72745 of 74057)
PASS: LLVM-Unit :: Support/./SupportTests/HashBuilderTest/1.HashStringRef (72746 of 74057)
PASS: LLVM-Unit :: Support/./SupportTests/HashBuilderTest/1.VariadicHelpers (72747 of 74057)
PASS: LLVM-Unit :: Support/./SupportTests/HashBuilderTest/1.AddHashableData (72748 of 74057)
PASS: LLVM-Unit :: Support/./SupportTests/HashBuilderTest/1.HashRangeWithForwardIterator (72749 of 74057)
PASS: LLVM-Unit :: Support/./SupportTests/HashBuilderTest/1.HashStdTuple (72750 of 74057)
PASS: LLVM-Unit :: Support/./SupportTests/HashBuilderTest/2.HashArrayRefHashableDataTypes (72751 of 74057)
PASS: LLVM-Unit :: Support/./SupportTests/HashBuilderTest/2.AddRangeElements (72752 of 74057)
PASS: LLVM-Unit :: Support/./SupportTests/HashBuilderTest/2.HashArrayRefNonHashableDataTypes (72753 of 74057)
PASS: LLVM-Unit :: Support/./SupportTests/HashBuilderTest/2.HashRangeWithForwardIterator (72754 of 74057)
PASS: LLVM-Unit :: Support/./SupportTests/HashBuilderTest/2.HashStdPair (72755 of 74057)
PASS: LLVM-Unit :: Support/./SupportTests/HashBuilderTest/2.HashStdString (72756 of 74057)
PASS: LLVM-Unit :: Support/./SupportTests/HashBuilderTest/2.AddHashableData (72757 of 74057)
PASS: LLVM-Unit :: Support/./SupportTests/HashBuilderTest/2.HashUserDefinedStruct (72758 of 74057)
PASS: LLVM-Unit :: Support/./SupportTests/HashBuilderTest/2.HashStdTuple (72759 of 74057)
PASS: LLVM-Unit :: Support/./SupportTests/HashBuilderTest/2.HashArrayRef (72760 of 74057)
PASS: LLVM-Unit :: Support/./SupportTests/HashBuilderTest/2.HashStringRef (72761 of 74057)
PASS: LLVM-Unit :: Support/./SupportTests/HashBuilderTest/2.VariadicHelpers (72762 of 74057)
PASS: LLVM-Unit :: Support/./SupportTests/HashBuilderTest/3.AddHashableData (72763 of 74057)
PASS: LLVM-Unit :: Support/./SupportTests/HashBuilderTest/3.HashArrayRef (72764 of 74057)
PASS: LLVM-Unit :: Support/./SupportTests/HashBuilderTest/3.HashStdTuple (72765 of 74057)
PASS: LLVM-Unit :: Support/./SupportTests/HashBuilderTest/3.HashStdPair (72766 of 74057)
PASS: LLVM-Unit :: Support/./SupportTests/HashBuilderTest/3.HashStdString (72767 of 74057)
PASS: LLVM-Unit :: Support/./SupportTests/HashBuilderTest/3.HashStringRef (72768 of 74057)
PASS: LLVM-Unit :: Support/./SupportTests/HashBuilderTest/3.HashRangeWithForwardIterator (72769 of 74057)
PASS: LLVM-Unit :: Support/./SupportTests/HashBuilderTest/3.HashArrayRefNonHashableDataTypes (72770 of 74057)
PASS: LLVM-Unit :: Support/./SupportTests/HashBuilderTest/4.HashArrayRefHashableDataTypes (72771 of 74057)
PASS: LLVM-Unit :: Support/./SupportTests/HashBuilderTest/3.AddRangeElements (72772 of 74057)
PASS: LLVM-Unit :: Support/./SupportTests/HashBuilderTest/3.VariadicHelpers (72773 of 74057)
PASS: LLVM-Unit :: Support/./SupportTests/HashBuilderTest/4.AddHashableData (72774 of 74057)
PASS: LLVM-Unit :: Support/./SupportTests/HashBuilderTest/3.HashUserDefinedStruct (72775 of 74057)
PASS: LLVM-Unit :: Support/./SupportTests/HashBuilderTest/4.AddRangeElements (72776 of 74057)
PASS: LLVM-Unit :: Support/./SupportTests/HashBuilderTest/4.HashArrayRef (72777 of 74057)
PASS: LLVM-Unit :: Support/./SupportTests/HashBuilderTest/3.HashArrayRefHashableDataTypes (72778 of 74057)
PASS: LLVM-Unit :: Support/./SupportTests/HashBuilderTest/4.HashArrayRefNonHashableDataTypes (72779 of 74057)
PASS: LLVM-Unit :: Support/./SupportTests/HashBuilderTest/4.HashStringRef (72780 of 74057)
PASS: LLVM-Unit :: Support/./SupportTests/HashBuilderTest/4.HashStdString (72781 of 74057)
PASS: LLVM-Unit :: Support/./SupportTests/HashBuilderTest/4.HashStdPair (72782 of 74057)
PASS: LLVM-Unit :: Support/./SupportTests/HashBuilderTest/4.VariadicHelpers (72783 of 74057)
PASS: LLVM-Unit :: Support/./SupportTests/HashBuilderTest/4.HashUserDefinedStruct (72784 of 74057)
PASS: LLVM-Unit :: Support/./SupportTests/HashBuilderTest/5.HashArrayRefNonHashableDataTypes (72785 of 74057)
PASS: LLVM-Unit :: Support/./SupportTests/HashBuilderTest/4.HashStdTuple (72786 of 74057)
PASS: LLVM-Unit :: Support/./SupportTests/HashBuilderTest/5.HashArrayRef (72787 of 74057)
PASS: LLVM-Unit :: Support/./SupportTests/HashBuilderTest/5.AddHashableData (72788 of 74057)
PASS: LLVM-Unit :: Support/./SupportTests/HashBuilderTest/5.HashArrayRefHashableDataTypes (72789 of 74057)
PASS: LLVM-Unit :: Support/./SupportTests/HashBuilderTest/5.HashRangeWithForwardIterator (72790 of 74057)
PASS: LLVM-Unit :: Support/./SupportTests/HashBuilderTest/5.HashStdPair (72791 of 74057)
PASS: LLVM-Unit :: Support/./SupportTests/HashBuilderTest/4.HashRangeWithForwardIterator (72792 of 74057)
PASS: LLVM-Unit :: Support/./SupportTests/HashBuilderTest/5.AddRangeElements (72793 of 74057)
PASS: LLVM-Unit :: Support/./SupportTests/HashBuilderTest/5.HashStdString (72794 of 74057)
PASS: LLVM-Unit :: Support/./SupportTests/HashBuilderTest/6.AddHashableData (72795 of 74057)
PASS: LLVM-Unit :: Support/./SupportTests/HashBuilderTest/5.HashStdTuple (72796 of 74057)
PASS: LLVM-Unit :: Support/./SupportTests/HashBuilderTest/5.HashStringRef (72797 of 74057)
PASS: LLVM-Unit :: Support/./SupportTests/HashBuilderTest/5.HashUserDefinedStruct (72798 of 74057)
PASS: LLVM-Unit :: Support/./SupportTests/HashBuilderTest/6.HashArrayRefHashableDataTypes (72799 of 74057)
PASS: LLVM-Unit :: Support/./SupportTests/HashBuilderTest/6.AddRangeElements (72800 of 74057)
PASS: LLVM-Unit :: Support/./SupportTests/HashBuilderTest/6.HashArrayRefNonHashableDataTypes (72801 of 74057)
PASS: LLVM-Unit :: Support/./SupportTests/HashBuilderTest/5.VariadicHelpers (72802 of 74057)
PASS: LLVM-Unit :: Support/./SupportTests/HashBuilderTest/6.HashArrayRef (72803 of 74057)
PASS: LLVM-Unit :: Support/./SupportTests/HashBuilderTest/6.HashStdTuple (72804 of 74057)
PASS: LLVM-Unit :: Support/./SupportTests/HashBuilderTest/6.HashRangeWithForwardIterator (72805 of 74057)
PASS: LLVM-Unit :: Support/./SupportTests/HashBuilderTest/6.HashStdString (72806 of 74057)
PASS: LLVM-Unit :: Support/./SupportTests/HashBuilderTest/6.HashStdPair (72807 of 74057)
PASS: LLVM-Unit :: Support/./SupportTests/HashBuilderTest/6.HashStringRef (72808 of 74057)
PASS: LLVM-Unit :: Support/./SupportTests/HashBuilderTest/7.AddHashableData (72809 of 74057)
PASS: LLVM-Unit :: Support/./SupportTests/HashBuilderTest/6.HashUserDefinedStruct (72810 of 74057)
PASS: LLVM-Unit :: Support/./SupportTests/HashBuilderTest/7.HashArrayRef (72811 of 74057)
PASS: LLVM-Unit :: Support/./SupportTests/HashBuilderTest/7.HashArrayRefHashableDataTypes (72812 of 74057)
PASS: LLVM-Unit :: Support/./SupportTests/HashBuilderTest/7.HashStdPair (72813 of 74057)
PASS: LLVM-Unit :: Support/./SupportTests/HashBuilderTest/6.VariadicHelpers (72814 of 74057)
PASS: LLVM-Unit :: Support/./SupportTests/HashBuilderTest/7.AddRangeElements (72815 of 74057)
PASS: LLVM-Unit :: Support/./SupportTests/HashBuilderTest/7.HashStdString (72816 of 74057)
PASS: LLVM-Unit :: Support/./SupportTests/HashBuilderTest/7.HashRangeWithForwardIterator (72817 of 74057)
PASS: LLVM-Unit :: Support/./SupportTests/HashBuilderTest/7.HashStringRef (72818 of 74057)
PASS: LLVM-Unit :: Support/./SupportTests/HashBuilderTest/8.AddHashableData (72819 of 74057)
PASS: LLVM-Unit :: Support/./SupportTests/HashBuilderTest/7.HashStdTuple (72820 of 74057)
PASS: LLVM-Unit :: Support/./SupportTests/HashBuilderTest/7.VariadicHelpers (72821 of 74057)
PASS: LLVM-Unit :: Support/./SupportTests/HashBuilderTest/7.HashUserDefinedStruct (72822 of 74057)
PASS: LLVM-Unit :: Support/./SupportTests/HashBuilderTest/7.HashArrayRefNonHashableDataTypes (72823 of 74057)
PASS: LLVM-Unit :: Support/./SupportTests/HashBuilderTest/8.HashArrayRefHashableDataTypes (72824 of 74057)
PASS: LLVM-Unit :: Support/./SupportTests/HashBuilderTest/8.AddRangeElements (72825 of 74057)
PASS: LLVM-Unit :: Support/./SupportTests/HashBuilderTest/8.HashStdString (72826 of 74057)
PASS: LLVM-Unit :: Support/./SupportTests/HashBuilderTest/8.HashArrayRef (72827 of 74057)
PASS: LLVM-Unit :: Support/./SupportTests/HashBuilderTest/8.HashStdTuple (72828 of 74057)
PASS: LLVM-Unit :: Support/./SupportTests/HashBuilderTest/8.HashArrayRefNonHashableDataTypes (72829 of 74057)
PASS: LLVM-Unit :: Support/./SupportTests/HashBuilderTest/8.HashRangeWithForwardIterator (72830 of 74057)
PASS: LLVM-Unit :: Support/./SupportTests/HashBuilderTest/8.VariadicHelpers (72831 of 74057)
PASS: LLVM-Unit :: Support/./SupportTests/HashBuilderTest/8.HashStdPair (72832 of 74057)
PASS: LLVM-Unit :: Support/./SupportTests/HashBuilderTest/8.HashUserDefinedStruct (72833 of 74057)
PASS: LLVM-Unit :: Support/./SupportTests/HostTest.DummyRunAndGetCommandOutputUse (72834 of 74057)
PASS: LLVM-Unit :: Support/./SupportTests/HashBuilderTest/8.HashStringRef (72835 of 74057)
PASS: LLVM-Unit :: Support/./SupportTests/HostTest.NumPhysicalCores (72836 of 74057)
PASS: LLVM-Unit :: Support/./SupportTests/InMemoryFileSystemTest.AddDirectoryThenAddChild (72837 of 74057)
PASS: LLVM-Unit :: Support/./SupportTests/InMemoryFileSystemTest.AddFileInPlaceOfAHardLinkWithDifferentContent (72838 of 74057)
PASS: LLVM-Unit :: Support/./SupportTests/InMemoryFileSystemTest.AddFileInPlaceOfAHardLinkWithSameContent (72839 of 74057)
PASS: LLVM-Unit :: Support/./SupportTests/InMemoryFileSystemTest.AddFileWithGroup (72840 of 74057)
PASS: LLVM-Unit :: Support/./SupportTests/InMemoryFileSystemTest.AddFileWithFileType (72841 of 74057)
PASS: LLVM-Unit :: Support/./SupportTests/InMemoryFileSystemTest.AddFileWithUser (72842 of 74057)
PASS: LLVM-Unit :: Support/./SupportTests/InMemoryFileSystemTest.AddFileWithPerms (72843 of 74057)
PASS: LLVM-Unit :: Support/./SupportTests/InMemoryFileSystemTest.AddHardLinkFromADirectory (72844 of 74057)
PASS: LLVM-Unit :: Support/./SupportTests/InMemoryFileSystemTest.AddHardLinkFromAFileThatWasAddedBefore (72845 of 74057)
PASS: LLVM-Unit :: Support/./SupportTests/InMemoryFileSystemTest.AddHardLinkToADirectory (72846 of 74057)
PASS: LLVM-Unit :: Support/./SupportTests/InMemoryFileSystemTest.AddHardLinkInChainPattern (72847 of 74057)
PASS: LLVM-Unit :: Support/./SupportTests/InMemoryFileSystemTest.AddHardLinkUnderAFile (72848 of 74057)
PASS: LLVM-Unit :: Support/./SupportTests/InMemoryFileSystemTest.AddHardLinkToAFileThatWasNotAddedBefore (72849 of 74057)
PASS: LLVM-Unit :: Support/./SupportTests/InMemoryFileSystemTest.AddSameHardLinkMoreThanOnce (72850 of 74057)
PASS: LLVM-Unit :: Support/./SupportTests/InMemoryFileSystemTest.AddHardLinkToFile (72851 of 74057)
PASS: LLVM-Unit :: Support/./SupportTests/HostTest.getMacOSHostVersion (72852 of 74057)
PASS: LLVM-Unit :: Support/./SupportTests/InMemoryFileSystemTest.GetRealPath (72853 of 74057)
PASS: LLVM-Unit :: Support/./SupportTests/InMemoryFileSystemTest.IsLocal (72854 of 74057)
PASS: LLVM-Unit :: Support/./SupportTests/InMemoryFileSystemTest.IsEmpty (72855 of 74057)
PASS: LLVM-Unit :: Support/./SupportTests/InMemoryFileSystemTest.OpenFileForRead (72856 of 74057)
PASS: LLVM-Unit :: Support/./SupportTests/InMemoryFileSystemTest.OverlayFile (72857 of 74057)
PASS: LLVM-Unit :: Support/./SupportTests/InMemoryFileSystemTest.StatusName (72858 of 74057)
PASS: LLVM-Unit :: Support/./SupportTests/InMemoryFileSystemTest.WindowsPath (72859 of 74057)
PASS: LLVM-Unit :: Support/./SupportTests/InMemoryFileSystemTest.DirectoryIteration (72860 of 74057)
PASS: LLVM-Unit :: Support/./SupportTests/InMemoryFileSystemTest.RecursiveIterationWithHardLink (72861 of 74057)
PASS: LLVM-Unit :: Support/./SupportTests/InMemoryFileSystemTest.WorkingDirectory (72862 of 74057)
PASS: LLVM-Unit :: Support/./SupportTests/InMemoryFileSystemTest.OverlayFileNoOwn (72863 of 74057)
PASS: LLVM-Unit :: Support/./SupportTests/InMemoryFileSystemTest.DuplicatedFile (72864 of 74057)
PASS: LLVM-Unit :: Support/./SupportTests/Initialize.MultipleThreads (72865 of 74057)
PASS: LLVM-Unit :: Support/./SupportTests/ItaniumManglingCanonicalizerTest.TestBadEquivalenceOrder (72866 of 74057)
PASS: LLVM-Unit :: Support/./SupportTests/ItaniumManglingCanonicalizerTest.TestCanonicalize (72867 of 74057)
PASS: LLVM-Unit :: Support/./SupportTests/ItaniumManglingCanonicalizerTest.TestForwardTemplateReference (72868 of 74057)
PASS: LLVM-Unit :: Support/./SupportTests/ItaniumManglingCanonicalizerTest.TestInvalidManglings (72869 of 74057)
PASS: LLVM-Unit :: Support/./SupportTests/JSONTest.Array (72870 of 74057)
PASS: LLVM-Unit :: Support/./SupportTests/ItaniumManglingCanonicalizerTest.TestLookup (72871 of 74057)
PASS: LLVM-Unit :: Support/./SupportTests/JSONTest.CanonicalOutput (72872 of 74057)
PASS: LLVM-Unit :: Support/./SupportTests/JSONTest.Deserialize (72873 of 74057)
PASS: LLVM-Unit :: Support/./SupportTests/JSONTest.Constructors (72874 of 74057)
PASS: LLVM-Unit :: Support/./SupportTests/JSONTest.Integers (72875 of 74057)
PASS: LLVM-Unit :: Support/./SupportTests/JSONTest.Object (72876 of 74057)
PASS: LLVM-Unit :: Support/./SupportTests/JSONTest.Inspection (72877 of 74057)
PASS: LLVM-Unit :: Support/./SupportTests/JSONTest.Parse (72878 of 74057)
PASS: LLVM-Unit :: Support/./SupportTests/JSONTest.Escaping (72879 of 74057)
PASS: LLVM-Unit :: Support/./SupportTests/JSONTest.ParseDeserialize (72880 of 74057)
PASS: LLVM-Unit :: Support/./SupportTests/JSONTest.ParseErrors (72881 of 74057)
PASS: LLVM-Unit :: Support/./SupportTests/JSONTest.Path (72882 of 74057)
PASS: LLVM-Unit :: Support/./SupportTests/JSONTest.Types (72883 of 74057)
PASS: LLVM-Unit :: Support/./SupportTests/JSONTest.UTF8 (72884 of 74057)
PASS: LLVM-Unit :: Support/./SupportTests/JSONTest.StringOwnership (72885 of 74057)
PASS: LLVM-Unit :: Support/./SupportTests/JSONTest.Stream (72886 of 74057)
PASS: LLVM-Unit :: Support/./SupportTests/JSONTest.PrettyPrinting (72887 of 74057)
PASS: LLVM-Unit :: Support/./SupportTests/LEB128Test.DecodeInvalidSLEB128 (72888 of 74057)
PASS: LLVM-Unit :: Support/./SupportTests/KnownBitsTest.CommonBitsSet (72889 of 74057)
PASS: LLVM-Unit :: Support/./SupportTests/KnownBitsTest.GetSignedMinMaxVal (72890 of 74057)
PASS: LLVM-Unit :: Support/./SupportTests/KnownBitsTest.SExtOrTrunc (72891 of 74057)
PASS: LLVM-Unit :: Support/./SupportTests/KnownBitsTest.GetMinMaxVal (72892 of 74057)
PASS: LLVM-Unit :: Support/./SupportTests/KnownBitsTest.UnaryExhaustive (72893 of 74057)
PASS: LLVM-Unit :: Support/./SupportTests/KnownBitsTest.AddSubExhaustive (72894 of 74057)
PASS: LLVM-Unit :: Support/./SupportTests/KnownBitsTest.AddCarryExhaustive (72895 of 74057)
PASS: LLVM-Unit :: Support/./SupportTests/KnownBitsTest.SExtInReg (72896 of 74057)
PASS: LLVM-Unit :: Support/./SupportTests/KnownBitsTest.ICmpExhaustive (72897 of 74057)
PASS: LLVM-Unit :: Support/./SupportTests/LEB128Test.DecodeInvalidULEB128 (72898 of 74057)
PASS: LLVM-Unit :: Support/./SupportTests/LEB128Test.DecodeSLEB128 (72899 of 74057)
PASS: LLVM-Unit :: Support/./SupportTests/LEB128Test.DecodeULEB128 (72900 of 74057)
PASS: LLVM-Unit :: Support/./SupportTests/LineIteratorTest.BlankKeeping (72901 of 74057)
PASS: LLVM-Unit :: Support/./SupportTests/LEB128Test.EncodeULEB128 (72902 of 74057)
PASS: LLVM-Unit :: Support/./SupportTests/LEB128Test.SLEB128Size (72903 of 74057)
PASS: LLVM-Unit :: Support/./SupportTests/LineIteratorTest.Basic (72904 of 74057)
PASS: LLVM-Unit :: Support/./SupportTests/LEB128Test.EncodeSLEB128 (72905 of 74057)
PASS: LLVM-Unit :: Support/./SupportTests/LEB128Test.ULEB128Size (72906 of 74057)
PASS: LLVM-Unit :: Support/./SupportTests/LineIteratorTest.BlankSkipping (72907 of 74057)
PASS: LLVM-Unit :: Support/./SupportTests/LineIteratorTest.CommentAndBlankSkipping (72908 of 74057)
PASS: LLVM-Unit :: Support/./SupportTests/LineIteratorTest.Ref (72909 of 74057)
PASS: LLVM-Unit :: Support/./SupportTests/LineIteratorTest.EmptyBuffers (72910 of 74057)
PASS: LLVM-Unit :: Support/./SupportTests/LineIteratorTest.CommentSkippingKeepBlanks (72911 of 74057)
PASS: LLVM-Unit :: Support/./SupportTests/LinearPolyBase.Poly3D_Scale (72912 of 74057)
PASS: LLVM-Unit :: Support/./SupportTests/LinearPolyBase.Poly3D_Sub (72913 of 74057)
PASS: LLVM-Unit :: Support/./SupportTests/LinearPolyBase.Poly3D_Equality (72914 of 74057)
PASS: LLVM-Unit :: Support/./SupportTests/LinearPolyBase.Poly3D_GetValue (72915 of 74057)
PASS: LLVM-Unit :: Support/./SupportTests/LinearPolyBase.Poly3D_Add (72916 of 74057)
PASS: LLVM-Unit :: Support/./SupportTests/LinearPolyBase.Poly3D_Invert (72917 of 74057)
PASS: LLVM-Unit :: Support/./SupportTests/LinearPolyBase.Poly3D_isZero (72918 of 74057)
PASS: LLVM-Unit :: Support/./SupportTests/MD5Test.FinalAndResultHelpers (72919 of 74057)
PASS: LLVM-Unit :: Support/./SupportTests/MD5HashTest.MD5 (72920 of 74057)
PASS: LLVM-Unit :: Support/./SupportTests/MPBuildAttr.testBuildAttr (72921 of 74057)
PASS: LLVM-Unit :: Support/./SupportTests/LockFileManagerTest.LinkLockExists (72922 of 74057)
PASS: LLVM-Unit :: Support/./SupportTests/LockFileManagerTest.Basic (72923 of 74057)
PASS: LLVM-Unit :: Support/./SupportTests/MD5Test.MD5 (72924 of 74057)
PASS: LLVM-Unit :: Support/./SupportTests/MVEBuildAttr.testBuildAttr (72925 of 74057)
PASS: LLVM-Unit :: Support/./SupportTests/LockFileManagerTest.RelativePath (72926 of 74057)
PASS: LLVM-Unit :: Support/./SupportTests/ManagedStaticTest.NestedStatics (72927 of 74057)
PASS: LLVM-Unit :: Support/./SupportTests/MatchersTest.Optional (72928 of 74057)
PASS: LLVM-Unit :: Support/./SupportTests/ManagedStaticTest.CustomCreatorDeletor (72929 of 74057)
PASS: LLVM-Unit :: Support/./SupportTests/MathExtras.CTLog2 (72930 of 74057)
PASS: LLVM-Unit :: Support/./SupportTests/MathExtras.DoubleBits (72931 of 74057)
PASS: LLVM-Unit :: Support/./SupportTests/MathExtras.PowerOf2Floor (72932 of 74057)
PASS: LLVM-Unit :: Support/./SupportTests/MathExtras.PowerOf2Ceil (72933 of 74057)
PASS: LLVM-Unit :: Support/./SupportTests/MathExtras.IsShiftedUInt (72934 of 74057)
PASS: LLVM-Unit :: Support/./SupportTests/MathExtras.SaturatingAdd (72935 of 74057)
PASS: LLVM-Unit :: Support/./SupportTests/MathExtras.NextPowerOf2 (72936 of 74057)
PASS: LLVM-Unit :: Support/./SupportTests/MathExtras.IsShiftedInt (72937 of 74057)
PASS: LLVM-Unit :: Support/./SupportTests/MathExtras.FloatBits (72938 of 74057)
PASS: LLVM-Unit :: Support/./SupportTests/MathExtras.MinAlign (72939 of 74057)
PASS: LLVM-Unit :: Support/./SupportTests/KnownBitsTest.BinaryExhaustive (72940 of 74057)
PASS: LLVM-Unit :: Support/./SupportTests/MathExtras.SaturatingMultiplyAdd (72941 of 74057)
PASS: LLVM-Unit :: Support/./SupportTests/MathExtras.SaturatingMultiply (72942 of 74057)
PASS: LLVM-Unit :: Support/./SupportTests/MathExtras.countLeadingOnes (72943 of 74057)
PASS: LLVM-Unit :: Support/./SupportTests/MathExtras.countLeadingZeros (72944 of 74057)
PASS: LLVM-Unit :: Support/./SupportTests/MathExtras.alignTo (72945 of 74057)
PASS: LLVM-Unit :: Support/./SupportTests/MathExtras.countTrailingZeros (72946 of 74057)
PASS: LLVM-Unit :: Support/./SupportTests/MathExtras.findLastSet (72947 of 74057)
PASS: LLVM-Unit :: Support/./SupportTests/MathExtras.findFirstSet (72948 of 74057)
PASS: LLVM-Unit :: Support/./SupportTests/MathExtras.isPowerOf2_32 (72949 of 74057)
PASS: LLVM-Unit :: Support/./SupportTests/MathExtras.isIntN (72950 of 74057)
PASS: LLVM-Unit :: Support/./SupportTests/MathExtras.isPowerOf2_64 (72951 of 74057)
PASS: LLVM-Unit :: Support/./SupportTests/MathExtras.maxUIntN (72952 of 74057)
PASS: LLVM-Unit :: Support/./SupportTests/MathExtras.minIntN (72953 of 74057)
PASS: LLVM-Unit :: Support/./SupportTests/MathExtras.onesMask (72954 of 74057)
PASS: LLVM-Unit :: Support/./SupportTests/MathExtras.isUIntN (72955 of 74057)
PASS: LLVM-Unit :: Support/./SupportTests/MathExtras.maxIntN (72956 of 74057)
PASS: LLVM-Unit :: Support/./SupportTests/MathExtras.reverseBits (72957 of 74057)
PASS: LLVM-Unit :: Support/./SupportTests/MemoryBufferTest.copy (72958 of 74057)
PASS: LLVM-Unit :: Support/./SupportTests/MemoryBufferTest.get (72959 of 74057)
PASS: LLVM-Unit :: Support/./SupportTests/MemoryBufferRefTest.construct (72960 of 74057)
PASS: LLVM-Unit :: Support/./SupportTests/MemoryBufferRefTest.compareEquals (72961 of 74057)
PASS: LLVM-Unit :: Support/./SupportTests/MemoryBufferTest.getOpenFile (72962 of 74057)
PASS: LLVM-Unit :: Support/./SupportTests/MemoryBufferTest.make_new (72963 of 74057)
PASS: LLVM-Unit :: Support/./SupportTests/MemoryBufferTest.writableSlice (72964 of 74057)
PASS: LLVM-Unit :: Support/./SupportTests/NativeFormatTest.BasicFloatingPointTests (72965 of 74057)
PASS: LLVM-Unit :: Support/./SupportTests/MemoryBufferTest.mmapVolatileNoNull (72966 of 74057)
PASS: LLVM-Unit :: Support/./SupportTests/MemoryBufferTest.NullTerminator4K (72967 of 74057)
PASS: LLVM-Unit :: Support/./SupportTests/MemoryBufferTest.writeThroughFile (72968 of 74057)
PASS: LLVM-Unit :: Support/./SupportTests/MemoryBufferTest.getOpenFileReopened (72969 of 74057)
PASS: LLVM-Unit :: Support/./SupportTests/NativeFormatTest.IntegerTests (72970 of 74057)
PASS: LLVM-Unit :: Support/./SupportTests/NativeFormatTest.BasicIntegerTests (72971 of 74057)
PASS: LLVM-Unit :: Support/./SupportTests/NativeFormatTest.CommaTests (72972 of 74057)
PASS: LLVM-Unit :: Support/./SupportTests/OptimizedStructLayoutTest.GardenPath (72973 of 74057)
PASS: LLVM-Unit :: Support/./SupportTests/NativeFormatTest.BoundaryTests (72974 of 74057)
PASS: LLVM-Unit :: Support/./SupportTests/OptimizedStructLayoutTest.HighAlignment (72975 of 74057)
PASS: LLVM-Unit :: Support/./SupportTests/NativeFormatTest.HexTests (72976 of 74057)
PASS: LLVM-Unit :: Support/./SupportTests/OptimizedStructLayoutTest.Basic (72977 of 74057)
PASS: LLVM-Unit :: Support/./SupportTests/OptimizedStructLayoutTest.Greed (72978 of 74057)
PASS: LLVM-Unit :: Support/./SupportTests/OptimizedStructLayoutTest.Gaps (72979 of 74057)
PASS: LLVM-Unit :: Support/./SupportTests/OptimizedStructLayoutTest.Jagged (72980 of 74057)
PASS: LLVM-Unit :: Support/./SupportTests/OptimizedStructLayoutTest.OddSize (72981 of 74057)
PASS: LLVM-Unit :: Support/./SupportTests/OverflowTest/0.AddNoOverflow (72982 of 74057)
PASS: LLVM-Unit :: Support/./SupportTests/OverflowTest/0.AddOverflowToNegative (72983 of 74057)
PASS: LLVM-Unit :: Support/./SupportTests/OverflowTest/0.AddOverflowToMax (72984 of 74057)
PASS: LLVM-Unit :: Support/./SupportTests/OverflowTest/0.AddOverflowToMin (72985 of 74057)
PASS: LLVM-Unit :: Support/./SupportTests/OverflowTest/0.AddOverflowToZero (72986 of 74057)
PASS: LLVM-Unit :: Support/./SupportTests/MemoryBufferTest.createFromPipe (72987 of 74057)
PASS: LLVM-Unit :: Support/./SupportTests/OverflowTest/0.MulNoOverflowToMax (72988 of 74057)
PASS: LLVM-Unit :: Support/./SupportTests/MemoryBufferTest.slice (72989 of 74057)
PASS: LLVM-Unit :: Support/./SupportTests/OverflowTest/0.SubNoOverflow (72990 of 74057)
PASS: LLVM-Unit :: Support/./SupportTests/OverflowTest/0.MulOverflowToMin (72991 of 74057)
PASS: LLVM-Unit :: Support/./SupportTests/OverflowTest/0.MulResultZero (72992 of 74057)
PASS: LLVM-Unit :: Support/./SupportTests/OverflowTest/0.MulNoOverflow (72993 of 74057)
PASS: LLVM-Unit :: Support/./SupportTests/OverflowTest/0.SubOverflowToMax (72994 of 74057)
PASS: LLVM-Unit :: Support/./SupportTests/OverflowTest/0.MulOverflowMax (72995 of 74057)
PASS: LLVM-Unit :: Support/./SupportTests/OverflowTest/0.SubOverflowToMin (72996 of 74057)
PASS: LLVM-Unit :: Support/./SupportTests/OverflowTest/0.SubOverflowToNegative (72997 of 74057)
PASS: LLVM-Unit :: Support/./SupportTests/OverflowTest/1.AddOverflowToMax (72998 of 74057)
PASS: LLVM-Unit :: Support/./SupportTests/OverflowTest/1.AddNoOverflow (72999 of 74057)
PASS: LLVM-Unit :: Support/./SupportTests/OverflowTest/0.SubOverflowToPositive (73000 of 74057)
PASS: LLVM-Unit :: Support/./SupportTests/OverflowTest/1.AddOverflowToZero (73001 of 74057)
PASS: LLVM-Unit :: Support/./SupportTests/OverflowTest/1.AddOverflowToMin (73002 of 74057)
PASS: LLVM-Unit :: Support/./SupportTests/OverflowTest/1.AddOverflowToNegative (73003 of 74057)
PASS: LLVM-Unit :: Support/./SupportTests/OverflowTest/1.MulNoOverflowToMax (73004 of 74057)
PASS: LLVM-Unit :: Support/./SupportTests/OverflowTest/1.MulNoOverflow (73005 of 74057)
PASS: LLVM-Unit :: Support/./SupportTests/OverflowTest/1.MulOverflowMax (73006 of 74057)
PASS: LLVM-Unit :: Support/./SupportTests/OverflowTest/1.SubNoOverflow (73007 of 74057)
PASS: LLVM-Unit :: Support/./SupportTests/OverflowTest/1.MulOverflowToMin (73008 of 74057)
PASS: LLVM-Unit :: Support/./SupportTests/OverflowTest/1.SubOverflowToMin (73009 of 74057)
PASS: LLVM-Unit :: Support/./SupportTests/OverflowTest/1.MulResultZero (73010 of 74057)
PASS: LLVM-Unit :: Support/./SupportTests/OverflowTest/1.SubOverflowToNegative (73011 of 74057)
PASS: LLVM-Unit :: Support/./SupportTests/OverflowTest/1.SubOverflowToPositive (73012 of 74057)
PASS: LLVM-Unit :: Support/./SupportTests/OverflowTest/2.AddOverflowToMin (73013 of 74057)
PASS: LLVM-Unit :: Support/./SupportTests/OverflowTest/2.AddOverflowToMax (73014 of 74057)
PASS: LLVM-Unit :: Support/./SupportTests/OverflowTest/2.AddOverflowToZero (73015 of 74057)
PASS: LLVM-Unit :: Support/./SupportTests/OverflowTest/2.AddNoOverflow (73016 of 74057)
PASS: LLVM-Unit :: Support/./SupportTests/OverflowTest/2.AddOverflowToNegative (73017 of 74057)
PASS: LLVM-Unit :: Support/./SupportTests/OverflowTest/1.SubOverflowToMax (73018 of 74057)
PASS: LLVM-Unit :: Support/./SupportTests/OverflowTest/2.MulNoOverflowToMax (73019 of 74057)
PASS: LLVM-Unit :: Support/./SupportTests/OverflowTest/2.MulOverflowToMin (73020 of 74057)
PASS: LLVM-Unit :: Support/./SupportTests/OverflowTest/2.SubNoOverflow (73021 of 74057)
PASS: LLVM-Unit :: Support/./SupportTests/OverflowTest/2.MulNoOverflow (73022 of 74057)
PASS: LLVM-Unit :: Support/./SupportTests/OverflowTest/2.SubOverflowToMax (73023 of 74057)
PASS: LLVM-Unit :: Support/./SupportTests/OverflowTest/2.MulResultZero (73024 of 74057)
PASS: LLVM-Unit :: Support/./SupportTests/OverflowTest/2.MulOverflowMax (73025 of 74057)
PASS: LLVM-Unit :: Support/./SupportTests/OverflowTest/2.SubOverflowToMin (73026 of 74057)
PASS: LLVM-Unit :: Support/./SupportTests/OverflowTest/3.AddNoOverflow (73027 of 74057)
PASS: LLVM-Unit :: Support/./SupportTests/OverflowTest/3.AddOverflowToMax (73028 of 74057)
PASS: LLVM-Unit :: Support/./SupportTests/OverflowTest/3.AddOverflowToMin (73029 of 74057)
PASS: LLVM-Unit :: Support/./SupportTests/OverflowTest/2.SubOverflowToPositive (73030 of 74057)
PASS: LLVM-Unit :: Support/./SupportTests/OverflowTest/3.AddOverflowToNegative (73031 of 74057)
PASS: LLVM-Unit :: Support/./SupportTests/OverflowTest/2.SubOverflowToNegative (73032 of 74057)
PASS: LLVM-Unit :: Support/./SupportTests/OverflowTest/3.AddOverflowToZero (73033 of 74057)
PASS: LLVM-Unit :: Support/./SupportTests/OverflowTest/3.MulNoOverflowToMax (73034 of 74057)
PASS: LLVM-Unit :: Support/./SupportTests/OverflowTest/3.MulOverflowToMin (73035 of 74057)
PASS: LLVM-Unit :: Support/./SupportTests/OverflowTest/3.MulNoOverflow (73036 of 74057)
PASS: LLVM-Unit :: Support/./SupportTests/OverflowTest/3.MulOverflowMax (73037 of 74057)
PASS: LLVM-Unit :: Support/./SupportTests/OverflowTest/3.MulResultZero (73038 of 74057)
PASS: LLVM-Unit :: Support/./SupportTests/OverflowTest/3.SubOverflowToMax (73039 of 74057)
PASS: LLVM-Unit :: Support/./SupportTests/OverflowTest/3.SubNoOverflow (73040 of 74057)
PASS: LLVM-Unit :: Support/./SupportTests/OverflowTest/3.SubOverflowToPositive (73041 of 74057)
PASS: LLVM-Unit :: Support/./SupportTests/OverflowTest/3.SubOverflowToMin (73042 of 74057)
PASS: LLVM-Unit :: Support/./SupportTests/OverflowTest/4.AddNoOverflow (73043 of 74057)
PASS: LLVM-Unit :: Support/./SupportTests/OverflowTest/4.AddOverflowToMax (73044 of 74057)
PASS: LLVM-Unit :: Support/./SupportTests/OverflowTest/3.SubOverflowToNegative (73045 of 74057)
PASS: LLVM-Unit :: Support/./SupportTests/OverflowTest/4.AddOverflowToMin (73046 of 74057)
PASS: LLVM-Unit :: Support/./SupportTests/OverflowTest/4.AddOverflowToNegative (73047 of 74057)
PASS: LLVM-Unit :: Support/./SupportTests/OverflowTest/4.MulOverflowMax (73048 of 74057)
PASS: LLVM-Unit :: Support/./SupportTests/OverflowTest/4.MulNoOverflow (73049 of 74057)
PASS: LLVM-Unit :: Support/./SupportTests/OverflowTest/4.AddOverflowToZero (73050 of 74057)
PASS: LLVM-Unit :: Support/./SupportTests/OverflowTest/4.MulNoOverflowToMax (73051 of 74057)
PASS: LLVM-Unit :: Support/./SupportTests/OverflowTest/4.MulOverflowToMin (73052 of 74057)
PASS: LLVM-Unit :: Support/./SupportTests/OverflowTest/4.MulResultZero (73053 of 74057)
PASS: LLVM-Unit :: Support/./SupportTests/OverflowTest/4.SubNoOverflow (73054 of 74057)
PASS: LLVM-Unit :: Support/./SupportTests/OverflowTest/4.SubOverflowToMin (73055 of 74057)
PASS: LLVM-Unit :: Support/./SupportTests/OverflowTest/4.SubOverflowToNegative (73056 of 74057)
PASS: LLVM-Unit :: Support/./SupportTests/OverflowTest/4.SubOverflowToMax (73057 of 74057)
PASS: LLVM-Unit :: Support/./SupportTests/PCS_ConfigBuildAttr.testBuildAttr (73058 of 74057)
PASS: LLVM-Unit :: Support/./SupportTests/PCS_R9BuildAttr.testBuildAttr (73059 of 74057)
PASS: LLVM-Unit :: Support/./SupportTests/PCS_GOTBuildAttr.testBuildAttr (73060 of 74057)
PASS: LLVM-Unit :: Support/./SupportTests/OverflowTest/4.SubOverflowToPositive (73061 of 74057)
PASS: LLVM-Unit :: Support/./SupportTests/PCS_ROBuildAttr.testBuildAttr (73062 of 74057)
PASS: LLVM-Unit :: Support/./SupportTests/PageSizeTest.PageSize (73063 of 74057)
PASS: LLVM-Unit :: Support/./SupportTests/PCS_RWBuildAttr.testBuildAttr (73064 of 74057)
PASS: LLVM-Unit :: Support/./SupportTests/PCS_WCharBuildAttr.testBuildAttr (73065 of 74057)
PASS: LLVM-Unit :: Support/./SupportTests/PrintOptionInfoTest.PrintOptionInfoEmptyValueDescription (73066 of 74057)
PASS: LLVM-Unit :: Support/./SupportTests/PrintOptionInfoTest.PrintOptionInfoMultilineValueDescription (73067 of 74057)
PASS: LLVM-Unit :: Support/./SupportTests/Parallel.ForEachError (73068 of 74057)
PASS: LLVM-Unit :: Support/./SupportTests/PrintOptionInfoTest.PrintOptionInfoValueRequiredWithEmptyValueName (73069 of 74057)
PASS: LLVM-Unit :: Support/./SupportTests/PrintOptionInfoTest.PrintOptionInfoValueOptionalWithSentinelWithHelp (73070 of 74057)
PASS: LLVM-Unit :: Support/./SupportTests/ProcessTest.GetProcessIdTest (73071 of 74057)
PASS: LLVM-Unit :: Support/./SupportTests/PrintOptionInfoTest.PrintOptionInfoValueOptionalWithoutSentinel (73072 of 74057)
PASS: LLVM-Unit :: Support/./SupportTests/PrintOptionInfoTest.PrintOptionInfoValueOptionalWithSentinel (73073 of 74057)
PASS: LLVM-Unit :: Support/./SupportTests/Parallel.parallel_for (73074 of 74057)
PASS: LLVM-Unit :: Support/./SupportTests/ProcessTest.GetRandomNumberTest (73075 of 74057)
PASS: LLVM-Unit :: Support/./SupportTests/Parallel.sort (73076 of 74057)
PASS: LLVM-Unit :: Support/./SupportTests/ProgramEnvTest.TestExecuteAndWaitStatistics (73077 of 74057)
PASS: LLVM-Unit :: Support/./SupportTests/ProgramEnvTest.CreateProcessTrailingSlash (73078 of 74057)
PASS: LLVM-Unit :: Support/./SupportTests/ProgramTest.TestExecuteNegative (73079 of 74057)
PASS: LLVM-Unit :: Support/./SupportTests/ProxyFileSystemTest.Basic (73080 of 74057)
PASS: LLVM-Unit :: Support/./SupportTests/Parallel.TransformReduce (73081 of 74057)
PASS: LLVM-Unit :: Support/./SupportTests/RegexTest.Basics (73082 of 74057)
PASS: LLVM-Unit :: Support/./SupportTests/RegexTest.Backreferences (73083 of 74057)
PASS: LLVM-Unit :: Support/./SupportTests/RegexTest.Escape (73084 of 74057)
PASS: LLVM-Unit :: Support/./SupportTests/RegexTest.IsLiteralERE (73085 of 74057)
PASS: LLVM-Unit :: Support/./SupportTests/RegexTest.IsValid (73086 of 74057)
PASS: LLVM-Unit :: Support/./SupportTests/ProgramTest.TestWriteWithSystemEncoding (73087 of 74057)
PASS: LLVM-Unit :: Support/./SupportTests/RegexTest.MatchInvalid (73088 of 74057)
PASS: LLVM-Unit :: Support/./SupportTests/RegexTest.MoveAssign (73089 of 74057)
PASS: LLVM-Unit :: Support/./SupportTests/RegexTest.MoveConstruct (73090 of 74057)
PASS: LLVM-Unit :: Support/./SupportTests/RegexTest.NoArgConstructor (73091 of 74057)
PASS: LLVM-Unit :: Support/./SupportTests/RegexTest.OssFuzz3727Regression (73092 of 74057)
PASS: LLVM-Unit :: Support/./SupportTests/RegexTest.Substitution (73093 of 74057)
PASS: LLVM-Unit :: Support/./SupportTests/ReverseIterationTest.DenseMapTest1 (73094 of 74057)
PASS: LLVM-Unit :: Support/./SupportTests/ReverseIterationTest.DenseMapTest2 (73095 of 74057)
PASS: LLVM-Unit :: Support/./SupportTests/SIMDBuildAttr.testBuildAttr (73096 of 74057)
PASS: LLVM-Unit :: Support/./SupportTests/ScaledNumberHelpersTest.arithmeticOperators (73097 of 74057)
PASS: LLVM-Unit :: Support/./SupportTests/SHA256Test.SHA256 (73098 of 74057)
PASS: LLVM-Unit :: Support/./SupportTests/ScaledNumberHelpersTest.compare (73099 of 74057)
PASS: LLVM-Unit :: Support/./SupportTests/ScaledNumberHelpersTest.getDifference (73100 of 74057)
PASS: LLVM-Unit :: Support/./SupportTests/ScaledNumberHelpersTest.getLgCeiling (73101 of 74057)
PASS: LLVM-Unit :: Support/./SupportTests/ScaledNumberHelpersTest.getLg (73102 of 74057)
PASS: LLVM-Unit :: Support/./SupportTests/ScaledNumberHelpersTest.getAdjusted (73103 of 74057)
PASS: LLVM-Unit :: Support/./SupportTests/ScaledNumberHelpersTest.getProduct (73104 of 74057)
PASS: LLVM-Unit :: Support/./SupportTests/ScaledNumberHelpersTest.getLgFloor (73105 of 74057)
PASS: LLVM-Unit :: Support/./SupportTests/ScaledNumberHelpersTest.getQuotient (73106 of 74057)
PASS: LLVM-Unit :: Support/./SupportTests/ScaledNumberHelpersTest.getRounded (73107 of 74057)
PASS: LLVM-Unit :: Support/./SupportTests/ScaledNumberHelpersTest.getSum (73108 of 74057)
PASS: LLVM-Unit :: Support/./SupportTests/ScaledNumberHelpersTest.matchScales (73109 of 74057)
PASS: LLVM-Unit :: Support/./SupportTests/ScaledNumberHelpersTest.toIntBug (73110 of 74057)
PASS: LLVM-Unit :: Support/./SupportTests/SourceMgrTest.BasicError (73111 of 74057)
PASS: LLVM-Unit :: Support/./SupportTests/SourceMgrTest.BasicRemark (73112 of 74057)
PASS: LLVM-Unit :: Support/./SupportTests/SourceMgrTest.BasicNote (73113 of 74057)
PASS: LLVM-Unit :: Support/./SupportTests/SourceMgrTest.BasicFixit (73114 of 74057)
PASS: LLVM-Unit :: Support/./SupportTests/SourceMgrTest.BasicRange (73115 of 74057)
PASS: LLVM-Unit :: Support/./SupportTests/SourceMgrTest.BasicWarning (73116 of 74057)
PASS: LLVM-Unit :: Support/./SupportTests/SourceMgrTest.LocationAtEmptyBuffer (73117 of 74057)
PASS: LLVM-Unit :: Support/./SupportTests/SourceMgrTest.FixitForTab (73118 of 74057)
PASS: LLVM-Unit :: Support/./SupportTests/SourceMgrTest.LocationAtEndOf255ByteBufferEndingInNewline (73119 of 74057)
PASS: LLVM-Unit :: Support/./SupportTests/SourceMgrTest.LocationAtEndOf255ByteBuffer (73120 of 74057)
PASS: LLVM-Unit :: Support/./SupportTests/SourceMgrTest.LocationAtEndOf256ByteBuffer (73121 of 74057)
PASS: LLVM-Unit :: Support/./SupportTests/SourceMgrTest.LocationAtEndOf256ByteBufferEndingInNewline (73122 of 74057)
PASS: LLVM-Unit :: Support/./SupportTests/SourceMgrTest.LocationAtEndOf257ByteBuffer (73123 of 74057)
PASS: LLVM-Unit :: Support/./SupportTests/SourceMgrTest.LocationAtNewline (73124 of 74057)
PASS: LLVM-Unit :: Support/./SupportTests/SourceMgrTest.LocationAtEndOf257ByteBufferEndingInNewline (73125 of 74057)
PASS: LLVM-Unit :: Support/./SupportTests/SourceMgrTest.LocationAtEndOfLine (73126 of 74057)
PASS: LLVM-Unit :: Support/./SupportTests/SourceMgrTest.LocationBeforeEndOf255ByteBufferEndingInNewline (73127 of 74057)
PASS: LLVM-Unit :: Support/./SupportTests/SourceMgrTest.LocationBeforeEndOf257ByteBuffer (73128 of 74057)
PASS: LLVM-Unit :: Support/./SupportTests/SourceMgrTest.LocationBeforeEndOf256ByteBuffer (73129 of 74057)
PASS: LLVM-Unit :: Support/./SupportTests/SourceMgrTest.LocationBeforeEndOf256ByteBufferEndingInNewline (73130 of 74057)
PASS: LLVM-Unit :: Support/./SupportTests/SourceMgrTest.LocationBeforeEndOf255ByteBuffer (73131 of 74057)
PASS: LLVM-Unit :: Support/./SupportTests/SourceMgrTest.LocationBeforeEndOf257ByteBufferEndingInNewline (73132 of 74057)
PASS: LLVM-Unit :: Support/./SupportTests/SourceMgrTest.LocationJustAfterNonNewline (73133 of 74057)
PASS: LLVM-Unit :: Support/./SupportTests/SourceMgrTest.LocationJustAfterSoleNewline (73134 of 74057)
PASS: LLVM-Unit :: Support/./SupportTests/SourceMgrTest.LocationJustOnSoleNewline (73135 of 74057)
PASS: LLVM-Unit :: Support/./SupportTests/ProgramEnvTest.TestLockFile (73136 of 74057)
PASS: LLVM-Unit :: Support/./SupportTests/SourceMgrTest.LocationOnEOLOfFirstLineOfMultiline (73137 of 74057)
PASS: LLVM-Unit :: Support/./SupportTests/SourceMgrTest.LocationOnEOLOfSecondSecondLineOfMultiline (73138 of 74057)
PASS: LLVM-Unit :: Support/./SupportTests/SourceMgrTest.LocationOnSecondLineOfMultilineNoSecondEOL (73139 of 74057)
PASS: LLVM-Unit :: Support/./SupportTests/SourceMgrTest.LocationOnSecondLineOfMultiline (73140 of 74057)
PASS: LLVM-Unit :: Support/./SupportTests/SourceMgrTest.LocationOnFirstLineOfMultiline (73141 of 74057)
PASS: LLVM-Unit :: Support/./SupportTests/SourceMgrTest.LocationPastEndOf256ByteBuffer (73142 of 74057)
PASS: LLVM-Unit :: Support/./SupportTests/SourceMgrTest.LocationPastEndOf255ByteBuffer (73143 of 74057)
PASS: LLVM-Unit :: Support/./SupportTests/SourceMgrTest.LocationPastEndOf255ByteBufferEndingInNewline (73144 of 74057)
PASS: LLVM-Unit :: Support/./SupportTests/SourceMgrTest.LocationPastEndOf256ByteBufferEndingInNewline (73145 of 74057)
PASS: LLVM-Unit :: Support/./SupportTests/SourceMgrTest.LocationPastEndOf257ByteBuffer (73146 of 74057)
PASS: LLVM-Unit :: Support/./SupportTests/SourceMgrTest.LocationPastEndOf257ByteBufferEndingInNewline (73147 of 74057)
PASS: LLVM-Unit :: Support/./SupportTests/SourceMgrTest.MultiLineRange (73148 of 74057)
PASS: LLVM-Unit :: Support/./SupportTests/SourceMgrTest.MultipleRanges (73149 of 74057)
PASS: LLVM-Unit :: Support/./SupportTests/SourceMgrTest.OverlappingRanges (73150 of 74057)
PASS: LLVM-Unit :: Support/./SupportTests/SpecialCaseListTest.CorrectErrorLineNumberWithBlankLine (73151 of 74057)
PASS: LLVM-Unit :: Support/./SupportTests/SourceMgrTest.RangeWithTab (73152 of 74057)
PASS: LLVM-Unit :: Support/./SupportTests/SpecialCaseListTest.GlobalInit (73153 of 74057)
PASS: LLVM-Unit :: Support/./SupportTests/SpecialCaseListTest.EmptySpecialCaseList (73154 of 74057)
PASS: LLVM-Unit :: Support/./SupportTests/SpecialCaseListTest.Basic (73155 of 74057)
PASS: LLVM-Unit :: Support/./SupportTests/SpecialCaseListTest.InvalidSpecialCaseList (73156 of 74057)
PASS: LLVM-Unit :: Support/./SupportTests/SpecialCaseListTest.EscapedSymbols (73157 of 74057)
PASS: LLVM-Unit :: Support/./SupportTests/SpecialCaseListTest.MultipleExclusions (73158 of 74057)
PASS: LLVM-Unit :: Support/./SupportTests/SpecialCaseListTest.NoTrigramsInARule (73159 of 74057)
PASS: LLVM-Unit :: Support/./SupportTests/SpecialCaseListTest.NoTrigramsInRules (73160 of 74057)
PASS: LLVM-Unit :: Support/./SupportTests/SpecialCaseListTest.PopularTrigram (73161 of 74057)
PASS: LLVM-Unit :: Support/./SupportTests/SpecialCaseListTest.RepetitiveRule (73162 of 74057)
PASS: LLVM-Unit :: Support/./SupportTests/SpecialCaseListTest.SectionRegexErrorHandling (73163 of 74057)
PASS: LLVM-Unit :: Support/./SupportTests/SpecialCaseListTest.SpecialSymbolRule (73164 of 74057)
PASS: LLVM-Unit :: Support/./SupportTests/SpecialCaseListTest.Section (73165 of 74057)
PASS: LLVM-Unit :: Support/./SupportTests/StackAlign.testAttribute (73166 of 74057)
PASS: LLVM-Unit :: Support/./SupportTests/SpecialCaseListTest.Substring (73167 of 74057)
PASS: LLVM-Unit :: Support/./SupportTests/SuffixTreeTest.TestLongerRepetition (73168 of 74057)
PASS: LLVM-Unit :: Support/./SupportTests/SuffixTreeTest.TestSingleCharacterRepeat (73169 of 74057)
PASS: LLVM-Unit :: Support/./SupportTests/SuffixTreeTest.TestExclusion (73170 of 74057)
PASS: LLVM-Unit :: Support/./SupportTests/SuffixTreeTest.TestSingleRepetition (73171 of 74057)
PASS: LLVM-Unit :: Support/./SupportTests/SuffixTreeTest.TestTandemRepeat (73172 of 74057)
PASS: LLVM-Unit :: Support/./SupportTests/Support.AbsolutePathIteratorEnd (73173 of 74057)
PASS: LLVM-Unit :: Support/./SupportTests/Support.ConfigDirectory (73174 of 74057)
PASS: LLVM-Unit :: Support/./SupportTests/Support.FilenameParent (73175 of 74057)
PASS: LLVM-Unit :: Support/./SupportTests/Support.HomeDirectory (73176 of 74057)
PASS: LLVM-Unit :: Support/./SupportTests/Support.NormalizePath (73177 of 74057)
PASS: LLVM-Unit :: Support/./SupportTests/Support.PathIterator (73178 of 74057)
PASS: LLVM-Unit :: Support/./SupportTests/Support.PathRoot (73179 of 74057)
PASS: LLVM-Unit :: Support/./SupportTests/Support.RemoveDots (73180 of 74057)
PASS: LLVM-Unit :: Support/./SupportTests/Support.ReplacePathPrefix (73181 of 74057)
PASS: LLVM-Unit :: Support/./SupportTests/Support.Path (73182 of 74057)
PASS: LLVM-Unit :: Support/./SupportTests/Support.RemoveLeadingDotSlash (73183 of 74057)
PASS: LLVM-Unit :: Support/./SupportTests/Support.TempDirectory (73184 of 74057)
PASS: LLVM-Unit :: Support/./SupportTests/SymbolRemappingReaderTest.DemanglingErrors (73185 of 74057)
PASS: LLVM-Unit :: Support/./SupportTests/SymbolRemappingReaderTest.BadMappingOrder (73186 of 74057)
PASS: LLVM-Unit :: Support/./SupportTests/SymbolRemappingReaderTest.ParseErrors (73187 of 74057)
PASS: LLVM-Unit :: Support/./SupportTests/SymbolRemappingReaderTest.RemappingsAdded (73188 of 74057)
PASS: LLVM-Unit :: Support/./SupportTests/T2EEBuildAttr.testBuildAttr (73189 of 74057)
PASS: LLVM-Unit :: Support/./SupportTests/TarWriterTest.Pax (73190 of 74057)
PASS: LLVM-Unit :: Support/./SupportTests/TargetParserTest.AArch64ArchExtFeature (73191 of 74057)
PASS: LLVM-Unit :: Support/./SupportTests/TarWriterTest.Basics (73192 of 74057)
PASS: LLVM-Unit :: Support/./SupportTests/TarWriterTest.Duplicate (73193 of 74057)
PASS: LLVM-Unit :: Support/./SupportTests/TarWriterTest.NoDuplicate (73194 of 74057)
PASS: LLVM-Unit :: Support/./SupportTests/TarWriterTest.SingleFile (73195 of 74057)
PASS: LLVM-Unit :: Support/./SupportTests/TarWriterTest.LongFilename (73196 of 74057)
PASS: LLVM-Unit :: Support/./SupportTests/TargetParserTest.AArch64ArchFeatures (73197 of 74057)
PASS: LLVM-Unit :: Support/./SupportTests/TargetParserTest.AArch64ExtensionFeatures (73198 of 74057)
PASS: LLVM-Unit :: Support/./SupportTests/TargetParserTest.ARMArchExtFeature (73199 of 74057)
PASS: LLVM-Unit :: Support/./SupportTests/TargetParserTest.ARMArchExtDependencies (73200 of 74057)
PASS: LLVM-Unit :: Support/./SupportTests/TargetParserTest.ARMExtensionFeatures (73201 of 74057)
PASS: LLVM-Unit :: Support/./SupportTests/TargetParserTest.ARMFPUFeatures (73202 of 74057)
PASS: LLVM-Unit :: Support/./SupportTests/TargetParserTest.ARMFPURestriction (73203 of 74057)
PASS: LLVM-Unit :: Support/./SupportTests/TargetParserTest.ARMFPUNeonSupportLevel (73204 of 74057)
PASS: LLVM-Unit :: Support/./SupportTests/TargetParserTest.ARMparseArchVersion (73205 of 74057)
PASS: LLVM-Unit :: Support/./SupportTests/TargetParserTest.ARMparseArchEndianAndISA (73206 of 74057)
PASS: LLVM-Unit :: Support/./SupportTests/TargetParserTest.ARMFPUVersion (73207 of 74057)
PASS: LLVM-Unit :: Support/./SupportTests/TargetParserTest.ARMparseArchProfile (73208 of 74057)
PASS: LLVM-Unit :: Support/./SupportTests/TargetParserTest.ARMparseHWDiv (73209 of 74057)
PASS: LLVM-Unit :: Support/./SupportTests/TargetParserTest.testAArch64Arch (73210 of 74057)
PASS: LLVM-Unit :: Support/./SupportTests/TargetParserTest.testAArch64CPUArchList (73211 of 74057)
PASS: LLVM-Unit :: Support/./SupportTests/TargetParserTest.testAArch64Extension (73212 of 74057)
PASS: LLVM-Unit :: Support/./SupportTests/TargetParserTest.testARMArch (73213 of 74057)
PASS: LLVM-Unit :: Support/./SupportTests/TargetParserTest.testARMCPUArchList (73214 of 74057)
PASS: LLVM-Unit :: Support/./SupportTests/TargetParserTest.testARMExtension (73215 of 74057)
PASS: LLVM-Unit :: Support/./SupportTests/TaskQueueTest.FutureWithReturnValue (73216 of 74057)
PASS: LLVM-Unit :: Support/./SupportTests/ThreadLocalTest.Basics (73217 of 74057)
PASS: LLVM-Unit :: Support/./SupportTests/TargetParserTest.testInvalidARMArch (73218 of 74057)
PASS: LLVM-Unit :: Support/./SupportTests/TaskQueueTest.UnOrderedFutures (73219 of 74057)
PASS: LLVM-Unit :: Support/./SupportTests/TaskQueueTest.OrderedFutures (73220 of 74057)
PASS: LLVM-Unit :: Support/./SupportTests/ThreadPoolTest.Async (73221 of 74057)
PASS: LLVM-Unit :: Support/./SupportTests/ThreadPoolTest.AsyncBarrier (73222 of 74057)
PASS: LLVM-Unit :: Support/./SupportTests/ThreadPoolTest.AsyncBarrierArgs (73223 of 74057)
PASS: LLVM-Unit :: Support/./SupportTests/Threading.AppleStackSize (73224 of 74057)
PASS: LLVM-Unit :: Support/./SupportTests/ThreadPoolTest.PoolDestruction (73225 of 74057)
PASS: LLVM-Unit :: Support/./SupportTests/ThreadPoolTest.GetFuture (73226 of 74057)
PASS: LLVM-Unit :: Support/./SupportTests/Threading.PhysicalConcurrency (73227 of 74057)
PASS: LLVM-Unit :: Support/./SupportTests/Threading.RunOnThreadSyncAsync (73228 of 74057)
PASS: LLVM-Unit :: Support/./SupportTests/ThumbISABuildAttr.testBuildAttr (73229 of 74057)
PASS: LLVM-Unit :: Support/./SupportTests/Timer.CheckIfTriggered (73230 of 74057)
PASS: LLVM-Unit :: Support/./SupportTests/ToolOutputFileTest.DashOpensOuts (73231 of 74057)
PASS: LLVM-Unit :: Support/./SupportTests/Threading.RunOnThreadSync (73232 of 74057)
PASS: LLVM-Unit :: Support/./SupportTests/TrailingObjects.OneArg (73233 of 74057)
PASS: LLVM-Unit :: Support/./SupportTests/Timer.Additivity (73234 of 74057)
PASS: LLVM-Unit :: Support/./SupportTests/TrailingObjects.Realignment (73235 of 74057)
PASS: LLVM-Unit :: Support/./SupportTests/TrailingObjects.ThreeArg (73236 of 74057)
PASS: LLVM-Unit :: Support/./SupportTests/TrigramIndexTest.Backreference2 (73237 of 74057)
PASS: LLVM-Unit :: Support/./SupportTests/TrailingObjects.TwoArg (73238 of 74057)
PASS: LLVM-Unit :: Support/./SupportTests/TrigramIndexTest.Backreference1 (73239 of 74057)
PASS: LLVM-Unit :: Support/./SupportTests/TrigramIndexTest.Basic (73240 of 74057)
PASS: LLVM-Unit :: Support/./SupportTests/TrigramIndexTest.Empty (73241 of 74057)
PASS: LLVM-Unit :: Support/./SupportTests/TrigramIndexTest.NoTrigramsInRules (73242 of 74057)
PASS: LLVM-Unit :: Support/./SupportTests/TrigramIndexTest.EscapedSymbols (73243 of 74057)
PASS: LLVM-Unit :: Support/./SupportTests/TrigramIndexTest.RepetitiveRule (73244 of 74057)
PASS: LLVM-Unit :: Support/./SupportTests/TrigramIndexTest.PopularTrigram (73245 of 74057)
PASS: LLVM-Unit :: Support/./SupportTests/TrigramIndexTest.PopularTrigram2 (73246 of 74057)
PASS: LLVM-Unit :: Support/./SupportTests/TrigramIndexTest.NoTrigramsInARule (73247 of 74057)
PASS: LLVM-Unit :: Support/./SupportTests/TrigramIndexTest.Sequence (73248 of 74057)
PASS: LLVM-Unit :: Support/./SupportTests/TrigramIndexTest.TooComplicatedRegex (73249 of 74057)
PASS: LLVM-Unit :: Support/./SupportTests/Triviality.ADT (73250 of 74057)
PASS: LLVM-Unit :: Support/./SupportTests/TrigramIndexTest.TooComplicatedRegex2 (73251 of 74057)
PASS: LLVM-Unit :: Support/./SupportTests/Triviality.Tester (73252 of 74057)
PASS: LLVM-Unit :: Support/./SupportTests/TypeNameTest.Names (73253 of 74057)
PASS: LLVM-Unit :: Support/./SupportTests/Unicode.columnWidthUTF8 (73254 of 74057)
PASS: LLVM-Unit :: Support/./SupportTests/UnalignedAccess.testAttribute (73255 of 74057)
PASS: LLVM-Unit :: Support/./SupportTests/UnivariateLinearPolyBase.Univariate3D_Add (73256 of 74057)
PASS: LLVM-Unit :: Support/./SupportTests/Unicode.isPrintable (73257 of 74057)
PASS: LLVM-Unit :: Support/./SupportTests/UnivariateLinearPolyBase.Univariate3D_GetValue (73258 of 74057)
PASS: LLVM-Unit :: Support/./SupportTests/UnivariateLinearPolyBase.Univariate3D_Equality (73259 of 74057)
PASS: LLVM-Unit :: Support/./SupportTests/UnivariateLinearPolyBase.Univariate3D_Invert (73260 of 74057)
PASS: LLVM-Unit :: Support/./SupportTests/UnivariateLinearPolyBase.Univariate3D_Scale (73261 of 74057)
PASS: LLVM-Unit :: Support/./SupportTests/UnivariateLinearPolyBase.Univariate3D_Sub (73262 of 74057)
PASS: LLVM-Unit :: Support/./SupportTests/UnivariateLinearPolyBase.Univariate3D_isZero (73263 of 74057)
PASS: LLVM-Unit :: Support/./SupportTests/MemoryBufferTest.getOpenFileNoReopen (73264 of 74057)
PASS: LLVM-Unit :: Support/./SupportTests/ProgramEnvTest.TestExecuteAndWaitTimeout (73265 of 74057)
PASS: LLVM-Unit :: Support/./SupportTests/ProgramEnvTest.TestExecuteNoWait (73266 of 74057)
PASS: LLVM-Unit :: Support/./SupportTests/VFPArgsBuildAttr.testBuildAttr (73267 of 74057)
PASS: LLVM-Unit :: Support/./SupportTests/VFSFromRemappedFilesTest.UseExternalNames (73268 of 74057)
PASS: LLVM-Unit :: Support/./SupportTests/VFSFromYAMLTest.BasicVFSFromYAML (73269 of 74057)
PASS: LLVM-Unit :: Support/./SupportTests/VFSFromRemappedFilesTest.LastMappingWins (73270 of 74057)
PASS: LLVM-Unit :: Support/./SupportTests/VFSFromYAMLTest.CaseSensitive (73271 of 74057)
PASS: LLVM-Unit :: Support/./SupportTests/VFSFromYAMLTest.DirectoryIteration (73272 of 74057)
PASS: LLVM-Unit :: Support/./SupportTests/VFSFromRemappedFilesTest.Basic (73273 of 74057)
PASS: LLVM-Unit :: Support/./SupportTests/VFSFromYAMLTest.DirectoryIterationSameDirMultipleEntries (73274 of 74057)
PASS: LLVM-Unit :: Support/./SupportTests/VFSFromYAMLTest.CaseInsensitive (73275 of 74057)
PASS: LLVM-Unit :: Support/./SupportTests/VFSFromYAMLTest.GetRealPath (73276 of 74057)
PASS: LLVM-Unit :: Support/./SupportTests/VFSFromYAMLTest.DirectoryIterationErrorInVFSLayer (73277 of 74057)
PASS: LLVM-Unit :: Support/./SupportTests/VFSFromYAMLTest.DirectoryIterationWithDuplicates (73278 of 74057)
PASS: LLVM-Unit :: Support/./SupportTests/VFSFromYAMLTest.MappedFiles (73279 of 74057)
PASS: LLVM-Unit :: Support/./SupportTests/VFSFromYAMLTest.MappedRoot (73280 of 74057)
PASS: LLVM-Unit :: Support/./SupportTests/VFSFromYAMLTest.IllegalVFSFile (73281 of 74057)
PASS: LLVM-Unit :: Support/./SupportTests/VFSFromYAMLTest.MultiComponentPath (73282 of 74057)
PASS: LLVM-Unit :: Support/./SupportTests/VFSFromYAMLTest.NonFallthroughDirectoryIteration (73283 of 74057)
PASS: LLVM-Unit :: Support/./SupportTests/VFSFromYAMLTest.RelativePaths (73284 of 74057)
PASS: LLVM-Unit :: Support/./SupportTests/VFSFromYAMLTest.RemappedDirectoryOverlayNoExternalNames (73285 of 74057)
PASS: LLVM-Unit :: Support/./SupportTests/VFSFromYAMLTest.RemappedDirectoryOverlay (73286 of 74057)
PASS: LLVM-Unit :: Support/./SupportTests/VFSFromYAMLTest.RecursiveDirectoryIterationLevel (73287 of 74057)
PASS: LLVM-Unit :: Support/./SupportTests/VFSFromYAMLTest.TrailingSlashes (73288 of 74057)
PASS: LLVM-Unit :: Support/./SupportTests/VFSFromYAMLTest.VirtualWorkingDirectory (73289 of 74057)
PASS: LLVM-Unit :: Support/./SupportTests/VFSFromYAMLTest.RemappedDirectoryOverlayNoFallthrough (73290 of 74057)
PASS: LLVM-Unit :: Support/./SupportTests/VFSFromYAMLTest.WorkingDirectory (73291 of 74057)
PASS: LLVM-Unit :: Support/./SupportTests/VFSFromYAMLTest.WorkingDirectoryFallthrough (73292 of 74057)
PASS: LLVM-Unit :: Support/./SupportTests/VFSFromYAMLTest.WorkingDirectoryFallthroughInvalid (73293 of 74057)
PASS: LLVM-Unit :: Support/./SupportTests/VFSFromYAMLTest.UseExternalName (73294 of 74057)
PASS: LLVM-Unit :: Support/./SupportTests/VFSFromYAMLTest.YAMLVFSWriterTest (73295 of 74057)
PASS: LLVM-Unit :: Support/./SupportTests/VFSFromYAMLTest.YAMLVFSWriterTest2 (73296 of 74057)
PASS: LLVM-Unit :: Support/./SupportTests/VFSFromYAMLTest.YAMLVFSWriterTest3 (73297 of 74057)
PASS: LLVM-Unit :: Support/./SupportTests/VFSFromYAMLTest.YAMLVFSWriterTestHandleDirs (73298 of 74057)
PASS: LLVM-Unit :: Support/./SupportTests/VersionTuple.tryParse (73299 of 74057)
PASS: LLVM-Unit :: Support/./SupportTests/VersionTuple.getAsString (73300 of 74057)
PASS: LLVM-Unit :: Support/./SupportTests/VirtualFileSystemTest.BaseOnlyOverlay (73301 of 74057)
PASS: LLVM-Unit :: Support/./SupportTests/VirtualFileSystemTest.GetRealPathInOverlay (73302 of 74057)
PASS: LLVM-Unit :: Support/./SupportTests/VirtualFileSystemTest.HiddenInIteration (73303 of 74057)
PASS: LLVM-Unit :: Support/./SupportTests/VirtualFileSystemTest.MergedDirPermissions (73304 of 74057)
PASS: LLVM-Unit :: Support/./SupportTests/VirtualFileSystemTest.BasicRealFSIteration (73305 of 74057)
PASS: LLVM-Unit :: Support/./SupportTests/VirtualFileSystemTest.BasicRealFSRecursiveIteration (73306 of 74057)
PASS: LLVM-Unit :: Support/./SupportTests/VirtualFileSystemTest.BrokenSymlinkRealFSIteration (73307 of 74057)
PASS: LLVM-Unit :: Support/./SupportTests/VirtualFileSystemTest.BasicRealFSRecursiveIterationNoPush (73308 of 74057)
PASS: LLVM-Unit :: Support/./SupportTests/VirtualFileSystemTest.BrokenSymlinkRealFSRecursiveIteration (73309 of 74057)
PASS: LLVM-Unit :: Support/./SupportTests/VirtualFileSystemTest.MultipleWorkingDirs (73310 of 74057)
PASS: LLVM-Unit :: Support/./SupportTests/VirtualFileSystemTest.OverlayDirsNonMerged (73311 of 74057)
PASS: LLVM-Unit :: Support/./SupportTests/VirtualFileSystemTest.OverlayFiles (73312 of 74057)
PASS: LLVM-Unit :: Support/./SupportTests/VirtualFileSystemTest.OverlayIteration (73313 of 74057)
PASS: LLVM-Unit :: Support/./SupportTests/VirtualFileSystemTest.OverlayIterator (73314 of 74057)
PASS: LLVM-Unit :: Support/./SupportTests/VirtualFileSystemTest.StatusQueries (73315 of 74057)
PASS: LLVM-Unit :: Support/./SupportTests/VirtualFileSystemTest.OverlayRecursiveIteration (73316 of 74057)
PASS: LLVM-Unit :: Support/./SupportTests/VirtualFileSystemTest.ThreeLevelIteration (73317 of 74057)
PASS: LLVM-Unit :: Support/./SupportTests/VirtualizationBuildAttr.testBuildAttr (73318 of 74057)
PASS: LLVM-Unit :: Support/./SupportTests/WMMXBuildAttr.testBuildAttr (73319 of 74057)
PASS: LLVM-Unit :: Support/./SupportTests/WMMXArgsBuildAttr.testBuildAttr (73320 of 74057)
PASS: LLVM-Unit :: Support/./SupportTests/YAMLIO.NoQuotesForTab (73321 of 74057)
PASS: LLVM-Unit :: Support/./SupportTests/WithColorTest.ColorMode (73322 of 74057)
PASS: LLVM-Unit :: Support/./SupportTests/YAMLIO.MultilineStrings (73323 of 74057)
PASS: LLVM-Unit :: Support/./SupportTests/YAMLIO.Numeric (73324 of 74057)
PASS: LLVM-Unit :: Support/./SupportTests/YAMLIO.SequenceElideTest (73325 of 74057)
PASS: LLVM-Unit :: Support/./SupportTests/YAMLIO.TestColorsReadError (73326 of 74057)
PASS: LLVM-Unit :: Support/./SupportTests/YAMLIO.TestAnchorMapError (73327 of 74057)
PASS: LLVM-Unit :: Support/./SupportTests/YAMLIO.TestContainerSequenceMapRead (73328 of 74057)
PASS: LLVM-Unit :: Support/./SupportTests/YAMLIO.TestCustomMapping (73329 of 74057)
PASS: LLVM-Unit :: Support/./SupportTests/YAMLIO.TestCustomMappingStruct (73330 of 74057)
PASS: LLVM-Unit :: Support/./SupportTests/YAMLIO.TestDocRead (73331 of 74057)
PASS: LLVM-Unit :: Support/./SupportTests/YAMLIO.TestDirectiveMappingNoValue (73332 of 74057)
PASS: LLVM-Unit :: Support/./SupportTests/YAMLIO.TestEmptyAlias (73333 of 74057)
PASS: LLVM-Unit :: Support/./SupportTests/YAMLIO.TestEmptyAnchor (73334 of 74057)
PASS: LLVM-Unit :: Support/./SupportTests/YAMLIO.TestEmptyMapWrite (73335 of 74057)
PASS: LLVM-Unit :: Support/./SupportTests/YAMLIO.TestEmptySequenceWrite (73336 of 74057)
PASS: LLVM-Unit :: Support/./SupportTests/YAMLIO.TestEmptyStringFailsForMapWithRequiredFields (73337 of 74057)
PASS: LLVM-Unit :: Support/./SupportTests/YAMLIO.TestEmptyStringSucceedsForMapWithOptionalFields (73338 of 74057)
PASS: LLVM-Unit :: Support/./SupportTests/YAMLIO.TestEmptyStringSucceedsForSequence (73339 of 74057)
PASS: LLVM-Unit :: Support/./SupportTests/YAMLIO.TestEnumRead (73340 of 74057)
PASS: LLVM-Unit :: Support/./SupportTests/YAMLIO.TestEscaped (73341 of 74057)
PASS: LLVM-Unit :: Support/./SupportTests/YAMLIO.TestFlagsReadError (73342 of 74057)
PASS: LLVM-Unit :: Support/./SupportTests/YAMLIO.TestFlagsRead (73343 of 74057)
PASS: LLVM-Unit :: Support/./SupportTests/YAMLIO.TestFlowSequenceTokenErrors (73344 of 74057)
PASS: LLVM-Unit :: Support/./SupportTests/YAMLIO.TestGivenFilename (73345 of 74057)
PASS: LLVM-Unit :: Support/./SupportTests/YAMLIO.TestMalformedContainerSequenceMapRead (73346 of 74057)
PASS: LLVM-Unit :: Support/./SupportTests/YAMLIO.TestMalformedMapFailsGracefully (73347 of 74057)
PASS: LLVM-Unit :: Support/./SupportTests/YAMLIO.TestMalformedMapRead (73348 of 74057)
PASS: LLVM-Unit :: Support/./SupportTests/YAMLIO.TestMapWithContext (73349 of 74057)
PASS: LLVM-Unit :: Support/./SupportTests/YAMLIO.TestReadBuiltInTypesDoubleError (73350 of 74057)
PASS: LLVM-Unit :: Support/./SupportTests/YAMLIO.TestReadBuiltInTypesFloatError (73351 of 74057)
PASS: LLVM-Unit :: Support/./SupportTests/YAMLIO.TestReadBuiltInTypes (73352 of 74057)
PASS: LLVM-Unit :: Support/./SupportTests/YAMLIO.TestReadBuiltInTypesHex16Error (73353 of 74057)
PASS: LLVM-Unit :: Support/./SupportTests/YAMLIO.TestMapRead (73354 of 74057)
PASS: LLVM-Unit :: Support/./SupportTests/YAMLIO.TestReadBuiltInTypesHex32Error (73355 of 74057)
PASS: LLVM-Unit :: Support/./SupportTests/YAMLIO.TestReadBuiltInTypesHex64Error (73356 of 74057)
PASS: LLVM-Unit :: Support/./SupportTests/YAMLIO.TestReadBuiltInTypesHex8Error (73357 of 74057)
PASS: LLVM-Unit :: Support/./SupportTests/YAMLIO.TestReadBuiltInTypesUint16Error (73358 of 74057)
PASS: LLVM-Unit :: Support/./SupportTests/YAMLIO.TestReadBuiltInTypesUint64Error (73359 of 74057)
PASS: LLVM-Unit :: Support/./SupportTests/YAMLIO.TestReadBuiltInTypesUint32Error (73360 of 74057)
PASS: LLVM-Unit :: Support/./SupportTests/YAMLIO.TestReadBuiltInTypesint16OverError (73361 of 74057)
PASS: LLVM-Unit :: Support/./SupportTests/YAMLIO.TestReadBuiltInTypesUint8Error (73362 of 74057)
PASS: LLVM-Unit :: Support/./SupportTests/YAMLIO.TestReadBuiltInTypesint32OverError (73363 of 74057)
PASS: LLVM-Unit :: Support/./SupportTests/YAMLIO.TestReadBuiltInTypesint16UnderError (73364 of 74057)
PASS: LLVM-Unit :: Support/./SupportTests/YAMLIO.TestReadBuiltInTypesint32UnderError (73365 of 74057)
PASS: LLVM-Unit :: Support/./SupportTests/YAMLIO.TestReadBuiltInTypesint64OverError (73366 of 74057)
PASS: LLVM-Unit :: Support/./SupportTests/YAMLIO.TestReadBuiltInTypesint64UnderError (73367 of 74057)
PASS: LLVM-Unit :: Support/./SupportTests/YAMLIO.TestReadBuiltInTypesint8OverError (73368 of 74057)
PASS: LLVM-Unit :: Support/./SupportTests/YAMLIO.TestReadEndianEnums (73369 of 74057)
PASS: LLVM-Unit :: Support/./SupportTests/YAMLIO.TestReadBuiltInTypesint8UnderError (73370 of 74057)
PASS: LLVM-Unit :: Support/./SupportTests/YAMLIO.TestReadKindAndFlagsSequence (73371 of 74057)
PASS: LLVM-Unit :: Support/./SupportTests/YAMLIO.TestReadEndianTypes (73372 of 74057)
PASS: LLVM-Unit :: Support/./SupportTests/YAMLIO.TestReadMySecondsSequence (73373 of 74057)
PASS: LLVM-Unit :: Support/./SupportTests/YAMLIO.TestReadWriteBlockScalarDocuments (73374 of 74057)
PASS: LLVM-Unit :: Support/./SupportTests/YAMLIO.TestReadWriteBuiltInTypes (73375 of 74057)
PASS: LLVM-Unit :: Support/./SupportTests/YAMLIO.TestReadWriteBlockScalarValue (73376 of 74057)
PASS: LLVM-Unit :: Support/./SupportTests/YAMLIO.TestReadWriteEndianEnums (73377 of 74057)
PASS: LLVM-Unit :: Support/./SupportTests/YAMLIO.TestReadWriteEndianTypes (73378 of 74057)
PASS: LLVM-Unit :: Support/./SupportTests/YAMLIO.TestReadWriteFlags (73379 of 74057)
PASS: LLVM-Unit :: Support/./SupportTests/YAMLIO.TestReadWriteKindAndFlagsSequence (73380 of 74057)
PASS: LLVM-Unit :: Support/./SupportTests/YAMLIO.TestReadWriteMultilineStringType (73381 of 74057)
PASS: LLVM-Unit :: Support/./SupportTests/YAMLIO.TestReadWriteMyFlowSequence (73382 of 74057)
PASS: LLVM-Unit :: Support/./SupportTests/YAMLIO.TestReadWriteMyCustomType (73383 of 74057)
PASS: LLVM-Unit :: Support/./SupportTests/YAMLIO.TestReadWriteMyFlowMapping (73384 of 74057)
PASS: LLVM-Unit :: Support/./SupportTests/YAMLIO.TestReadWriteMySecondsSequence (73385 of 74057)
PASS: LLVM-Unit :: Support/./SupportTests/YAMLIO.TestReadWritePolymorphicMap (73386 of 74057)
PASS: LLVM-Unit :: Support/./SupportTests/YAMLIO.TestReadWriteSequenceOfMyFlowSequence (73387 of 74057)
PASS: LLVM-Unit :: Support/./SupportTests/YAMLIO.TestReadWritePolymorphicSeq (73388 of 74057)
PASS: LLVM-Unit :: Support/./SupportTests/YAMLIO.TestReadWritePolymorphicScalar (73389 of 74057)
PASS: LLVM-Unit :: Support/./SupportTests/YAMLIO.TestScannerNoNullEmpty (73390 of 74057)
PASS: LLVM-Unit :: Support/./SupportTests/YAMLIO.TestScannerNoNullDecodeInvalidUTF8 (73391 of 74057)
PASS: LLVM-Unit :: Support/./SupportTests/YAMLIO.TestReadWriteStringTypes (73392 of 74057)
PASS: LLVM-Unit :: Support/./SupportTests/YAMLIO.TestScannerNoNullEmptyAnchor (73393 of 74057)
PASS: LLVM-Unit :: Support/./SupportTests/YAMLIO.TestScannerNoNullEmptyAlias (73394 of 74057)
PASS: LLVM-Unit :: Support/./SupportTests/YAMLIO.TestScannerNoNullEmptyMap (73395 of 74057)
PASS: LLVM-Unit :: Support/./SupportTests/YAMLIO.TestScannerNoNullEmptySequence (73396 of 74057)
PASS: LLVM-Unit :: Support/./SupportTests/YAMLIO.TestScannerNoNullSequenceOfNull (73397 of 74057)
PASS: LLVM-Unit :: Support/./SupportTests/YAMLIO.TestScannerNoNullScanPlainScalarInFlow (73398 of 74057)
PASS: LLVM-Unit :: Support/./SupportTests/YAMLIO.TestScannerNoNullScalarUnbalancedSingleQuote (73399 of 74057)
PASS: LLVM-Unit :: Support/./SupportTests/YAMLIO.TestScannerNoNullScalarUnbalancedDoubleQuote (73400 of 74057)
PASS: LLVM-Unit :: Support/./SupportTests/YAMLIO.TestScannerNoNullSimpleSequence (73401 of 74057)
PASS: LLVM-Unit :: Support/./SupportTests/YAMLIO.TestSequenceDocListWriteAndRead (73402 of 74057)
PASS: LLVM-Unit :: Support/./SupportTests/YAMLIO.TestScannerNoNullUnbalancedMap (73403 of 74057)
PASS: LLVM-Unit :: Support/./SupportTests/YAMLIO.TestScannerNoNullUnbalancedSequence (73404 of 74057)
PASS: LLVM-Unit :: Support/./SupportTests/YAMLIO.TestScannerUnexpectedCharacter (73405 of 74057)
PASS: LLVM-Unit :: Support/./SupportTests/YAMLIO.TestSequenceMapRead (73406 of 74057)
PASS: LLVM-Unit :: Support/./SupportTests/YAMLIO.TestSequenceMapWriteAndRead (73407 of 74057)
PASS: LLVM-Unit :: Support/./SupportTests/YAMLIO.TestTaggedDocuments (73408 of 74057)
PASS: LLVM-Unit :: Support/./SupportTests/YAMLIO.TestTaggedDocumentsWriteAndRead (73409 of 74057)
PASS: LLVM-Unit :: Support/./SupportTests/YAMLIO.TestUnescapeInfiniteLoop (73410 of 74057)
PASS: LLVM-Unit :: Support/./SupportTests/YAMLIO.TestUnknownDirective (73411 of 74057)
PASS: LLVM-Unit :: Support/./SupportTests/YAMLIO.TestValidatingInput (73412 of 74057)
PASS: LLVM-Unit :: Support/./SupportTests/YAMLIO.TestWrapFlow (73413 of 74057)
PASS: LLVM-Unit :: Support/./SupportTests/YAMLParser.DiagnosticFilenameFromBufferID (73414 of 74057)
PASS: LLVM-Unit :: Support/./SupportTests/YAMLParser.DefaultDiagnosticFilename (73415 of 74057)
PASS: LLVM-Unit :: Support/./SupportTests/YAMLParser.DifferentNodesIteratorOperatorEquals (73416 of 74057)
PASS: LLVM-Unit :: Support/./SupportTests/YAMLParser.FailsIfMissingColon (73417 of 74057)
PASS: LLVM-Unit :: Support/./SupportTests/YAMLParser.DifferentNodesIteratorOperatorNotEquals (73418 of 74057)
PASS: LLVM-Unit :: Support/./SupportTests/YAMLParser.FailsIfNotClosingArray (73419 of 74057)
PASS: LLVM-Unit :: Support/./SupportTests/YAMLParser.FailsOnMissingComma (73420 of 74057)
PASS: LLVM-Unit :: Support/./SupportTests/YAMLParser.FailsIfNotClosingObject (73421 of 74057)
PASS: LLVM-Unit :: Support/./SupportTests/YAMLParser.FailsOnMissingQuote (73422 of 74057)
PASS: LLVM-Unit :: Support/./SupportTests/YAMLParser.HandlesEndOfFileGracefully (73423 of 74057)
PASS: LLVM-Unit :: Support/./SupportTests/YAMLParser.FlowSequenceTokensOutsideFlowSequence (73424 of 74057)
PASS: LLVM-Unit :: Support/./SupportTests/YAMLParser.NullTerminatedBlockScalars (73425 of 74057)
PASS: LLVM-Unit :: Support/./SupportTests/YAMLParser.HandlesNullValuesInKeyValueNodesGracefully (73426 of 74057)
PASS: LLVM-Unit :: Support/./SupportTests/YAMLParser.ParsesBools (73427 of 74057)
PASS: LLVM-Unit :: Support/./SupportTests/YAMLParser.ParsesArrayOfArrays (73428 of 74057)
PASS: LLVM-Unit :: Support/./SupportTests/YAMLParser.ParsesBlockLiteralScalars (73429 of 74057)
PASS: LLVM-Unit :: Support/./SupportTests/YAMLParser.ParsesEmptyArray (73430 of 74057)
PASS: LLVM-Unit :: Support/./SupportTests/YAMLParser.ParsesEmptyArrayWithWhitespace (73431 of 74057)
PASS: LLVM-Unit :: Support/./SupportTests/YAMLParser.ParsesEmptyObject (73432 of 74057)
PASS: LLVM-Unit :: Support/./SupportTests/YAMLParser.ParsesEmptyString (73433 of 74057)
PASS: LLVM-Unit :: Support/./SupportTests/YAMLParser.ParsesMultipleKeyValuePairsInObject (73434 of 74057)
PASS: LLVM-Unit :: Support/./SupportTests/YAMLParser.ParsesEscapedQuotes (73435 of 74057)
PASS: LLVM-Unit :: Support/./SupportTests/YAMLParser.ParsesMultipleObjects (73436 of 74057)
PASS: LLVM-Unit :: Support/./SupportTests/YAMLParser.ParsesObject (73437 of 74057)
PASS: LLVM-Unit :: Support/./SupportTests/YAMLParser.ParsesSpacesInBetweenTokens (73438 of 74057)
PASS: LLVM-Unit :: Support/./SupportTests/YAMLParser.ParsesStrings (73439 of 74057)
PASS: LLVM-Unit :: Support/./SupportTests/YAMLParser.SameNodeIteratorOperatorEquals (73440 of 74057)
PASS: LLVM-Unit :: Support/./SupportTests/YAMLParser.SameNodeIteratorOperatorNotEquals (73441 of 74057)
PASS: LLVM-Unit :: Support/./SupportTests/YAMLParser.WorksWithIteratorAlgorithms (73442 of 74057)
PASS: LLVM-Unit :: Support/./SupportTests/formatted_raw_ostreamTest.Test_Flush (73443 of 74057)
PASS: LLVM-Unit :: Support/./SupportTests/formatted_raw_ostreamTest.Test_LineColumn (73444 of 74057)
PASS: LLVM-Unit :: Support/./SupportTests/formatted_raw_ostreamTest.Test_Tell (73445 of 74057)
PASS: LLVM-Unit :: Support/./SupportTests/formatted_raw_ostreamTest.Test_UTF8Buffered (73446 of 74057)
PASS: LLVM-Unit :: Support/./SupportTests/formatted_raw_ostreamTest.Test_UTF8 (73447 of 74057)
PASS: LLVM-Unit :: Support/./SupportTests/formatted_raw_ostreamTest.Test_UTF8TinyBuffer (73448 of 74057)
PASS: LLVM-Unit :: Support/./SupportTests/getLinuxHostCPUName.AArch64 (73449 of 74057)
PASS: LLVM-Unit :: Support/./SupportTests/getLinuxHostCPUName.ARM (73450 of 74057)
PASS: LLVM-Unit :: Support/./SupportTests/getSwappedBytes.SignedRoundTrip (73451 of 74057)
PASS: LLVM-Unit :: Support/./SupportTests/getLinuxHostCPUName.s390x (73452 of 74057)
PASS: LLVM-Unit :: Support/./SupportTests/getSwappedBytes.UnsignedRoundTrip (73453 of 74057)
PASS: LLVM-Unit :: Support/./SupportTests/getSwappedBytes.double (73454 of 74057)
PASS: LLVM-Unit :: Support/./SupportTests/getSwappedBytes.float (73455 of 74057)
PASS: LLVM-Unit :: Support/./SupportTests/getSwappedBytes.int16_t (73456 of 74057)
PASS: LLVM-Unit :: Support/./SupportTests/getSwappedBytes.int32_t (73457 of 74057)
PASS: LLVM-Unit :: Support/./SupportTests/getSwappedBytes.int64_t (73458 of 74057)
PASS: LLVM-Unit :: Support/./SupportTests/getSwappedBytes.uint16_t (73459 of 74057)
PASS: LLVM-Unit :: Support/./SupportTests/getSwappedBytes.int8_t (73460 of 74057)
PASS: LLVM-Unit :: Support/./SupportTests/getSwappedBytes.uint32_t (73461 of 74057)
PASS: LLVM-Unit :: Support/./SupportTests/getSwappedBytes.uint64_t (73462 of 74057)
PASS: LLVM-Unit :: Support/./SupportTests/getSwappedBytes.uint8_t (73463 of 74057)
PASS: LLVM-Unit :: Support/./SupportTests/is_absolute_gnu.Works (73464 of 74057)
PASS: LLVM-Unit :: Support/./SupportTests/is_separator.Works (73465 of 74057)
PASS: LLVM-Unit :: Support/./SupportTests/raw_fd_streamTest.DynCast (73466 of 74057)
PASS: LLVM-Unit :: Support/./SupportTests/raw_fd_ostreamTest.multiple_raw_fd_ostream_to_stdout (73467 of 74057)
PASS: LLVM-Unit :: Support/./SupportTests/raw_ostreamTest.BufferEdge (73468 of 74057)
PASS: LLVM-Unit :: Support/./SupportTests/raw_fd_streamTest.ReadAfterWrite (73469 of 74057)
PASS: LLVM-Unit :: Support/./SupportTests/raw_ostreamTest.Colors (73470 of 74057)
PASS: LLVM-Unit :: Support/./SupportTests/raw_ostreamTest.FormatHex (73471 of 74057)
PASS: LLVM-Unit :: Support/./SupportTests/raw_ostreamTest.FormatDecimal (73472 of 74057)
PASS: LLVM-Unit :: Support/./SupportTests/raw_ostreamTest.Justify (73473 of 74057)
PASS: LLVM-Unit :: Support/./SupportTests/raw_ostreamTest.FormattedHexBytes (73474 of 74057)
PASS: LLVM-Unit :: Support/./SupportTests/raw_ostreamTest.TinyBuffer (73475 of 74057)
PASS: LLVM-Unit :: Support/./SupportTests/raw_ostreamTest.Types_Buffered (73476 of 74057)
PASS: LLVM-Unit :: Support/./SupportTests/raw_ostreamTest.Types_Unbuffered (73477 of 74057)
PASS: LLVM-Unit :: Support/./SupportTests/raw_ostreamTest.WriteEscaped (73478 of 74057)
PASS: LLVM-Unit :: Support/./SupportTests/raw_ostreamTest.flush_tied_to_stream_on_write (73479 of 74057)
PASS: LLVM-Unit :: Support/./SupportTests/raw_ostreamTest.reserve_stream (73480 of 74057)
PASS: LLVM-Unit :: Support/./SupportTests/raw_ostreamTest.writeToDevNull (73481 of 74057)
PASS: LLVM-Unit :: Support/./SupportTests/raw_ostreamTest.writeToNonexistingPath (73482 of 74057)
PASS: LLVM-Unit :: Support/./SupportTests/raw_ostreamTest.writeToStdOut (73483 of 74057)
PASS: LLVM-Unit :: Support/./SupportTests/raw_pwrite_ostreamTest.TestDevNull (73484 of 74057)
PASS: LLVM-Unit :: Support/./SupportTests/raw_ostreamTest.writeToOutputFile (73485 of 74057)
PASS: LLVM-Unit :: Support/./SupportTests/raw_sha1_ostreamTest.Basic (73486 of 74057)
PASS: LLVM-Unit :: Support/./SupportTests/raw_pwrite_ostreamTest.TestSVector (73487 of 74057)
PASS: LLVM-Unit :: Support/./SupportTests/raw_pwrite_ostreamTest.TestFD (73488 of 74057)
PASS: LLVM-Unit :: Support/./SupportTests/raw_sha1_ostreamTest.Intermediate (73489 of 74057)
PASS: LLVM-Unit :: Support/./SupportTests/sha1_hash_test.Basic (73490 of 74057)
PASS: LLVM-Unit :: Support/./SupportTests/raw_sha1_ostreamTest.Reset (73491 of 74057)
PASS: LLVM-Unit :: Support/./SupportTests/sha1_hash_test.Update (73492 of 74057)
PASS: LLVM-Unit :: Support/./SupportTests/swapByteOrder.double (73493 of 74057)
PASS: LLVM-Unit :: Support/./SupportTests/swapByteOrder.float (73494 of 74057)
PASS: LLVM-Unit :: Support/./SupportTests/rename.ExistingTemp (73495 of 74057)
PASS: LLVM-Unit :: Support/./SupportTests/rename.FileOpenedForReadingCanBeReplaced (73496 of 74057)
PASS: LLVM-Unit :: Support/./SupportTests/swapByteOrder.int16_t (73497 of 74057)
PASS: LLVM-Unit :: Support/./SupportTests/swapByteOrder.int32_t (73498 of 74057)
PASS: LLVM-Unit :: Support/./SupportTests/swapByteOrder.uint16_t (73499 of 74057)
PASS: LLVM-Unit :: Support/CommandLineInit/./CommandLineInitTests/CommandLineInitTest.GetPresetOptions (73500 of 74057)
PASS: LLVM-Unit :: Support/./SupportTests/swapByteOrder.int64_t (73501 of 74057)
PASS: LLVM-Unit :: Support/./SupportTests/swapByteOrder.int8_t (73502 of 74057)
PASS: LLVM-Unit :: TableGen/./TableGenTests/Automata.NfaAutomatonAccepts (73503 of 74057)
PASS: LLVM-Unit :: Support/./SupportTests/swapByteOrder.uint32_t (73504 of 74057)
PASS: LLVM-Unit :: Support/./SupportTests/swapByteOrder.uint64_t (73505 of 74057)
PASS: LLVM-Unit :: Support/./SupportTests/swapByteOrder.uint8_t (73506 of 74057)
PASS: LLVM-Unit :: TableGen/./TableGenTests/Automata.BinPackerAutomatonAccepts (73507 of 74057)
PASS: LLVM-Unit :: TableGen/./TableGenTests/Automata.BinPackerAutomatonExplains (73508 of 74057)
PASS: LLVM-Unit :: TableGen/./TableGenTests/Automata.SimpleAutomatonAcceptsFromInitialState (73509 of 74057)
PASS: LLVM-Unit :: Support/./SupportTests/xxhashTest.Basic (73510 of 74057)
PASS: LLVM-Unit :: TableGen/./TableGenTests/Automata.SimpleAutomatonAcceptsSequences (73511 of 74057)
PASS: LLVM-Unit :: TableGen/./TableGenTests/CodeExpander.Escape (73512 of 74057)
PASS: LLVM-Unit :: TableGen/./TableGenTests/Automata.TupleAutomatonAccepts (73513 of 74057)
PASS: LLVM-Unit :: TableGen/./TableGenTests/CodeExpander.EscapedNotAnExpansion (73514 of 74057)
PASS: LLVM-Unit :: TableGen/./TableGenTests/CodeExpander.EscapedExpansion (73515 of 74057)
PASS: LLVM-Unit :: Support/./SupportTests/writeFileAtomicallyTest.Test (73516 of 74057)
PASS: LLVM-Unit :: TableGen/./TableGenTests/CodeExpander.EscapedUnterminatedExpansion (73517 of 74057)
PASS: LLVM-Unit :: TableGen/./TableGenTests/CodeExpander.Indentation (73518 of 74057)
PASS: LLVM-Unit :: TableGen/./TableGenTests/CodeExpander.NoExpansions (73519 of 74057)
PASS: LLVM-Unit :: TableGen/./TableGenTests/CodeExpander.NotAnExpansion (73520 of 74057)
PASS: LLVM-Unit :: TableGen/./TableGenTests/CodeExpander.UndefinedExpansion (73521 of 74057)
PASS: LLVM-Unit :: TableGen/./TableGenTests/CodeExpander.UnterminatedExpansion (73522 of 74057)
PASS: LLVM-Unit :: Target/AArch64/./AArch64Tests/MatrixRegisterAliasing.Aliasing (73523 of 74057)
PASS: LLVM-Unit :: Target/AArch64/./AArch64Tests/StackOffset.decomposeStackOffsetForFrameOffsets (73524 of 74057)
PASS: LLVM-Unit :: TextAPI/./TextAPITests/TBDv1.MalformedFile2 (73525 of 74057)
PASS: LLVM-Unit :: Target/ARM/./ARMTests/MachineInstr.HasSideEffects (73526 of 74057)
PASS: LLVM-Unit :: Target/ARM/./ARMTests/MachineInstructionDoubleWidthResult.IsCorrect (73527 of 74057)
PASS: LLVM-Unit :: Target/ARM/./ARMTests/MachineInstrValidTailPredication.IsCorrect (73528 of 74057)
PASS: LLVM-Unit :: Target/AArch64/./AArch64Tests/InstSizes.PATCHPOINT (73529 of 74057)
PASS: LLVM-Unit :: Target/ARM/./ARMTests/MachineInstructionHorizontalReduction.IsCorrect (73530 of 74057)
PASS: LLVM-Unit :: Target/ARM/./ARMTests/MachineInstructionRetainsPreviousHalfElement.IsCorrect (73531 of 74057)
PASS: LLVM-Unit :: TextAPI/./TextAPITests/TBDv1.MalformedFile1 (73532 of 74057)
PASS: LLVM-Unit :: Target/AArch64/./AArch64Tests/InstSizes.STACKMAP (73533 of 74057)
PASS: LLVM-Unit :: Target/AArch64/./AArch64Tests/InstSizes.TLSDESC_CALLSEQ (73534 of 74057)
PASS: LLVM-Unit :: Target/AArch64/./AArch64Tests/InstSizes.Authenticated (73535 of 74057)
PASS: LLVM-Unit :: TextAPI/./TextAPITests/TBDv1.Platform_macOS (73536 of 74057)
PASS: LLVM-Unit :: TextAPI/./TextAPITests/TBDv1.Platform_tvOS (73537 of 74057)
PASS: LLVM-Unit :: TextAPI/./TextAPITests/TBDv1.Platform_bridgeOS (73538 of 74057)
PASS: LLVM-Unit :: TextAPI/./TextAPITests/TBDv1.Platform_watchOS (73539 of 74057)
PASS: LLVM-Unit :: TextAPI/./TextAPITests/TBDv1.ReadFile2 (73540 of 74057)
PASS: LLVM-Unit :: TextAPI/./TextAPITests/TBDv1.Platform_iOS (73541 of 74057)
PASS: LLVM-Unit :: TextAPI/./TextAPITests/TBDv1.ReadFile (73542 of 74057)
PASS: LLVM-Unit :: TextAPI/./TextAPITests/TBDv1.Swift_1_1 (73543 of 74057)
PASS: LLVM-Unit :: Target/X86/./X86Tests/MachineSizeOptsTest.Test (73544 of 74057)
PASS: LLVM-Unit :: TextAPI/./TextAPITests/TBDv1.Swift_1_0 (73545 of 74057)
PASS: LLVM-Unit :: TextAPI/./TextAPITests/TBDv1.Swift_2_0 (73546 of 74057)
PASS: LLVM-Unit :: TextAPI/./TextAPITests/TBDv1.Swift_3_0 (73547 of 74057)
PASS: LLVM-Unit :: TextAPI/./TextAPITests/TBDv1.Swift_4_0 (73548 of 74057)
PASS: LLVM-Unit :: TextAPI/./TextAPITests/TBDv1.Swift_5 (73549 of 74057)
PASS: LLVM-Unit :: TextAPI/./TextAPITests/TBDv1.UnknownArchitecture (73550 of 74057)
PASS: LLVM-Unit :: TextAPI/./TextAPITests/TBDv1.Swift_99 (73551 of 74057)
PASS: LLVM-Unit :: TextAPI/./TextAPITests/TBDv1.WriteFile (73552 of 74057)
PASS: LLVM-Unit :: TextAPI/./TextAPITests/TBDv1.UnknownPlatform (73553 of 74057)
PASS: LLVM-Unit :: TextAPI/./TextAPITests/TBDv2.MalformedFile1 (73554 of 74057)
PASS: LLVM-Unit :: TextAPI/./TextAPITests/TBDv2.MalformedFile2 (73555 of 74057)
PASS: LLVM-Unit :: TextAPI/./TextAPITests/TBDv2.InvalidPlatform (73556 of 74057)
PASS: LLVM-Unit :: TextAPI/./TextAPITests/TBDv2.Platform_bridgeOS (73557 of 74057)
PASS: LLVM-Unit :: TextAPI/./TextAPITests/TBDv2.Platform_tvOS (73558 of 74057)
PASS: LLVM-Unit :: TextAPI/./TextAPITests/TBDv2.Platform_watchOS (73559 of 74057)
PASS: LLVM-Unit :: TextAPI/./TextAPITests/TBDv2.Platform_macOS (73560 of 74057)
PASS: LLVM-Unit :: TextAPI/./TextAPITests/TBDv2.Platform_iOS (73561 of 74057)
PASS: LLVM-Unit :: TextAPI/./TextAPITests/TBDv2.ReadFile (73562 of 74057)
PASS: LLVM-Unit :: TextAPI/./TextAPITests/TBDv2.Swift_1_1 (73563 of 74057)
PASS: LLVM-Unit :: TextAPI/./TextAPITests/TBDv2.Swift_2_0 (73564 of 74057)
PASS: LLVM-Unit :: TextAPI/./TextAPITests/TBDv2.Swift_1_0 (73565 of 74057)
PASS: LLVM-Unit :: TextAPI/./TextAPITests/TBDv2.Swift_4_0 (73566 of 74057)
PASS: LLVM-Unit :: TextAPI/./TextAPITests/TBDv2.Swift_3_0 (73567 of 74057)
PASS: LLVM-Unit :: TextAPI/./TextAPITests/TBDv2.UnknownArchitecture (73568 of 74057)
PASS: LLVM-Unit :: TextAPI/./TextAPITests/TBDv2.Swift_99 (73569 of 74057)
PASS: LLVM-Unit :: TextAPI/./TextAPITests/TBDv2.ReadFile2 (73570 of 74057)
PASS: LLVM-Unit :: TextAPI/./TextAPITests/TBDv2.Swift_5 (73571 of 74057)
PASS: LLVM-Unit :: TextAPI/./TextAPITests/TBDv2.UnknownPlatform (73572 of 74057)
PASS: LLVM-Unit :: TextAPI/./TextAPITests/TBDv3.InterfaceInequality (73573 of 74057)
PASS: LLVM-Unit :: TextAPI/./TextAPITests/TBDv3.Arch_arm64e (73574 of 74057)
PASS: LLVM-Unit :: TextAPI/./TextAPITests/TBDv3.InterfaceEquality (73575 of 74057)
PASS: LLVM-Unit :: TextAPI/./TextAPITests/TBDv2.WriteFile (73576 of 74057)
PASS: LLVM-Unit :: TextAPI/./TextAPITests/TBDv3.Platform_bridgeOS (73577 of 74057)
PASS: LLVM-Unit :: TextAPI/./TextAPITests/TBDv3.MalformedFile1 (73578 of 74057)
PASS: LLVM-Unit :: TextAPI/./TextAPITests/TBDv3.MalformedFile2 (73579 of 74057)
PASS: LLVM-Unit :: TextAPI/./TextAPITests/TBDv3.Platform_macCatalyst (73580 of 74057)
PASS: LLVM-Unit :: TextAPI/./TextAPITests/TBDv3.Platform_iOS (73581 of 74057)
PASS: LLVM-Unit :: TextAPI/./TextAPITests/TBDv3.Platform_macOS (73582 of 74057)
PASS: LLVM-Unit :: TextAPI/./TextAPITests/TBDv3.Platform_iOSSim (73583 of 74057)
PASS: LLVM-Unit :: TextAPI/./TextAPITests/TBDv3.Platform_tvOS (73584 of 74057)
PASS: LLVM-Unit :: TextAPI/./TextAPITests/TBDv3.Platform_zippered (73585 of 74057)
PASS: LLVM-Unit :: TextAPI/./TextAPITests/TBDv3.Platform_watchOSSim (73586 of 74057)
PASS: LLVM-Unit :: TextAPI/./TextAPITests/TBDv3.ReadFile (73587 of 74057)
PASS: LLVM-Unit :: TextAPI/./TextAPITests/TBDv3.Platform_watchOS (73588 of 74057)
PASS: LLVM-Unit :: TextAPI/./TextAPITests/TBDv3.ReadMultipleDocuments (73589 of 74057)
PASS: LLVM-Unit :: TextAPI/./TextAPITests/TBDv3.Platform_tvOSSim (73590 of 74057)
PASS: LLVM-Unit :: TextAPI/./TextAPITests/TBDv3.Swift_3_0 (73591 of 74057)
PASS: LLVM-Unit :: TextAPI/./TextAPITests/TBDv3.Swift_1_0 (73592 of 74057)
PASS: LLVM-Unit :: TextAPI/./TextAPITests/TBDv3.Swift_1_1 (73593 of 74057)
PASS: LLVM-Unit :: TextAPI/./TextAPITests/TBDv3.UnknownArchitecture (73594 of 74057)
PASS: LLVM-Unit :: TextAPI/./TextAPITests/TBDv3.Swift_4_0 (73595 of 74057)
PASS: LLVM-Unit :: TextAPI/./TextAPITests/TBDv3.WriteMultipleDocuments (73596 of 74057)
PASS: LLVM-Unit :: TextAPI/./TextAPITests/TBDv3.UnknownPlatform (73597 of 74057)
PASS: LLVM-Unit :: TextAPI/./TextAPITests/TBDv3.Swift_5 (73598 of 74057)
PASS: LLVM-Unit :: TextAPI/./TextAPITests/TBDv3.Swift_99 (73599 of 74057)
PASS: LLVM-Unit :: TextAPI/./TextAPITests/TBDv3.Swift_2_0 (73600 of 74057)
PASS: LLVM-Unit :: TextAPI/./TextAPITests/TBDv3.WriteFile (73601 of 74057)
PASS: LLVM-Unit :: TextAPI/./TextAPITests/TBDv4.InterfaceEquality (73602 of 74057)
PASS: LLVM-Unit :: TextAPI/./TextAPITests/TBDv4.InterfaceDiffVersionsEquality (73603 of 74057)
PASS: LLVM-Unit :: TextAPI/./TextAPITests/TBDv4.InterfaceInequality (73604 of 74057)
PASS: LLVM-Unit :: TextAPI/./TextAPITests/TBDv4.InvalidPlatform (73605 of 74057)
PASS: LLVM-Unit :: TextAPI/./TextAPITests/TBDv4.MalformedFile1 (73606 of 74057)
PASS: LLVM-Unit :: TextAPI/./TextAPITests/TBDv4.InvalidArchitecture (73607 of 74057)
PASS: LLVM-Unit :: TextAPI/./TextAPITests/TBDv4.MalformedFile3 (73608 of 74057)
PASS: LLVM-Unit :: TextAPI/./TextAPITests/TBDv4.MalformedFile2 (73609 of 74057)
PASS: LLVM-Unit :: TextAPI/./TextAPITests/TBDv4.MultipleTargetsSamePlatform (73610 of 74057)
PASS: LLVM-Unit :: TextAPI/./TextAPITests/TBDv4.MultipleTargets (73611 of 74057)
PASS: LLVM-Unit :: TextAPI/./TextAPITests/TBDv4.MultipleTargetsSameArch (73612 of 74057)
PASS: LLVM-Unit :: TextAPI/./TextAPITests/TBDv4.Swift_1 (73613 of 74057)
PASS: LLVM-Unit :: TextAPI/./TextAPITests/TBDv4.ReadMultipleDocuments (73614 of 74057)
PASS: LLVM-Unit :: TextAPI/./TextAPITests/TBDv4.ReadFile (73615 of 74057)
PASS: LLVM-Unit :: TextAPI/./TextAPITests/TBDv4.Swift_5 (73616 of 74057)
PASS: LLVM-Unit :: TextAPI/./TextAPITests/TBDv4.Swift_99 (73617 of 74057)
PASS: LLVM-Unit :: TextAPI/./TextAPITests/TBDv4.Swift_2 (73618 of 74057)
PASS: LLVM-Unit :: Support/DynamicLibrary/./DynamicLibraryTests/DynamicLibrary.Overload (73619 of 74057)
PASS: LLVM-Unit :: TextAPI/./TextAPITests/TBDv4.Target_arm_iOS (73620 of 74057)
PASS: LLVM-Unit :: TextAPI/./TextAPITests/TBDv4.Target_arm_bridgeOS (73621 of 74057)
PASS: LLVM-Unit :: TextAPI/./TextAPITests/TBDv4.Target_i386_driverkit (73622 of 74057)
PASS: LLVM-Unit :: TextAPI/./TextAPITests/TBDv4.Target_i386_watchos_simulator (73623 of 74057)
PASS: LLVM-Unit :: TextAPI/./TextAPITests/TBDv4.Target_x86_ios_simulator (73624 of 74057)
PASS: LLVM-Unit :: TextAPI/./TextAPITests/TBDv4.WriteFile (73625 of 74057)
PASS: LLVM-Unit :: TextAPI/./TextAPITests/TBDv4.Target_x86_tvos_simulator (73626 of 74057)
PASS: LLVM-Unit :: TextAPI/./TextAPITests/TBDv4.Target_maccatalyst (73627 of 74057)
PASS: LLVM-Unit :: TextAPI/./TextAPITests/TBDv4.WriteMultipleDocuments (73628 of 74057)
PASS: LLVM-Unit :: Transforms/IPO/./IPOTests/AttributorTestBase.TestCast (73629 of 74057)
PASS: LLVM-Unit :: Transforms/IPO/./IPOTests/AttributorTestBase.IRPPositionCallBaseContext (73630 of 74057)
PASS: LLVM-Unit :: TextAPI/./TextAPITests/TBDv4.Target_x86_macos (73631 of 74057)
PASS: LLVM-Unit :: TextAPI/./TextAPITests/TBDv4.Target_x86_ios (73632 of 74057)
PASS: LLVM-Unit :: Transforms/IPO/./IPOTests/AttributorTestBase.AAReachabilityTest (73633 of 74057)
PASS: LLVM-Unit :: Transforms/IPO/./IPOTests/LowerTypeTests.BitSetBuilder (73634 of 74057)
PASS: LLVM-Unit :: Transforms/IPO/./IPOTests/LowerTypeTests.ByteArrayBuilder (73635 of 74057)
PASS: LLVM-Unit :: Transforms/IPO/./IPOTests/LowerTypeTests.GlobalLayoutBuilder (73636 of 74057)
PASS: LLVM-Unit :: Transforms/IPO/./IPOTests/WholeProgramDevirt.findLowestOffset (73637 of 74057)
PASS: LLVM-Unit :: Transforms/IPO/./IPOTests/WholeProgramDevirt.setReturnValues (73638 of 74057)
PASS: LLVM-Unit :: Transforms/Scalar/./ScalarTests/LICMTest.TestSCEVInvalidationOnHoisting (73639 of 74057)
PASS: LLVM-Unit :: Transforms/Scalar/./ScalarTests/LoopPassManagerTest.IndirectInvalidation (73640 of 74057)
PASS: LLVM-Unit :: Transforms/Scalar/./ScalarTests/LoopPassManagerTest.LoopChildInsertion (73641 of 74057)
PASS: LLVM-Unit :: Transforms/Scalar/./ScalarTests/LoopPassManagerTest.Basic (73642 of 74057)
PASS: LLVM-Unit :: Transforms/Scalar/./ScalarTests/LoopPassManagerTest.IndirectOuterPassInvalidation (73643 of 74057)
PASS: LLVM-Unit :: Transforms/Scalar/./ScalarTests/LoopPassManagerTest.InvalidationOfBundledAnalyses (73644 of 74057)
PASS: LLVM-Unit :: Transforms/Scalar/./ScalarTests/LoopPassManagerTest.LoopDeletion (73645 of 74057)
PASS: LLVM-Unit :: Transforms/Scalar/./ScalarTests/LoopPassManagerTest.HandleLoopNestPass (73646 of 74057)
PASS: LLVM-Unit :: Transforms/Scalar/./ScalarTests/LoopPassManagerTest.LoopPeerInsertion (73647 of 74057)
PASS: LLVM-Unit :: Transforms/Scalar/./ScalarTests/LoopPassManagerTest.FunctionPassInvalidationOfLoopAnalyses (73648 of 74057)
PASS: LLVM-Unit :: Transforms/Scalar/./ScalarTests/LoopPassManagerTest.ModulePassInvalidationOfLoopAnalyses (73649 of 74057)
PASS: LLVM-Unit :: Transforms/Utils/./UtilsTests/ASanStackFrameLayout.Test (73650 of 74057)
PASS: LLVM-Unit :: Transforms/Utils/./UtilsTests/BasicBlockUtils.SetEdgeProbability (73651 of 74057)
PASS: LLVM-Unit :: Transforms/Utils/./UtilsTests/BasicBlockUtils.splitBasicBlockBefore_ex1 (73652 of 74057)
PASS: LLVM-Unit :: Transforms/Utils/./UtilsTests/BasicBlockUtils.NoUnreachableBlocksToEliminate (73653 of 74057)
PASS: LLVM-Unit :: Transforms/Utils/./UtilsTests/BasicBlockUtils.SplitBlockPredecessors (73654 of 74057)
PASS: LLVM-Unit :: Transforms/Utils/./UtilsTests/BasicBlockUtils.EliminateUnreachableBlocks (73655 of 74057)
PASS: LLVM-Unit :: Transforms/Utils/./UtilsTests/BasicBlockUtils.SplitCriticalEdge (73656 of 74057)
PASS: LLVM-Unit :: Transforms/Utils/./UtilsTests/BasicBlockUtils.SplitEdge_ex1 (73657 of 74057)
PASS: LLVM-Unit :: Transforms/Utils/./UtilsTests/BasicBlockUtils.SplitEdge_ex3 (73658 of 74057)
PASS: LLVM-Unit :: Transforms/Utils/./UtilsTests/BasicBlockUtils.SplitEdge_ex4 (73659 of 74057)
PASS: LLVM-Unit :: Transforms/Utils/./UtilsTests/CallPromotionUtilsTest.TryPromoteCall_EmptyVTable (73660 of 74057)
PASS: LLVM-Unit :: Transforms/Utils/./UtilsTests/BasicBlockUtils.SplitEdge_ex2 (73661 of 74057)
PASS: LLVM-Unit :: Transforms/Utils/./UtilsTests/BasicBlockUtils.SplitIndirectBrCriticalEdge (73662 of 74057)
PASS: LLVM-Unit :: Transforms/Utils/./UtilsTests/CallPromotionUtilsTest.TryPromoteCall (73663 of 74057)
PASS: LLVM-Unit :: Transforms/Utils/./UtilsTests/CallPromotionUtilsTest.TryPromoteCall_Legality (73664 of 74057)
PASS: LLVM-Unit :: Transforms/Utils/./UtilsTests/CallPromotionUtilsTest.TryPromoteCall_NoVTableInitFound (73665 of 74057)
PASS: LLVM-Unit :: Transforms/Utils/./UtilsTests/CallPromotionUtilsTest.TryPromoteCall_NoVTablePtrLoad (73666 of 74057)
PASS: LLVM-Unit :: Transforms/Utils/./UtilsTests/CallPromotionUtilsTest.TryPromoteCall_NullFP (73667 of 74057)
PASS: LLVM-Unit :: Transforms/Utils/./UtilsTests/CloneFunc.NewFunctionCreated (73668 of 74057)
PASS: LLVM-Unit :: Transforms/Utils/./UtilsTests/CloneInstruction.CallingConvention (73669 of 74057)
PASS: LLVM-Unit :: Transforms/Utils/./UtilsTests/CloneFunc.DebugIntrinsics (73670 of 74057)
PASS: LLVM-Unit :: Transforms/Utils/./UtilsTests/CallPromotionUtilsTest.TryPromoteCall_NoFPLoad (73671 of 74057)
PASS: LLVM-Unit :: Transforms/Utils/./UtilsTests/CloneFunc.InstructionOwnership (73672 of 74057)
PASS: LLVM-Unit :: Transforms/Utils/./UtilsTests/CallPromotionUtilsTest.TryPromoteCall_MemberFunctionCalls (73673 of 74057)
PASS: LLVM-Unit :: Transforms/Utils/./UtilsTests/CloneFunction.CloneFunctionWithInalloca (73674 of 74057)
PASS: LLVM-Unit :: Transforms/Utils/./UtilsTests/CloneFunc.Subprogram (73675 of 74057)
PASS: LLVM-Unit :: Transforms/Utils/./UtilsTests/CloneFunction.CloneFunctionToDifferentModule (73676 of 74057)
PASS: LLVM-Unit :: Transforms/Utils/./UtilsTests/CloneFunction.CloneEmptyFunction (73677 of 74057)
PASS: LLVM-Unit :: Transforms/Utils/./UtilsTests/CloneInstruction.Attributes (73678 of 74057)
PASS: LLVM-Unit :: Transforms/Utils/./UtilsTests/CloneFunction.CloneFunctionWithSubprograms (73679 of 74057)
PASS: LLVM-Unit :: Transforms/Utils/./UtilsTests/CloneInstruction.DuplicateInstructionsToSplit (73680 of 74057)
PASS: LLVM-Unit :: Transforms/Utils/./UtilsTests/CloneInstruction.OverflowBits (73681 of 74057)
PASS: LLVM-Unit :: Transforms/Utils/./UtilsTests/CloneInstruction.Inbounds (73682 of 74057)
PASS: LLVM-Unit :: Transforms/Utils/./UtilsTests/CloneInstruction.Exact (73683 of 74057)
PASS: LLVM-Unit :: Transforms/Utils/./UtilsTests/CloneInstruction.DuplicateInstructionsToSplitBlocksEq2 (73684 of 74057)
PASS: LLVM-Unit :: Transforms/Utils/./UtilsTests/CloneLoop.CloneLoopNest (73685 of 74057)
PASS: LLVM-Unit :: Transforms/Utils/./UtilsTests/CloneInstruction.DuplicateInstructionsToSplitBlocksEq1 (73686 of 74057)
PASS: LLVM-Unit :: Transforms/Utils/./UtilsTests/CloneModule.Comdat (73687 of 74057)
PASS: LLVM-Unit :: Transforms/Utils/./UtilsTests/CodeExtractor.ExitBlockOrdering (73688 of 74057)
PASS: LLVM-Unit :: Transforms/Utils/./UtilsTests/CloneModule.GlobalMetadata (73689 of 74057)
PASS: LLVM-Unit :: Transforms/Utils/./UtilsTests/CloneModule.CompileUnit (73690 of 74057)
PASS: LLVM-Unit :: Transforms/Utils/./UtilsTests/CloneModule.GlobalDebugInfo (73691 of 74057)
PASS: LLVM-Unit :: Transforms/Utils/./UtilsTests/CloneModule.OldModuleUnchanged (73692 of 74057)
PASS: LLVM-Unit :: Transforms/Utils/./UtilsTests/CloneModule.Verify (73693 of 74057)
PASS: LLVM-Unit :: Transforms/Utils/./UtilsTests/CloneModule.Subprogram (73694 of 74057)
PASS: LLVM-Unit :: Transforms/Utils/./UtilsTests/CodeExtractor.ExitBlockOrderingPhis (73695 of 74057)
PASS: LLVM-Unit :: Transforms/Utils/./UtilsTests/CodeExtractor.ExitStub (73696 of 74057)
PASS: LLVM-Unit :: Transforms/Utils/./UtilsTests/CodeExtractor.ExitPHIOnePredFromRegion (73697 of 74057)
PASS: LLVM-Unit :: Transforms/Utils/./UtilsTests/CodeExtractor.RemoveBitcastUsesFromOuterLifetimeMarkers (73698 of 74057)
PASS: LLVM-Unit :: Transforms/Utils/./UtilsTests/CodeExtractor.StoreOutputInvokeResultAfterEHPad (73699 of 74057)
PASS: LLVM-Unit :: Transforms/Utils/./UtilsTests/CodeExtractor.ExtractAndInvalidateAssumptionCache (73700 of 74057)
PASS: LLVM-Unit :: Transforms/Utils/./UtilsTests/CodeMoverUtils.IsControlFlowEquivalentCondNestTest (73701 of 74057)
PASS: LLVM-Unit :: Transforms/Utils/./UtilsTests/CodeExtractor.InputOutputMonitoring (73702 of 74057)
PASS: LLVM-Unit :: Transforms/Utils/./UtilsTests/CodeMoverUtils.IsControlFlowEquivalentImbalanceTest (73703 of 74057)
PASS: LLVM-Unit :: Transforms/Utils/./UtilsTests/CodeMoverUtils.IsControlFlowEquivalentSimpleTest (73704 of 74057)
PASS: LLVM-Unit :: Transforms/Utils/./UtilsTests/CodeExtractor.StoreOutputInvokeResultInExitStub (73705 of 74057)
PASS: LLVM-Unit :: Transforms/Utils/./UtilsTests/CodeMoverUtils.IsControlFlowEquivalentNotPostdomTest (73706 of 74057)
PASS: LLVM-Unit :: Transforms/Utils/./UtilsTests/CodeMoverUtils.IsControlFlowEquivalentOppositeCondTest (73707 of 74057)
PASS: LLVM-Unit :: Transforms/Utils/./UtilsTests/CodeMoverUtils.IsControlFlowEquivalentPointerTest (73708 of 74057)
PASS: LLVM-Unit :: Transforms/Utils/./UtilsTests/CodeMoverUtils.IsSafeToMoveTest1 (73709 of 74057)
PASS: LLVM-Unit :: Transforms/Utils/./UtilsTests/CodeMoverUtils.IsSafeToMoveTest2 (73710 of 74057)
PASS: LLVM-Unit :: Transforms/Utils/./UtilsTests/CodeMoverUtils.IsSafeToMoveTest3 (73711 of 74057)
PASS: LLVM-Unit :: Transforms/Utils/./UtilsTests/CodeMoverUtils.IsSafeToMoveTest5 (73712 of 74057)
PASS: LLVM-Unit :: Transforms/Utils/./UtilsTests/CodeMoverUtils.IsSafeToMoveTest6 (73713 of 74057)
PASS: LLVM-Unit :: Transforms/Utils/./UtilsTests/DebugInfoDummyAnalysis.PreserveOriginalDebugInfo (73714 of 74057)
PASS: LLVM-Unit :: Transforms/Utils/./UtilsTests/CodeMoverUtils.IsSafeToMoveTest4 (73715 of 74057)
PASS: LLVM-Unit :: Transforms/Utils/./UtilsTests/IntegerDivision.SDiv (73716 of 74057)
PASS: LLVM-Unit :: Transforms/Utils/./UtilsTests/DebugInfoDrop.DropOriginalDebugInfo (73717 of 74057)
PASS: LLVM-Unit :: Transforms/Utils/./UtilsTests/IntegerDivision.SRem (73718 of 74057)
PASS: LLVM-Unit :: Transforms/Utils/./UtilsTests/IntegerDivision.UDiv (73719 of 74057)
PASS: LLVM-Unit :: Transforms/Utils/./UtilsTests/IntegerDivision.SRem64 (73720 of 74057)
PASS: LLVM-Unit :: Transforms/Utils/./UtilsTests/IntegerDivision.SDiv64 (73721 of 74057)
PASS: LLVM-Unit :: Transforms/Utils/./UtilsTests/IntegerDivision.UDiv64 (73722 of 74057)
PASS: LLVM-Unit :: Transforms/Utils/./UtilsTests/FunctionComparatorTest.TestAPI (73723 of 74057)
PASS: LLVM-Unit :: Transforms/Utils/./UtilsTests/DebugValueDrop.DropOriginalDebugValues (73724 of 74057)
PASS: LLVM-Unit :: Support/DynamicLibrary/./DynamicLibraryTests/DynamicLibrary.Shutdown (73725 of 74057)
PASS: LLVM-Unit :: Transforms/Utils/./UtilsTests/IntegerDivision.URem64 (73726 of 74057)
PASS: LLVM-Unit :: Transforms/Utils/./UtilsTests/IntegerDivision.URem (73727 of 74057)
PASS: LLVM-Unit :: Transforms/Utils/./UtilsTests/Local.CanReplaceOperandWithVariable (73728 of 74057)
PASS: LLVM-Unit :: Transforms/Utils/./UtilsTests/Local.ChangeToUnreachable (73729 of 74057)
PASS: LLVM-Unit :: Transforms/Utils/./UtilsTests/Local.ConstantFoldTerminator (73730 of 74057)
PASS: LLVM-Unit :: Transforms/Utils/./UtilsTests/Local.RemoveDuplicatePHINodes (73731 of 74057)
PASS: LLVM-Unit :: Transforms/Utils/./UtilsTests/Local.RemoveUnreachableBlocks (73732 of 74057)
PASS: LLVM-Unit :: Transforms/Utils/./UtilsTests/Local.MergeBasicBlockIntoOnlyPred (73733 of 74057)
PASS: LLVM-Unit :: Transforms/Utils/./UtilsTests/Local.ReplaceAllDbgUsesWith (73734 of 74057)
PASS: LLVM-Unit :: Transforms/Utils/./UtilsTests/Local.SimplifyCFGWithNullAC (73735 of 74057)
PASS: LLVM-Unit :: Transforms/Utils/./UtilsTests/LoopRotate.MultiDeoptExit (73736 of 74057)
PASS: LLVM-Unit :: Transforms/Utils/./UtilsTests/Local.SimplifyVScaleWithRange (73737 of 74057)
PASS: LLVM-Unit :: Transforms/Utils/./UtilsTests/Local.RecursivelyDeleteDeadPHINodes (73738 of 74057)
PASS: LLVM-Unit :: Transforms/Utils/./UtilsTests/Local.ReplaceDbgDeclare (73739 of 74057)
PASS: LLVM-Unit :: Transforms/Utils/./UtilsTests/LoopRotate.MultiDeoptExit_Nondup (73740 of 74057)
PASS: LLVM-Unit :: Transforms/Utils/./UtilsTests/LoopUnrollRuntime.Latch (73741 of 74057)
PASS: LLVM-Unit :: Transforms/Utils/./UtilsTests/LoopUtils.DeleteDeadLoopNest (73742 of 74057)
PASS: LLVM-Unit :: Transforms/Utils/./UtilsTests/ModuleUtils.AppendToUsedList1 (73743 of 74057)
PASS: LLVM-Unit :: Transforms/Utils/./UtilsTests/SSAUpdaterBulk.SimpleMerge (73744 of 74057)
PASS: LLVM-Unit :: Transforms/Utils/./UtilsTests/ModuleUtils.AppendToUsedList2 (73745 of 74057)
PASS: LLVM-Unit :: Transforms/Utils/./UtilsTests/SalvageDebugInfoTest.RecursiveBlockSimplification (73746 of 74057)
PASS: LLVM-Unit :: Transforms/Utils/./UtilsTests/SSAUpdaterBulk.Irreducible (73747 of 74057)
PASS: LLVM-Unit :: Transforms/Utils/./UtilsTests/SalvageDebugInfoTest.RecursiveInstDeletion (73748 of 74057)
PASS: LLVM-Unit :: Transforms/Utils/./UtilsTests/ScalarEvolutionExpanderTest.SCEVCacheNSW (73749 of 74057)
PASS: LLVM-Unit :: Transforms/Utils/./UtilsTests/ScalarEvolutionExpanderTest.ExpandNonIntegralPtrWithNullBase (73750 of 74057)
PASS: LLVM-Unit :: Transforms/Utils/./UtilsTests/ScalarEvolutionExpanderTest.SCEVExpanderIsSafeToExpandAt (73751 of 74057)
PASS: LLVM-Unit :: Transforms/Utils/./UtilsTests/ScalarEvolutionExpanderTest.SCEVExpanderNSW (73752 of 74057)
PASS: LLVM-Unit :: Transforms/Utils/./UtilsTests/ScalarEvolutionExpanderTest.SCEVCacheNUW (73753 of 74057)
PASS: LLVM-Unit :: Transforms/Utils/./UtilsTests/ScalarEvolutionExpanderTest.ExpandPtrTypeSCEV (73754 of 74057)
PASS: LLVM-Unit :: Transforms/Utils/./UtilsTests/ScalarEvolutionExpanderTest.SCEVExpandInsertCanonicalIV (73755 of 74057)
PASS: LLVM-Unit :: Transforms/Utils/./UtilsTests/ScalarEvolutionExpanderTest.SCEVExpanderNUW (73756 of 74057)
PASS: LLVM-Unit :: Transforms/Utils/./UtilsTests/ScalarEvolutionExpanderTest.SCEVExpanderShlNSW (73757 of 74057)
PASS: LLVM-Unit :: Transforms/Utils/./UtilsTests/ScalarEvolutionExpanderTest.SCEVExpandNonAffineAddRec (73758 of 74057)
PASS: LLVM-Unit :: Transforms/Utils/./UtilsTests/ScalarEvolutionExpanderTest.SCEVZeroExtendExprNonIntegral (73759 of 74057)
PASS: LLVM-Unit :: Transforms/Utils/./UtilsTests/SizeOptsTest.Test (73760 of 74057)
PASS: LLVM-Unit :: Transforms/Utils/./UtilsTests/ValueMapperTest.mapMDNodeDistinct (73761 of 74057)
PASS: LLVM-Unit :: Transforms/Utils/./UtilsTests/ValueMapperTest.mapMDNode (73762 of 74057)
PASS: LLVM-Unit :: Transforms/Utils/./UtilsTests/ValueMapperTest.mapMDNodeCycle (73763 of 74057)
PASS: LLVM-Unit :: Transforms/Utils/./UtilsTests/VFABIAttrTest.Write (73764 of 74057)
PASS: LLVM-Unit :: Transforms/Utils/./UtilsTests/ValueMapperTest.mapMDNodeDistinctOperands (73765 of 74057)
PASS: LLVM-Unit :: Transforms/Utils/./UtilsTests/ValueMapperTest.mapMDNodeSeeded (73766 of 74057)
PASS: LLVM-Unit :: Transforms/Utils/./UtilsTests/ValueMapperTest.mapMDNodeSeededWithNull (73767 of 74057)
PASS: LLVM-Unit :: Transforms/Utils/./UtilsTests/ValueMapperTest.mapMDNodeDuplicatedCycle (73768 of 74057)
PASS: LLVM-Unit :: Transforms/Utils/./UtilsTests/ValueMapperTest.mapMetadataMDString (73769 of 74057)
PASS: LLVM-Unit :: Transforms/Utils/./UtilsTests/ValueMapperTest.mapMDNodeUnresolved (73770 of 74057)
PASS: LLVM-Unit :: Transforms/Utils/./UtilsTests/ValueMapperTest.mapMetadataConstantAsMetadata (73771 of 74057)
PASS: LLVM-Unit :: Transforms/Utils/./UtilsTests/ValueMapperTest.mapMetadataGetMappedMD (73772 of 74057)
PASS: LLVM-Unit :: Transforms/Utils/./UtilsTests/ValueMapperTest.mapMetadataNoModuleLevelChanges (73773 of 74057)
PASS: LLVM-Unit :: Transforms/Utils/./UtilsTests/ValueMapperTest.mapValueLocalAsMetadata (73774 of 74057)
PASS: LLVM-Unit :: Transforms/Vectorize/./VectorizeTests/VPBasicBlockTest.getPlan (73775 of 74057)
PASS: LLVM-Unit :: Transforms/Vectorize/./VectorizeTests/VPDoubleValueDefTest.traverseUseLists (73776 of 74057)
PASS: LLVM-Unit :: Transforms/Vectorize/./VectorizeTests/VPInstructionTest.insertBefore (73777 of 74057)
PASS: LLVM-Unit :: Transforms/Vectorize/./VectorizeTests/VPInstructionTest.replaceAllUsesWith (73778 of 74057)
PASS: LLVM-Unit :: Transforms/Utils/./UtilsTests/ValueMapperTest.mapValueLocalAsMetadataToConstant (73779 of 74057)
PASS: LLVM-Unit :: Transforms/Utils/./UtilsTests/ValueMapperTest.mapMetadataNullMapGlobalWithIgnoreMissingLocals (73780 of 74057)
PASS: LLVM-Unit :: Transforms/Vectorize/./VectorizeTests/VPBasicBlockTest.TraversingIteratorTest (73781 of 74057)
PASS: LLVM-Unit :: Transforms/Vectorize/./VectorizeTests/VPInstructionTest.moveBefore (73782 of 74057)
PASS: LLVM-Unit :: Transforms/Vectorize/./VectorizeTests/VPInstructionTest.eraseFromParent (73783 of 74057)
PASS: LLVM-Unit :: Transforms/Vectorize/./VectorizeTests/VPRecipeTest.CastVPInstructionToVPUser (73784 of 74057)
PASS: LLVM-Unit :: Transforms/Vectorize/./VectorizeTests/VPInstructionTest.releaseOperandsAtDeletion (73785 of 74057)
PASS: LLVM-Unit :: Transforms/Vectorize/./VectorizeTests/VPInstructionTest.setOperand (73786 of 74057)
PASS: LLVM-Unit :: Transforms/Vectorize/./VectorizeTests/VPInstructionTest.moveAfter (73787 of 74057)
PASS: LLVM-Unit :: Transforms/Vectorize/./VectorizeTests/VPRecipeTest.CastVPBlendRecipeToVPUser (73788 of 74057)
PASS: LLVM-Unit :: Transforms/Vectorize/./VectorizeTests/VPRecipeTest.CastVPBranchOnMaskRecipeToVPUser (73789 of 74057)
PASS: LLVM-Unit :: Transforms/Vectorize/./VectorizeTests/VPRecipeTest.CastVPInterleaveRecipeToVPUser (73790 of 74057)
PASS: LLVM-Unit :: Transforms/Vectorize/./VectorizeTests/VPRecipeTest.CastVPWidenGEPRecipeToVPUserAndVPDef (73791 of 74057)
PASS: LLVM-Unit :: Transforms/Vectorize/./VectorizeTests/VPRecipeTest.CastVPReplicateRecipeToVPUser (73792 of 74057)
PASS: LLVM-Unit :: Transforms/Vectorize/./VectorizeTests/VPRecipeTest.MayHaveSideEffectsAndMayReadWriteMemory (73793 of 74057)
PASS: LLVM-Unit :: Transforms/Vectorize/./VectorizeTests/VPlanDominatorTreeTest.BasicVPBBDomination (73794 of 74057)
PASS: LLVM-Unit :: Transforms/Vectorize/./VectorizeTests/VPlanHCFGTest.testBuildHCFGInnerLoop (73795 of 74057)
PASS: LLVM-Unit :: Transforms/Vectorize/./VectorizeTests/VPRecipeTest.CastVPReductionRecipeToVPUser (73796 of 74057)
PASS: LLVM-Unit :: Transforms/Vectorize/./VectorizeTests/VPRecipeTest.CastVPWidenSelectRecipeToVPUserAndVPDef (73797 of 74057)
PASS: LLVM-Unit :: Transforms/Vectorize/./VectorizeTests/VPRecipeTest.CastVPWidenCallRecipeToVPUserAndVPDef (73798 of 74057)
PASS: LLVM-Unit :: Transforms/Vectorize/./VectorizeTests/VPlanHCFGTest.testVPInstructionToVPRecipesInner (73799 of 74057)
PASS: LLVM-Unit :: Transforms/Vectorize/./VectorizeTests/VPRecipeTest.CastVPWidenMemoryInstructionRecipeToVPUserAndVPDef (73800 of 74057)
PASS: LLVM-Unit :: Transforms/Vectorize/./VectorizeTests/VPRecipeTest.CastVPWidenRecipeToVPUser (73801 of 74057)
PASS: LLVM-Unit :: Transforms/Vectorize/./VectorizeTests/VPlanLoopInfo.BasicLoopInfoTest (73802 of 74057)
PASS: LLVM-Unit :: Transforms/Vectorize/./VectorizeTests/VPlanSlpTest.testInstrsInDifferentBBs (73803 of 74057)
PASS: LLVM-Unit :: Transforms/Vectorize/./VectorizeTests/VPlanPredicatorTest.PredicatorNegOrTest (73804 of 74057)
PASS: LLVM-Unit :: Transforms/Vectorize/./VectorizeTests/VPlanPredicatorTest.BasicPredicatorTest (73805 of 74057)
PASS: LLVM-Unit :: Transforms/Vectorize/./VectorizeTests/VPlanSlpTest.testInstrsInDifferentBBs2 (73806 of 74057)
PASS: LLVM-Unit :: Transforms/Vectorize/./VectorizeTests/VPlanSlpTest.testSlpAtomicLoad (73807 of 74057)
PASS: LLVM-Unit :: Transforms/Vectorize/./VectorizeTests/VPlanSlpTest.testSlpAtomicStore (73808 of 74057)
PASS: LLVM-Unit :: Transforms/Vectorize/./VectorizeTests/VPlanSlpTest.testSlpReorder_3 (73809 of 74057)
PASS: LLVM-Unit :: Transforms/Vectorize/./VectorizeTests/VPlanSlpTest.testSlpReorder_1 (73810 of 74057)
PASS: LLVM-Unit :: Transforms/Vectorize/./VectorizeTests/VPlanSlpTest.testSlpReorder_2 (73811 of 74057)
PASS: LLVM-Unit :: Transforms/Vectorize/./VectorizeTests/VPlanSlpTest.testSlpReorder_4 (73812 of 74057)
PASS: LLVM-Unit :: Transforms/Vectorize/./VectorizeTests/VPlanSlpTest.testSlpSimple_2 (73813 of 74057)
PASS: LLVM-Unit :: XRay/./XRayTests/FDRBlockVerifierTest.ValidBlocksV3 (73814 of 74057)
PASS: LLVM-Unit :: Transforms/Vectorize/./VectorizeTests/VPlanSlpTest.testSlpReuse_1 (73815 of 74057)
PASS: LLVM-Unit :: Transforms/Vectorize/./VectorizeTests/VPlanSlpTest.testSlpSimple_3 (73816 of 74057)
PASS: LLVM-Unit :: Transforms/Vectorize/./VectorizeTests/VPlanSlpTest.testSlpReuse_2 (73817 of 74057)
PASS: LLVM-Unit :: XRay/./XRayTests/FDRBlockIndexerTest.IndexBlocksV3 (73818 of 74057)
PASS: LLVM-Unit :: XRay/./XRayTests/FDRBlockVerifierTest.MissingBufferExtents (73819 of 74057)
PASS: LLVM-Unit :: XRay/./XRayTests/FDRBlockVerifierTest.IgnoreRecordsAfterEOB (73820 of 74057)
PASS: LLVM-Unit :: XRay/./XRayTests/FDRBlockVerifierTest.MissingPIDRecord (73821 of 74057)
PASS: LLVM-Unit :: XRay/./XRayTests/FDRBlockVerifierTest.MalformedV2 (73822 of 74057)
PASS: LLVM-Unit :: XRay/./XRayTests/FDRRecordPrinterTest.WriteFunctionRecordEnter (73823 of 74057)
PASS: LLVM-Unit :: XRay/./XRayTests/FDRRecordPrinterTest.WriteFunctionRecordExit (73824 of 74057)
PASS: LLVM-Unit :: XRay/./XRayTests/FDRRecordPrinterTest.WriteFunctionRecordEnterArg (73825 of 74057)
PASS: LLVM-Unit :: XRay/./XRayTests/FDRTraceWriterTest.WriteToStringBufferVersion1 (73826 of 74057)
PASS: LLVM-Unit :: XRay/./XRayTests/FDRRecordPrinterTest.WriteFunctionRecordTailExit (73827 of 74057)
PASS: LLVM-Unit :: XRay/./XRayTests/GraphTest.TestConstruction (73828 of 74057)
PASS: LLVM-Unit :: XRay/./XRayTests/GraphTest.TestEdgeAccessOperator (73829 of 74057)
PASS: LLVM-Unit :: XRay/./XRayTests/FDRTraceWriterTest.WriteToStringBufferVersion2 (73830 of 74057)
PASS: LLVM-Unit :: XRay/./XRayTests/FDRTraceWriterTest.WriteToStringBufferVersion3 (73831 of 74057)
PASS: LLVM-Unit :: XRay/./XRayTests/GraphTest.TestiVertexAccessOperator (73832 of 74057)
PASS: LLVM-Unit :: XRay/./XRayTests/GraphTest/0.TestCopyConstructor (73833 of 74057)
PASS: LLVM-Unit :: XRay/./XRayTests/GraphTest/0.TestCopyAssign (73834 of 74057)
PASS: LLVM-Unit :: XRay/./XRayTests/GraphTest/0.TestGraphEdge (73835 of 74057)
PASS: LLVM-Unit :: XRay/./XRayTests/GraphTest/1.TestCopyAssign (73836 of 74057)
PASS: LLVM-Unit :: XRay/./XRayTests/GraphTest/0.TestGraphVertex (73837 of 74057)
PASS: LLVM-Unit :: XRay/./XRayTests/GraphTest/0.TestMoveConstructor (73838 of 74057)
PASS: LLVM-Unit :: XRay/./XRayTests/GraphTest/1.TestCopyConstructor (73839 of 74057)
PASS: LLVM-Unit :: XRay/./XRayTests/GraphTest/1.TestGraphEdge (73840 of 74057)
PASS: LLVM-Unit :: XRay/./XRayTests/GraphTest/1.TestGraphVertex (73841 of 74057)
PASS: LLVM-Unit :: XRay/./XRayTests/GraphTest/1.TestMoveConstructor (73842 of 74057)
PASS: LLVM-Unit :: XRay/./XRayTests/ProfileTest.AddBlocks (73843 of 74057)
PASS: LLVM-Unit :: XRay/./XRayTests/ProfileTest.CopyProfile (73844 of 74057)
PASS: LLVM-Unit :: XRay/./XRayTests/ProfileTest.CreateProfile (73845 of 74057)
PASS: LLVM-Unit :: XRay/./XRayTests/ProfileTest.ExpandPath (73846 of 74057)
PASS: LLVM-Unit :: XRay/./XRayTests/ProfileTest.MergeProfilesByStackAccumulate (73847 of 74057)
PASS: LLVM-Unit :: XRay/./XRayTests/ProfileTest.MergeProfilesByStack (73848 of 74057)
PASS: LLVM-Unit :: XRay/./XRayTests/ProfileTest.InternPath (73849 of 74057)
PASS: LLVM-Unit :: XRay/./XRayTests/ProfileTest.MergeProfilesByThread (73850 of 74057)
PASS: LLVM-Unit :: XRay/./XRayTests/Records/PrinterTest/1.PrintsRecord (73851 of 74057)
PASS: LLVM-Unit :: XRay/./XRayTests/ProfileTest.MoveProfile (73852 of 74057)
PASS: LLVM-Unit :: XRay/./XRayTests/ProfileTest.MergeProfilesByThreadAccumulate (73853 of 74057)
PASS: LLVM-Unit :: XRay/./XRayTests/Records/PrinterTest/2.PrintsRecord (73854 of 74057)
PASS: LLVM-Unit :: XRay/./XRayTests/Records/PrinterTest/0.PrintsRecord (73855 of 74057)
PASS: LLVM-Unit :: XRay/./XRayTests/Records/PrinterTest/3.PrintsRecord (73856 of 74057)
PASS: LLVM-Unit :: XRay/./XRayTests/Records/PrinterTest/4.PrintsRecord (73857 of 74057)
PASS: LLVM-Unit :: XRay/./XRayTests/Records/PrinterTest/5.PrintsRecord (73858 of 74057)
PASS: LLVM-Unit :: XRay/./XRayTests/Records/PrinterTest/7.PrintsRecord (73859 of 74057)
PASS: LLVM-Unit :: XRay/./XRayTests/Records/PrinterTest/6.PrintsRecord (73860 of 74057)
PASS: LLVM-Unit :: XRay/./XRayTests/Records/PrinterTest/9.PrintsRecord (73861 of 74057)
PASS: LLVM-Unit :: XRay/./XRayTests/Records/RoundTripTest/0.RoundTripsSingleValue (73862 of 74057)
PASS: LLVM-Unit :: XRay/./XRayTests/Records/RoundTripTest/1.RoundTripsSingleValue (73863 of 74057)
PASS: LLVM-Unit :: XRay/./XRayTests/Records/RoundTripTest/2.RoundTripsSingleValue (73864 of 74057)
PASS: LLVM-Unit :: XRay/./XRayTests/Records/PrinterTest/8.PrintsRecord (73865 of 74057)
PASS: LLVM-Unit :: XRay/./XRayTests/Records/RoundTripTest/4.RoundTripsSingleValue (73866 of 74057)
PASS: LLVM-Unit :: XRay/./XRayTests/Records/RoundTripTest/5.RoundTripsSingleValue (73867 of 74057)
PASS: LLVM-Unit :: XRay/./XRayTests/Records/RoundTripTest/7.RoundTripsSingleValue (73868 of 74057)
PASS: LLVM-Unit :: XRay/./XRayTests/Records/RoundTripTest/6.RoundTripsSingleValue (73869 of 74057)
PASS: LLVM-Unit :: XRay/./XRayTests/Records/RoundTripTestV5/1.RoundTripsSingleValue (73870 of 74057)
PASS: LLVM-Unit :: XRay/./XRayTests/Records/RoundTripTest/3.RoundTripsSingleValue (73871 of 74057)
PASS: LLVM-Unit :: XRay/./XRayTests/Records/RoundTripTestV5/2.RoundTripsSingleValue (73872 of 74057)
PASS: LLVM-Unit :: XRay/./XRayTests/Records/RoundTripTestV5/3.RoundTripsSingleValue (73873 of 74057)
PASS: LLVM-Unit :: XRay/./XRayTests/Records/RoundTripTestV5/0.RoundTripsSingleValue (73874 of 74057)
PASS: LLVM-Unit :: XRay/./XRayTests/Records/RoundTripTestV5/5.RoundTripsSingleValue (73875 of 74057)
PASS: LLVM-Unit :: XRay/./XRayTests/Records/RoundTripTestV5/4.RoundTripsSingleValue (73876 of 74057)
PASS: LLVM-Unit :: XRay/./XRayTests/Records/RoundTripTestV5/7.RoundTripsSingleValue (73877 of 74057)
PASS: LLVM-Unit :: XRay/./XRayTests/Records/RoundTripTestV5/6.RoundTripsSingleValue (73878 of 74057)
PASS: LLVM-Unit :: XRay/./XRayTests/XRayFDRTest.IndexAndVerifyBlocks (73879 of 74057)
PASS: LLVM-Unit :: XRay/./XRayTests/XRayFDRTest.BuilderAndBlockIndexer (73880 of 74057)
PASS: LLVM-Unit :: XRay/./XRayTests/XRayFDRTest.BuilderAndBlockVerifier (73881 of 74057)
PASS: LLVM-Unit :: XRay/./XRayTests/Records/RoundTripTestV5/8.RoundTripsSingleValue (73882 of 74057)
PASS: LLVM-Unit :: tools/llvm-cfi-verify/./CFIVerifyTests/BasicAArch64FileAnalysisTest.AArch64ClobberLoadAddBad (73883 of 74057)
PASS: LLVM-Unit :: tools/llvm-cfi-verify/./CFIVerifyTests/BasicAArch64FileAnalysisTest.AArch64BasicUnprotected (73884 of 74057)
PASS: LLVM-Unit :: tools/llvm-cfi-verify/./CFIVerifyTests/BasicAArch64FileAnalysisTest.AArch64BasicProtected (73885 of 74057)
PASS: LLVM-Unit :: tools/llvm-cfi-verify/./CFIVerifyTests/BasicAArch64FileAnalysisTest.AArch64ClobberBasic (73886 of 74057)
PASS: LLVM-Unit :: tools/llvm-cfi-verify/./CFIVerifyTests/BasicAArch64FileAnalysisTest.AArch64ClobberLoadAddBad2 (73887 of 74057)
PASS: LLVM-Unit :: tools/llvm-cfi-verify/./CFIVerifyTests/BasicAArch64FileAnalysisTest.AArch64ClobberOneLoad (73888 of 74057)
PASS: LLVM-Unit :: tools/llvm-cfi-verify/./CFIVerifyTests/BasicAArch64FileAnalysisTest.AArch64ClobberLoadAddGood (73889 of 74057)
PASS: LLVM-Unit :: tools/llvm-cfi-verify/./CFIVerifyTests/BasicAArch64FileAnalysisTest.AArch64ClobberUnrelatedLoads (73890 of 74057)
PASS: LLVM-Unit :: tools/llvm-cfi-verify/./CFIVerifyTests/BasicAArch64FileAnalysisTest.AArch64ClobberUnrelatedSecondLoad (73891 of 74057)
PASS: LLVM-Unit :: tools/llvm-cfi-verify/./CFIVerifyTests/BasicAArch64FileAnalysisTest.AArch64ClobberTwoLoads (73892 of 74057)
PASS: LLVM-Unit :: tools/llvm-cfi-verify/./CFIVerifyTests/BasicAArch64FileAnalysisTest.AArch64TwoPaths (73893 of 74057)
PASS: LLVM-Unit :: tools/llvm-cfi-verify/./CFIVerifyTests/BasicAArch64FileAnalysisTest.AArch64GoodAndBadPaths (73894 of 74057)
PASS: LLVM-Unit :: tools/llvm-cfi-verify/./CFIVerifyTests/BasicGraphBuilderTest.BuildFlowGraphComplexExample (73895 of 74057)
PASS: LLVM-Unit :: tools/llvm-cfi-verify/./CFIVerifyTests/BasicGraphBuilderTest.BuildFlowGraphConditionalInfiniteLoop (73896 of 74057)
PASS: LLVM-Unit :: tools/llvm-cfi-verify/./CFIVerifyTests/BasicAArch64FileAnalysisTest.AArch64TwoPathsBadLoad1 (73897 of 74057)
PASS: LLVM-Unit :: tools/llvm-cfi-verify/./CFIVerifyTests/BasicGraphBuilderTest.BuildFlowGraphFailures (73898 of 74057)
PASS: LLVM-Unit :: tools/llvm-cfi-verify/./CFIVerifyTests/BasicAArch64FileAnalysisTest.AArch64TwoPathsBadLoad2 (73899 of 74057)
PASS: LLVM-Unit :: tools/llvm-cfi-verify/./CFIVerifyTests/BasicGraphBuilderTest.BuildFlowGraphLengthExceededDownwards (73900 of 74057)
PASS: LLVM-Unit :: tools/llvm-cfi-verify/./CFIVerifyTests/BasicGraphBuilderTest.BuildFlowGraphLengthExceededUpwards (73901 of 74057)
PASS: LLVM-Unit :: tools/llvm-cfi-verify/./CFIVerifyTests/BasicGraphBuilderTest.BuildFlowGraphTestDualPathSingleUd2 (73902 of 74057)
PASS: LLVM-Unit :: tools/llvm-cfi-verify/./CFIVerifyTests/BasicGraphBuilderTest.BuildFlowGraphTestDualPathDualUd2 (73903 of 74057)
PASS: LLVM-Unit :: tools/llvm-cfi-verify/./CFIVerifyTests/BasicGraphBuilderTest.BuildFlowGraphNoXrefs (73904 of 74057)
PASS: LLVM-Unit :: tools/llvm-cfi-verify/./CFIVerifyTests/BasicGraphBuilderTest.BuildFlowGraphNoFlowsToIndirection (73905 of 74057)
PASS: LLVM-Unit :: tools/llvm-cfi-verify/./CFIVerifyTests/BasicGraphBuilderTest.BuildFlowGraphTestSinglePathFallthroughUd2 (73906 of 74057)
PASS: LLVM-Unit :: tools/llvm-cfi-verify/./CFIVerifyTests/BasicGraphBuilderTest.BuildFlowGraphTestSinglePathJumpUd2 (73907 of 74057)
PASS: LLVM-Unit :: tools/llvm-cfi-verify/./CFIVerifyTests/BasicGraphBuilderTest.BuildFlowGraphWithRepeatedWork (73908 of 74057)
PASS: LLVM-Unit :: tools/llvm-cfi-verify/./CFIVerifyTests/BasicGraphBuilderTest.BuildFlowGraphUnconditionalInfiniteLoop (73909 of 74057)
PASS: LLVM-Unit :: tools/llvm-cfi-verify/./CFIVerifyTests/BasicX86FileAnalysisTest.CFIProtectionBasicFallthroughToUd2 (73910 of 74057)
PASS: LLVM-Unit :: tools/llvm-cfi-verify/./CFIVerifyTests/BasicX86FileAnalysisTest.CFIProtectionBasicJumpToUd2 (73911 of 74057)
PASS: LLVM-Unit :: tools/llvm-cfi-verify/./CFIVerifyTests/BasicX86FileAnalysisTest.CFIProtectionClobberSinglePathExplicit (73912 of 74057)
PASS: LLVM-Unit :: tools/llvm-cfi-verify/./CFIVerifyTests/BasicX86FileAnalysisTest.CFIProtectionClobberSinglePathImplicit (73913 of 74057)
PASS: LLVM-Unit :: tools/llvm-cfi-verify/./CFIVerifyTests/BasicX86FileAnalysisTest.CFIProtectionClobberSinglePathExplicit2 (73914 of 74057)
PASS: LLVM-Unit :: tools/llvm-cfi-verify/./CFIVerifyTests/BasicX86FileAnalysisTest.BasicDisassemblyTraversalTest (73915 of 74057)
PASS: LLVM-Unit :: tools/llvm-cfi-verify/./CFIVerifyTests/BasicX86FileAnalysisTest.CFIProtectionClobberDualPathImplicit (73916 of 74057)
PASS: LLVM-Unit :: tools/llvm-cfi-verify/./CFIVerifyTests/BasicX86FileAnalysisTest.CFIProtectionDualFailLimitUpwards (73917 of 74057)
PASS: LLVM-Unit :: tools/llvm-cfi-verify/./CFIVerifyTests/BasicX86FileAnalysisTest.CFIProtectionDualFailLimitDownwards (73918 of 74057)
PASS: LLVM-Unit :: tools/llvm-cfi-verify/./CFIVerifyTests/BasicX86FileAnalysisTest.CFIProtectionComplexExample (73919 of 74057)
PASS: LLVM-Unit :: tools/llvm-cfi-verify/./CFIVerifyTests/BasicX86FileAnalysisTest.CFIProtectionDualPathSingleUd2 (73920 of 74057)
PASS: LLVM-Unit :: tools/llvm-cfi-verify/./CFIVerifyTests/BasicX86FileAnalysisTest.CFIProtectionDualPathUd2 (73921 of 74057)
PASS: LLVM-Unit :: tools/llvm-cfi-verify/./CFIVerifyTests/BasicX86FileAnalysisTest.CFIProtectionInvalidTargets (73922 of 74057)
PASS: LLVM-Unit :: tools/llvm-cfi-verify/./CFIVerifyTests/BasicX86FileAnalysisTest.CFIProtectionWithUnconditionalJumpInFallthrough (73923 of 74057)
PASS: LLVM-Unit :: tools/llvm-cfi-verify/./CFIVerifyTests/BasicX86FileAnalysisTest.CFITrapTest (73924 of 74057)
PASS: LLVM-Unit :: tools/llvm-cfi-verify/./CFIVerifyTests/BasicX86FileAnalysisTest.PrevAndNextFromBadInst (73925 of 74057)
PASS: LLVM-Unit :: tools/llvm-cfi-verify/./CFIVerifyTests/BasicX86FileAnalysisTest.FallThroughTest (73926 of 74057)
PASS: LLVM-Unit :: tools/llvm-cfi-verify/./CFIVerifyTests/BasicX86FileAnalysisTest.DefiniteNextInstructionTest (73927 of 74057)
PASS: LLVM-Unit :: tools/llvm-cfi-verify/./CFIVerifyTests/BasicX86FileAnalysisTest.ControlFlowXRefsTest (73928 of 74057)
PASS: LLVM-Unit :: tools/llvm-cfi-verify/./CFIVerifyTests/BasicX86FileAnalysisTest.CFIProtectionGoodAndBadPaths (73929 of 74057)
PASS: LLVM-Unit :: tools/llvm-cfi-verify/./CFIVerifyTests/BasicX86FileAnalysisTest.UndefSearchLengthOneTest (73930 of 74057)
PASS: LLVM-Unit :: tools/llvm-cfi-verify/./CFIVerifyTests/BasicX86FileAnalysisTest.UndefSearchLengthOneTestFarAway (73931 of 74057)
PASS: LLVM-Unit :: tools/llvm-exegesis/./LLVMExegesisTests/BenchmarkResultTest.PerInstructionStats (73932 of 74057)
PASS: LLVM-Unit :: tools/llvm-exegesis/./LLVMExegesisTests/ClusteringTest.Clusters3D_InvalidSize (73933 of 74057)
PASS: LLVM-Unit :: tools/llvm-exegesis/./LLVMExegesisTests/AArch64TargetTest.SetRegToConstant (73934 of 74057)
PASS: LLVM-Unit :: tools/llvm-exegesis/./LLVMExegesisTests/AArch64TargetTest.DefaultPfmCounters (73935 of 74057)
PASS: LLVM-Unit :: tools/llvm-exegesis/./LLVMExegesisTests/ClusteringTest.Clusters3D_InvalidOrder (73936 of 74057)
PASS: LLVM-Unit :: tools/llvm-exegesis/./LLVMExegesisTests/ClusteringTest.Clusters3D (73937 of 74057)
PASS: LLVM-Unit :: tools/llvm-exegesis/./LLVMExegesisTests/ClusteringTest.Ordering (73938 of 74057)
PASS: LLVM-Unit :: tools/llvm-exegesis/./LLVMExegesisTests/ClusteringTest.Ordering2 (73939 of 74057)
PASS: LLVM-Unit :: tools/llvm-exegesis/./LLVMExegesisTests/CombinationGenerator.Column (73940 of 74057)
PASS: LLVM-Unit :: tools/llvm-exegesis/./LLVMExegesisTests/CombinationGenerator.MiddleColumn (73941 of 74057)
PASS: LLVM-Unit :: tools/llvm-exegesis/./LLVMExegesisTests/ClusteringTest.Ordering1 (73942 of 74057)
PASS: LLVM-Unit :: tools/llvm-exegesis/./LLVMExegesisTests/CombinationGenerator.LeftColumn (73943 of 74057)
PASS: LLVM-Unit :: tools/llvm-exegesis/./LLVMExegesisTests/CombinationGenerator.RightColumn (73944 of 74057)
PASS: LLVM-Unit :: tools/llvm-exegesis/./LLVMExegesisTests/CombinationGenerator.Row (73945 of 74057)
PASS: LLVM-Unit :: tools/llvm-exegesis/./LLVMExegesisTests/CombinationGenerator.SideColumns (73946 of 74057)
PASS: LLVM-Unit :: tools/llvm-exegesis/./LLVMExegesisTests/CombinationGenerator.Singleton (73947 of 74057)
PASS: LLVM-Unit :: tools/llvm-exegesis/./LLVMExegesisTests/CombinationGenerator.Square (73948 of 74057)
PASS: LLVM-Unit :: tools/llvm-exegesis/./LLVMExegesisTests/PerfHelperTest.FunctionalTest (73949 of 74057)
PASS: LLVM-Unit :: tools/llvm-exegesis/./LLVMExegesisTests/RegisterValueTest.Double (73950 of 74057)
PASS: LLVM-Unit :: tools/llvm-exegesis/./LLVMExegesisTests/RegisterValueTest.Half (73951 of 74057)
PASS: LLVM-Unit :: tools/llvm-exegesis/./LLVMExegesisTests/RegisterValueTest.Single (73952 of 74057)
PASS: LLVM-Unit :: tools/llvm-exegesis/./LLVMExegesisTests/ScratchSpaceTest.Works (73953 of 74057)
PASS: LLVM-Unit :: tools/llvm-exegesis/./LLVMExegesisTests/X86Core2Avx512TargetTest.FillMemoryOperands_ADD64rm (73954 of 74057)
PASS: LLVM-Unit :: tools/llvm-exegesis/./LLVMExegesisTests/X86Core2Avx512TargetTest.FillMemoryOperands_VGATHERDPSZ128rm (73955 of 74057)
PASS: LLVM-Unit :: tools/llvm-exegesis/./LLVMExegesisTests/X86Core2Avx512TargetTest.SetRegToVR128Value_Use_VMOVDQU32Z128rm (73956 of 74057)
PASS: LLVM-Unit :: tools/llvm-exegesis/./LLVMExegesisTests/X86Core2Avx512TargetTest.SetRegToVR256Value_Use_VMOVDQU32Z256rm (73957 of 74057)
PASS: LLVM-Unit :: tools/llvm-exegesis/./LLVMExegesisTests/BenchmarkResultTest.WriteToAndReadFromDisk (73958 of 74057)
PASS: LLVM-Unit :: tools/llvm-exegesis/./LLVMExegesisTests/X86Core2Avx512TargetTest.SetRegToVR512Value (73959 of 74057)
PASS: LLVM-Unit :: tools/llvm-exegesis/./LLVMExegesisTests/X86Core2TargetTest.SetFlags (73960 of 74057)
PASS: LLVM-Unit :: tools/llvm-exegesis/./LLVMExegesisTests/X86Core2AvxTargetTest.SetRegToVR128Value_Use_VMOVDQUrm (73961 of 74057)
PASS: LLVM-Unit :: tools/llvm-exegesis/./LLVMExegesisTests/X86Core2TargetTest.NoHighByteRegs (73962 of 74057)
PASS: LLVM-Unit :: tools/llvm-exegesis/./LLVMExegesisTests/X86Core2TargetTest.AllowAsBackToBack (73963 of 74057)
PASS: LLVM-Unit :: tools/llvm-exegesis/./LLVMExegesisTests/X86Core2TargetTest.SetRegToFP0_80Bits (73964 of 74057)
PASS: LLVM-Unit :: tools/llvm-exegesis/./LLVMExegesisTests/X86Core2AvxTargetTest.SetRegToVR256Value_Use_VMOVDQUYrm (73965 of 74057)
PASS: LLVM-Unit :: tools/llvm-exegesis/./LLVMExegesisTests/X86Core2TargetTest.SetRegToFP1_32Bits (73966 of 74057)
PASS: LLVM-Unit :: tools/llvm-exegesis/./LLVMExegesisTests/X86Core2TargetTest.SetRegToFP1_4Bits (73967 of 74057)
PASS: LLVM-Unit :: tools/llvm-exegesis/./LLVMExegesisTests/X86Core2TargetTest.SetRegToGR32Value (73968 of 74057)
PASS: LLVM-Unit :: tools/llvm-exegesis/./LLVMExegesisTests/X86Core2TargetTest.SetRegToGR64Value (73969 of 74057)
PASS: LLVM-Unit :: tools/llvm-exegesis/./LLVMExegesisTests/X86Core2TargetTest.SetRegToGR16Value (73970 of 74057)
PASS: LLVM-Unit :: tools/llvm-exegesis/./LLVMExegesisTests/X86Core2TargetTest.SetRegToGR8Value (73971 of 74057)
PASS: LLVM-Unit :: tools/llvm-exegesis/./LLVMExegesisTests/X86Core2TargetTest.SetRegToST0_64Bits (73972 of 74057)
PASS: LLVM-Unit :: tools/llvm-exegesis/./LLVMExegesisTests/X86Core2TargetTest.SetRegToST0_32Bits (73973 of 74057)
PASS: LLVM-Unit :: tools/llvm-exegesis/./LLVMExegesisTests/X86Core2TargetTest.SetRegToST1_32Bits (73974 of 74057)
PASS: LLVM-Unit :: tools/llvm-exegesis/./LLVMExegesisTests/X86Core2TargetTest.SetRegToVR128Value_Use_MOVDQUrm (73975 of 74057)
PASS: LLVM-Unit :: tools/llvm-exegesis/./LLVMExegesisTests/X86Core2TargetTest.SetRegToST0_80Bits (73976 of 74057)
PASS: LLVM-Unit :: tools/llvm-exegesis/./LLVMExegesisTests/X86FakeSnippetGeneratorTest.ComputeRegisterInitialValuesAdd16ri (73977 of 74057)
PASS: LLVM-Unit :: tools/llvm-exegesis/./LLVMExegesisTests/X86FakeSnippetGeneratorTest.MemoryUse_Movsb (73978 of 74057)
PASS: LLVM-Unit :: tools/llvm-exegesis/./LLVMExegesisTests/X86Core2TargetTest.SetRegToVR64Value (73979 of 74057)
PASS: LLVM-Unit :: tools/llvm-exegesis/./LLVMExegesisTests/X86ParallelSnippetGeneratorTest.AvoidSerializingThroughImplicitRegisters (73980 of 74057)
PASS: LLVM-Unit :: tools/llvm-exegesis/./LLVMExegesisTests/X86FakeSnippetGeneratorTest.ComputeRegisterInitialValuesAdd64rr (73981 of 74057)
PASS: LLVM-Unit :: tools/llvm-exegesis/./LLVMExegesisTests/X86ParallelSnippetGeneratorTest.NoTiedVariables (73982 of 74057)
PASS: LLVM-Unit :: tools/llvm-exegesis/./LLVMExegesisTests/X86ParallelSnippetGeneratorTest.ParallelInstruction (73983 of 74057)
PASS: LLVM-Unit :: tools/llvm-exegesis/./LLVMExegesisTests/X86ParallelSnippetGeneratorTest.StaticRenaming (73984 of 74057)
PASS: LLVM-Unit :: tools/llvm-exegesis/./LLVMExegesisTests/X86ParallelSnippetGeneratorTest.MOV16ms (73985 of 74057)
PASS: LLVM-Unit :: tools/llvm-exegesis/./LLVMExegesisTests/X86RegisterAliasingTest.TrackRegisterClassCache (73986 of 74057)
PASS: LLVM-Unit :: tools/llvm-exegesis/./LLVMExegesisTests/X86RegisterAliasingTest.TrackRegisterClass (73987 of 74057)
PASS: LLVM-Unit :: tools/llvm-exegesis/./LLVMExegesisTests/X86ParallelSnippetGeneratorTest.MemoryUse (73988 of 74057)
PASS: LLVM-Unit :: tools/llvm-exegesis/./LLVMExegesisTests/X86ParallelSnippetGeneratorTest.SerialInstruction (73989 of 74057)
PASS: LLVM-Unit :: tools/llvm-exegesis/./LLVMExegesisTests/X86SchedClassResolutionTest.ComputeIdealizedProcResPressure_1P1_1P05_2P0156 (73990 of 74057)
PASS: LLVM-Unit :: tools/llvm-exegesis/./LLVMExegesisTests/X86RegisterAliasingTest.TrackSimpleRegister (73991 of 74057)
PASS: LLVM-Unit :: tools/llvm-exegesis/./LLVMExegesisTests/X86SchedClassResolutionTest.ComputeIdealizedProcResPressure_2P05 (73992 of 74057)
PASS: LLVM-Unit :: tools/llvm-exegesis/./LLVMExegesisTests/X86SchedClassResolutionTest.ComputeIdealizedProcResPressure_2P05_2P0156 (73993 of 74057)
PASS: LLVM-Unit :: tools/llvm-exegesis/./LLVMExegesisTests/X86SchedClassResolutionTest.ComputeIdealizedProcResPressure_2P0 (73994 of 74057)
PASS: LLVM-Unit :: tools/llvm-exegesis/./LLVMExegesisTests/X86SerialSnippetGeneratorTest.ImplicitSelfDependencyThroughExplicitRegs (73995 of 74057)
PASS: LLVM-Unit :: tools/llvm-exegesis/./LLVMExegesisTests/X86SerialSnippetGeneratorTest.ImplicitSelfDependencyThroughTiedRegs (73996 of 74057)
PASS: LLVM-Unit :: tools/llvm-exegesis/./LLVMExegesisTests/X86SerialSnippetGeneratorTest.ImplicitSelfDependencyThroughImplicitReg (73997 of 74057)
PASS: LLVM-Unit :: tools/llvm-profgen/./LLVMProfgenTests/TestCompression.TestMaxDedupSize (73998 of 74057)
PASS: LLVM-Unit :: tools/llvm-exegesis/./LLVMExegesisTests/X86SnippetFileTest.BadDefregParam (73999 of 74057)
PASS: LLVM-Unit :: tools/llvm-exegesis/./LLVMExegesisTests/X86SnippetFileTest.MissingParam (74000 of 74057)
PASS: LLVM-Unit :: tools/llvm-exegesis/./LLVMExegesisTests/X86SerialSnippetGeneratorTest.VCVTUSI642SDZrrb_Int (74001 of 74057)
PASS: LLVM-Unit :: tools/llvm-exegesis/./LLVMExegesisTests/X86SerialSnippetGeneratorTest.DependencyThroughOtherOpcode (74002 of 74057)
PASS: LLVM-Unit :: tools/llvm-exegesis/./LLVMExegesisTests/X86SnippetFileTest.Works (74003 of 74057)
PASS: LLVM-Unit :: tools/llvm-exegesis/./LLVMExegesisTests/X86SnippetRepetitorTest.Duplicate (74004 of 74057)
PASS: LLVM-Unit :: tools/llvm-exegesis/./LLVMExegesisTests/X86SnippetFileTest.NoAsmStreamer (74005 of 74057)
PASS: LLVM-Unit :: tools/llvm-profgen/./LLVMProfgenTests/TestCompression.TestNoSizeLimit2 (74006 of 74057)
PASS: LLVM-Unit :: tools/llvm-exegesis/./LLVMExegesisTests/X86SnippetFileTest.NoDefregValue (74007 of 74057)
PASS: LLVM-Unit :: tools/llvm-profgen/./LLVMProfgenTests/TestCompression.TestNoSizeLimit1 (74008 of 74057)
PASS: LLVM-Unit :: tools/llvm-exegesis/./LLVMExegesisTests/X86SnippetRepetitorTest.Loop (74009 of 74057)
PASS: LLVM-Unit :: tools/llvm-exegesis/./LLVMExegesisTests/X86SerialSnippetGeneratorTest.LAHF (74010 of 74057)
PASS: LLVM-Unit :: tools/llvm-exegesis/./LLVMExegesisTests/X86SerialSnippetGeneratorTest.ImplicitSelfDependencyThroughExplicitRegsForbidAll (74011 of 74057)
PASS: lit :: boolean-parsing.py (74012 of 74057)
PASS: lit :: lld-features.py (74013 of 74057)
PASS: lit :: parallelism-groups.py (74014 of 74057)
PASS: lit :: custom-result-category.py (74015 of 74057)
PASS: lit :: progress-bar.py (74016 of 74057)
PASS: lit :: shtest-encoding.py (74017 of 74057)
PASS: lit :: googletest-discovery-failed.py (74018 of 74057)
PASS: lit :: shell-parsing.py (74019 of 74057)
PASS: lit :: reorder.py (74020 of 74057)
PASS: lit :: show-used-features.py (74021 of 74057)
PASS: lit :: ignore-fail.py (74022 of 74057)
PASS: lit :: googletest-upstream-format.py (74023 of 74057)
PASS: lit :: shtest-format-argv0.py (74024 of 74057)
PASS: lit :: googletest-format.py (74025 of 74057)
PASS: lit :: shtest-keyword-parse-errors.py (74026 of 74057)
PASS: lit :: shtest-format.py (74027 of 74057)
PASS: lit :: shtest-output-printing.py (74028 of 74057)
PASS: lit :: shtest-run-at-line.py (74029 of 74057)
PASS: lit :: max-failures.py (74030 of 74057)
PASS: lit :: show-result-codes.py (74031 of 74057)
PASS: lit :: test-data-micro.py (74032 of 74057)
PASS: lit :: shtest-env.py (74033 of 74057)
PASS: lit :: test-data.py (74034 of 74057)
PASS: lit :: shtest-inject.py (74035 of 74057)
PASS: lit :: test-output-micro-resultdb.py (74036 of 74057)
PASS: lit :: unit/ShUtil.py (74037 of 74057)
PASS: lit :: test-output-micro.py (74038 of 74057)
PASS: lit :: unit/TestRunner.py (74039 of 74057)
PASS: lit :: test-output-resultdb.py (74040 of 74057)
PASS: lit :: test-output.py (74041 of 74057)
PASS: lit :: unittest-adaptor.py (74042 of 74057)
PASS: lit :: unparsed-requirements.py (74043 of 74057)
PASS: lit :: lit-opts.py (74044 of 74057)
PASS: lit :: xunit-output.py (74045 of 74057)
PASS: lit :: usage.py (74046 of 74057)
PASS: lit :: use-llvm-tool.py (74047 of 74057)
PASS: lit :: allow-retries.py (74048 of 74057)
PASS: lit :: shtest-recursive-substitution.py (74049 of 74057)
PASS: lit :: xfail-cl.py (74050 of 74057)
PASS: lit :: googletest-timeout.py (74051 of 74057)
PASS: lit :: shtest-not.py (74052 of 74057)
PASS: lit :: discovery.py (74053 of 74057)
PASS: lit :: max-time.py (74054 of 74057)
PASS: lit :: shtest-timeout.py (74055 of 74057)
PASS: lit :: selecting.py (74056 of 74057)
PASS: lit :: shtest-shell.py (74057 of 74057)
********************
Failed Tests (1):
  Clang :: OpenMP/remarks_parallel_in_multiple_target_state_machines.c

Hide Details

Hide Details

Testing Time: 575.55s Skipped : 4 Unsupported : 13772 Passed : 60187 Expectedly Failed: 93 Failed : 1 FAILED: CMakeFiles/check-all cd /Users/buildslave/jenkins/workspace/clang-stage2-Rthinlto/clang-build/Build && /usr/local/Frameworks/Python.framework/Versions/3.7/bin/python3.7 /Users/buildslave/jenkins/workspace/clang-stage2-Rthinlto/clang-build/Build/./bin/llvm-lit --xunit-xml-output=testresults.xunit.xml -v -vv --timeout=600 --param USE_Z3_SOLVER=0 /Users/buildslave/jenkins/workspace/clang-stage2-Rthinlto/clang-build/Build/tools/clang/test /Users/buildslave/jenkins/workspace/clang-stage2-Rthinlto/clang-build/Build/utils/lit /Users/buildslave/jenkins/workspace/clang-stage2-Rthinlto/clang-build/Build/test ninja: build stopped: cannot make progress due to previous errors. [Pipeline] } [Pipeline] // timeout [Pipeline] junit Recording test results [Checks API] No suitable checks publisher found. [Pipeline] } [Pipeline] // stage [Pipeline] stage [Pipeline] { (Declarative: Post Actions) [Pipeline] scanForIssues [Clang] Sleeping for 5 seconds due to JENKINS-32191... [Clang] Parsing console log (workspace: '/Users/buildslave/jenkins/workspace/clang-stage2-Rthinlto') [Clang] -> found 12 issues (skipped 37 duplicates) [Clang] Parsing console log (workspace: '/Users/buildslave/jenkins/workspace/clang-stage2-Rthinlto') [Clang] [-ERROR-] Can't create fingerprints for some files: [Clang] [-ERROR-] - '/Users/buildslave/jenkins/workspace/clang-stage2-Rthinlto/clang-build/Build/tools/clang/sanitizer_common/sanitizer_mac.cpp', IO exception has been thrown: java.nio.file.NoSuchFileException: /Users/buildslave/jenkins/workspace/clang-stage2-Rthinlto/clang-build/Build/tools/clang/sanitizer_common/sanitizer_mac.cpp [Clang] [-ERROR-] - '/Users/buildslave/jenkins/workspace/clang-stage2-Rthinlto/clang-build/Build/tools/clang/sanitizer_common/sanitizer_mac.cpp', IO exception has been thrown: java.nio.file.NoSuchFileException: /Users/buildslave/jenkins/workspace/clang-stage2-Rthinlto/clang-build/Build/tools/clang/sanitizer_common/sanitizer_mac.cpp [Clang] [-ERROR-] - '/Users/buildslave/jenkins/workspace/clang-stage2-Rthinlto/clang-build/Build/tools/clang/sanitizer_common/sanitizer_mac.cpp', IO exception has been thrown: java.nio.file.NoSuchFileException: /Users/buildslave/jenkins/workspace/clang-stage2-Rthinlto/clang-build/Build/tools/clang/sanitizer_common/sanitizer_mac.cpp [Clang] [-ERROR-] - '/Users/buildslave/jenkins/workspace/clang-stage2-Rthinlto/clang-build/Build/tools/clang/sanitizer_common/sanitizer_mac.cpp', IO exception has been thrown: java.nio.file.NoSuchFileException: /Users/buildslave/jenkins/workspace/clang-stage2-Rthinlto/clang-build/Build/tools/clang/sanitizer_common/sanitizer_mac.cpp [Clang] [-ERROR-] - '/Users/buildslave/jenkins/workspace/clang-stage2-Rthinlto/clang-build/Build/tools/clang/sanitizer_common/sanitizer_mac.cpp', IO exception has been thrown: java.nio.file.NoSuchFileException: /Users/buildslave/jenkins/workspace/clang-stage2-Rthinlto/clang-build/Build/tools/clang/sanitizer_common/sanitizer_mac.cpp [Clang] [-ERROR-] - '/Users/buildslave/jenkins/workspace/clang-stage2-Rthinlto/clang-build/Build/tools/clang/sanitizer_common/sanitizer_mac.cpp', IO exception has been thrown: java.nio.file.NoSuchFileException: /Users/buildslave/jenkins/workspace/clang-stage2-Rthinlto/clang-build/Build/tools/clang/sanitizer_common/sanitizer_mac.cpp [Clang] [-ERROR-] - '/Users/buildslave/jenkins/workspace/clang-stage2-Rthinlto/clang-build/Build/tools/clang/sanitizer_common/sanitizer_mac.cpp', IO exception has been thrown: java.nio.file.NoSuchFileException: /Users/buildslave/jenkins/workspace/clang-stage2-Rthinlto/clang-build/Build/tools/clang/sanitizer_common/sanitizer_mac.cpp [Clang] [-ERROR-] - '/Users/buildslave/jenkins/workspace/clang-stage2-Rthinlto/clang-build/Build/tools/clang/sanitizer_common/sanitizer_mac.cpp', IO exception has been thrown: java.nio.file.NoSuchFileException: /Users/buildslave/jenkins/workspace/clang-stage2-Rthinlto/clang-build/Build/tools/clang/sanitizer_common/sanitizer_mac.cpp [Clang] [-ERROR-] - '/Users/buildslave/jenkins/workspace/clang-stage2-Rthinlto/clang-build/Build/tools/clang/runtime/compiler-rt-bins/llvm-lit: /Users/buildslave/jenkins/workspace/clang-stage2-Rthinlto/llvm-project/compiler-rt/test/lit.common.cfg.py', IO exception has been thrown: java.nio.file.NoSuchFileException: /Users/buildslave/jenkins/workspace/clang-stage2-Rthinlto/clang-build/Build/tools/clang/runtime/compiler-rt-bins/llvm-lit: /Users/buildslave/jenkins/workspace/clang-stage2-Rthinlto/llvm-project/compiler-rt/test/lit.common.cfg.py [Clang] -> found 12 issues (skipped 37 duplicates) [Clang] Successfully parsed console log [Clang] -> found 12 issues (skipped 37 duplicates) [Clang] Parsing console log (workspace: '/Users/buildslave/jenkins/workspace/clang-stage2-Rthinlto') [Clang] Post processing issues on 'green-dragon-22' with source code encoding 'UTF-8' [Clang] Creating SCM blamer to obtain author and commit information for affected files [Clang] -> No blamer installed yet. You need to install the 'git-forensics' plugin to enable blaming for Git. [Clang] Resolving file names for all issues in source directory '/Users/buildslave/jenkins/workspace/clang-stage2-Rthinlto' [Clang] -> resolved paths in source directory (2 found, 2 not found) [Clang] Resolving module names from module definitions (build.xml, pom.xml, or Manifest.mf files) [Clang] -> resolved module names for 12 issues [Clang] Resolving package names (or namespaces) by parsing the affected files [Clang] -> resolved package names of 4 affected files [Clang] No filter has been set, publishing all 12 issues [Clang] Creating fingerprints for all affected code blocks to track issues over different builds [Clang] -> created fingerprints for 3 issues (skipped 9 issues) [Clang] Copying affected files to Jenkins' build folder '/Users/Shared/Jenkins/Home/jobs/clang-stage2-Rthinlto/builds/4460/files-with-issues' [Clang] -> 2 copied, 0 not in workspace, 9 not-found, 0 with I/O error [Clang] Repository miner is not configured, skipping repository mining [Pipeline] emailext Warning: csigg@google.com is not a recognized user, but sending mail anyway Warning: georgakoudis1@llnl.gov is not a recognized user, but sending mail anyway Warning: aaron@aaronballman.com is not a recognized user, but sending mail anyway Warning: koraq@xs4all.nl is not a recognized user, but sending mail anyway Warning: amy.kwan1@ibm.com is not a recognized user, but sending mail anyway Warning: Justas.Janickas@arm.com is not a recognized user, but sending mail anyway Warning: wingo@igalia.com is not a recognized user, but sending mail anyway Warning: Matthew.Arsenault@amd.com is not a recognized user, but sending mail anyway Warning: quinn.pham@ibm.com is not a recognized user, but sending mail anyway Warning: david.green@arm.com is not a recognized user, but sending mail anyway Warning: nikita.ppv@gmail.com is not a recognized user, but sending mail anyway Warning: diana.picus@linaro.org is not a recognized user, but sending mail anyway Warning: Petar.Avramovic@rt-rk.com is not a recognized user, but sending mail anyway Warning: spatel@rotateright.com is not a recognized user, but sending mail anyway Warning: chris.bieneman@me.com is not a recognized user, but sending mail anyway Warning: dmalyutin@azul.com is not a recognized user, but sending mail anyway Warning: kazu@google.com is not a recognized user, but sending mail anyway Warning: thakis@chromium.org is not a recognized user, but sending mail anyway Warning: powerman1st@163.com is not a recognized user, but sending mail anyway Warning: gusrb406@snu.ac.kr is not a recognized user, but sending mail anyway Warning: anna@azul.com is not a recognized user, but sending mail anyway Warning: kcc@google.com is not a recognized user, but sending mail anyway Warning: cchen@cray.com is not a recognized user, but sending mail anyway Warning: Saiyedul.Islam@amd.com is not a recognized user, but sending mail anyway Warning: resistor@mac.com is not a recognized user, but sending mail anyway Warning: ayal.zaks@intel.com is not a recognized user, but sending mail anyway Warning: dmitry.preobrazhensky@amd.com is not a recognized user, but sending mail anyway Warning: nicolas.vasilache@gmail.com is not a recognized user, but sending mail anyway Warning: brendon.cahoon@amd.com is not a recognized user, but sending mail anyway Warning: michael.hliao@gmail.com is not a recognized user, but sending mail anyway Warning: gysit@google.com is not a recognized user, but sending mail anyway Warning: craig.topper@intel.com is not a recognized user, but sending mail anyway Warning: dblaikie@gmail.com is not a recognized user, but sending mail anyway Warning: flo@fhahn.com is not a recognized user, but sending mail anyway Warning: paulsson@linux.vnet.ibm.com is not a recognized user, but sending mail anyway Warning: llvmgnsyncbot@gmail.com is not a recognized user, but sending mail anyway Warning: csigg@google.com is not a recognized user, but sending mail anyway Warning: georgakoudis1@llnl.gov is not a recognized user, but sending mail anyway Warning: aaron@aaronballman.com is not a recognized user, but sending mail anyway Warning: koraq@xs4all.nl is not a recognized user, but sending mail anyway Warning: amy.kwan1@ibm.com is not a recognized user, but sending mail anyway Warning: Justas.Janickas@arm.com is not a recognized user, but sending mail anyway Warning: wingo@igalia.com is not a recognized user, but sending mail anyway Warning: Matthew.Arsenault@amd.com is not a recognized user, but sending mail anyway Warning: quinn.pham@ibm.com is not a recognized user, but sending mail anyway Warning: david.green@arm.com is not a recognized user, but sending mail anyway Warning: nikita.ppv@gmail.com is not a recognized user, but sending mail anyway Warning: diana.picus@linaro.org is not a recognized user, but sending mail anyway Warning: Petar.Avramovic@rt-rk.com is not a recognized user, but sending mail anyway Warning: spatel@rotateright.com is not a recognized user, but sending mail anyway Warning: chris.bieneman@me.com is not a recognized user, but sending mail anyway Warning: dmalyutin@azul.com is not a recognized user, but sending mail anyway Warning: kazu@google.com is not a recognized user, but sending mail anyway Warning: thakis@chromium.org is not a recognized user, but sending mail anyway Warning: powerman1st@163.com is not a recognized user, but sending mail anyway Warning: gusrb406@snu.ac.kr is not a recognized user, but sending mail anyway Warning: anna@azul.com is not a recognized user, but sending mail anyway Warning: kcc@google.com is not a recognized user, but sending mail anyway Warning: cchen@cray.com is not a recognized user, but sending mail anyway Warning: Saiyedul.Islam@amd.com is not a recognized user, but sending mail anyway Warning: resistor@mac.com is not a recognized user, but sending mail anyway Warning: ayal.zaks@intel.com is not a recognized user, but sending mail anyway Warning: dmitry.preobrazhensky@amd.com is not a recognized user, but sending mail anyway Warning: nicolas.vasilache@gmail.com is not a recognized user, but sending mail anyway Warning: brendon.cahoon@amd.com is not a recognized user, but sending mail anyway Warning: michael.hliao@gmail.com is not a recognized user, but sending mail anyway Warning: gysit@google.com is not a recognized user, but sending mail anyway Warning: craig.topper@intel.com is not a recognized user, but sending mail anyway Warning: dblaikie@gmail.com is not a recognized user, but sending mail anyway Warning: flo@fhahn.com is not a recognized user, but sending mail anyway Warning: paulsson@linux.vnet.ibm.com is not a recognized user, but sending mail anyway Warning: llvmgnsyncbot@gmail.com is not a recognized user, but sending mail anyway

Hide Details

Begin Pre-Send Script... Sending email to: Jessica Paquette <jonathan_roelofs@apple.com> Jessica Paquette <jonathan_roelofs@apple.com> Azhar Mohammed <azhar@apple.com>
[Pipeline] } [Pipeline] // stage [Pipeline] } [Pipeline] // withEnv [Pipeline] } [Pipeline] // node [Pipeline] End of Pipeline Triggering a new build of Debug Info Statistics #4870 Finished: UNSTABLE