Console Output

Skipping 8,283 KB.. Full Log
UNSUPPORTED: SanitizerCommon-lsan-x86_64-Darwin :: Linux/decorate_proc_maps.cpp (1706 of 3269)
UNSUPPORTED: SanitizerCommon-lsan-x86_64-Darwin :: Linux/getgrouplist.cpp (1707 of 3269)
UNSUPPORTED: SanitizerCommon-lsan-x86_64-Darwin :: Linux/iconv_test.c (1708 of 3269)
UNSUPPORTED: SanitizerCommon-lsan-x86_64-Darwin :: Linux/ill.cpp (1709 of 3269)
UNSUPPORTED: SanitizerCommon-lsan-x86_64-Darwin :: Linux/mallopt.cpp (1710 of 3269)
UNSUPPORTED: SanitizerCommon-lsan-x86_64-Darwin :: Linux/mlock_test.cpp (1711 of 3269)
UNSUPPORTED: SanitizerCommon-lsan-x86_64-Darwin :: Linux/mmap64_test.c (1712 of 3269)
UNSUPPORTED: SanitizerCommon-lsan-x86_64-Darwin :: Linux/mmap_write_exec.cpp (1713 of 3269)
UNSUPPORTED: SanitizerCommon-lsan-x86_64-Darwin :: Linux/mprobe.cpp (1714 of 3269)
UNSUPPORTED: SanitizerCommon-lsan-x86_64-Darwin :: Linux/name_to_handle_at.cpp (1715 of 3269)
UNSUPPORTED: SanitizerCommon-lsan-x86_64-Darwin :: Linux/netent.cpp (1716 of 3269)
UNSUPPORTED: SanitizerCommon-lsan-x86_64-Darwin :: Linux/new_delete_test.cpp (1717 of 3269)
UNSUPPORTED: SanitizerCommon-lsan-x86_64-Darwin :: Linux/open_memstream.cpp (1718 of 3269)
UNSUPPORTED: SanitizerCommon-lsan-x86_64-Darwin :: Linux/protoent.cpp (1719 of 3269)
UNSUPPORTED: SanitizerCommon-lsan-x86_64-Darwin :: Linux/pthread_mutex.cpp (1720 of 3269)
UNSUPPORTED: SanitizerCommon-lsan-x86_64-Darwin :: Linux/ptrace.cpp (1721 of 3269)
UNSUPPORTED: SanitizerCommon-lsan-x86_64-Darwin :: Linux/ptsname.c (1722 of 3269)
UNSUPPORTED: SanitizerCommon-lsan-x86_64-Darwin :: Linux/pvalloc-overflow.cpp (1723 of 3269)
UNSUPPORTED: SanitizerCommon-lsan-x86_64-Darwin :: Linux/recv_msg_trunc.cpp (1724 of 3269)
UNSUPPORTED: SanitizerCommon-lsan-x86_64-Darwin :: Linux/resize_tls_dynamic.cpp (1725 of 3269)
UNSUPPORTED: SanitizerCommon-lsan-x86_64-Darwin :: Linux/sched_getparam.cpp (1726 of 3269)
UNSUPPORTED: SanitizerCommon-lsan-x86_64-Darwin :: Linux/sem_init_glibc.cpp (1727 of 3269)
UNSUPPORTED: SanitizerCommon-lsan-x86_64-Darwin :: Linux/signal_line.cpp (1728 of 3269)
UNSUPPORTED: SanitizerCommon-lsan-x86_64-Darwin :: Linux/signal_name.c (1729 of 3269)
UNSUPPORTED: SanitizerCommon-lsan-x86_64-Darwin :: Linux/signal_segv_handler.cpp (1730 of 3269)
UNSUPPORTED: SanitizerCommon-lsan-x86_64-Darwin :: Linux/signal_send.cpp (1731 of 3269)
UNSUPPORTED: SanitizerCommon-lsan-x86_64-Darwin :: Linux/signal_trap_handler.cpp (1732 of 3269)
UNSUPPORTED: SanitizerCommon-lsan-x86_64-Darwin :: Linux/soft_rss_limit_mb_test.cpp (1733 of 3269)
UNSUPPORTED: SanitizerCommon-lsan-x86_64-Darwin :: Linux/symbolize_stack_fp.cpp (1734 of 3269)
UNSUPPORTED: SanitizerCommon-lsan-x86_64-Darwin :: Linux/sysconf_interceptor_bypass_test.cpp (1735 of 3269)
UNSUPPORTED: SanitizerCommon-lsan-x86_64-Darwin :: Linux/sysmsg.c (1736 of 3269)
UNSUPPORTED: SanitizerCommon-lsan-x86_64-Darwin :: Linux/timerfd.cpp (1737 of 3269)
UNSUPPORTED: SanitizerCommon-lsan-x86_64-Darwin :: Linux/ttyent.cpp (1738 of 3269)
UNSUPPORTED: SanitizerCommon-lsan-x86_64-Darwin :: Linux/unexpected_format_specifier_test.cpp (1739 of 3269)
UNSUPPORTED: SanitizerCommon-lsan-x86_64-Darwin :: Linux/use_tls_test.cpp (1740 of 3269)
UNSUPPORTED: SanitizerCommon-lsan-x86_64-Darwin :: Linux/xdrrec.cpp (1741 of 3269)
UNSUPPORTED: SanitizerCommon-lsan-x86_64-Darwin :: NetBSD/asysctl.cpp (1742 of 3269)
UNSUPPORTED: SanitizerCommon-lsan-x86_64-Darwin :: NetBSD/cdb.cpp (1743 of 3269)
UNSUPPORTED: SanitizerCommon-lsan-x86_64-Darwin :: NetBSD/faccessat.cpp (1744 of 3269)
UNSUPPORTED: SanitizerCommon-lsan-x86_64-Darwin :: NetBSD/fparseln.cpp (1745 of 3269)
UNSUPPORTED: SanitizerCommon-lsan-x86_64-Darwin :: NetBSD/funopen2.cpp (1746 of 3269)
UNSUPPORTED: SanitizerCommon-lsan-x86_64-Darwin :: NetBSD/getgroupmembership.cpp (1747 of 3269)
UNSUPPORTED: SanitizerCommon-lsan-x86_64-Darwin :: NetBSD/getvfsstat.cpp (1748 of 3269)
UNSUPPORTED: SanitizerCommon-lsan-x86_64-Darwin :: NetBSD/gid_from_group.cpp (1749 of 3269)
UNSUPPORTED: SanitizerCommon-lsan-x86_64-Darwin :: NetBSD/group_from_gid.cpp (1750 of 3269)
UNSUPPORTED: SanitizerCommon-lsan-x86_64-Darwin :: NetBSD/md2.cpp (1751 of 3269)
UNSUPPORTED: SanitizerCommon-lsan-x86_64-Darwin :: NetBSD/md4.cpp (1752 of 3269)
UNSUPPORTED: SanitizerCommon-lsan-x86_64-Darwin :: NetBSD/md5.cpp (1753 of 3269)
UNSUPPORTED: SanitizerCommon-lsan-x86_64-Darwin :: NetBSD/mi_vector_hash.cpp (1754 of 3269)
UNSUPPORTED: SanitizerCommon-lsan-x86_64-Darwin :: NetBSD/netent.cpp (1755 of 3269)
UNSUPPORTED: SanitizerCommon-lsan-x86_64-Darwin :: NetBSD/paccept.cpp (1756 of 3269)
UNSUPPORTED: SanitizerCommon-lsan-x86_64-Darwin :: NetBSD/protoent.cpp (1757 of 3269)
UNSUPPORTED: SanitizerCommon-lsan-x86_64-Darwin :: NetBSD/rmd160.cpp (1758 of 3269)
UNSUPPORTED: SanitizerCommon-lsan-x86_64-Darwin :: NetBSD/sha1.cpp (1759 of 3269)
UNSUPPORTED: SanitizerCommon-lsan-x86_64-Darwin :: NetBSD/sha2.cpp (1760 of 3269)
UNSUPPORTED: SanitizerCommon-lsan-x86_64-Darwin :: NetBSD/statvfs1.cpp (1761 of 3269)
UNSUPPORTED: SanitizerCommon-lsan-x86_64-Darwin :: NetBSD/strmode.cpp (1762 of 3269)
UNSUPPORTED: SanitizerCommon-lsan-x86_64-Darwin :: NetBSD/strtoi.cpp (1763 of 3269)
UNSUPPORTED: SanitizerCommon-lsan-x86_64-Darwin :: NetBSD/sysctlgetmibinfo.cpp (1764 of 3269)
UNSUPPORTED: SanitizerCommon-lsan-x86_64-Darwin :: NetBSD/uid_from_user.cpp (1765 of 3269)
UNSUPPORTED: SanitizerCommon-lsan-x86_64-Darwin :: NetBSD/user_from_uid.cpp (1766 of 3269)
PASS: SanitizerCommon-asan-x86_64-Darwin :: symbolize_stack.cpp (1767 of 3269)
PASS: SanitizerCommon-lsan-x86_64-Darwin :: Posix/access.cpp (1768 of 3269)
PASS: SanitizerCommon-lsan-x86_64-Darwin :: Posix/arc4random.cpp (1769 of 3269)
PASS: SanitizerCommon-lsan-x86_64-Darwin :: Darwin/symbolizer-function-offset-atos.cpp (1770 of 3269)
UNSUPPORTED: SanitizerCommon-lsan-x86_64-Darwin :: Posix/crypt.cpp (1771 of 3269)
PASS: SanitizerCommon-lsan-x86_64-Darwin :: Posix/create_thread_fail.cpp (1772 of 3269)
PASS: SanitizerCommon-lsan-x86_64-Darwin :: Posix/bsearch.cpp (1773 of 3269)
PASS: SanitizerCommon-lsan-x86_64-Darwin :: Posix/devname.cpp (1774 of 3269)
PASS: SanitizerCommon-lsan-x86_64-Darwin :: Posix/devname_r.cpp (1775 of 3269)
UNSUPPORTED: SanitizerCommon-lsan-x86_64-Darwin :: Posix/dump_registers.cpp (1776 of 3269)
PASS: SanitizerCommon-lsan-x86_64-Darwin :: Posix/feof_fileno_ferror.cpp (1777 of 3269)
PASS: SanitizerCommon-lsan-x86_64-Darwin :: Posix/fgetc_ungetc_getc.cpp (1778 of 3269)
PASS: SanitizerCommon-lsan-x86_64-Darwin :: Posix/fgetln.cpp (1779 of 3269)
PASS: SanitizerCommon-lsan-x86_64-Darwin :: Posix/dump_instruction_bytes.cpp (1780 of 3269)
PASS: SanitizerCommon-lsan-x86_64-Darwin :: Posix/fgets.cpp (1781 of 3269)
PASS: SanitizerCommon-lsan-x86_64-Darwin :: Posix/fputc_putc_putchar.cpp (1782 of 3269)
PASS: SanitizerCommon-lsan-x86_64-Darwin :: Posix/fputs_puts.cpp (1783 of 3269)
UNSUPPORTED: SanitizerCommon-lsan-x86_64-Darwin :: Posix/fseek.cpp (1784 of 3269)
UNSUPPORTED: SanitizerCommon-lsan-x86_64-Darwin :: Posix/fts.cpp (1785 of 3269)
UNSUPPORTED: SanitizerCommon-lsan-x86_64-Darwin :: Posix/funopen.cpp (1786 of 3269)
PASS: SanitizerCommon-lsan-x86_64-Darwin :: Posix/getc_unlocked.cpp (1787 of 3269)
UNSUPPORTED: SanitizerCommon-lsan-x86_64-Darwin :: Posix/getcpuclockid.c (1788 of 3269)
UNSUPPORTED: SanitizerCommon-lsan-x86_64-Darwin :: Posix/getfsent.cpp (1789 of 3269)
PASS: SanitizerCommon-lsan-x86_64-Darwin :: Posix/dedup_token_length_test.cpp (1790 of 3269)
PASS: SanitizerCommon-lsan-x86_64-Darwin :: Posix/fpe.cpp (1791 of 3269)
PASS: SanitizerCommon-lsan-x86_64-Darwin :: Posix/getmntinfo.cpp (1792 of 3269)
UNSUPPORTED: SanitizerCommon-lsan-x86_64-Darwin :: Posix/getrandom.c (1793 of 3269)
PASS: SanitizerCommon-lsan-x86_64-Darwin :: Posix/getpass.cpp (1794 of 3269)
PASS: SanitizerCommon-lsan-x86_64-Darwin :: Posix/getusershell.cpp (1795 of 3269)
PASS: SanitizerCommon-lsan-x86_64-Darwin :: Posix/getpw_getgr.cpp (1796 of 3269)
PASS: SanitizerCommon-lsan-x86_64-Darwin :: Posix/illegal_read_test.cpp (1797 of 3269)
PASS: SanitizerCommon-lsan-x86_64-Darwin :: Posix/lstat.cpp (1798 of 3269)
UNSUPPORTED: SanitizerCommon-lsan-x86_64-Darwin :: Posix/nl_langinfo.cpp (1799 of 3269)
PASS: SanitizerCommon-lsan-x86_64-Darwin :: Posix/illegal_write_test.cpp (1800 of 3269)
PASS: SanitizerCommon-lsan-x86_64-Darwin :: Posix/mmap_test.c (1801 of 3269)
PASS: SanitizerCommon-lsan-x86_64-Darwin :: Posix/popen.cpp (1802 of 3269)
XFAIL: SanitizerCommon-lsan-x86_64-Darwin :: Posix/print-module-map.cpp (1803 of 3269)
PASS: SanitizerCommon-lsan-x86_64-Darwin :: Posix/putc_putchar_unlocked.cpp (1804 of 3269)
PASS: SanitizerCommon-lsan-x86_64-Darwin :: Posix/readlink.c (1805 of 3269)
PASS: SanitizerCommon-lsan-x86_64-Darwin :: Posix/readlinkat.c (1806 of 3269)
PASS: SanitizerCommon-lsan-x86_64-Darwin :: Posix/qsort.cpp (1807 of 3269)
PASS: SanitizerCommon-lsan-x86_64-Darwin :: Posix/realpath.cpp (1808 of 3269)
UNSUPPORTED: SanitizerCommon-lsan-x86_64-Darwin :: Posix/regex.cpp (1809 of 3269)
PASS: SanitizerCommon-lsan-x86_64-Darwin :: Posix/recursion-in-qsort.cpp (1810 of 3269)
PASS: SanitizerCommon-lsan-x86_64-Darwin :: Posix/regex_startend.cpp (1811 of 3269)
PASS: SanitizerCommon-lsan-x86_64-Darwin :: Posix/replace_sigaction.cpp (1812 of 3269)
XFAIL: SanitizerCommon-lsan-x86_64-Darwin :: Posix/sanitizer_set_death_callback_test.cpp (1813 of 3269)
PASS: SanitizerCommon-lsan-x86_64-Darwin :: Posix/posix_memalign-alignment.cpp (1814 of 3269)
PASS: SanitizerCommon-lsan-x86_64-Darwin :: Posix/sanitizer_set_report_path_test.cpp (1815 of 3269)
PASS: SanitizerCommon-lsan-x86_64-Darwin :: Posix/sem_open.cpp (1816 of 3269)
PASS: SanitizerCommon-lsan-x86_64-Darwin :: Posix/setvbuf.cpp (1817 of 3269)
UNSUPPORTED: SanitizerCommon-lsan-x86_64-Darwin :: Posix/sl_add.cpp (1818 of 3269)
PASS: SanitizerCommon-lsan-x86_64-Darwin :: Posix/signal.cpp (1819 of 3269)
PASS: SanitizerCommon-lsan-x86_64-Darwin :: Posix/strlcat.cpp (1820 of 3269)
UNSUPPORTED: SanitizerCommon-lsan-x86_64-Darwin :: Posix/strtonum.cpp (1821 of 3269)
UNSUPPORTED: SanitizerCommon-lsan-x86_64-Darwin :: Posix/strxfrm.c (1822 of 3269)
PASS: SanitizerCommon-lsan-x86_64-Darwin :: Posix/sanitizer_set_report_fd_test.cpp (1823 of 3269)
PASS: SanitizerCommon-lsan-x86_64-Darwin :: Posix/strlcpy.cpp (1824 of 3269)
UNSUPPORTED: SanitizerCommon-lsan-x86_64-Darwin :: Posix/vis.cpp (1825 of 3269)
PASS: SanitizerCommon-lsan-x86_64-Darwin :: Posix/uname.c (1826 of 3269)
UNSUPPORTED: SanitizerCommon-lsan-x86_64-Darwin :: Posix/wcsxfrm.c (1827 of 3269)
PASS: SanitizerCommon-lsan-x86_64-Darwin :: Posix/sysctl.cpp (1828 of 3269)
PASS: SanitizerCommon-lsan-x86_64-Darwin :: Posix/wcsdup.c (1829 of 3269)
UNSUPPORTED: SanitizerCommon-lsan-x86_64-Darwin :: corelimit.cpp (1830 of 3269)
XFAIL: SanitizerCommon-lsan-x86_64-Darwin :: Posix/weak_hook_test.cpp (1831 of 3269)
UNSUPPORTED: SanitizerCommon-lsan-x86_64-Darwin :: external_symbolizer_path.cpp (1832 of 3269)
PASS: SanitizerCommon-lsan-x86_64-Darwin :: ctype.c (1833 of 3269)
PASS: SanitizerCommon-lsan-x86_64-Darwin :: fopen_nullptr.c (1834 of 3269)
UNSUPPORTED: SanitizerCommon-lsan-x86_64-Darwin :: hard_rss_limit_mb_test.cpp (1835 of 3269)
PASS: SanitizerCommon-lsan-x86_64-Darwin :: malloc_hook.cpp (1836 of 3269)
PASS: SanitizerCommon-lsan-x86_64-Darwin :: get_module_and_offset_for_pc.cpp (1837 of 3269)
PASS: SanitizerCommon-lsan-x86_64-Darwin :: onprint.cpp (1838 of 3269)
PASS: SanitizerCommon-lsan-x86_64-Darwin :: options-help.cpp (1839 of 3269)
PASS: SanitizerCommon-lsan-x86_64-Darwin :: options-include.cpp (1840 of 3269)
PASS: SanitizerCommon-lsan-x86_64-Darwin :: options-invalid.cpp (1841 of 3269)
UNSUPPORTED: SanitizerCommon-lsan-x86_64-Darwin :: print-stack-trace.cpp (1842 of 3269)
PASS: SanitizerCommon-lsan-x86_64-Darwin :: printf-ldbl.c (1843 of 3269)
PASS: SanitizerCommon-lsan-x86_64-Darwin :: pthread_mutexattr_get.cpp (1844 of 3269)
UNSUPPORTED: SanitizerCommon-lsan-x86_64-Darwin :: reallocarray-overflow.cpp (1845 of 3269)
UNSUPPORTED: SanitizerCommon-lsan-x86_64-Darwin :: sanitizer_coverage_allowlist_ignorelist.cpp (1846 of 3269)
PASS: SanitizerCommon-lsan-x86_64-Darwin :: sanitizer_coverage_inline8bit_counter.cpp (1847 of 3269)
UNSUPPORTED: SanitizerCommon-lsan-x86_64-Darwin :: sanitizer_coverage_inline8bit_counter_default_impl.cpp (1848 of 3269)
UNSUPPORTED: SanitizerCommon-lsan-x86_64-Darwin :: sanitizer_coverage_inline_bool_flag.cpp (1849 of 3269)
PASS: SanitizerCommon-lsan-x86_64-Darwin :: sanitizer_coverage_no_prune.cpp (1850 of 3269)
PASS: SanitizerCommon-lsan-x86_64-Darwin :: sanitizer_coverage_stack_depth.cpp (1851 of 3269)
UNSUPPORTED: SanitizerCommon-lsan-x86_64-Darwin :: sanitizer_coverage_symbolize.cpp (1852 of 3269)
PASS: SanitizerCommon-lsan-x86_64-Darwin :: max_allocation_size.cpp (1853 of 3269)
UNSUPPORTED: SanitizerCommon-lsan-x86_64-Darwin :: sanitizer_coverage_trace_pc_guard-init.cpp (1854 of 3269)
PASS: SanitizerCommon-lsan-x86_64-Darwin :: allocator_returns_null.cpp (1855 of 3269)
PASS: SanitizerCommon-lsan-x86_64-Darwin :: sanitizer_coverage_trace_pc_guard.cpp (1856 of 3269)
PASS: SanitizerCommon-lsan-x86_64-Darwin :: scanf-ldbl.c (1857 of 3269)
PASS: SanitizerCommon-lsan-x86_64-Darwin :: setlocale.cpp (1858 of 3269)
PASS: SanitizerCommon-lsan-x86_64-Darwin :: strcasestr.c (1859 of 3269)
XFAIL: SanitizerCommon-lsan-x86_64-Darwin :: sanitizer_coverage_trace_pc_guard-dso.cpp (1860 of 3269)
PASS: SanitizerCommon-lsan-x86_64-Darwin :: strcspn.c (1861 of 3269)
PASS: SanitizerCommon-lsan-x86_64-Darwin :: strnlen.c (1862 of 3269)
PASS: SanitizerCommon-lsan-x86_64-Darwin :: strpbrk.c (1863 of 3269)
PASS: SanitizerCommon-lsan-x86_64-Darwin :: strspn.c (1864 of 3269)
PASS: SanitizerCommon-lsan-x86_64-Darwin :: strstr.c (1865 of 3269)
PASS: SanitizerCommon-lsan-x86_64-Darwin :: suffix-log-path_test.c (1866 of 3269)
PASS: SanitizerCommon-lsan-x86_64-Darwin :: symbolize_debug_argv.cpp (1867 of 3269)
PASS: SanitizerCommon-lsan-x86_64-Darwin :: symbolize_pc.cpp (1868 of 3269)
PASS: SanitizerCommon-lsan-x86_64-Darwin :: wcrtomb.c (1869 of 3269)
XFAIL: SanitizerCommon-lsan-x86_64-Darwin :: symbolize_pc_inline.cpp (1870 of 3269)
PASS: SanitizerCommon-lsan-x86_64-Darwin :: wctomb.c (1871 of 3269)
PASS: SanitizerCommon-tsan-x86_64-Darwin :: Darwin/fputs_puts_null.cpp (1872 of 3269)
XFAIL: SanitizerCommon-lsan-x86_64-Darwin :: symbolize_stack.cpp (1873 of 3269)
PASS: SanitizerCommon-tsan-x86_64-Darwin :: Darwin/abort_on_error.cpp (1874 of 3269)
PASS: SanitizerCommon-tsan-x86_64-Darwin :: Darwin/malloc_zone.cpp (1875 of 3269)
PASS: SanitizerCommon-tsan-x86_64-Darwin :: Darwin/print-stack-trace-in-code-loaded-after-fork.cpp (1876 of 3269)
UNSUPPORTED: SanitizerCommon-tsan-x86_64-Darwin :: FreeBSD/capsicum.cpp (1877 of 3269)
PASS: SanitizerCommon-tsan-x86_64-Darwin :: Darwin/symbolizer-function-offset-dladdr.cpp (1878 of 3269)
UNSUPPORTED: SanitizerCommon-tsan-x86_64-Darwin :: FreeBSD/fdevname.cpp (1879 of 3269)
UNSUPPORTED: SanitizerCommon-tsan-x86_64-Darwin :: FreeBSD/fparseln.cpp (1880 of 3269)
UNSUPPORTED: SanitizerCommon-tsan-x86_64-Darwin :: Linux/abort_on_error.cpp (1881 of 3269)
UNSUPPORTED: SanitizerCommon-tsan-x86_64-Darwin :: Linux/aligned_alloc-alignment.cpp (1882 of 3269)
UNSUPPORTED: SanitizerCommon-tsan-x86_64-Darwin :: Linux/aligned_alloc.c (1883 of 3269)
UNSUPPORTED: SanitizerCommon-tsan-x86_64-Darwin :: Linux/allow_user_segv.cpp (1884 of 3269)
UNSUPPORTED: SanitizerCommon-tsan-x86_64-Darwin :: Linux/clock_gettime.c (1885 of 3269)
UNSUPPORTED: SanitizerCommon-tsan-x86_64-Darwin :: Linux/assert.cpp (1886 of 3269)
UNSUPPORTED: SanitizerCommon-tsan-x86_64-Darwin :: Linux/closedir.c (1887 of 3269)
UNSUPPORTED: SanitizerCommon-tsan-x86_64-Darwin :: Linux/crypt_r.cpp (1888 of 3269)
UNSUPPORTED: SanitizerCommon-tsan-x86_64-Darwin :: Linux/iconv_test.c (1889 of 3269)
UNSUPPORTED: SanitizerCommon-tsan-x86_64-Darwin :: Linux/deepbind.cpp (1890 of 3269)
UNSUPPORTED: SanitizerCommon-tsan-x86_64-Darwin :: Linux/decorate_proc_maps.cpp (1891 of 3269)
UNSUPPORTED: SanitizerCommon-tsan-x86_64-Darwin :: Linux/getgrouplist.cpp (1892 of 3269)
UNSUPPORTED: SanitizerCommon-tsan-x86_64-Darwin :: Linux/getpwnam_r_invalid_user.cpp (1893 of 3269)
UNSUPPORTED: SanitizerCommon-tsan-x86_64-Darwin :: Linux/ill.cpp (1894 of 3269)
UNSUPPORTED: SanitizerCommon-tsan-x86_64-Darwin :: Linux/mallopt.cpp (1895 of 3269)
UNSUPPORTED: SanitizerCommon-tsan-x86_64-Darwin :: Linux/mlock_test.cpp (1896 of 3269)
UNSUPPORTED: SanitizerCommon-tsan-x86_64-Darwin :: Linux/mmap64_test.c (1897 of 3269)
UNSUPPORTED: SanitizerCommon-tsan-x86_64-Darwin :: Linux/mmap_write_exec.cpp (1898 of 3269)
UNSUPPORTED: SanitizerCommon-tsan-x86_64-Darwin :: Linux/mprobe.cpp (1899 of 3269)
UNSUPPORTED: SanitizerCommon-tsan-x86_64-Darwin :: Linux/name_to_handle_at.cpp (1900 of 3269)
UNSUPPORTED: SanitizerCommon-tsan-x86_64-Darwin :: Linux/netent.cpp (1901 of 3269)
UNSUPPORTED: SanitizerCommon-tsan-x86_64-Darwin :: Linux/new_delete_test.cpp (1902 of 3269)
UNSUPPORTED: SanitizerCommon-tsan-x86_64-Darwin :: Linux/open_memstream.cpp (1903 of 3269)
UNSUPPORTED: SanitizerCommon-tsan-x86_64-Darwin :: Linux/protoent.cpp (1904 of 3269)
UNSUPPORTED: SanitizerCommon-tsan-x86_64-Darwin :: Linux/pthread_mutex.cpp (1905 of 3269)
UNSUPPORTED: SanitizerCommon-tsan-x86_64-Darwin :: Linux/ptrace.cpp (1906 of 3269)
UNSUPPORTED: SanitizerCommon-tsan-x86_64-Darwin :: Linux/ptsname.c (1907 of 3269)
UNSUPPORTED: SanitizerCommon-tsan-x86_64-Darwin :: Linux/pvalloc-overflow.cpp (1908 of 3269)
UNSUPPORTED: SanitizerCommon-tsan-x86_64-Darwin :: Linux/recv_msg_trunc.cpp (1909 of 3269)
UNSUPPORTED: SanitizerCommon-tsan-x86_64-Darwin :: Linux/resize_tls_dynamic.cpp (1910 of 3269)
UNSUPPORTED: SanitizerCommon-tsan-x86_64-Darwin :: Linux/sched_getparam.cpp (1911 of 3269)
UNSUPPORTED: SanitizerCommon-tsan-x86_64-Darwin :: Linux/sem_init_glibc.cpp (1912 of 3269)
UNSUPPORTED: SanitizerCommon-tsan-x86_64-Darwin :: Linux/signal_line.cpp (1913 of 3269)
UNSUPPORTED: SanitizerCommon-tsan-x86_64-Darwin :: Linux/signal_name.c (1914 of 3269)
UNSUPPORTED: SanitizerCommon-tsan-x86_64-Darwin :: Linux/signal_segv_handler.cpp (1915 of 3269)
UNSUPPORTED: SanitizerCommon-tsan-x86_64-Darwin :: Linux/signal_send.cpp (1916 of 3269)
UNSUPPORTED: SanitizerCommon-tsan-x86_64-Darwin :: Linux/signal_trap_handler.cpp (1917 of 3269)
UNSUPPORTED: SanitizerCommon-tsan-x86_64-Darwin :: Linux/soft_rss_limit_mb_test.cpp (1918 of 3269)
UNSUPPORTED: SanitizerCommon-tsan-x86_64-Darwin :: Linux/symbolize_stack_fp.cpp (1919 of 3269)
UNSUPPORTED: SanitizerCommon-tsan-x86_64-Darwin :: Linux/sysconf_interceptor_bypass_test.cpp (1920 of 3269)
UNSUPPORTED: SanitizerCommon-tsan-x86_64-Darwin :: Linux/sysmsg.c (1921 of 3269)
UNSUPPORTED: SanitizerCommon-tsan-x86_64-Darwin :: Linux/timerfd.cpp (1922 of 3269)
UNSUPPORTED: SanitizerCommon-tsan-x86_64-Darwin :: Linux/ttyent.cpp (1923 of 3269)
UNSUPPORTED: SanitizerCommon-tsan-x86_64-Darwin :: Linux/unexpected_format_specifier_test.cpp (1924 of 3269)
UNSUPPORTED: SanitizerCommon-tsan-x86_64-Darwin :: Linux/use_tls_test.cpp (1925 of 3269)
UNSUPPORTED: SanitizerCommon-tsan-x86_64-Darwin :: Linux/xdrrec.cpp (1926 of 3269)
UNSUPPORTED: SanitizerCommon-tsan-x86_64-Darwin :: NetBSD/asysctl.cpp (1927 of 3269)
UNSUPPORTED: SanitizerCommon-tsan-x86_64-Darwin :: NetBSD/cdb.cpp (1928 of 3269)
UNSUPPORTED: SanitizerCommon-tsan-x86_64-Darwin :: NetBSD/faccessat.cpp (1929 of 3269)
UNSUPPORTED: SanitizerCommon-tsan-x86_64-Darwin :: NetBSD/fparseln.cpp (1930 of 3269)
UNSUPPORTED: SanitizerCommon-tsan-x86_64-Darwin :: NetBSD/funopen2.cpp (1931 of 3269)
UNSUPPORTED: SanitizerCommon-tsan-x86_64-Darwin :: NetBSD/getgroupmembership.cpp (1932 of 3269)
UNSUPPORTED: SanitizerCommon-tsan-x86_64-Darwin :: NetBSD/getvfsstat.cpp (1933 of 3269)
UNSUPPORTED: SanitizerCommon-tsan-x86_64-Darwin :: NetBSD/gid_from_group.cpp (1934 of 3269)
UNSUPPORTED: SanitizerCommon-tsan-x86_64-Darwin :: NetBSD/group_from_gid.cpp (1935 of 3269)
UNSUPPORTED: SanitizerCommon-tsan-x86_64-Darwin :: NetBSD/md2.cpp (1936 of 3269)
UNSUPPORTED: SanitizerCommon-tsan-x86_64-Darwin :: NetBSD/md4.cpp (1937 of 3269)
UNSUPPORTED: SanitizerCommon-tsan-x86_64-Darwin :: NetBSD/md5.cpp (1938 of 3269)
UNSUPPORTED: SanitizerCommon-tsan-x86_64-Darwin :: NetBSD/mi_vector_hash.cpp (1939 of 3269)
UNSUPPORTED: SanitizerCommon-tsan-x86_64-Darwin :: NetBSD/netent.cpp (1940 of 3269)
UNSUPPORTED: SanitizerCommon-tsan-x86_64-Darwin :: NetBSD/paccept.cpp (1941 of 3269)
UNSUPPORTED: SanitizerCommon-tsan-x86_64-Darwin :: NetBSD/protoent.cpp (1942 of 3269)
UNSUPPORTED: SanitizerCommon-tsan-x86_64-Darwin :: NetBSD/rmd160.cpp (1943 of 3269)
UNSUPPORTED: SanitizerCommon-tsan-x86_64-Darwin :: NetBSD/sha1.cpp (1944 of 3269)
UNSUPPORTED: SanitizerCommon-tsan-x86_64-Darwin :: NetBSD/sha2.cpp (1945 of 3269)
UNSUPPORTED: SanitizerCommon-tsan-x86_64-Darwin :: NetBSD/statvfs1.cpp (1946 of 3269)
UNSUPPORTED: SanitizerCommon-tsan-x86_64-Darwin :: NetBSD/strmode.cpp (1947 of 3269)
UNSUPPORTED: SanitizerCommon-tsan-x86_64-Darwin :: NetBSD/strtoi.cpp (1948 of 3269)
UNSUPPORTED: SanitizerCommon-tsan-x86_64-Darwin :: NetBSD/sysctlgetmibinfo.cpp (1949 of 3269)
UNSUPPORTED: SanitizerCommon-tsan-x86_64-Darwin :: NetBSD/uid_from_user.cpp (1950 of 3269)
UNSUPPORTED: SanitizerCommon-tsan-x86_64-Darwin :: NetBSD/user_from_uid.cpp (1951 of 3269)
PASS: SanitizerCommon-tsan-x86_64-Darwin :: Darwin/print-stack-trace.cpp (1952 of 3269)
PASS: SanitizerCommon-tsan-x86_64-Darwin :: Posix/access.cpp (1953 of 3269)
PASS: SanitizerCommon-tsan-x86_64-Darwin :: Darwin/symbolizer-function-offset-atos.cpp (1954 of 3269)
PASS: SanitizerCommon-tsan-x86_64-Darwin :: Posix/arc4random.cpp (1955 of 3269)
UNSUPPORTED: SanitizerCommon-tsan-x86_64-Darwin :: Posix/crypt.cpp (1956 of 3269)
PASS: SanitizerCommon-tsan-x86_64-Darwin :: Posix/create_thread_fail.cpp (1957 of 3269)
PASS: SanitizerCommon-tsan-x86_64-Darwin :: Posix/bsearch.cpp (1958 of 3269)
PASS: SanitizerCommon-tsan-x86_64-Darwin :: Posix/devname.cpp (1959 of 3269)
PASS: SanitizerCommon-tsan-x86_64-Darwin :: Posix/devname_r.cpp (1960 of 3269)
UNSUPPORTED: SanitizerCommon-tsan-x86_64-Darwin :: Posix/dump_registers.cpp (1961 of 3269)
PASS: SanitizerCommon-tsan-x86_64-Darwin :: Posix/feof_fileno_ferror.cpp (1962 of 3269)
PASS: SanitizerCommon-tsan-x86_64-Darwin :: Posix/fgetc_ungetc_getc.cpp (1963 of 3269)
PASS: SanitizerCommon-tsan-x86_64-Darwin :: Posix/dump_instruction_bytes.cpp (1964 of 3269)
PASS: SanitizerCommon-tsan-x86_64-Darwin :: Posix/fgetln.cpp (1965 of 3269)
PASS: SanitizerCommon-tsan-x86_64-Darwin :: Posix/fgets.cpp (1966 of 3269)
PASS: SanitizerCommon-tsan-x86_64-Darwin :: Posix/fputc_putc_putchar.cpp (1967 of 3269)
PASS: SanitizerCommon-tsan-x86_64-Darwin :: Posix/dedup_token_length_test.cpp (1968 of 3269)
UNSUPPORTED: SanitizerCommon-tsan-x86_64-Darwin :: Posix/fseek.cpp (1969 of 3269)
UNSUPPORTED: SanitizerCommon-tsan-x86_64-Darwin :: Posix/fts.cpp (1970 of 3269)
UNSUPPORTED: SanitizerCommon-tsan-x86_64-Darwin :: Posix/funopen.cpp (1971 of 3269)
PASS: SanitizerCommon-tsan-x86_64-Darwin :: Posix/fputs_puts.cpp (1972 of 3269)
UNSUPPORTED: SanitizerCommon-tsan-x86_64-Darwin :: Posix/getcpuclockid.c (1973 of 3269)
UNSUPPORTED: SanitizerCommon-tsan-x86_64-Darwin :: Posix/getfsent.cpp (1974 of 3269)
PASS: SanitizerCommon-tsan-x86_64-Darwin :: Posix/getc_unlocked.cpp (1975 of 3269)
PASS: SanitizerCommon-tsan-x86_64-Darwin :: Posix/getmntinfo.cpp (1976 of 3269)
PASS: SanitizerCommon-tsan-x86_64-Darwin :: Posix/fpe.cpp (1977 of 3269)
UNSUPPORTED: SanitizerCommon-tsan-x86_64-Darwin :: Posix/getrandom.c (1978 of 3269)
PASS: SanitizerCommon-tsan-x86_64-Darwin :: Posix/getpass.cpp (1979 of 3269)
PASS: SanitizerCommon-tsan-x86_64-Darwin :: Posix/getusershell.cpp (1980 of 3269)
PASS: SanitizerCommon-tsan-x86_64-Darwin :: Posix/getpw_getgr.cpp (1981 of 3269)
PASS: SanitizerCommon-tsan-x86_64-Darwin :: Posix/illegal_read_test.cpp (1982 of 3269)
PASS: SanitizerCommon-tsan-x86_64-Darwin :: Posix/illegal_write_test.cpp (1983 of 3269)
UNSUPPORTED: SanitizerCommon-tsan-x86_64-Darwin :: Posix/nl_langinfo.cpp (1984 of 3269)
PASS: SanitizerCommon-tsan-x86_64-Darwin :: Posix/mmap_test.c (1985 of 3269)
PASS: SanitizerCommon-tsan-x86_64-Darwin :: Posix/lstat.cpp (1986 of 3269)
PASS: SanitizerCommon-tsan-x86_64-Darwin :: Posix/popen.cpp (1987 of 3269)
PASS: SanitizerCommon-tsan-x86_64-Darwin :: Posix/putc_putchar_unlocked.cpp (1988 of 3269)
PASS: SanitizerCommon-tsan-x86_64-Darwin :: Posix/qsort.cpp (1989 of 3269)
XFAIL: SanitizerCommon-tsan-x86_64-Darwin :: Posix/print-module-map.cpp (1990 of 3269)
PASS: SanitizerCommon-tsan-x86_64-Darwin :: Posix/readlink.c (1991 of 3269)
PASS: SanitizerCommon-tsan-x86_64-Darwin :: Posix/readlinkat.c (1992 of 3269)
PASS: SanitizerCommon-tsan-x86_64-Darwin :: Posix/realpath.cpp (1993 of 3269)
UNSUPPORTED: SanitizerCommon-tsan-x86_64-Darwin :: Posix/regex.cpp (1994 of 3269)
PASS: SanitizerCommon-tsan-x86_64-Darwin :: Posix/recursion-in-qsort.cpp (1995 of 3269)
PASS: SanitizerCommon-tsan-x86_64-Darwin :: Posix/regex_startend.cpp (1996 of 3269)
PASS: SanitizerCommon-tsan-x86_64-Darwin :: Posix/replace_sigaction.cpp (1997 of 3269)
PASS: SanitizerCommon-tsan-x86_64-Darwin :: Posix/sanitizer_set_death_callback_test.cpp (1998 of 3269)
PASS: SanitizerCommon-tsan-x86_64-Darwin :: Posix/posix_memalign-alignment.cpp (1999 of 3269)
PASS: SanitizerCommon-tsan-x86_64-Darwin :: Posix/sanitizer_set_report_path_test.cpp (2000 of 3269)
PASS: SanitizerCommon-tsan-x86_64-Darwin :: Posix/sem_open.cpp (2001 of 3269)
PASS: SanitizerCommon-tsan-x86_64-Darwin :: Posix/setvbuf.cpp (2002 of 3269)
UNSUPPORTED: SanitizerCommon-tsan-x86_64-Darwin :: Posix/sl_add.cpp (2003 of 3269)
PASS: SanitizerCommon-tsan-x86_64-Darwin :: Posix/signal.cpp (2004 of 3269)
PASS: SanitizerCommon-tsan-x86_64-Darwin :: Posix/sanitizer_set_report_fd_test.cpp (2005 of 3269)
UNSUPPORTED: SanitizerCommon-tsan-x86_64-Darwin :: Posix/strtonum.cpp (2006 of 3269)
UNSUPPORTED: SanitizerCommon-tsan-x86_64-Darwin :: Posix/strxfrm.c (2007 of 3269)
PASS: SanitizerCommon-tsan-x86_64-Darwin :: Posix/strlcat.cpp (2008 of 3269)
PASS: SanitizerCommon-tsan-x86_64-Darwin :: Posix/strlcpy.cpp (2009 of 3269)
UNSUPPORTED: SanitizerCommon-tsan-x86_64-Darwin :: Posix/vis.cpp (2010 of 3269)
PASS: SanitizerCommon-tsan-x86_64-Darwin :: Posix/sysctl.cpp (2011 of 3269)
UNSUPPORTED: SanitizerCommon-tsan-x86_64-Darwin :: Posix/wcsxfrm.c (2012 of 3269)
PASS: SanitizerCommon-tsan-x86_64-Darwin :: Posix/uname.c (2013 of 3269)
PASS: SanitizerCommon-tsan-x86_64-Darwin :: Posix/wcsdup.c (2014 of 3269)
PASS: SanitizerCommon-tsan-x86_64-Darwin :: Posix/weak_hook_test.cpp (2015 of 3269)
PASS: SanitizerCommon-tsan-x86_64-Darwin :: corelimit.cpp (2016 of 3269)
UNSUPPORTED: SanitizerCommon-tsan-x86_64-Darwin :: external_symbolizer_path.cpp (2017 of 3269)
PASS: SanitizerCommon-tsan-x86_64-Darwin :: ctype.c (2018 of 3269)
PASS: SanitizerCommon-tsan-x86_64-Darwin :: fopen_nullptr.c (2019 of 3269)
UNSUPPORTED: SanitizerCommon-tsan-x86_64-Darwin :: hard_rss_limit_mb_test.cpp (2020 of 3269)
PASS: SanitizerCommon-tsan-x86_64-Darwin :: malloc_hook.cpp (2021 of 3269)
PASS: SanitizerCommon-tsan-x86_64-Darwin :: get_module_and_offset_for_pc.cpp (2022 of 3269)
PASS: SanitizerCommon-tsan-x86_64-Darwin :: onprint.cpp (2023 of 3269)
PASS: SanitizerCommon-tsan-x86_64-Darwin :: options-help.cpp (2024 of 3269)
PASS: SanitizerCommon-tsan-x86_64-Darwin :: options-include.cpp (2025 of 3269)
PASS: SanitizerCommon-tsan-x86_64-Darwin :: options-invalid.cpp (2026 of 3269)
UNSUPPORTED: SanitizerCommon-tsan-x86_64-Darwin :: print-stack-trace.cpp (2027 of 3269)
PASS: SanitizerCommon-tsan-x86_64-Darwin :: printf-ldbl.c (2028 of 3269)
PASS: SanitizerCommon-tsan-x86_64-Darwin :: allocator_returns_null.cpp (2029 of 3269)
UNSUPPORTED: SanitizerCommon-tsan-x86_64-Darwin :: reallocarray-overflow.cpp (2030 of 3269)
UNSUPPORTED: SanitizerCommon-tsan-x86_64-Darwin :: sanitizer_coverage_allowlist_ignorelist.cpp (2031 of 3269)
PASS: SanitizerCommon-tsan-x86_64-Darwin :: pthread_mutexattr_get.cpp (2032 of 3269)
UNSUPPORTED: SanitizerCommon-tsan-x86_64-Darwin :: sanitizer_coverage_inline8bit_counter_default_impl.cpp (2033 of 3269)
UNSUPPORTED: SanitizerCommon-tsan-x86_64-Darwin :: sanitizer_coverage_inline_bool_flag.cpp (2034 of 3269)
PASS: SanitizerCommon-tsan-x86_64-Darwin :: sanitizer_coverage_no_prune.cpp (2035 of 3269)
PASS: SanitizerCommon-tsan-x86_64-Darwin :: max_allocation_size.cpp (2036 of 3269)
UNSUPPORTED: SanitizerCommon-tsan-x86_64-Darwin :: sanitizer_coverage_symbolize.cpp (2037 of 3269)
PASS: SanitizerCommon-tsan-x86_64-Darwin :: sanitizer_coverage_inline8bit_counter.cpp (2038 of 3269)
UNSUPPORTED: SanitizerCommon-tsan-x86_64-Darwin :: sanitizer_coverage_trace_pc_guard-init.cpp (2039 of 3269)
XFAIL: SanitizerCommon-tsan-x86_64-Darwin :: sanitizer_coverage_trace_pc_guard.cpp (2040 of 3269)
PASS: SanitizerCommon-tsan-x86_64-Darwin :: sanitizer_coverage_stack_depth.cpp (2041 of 3269)
XFAIL: SanitizerCommon-tsan-x86_64-Darwin :: sanitizer_coverage_trace_pc_guard-dso.cpp (2042 of 3269)
PASS: SanitizerCommon-tsan-x86_64-Darwin :: scanf-ldbl.c (2043 of 3269)
PASS: SanitizerCommon-tsan-x86_64-Darwin :: setlocale.cpp (2044 of 3269)
PASS: SanitizerCommon-tsan-x86_64-Darwin :: strcasestr.c (2045 of 3269)
PASS: SanitizerCommon-tsan-x86_64-Darwin :: strcspn.c (2046 of 3269)
PASS: SanitizerCommon-tsan-x86_64-Darwin :: strnlen.c (2047 of 3269)
PASS: SanitizerCommon-tsan-x86_64-Darwin :: strpbrk.c (2048 of 3269)
PASS: SanitizerCommon-tsan-x86_64-Darwin :: strspn.c (2049 of 3269)
PASS: SanitizerCommon-tsan-x86_64-Darwin :: strstr.c (2050 of 3269)
PASS: SanitizerCommon-tsan-x86_64-Darwin :: suffix-log-path_test.c (2051 of 3269)
PASS: SanitizerCommon-tsan-x86_64-Darwin :: symbolize_pc.cpp (2052 of 3269)
PASS: SanitizerCommon-tsan-x86_64-Darwin :: symbolize_debug_argv.cpp (2053 of 3269)
XFAIL: SanitizerCommon-tsan-x86_64-Darwin :: symbolize_pc_inline.cpp (2054 of 3269)
PASS: SanitizerCommon-tsan-x86_64-Darwin :: wcrtomb.c (2055 of 3269)
PASS: SanitizerCommon-tsan-x86_64-Darwin :: wctomb.c (2056 of 3269)
PASS: SanitizerCommon-ubsan-x86_64-Darwin :: Darwin/fputs_puts_null.cpp (2057 of 3269)
XFAIL: SanitizerCommon-ubsan-x86_64-Darwin :: Darwin/malloc_zone.cpp (2058 of 3269)
PASS: SanitizerCommon-ubsan-x86_64-Darwin :: Darwin/abort_on_error.cpp (2059 of 3269)
PASS: SanitizerCommon-tsan-x86_64-Darwin :: symbolize_stack.cpp (2060 of 3269)
PASS: SanitizerCommon-ubsan-x86_64-Darwin :: Darwin/print-stack-trace-in-code-loaded-after-fork.cpp (2061 of 3269)
UNSUPPORTED: SanitizerCommon-ubsan-x86_64-Darwin :: FreeBSD/capsicum.cpp (2062 of 3269)
PASS: SanitizerCommon-ubsan-x86_64-Darwin :: Darwin/symbolizer-function-offset-dladdr.cpp (2063 of 3269)
UNSUPPORTED: SanitizerCommon-ubsan-x86_64-Darwin :: FreeBSD/fdevname.cpp (2064 of 3269)
UNSUPPORTED: SanitizerCommon-ubsan-x86_64-Darwin :: FreeBSD/fparseln.cpp (2065 of 3269)
UNSUPPORTED: SanitizerCommon-ubsan-x86_64-Darwin :: Linux/abort_on_error.cpp (2066 of 3269)
UNSUPPORTED: SanitizerCommon-ubsan-x86_64-Darwin :: Linux/aligned_alloc-alignment.cpp (2067 of 3269)
UNSUPPORTED: SanitizerCommon-ubsan-x86_64-Darwin :: Linux/aligned_alloc.c (2068 of 3269)
UNSUPPORTED: SanitizerCommon-ubsan-x86_64-Darwin :: Linux/allow_user_segv.cpp (2069 of 3269)
UNSUPPORTED: SanitizerCommon-ubsan-x86_64-Darwin :: Linux/assert.cpp (2070 of 3269)
UNSUPPORTED: SanitizerCommon-ubsan-x86_64-Darwin :: Linux/clock_gettime.c (2071 of 3269)
UNSUPPORTED: SanitizerCommon-ubsan-x86_64-Darwin :: Linux/closedir.c (2072 of 3269)
UNSUPPORTED: SanitizerCommon-ubsan-x86_64-Darwin :: Linux/decorate_proc_maps.cpp (2073 of 3269)
UNSUPPORTED: SanitizerCommon-ubsan-x86_64-Darwin :: Linux/crypt_r.cpp (2074 of 3269)
UNSUPPORTED: SanitizerCommon-ubsan-x86_64-Darwin :: Linux/getgrouplist.cpp (2075 of 3269)
UNSUPPORTED: SanitizerCommon-ubsan-x86_64-Darwin :: Linux/getpwnam_r_invalid_user.cpp (2076 of 3269)
UNSUPPORTED: SanitizerCommon-ubsan-x86_64-Darwin :: Linux/deepbind.cpp (2077 of 3269)
UNSUPPORTED: SanitizerCommon-ubsan-x86_64-Darwin :: Linux/iconv_test.c (2078 of 3269)
UNSUPPORTED: SanitizerCommon-ubsan-x86_64-Darwin :: Linux/ill.cpp (2079 of 3269)
UNSUPPORTED: SanitizerCommon-ubsan-x86_64-Darwin :: Linux/mallopt.cpp (2080 of 3269)
UNSUPPORTED: SanitizerCommon-ubsan-x86_64-Darwin :: Linux/mlock_test.cpp (2081 of 3269)
UNSUPPORTED: SanitizerCommon-ubsan-x86_64-Darwin :: Linux/mmap64_test.c (2082 of 3269)
UNSUPPORTED: SanitizerCommon-ubsan-x86_64-Darwin :: Linux/mmap_write_exec.cpp (2083 of 3269)
UNSUPPORTED: SanitizerCommon-ubsan-x86_64-Darwin :: Linux/mprobe.cpp (2084 of 3269)
UNSUPPORTED: SanitizerCommon-ubsan-x86_64-Darwin :: Linux/name_to_handle_at.cpp (2085 of 3269)
UNSUPPORTED: SanitizerCommon-ubsan-x86_64-Darwin :: Linux/netent.cpp (2086 of 3269)
UNSUPPORTED: SanitizerCommon-ubsan-x86_64-Darwin :: Linux/new_delete_test.cpp (2087 of 3269)
UNSUPPORTED: SanitizerCommon-ubsan-x86_64-Darwin :: Linux/open_memstream.cpp (2088 of 3269)
UNSUPPORTED: SanitizerCommon-ubsan-x86_64-Darwin :: Linux/protoent.cpp (2089 of 3269)
UNSUPPORTED: SanitizerCommon-ubsan-x86_64-Darwin :: Linux/pthread_mutex.cpp (2090 of 3269)
UNSUPPORTED: SanitizerCommon-ubsan-x86_64-Darwin :: Linux/ptrace.cpp (2091 of 3269)
UNSUPPORTED: SanitizerCommon-ubsan-x86_64-Darwin :: Linux/ptsname.c (2092 of 3269)
UNSUPPORTED: SanitizerCommon-ubsan-x86_64-Darwin :: Linux/pvalloc-overflow.cpp (2093 of 3269)
UNSUPPORTED: SanitizerCommon-ubsan-x86_64-Darwin :: Linux/recv_msg_trunc.cpp (2094 of 3269)
UNSUPPORTED: SanitizerCommon-ubsan-x86_64-Darwin :: Linux/resize_tls_dynamic.cpp (2095 of 3269)
UNSUPPORTED: SanitizerCommon-ubsan-x86_64-Darwin :: Linux/sched_getparam.cpp (2096 of 3269)
UNSUPPORTED: SanitizerCommon-ubsan-x86_64-Darwin :: Linux/sem_init_glibc.cpp (2097 of 3269)
UNSUPPORTED: SanitizerCommon-ubsan-x86_64-Darwin :: Linux/signal_line.cpp (2098 of 3269)
UNSUPPORTED: SanitizerCommon-ubsan-x86_64-Darwin :: Linux/signal_name.c (2099 of 3269)
UNSUPPORTED: SanitizerCommon-ubsan-x86_64-Darwin :: Linux/signal_segv_handler.cpp (2100 of 3269)
UNSUPPORTED: SanitizerCommon-ubsan-x86_64-Darwin :: Linux/signal_send.cpp (2101 of 3269)
UNSUPPORTED: SanitizerCommon-ubsan-x86_64-Darwin :: Linux/signal_trap_handler.cpp (2102 of 3269)
UNSUPPORTED: SanitizerCommon-ubsan-x86_64-Darwin :: Linux/soft_rss_limit_mb_test.cpp (2103 of 3269)
UNSUPPORTED: SanitizerCommon-ubsan-x86_64-Darwin :: Linux/symbolize_stack_fp.cpp (2104 of 3269)
UNSUPPORTED: SanitizerCommon-ubsan-x86_64-Darwin :: Linux/sysconf_interceptor_bypass_test.cpp (2105 of 3269)
UNSUPPORTED: SanitizerCommon-ubsan-x86_64-Darwin :: Linux/sysmsg.c (2106 of 3269)
UNSUPPORTED: SanitizerCommon-ubsan-x86_64-Darwin :: Linux/timerfd.cpp (2107 of 3269)
UNSUPPORTED: SanitizerCommon-ubsan-x86_64-Darwin :: Linux/ttyent.cpp (2108 of 3269)
UNSUPPORTED: SanitizerCommon-ubsan-x86_64-Darwin :: Linux/unexpected_format_specifier_test.cpp (2109 of 3269)
UNSUPPORTED: SanitizerCommon-ubsan-x86_64-Darwin :: Linux/use_tls_test.cpp (2110 of 3269)
UNSUPPORTED: SanitizerCommon-ubsan-x86_64-Darwin :: Linux/xdrrec.cpp (2111 of 3269)
UNSUPPORTED: SanitizerCommon-ubsan-x86_64-Darwin :: NetBSD/asysctl.cpp (2112 of 3269)
UNSUPPORTED: SanitizerCommon-ubsan-x86_64-Darwin :: NetBSD/cdb.cpp (2113 of 3269)
UNSUPPORTED: SanitizerCommon-ubsan-x86_64-Darwin :: NetBSD/faccessat.cpp (2114 of 3269)
UNSUPPORTED: SanitizerCommon-ubsan-x86_64-Darwin :: NetBSD/fparseln.cpp (2115 of 3269)
UNSUPPORTED: SanitizerCommon-ubsan-x86_64-Darwin :: NetBSD/funopen2.cpp (2116 of 3269)
UNSUPPORTED: SanitizerCommon-ubsan-x86_64-Darwin :: NetBSD/getgroupmembership.cpp (2117 of 3269)
UNSUPPORTED: SanitizerCommon-ubsan-x86_64-Darwin :: NetBSD/getvfsstat.cpp (2118 of 3269)
UNSUPPORTED: SanitizerCommon-ubsan-x86_64-Darwin :: NetBSD/gid_from_group.cpp (2119 of 3269)
UNSUPPORTED: SanitizerCommon-ubsan-x86_64-Darwin :: NetBSD/group_from_gid.cpp (2120 of 3269)
UNSUPPORTED: SanitizerCommon-ubsan-x86_64-Darwin :: NetBSD/md2.cpp (2121 of 3269)
UNSUPPORTED: SanitizerCommon-ubsan-x86_64-Darwin :: NetBSD/md4.cpp (2122 of 3269)
UNSUPPORTED: SanitizerCommon-ubsan-x86_64-Darwin :: NetBSD/md5.cpp (2123 of 3269)
UNSUPPORTED: SanitizerCommon-ubsan-x86_64-Darwin :: NetBSD/mi_vector_hash.cpp (2124 of 3269)
UNSUPPORTED: SanitizerCommon-ubsan-x86_64-Darwin :: NetBSD/netent.cpp (2125 of 3269)
UNSUPPORTED: SanitizerCommon-ubsan-x86_64-Darwin :: NetBSD/paccept.cpp (2126 of 3269)
UNSUPPORTED: SanitizerCommon-ubsan-x86_64-Darwin :: NetBSD/protoent.cpp (2127 of 3269)
UNSUPPORTED: SanitizerCommon-ubsan-x86_64-Darwin :: NetBSD/rmd160.cpp (2128 of 3269)
UNSUPPORTED: SanitizerCommon-ubsan-x86_64-Darwin :: NetBSD/sha1.cpp (2129 of 3269)
UNSUPPORTED: SanitizerCommon-ubsan-x86_64-Darwin :: NetBSD/sha2.cpp (2130 of 3269)
UNSUPPORTED: SanitizerCommon-ubsan-x86_64-Darwin :: NetBSD/statvfs1.cpp (2131 of 3269)
UNSUPPORTED: SanitizerCommon-ubsan-x86_64-Darwin :: NetBSD/strmode.cpp (2132 of 3269)
UNSUPPORTED: SanitizerCommon-ubsan-x86_64-Darwin :: NetBSD/strtoi.cpp (2133 of 3269)
UNSUPPORTED: SanitizerCommon-ubsan-x86_64-Darwin :: NetBSD/sysctlgetmibinfo.cpp (2134 of 3269)
UNSUPPORTED: SanitizerCommon-ubsan-x86_64-Darwin :: NetBSD/uid_from_user.cpp (2135 of 3269)
UNSUPPORTED: SanitizerCommon-ubsan-x86_64-Darwin :: NetBSD/user_from_uid.cpp (2136 of 3269)
PASS: SanitizerCommon-ubsan-x86_64-Darwin :: Posix/access.cpp (2137 of 3269)
PASS: SanitizerCommon-ubsan-x86_64-Darwin :: Darwin/print-stack-trace.cpp (2138 of 3269)
PASS: SanitizerCommon-ubsan-x86_64-Darwin :: Posix/arc4random.cpp (2139 of 3269)
PASS: SanitizerCommon-ubsan-x86_64-Darwin :: Posix/create_thread_fail.cpp (2140 of 3269)
UNSUPPORTED: SanitizerCommon-ubsan-x86_64-Darwin :: Posix/crypt.cpp (2141 of 3269)
PASS: SanitizerCommon-ubsan-x86_64-Darwin :: Posix/bsearch.cpp (2142 of 3269)
PASS: SanitizerCommon-ubsan-x86_64-Darwin :: Darwin/symbolizer-function-offset-atos.cpp (2143 of 3269)
PASS: SanitizerCommon-ubsan-x86_64-Darwin :: Posix/devname.cpp (2144 of 3269)
PASS: SanitizerCommon-ubsan-x86_64-Darwin :: Posix/devname_r.cpp (2145 of 3269)
UNSUPPORTED: SanitizerCommon-ubsan-x86_64-Darwin :: Posix/dump_registers.cpp (2146 of 3269)
PASS: SanitizerCommon-ubsan-x86_64-Darwin :: Posix/feof_fileno_ferror.cpp (2147 of 3269)
PASS: SanitizerCommon-ubsan-x86_64-Darwin :: Posix/fgetc_ungetc_getc.cpp (2148 of 3269)
PASS: SanitizerCommon-ubsan-x86_64-Darwin :: Posix/fgetln.cpp (2149 of 3269)
PASS: SanitizerCommon-ubsan-x86_64-Darwin :: Posix/fgets.cpp (2150 of 3269)
PASS: SanitizerCommon-ubsan-x86_64-Darwin :: Posix/dump_instruction_bytes.cpp (2151 of 3269)
PASS: SanitizerCommon-ubsan-x86_64-Darwin :: Posix/fputc_putc_putchar.cpp (2152 of 3269)
PASS: SanitizerCommon-ubsan-x86_64-Darwin :: Posix/fputs_puts.cpp (2153 of 3269)
UNSUPPORTED: SanitizerCommon-ubsan-x86_64-Darwin :: Posix/fseek.cpp (2154 of 3269)
UNSUPPORTED: SanitizerCommon-ubsan-x86_64-Darwin :: Posix/fts.cpp (2155 of 3269)
UNSUPPORTED: SanitizerCommon-ubsan-x86_64-Darwin :: Posix/funopen.cpp (2156 of 3269)
PASS: SanitizerCommon-ubsan-x86_64-Darwin :: Posix/getc_unlocked.cpp (2157 of 3269)
UNSUPPORTED: SanitizerCommon-ubsan-x86_64-Darwin :: Posix/getcpuclockid.c (2158 of 3269)
UNSUPPORTED: SanitizerCommon-ubsan-x86_64-Darwin :: Posix/getfsent.cpp (2159 of 3269)
PASS: SanitizerCommon-ubsan-x86_64-Darwin :: Posix/getmntinfo.cpp (2160 of 3269)
PASS: SanitizerCommon-ubsan-x86_64-Darwin :: Posix/dedup_token_length_test.cpp (2161 of 3269)
PASS: SanitizerCommon-ubsan-x86_64-Darwin :: Posix/getpass.cpp (2162 of 3269)
UNSUPPORTED: SanitizerCommon-ubsan-x86_64-Darwin :: Posix/getrandom.c (2163 of 3269)
PASS: SanitizerCommon-ubsan-x86_64-Darwin :: Posix/fpe.cpp (2164 of 3269)
PASS: SanitizerCommon-ubsan-x86_64-Darwin :: Posix/getusershell.cpp (2165 of 3269)
PASS: SanitizerCommon-ubsan-x86_64-Darwin :: Posix/getpw_getgr.cpp (2166 of 3269)
PASS: SanitizerCommon-ubsan-x86_64-Darwin :: Posix/illegal_read_test.cpp (2167 of 3269)
PASS: SanitizerCommon-ubsan-x86_64-Darwin :: Posix/lstat.cpp (2168 of 3269)
UNSUPPORTED: SanitizerCommon-ubsan-x86_64-Darwin :: Posix/nl_langinfo.cpp (2169 of 3269)
PASS: SanitizerCommon-ubsan-x86_64-Darwin :: Posix/mmap_test.c (2170 of 3269)
UNSUPPORTED: SanitizerCommon-ubsan-x86_64-Darwin :: Posix/posix_memalign-alignment.cpp (2171 of 3269)
PASS: SanitizerCommon-ubsan-x86_64-Darwin :: Posix/illegal_write_test.cpp (2172 of 3269)
PASS: SanitizerCommon-ubsan-x86_64-Darwin :: Posix/popen.cpp (2173 of 3269)
PASS: SanitizerCommon-ubsan-x86_64-Darwin :: Posix/print-module-map.cpp (2174 of 3269)
PASS: SanitizerCommon-ubsan-x86_64-Darwin :: Posix/putc_putchar_unlocked.cpp (2175 of 3269)
PASS: SanitizerCommon-ubsan-x86_64-Darwin :: Posix/readlink.c (2176 of 3269)
PASS: SanitizerCommon-ubsan-x86_64-Darwin :: Posix/readlinkat.c (2177 of 3269)
PASS: SanitizerCommon-ubsan-x86_64-Darwin :: Posix/realpath.cpp (2178 of 3269)
UNSUPPORTED: SanitizerCommon-ubsan-x86_64-Darwin :: Posix/regex.cpp (2179 of 3269)
PASS: SanitizerCommon-ubsan-x86_64-Darwin :: Posix/recursion-in-qsort.cpp (2180 of 3269)
PASS: SanitizerCommon-ubsan-x86_64-Darwin :: Posix/regex_startend.cpp (2181 of 3269)
PASS: SanitizerCommon-ubsan-x86_64-Darwin :: Posix/qsort.cpp (2182 of 3269)
PASS: SanitizerCommon-ubsan-x86_64-Darwin :: Posix/replace_sigaction.cpp (2183 of 3269)
XFAIL: SanitizerCommon-ubsan-x86_64-Darwin :: Posix/sanitizer_set_death_callback_test.cpp (2184 of 3269)
PASS: SanitizerCommon-ubsan-x86_64-Darwin :: Posix/sanitizer_set_report_path_test.cpp (2185 of 3269)
PASS: SanitizerCommon-ubsan-x86_64-Darwin :: Posix/sem_open.cpp (2186 of 3269)
PASS: SanitizerCommon-ubsan-x86_64-Darwin :: Posix/setvbuf.cpp (2187 of 3269)
UNSUPPORTED: SanitizerCommon-ubsan-x86_64-Darwin :: Posix/sl_add.cpp (2188 of 3269)
PASS: SanitizerCommon-ubsan-x86_64-Darwin :: Posix/signal.cpp (2189 of 3269)
PASS: SanitizerCommon-ubsan-x86_64-Darwin :: Posix/strlcat.cpp (2190 of 3269)
UNSUPPORTED: SanitizerCommon-ubsan-x86_64-Darwin :: Posix/strtonum.cpp (2191 of 3269)
UNSUPPORTED: SanitizerCommon-ubsan-x86_64-Darwin :: Posix/strxfrm.c (2192 of 3269)
PASS: SanitizerCommon-ubsan-x86_64-Darwin :: Posix/strlcpy.cpp (2193 of 3269)
PASS: SanitizerCommon-ubsan-x86_64-Darwin :: Posix/sysctl.cpp (2194 of 3269)
UNSUPPORTED: SanitizerCommon-ubsan-x86_64-Darwin :: Posix/vis.cpp (2195 of 3269)
PASS: SanitizerCommon-ubsan-x86_64-Darwin :: Posix/uname.c (2196 of 3269)
UNSUPPORTED: SanitizerCommon-ubsan-x86_64-Darwin :: Posix/wcsxfrm.c (2197 of 3269)
PASS: SanitizerCommon-ubsan-x86_64-Darwin :: Posix/wcsdup.c (2198 of 3269)
UNSUPPORTED: SanitizerCommon-ubsan-x86_64-Darwin :: allocator_returns_null.cpp (2199 of 3269)
UNSUPPORTED: SanitizerCommon-ubsan-x86_64-Darwin :: corelimit.cpp (2200 of 3269)
XFAIL: SanitizerCommon-ubsan-x86_64-Darwin :: Posix/weak_hook_test.cpp (2201 of 3269)
UNSUPPORTED: SanitizerCommon-ubsan-x86_64-Darwin :: external_symbolizer_path.cpp (2202 of 3269)
PASS: SanitizerCommon-ubsan-x86_64-Darwin :: ctype.c (2203 of 3269)
PASS: SanitizerCommon-ubsan-x86_64-Darwin :: fopen_nullptr.c (2204 of 3269)
UNSUPPORTED: SanitizerCommon-ubsan-x86_64-Darwin :: hard_rss_limit_mb_test.cpp (2205 of 3269)
PASS: SanitizerCommon-ubsan-x86_64-Darwin :: Posix/sanitizer_set_report_fd_test.cpp (2206 of 3269)
UNSUPPORTED: SanitizerCommon-ubsan-x86_64-Darwin :: max_allocation_size.cpp (2207 of 3269)
XFAIL: SanitizerCommon-ubsan-x86_64-Darwin :: malloc_hook.cpp (2208 of 3269)
PASS: SanitizerCommon-ubsan-x86_64-Darwin :: onprint.cpp (2209 of 3269)
PASS: SanitizerCommon-ubsan-x86_64-Darwin :: options-help.cpp (2210 of 3269)
PASS: SanitizerCommon-ubsan-x86_64-Darwin :: options-include.cpp (2211 of 3269)
UNSUPPORTED: SanitizerCommon-ubsan-x86_64-Darwin :: print-stack-trace.cpp (2212 of 3269)
PASS: SanitizerCommon-ubsan-x86_64-Darwin :: options-invalid.cpp (2213 of 3269)
PASS: SanitizerCommon-ubsan-x86_64-Darwin :: printf-ldbl.c (2214 of 3269)
UNSUPPORTED: SanitizerCommon-ubsan-x86_64-Darwin :: reallocarray-overflow.cpp (2215 of 3269)
UNSUPPORTED: SanitizerCommon-ubsan-x86_64-Darwin :: sanitizer_coverage_allowlist_ignorelist.cpp (2216 of 3269)
PASS: SanitizerCommon-ubsan-x86_64-Darwin :: pthread_mutexattr_get.cpp (2217 of 3269)
UNSUPPORTED: SanitizerCommon-ubsan-x86_64-Darwin :: sanitizer_coverage_inline8bit_counter_default_impl.cpp (2218 of 3269)
UNSUPPORTED: SanitizerCommon-ubsan-x86_64-Darwin :: sanitizer_coverage_inline_bool_flag.cpp (2219 of 3269)
XFAIL: SanitizerCommon-ubsan-x86_64-Darwin :: sanitizer_coverage_no_prune.cpp (2220 of 3269)
PASS: SanitizerCommon-ubsan-x86_64-Darwin :: sanitizer_coverage_inline8bit_counter.cpp (2221 of 3269)
UNSUPPORTED: SanitizerCommon-ubsan-x86_64-Darwin :: sanitizer_coverage_symbolize.cpp (2222 of 3269)
UNSUPPORTED: SanitizerCommon-ubsan-x86_64-Darwin :: sanitizer_coverage_trace_pc_guard-dso.cpp (2223 of 3269)
UNSUPPORTED: SanitizerCommon-ubsan-x86_64-Darwin :: sanitizer_coverage_trace_pc_guard-init.cpp (2224 of 3269)
UNSUPPORTED: SanitizerCommon-ubsan-x86_64-Darwin :: sanitizer_coverage_trace_pc_guard.cpp (2225 of 3269)
PASS: SanitizerCommon-ubsan-x86_64-Darwin :: scanf-ldbl.c (2226 of 3269)
PASS: SanitizerCommon-ubsan-x86_64-Darwin :: sanitizer_coverage_stack_depth.cpp (2227 of 3269)
UNSUPPORTED: ShadowCallStack :: init.c (2228 of 3269)
UNSUPPORTED: ShadowCallStack :: overflow.c (2229 of 3269)
PASS: SanitizerCommon-ubsan-x86_64-Darwin :: setlocale.cpp (2230 of 3269)
PASS: SanitizerCommon-ubsan-x86_64-Darwin :: strcasestr.c (2231 of 3269)
PASS: SanitizerCommon-ubsan-x86_64-Darwin :: get_module_and_offset_for_pc.cpp (2232 of 3269)
PASS: SanitizerCommon-ubsan-x86_64-Darwin :: strcspn.c (2233 of 3269)
PASS: SanitizerCommon-ubsan-x86_64-Darwin :: strnlen.c (2234 of 3269)
PASS: SanitizerCommon-ubsan-x86_64-Darwin :: strpbrk.c (2235 of 3269)
PASS: SanitizerCommon-ubsan-x86_64-Darwin :: strspn.c (2236 of 3269)
PASS: SanitizerCommon-ubsan-x86_64-Darwin :: strstr.c (2237 of 3269)
PASS: SanitizerCommon-ubsan-x86_64-Darwin :: suffix-log-path_test.c (2238 of 3269)
PASS: SanitizerCommon-ubsan-x86_64-Darwin :: symbolize_debug_argv.cpp (2239 of 3269)
PASS: SanitizerCommon-ubsan-x86_64-Darwin :: symbolize_pc.cpp (2240 of 3269)
PASS: SanitizerCommon-ubsan-x86_64-Darwin :: wcrtomb.c (2241 of 3269)
PASS: SanitizerCommon-ubsan-x86_64-Darwin :: wctomb.c (2242 of 3269)
XFAIL: SanitizerCommon-ubsan-x86_64-Darwin :: symbolize_pc_inline.cpp (2243 of 3269)
PASS: ThreadSanitizer-Unit :: rtl/./TsanRtlTest-x86_64-Test/Posix.CondBasic (2244 of 3269)
PASS: ThreadSanitizer-Unit :: rtl/./TsanRtlTest-x86_64-Test/Posix.ThreadLocalAccesses (2245 of 3269)
PASS: ThreadSanitizer-Unit :: rtl/./TsanRtlTest-x86_64-Test/Posix.ThreadSpecificDtors (2246 of 3269)
PASS: ThreadSanitizer-Unit :: rtl/./TsanRtlTest-x86_64-Test/ThreadSanitizer.BasicMutex (2247 of 3269)
PASS: SanitizerCommon-ubsan-x86_64-Darwin :: symbolize_stack.cpp (2248 of 3269)
PASS: ThreadSanitizer-Unit :: rtl/./TsanRtlTest-x86_64-Test/ThreadSanitizer.BasicRwMutex (2249 of 3269)
PASS: ThreadSanitizer-Unit :: rtl/./TsanRtlTest-x86_64-Test/ThreadSanitizer.BasicSpinMutex (2250 of 3269)
PASS: ThreadSanitizer-Unit :: rtl/./TsanRtlTest-x86_64-Test/ThreadSanitizer.BenignRaceOnVptr (2251 of 3269)
PASS: ThreadSanitizer-Unit :: rtl/./TsanRtlTest-x86_64-Test/ThreadSanitizer.FuncCall (2252 of 3269)
PASS: ThreadSanitizer-Unit :: rtl/./TsanRtlTest-x86_64-Test/ThreadSanitizer.HarmfulRaceOnVptr (2253 of 3269)
PASS: ThreadSanitizer-Unit :: rtl/./TsanRtlTest-x86_64-Test/ThreadSanitizer.LockedWriteThenRead (2254 of 3269)
PASS: ThreadSanitizer-Unit :: rtl/./TsanRtlTest-x86_64-Test/ThreadSanitizer.Memcpy (2255 of 3269)
PASS: ThreadSanitizer-Unit :: rtl/./TsanRtlTest-x86_64-Test/ThreadSanitizer.MemcpyRace1 (2256 of 3269)
PASS: ThreadSanitizer-Unit :: rtl/./TsanRtlTest-x86_64-Test/ThreadSanitizer.MemcpyRace2 (2257 of 3269)
PASS: ThreadSanitizer-Unit :: rtl/./TsanRtlTest-x86_64-Test/ThreadSanitizer.MemcpyRace3 (2258 of 3269)
PASS: ThreadSanitizer-Unit :: rtl/./TsanRtlTest-x86_64-Test/ThreadSanitizer.MemcpyStack (2259 of 3269)
PASS: ThreadSanitizer-Unit :: rtl/./TsanRtlTest-x86_64-Test/ThreadSanitizer.MemsetRace1 (2260 of 3269)
PASS: ThreadSanitizer-Unit :: rtl/./TsanRtlTest-x86_64-Test/ThreadSanitizer.Mutex (2261 of 3269)
PASS: ThreadSanitizer-Unit :: rtl/./TsanRtlTest-x86_64-Test/ThreadSanitizer.NoRaceWithOffset (2262 of 3269)
PASS: ThreadSanitizer-Unit :: rtl/./TsanRtlTest-x86_64-Test/ThreadSanitizer.RaceWithDeadThread (2263 of 3269)
PASS: ThreadSanitizer-Unit :: rtl/./TsanRtlTest-x86_64-Test/ThreadSanitizer.RaceWithOffset (2264 of 3269)
PASS: ThreadSanitizer-Unit :: rtl/./TsanRtlTest-x86_64-Test/ThreadSanitizer.RaceWithOffset2 (2265 of 3269)
PASS: ThreadSanitizer-Unit :: rtl/./TsanRtlTest-x86_64-Test/ThreadSanitizer.ReadReadNoRace (2266 of 3269)
PASS: ThreadSanitizer-Unit :: rtl/./TsanRtlTest-x86_64-Test/ThreadSanitizer.ReadWriteRace (2267 of 3269)
PASS: ThreadSanitizer-Unit :: rtl/./TsanRtlTest-x86_64-Test/ThreadSanitizer.ReportDeadThread (2268 of 3269)
PASS: ThreadSanitizer-Unit :: rtl/./TsanRtlTest-x86_64-Test/ThreadSanitizer.ReportRace (2269 of 3269)
PASS: ThreadSanitizer-Unit :: rtl/./TsanRtlTest-x86_64-Test/ThreadSanitizer.RwMutex (2270 of 3269)
PASS: ThreadSanitizer-Unit :: rtl/./TsanRtlTest-x86_64-Test/ThreadSanitizer.SimpleWrite (2271 of 3269)
PASS: ThreadSanitizer-Unit :: rtl/./TsanRtlTest-x86_64-Test/ThreadSanitizer.SimpleWriteWrite (2272 of 3269)
PASS: ThreadSanitizer-Unit :: rtl/./TsanRtlTest-x86_64-Test/ThreadSanitizer.SpinMutex (2273 of 3269)
PASS: ThreadSanitizer-Unit :: rtl/./TsanRtlTest-x86_64-Test/ThreadSanitizer.StaticMutex (2274 of 3269)
PASS: ThreadSanitizer-Unit :: rtl/./TsanRtlTest-x86_64-Test/ThreadSanitizer.ThreadDetach1 (2275 of 3269)
PASS: ThreadSanitizer-Unit :: rtl/./TsanRtlTest-x86_64-Test/ThreadSanitizer.ThreadDetach2 (2276 of 3269)
PASS: ThreadSanitizer-Unit :: rtl/./TsanRtlTest-x86_64-Test/ThreadSanitizer.ThreadSync (2277 of 3269)
PASS: ThreadSanitizer-Unit :: rtl/./TsanRtlTest-x86_64-Test/ThreadSanitizer.WriteThenLockedRead (2278 of 3269)
PASS: ThreadSanitizer-Unit :: rtl/./TsanRtlTest-x86_64-Test/ThreadSanitizer.WriteReadRace (2279 of 3269)
PASS: ThreadSanitizer-Unit :: rtl/./TsanRtlTest-x86_64-Test/ThreadSanitizer.WriteThenRead (2280 of 3269)
PASS: ThreadSanitizer-Unit :: rtl/./TsanRtlTest-x86_64-Test/ThreadSanitizer.WriteWriteRace (2281 of 3269)
PASS: ThreadSanitizer-Unit :: unit/./TsanUnitTest-x86_64-Test/Clock.AcquireRelease (2282 of 3269)
PASS: ThreadSanitizer-Unit :: unit/./TsanUnitTest-x86_64-Test/Clock.ChunkedBasic (2283 of 3269)
PASS: ThreadSanitizer-Unit :: unit/./TsanUnitTest-x86_64-Test/Clock.DifferentSizes (2284 of 3269)
PASS: ThreadSanitizer-Unit :: unit/./TsanUnitTest-x86_64-Test/Clock.Fuzzer (2285 of 3269)
PASS: ThreadSanitizer-Unit :: unit/./TsanUnitTest-x86_64-Test/Clock.Growth (2286 of 3269)
PASS: ThreadSanitizer-Unit :: unit/./TsanUnitTest-x86_64-Test/Clock.Growth2 (2287 of 3269)
PASS: ThreadSanitizer-Unit :: unit/./TsanUnitTest-x86_64-Test/Clock.Iter (2288 of 3269)
PASS: ThreadSanitizer-Unit :: unit/./TsanUnitTest-x86_64-Test/Clock.ManyThreads (2289 of 3269)
PASS: ThreadSanitizer-Unit :: unit/./TsanUnitTest-x86_64-Test/Clock.RepeatedAcquire (2290 of 3269)
PASS: ThreadSanitizer-Unit :: unit/./TsanUnitTest-x86_64-Test/Clock.VectorBasic (2291 of 3269)
PASS: ThreadSanitizer-Unit :: unit/./TsanUnitTest-x86_64-Test/Clock.releaseStoreAcquire (2292 of 3269)
PASS: ThreadSanitizer-Unit :: unit/./TsanUnitTest-x86_64-Test/DenseSlabAlloc.Basic (2293 of 3269)
PASS: ThreadSanitizer-Unit :: unit/./TsanUnitTest-x86_64-Test/Flags.Basic (2294 of 3269)
PASS: ThreadSanitizer-Unit :: unit/./TsanUnitTest-x86_64-Test/Flags.DefaultValues (2295 of 3269)
PASS: ThreadSanitizer-Unit :: unit/./TsanUnitTest-x86_64-Test/Flags.ParseDefaultOptions (2296 of 3269)
PASS: ThreadSanitizer-Unit :: unit/./TsanUnitTest-x86_64-Test/Flags.ParseEnvOptions (2297 of 3269)
PASS: ThreadSanitizer-Unit :: unit/./TsanUnitTest-x86_64-Test/Flags.ParsePriority (2298 of 3269)
PASS: ThreadSanitizer-Unit :: unit/./TsanUnitTest-x86_64-Test/IList.Empty (2299 of 3269)
PASS: ThreadSanitizer-Unit :: unit/./TsanUnitTest-x86_64-Test/IList.MultipleNodes (2300 of 3269)
PASS: ThreadSanitizer-Unit :: unit/./TsanUnitTest-x86_64-Test/IList.OneNode (2301 of 3269)
PASS: ThreadSanitizer-Unit :: unit/./TsanUnitTest-x86_64-Test/IList.TwoLists (2302 of 3269)
PASS: ThreadSanitizer-Unit :: unit/./TsanUnitTest-x86_64-Test/MetaMap.Basic (2303 of 3269)
PASS: ThreadSanitizer-Unit :: unit/./TsanUnitTest-x86_64-Test/MetaMap.FreeRange (2304 of 3269)
PASS: ThreadSanitizer-Unit :: unit/./TsanUnitTest-x86_64-Test/MetaMap.MoveMemory (2305 of 3269)
PASS: ThreadSanitizer-Unit :: unit/./TsanUnitTest-x86_64-Test/MetaMap.ResetSync (2306 of 3269)
PASS: ThreadSanitizer-Unit :: unit/./TsanUnitTest-x86_64-Test/MetaMap.Sync (2307 of 3269)
PASS: ThreadSanitizer-Unit :: unit/./TsanUnitTest-x86_64-Test/Mman.AlignedAlloc (2308 of 3269)
PASS: ThreadSanitizer-Unit :: unit/./TsanUnitTest-x86_64-Test/Mman.Internal (2309 of 3269)
PASS: ThreadSanitizer-Unit :: unit/./TsanUnitTest-x86_64-Test/Mman.PosixMemalign (2310 of 3269)
PASS: ThreadSanitizer-Unit :: unit/./TsanUnitTest-x86_64-Test/Mman.Stats (2311 of 3269)
PASS: ThreadSanitizer-Unit :: unit/./TsanUnitTest-x86_64-Test/Mman.Memalign (2312 of 3269)
PASS: ThreadSanitizer-Unit :: unit/./TsanUnitTest-x86_64-Test/Mman.UsableSize (2313 of 3269)
PASS: ThreadSanitizer-Unit :: unit/./TsanUnitTest-x86_64-Test/Mman.User (2314 of 3269)
PASS: ThreadSanitizer-Unit :: unit/./TsanUnitTest-x86_64-Test/Mman.UserRealloc (2315 of 3269)
PASS: ThreadSanitizer-Unit :: unit/./TsanUnitTest-x86_64-Test/Mman.Valloc (2316 of 3269)
PASS: ThreadSanitizer-Unit :: unit/./TsanUnitTest-x86_64-Test/Shadow.Celling (2317 of 3269)
PASS: ThreadSanitizer-Unit :: unit/./TsanUnitTest-x86_64-Test/Shadow.FastState (2318 of 3269)
PASS: ThreadSanitizer-Unit :: unit/./TsanUnitTest-x86_64-Test/Shadow.Mapping (2319 of 3269)
PASS: ThreadSanitizer-Unit :: unit/./TsanUnitTest-x86_64-Test/StackTrace.BasicBuffered (2320 of 3269)
PASS: ThreadSanitizer-Unit :: unit/./TsanUnitTest-x86_64-Test/Shadow.AllMappings (2321 of 3269)
PASS: ThreadSanitizer-Unit :: unit/./TsanUnitTest-x86_64-Test/StackTrace.BasicVarSize (2322 of 3269)
PASS: ThreadSanitizer-Unit :: unit/./TsanUnitTest-x86_64-Test/StackTrace.TrimBuffered (2323 of 3269)
PASS: ThreadSanitizer-Unit :: unit/./TsanUnitTest-x86_64-Test/StackTrace.TrimVarSize (2324 of 3269)
PASS: ThreadSanitizer-Unit :: unit/./TsanUnitTest-x86_64-Test/VectorClock.GetSet (2325 of 3269)
PASS: ThreadSanitizer-Unit :: unit/./TsanUnitTest-x86_64-Test/VectorClock.VectorOps (2326 of 3269)
PASS: ThreadSanitizer-x86_64 :: Darwin/dlopen.cpp (2327 of 3269)
PASS: ThreadSanitizer-x86_64 :: Darwin/debug_external.cpp (2328 of 3269)
FAIL: ThreadSanitizer-x86_64 :: Darwin/dyld-insert-libraries.c (2329 of 3269)
******************** TEST 'ThreadSanitizer-x86_64 :: Darwin/dyld-insert-libraries.c' FAILED ********************
Script:
--
: 'RUN: at line 7';      /Users/buildslave/jenkins/workspace/clang-stage2-Rthinlto/clang-build/Build/./bin/clang  -fsanitize=thread -Wall  -arch x86_64 -stdlib=libc++ -mmacosx-version-min=10.10 -isysroot /Applications/Xcode.app/Contents/Developer/Platforms/MacOSX.platform/Developer/SDKs/MacOSX10.15.sdk   -gline-tables-only -I/Users/buildslave/jenkins/workspace/clang-stage2-Rthinlto/llvm-project/compiler-rt/test/tsan/../ /Users/buildslave/jenkins/workspace/clang-stage2-Rthinlto/llvm-project/compiler-rt/test/tsan/Darwin/dyld-insert-libraries.c -o /Users/buildslave/jenkins/workspace/clang-stage2-Rthinlto/clang-build/Build/tools/clang/runtime/compiler-rt-bins/test/tsan/X86_64Config/Darwin/Output/dyld-insert-libraries.c.tmp
: 'RUN: at line 8';      /Users/buildslave/jenkins/workspace/clang-stage2-Rthinlto/clang-build/Build/./bin/clang  -fsanitize=thread -Wall  -arch x86_64 -stdlib=libc++ -mmacosx-version-min=10.10 -isysroot /Applications/Xcode.app/Contents/Developer/Platforms/MacOSX.platform/Developer/SDKs/MacOSX10.15.sdk   -gline-tables-only -I/Users/buildslave/jenkins/workspace/clang-stage2-Rthinlto/llvm-project/compiler-rt/test/tsan/../ /Users/buildslave/jenkins/workspace/clang-stage2-Rthinlto/llvm-project/compiler-rt/test/tsan/Darwin/dyld-insert-libraries.c -o /Users/buildslave/jenkins/workspace/clang-stage2-Rthinlto/clang-build/Build/tools/clang/runtime/compiler-rt-bins/test/tsan/X86_64Config/Darwin/Output/dyld-insert-libraries.c.tmp.dylib -fno-sanitize=thread -dynamiclib -DSHARED_LIB
: 'RUN: at line 10';   env DYLD_INSERT_LIBRARIES=/Users/buildslave/jenkins/workspace/clang-stage2-Rthinlto/clang-build/Build/tools/clang/runtime/compiler-rt-bins/test/tsan/X86_64Config/Darwin/Output/dyld-insert-libraries.c.tmp.dylib  /Users/buildslave/jenkins/workspace/clang-stage2-Rthinlto/clang-build/Build/tools/clang/runtime/compiler-rt-bins/test/tsan/X86_64Config/Darwin/Output/dyld-insert-libraries.c.tmp 2>&1 | FileCheck /Users/buildslave/jenkins/workspace/clang-stage2-Rthinlto/llvm-project/compiler-rt/test/tsan/Darwin/dyld-insert-libraries.c --implicit-check-not='ThreadSanitizer'
--
Exit Code: 1

Hide Details

Command Output (stderr): -- + : 'RUN: at line 7' + /Users/buildslave/jenkins/workspace/clang-stage2-Rthinlto/clang-build/Build/./bin/clang -fsanitize=thread -Wall -arch x86_64 -stdlib=libc++ -mmacosx-version-min=10.10 -isysroot /Applications/Xcode.app/Contents/Developer/Platforms/MacOSX.platform/Developer/SDKs/MacOSX10.15.sdk -gline-tables-only -I/Users/buildslave/jenkins/workspace/clang-stage2-Rthinlto/llvm-project/compiler-rt/test/tsan/../ /Users/buildslave/jenkins/workspace/clang-stage2-Rthinlto/llvm-project/compiler-rt/test/tsan/Darwin/dyld-insert-libraries.c -o /Users/buildslave/jenkins/workspace/clang-stage2-Rthinlto/clang-build/Build/tools/clang/runtime/compiler-rt-bins/test/tsan/X86_64Config/Darwin/Output/dyld-insert-libraries.c.tmp + : 'RUN: at line 8' + /Users/buildslave/jenkins/workspace/clang-stage2-Rthinlto/clang-build/Build/./bin/clang -fsanitize=thread -Wall -arch x86_64 -stdlib=libc++ -mmacosx-version-min=10.10 -isysroot /Applications/Xcode.app/Contents/Developer/Platforms/MacOSX.platform/Developer/SDKs/MacOSX10.15.sdk -gline-tables-only -I/Users/buildslave/jenkins/workspace/clang-stage2-Rthinlto/llvm-project/compiler-rt/test/tsan/../ /Users/buildslave/jenkins/workspace/clang-stage2-Rthinlto/llvm-project/compiler-rt/test/tsan/Darwin/dyld-insert-libraries.c -o /Users/buildslave/jenkins/workspace/clang-stage2-Rthinlto/clang-build/Build/tools/clang/runtime/compiler-rt-bins/test/tsan/X86_64Config/Darwin/Output/dyld-insert-libraries.c.tmp.dylib -fno-sanitize=thread -dynamiclib -DSHARED_LIB + : 'RUN: at line 10' + env DYLD_INSERT_LIBRARIES=/Users/buildslave/jenkins/workspace/clang-stage2-Rthinlto/clang-build/Build/tools/clang/runtime/compiler-rt-bins/test/tsan/X86_64Config/Darwin/Output/dyld-insert-libraries.c.tmp.dylib /Users/buildslave/jenkins/workspace/clang-stage2-Rthinlto/clang-build/Build/tools/clang/runtime/compiler-rt-bins/test/tsan/X86_64Config/Darwin/Output/dyld-insert-libraries.c.tmp + FileCheck /Users/buildslave/jenkins/workspace/clang-stage2-Rthinlto/llvm-project/compiler-rt/test/tsan/Darwin/dyld-insert-libraries.c --implicit-check-not=ThreadSanitizer /Users/buildslave/jenkins/workspace/clang-stage2-Rthinlto/llvm-project/compiler-rt/test/tsan/Darwin/dyld-insert-libraries.c:112:11: error: CHECK: expected string not found in input // CHECK: THREAD_DESTROY [[CHILD]], self: [[MAIN]] ^ <stdin>:8:74: note: scanning from here THREAD_TERMINATE 0x7e8000104000, self: 0x7e8000104000, name: child thread ^ <stdin>:8:74: note: with "CHILD" equal to "0x7e8000104000" THREAD_TERMINATE 0x7e8000104000, self: 0x7e8000104000, name: child thread ^ <stdin>:8:74: note: with "MAIN" equal to "0x111220dc0" THREAD_TERMINATE 0x7e8000104000, self: 0x7e8000104000, name: child thread ^ <stdin>:9:1: note: possible intended match here THREAD_DESTROY 0x7e8000104000, self: 0x7e8000104000, name: child thread ^

Hide Details

Input file: <stdin> Check file: /Users/buildslave/jenkins/workspace/clang-stage2-Rthinlto/llvm-project/compiler-rt/test/tsan/Darwin/dyld-insert-libraries.c

Hide Details

-dump-input=help explains the following input dump.

Hide Details

Input was: <<<<<< 1: __library_initializer 2: main 3: THREAD_CREATE 0x7e8000081000, self: 0x111220dc0, name: n/a 4: THREAD_START 0x7e8000081000, self: 0x7e8000081000, name: n/a 5: THREAD_CREATE 0x7e8000104000, self: 0x111220dc0, name: n/a 6: THREAD_START 0x7e8000104000, self: 0x7e8000104000, name: n/a 7: Hello from pthread 8: THREAD_TERMINATE 0x7e8000104000, self: 0x7e8000104000, name: child thread check:112'0 X error: no match found check:112'1 with "CHILD" equal to "0x7e8000104000" check:112'2 with "MAIN" equal to "0x111220dc0" 9: THREAD_DESTROY 0x7e8000104000, self: 0x7e8000104000, name: child thread check:112'0 ~~~~~~~~~~~~~~~~~~~~~~~~~~~~~~~~~~~~~~~~~~~~~~~~~~~~~~~~~~~~~~~~~~~~~~~~ check:112'3 ? possible intended match 10: Done. check:112'0 ~~~~~~ >>>>>>

Hide Details

--

Hide Details

******************** PASS: ThreadSanitizer-x86_64 :: Darwin/deadlock.mm (2330 of 3269) PASS: ThreadSanitizer-x86_64 :: Darwin/dyld-library-path.c (2331 of 3269) PASS: ThreadSanitizer-x86_64 :: Darwin/external-lib.cpp (2332 of 3269) PASS: ThreadSanitizer-x86_64 :: Darwin/external-noninstrumented-module.cpp (2333 of 3269) PASS: ThreadSanitizer-x86_64 :: Darwin/external-ignore-noninstrumented.cpp (2334 of 3269) PASS: ThreadSanitizer-x86_64 :: Darwin/external-dups.cpp (2335 of 3269) PASS: ThreadSanitizer-x86_64 :: Darwin/external-swift-debugging.cpp (2336 of 3269) PASS: ThreadSanitizer-x86_64 :: Darwin/external-swift.cpp (2337 of 3269) PASS: ThreadSanitizer-x86_64 :: Darwin/gcd-sync-block-copy.mm (2338 of 3269) PASS: ThreadSanitizer-x86_64 :: Darwin/libcxx-call-once.mm (2339 of 3269) PASS: ThreadSanitizer-x86_64 :: Darwin/ignore-noninstrumented.mm (2340 of 3269) PASS: ThreadSanitizer-x86_64 :: Darwin/external.cpp (2341 of 3269) PASS: ThreadSanitizer-x86_64 :: Darwin/libcxx-future.mm (2342 of 3269) PASS: ThreadSanitizer-x86_64 :: Darwin/libcxx-shared-ptr-recursive.mm (2343 of 3269) PASS: ThreadSanitizer-x86_64 :: Darwin/libcxx-shared-ptr-stress.mm (2344 of 3269) PASS: ThreadSanitizer-x86_64 :: Darwin/mach_vm_allocate.c (2345 of 3269) PASS: ThreadSanitizer-x86_64 :: Darwin/malloc-stack-logging.cpp (2346 of 3269) PASS: ThreadSanitizer-x86_64 :: Darwin/libcxx-shared-ptr.mm (2347 of 3269) PASS: ThreadSanitizer-x86_64 :: Darwin/main_tid.mm (2348 of 3269) PASS: ThreadSanitizer-x86_64 :: Darwin/malloc_size.mm (2349 of 3269) PASS: ThreadSanitizer-x86_64 :: Darwin/norace-objcxx-run-time.mm (2350 of 3269) PASS: ThreadSanitizer-x86_64 :: Darwin/no_call_setenv_in_symbolize.cpp (2351 of 3269) PASS: ThreadSanitizer-x86_64 :: Darwin/objc-simple.mm (2352 of 3269) PASS: ThreadSanitizer-x86_64 :: Darwin/objc-race.mm (2353 of 3269) PASS: ThreadSanitizer-x86_64 :: Darwin/objc-synchronize-cycle-tagged.mm (2354 of 3269) PASS: ThreadSanitizer-x86_64 :: Darwin/objc-double-property.mm (2355 of 3269) PASS: ThreadSanitizer-x86_64 :: Darwin/objc-synchronize-cycle.mm (2356 of 3269) PASS: ThreadSanitizer-x86_64 :: Darwin/objc-synchronize-nested-recursive.mm (2357 of 3269) PASS: ThreadSanitizer-x86_64 :: Darwin/os_unfair_lock.c (2358 of 3269) PASS: ThreadSanitizer-x86_64 :: Darwin/objc-synchronize-tagged.mm (2359 of 3269) PASS: ThreadSanitizer-x86_64 :: Darwin/objc-synchronize.mm (2360 of 3269) PASS: ThreadSanitizer-x86_64 :: Darwin/osatomics-bitops.mm (2361 of 3269) PASS: ThreadSanitizer-x86_64 :: Darwin/osatomics-add.mm (2362 of 3269) PASS: ThreadSanitizer-x86_64 :: Darwin/osspinlock-norace.cpp (2363 of 3269) PASS: ThreadSanitizer-x86_64 :: Darwin/osatomics-list.mm (2364 of 3269) PASS: ThreadSanitizer-x86_64 :: Darwin/realloc-zero.cpp (2365 of 3269) PASS: ThreadSanitizer-x86_64 :: Darwin/signals-blocked.cpp (2366 of 3269) PASS: ThreadSanitizer-x86_64 :: Darwin/symbolizer-dladdr.cpp (2367 of 3269) PASS: ThreadSanitizer-x86_64 :: Darwin/variadic-open.cpp (2368 of 3269) PASS: ThreadSanitizer-x86_64 :: Darwin/symbolizer-atos.cpp (2369 of 3269) PASS: ThreadSanitizer-x86_64 :: Darwin/xpc-cancel.mm (2370 of 3269) UNSUPPORTED: ThreadSanitizer-x86_64 :: Linux/check_memcpy.c (2371 of 3269) UNSUPPORTED: ThreadSanitizer-x86_64 :: Linux/check_preinit.cpp (2372 of 3269) PASS: ThreadSanitizer-x86_64 :: Darwin/workerthreads.mm (2373 of 3269) UNSUPPORTED: ThreadSanitizer-x86_64 :: Linux/clockwait_double_lock.c (2374 of 3269) UNSUPPORTED: ThreadSanitizer-x86_64 :: Linux/double_race.cpp (2375 of 3269) UNSUPPORTED: ThreadSanitizer-x86_64 :: Linux/mutex_robust2.cpp (2376 of 3269) UNSUPPORTED: ThreadSanitizer-x86_64 :: Linux/fork_syscall.cpp (2377 of 3269) UNSUPPORTED: ThreadSanitizer-x86_64 :: Linux/mutex_robust.cpp (2378 of 3269) UNSUPPORTED: ThreadSanitizer-x86_64 :: Linux/thread_timedjoin.c (2379 of 3269) UNSUPPORTED: ThreadSanitizer-x86_64 :: Linux/syscall.cpp (2380 of 3269) UNSUPPORTED: ThreadSanitizer-x86_64 :: Linux/pie_no_aslr.cpp (2381 of 3269) UNSUPPORTED: ThreadSanitizer-x86_64 :: Linux/thread_tryjoin.c (2382 of 3269) UNSUPPORTED: ThreadSanitizer-x86_64 :: Linux/user_fopen.cpp (2383 of 3269) UNSUPPORTED: ThreadSanitizer-x86_64 :: Linux/user_malloc.cpp (2384 of 3269) PASS: ThreadSanitizer-x86_64 :: Darwin/xpc-race.mm (2385 of 3269) PASS: ThreadSanitizer-x86_64 :: annotate_happens_before.cpp (2386 of 3269) PASS: ThreadSanitizer-x86_64 :: atexit.cpp (2387 of 3269) PASS: ThreadSanitizer-x86_64 :: Darwin/xpc.mm (2388 of 3269) PASS: ThreadSanitizer-x86_64 :: aligned_vs_unaligned_race.cpp (2389 of 3269) PASS: ThreadSanitizer-x86_64 :: atexit2.cpp (2390 of 3269) PASS: ThreadSanitizer-x86_64 :: atexit3.cpp (2391 of 3269) PASS: ThreadSanitizer-x86_64 :: atexit4.cpp (2392 of 3269) PASS: ThreadSanitizer-x86_64 :: atomic_free2.cpp (2393 of 3269) PASS: ThreadSanitizer-x86_64 :: atomic_free3.cpp (2394 of 3269) PASS: ThreadSanitizer-x86_64 :: atomic_hle.cpp (2395 of 3269) PASS: ThreadSanitizer-x86_64 :: atomic_norace.cpp (2396 of 3269) PASS: ThreadSanitizer-x86_64 :: atomic_norace2.cpp (2397 of 3269) PASS: ThreadSanitizer-x86_64 :: atomic_race.cpp (2398 of 3269) PASS: ThreadSanitizer-x86_64 :: atomic_stack.cpp (2399 of 3269) UNSUPPORTED: ThreadSanitizer-x86_64 :: barrier.cpp (2400 of 3269) UNSUPPORTED: ThreadSanitizer-x86_64 :: bench_acquire_only.cpp (2401 of 3269) UNSUPPORTED: ThreadSanitizer-x86_64 :: bench_acquire_release.cpp (2402 of 3269) UNSUPPORTED: ThreadSanitizer-x86_64 :: bench_local_mutex.cpp (2403 of 3269) UNSUPPORTED: ThreadSanitizer-x86_64 :: bench_memory_access.cpp (2404 of 3269) UNSUPPORTED: ThreadSanitizer-x86_64 :: bench_mutex.cpp (2405 of 3269) UNSUPPORTED: ThreadSanitizer-x86_64 :: bench_release_only.cpp (2406 of 3269) UNSUPPORTED: ThreadSanitizer-x86_64 :: bench_rwmutex.cpp (2407 of 3269) PASS: ThreadSanitizer-x86_64 :: bench_shadow_flush.cpp (2408 of 3269) UNSUPPORTED: ThreadSanitizer-x86_64 :: bench_single_writer.cpp (2409 of 3269) UNSUPPORTED: ThreadSanitizer-x86_64 :: bench_ten_mutexes.cpp (2410 of 3269) PASS: ThreadSanitizer-x86_64 :: atomic_store.cpp (2411 of 3269) PASS: ThreadSanitizer-x86_64 :: benign_race.cpp (2412 of 3269) PASS: ThreadSanitizer-x86_64 :: cond.c (2413 of 3269) PASS: ThreadSanitizer-x86_64 :: compare_exchange.cpp (2414 of 3269) PASS: ThreadSanitizer-x86_64 :: cond_cancel.c (2415 of 3269) PASS: ThreadSanitizer-x86_64 :: cond_destruction.cpp (2416 of 3269) UNSUPPORTED: ThreadSanitizer-x86_64 :: cond_version.c (2417 of 3269) PASS: ThreadSanitizer-x86_64 :: cond_race.cpp (2418 of 3269) PASS: ThreadSanitizer-x86_64 :: custom_mutex0.cpp (2419 of 3269) PASS: ThreadSanitizer-x86_64 :: atomic_free.cpp (2420 of 3269) PASS: ThreadSanitizer-x86_64 :: custom_mutex1.cpp (2421 of 3269) PASS: ThreadSanitizer-x86_64 :: custom_mutex2.cpp (2422 of 3269) PASS: ThreadSanitizer-x86_64 :: custom_mutex3.cpp (2423 of 3269) UNSUPPORTED: ThreadSanitizer-x86_64 :: cxa_guard_acquire.cpp (2424 of 3269) PASS: ThreadSanitizer-x86_64 :: custom_mutex4.cpp (2425 of 3269) UNSUPPORTED: ThreadSanitizer-x86_64 :: debug_alloc_stack.cpp (2426 of 3269) PASS: ThreadSanitizer-x86_64 :: custom_mutex5.cpp (2427 of 3269) PASS: ThreadSanitizer-x86_64 :: debug_locate.cpp (2428 of 3269) PASS: ThreadSanitizer-x86_64 :: debugging.cpp (2429 of 3269) PASS: ThreadSanitizer-x86_64 :: deep_stack2.cpp (2430 of 3269) PASS: ThreadSanitizer-x86_64 :: deep_stack1.cpp (2431 of 3269) UNSUPPORTED: ThreadSanitizer-x86_64 :: dl_iterate_phdr.cpp (2432 of 3269) PASS: ThreadSanitizer-x86_64 :: default_options.cpp (2433 of 3269) PASS: ThreadSanitizer-x86_64 :: dlclose.cpp (2434 of 3269) PASS: ThreadSanitizer-x86_64 :: dtls.c (2435 of 3269) PASS: ThreadSanitizer-x86_64 :: exceptions.cpp (2436 of 3269) PASS: ThreadSanitizer-x86_64 :: fd_close_norace.cpp (2437 of 3269) PASS: ThreadSanitizer-x86_64 :: fd_close_norace2.cpp (2438 of 3269) PASS: ThreadSanitizer-x86_64 :: fd_dup_norace.cpp (2439 of 3269) PASS: ThreadSanitizer-x86_64 :: fd_dup_norace2.cpp (2440 of 3269) PASS: ThreadSanitizer-x86_64 :: fd_dup_race.cpp (2441 of 3269) PASS: ThreadSanitizer-x86_64 :: fd_location.cpp (2442 of 3269) PASS: ThreadSanitizer-x86_64 :: fd_pipe_norace.cpp (2443 of 3269) PASS: ThreadSanitizer-x86_64 :: fd_socket_connect_norace.cpp (2444 of 3269) PASS: ThreadSanitizer-x86_64 :: fd_pipe_race.cpp (2445 of 3269) PASS: ThreadSanitizer-x86_64 :: fd_socket_norace.cpp (2446 of 3269) PASS: ThreadSanitizer-x86_64 :: deadlock_detector_stress_test.cpp (2447 of 3269) PASS: ThreadSanitizer-x86_64 :: fd_socketpair_norace.cpp (2448 of 3269) PASS: ThreadSanitizer-x86_64 :: fiber_asm.cpp (2449 of 3269) UNSUPPORTED: ThreadSanitizer-x86_64 :: fiber_cleanup.cpp (2450 of 3269) PASS: ThreadSanitizer-x86_64 :: fd_stdout_race.cpp (2451 of 3269) PASS: ThreadSanitizer-x86_64 :: fd_tid_recycled.cpp (2452 of 3269) PASS: ThreadSanitizer-x86_64 :: fiber_from_thread.cpp (2453 of 3269) PASS: ThreadSanitizer-x86_64 :: fiber_longjmp.cpp (2454 of 3269) PASS: ThreadSanitizer-x86_64 :: fiber_simple.cpp (2455 of 3269) PASS: ThreadSanitizer-x86_64 :: fiber_race.cpp (2456 of 3269) PASS: ThreadSanitizer-x86_64 :: fiber_two_threads.cpp (2457 of 3269) PASS: ThreadSanitizer-x86_64 :: fork_atexit.cpp (2458 of 3269) PASS: ThreadSanitizer-x86_64 :: flush_memory.cpp (2459 of 3269) PASS: ThreadSanitizer-x86_64 :: fork_multithreaded3.cpp (2460 of 3269) PASS: ThreadSanitizer-x86_64 :: fork_multithreaded.cpp (2461 of 3269) PASS: ThreadSanitizer-x86_64 :: fork_deadlock.cpp (2462 of 3269) PASS: ThreadSanitizer-x86_64 :: getline_nohang.cpp (2463 of 3269) PASS: ThreadSanitizer-x86_64 :: free_race.c (2464 of 3269) PASS: ThreadSanitizer-x86_64 :: free_race2.c (2465 of 3269) PASS: ThreadSanitizer-x86_64 :: global_race2.cpp (2466 of 3269) PASS: ThreadSanitizer-x86_64 :: global_race3.cpp (2467 of 3269) PASS: ThreadSanitizer-x86_64 :: halt_on_error.cpp (2468 of 3269) PASS: ThreadSanitizer-x86_64 :: heap_race.cpp (2469 of 3269) PASS: ThreadSanitizer-x86_64 :: ignore_free.cpp (2470 of 3269) PASS: ThreadSanitizer-x86_64 :: ignore_lib0.cpp (2471 of 3269) PASS: ThreadSanitizer-x86_64 :: ignore_lib1.cpp (2472 of 3269) PASS: ThreadSanitizer-x86_64 :: ignore_lib2.cpp (2473 of 3269) PASS: ThreadSanitizer-x86_64 :: ignore_lib3.cpp (2474 of 3269) PASS: ThreadSanitizer-x86_64 :: ignore_lib5.cpp (2475 of 3269) PASS: ThreadSanitizer-x86_64 :: ignore_lib4.cpp (2476 of 3269) PASS: ThreadSanitizer-x86_64 :: global_race.cpp (2477 of 3269) PASS: ThreadSanitizer-x86_64 :: ignore_malloc.cpp (2478 of 3269) PASS: ThreadSanitizer-x86_64 :: ignore_race.cpp (2479 of 3269) PASS: ThreadSanitizer-x86_64 :: ignore_sync.cpp (2480 of 3269) PASS: ThreadSanitizer-x86_64 :: ignored-interceptors-mmap.cpp (2481 of 3269) PASS: ThreadSanitizer-x86_64 :: ignorelist.cpp (2482 of 3269) PASS: ThreadSanitizer-x86_64 :: ignore_lib6.cpp (2483 of 3269) PASS: ThreadSanitizer-x86_64 :: ignorelist2.cpp (2484 of 3269) PASS: ThreadSanitizer-x86_64 :: inlined_memcpy_race.cpp (2485 of 3269) PASS: ThreadSanitizer-x86_64 :: interface_atomic_test.c (2486 of 3269) PASS: ThreadSanitizer-x86_64 :: inlined_memcpy_race2.cpp (2487 of 3269) UNSUPPORTED: ThreadSanitizer-x86_64 :: java_finalizer2.cpp (2488 of 3269) PASS: ThreadSanitizer-x86_64 :: java_alloc.cpp (2489 of 3269) PASS: ThreadSanitizer-x86_64 :: java_finalizer.cpp (2490 of 3269) PASS: ThreadSanitizer-x86_64 :: java_find.cpp (2491 of 3269) PASS: ThreadSanitizer-x86_64 :: java_heap_init.cpp (2492 of 3269) PASS: ThreadSanitizer-x86_64 :: java_lock.cpp (2493 of 3269) PASS: ThreadSanitizer-x86_64 :: java_lock_move.cpp (2494 of 3269) PASS: ThreadSanitizer-x86_64 :: java_lock_rec.cpp (2495 of 3269) PASS: ThreadSanitizer-x86_64 :: java_lock_rec_race.cpp (2496 of 3269) PASS: ThreadSanitizer-x86_64 :: java_move_overlap.cpp (2497 of 3269) PASS: ThreadSanitizer-x86_64 :: java_move_overlap_race.cpp (2498 of 3269) PASS: ThreadSanitizer-x86_64 :: java_race_move.cpp (2499 of 3269) PASS: ThreadSanitizer-x86_64 :: java_race.cpp (2500 of 3269) PASS: ThreadSanitizer-x86_64 :: java_rwlock.cpp (2501 of 3269) PASS: ThreadSanitizer-x86_64 :: java_race_pc.cpp (2502 of 3269) PASS: ThreadSanitizer-x86_64 :: java_volatile.cpp (2503 of 3269) PASS: ThreadSanitizer-x86_64 :: java_symbolization.cpp (2504 of 3269) PASS: ThreadSanitizer-x86_64 :: java_symbolization_legacy.cpp (2505 of 3269) PASS: ThreadSanitizer-x86_64 :: libdispatch/after.c (2506 of 3269) PASS: ThreadSanitizer-x86_64 :: libcxx/std_shared_ptr.cpp (2507 of 3269) PASS: ThreadSanitizer-x86_64 :: large_malloc_meta.cpp (2508 of 3269) PASS: ThreadSanitizer-x86_64 :: libdispatch/apply.c (2509 of 3269) PASS: ThreadSanitizer-x86_64 :: libdispatch/apply-race.c (2510 of 3269) PASS: ThreadSanitizer-x86_64 :: libdispatch/async-norace.c (2511 of 3269) PASS: ThreadSanitizer-x86_64 :: libdispatch/async_and_wait.c (2512 of 3269) PASS: ThreadSanitizer-x86_64 :: libdispatch/async-race.c (2513 of 3269) PASS: ThreadSanitizer-x86_64 :: libdispatch/barrier-race.c (2514 of 3269) PASS: ThreadSanitizer-x86_64 :: libdispatch/barrier.c (2515 of 3269) PASS: ThreadSanitizer-x86_64 :: libdispatch/blocks.c (2516 of 3269) PASS: ThreadSanitizer-x86_64 :: libdispatch/data.c (2517 of 3269) PASS: ThreadSanitizer-x86_64 :: libdispatch/fd.c (2518 of 3269) PASS: ThreadSanitizer-x86_64 :: libdispatch/dispatch_once_deadlock.c (2519 of 3269) PASS: ThreadSanitizer-x86_64 :: libdispatch/dispatch_main.c (2520 of 3269) PASS: ThreadSanitizer-x86_64 :: libdispatch/groups-leave.c (2521 of 3269) PASS: ThreadSanitizer-x86_64 :: libdispatch/groups-norace.c (2522 of 3269) PASS: ThreadSanitizer-x86_64 :: libdispatch/groups-destructor.cpp (2523 of 3269) PASS: ThreadSanitizer-x86_64 :: libdispatch/io-barrier.c (2524 of 3269) PASS: ThreadSanitizer-x86_64 :: libdispatch/io-cleanup.c (2525 of 3269) PASS: ThreadSanitizer-x86_64 :: libdispatch/io-barrier-race.c (2526 of 3269) PASS: ThreadSanitizer-x86_64 :: libdispatch/groups-stress.c (2527 of 3269) PASS: ThreadSanitizer-x86_64 :: libdispatch/io.c (2528 of 3269) PASS: ThreadSanitizer-x86_64 :: libdispatch/once.c (2529 of 3269) PASS: ThreadSanitizer-x86_64 :: libdispatch/io-race.c (2530 of 3269) PASS: ThreadSanitizer-x86_64 :: libdispatch/semaphore-norace.c (2531 of 3269) PASS: ThreadSanitizer-x86_64 :: libdispatch/serial-queue-norace.c (2532 of 3269) PASS: ThreadSanitizer-x86_64 :: libdispatch/source-cancel.c (2533 of 3269) PASS: ThreadSanitizer-x86_64 :: libdispatch/source-cancel2.c (2534 of 3269) PASS: ThreadSanitizer-x86_64 :: libdispatch/source-event.c (2535 of 3269) PASS: ThreadSanitizer-x86_64 :: libdispatch/source-event2.c (2536 of 3269) PASS: ThreadSanitizer-x86_64 :: libdispatch/source-registration.c (2537 of 3269) PASS: ThreadSanitizer-x86_64 :: libdispatch/source-registration2.c (2538 of 3269) PASS: ThreadSanitizer-x86_64 :: libdispatch/suspend.c (2539 of 3269) PASS: ThreadSanitizer-x86_64 :: libdispatch/source-serial.c (2540 of 3269) PASS: ThreadSanitizer-x86_64 :: libdispatch/sync-block-copy.cpp (2541 of 3269) PASS: ThreadSanitizer-x86_64 :: libdispatch/sync-norace.c (2542 of 3269) PASS: ThreadSanitizer-x86_64 :: libdispatch/target-queue-norace.c (2543 of 3269) PASS: ThreadSanitizer-x86_64 :: libdispatch/sync-race.c (2544 of 3269) PASS: ThreadSanitizer-x86_64 :: longjmp.cpp (2545 of 3269) PASS: ThreadSanitizer-x86_64 :: longjmp2.cpp (2546 of 3269) PASS: ThreadSanitizer-x86_64 :: load_shared_lib.cpp (2547 of 3269) PASS: ThreadSanitizer-x86_64 :: longjmp3.cpp (2548 of 3269) PASS: ThreadSanitizer-x86_64 :: longjmp4.cpp (2549 of 3269) PASS: ThreadSanitizer-x86_64 :: malloc_overflow.cpp (2550 of 3269) UNSUPPORTED: ThreadSanitizer-x86_64 :: map32bit.cpp (2551 of 3269) PASS: ThreadSanitizer-x86_64 :: malloc_stack.cpp (2552 of 3269) PASS: ThreadSanitizer-x86_64 :: memcmp_race.cpp (2553 of 3269) PASS: ThreadSanitizer-x86_64 :: mmap_large.cpp (2554 of 3269) PASS: ThreadSanitizer-x86_64 :: mmap_lots.cpp (2555 of 3269) UNSUPPORTED: ThreadSanitizer-x86_64 :: mmap_stress.cpp (2556 of 3269) PASS: ThreadSanitizer-x86_64 :: lots_of_threads.c (2557 of 3269) PASS: ThreadSanitizer-x86_64 :: memcpy_race.cpp (2558 of 3269) PASS: ThreadSanitizer-x86_64 :: mop1.c (2559 of 3269) PASS: ThreadSanitizer-x86_64 :: mop_with_offset.cpp (2560 of 3269) XFAIL: ThreadSanitizer-x86_64 :: must_deadlock.cpp (2561 of 3269) PASS: ThreadSanitizer-x86_64 :: mutex_annotations.cpp (2562 of 3269) PASS: ThreadSanitizer-x86_64 :: mop_with_offset2.cpp (2563 of 3269) PASS: ThreadSanitizer-x86_64 :: mutex_bad_read_lock.cpp (2564 of 3269) PASS: ThreadSanitizer-x86_64 :: mmap_stress2.cpp (2565 of 3269) PASS: ThreadSanitizer-x86_64 :: mutex_bad_read_unlock.cpp (2566 of 3269) PASS: ThreadSanitizer-x86_64 :: mutex_bad_unlock.cpp (2567 of 3269) PASS: ThreadSanitizer-x86_64 :: mutex_destroy_locked.cpp (2568 of 3269) PASS: ThreadSanitizer-x86_64 :: mutex_destroy_locked2.cpp (2569 of 3269) PASS: ThreadSanitizer-x86_64 :: mutex_cycle2.c (2570 of 3269) PASS: ThreadSanitizer-x86_64 :: mutex_double_lock.cpp (2571 of 3269) PASS: ThreadSanitizer-x86_64 :: mutex_cycle_long.c (2572 of 3269) PASS: ThreadSanitizer-x86_64 :: mutexset1.cpp (2573 of 3269) PASS: ThreadSanitizer-x86_64 :: mutexset2.cpp (2574 of 3269) PASS: ThreadSanitizer-x86_64 :: mutex_lock_destroyed.cpp (2575 of 3269) PASS: ThreadSanitizer-x86_64 :: mutexset3.cpp (2576 of 3269) PASS: ThreadSanitizer-x86_64 :: mutexset4.cpp (2577 of 3269) PASS: ThreadSanitizer-x86_64 :: mutexset5.cpp (2578 of 3269) PASS: ThreadSanitizer-x86_64 :: mutexset6.cpp (2579 of 3269) PASS: ThreadSanitizer-x86_64 :: mutexset7.cpp (2580 of 3269) PASS: ThreadSanitizer-x86_64 :: mutexset8.cpp (2581 of 3269) PASS: ThreadSanitizer-x86_64 :: pie_test.cpp (2582 of 3269) PASS: ThreadSanitizer-x86_64 :: on_initialize_finalize_hooks.cpp (2583 of 3269) PASS: ThreadSanitizer-x86_64 :: printf-1.c (2584 of 3269) PASS: ThreadSanitizer-x86_64 :: pthread_atfork_deadlock.c (2585 of 3269) PASS: ThreadSanitizer-x86_64 :: pthread_atfork_deadlock2.c (2586 of 3269) UNSUPPORTED: ThreadSanitizer-x86_64 :: race_on_barrier.c (2587 of 3269) UNSUPPORTED: ThreadSanitizer-x86_64 :: race_on_barrier2.c (2588 of 3269) PASS: ThreadSanitizer-x86_64 :: pthread_key.cpp (2589 of 3269) PASS: ThreadSanitizer-x86_64 :: race_on_fputs.cpp (2590 of 3269) PASS: ThreadSanitizer-x86_64 :: pthread_atfork_deadlock3.c (2591 of 3269) PASS: ThreadSanitizer-x86_64 :: race_on_heap.cpp (2592 of 3269) PASS: ThreadSanitizer-x86_64 :: race_on_mutex.c (2593 of 3269) PASS: ThreadSanitizer-x86_64 :: race_on_mutex2.c (2594 of 3269) PASS: ThreadSanitizer-x86_64 :: race_on_puts.cpp (2595 of 3269) PASS: ThreadSanitizer-x86_64 :: race_on_speculative_load.cpp (2596 of 3269) PASS: ThreadSanitizer-x86_64 :: race_on_read.cpp (2597 of 3269) PASS: ThreadSanitizer-x86_64 :: race_on_write.cpp (2598 of 3269) PASS: ThreadSanitizer-x86_64 :: race_range_pc.cpp (2599 of 3269) PASS: ThreadSanitizer-x86_64 :: race_stress.cpp (2600 of 3269) PASS: ThreadSanitizer-x86_64 :: race_top_suppression.cpp (2601 of 3269) PASS: ThreadSanitizer-x86_64 :: race_top_suppression1.cpp (2602 of 3269) PASS: ThreadSanitizer-x86_64 :: real_deadlock_detector_stress_test.cpp (2603 of 3269) PASS: ThreadSanitizer-x86_64 :: race_with_finished_thread.cpp (2604 of 3269) PASS: ThreadSanitizer-x86_64 :: setuid.c (2605 of 3269) PASS: ThreadSanitizer-x86_64 :: signal_block.cpp (2606 of 3269) UNSUPPORTED: ThreadSanitizer-x86_64 :: signal_block2.cpp (2607 of 3269) PASS: ThreadSanitizer-x86_64 :: setuid2.c (2608 of 3269) PASS: ThreadSanitizer-x86_64 :: signal_cond.cpp (2609 of 3269) PASS: ThreadSanitizer-x86_64 :: signal_exit.cpp (2610 of 3269) PASS: ThreadSanitizer-x86_64 :: signal_errno.cpp (2611 of 3269) PASS: ThreadSanitizer-x86_64 :: signal_longjmp.cpp (2612 of 3269) PASS: ThreadSanitizer-x86_64 :: restore_stack.cpp (2613 of 3269) UNSUPPORTED: ThreadSanitizer-x86_64 :: signal_recursive.cpp (2614 of 3269) UNSUPPORTED: ThreadSanitizer-x86_64 :: signal_reset.cpp (2615 of 3269) UNSUPPORTED: ThreadSanitizer-x86_64 :: signal_sync.cpp (2616 of 3269) UNSUPPORTED: ThreadSanitizer-x86_64 :: signal_sync2.cpp (2617 of 3269) UNSUPPORTED: ThreadSanitizer-x86_64 :: signal_thread.cpp (2618 of 3269) PASS: ThreadSanitizer-x86_64 :: signal_pause.cpp (2619 of 3269) PASS: ThreadSanitizer-x86_64 :: signal_malloc.cpp (2620 of 3269) PASS: ThreadSanitizer-x86_64 :: sigsuspend.cpp (2621 of 3269) PASS: ThreadSanitizer-x86_64 :: signal_write.cpp (2622 of 3269) PASS: ThreadSanitizer-x86_64 :: simple_race.c (2623 of 3269) PASS: ThreadSanitizer-x86_64 :: simple_race.cpp (2624 of 3269) PASS: ThreadSanitizer-x86_64 :: simple_stack2.cpp (2625 of 3269) PASS: ThreadSanitizer-x86_64 :: sleep_sync.cpp (2626 of 3269) PASS: ThreadSanitizer-x86_64 :: simple_stack.c (2627 of 3269) PASS: ThreadSanitizer-x86_64 :: sleep_sync2.cpp (2628 of 3269) PASS: ThreadSanitizer-x86_64 :: stack_race.cpp (2629 of 3269) PASS: ThreadSanitizer-x86_64 :: stack_sync_reuse.cpp (2630 of 3269) PASS: ThreadSanitizer-x86_64 :: stack_race2.cpp (2631 of 3269) PASS: ThreadSanitizer-x86_64 :: static_init1.cpp (2632 of 3269) PASS: ThreadSanitizer-x86_64 :: static_init2.cpp (2633 of 3269) PASS: ThreadSanitizer-x86_64 :: static_init4.cpp (2634 of 3269) PASS: ThreadSanitizer-x86_64 :: static_init3.cpp (2635 of 3269) UNSUPPORTED: ThreadSanitizer-x86_64 :: strerror_r.cpp (2636 of 3269) PASS: ThreadSanitizer-x86_64 :: static_init5.cpp (2637 of 3269) UNSUPPORTED: ThreadSanitizer-x86_64 :: sunrpc.cpp (2638 of 3269) PASS: ThreadSanitizer-x86_64 :: static_init6.cpp (2639 of 3269) PASS: ThreadSanitizer-x86_64 :: suppress_same_address.cpp (2640 of 3269) PASS: ThreadSanitizer-x86_64 :: suppress_same_stacks.cpp (2641 of 3269) PASS: ThreadSanitizer-x86_64 :: suppressions_global.cpp (2642 of 3269) PASS: ThreadSanitizer-x86_64 :: suppressions_mutex.cpp (2643 of 3269) PASS: ThreadSanitizer-x86_64 :: stress.cpp (2644 of 3269) PASS: ThreadSanitizer-x86_64 :: suppressions_race.cpp (2645 of 3269) PASS: ThreadSanitizer-x86_64 :: suppressions_race2.cpp (2646 of 3269) PASS: ThreadSanitizer-x86_64 :: thread_detach.c (2647 of 3269) PASS: ThreadSanitizer-x86_64 :: thread_detach2.c (2648 of 3269) PASS: ThreadSanitizer-x86_64 :: thread_end_with_ignore.cpp (2649 of 3269) PASS: ThreadSanitizer-x86_64 :: thread_end_with_ignore2.cpp (2650 of 3269) PASS: ThreadSanitizer-x86_64 :: thread_end_with_ignore3.cpp (2651 of 3269) PASS: ThreadSanitizer-x86_64 :: thread_exit.c (2652 of 3269) PASS: ThreadSanitizer-x86_64 :: thread_leak.c (2653 of 3269) PASS: ThreadSanitizer-x86_64 :: thread_leak2.c (2654 of 3269) PASS: ThreadSanitizer-x86_64 :: thread_leak4.c (2655 of 3269) PASS: ThreadSanitizer-x86_64 :: thread_name.cpp (2656 of 3269) UNSUPPORTED: ThreadSanitizer-x86_64 :: thread_name2.cpp (2657 of 3269) PASS: ThreadSanitizer-x86_64 :: thread_leak3.c (2658 of 3269) PASS: ThreadSanitizer-x86_64 :: thread_leak5.c (2659 of 3269) PASS: ThreadSanitizer-x86_64 :: tiny_race.c (2660 of 3269) PASS: ThreadSanitizer-x86_64 :: tls_race.cpp (2661 of 3269) PASS: ThreadSanitizer-x86_64 :: tls_race2.cpp (2662 of 3269) PASS: ThreadSanitizer-x86_64 :: unaligned_norace.cpp (2663 of 3269) PASS: ThreadSanitizer-x86_64 :: vfork.cpp (2664 of 3269) PASS: ThreadSanitizer-x86_64 :: tsan-vs-gvn.cpp (2665 of 3269) PASS: ThreadSanitizer-x86_64 :: unaligned_race.cpp (2666 of 3269) PASS: ThreadSanitizer-x86_64 :: virtual_inheritance_compile_bug.cpp (2667 of 3269) PASS: ThreadSanitizer-x86_64 :: vptr_benign_race.cpp (2668 of 3269) PASS: ThreadSanitizer-x86_64 :: vptr_harmful_race.cpp (2669 of 3269) PASS: ThreadSanitizer-x86_64 :: vptr_harmful_race2.cpp (2670 of 3269) PASS: ThreadSanitizer-x86_64 :: vptr_harmful_race3.cpp (2671 of 3269) PASS: UBSan-AddressSanitizer-x86_64 :: TestCases/Float/cast-overflow.cpp (2672 of 3269) PASS: ThreadSanitizer-x86_64 :: vptr_harmful_race4.cpp (2673 of 3269) PASS: ThreadSanitizer-x86_64 :: write_in_reader_lock.cpp (2674 of 3269) PASS: UBSan-AddressSanitizer-x86_64 :: TestCases/ImplicitConversion/integer-conversion-incdec.c (2675 of 3269) PASS: UBSan-AddressSanitizer-x86_64 :: TestCases/ImplicitConversion/integer-sign-change-ignorelist.c (2676 of 3269) PASS: UBSan-AddressSanitizer-x86_64 :: TestCases/ImplicitConversion/integer-arithmetic-value-change.c (2677 of 3269) PASS: UBSan-AddressSanitizer-x86_64 :: TestCases/ImplicitConversion/integer-conversion.c (2678 of 3269) PASS: UBSan-AddressSanitizer-x86_64 :: TestCases/ImplicitConversion/integer-sign-change-summary.cpp (2679 of 3269) PASS: UBSan-AddressSanitizer-x86_64 :: TestCases/ImplicitConversion/integer-sign-change-incdec.c (2680 of 3269) PASS: UBSan-AddressSanitizer-x86_64 :: TestCases/ImplicitConversion/integer-sign-change.c (2681 of 3269) PASS: UBSan-AddressSanitizer-x86_64 :: TestCases/ImplicitConversion/integer-truncation.c (2682 of 3269) PASS: UBSan-AddressSanitizer-x86_64 :: TestCases/ImplicitConversion/signed-integer-truncation-incdec.c (2683 of 3269) PASS: UBSan-AddressSanitizer-x86_64 :: TestCases/ImplicitConversion/signed-integer-truncation-or-sign-change-summary.cpp (2684 of 3269) PASS: UBSan-AddressSanitizer-x86_64 :: TestCases/ImplicitConversion/signed-integer-truncation-summary.cpp (2685 of 3269) PASS: UBSan-AddressSanitizer-x86_64 :: TestCases/ImplicitConversion/signed-integer-truncation-ignorelist.c (2686 of 3269) PASS: UBSan-AddressSanitizer-x86_64 :: TestCases/ImplicitConversion/signed-integer-truncation-or-sign-change-ignorelist.c (2687 of 3269) PASS: UBSan-AddressSanitizer-x86_64 :: TestCases/ImplicitConversion/unsigned-integer-truncation-summary.cpp (2688 of 3269) PASS: UBSan-AddressSanitizer-x86_64 :: TestCases/ImplicitConversion/signed-integer-truncation.c (2689 of 3269) PASS: UBSan-AddressSanitizer-x86_64 :: TestCases/Integer/add-overflow.cpp (2690 of 3269) PASS: UBSan-AddressSanitizer-x86_64 :: TestCases/Integer/div-overflow.cpp (2691 of 3269) PASS: UBSan-AddressSanitizer-x86_64 :: TestCases/Integer/div-zero.cpp (2692 of 3269) PASS: UBSan-AddressSanitizer-x86_64 :: TestCases/ImplicitConversion/unsigned-integer-truncation-ignorelist.c (2693 of 3269) PASS: UBSan-AddressSanitizer-x86_64 :: TestCases/Integer/incdec-overflow.cpp (2694 of 3269) PASS: UBSan-AddressSanitizer-x86_64 :: TestCases/Integer/mul-overflow.cpp (2695 of 3269) PASS: UBSan-AddressSanitizer-x86_64 :: TestCases/ImplicitConversion/unsigned-integer-truncation.c (2696 of 3269) PASS: UBSan-AddressSanitizer-x86_64 :: TestCases/Integer/negate-overflow.cpp (2697 of 3269) PASS: UBSan-AddressSanitizer-x86_64 :: TestCases/Integer/no-recover.cpp (2698 of 3269) PASS: UBSan-AddressSanitizer-x86_64 :: TestCases/Integer/summary.cpp (2699 of 3269) PASS: UBSan-AddressSanitizer-x86_64 :: TestCases/Integer/sub-overflow.cpp (2700 of 3269) PASS: UBSan-AddressSanitizer-x86_64 :: TestCases/Integer/uadd-overflow.cpp (2701 of 3269) PASS: UBSan-AddressSanitizer-x86_64 :: TestCases/Integer/suppressions.cpp (2702 of 3269) PASS: UBSan-AddressSanitizer-x86_64 :: TestCases/Integer/umul-overflow.cpp (2703 of 3269) PASS: UBSan-AddressSanitizer-x86_64 :: TestCases/Integer/uincdec-overflow.cpp (2704 of 3269) UNSUPPORTED: UBSan-AddressSanitizer-x86_64 :: TestCases/Misc/Linux/print_stack_trace.cpp (2705 of 3269) PASS: UBSan-AddressSanitizer-x86_64 :: TestCases/Integer/unsigned-shift.cpp (2706 of 3269) UNSUPPORTED: UBSan-AddressSanitizer-x86_64 :: TestCases/Misc/Linux/static-link.cpp (2707 of 3269) UNSUPPORTED: UBSan-AddressSanitizer-x86_64 :: TestCases/Misc/Linux/ubsan_options.cpp (2708 of 3269) PASS: UBSan-AddressSanitizer-x86_64 :: TestCases/Misc/bool.cpp (2709 of 3269) PASS: UBSan-AddressSanitizer-x86_64 :: TestCases/Integer/usub-overflow.cpp (2710 of 3269) PASS: UBSan-AddressSanitizer-x86_64 :: TestCases/Misc/bool.m (2711 of 3269) PASS: UBSan-AddressSanitizer-x86_64 :: TestCases/Integer/shift.cpp (2712 of 3269) PASS: UBSan-AddressSanitizer-x86_64 :: TestCases/Misc/bounds.cpp (2713 of 3269) PASS: UBSan-AddressSanitizer-x86_64 :: TestCases/Misc/builtins.cpp (2714 of 3269) PASS: UBSan-AddressSanitizer-x86_64 :: TestCases/Misc/deduplication.cpp (2715 of 3269) PASS: UBSan-AddressSanitizer-x86_64 :: TestCases/Misc/log-path_test.cpp (2716 of 3269) PASS: UBSan-AddressSanitizer-x86_64 :: TestCases/Misc/enum.cpp (2717 of 3269) PASS: UBSan-AddressSanitizer-x86_64 :: TestCases/Misc/monitor.cpp (2718 of 3269) UNSUPPORTED: UBSan-AddressSanitizer-x86_64 :: TestCases/Misc/no-interception.cpp (2719 of 3269) PASS: UBSan-AddressSanitizer-x86_64 :: TestCases/Misc/coverage-levels.cpp (2720 of 3269) PASS: UBSan-AddressSanitizer-x86_64 :: TestCases/Misc/missing_return.cpp (2721 of 3269) PASS: UBSan-AddressSanitizer-x86_64 :: TestCases/Misc/nonnull.cpp (2722 of 3269) PASS: UBSan-AddressSanitizer-x86_64 :: TestCases/Misc/nullability.c (2723 of 3269) PASS: UBSan-AddressSanitizer-x86_64 :: TestCases/Misc/nonnull-arg.cpp (2724 of 3269) PASS: UBSan-AddressSanitizer-x86_64 :: TestCases/Misc/print_summary.c (2725 of 3269) PASS: UBSan-AddressSanitizer-x86_64 :: TestCases/Misc/unreachable.cpp (2726 of 3269) PASS: UBSan-AddressSanitizer-x86_64 :: TestCases/Misc/vla.c (2727 of 3269) PASS: UBSan-AddressSanitizer-x86_64 :: TestCases/Misc/objc-cast.m (2728 of 3269) PASS: UBSan-AddressSanitizer-x86_64 :: TestCases/Pointer/alignment-assumption-attribute-align_value-on-lvalue.cpp (2729 of 3269) PASS: UBSan-AddressSanitizer-x86_64 :: TestCases/Pointer/alignment-assumption-attribute-align_value-on-paramvar.cpp (2730 of 3269) PASS: UBSan-AddressSanitizer-x86_64 :: TestCases/Pointer/alignment-assumption-attribute-alloc_align-on-function-variable.cpp (2731 of 3269) PASS: UBSan-AddressSanitizer-x86_64 :: TestCases/Pointer/alignment-assumption-attribute-alloc_align-on-function.cpp (2732 of 3269) PASS: UBSan-AddressSanitizer-x86_64 :: TestCases/Pointer/alignment-assumption-attribute-assume_aligned-on-function-two-params.cpp (2733 of 3269) PASS: UBSan-AddressSanitizer-x86_64 :: TestCases/Pointer/alignment-assumption-attribute-assume_aligned-on-function.cpp (2734 of 3269) PASS: UBSan-AddressSanitizer-x86_64 :: TestCases/Pointer/alignment-assumption-builtin_assume_aligned-three-params-variable.cpp (2735 of 3269) PASS: UBSan-AddressSanitizer-x86_64 :: TestCases/Pointer/alignment-assumption-builtin_assume_aligned-three-params.cpp (2736 of 3269) PASS: UBSan-AddressSanitizer-x86_64 :: TestCases/Pointer/alignment-assumption-summary.cpp (2737 of 3269) PASS: UBSan-AddressSanitizer-x86_64 :: TestCases/Pointer/index-overflow.cpp (2738 of 3269) PASS: UBSan-AddressSanitizer-x86_64 :: TestCases/Pointer/alignment-assumption-builtin_assume_aligned-two-params.cpp (2739 of 3269) PASS: UBSan-AddressSanitizer-x86_64 :: TestCases/Pointer/alignment-assumption-openmp.cpp (2740 of 3269) PASS: UBSan-AddressSanitizer-x86_64 :: TestCases/Pointer/nullptr-and-nonzero-offset-summary.cpp (2741 of 3269) PASS: UBSan-AddressSanitizer-x86_64 :: TestCases/Pointer/unsigned-index-expression.cpp (2742 of 3269) PASS: UBSan-Minimal-x86_64 :: TestCases/implicit-integer-sign-change.c (2743 of 3269) PASS: UBSan-Minimal-x86_64 :: TestCases/alignment-assumption.c (2744 of 3269) PASS: UBSan-Minimal-x86_64 :: TestCases/implicit-signed-integer-truncation-or-sign-change.c (2745 of 3269) PASS: UBSan-Minimal-x86_64 :: TestCases/implicit-unsigned-integer-truncation.c (2746 of 3269) PASS: UBSan-Minimal-x86_64 :: TestCases/implicit-signed-integer-truncation.c (2747 of 3269) PASS: UBSan-Minimal-x86_64 :: TestCases/recover-dedup-limit.cpp (2748 of 3269) PASS: UBSan-Minimal-x86_64 :: TestCases/test-darwin-interface.c (2749 of 3269) PASS: UBSan-Minimal-x86_64 :: TestCases/recover-dedup.cpp (2750 of 3269) PASS: UBSan-Minimal-x86_64 :: TestCases/nullptr-and-nonzero-offset.c (2751 of 3269) PASS: UBSan-Standalone-x86_64 :: TestCases/Float/cast-overflow.cpp (2752 of 3269) UNSUPPORTED: UBSan-AddressSanitizer-x86_64 :: TestCases/TypeCheck/Linux/PR33221.cpp (2753 of 3269) PASS: UBSan-AddressSanitizer-x86_64 :: TestCases/Pointer/nullptr-and-nonzero-offset-constants.cpp (2754 of 3269) PASS: UBSan-Minimal-x86_64 :: TestCases/uadd-overflow.cpp (2755 of 3269) PASS: UBSan-AddressSanitizer-x86_64 :: TestCases/TypeCheck/PR33221.cpp (2756 of 3269) UNSUPPORTED: UBSan-Standalone-x86_64 :: TestCases/ImplicitConversion/integer-sign-change-summary.cpp (2757 of 3269) PASS: UBSan-AddressSanitizer-x86_64 :: TestCases/TypeCheck/Function/function.cpp (2758 of 3269) PASS: UBSan-AddressSanitizer-x86_64 :: TestCases/TypeCheck/null.cpp (2759 of 3269) PASS: UBSan-AddressSanitizer-x86_64 :: TestCases/TypeCheck/vptr-corrupted-vtable-itanium.cpp (2760 of 3269) PASS: UBSan-AddressSanitizer-x86_64 :: TestCases/TypeCheck/misaligned.cpp (2761 of 3269) UNSUPPORTED: UBSan-AddressSanitizer-x86_64 :: TestCases/TypeCheck/vptr-ptrauth-unauthenticated.cpp (2762 of 3269) UNSUPPORTED: UBSan-Standalone-x86_64 :: TestCases/ImplicitConversion/signed-integer-truncation-or-sign-change-summary.cpp (2763 of 3269) UNSUPPORTED: UBSan-Standalone-x86_64 :: TestCases/ImplicitConversion/signed-integer-truncation-summary.cpp (2764 of 3269) PASS: UBSan-Standalone-x86_64 :: TestCases/ImplicitConversion/integer-conversion-incdec.c (2765 of 3269) PASS: UBSan-AddressSanitizer-x86_64 :: TestCases/TypeCheck/vptr-virtual-base-construction.cpp (2766 of 3269) UNSUPPORTED: UBSan-Standalone-x86_64 :: TestCases/ImplicitConversion/unsigned-integer-truncation-summary.cpp (2767 of 3269) PASS: UBSan-AddressSanitizer-x86_64 :: TestCases/TypeCheck/vptr-non-unique-typeinfo.cpp (2768 of 3269) PASS: UBSan-Standalone-x86_64 :: TestCases/ImplicitConversion/integer-sign-change-ignorelist.c (2769 of 3269) PASS: UBSan-Standalone-x86_64 :: TestCases/ImplicitConversion/integer-sign-change-incdec.c (2770 of 3269) PASS: UBSan-AddressSanitizer-x86_64 :: TestCases/TypeCheck/vptr-virtual-base.cpp (2771 of 3269) PASS: UBSan-Standalone-x86_64 :: TestCases/Integer/div-overflow.cpp (2772 of 3269) PASS: UBSan-Standalone-x86_64 :: TestCases/Integer/mul-overflow.cpp (2773 of 3269) PASS: UBSan-Standalone-x86_64 :: TestCases/Integer/add-overflow.cpp (2774 of 3269) PASS: UBSan-AddressSanitizer-x86_64 :: TestCases/Pointer/nullptr-and-nonzero-offset-variable.cpp (2775 of 3269) PASS: UBSan-Standalone-x86_64 :: TestCases/Integer/div-zero.cpp (2776 of 3269) PASS: UBSan-Standalone-x86_64 :: TestCases/Integer/incdec-overflow.cpp (2777 of 3269) UNSUPPORTED: UBSan-Standalone-x86_64 :: TestCases/Integer/summary.cpp (2778 of 3269) PASS: UBSan-Standalone-x86_64 :: TestCases/Integer/negate-overflow.cpp (2779 of 3269) PASS: UBSan-Standalone-x86_64 :: TestCases/ImplicitConversion/signed-integer-truncation-incdec.c (2780 of 3269) PASS: UBSan-Standalone-x86_64 :: TestCases/Integer/no-recover.cpp (2781 of 3269) PASS: UBSan-Standalone-x86_64 :: TestCases/Integer/umul-overflow.cpp (2782 of 3269) PASS: UBSan-Standalone-x86_64 :: TestCases/ImplicitConversion/integer-sign-change.c (2783 of 3269) PASS: UBSan-Standalone-x86_64 :: TestCases/Integer/sub-overflow.cpp (2784 of 3269) UNSUPPORTED: UBSan-Standalone-x86_64 :: TestCases/Misc/Linux/print_stack_trace.cpp (2785 of 3269) UNSUPPORTED: UBSan-Standalone-x86_64 :: TestCases/Misc/Linux/static-link.cpp (2786 of 3269) UNSUPPORTED: UBSan-Standalone-x86_64 :: TestCases/Misc/Linux/ubsan_options.cpp (2787 of 3269) PASS: UBSan-Standalone-x86_64 :: TestCases/Integer/suppressions.cpp (2788 of 3269) PASS: UBSan-Standalone-x86_64 :: TestCases/ImplicitConversion/integer-arithmetic-value-change.c (2789 of 3269) PASS: UBSan-Standalone-x86_64 :: TestCases/Integer/uadd-overflow.cpp (2790 of 3269) PASS: UBSan-Standalone-x86_64 :: TestCases/ImplicitConversion/integer-conversion.c (2791 of 3269) PASS: UBSan-AddressSanitizer-x86_64 :: TestCases/TypeCheck/vptr.cpp (2792 of 3269) PASS: UBSan-Standalone-x86_64 :: TestCases/Misc/bool.cpp (2793 of 3269) PASS: UBSan-Standalone-x86_64 :: TestCases/Misc/bool.m (2794 of 3269) PASS: UBSan-Standalone-x86_64 :: TestCases/Misc/bounds.cpp (2795 of 3269) PASS: UBSan-Standalone-x86_64 :: TestCases/Integer/unsigned-shift.cpp (2796 of 3269) PASS: UBSan-Standalone-x86_64 :: TestCases/Misc/deduplication.cpp (2797 of 3269) UNSUPPORTED: UBSan-Standalone-x86_64 :: TestCases/Misc/no-interception.cpp (2798 of 3269) PASS: UBSan-Standalone-x86_64 :: TestCases/Misc/log-path_test.cpp (2799 of 3269) PASS: UBSan-Standalone-x86_64 :: TestCases/ImplicitConversion/integer-truncation.c (2800 of 3269) PASS: UBSan-Standalone-x86_64 :: TestCases/Integer/uincdec-overflow.cpp (2801 of 3269) PASS: UBSan-Standalone-x86_64 :: TestCases/Misc/monitor.cpp (2802 of 3269) PASS: UBSan-Standalone-x86_64 :: TestCases/Misc/builtins.cpp (2803 of 3269) PASS: UBSan-Standalone-x86_64 :: TestCases/Misc/missing_return.cpp (2804 of 3269) PASS: UBSan-Standalone-x86_64 :: TestCases/Integer/usub-overflow.cpp (2805 of 3269) PASS: UBSan-Standalone-x86_64 :: TestCases/Misc/nonnull-arg.cpp (2806 of 3269) PASS: UBSan-Standalone-x86_64 :: TestCases/Misc/nullability.c (2807 of 3269) PASS: UBSan-Standalone-x86_64 :: TestCases/Misc/print_summary.c (2808 of 3269) PASS: UBSan-Standalone-x86_64 :: TestCases/Misc/unreachable.cpp (2809 of 3269) PASS: UBSan-Standalone-x86_64 :: TestCases/Misc/vla.c (2810 of 3269) PASS: UBSan-Standalone-x86_64 :: TestCases/Misc/enum.cpp (2811 of 3269) PASS: UBSan-Standalone-x86_64 :: TestCases/Misc/nonnull.cpp (2812 of 3269) PASS: UBSan-Standalone-x86_64 :: TestCases/Misc/objc-cast.m (2813 of 3269) PASS: UBSan-Standalone-x86_64 :: TestCases/Misc/coverage-levels.cpp (2814 of 3269) PASS: UBSan-Standalone-x86_64 :: TestCases/ImplicitConversion/signed-integer-truncation.c (2815 of 3269) UNSUPPORTED: UBSan-Standalone-x86_64 :: TestCases/Pointer/alignment-assumption-summary.cpp (2816 of 3269) PASS: UBSan-Standalone-x86_64 :: TestCases/ImplicitConversion/unsigned-integer-truncation.c (2817 of 3269) PASS: UBSan-Standalone-x86_64 :: TestCases/Pointer/index-overflow.cpp (2818 of 3269) UNSUPPORTED: UBSan-Standalone-x86_64 :: TestCases/Pointer/nullptr-and-nonzero-offset-summary.cpp (2819 of 3269) PASS: UBSan-Standalone-x86_64 :: TestCases/Pointer/alignment-assumption-attribute-align_value-on-lvalue.cpp (2820 of 3269) PASS: UBSan-Standalone-x86_64 :: TestCases/Pointer/alignment-assumption-attribute-align_value-on-paramvar.cpp (2821 of 3269) PASS: UBSan-Standalone-x86_64 :: TestCases/Pointer/alignment-assumption-attribute-alloc_align-on-function-variable.cpp (2822 of 3269) UNSUPPORTED: UBSan-Standalone-x86_64 :: TestCases/TypeCheck/Linux/PR33221.cpp (2823 of 3269) PASS: UBSan-Standalone-x86_64 :: TestCases/ImplicitConversion/signed-integer-truncation-or-sign-change-ignorelist.c (2824 of 3269) PASS: UBSan-Standalone-x86_64 :: TestCases/Pointer/alignment-assumption-attribute-alloc_align-on-function.cpp (2825 of 3269) PASS: UBSan-Standalone-x86_64 :: TestCases/Pointer/alignment-assumption-attribute-assume_aligned-on-function-two-params.cpp (2826 of 3269) PASS: UBSan-Standalone-x86_64 :: TestCases/Pointer/alignment-assumption-attribute-assume_aligned-on-function.cpp (2827 of 3269) PASS: UBSan-Standalone-x86_64 :: TestCases/Pointer/unsigned-index-expression.cpp (2828 of 3269) UNSUPPORTED: UBSan-Standalone-x86_64 :: TestCases/TypeCheck/vptr-ptrauth-unauthenticated.cpp (2829 of 3269) PASS: UBSan-Standalone-x86_64 :: TestCases/Integer/shift.cpp (2830 of 3269) PASS: UBSan-Standalone-x86_64 :: TestCases/Pointer/alignment-assumption-builtin_assume_aligned-three-params-variable.cpp (2831 of 3269) PASS: UBSan-Standalone-x86_64 :: TestCases/Pointer/alignment-assumption-builtin_assume_aligned-three-params.cpp (2832 of 3269) PASS: UBSan-Standalone-x86_64 :: TestCases/TypeCheck/PR33221.cpp (2833 of 3269) PASS: UBSan-Standalone-x86_64 :: TestCases/TypeCheck/null.cpp (2834 of 3269) PASS: UBSan-Standalone-x86_64 :: TestCases/TypeCheck/vptr-corrupted-vtable-itanium.cpp (2835 of 3269) PASS: UBSan-Standalone-x86_64 :: TestCases/TypeCheck/vptr-virtual-base-construction.cpp (2836 of 3269) PASS: UBSan-Standalone-x86_64 :: TestCases/TypeCheck/vptr-virtual-base.cpp (2837 of 3269) PASS: UBSan-Standalone-x86_64 :: TestCases/ImplicitConversion/signed-integer-truncation-ignorelist.c (2838 of 3269) UNSUPPORTED: UBSan-StandaloneStatic-x86_64 :: TestCases/ImplicitConversion/integer-sign-change-summary.cpp (2839 of 3269) PASS: UBSan-StandaloneStatic-x86_64 :: TestCases/Float/cast-overflow.cpp (2840 of 3269) PASS: UBSan-Standalone-x86_64 :: TestCases/TypeCheck/vptr-non-unique-typeinfo.cpp (2841 of 3269) PASS: UBSan-Standalone-x86_64 :: TestCases/Pointer/alignment-assumption-builtin_assume_aligned-two-params.cpp (2842 of 3269) PASS: UBSan-Standalone-x86_64 :: TestCases/TypeCheck/misaligned.cpp (2843 of 3269) PASS: UBSan-Standalone-x86_64 :: TestCases/Pointer/alignment-assumption-openmp.cpp (2844 of 3269) UNSUPPORTED: UBSan-StandaloneStatic-x86_64 :: TestCases/ImplicitConversion/signed-integer-truncation-or-sign-change-summary.cpp (2845 of 3269) UNSUPPORTED: UBSan-StandaloneStatic-x86_64 :: TestCases/ImplicitConversion/signed-integer-truncation-summary.cpp (2846 of 3269) PASS: UBSan-Standalone-x86_64 :: TestCases/TypeCheck/Function/function.cpp (2847 of 3269) PASS: UBSan-Standalone-x86_64 :: TestCases/ImplicitConversion/unsigned-integer-truncation-ignorelist.c (2848 of 3269) UNSUPPORTED: UBSan-StandaloneStatic-x86_64 :: TestCases/ImplicitConversion/unsigned-integer-truncation-summary.cpp (2849 of 3269) PASS: UBSan-Standalone-x86_64 :: TestCases/Pointer/nullptr-and-nonzero-offset-constants.cpp (2850 of 3269) PASS: UBSan-Standalone-x86_64 :: TestCases/TypeCheck/vptr.cpp (2851 of 3269) PASS: UBSan-StandaloneStatic-x86_64 :: TestCases/Integer/add-overflow.cpp (2852 of 3269) PASS: UBSan-StandaloneStatic-x86_64 :: TestCases/Integer/div-overflow.cpp (2853 of 3269) PASS: UBSan-StandaloneStatic-x86_64 :: TestCases/ImplicitConversion/integer-conversion-incdec.c (2854 of 3269) PASS: UBSan-StandaloneStatic-x86_64 :: TestCases/ImplicitConversion/integer-sign-change-ignorelist.c (2855 of 3269) PASS: UBSan-StandaloneStatic-x86_64 :: TestCases/ImplicitConversion/integer-sign-change-incdec.c (2856 of 3269) PASS: UBSan-StandaloneStatic-x86_64 :: TestCases/Integer/mul-overflow.cpp (2857 of 3269) PASS: UBSan-StandaloneStatic-x86_64 :: TestCases/ImplicitConversion/signed-integer-truncation-incdec.c (2858 of 3269) PASS: UBSan-StandaloneStatic-x86_64 :: TestCases/Integer/div-zero.cpp (2859 of 3269) UNSUPPORTED: UBSan-StandaloneStatic-x86_64 :: TestCases/Integer/summary.cpp (2860 of 3269) PASS: UBSan-StandaloneStatic-x86_64 :: TestCases/Integer/incdec-overflow.cpp (2861 of 3269) PASS: UBSan-StandaloneStatic-x86_64 :: TestCases/Integer/negate-overflow.cpp (2862 of 3269) PASS: UBSan-StandaloneStatic-x86_64 :: TestCases/Integer/no-recover.cpp (2863 of 3269) PASS: UBSan-Standalone-x86_64 :: TestCases/Pointer/nullptr-and-nonzero-offset-variable.cpp (2864 of 3269) PASS: UBSan-StandaloneStatic-x86_64 :: TestCases/Integer/sub-overflow.cpp (2865 of 3269) PASS: UBSan-StandaloneStatic-x86_64 :: TestCases/Integer/umul-overflow.cpp (2866 of 3269) UNSUPPORTED: UBSan-StandaloneStatic-x86_64 :: TestCases/Misc/Linux/print_stack_trace.cpp (2867 of 3269) UNSUPPORTED: UBSan-StandaloneStatic-x86_64 :: TestCases/Misc/Linux/static-link.cpp (2868 of 3269) UNSUPPORTED: UBSan-StandaloneStatic-x86_64 :: TestCases/Misc/Linux/ubsan_options.cpp (2869 of 3269) PASS: UBSan-StandaloneStatic-x86_64 :: TestCases/Misc/bool.cpp (2870 of 3269) PASS: UBSan-StandaloneStatic-x86_64 :: TestCases/Integer/unsigned-shift.cpp (2871 of 3269) PASS: UBSan-StandaloneStatic-x86_64 :: TestCases/Integer/suppressions.cpp (2872 of 3269) PASS: UBSan-StandaloneStatic-x86_64 :: TestCases/Integer/uadd-overflow.cpp (2873 of 3269) UNSUPPORTED: UBSan-StandaloneStatic-x86_64 :: TestCases/Misc/coverage-levels.cpp (2874 of 3269) PASS: UBSan-StandaloneStatic-x86_64 :: TestCases/Misc/bool.m (2875 of 3269) PASS: UBSan-StandaloneStatic-x86_64 :: TestCases/Misc/bounds.cpp (2876 of 3269) PASS: UBSan-StandaloneStatic-x86_64 :: TestCases/ImplicitConversion/integer-sign-change.c (2877 of 3269) PASS: UBSan-StandaloneStatic-x86_64 :: TestCases/Misc/deduplication.cpp (2878 of 3269) PASS: UBSan-StandaloneStatic-x86_64 :: TestCases/Integer/uincdec-overflow.cpp (2879 of 3269) UNSUPPORTED: UBSan-StandaloneStatic-x86_64 :: TestCases/Misc/no-interception.cpp (2880 of 3269) PASS: UBSan-StandaloneStatic-x86_64 :: TestCases/Integer/usub-overflow.cpp (2881 of 3269) PASS: UBSan-StandaloneStatic-x86_64 :: TestCases/Misc/log-path_test.cpp (2882 of 3269) PASS: UBSan-StandaloneStatic-x86_64 :: TestCases/Misc/builtins.cpp (2883 of 3269) PASS: UBSan-StandaloneStatic-x86_64 :: TestCases/ImplicitConversion/integer-arithmetic-value-change.c (2884 of 3269) PASS: UBSan-StandaloneStatic-x86_64 :: TestCases/Misc/monitor.cpp (2885 of 3269) PASS: UBSan-StandaloneStatic-x86_64 :: TestCases/Misc/missing_return.cpp (2886 of 3269) PASS: UBSan-StandaloneStatic-x86_64 :: TestCases/Misc/nonnull-arg.cpp (2887 of 3269) PASS: UBSan-StandaloneStatic-x86_64 :: TestCases/ImplicitConversion/integer-conversion.c (2888 of 3269) PASS: UBSan-StandaloneStatic-x86_64 :: TestCases/Misc/nullability.c (2889 of 3269) PASS: UBSan-StandaloneStatic-x86_64 :: TestCases/ImplicitConversion/integer-truncation.c (2890 of 3269) PASS: UBSan-StandaloneStatic-x86_64 :: TestCases/Misc/print_summary.c (2891 of 3269) PASS: UBSan-StandaloneStatic-x86_64 :: TestCases/Misc/unreachable.cpp (2892 of 3269) PASS: UBSan-StandaloneStatic-x86_64 :: TestCases/Misc/vla.c (2893 of 3269) PASS: UBSan-StandaloneStatic-x86_64 :: TestCases/Misc/nonnull.cpp (2894 of 3269) PASS: UBSan-StandaloneStatic-x86_64 :: TestCases/Misc/enum.cpp (2895 of 3269) PASS: UBSan-StandaloneStatic-x86_64 :: TestCases/ImplicitConversion/signed-integer-truncation.c (2896 of 3269) PASS: UBSan-StandaloneStatic-x86_64 :: TestCases/Misc/objc-cast.m (2897 of 3269) UNSUPPORTED: UBSan-StandaloneStatic-x86_64 :: TestCases/Pointer/alignment-assumption-summary.cpp (2898 of 3269) PASS: UBSan-StandaloneStatic-x86_64 :: TestCases/ImplicitConversion/unsigned-integer-truncation.c (2899 of 3269) PASS: UBSan-StandaloneStatic-x86_64 :: TestCases/Pointer/index-overflow.cpp (2900 of 3269) UNSUPPORTED: UBSan-StandaloneStatic-x86_64 :: TestCases/Pointer/nullptr-and-nonzero-offset-summary.cpp (2901 of 3269) PASS: UBSan-StandaloneStatic-x86_64 :: TestCases/ImplicitConversion/signed-integer-truncation-or-sign-change-ignorelist.c (2902 of 3269) PASS: UBSan-StandaloneStatic-x86_64 :: TestCases/Pointer/unsigned-index-expression.cpp (2903 of 3269) PASS: UBSan-StandaloneStatic-x86_64 :: TestCases/Pointer/alignment-assumption-attribute-align_value-on-lvalue.cpp (2904 of 3269) UNSUPPORTED: UBSan-StandaloneStatic-x86_64 :: TestCases/TypeCheck/Linux/PR33221.cpp (2905 of 3269) PASS: UBSan-StandaloneStatic-x86_64 :: TestCases/Pointer/alignment-assumption-attribute-align_value-on-paramvar.cpp (2906 of 3269) PASS: UBSan-StandaloneStatic-x86_64 :: TestCases/Pointer/alignment-assumption-attribute-alloc_align-on-function-variable.cpp (2907 of 3269) PASS: UBSan-StandaloneStatic-x86_64 :: TestCases/Pointer/alignment-assumption-attribute-alloc_align-on-function.cpp (2908 of 3269) PASS: UBSan-StandaloneStatic-x86_64 :: TestCases/Pointer/alignment-assumption-attribute-assume_aligned-on-function-two-params.cpp (2909 of 3269) PASS: UBSan-StandaloneStatic-x86_64 :: TestCases/Pointer/alignment-assumption-attribute-assume_aligned-on-function.cpp (2910 of 3269) UNSUPPORTED: UBSan-StandaloneStatic-x86_64 :: TestCases/TypeCheck/vptr-ptrauth-unauthenticated.cpp (2911 of 3269) PASS: UBSan-StandaloneStatic-x86_64 :: TestCases/Integer/shift.cpp (2912 of 3269) PASS: UBSan-StandaloneStatic-x86_64 :: TestCases/ImplicitConversion/signed-integer-truncation-ignorelist.c (2913 of 3269) PASS: UBSan-StandaloneStatic-x86_64 :: TestCases/Pointer/alignment-assumption-builtin_assume_aligned-three-params-variable.cpp (2914 of 3269) PASS: UBSan-StandaloneStatic-x86_64 :: TestCases/Pointer/alignment-assumption-builtin_assume_aligned-three-params.cpp (2915 of 3269) PASS: UBSan-StandaloneStatic-x86_64 :: TestCases/TypeCheck/PR33221.cpp (2916 of 3269) PASS: UBSan-StandaloneStatic-x86_64 :: TestCases/Pointer/alignment-assumption-builtin_assume_aligned-two-params.cpp (2917 of 3269) PASS: UBSan-StandaloneStatic-x86_64 :: TestCases/TypeCheck/null.cpp (2918 of 3269) PASS: UBSan-StandaloneStatic-x86_64 :: TestCases/TypeCheck/vptr-virtual-base-construction.cpp (2919 of 3269) PASS: UBSan-StandaloneStatic-x86_64 :: TestCases/TypeCheck/vptr-corrupted-vtable-itanium.cpp (2920 of 3269) PASS: UBSan-StandaloneStatic-x86_64 :: TestCases/TypeCheck/vptr-virtual-base.cpp (2921 of 3269) PASS: UBSan-StandaloneStatic-x86_64 :: TestCases/Pointer/alignment-assumption-openmp.cpp (2922 of 3269) PASS: UBSan-StandaloneStatic-x86_64 :: TestCases/ImplicitConversion/unsigned-integer-truncation-ignorelist.c (2923 of 3269) PASS: UBSan-StandaloneStatic-x86_64 :: TestCases/TypeCheck/vptr-non-unique-typeinfo.cpp (2924 of 3269) PASS: UBSan-StandaloneStatic-x86_64 :: TestCases/TypeCheck/Function/function.cpp (2925 of 3269) PASS: UBSan-StandaloneStatic-x86_64 :: TestCases/TypeCheck/misaligned.cpp (2926 of 3269) PASS: UBSan-StandaloneStatic-x86_64 :: TestCases/Pointer/nullptr-and-nonzero-offset-constants.cpp (2927 of 3269) PASS: UBSan-StandaloneStatic-x86_64 :: TestCases/Pointer/nullptr-and-nonzero-offset-variable.cpp (2928 of 3269) PASS: UBSan-StandaloneStatic-x86_64 :: TestCases/TypeCheck/vptr.cpp (2929 of 3269) PASS: UBSan-ThreadSanitizer-x86_64 :: TestCases/Float/cast-overflow.cpp (2930 of 3269) PASS: UBSan-ThreadSanitizer-x86_64 :: TestCases/ImplicitConversion/integer-conversion-incdec.c (2931 of 3269) PASS: UBSan-ThreadSanitizer-x86_64 :: TestCases/ImplicitConversion/integer-sign-change-ignorelist.c (2932 of 3269) PASS: UBSan-ThreadSanitizer-x86_64 :: TestCases/ImplicitConversion/integer-arithmetic-value-change.c (2933 of 3269) PASS: UBSan-ThreadSanitizer-x86_64 :: TestCases/ImplicitConversion/integer-sign-change-summary.cpp (2934 of 3269) PASS: UBSan-ThreadSanitizer-x86_64 :: TestCases/ImplicitConversion/integer-conversion.c (2935 of 3269) PASS: UBSan-ThreadSanitizer-x86_64 :: TestCases/ImplicitConversion/integer-sign-change-incdec.c (2936 of 3269) PASS: UBSan-ThreadSanitizer-x86_64 :: TestCases/ImplicitConversion/integer-sign-change.c (2937 of 3269) PASS: UBSan-ThreadSanitizer-x86_64 :: TestCases/ImplicitConversion/integer-truncation.c (2938 of 3269) PASS: UBSan-ThreadSanitizer-x86_64 :: TestCases/ImplicitConversion/signed-integer-truncation-incdec.c (2939 of 3269) PASS: UBSan-ThreadSanitizer-x86_64 :: TestCases/ImplicitConversion/signed-integer-truncation-or-sign-change-summary.cpp (2940 of 3269) PASS: UBSan-ThreadSanitizer-x86_64 :: TestCases/ImplicitConversion/signed-integer-truncation-summary.cpp (2941 of 3269) PASS: UBSan-ThreadSanitizer-x86_64 :: TestCases/ImplicitConversion/signed-integer-truncation-ignorelist.c (2942 of 3269) PASS: UBSan-ThreadSanitizer-x86_64 :: TestCases/ImplicitConversion/signed-integer-truncation-or-sign-change-ignorelist.c (2943 of 3269) PASS: UBSan-ThreadSanitizer-x86_64 :: TestCases/ImplicitConversion/signed-integer-truncation.c (2944 of 3269) PASS: UBSan-ThreadSanitizer-x86_64 :: TestCases/ImplicitConversion/unsigned-integer-truncation-summary.cpp (2945 of 3269) PASS: UBSan-ThreadSanitizer-x86_64 :: TestCases/Integer/add-overflow.cpp (2946 of 3269) PASS: UBSan-ThreadSanitizer-x86_64 :: TestCases/Integer/div-overflow.cpp (2947 of 3269) PASS: UBSan-ThreadSanitizer-x86_64 :: TestCases/Integer/div-zero.cpp (2948 of 3269) PASS: UBSan-ThreadSanitizer-x86_64 :: TestCases/ImplicitConversion/unsigned-integer-truncation-ignorelist.c (2949 of 3269) PASS: UBSan-ThreadSanitizer-x86_64 :: TestCases/Integer/mul-overflow.cpp (2950 of 3269) PASS: UBSan-ThreadSanitizer-x86_64 :: TestCases/Integer/incdec-overflow.cpp (2951 of 3269) PASS: UBSan-ThreadSanitizer-x86_64 :: TestCases/Integer/negate-overflow.cpp (2952 of 3269) PASS: UBSan-ThreadSanitizer-x86_64 :: TestCases/ImplicitConversion/unsigned-integer-truncation.c (2953 of 3269) PASS: UBSan-ThreadSanitizer-x86_64 :: TestCases/Integer/no-recover.cpp (2954 of 3269) UNSUPPORTED: UBSan-ThreadSanitizer-x86_64 :: TestCases/Integer/summary.cpp (2955 of 3269) PASS: UBSan-ThreadSanitizer-x86_64 :: TestCases/Integer/sub-overflow.cpp (2956 of 3269) PASS: UBSan-ThreadSanitizer-x86_64 :: TestCases/Integer/uadd-overflow.cpp (2957 of 3269) PASS: UBSan-ThreadSanitizer-x86_64 :: TestCases/Integer/suppressions.cpp (2958 of 3269) PASS: UBSan-ThreadSanitizer-x86_64 :: TestCases/Integer/umul-overflow.cpp (2959 of 3269) PASS: UBSan-ThreadSanitizer-x86_64 :: TestCases/Integer/unsigned-shift.cpp (2960 of 3269) UNSUPPORTED: UBSan-ThreadSanitizer-x86_64 :: TestCases/Misc/Linux/print_stack_trace.cpp (2961 of 3269) PASS: UBSan-ThreadSanitizer-x86_64 :: TestCases/Integer/uincdec-overflow.cpp (2962 of 3269) UNSUPPORTED: UBSan-ThreadSanitizer-x86_64 :: TestCases/Misc/Linux/static-link.cpp (2963 of 3269) UNSUPPORTED: UBSan-ThreadSanitizer-x86_64 :: TestCases/Misc/Linux/ubsan_options.cpp (2964 of 3269) PASS: UBSan-ThreadSanitizer-x86_64 :: TestCases/Misc/bool.cpp (2965 of 3269) PASS: UBSan-ThreadSanitizer-x86_64 :: TestCases/Integer/usub-overflow.cpp (2966 of 3269) PASS: UBSan-ThreadSanitizer-x86_64 :: TestCases/Integer/shift.cpp (2967 of 3269) PASS: UBSan-ThreadSanitizer-x86_64 :: TestCases/Misc/bool.m (2968 of 3269) XFAIL: UBSan-ThreadSanitizer-x86_64 :: TestCases/Misc/coverage-levels.cpp (2969 of 3269) PASS: UBSan-ThreadSanitizer-x86_64 :: TestCases/Misc/builtins.cpp (2970 of 3269) PASS: UBSan-ThreadSanitizer-x86_64 :: TestCases/Misc/deduplication.cpp (2971 of 3269) PASS: UBSan-ThreadSanitizer-x86_64 :: TestCases/Misc/bounds.cpp (2972 of 3269) PASS: UBSan-ThreadSanitizer-x86_64 :: TestCases/Misc/enum.cpp (2973 of 3269) PASS: UBSan-ThreadSanitizer-x86_64 :: TestCases/Misc/log-path_test.cpp (2974 of 3269) UNSUPPORTED: UBSan-ThreadSanitizer-x86_64 :: TestCases/Misc/no-interception.cpp (2975 of 3269) PASS: UBSan-ThreadSanitizer-x86_64 :: TestCases/Misc/missing_return.cpp (2976 of 3269) PASS: UBSan-ThreadSanitizer-x86_64 :: TestCases/Misc/monitor.cpp (2977 of 3269) PASS: UBSan-ThreadSanitizer-x86_64 :: TestCases/Misc/nonnull.cpp (2978 of 3269) PASS: UBSan-ThreadSanitizer-x86_64 :: TestCases/Misc/nullability.c (2979 of 3269) PASS: UBSan-ThreadSanitizer-x86_64 :: TestCases/Misc/print_summary.c (2980 of 3269) PASS: UBSan-ThreadSanitizer-x86_64 :: TestCases/Misc/nonnull-arg.cpp (2981 of 3269) PASS: UBSan-ThreadSanitizer-x86_64 :: TestCases/Misc/objc-cast.m (2982 of 3269) PASS: UBSan-ThreadSanitizer-x86_64 :: TestCases/Misc/unreachable.cpp (2983 of 3269) PASS: UBSan-ThreadSanitizer-x86_64 :: TestCases/Misc/vla.c (2984 of 3269) PASS: UBSan-ThreadSanitizer-x86_64 :: TestCases/Pointer/alignment-assumption-attribute-align_value-on-lvalue.cpp (2985 of 3269) PASS: UBSan-ThreadSanitizer-x86_64 :: TestCases/Pointer/alignment-assumption-attribute-align_value-on-paramvar.cpp (2986 of 3269) PASS: UBSan-ThreadSanitizer-x86_64 :: TestCases/Pointer/alignment-assumption-attribute-alloc_align-on-function-variable.cpp (2987 of 3269) PASS: UBSan-ThreadSanitizer-x86_64 :: TestCases/Pointer/alignment-assumption-attribute-alloc_align-on-function.cpp (2988 of 3269) PASS: UBSan-ThreadSanitizer-x86_64 :: TestCases/Pointer/alignment-assumption-attribute-assume_aligned-on-function-two-params.cpp (2989 of 3269) PASS: UBSan-ThreadSanitizer-x86_64 :: TestCases/Pointer/alignment-assumption-attribute-assume_aligned-on-function.cpp (2990 of 3269) PASS: UBSan-ThreadSanitizer-x86_64 :: TestCases/Pointer/alignment-assumption-builtin_assume_aligned-three-params-variable.cpp (2991 of 3269) PASS: UBSan-ThreadSanitizer-x86_64 :: TestCases/Pointer/alignment-assumption-builtin_assume_aligned-three-params.cpp (2992 of 3269) PASS: UBSan-ThreadSanitizer-x86_64 :: TestCases/Pointer/alignment-assumption-builtin_assume_aligned-two-params.cpp (2993 of 3269) PASS: UBSan-ThreadSanitizer-x86_64 :: TestCases/Pointer/alignment-assumption-summary.cpp (2994 of 3269) PASS: UBSan-ThreadSanitizer-x86_64 :: TestCases/Pointer/index-overflow.cpp (2995 of 3269) PASS: UBSan-ThreadSanitizer-x86_64 :: TestCases/Pointer/alignment-assumption-openmp.cpp (2996 of 3269) UNSUPPORTED: XRay-x86_64-darwin :: TestCases/Posix/always-never-instrument.cpp (2997 of 3269) UNSUPPORTED: XRay-x86_64-darwin :: TestCases/Posix/arg1-arg0-logging.cpp (2998 of 3269) UNSUPPORTED: XRay-x86_64-darwin :: TestCases/Posix/arg1-logger.cpp (2999 of 3269) UNSUPPORTED: XRay-x86_64-darwin :: TestCases/Posix/arg1-logging-implicit-this.cpp (3000 of 3269) UNSUPPORTED: XRay-x86_64-darwin :: TestCases/Posix/argv0-log-file-name.cpp (3001 of 3269) UNSUPPORTED: XRay-x86_64-darwin :: TestCases/Posix/basic-filtering.cpp (3002 of 3269) UNSUPPORTED: XRay-x86_64-darwin :: TestCases/Posix/c-test.cpp (3003 of 3269) UNSUPPORTED: XRay-x86_64-darwin :: TestCases/Posix/clang-no-xray-instrument.cpp (3004 of 3269) UNSUPPORTED: XRay-x86_64-darwin :: TestCases/Posix/common-trampoline-alignment.cpp (3005 of 3269) UNSUPPORTED: XRay-x86_64-darwin :: TestCases/Posix/coverage-sample.cpp (3006 of 3269) UNSUPPORTED: XRay-x86_64-darwin :: TestCases/Posix/custom-event-handler-alignment.cpp (3007 of 3269) UNSUPPORTED: XRay-x86_64-darwin :: TestCases/Posix/custom-event-logging.cpp (3008 of 3269) UNSUPPORTED: XRay-x86_64-darwin :: TestCases/Posix/fdr-mode-inmemory.cpp (3009 of 3269) UNSUPPORTED: XRay-x86_64-darwin :: TestCases/Posix/fdr-mode-multiple.cpp (3010 of 3269) UNSUPPORTED: XRay-x86_64-darwin :: TestCases/Posix/fdr-mode.cpp (3011 of 3269) UNSUPPORTED: XRay-x86_64-darwin :: TestCases/Posix/fdr-reinit.cpp (3012 of 3269) UNSUPPORTED: XRay-x86_64-darwin :: TestCases/Posix/fdr-single-thread.cpp (3013 of 3269) UNSUPPORTED: XRay-x86_64-darwin :: TestCases/Posix/fdr-thread-order.cpp (3014 of 3269) UNSUPPORTED: XRay-x86_64-darwin :: TestCases/Posix/fixedsize-logging.cpp (3015 of 3269) UNSUPPORTED: XRay-x86_64-darwin :: TestCases/Posix/fork_basic_logging.cpp (3016 of 3269) UNSUPPORTED: XRay-x86_64-darwin :: TestCases/Posix/func-id-utils.cpp (3017 of 3269) UNSUPPORTED: XRay-x86_64-darwin :: TestCases/Posix/logging-modes.cpp (3018 of 3269) UNSUPPORTED: XRay-x86_64-darwin :: TestCases/Posix/optional-inmemory-log.cpp (3019 of 3269) UNSUPPORTED: XRay-x86_64-darwin :: TestCases/Posix/patching-unpatching.cpp (3020 of 3269) UNSUPPORTED: XRay-x86_64-darwin :: TestCases/Posix/pic_test.cpp (3021 of 3269) UNSUPPORTED: XRay-x86_64-darwin :: TestCases/Posix/profiling-multi-threaded.cpp (3022 of 3269) UNSUPPORTED: XRay-x86_64-darwin :: TestCases/Posix/profiling-single-threaded.cpp (3023 of 3269) UNSUPPORTED: XRay-x86_64-darwin :: TestCases/Posix/quiet-start.cpp (3024 of 3269) UNSUPPORTED: XRay-x86_64h-darwin :: TestCases/Posix/always-never-instrument.cpp (3025 of 3269) UNSUPPORTED: XRay-x86_64h-darwin :: TestCases/Posix/arg1-arg0-logging.cpp (3026 of 3269) UNSUPPORTED: XRay-x86_64h-darwin :: TestCases/Posix/arg1-logger.cpp (3027 of 3269) UNSUPPORTED: XRay-x86_64h-darwin :: TestCases/Posix/arg1-logging-implicit-this.cpp (3028 of 3269) UNSUPPORTED: XRay-x86_64h-darwin :: TestCases/Posix/argv0-log-file-name.cpp (3029 of 3269) UNSUPPORTED: XRay-x86_64h-darwin :: TestCases/Posix/basic-filtering.cpp (3030 of 3269) UNSUPPORTED: XRay-x86_64h-darwin :: TestCases/Posix/c-test.cpp (3031 of 3269) UNSUPPORTED: XRay-x86_64h-darwin :: TestCases/Posix/clang-no-xray-instrument.cpp (3032 of 3269) UNSUPPORTED: XRay-x86_64h-darwin :: TestCases/Posix/common-trampoline-alignment.cpp (3033 of 3269) UNSUPPORTED: XRay-x86_64h-darwin :: TestCases/Posix/coverage-sample.cpp (3034 of 3269) UNSUPPORTED: XRay-x86_64h-darwin :: TestCases/Posix/custom-event-handler-alignment.cpp (3035 of 3269) UNSUPPORTED: XRay-x86_64h-darwin :: TestCases/Posix/custom-event-logging.cpp (3036 of 3269) UNSUPPORTED: XRay-x86_64h-darwin :: TestCases/Posix/fdr-mode-inmemory.cpp (3037 of 3269) UNSUPPORTED: XRay-x86_64h-darwin :: TestCases/Posix/fdr-mode-multiple.cpp (3038 of 3269) UNSUPPORTED: XRay-x86_64h-darwin :: TestCases/Posix/fdr-mode.cpp (3039 of 3269) UNSUPPORTED: XRay-x86_64h-darwin :: TestCases/Posix/fdr-reinit.cpp (3040 of 3269) UNSUPPORTED: XRay-x86_64h-darwin :: TestCases/Posix/fdr-single-thread.cpp (3041 of 3269) UNSUPPORTED: XRay-x86_64h-darwin :: TestCases/Posix/fdr-thread-order.cpp (3042 of 3269) UNSUPPORTED: XRay-x86_64h-darwin :: TestCases/Posix/fixedsize-logging.cpp (3043 of 3269) UNSUPPORTED: XRay-x86_64h-darwin :: TestCases/Posix/fork_basic_logging.cpp (3044 of 3269) UNSUPPORTED: XRay-x86_64h-darwin :: TestCases/Posix/func-id-utils.cpp (3045 of 3269) UNSUPPORTED: XRay-x86_64h-darwin :: TestCases/Posix/logging-modes.cpp (3046 of 3269) UNSUPPORTED: XRay-x86_64h-darwin :: TestCases/Posix/optional-inmemory-log.cpp (3047 of 3269) UNSUPPORTED: XRay-x86_64h-darwin :: TestCases/Posix/patching-unpatching.cpp (3048 of 3269) UNSUPPORTED: XRay-x86_64h-darwin :: TestCases/Posix/pic_test.cpp (3049 of 3269) UNSUPPORTED: XRay-x86_64h-darwin :: TestCases/Posix/profiling-multi-threaded.cpp (3050 of 3269) UNSUPPORTED: XRay-x86_64h-darwin :: TestCases/Posix/profiling-single-threaded.cpp (3051 of 3269) UNSUPPORTED: XRay-x86_64h-darwin :: TestCases/Posix/quiet-start.cpp (3052 of 3269) UNSUPPORTED: cfi-devirt-x86_64 :: anon-namespace.cpp (3053 of 3269) UNSUPPORTED: cfi-devirt-x86_64 :: bad-cast.cpp (3054 of 3269) UNSUPPORTED: cfi-devirt-x86_64 :: bad-split.cpp (3055 of 3269) UNSUPPORTED: cfi-devirt-x86_64 :: base-derived-destructor.cpp (3056 of 3269) UNSUPPORTED: cfi-devirt-x86_64 :: create-derivers.test (3057 of 3269) UNSUPPORTED: cfi-devirt-x86_64 :: cross-dso-diagnostic.cpp (3058 of 3269) UNSUPPORTED: cfi-devirt-x86_64 :: cross-dso/icall/diag.cpp (3059 of 3269) UNSUPPORTED: cfi-devirt-x86_64 :: cross-dso/icall/dlopen.cpp (3060 of 3269) UNSUPPORTED: cfi-devirt-x86_64 :: cross-dso/icall/icall-from-dso.cpp (3061 of 3269) UNSUPPORTED: cfi-devirt-x86_64 :: cross-dso/icall/icall.cpp (3062 of 3269) UNSUPPORTED: cfi-devirt-x86_64 :: cross-dso/shadow_is_read_only.cpp (3063 of 3269) UNSUPPORTED: cfi-devirt-x86_64 :: cross-dso/simple-fail.cpp (3064 of 3269) UNSUPPORTED: cfi-devirt-x86_64 :: cross-dso/simple-pass.cpp (3065 of 3269) UNSUPPORTED: cfi-devirt-x86_64 :: cross-dso/stats.cpp (3066 of 3269) UNSUPPORTED: cfi-devirt-x86_64 :: cross-dso/target_out_of_bounds.cpp (3067 of 3269) UNSUPPORTED: cfi-devirt-x86_64 :: icall/bad-signature.c (3068 of 3269) UNSUPPORTED: cfi-devirt-x86_64 :: icall/external-call.c (3069 of 3269) UNSUPPORTED: cfi-devirt-x86_64 :: icall/weak.c (3070 of 3269) UNSUPPORTED: cfi-devirt-x86_64 :: icall/wrong-signature-mixed-lto.c (3071 of 3269) UNSUPPORTED: cfi-devirt-x86_64 :: mfcall.cpp (3072 of 3269) UNSUPPORTED: cfi-devirt-x86_64 :: multiple-inheritance.cpp (3073 of 3269) UNSUPPORTED: cfi-devirt-x86_64 :: multiple-inheritance2.cpp (3074 of 3269) UNSUPPORTED: cfi-devirt-x86_64 :: nvcall.cpp (3075 of 3269) UNSUPPORTED: cfi-devirt-x86_64 :: overwrite.cpp (3076 of 3269) UNSUPPORTED: cfi-devirt-x86_64 :: sibling.cpp (3077 of 3269) UNSUPPORTED: cfi-devirt-x86_64 :: simple-fail.cpp (3078 of 3269) UNSUPPORTED: cfi-devirt-x86_64 :: simple-pass.cpp (3079 of 3269) UNSUPPORTED: cfi-devirt-x86_64 :: stats.cpp (3080 of 3269) UNSUPPORTED: cfi-devirt-x86_64 :: target_uninstrumented.cpp (3081 of 3269) UNSUPPORTED: cfi-devirt-x86_64 :: two-vcalls.cpp (3082 of 3269) UNSUPPORTED: cfi-devirt-x86_64 :: vdtor.cpp (3083 of 3269) UNSUPPORTED: cfi-devirt-x86_64 :: vtable-may-alias.cpp (3084 of 3269) UNSUPPORTED: cfi-standalone-x86_64 :: anon-namespace.cpp (3085 of 3269) UNSUPPORTED: cfi-standalone-x86_64 :: bad-cast.cpp (3086 of 3269) UNSUPPORTED: cfi-standalone-x86_64 :: bad-split.cpp (3087 of 3269) UNSUPPORTED: cfi-standalone-x86_64 :: base-derived-destructor.cpp (3088 of 3269) UNSUPPORTED: cfi-standalone-x86_64 :: create-derivers.test (3089 of 3269) UNSUPPORTED: cfi-standalone-x86_64 :: cross-dso-diagnostic.cpp (3090 of 3269) UNSUPPORTED: cfi-standalone-x86_64 :: cross-dso/icall/diag.cpp (3091 of 3269) UNSUPPORTED: cfi-standalone-x86_64 :: cross-dso/icall/dlopen.cpp (3092 of 3269) UNSUPPORTED: cfi-standalone-x86_64 :: cross-dso/icall/icall-from-dso.cpp (3093 of 3269) UNSUPPORTED: cfi-standalone-x86_64 :: cross-dso/icall/icall.cpp (3094 of 3269) UNSUPPORTED: cfi-standalone-x86_64 :: cross-dso/shadow_is_read_only.cpp (3095 of 3269) UNSUPPORTED: cfi-standalone-x86_64 :: cross-dso/simple-fail.cpp (3096 of 3269) UNSUPPORTED: cfi-standalone-x86_64 :: cross-dso/simple-pass.cpp (3097 of 3269) UNSUPPORTED: cfi-standalone-x86_64 :: cross-dso/stats.cpp (3098 of 3269) UNSUPPORTED: cfi-standalone-x86_64 :: cross-dso/target_out_of_bounds.cpp (3099 of 3269) UNSUPPORTED: cfi-standalone-x86_64 :: icall/bad-signature.c (3100 of 3269) UNSUPPORTED: cfi-standalone-x86_64 :: icall/external-call.c (3101 of 3269) UNSUPPORTED: cfi-standalone-x86_64 :: icall/weak.c (3102 of 3269) UNSUPPORTED: cfi-standalone-x86_64 :: icall/wrong-signature-mixed-lto.c (3103 of 3269) UNSUPPORTED: cfi-standalone-x86_64 :: mfcall.cpp (3104 of 3269) UNSUPPORTED: cfi-standalone-x86_64 :: multiple-inheritance.cpp (3105 of 3269) UNSUPPORTED: cfi-standalone-x86_64 :: multiple-inheritance2.cpp (3106 of 3269) UNSUPPORTED: cfi-standalone-x86_64 :: nvcall.cpp (3107 of 3269) UNSUPPORTED: cfi-standalone-x86_64 :: overwrite.cpp (3108 of 3269) UNSUPPORTED: cfi-standalone-x86_64 :: sibling.cpp (3109 of 3269) UNSUPPORTED: cfi-standalone-x86_64 :: simple-fail.cpp (3110 of 3269) UNSUPPORTED: cfi-standalone-x86_64 :: simple-pass.cpp (3111 of 3269) UNSUPPORTED: cfi-standalone-x86_64 :: stats.cpp (3112 of 3269) UNSUPPORTED: cfi-standalone-x86_64 :: target_uninstrumented.cpp (3113 of 3269) UNSUPPORTED: cfi-standalone-x86_64 :: two-vcalls.cpp (3114 of 3269) UNSUPPORTED: cfi-standalone-x86_64 :: vdtor.cpp (3115 of 3269) UNSUPPORTED: cfi-standalone-x86_64 :: vtable-may-alias.cpp (3116 of 3269) PASS: UBSan-ThreadSanitizer-x86_64 :: TestCases/Pointer/nullptr-and-nonzero-offset-summary.cpp (3117 of 3269) PASS: UBSan-ThreadSanitizer-x86_64 :: TestCases/Pointer/unsigned-index-expression.cpp (3118 of 3269) UNSUPPORTED: UBSan-ThreadSanitizer-x86_64 :: TestCases/TypeCheck/Linux/PR33221.cpp (3119 of 3269) PASS: UBSan-ThreadSanitizer-x86_64 :: TestCases/Pointer/nullptr-and-nonzero-offset-constants.cpp (3120 of 3269) PASS: UBSan-ThreadSanitizer-x86_64 :: TestCases/TypeCheck/PR33221.cpp (3121 of 3269) PASS: UBSan-ThreadSanitizer-x86_64 :: TestCases/TypeCheck/Function/function.cpp (3122 of 3269) PASS: UBSan-ThreadSanitizer-x86_64 :: TestCases/TypeCheck/null.cpp (3123 of 3269) PASS: UBSan-ThreadSanitizer-x86_64 :: TestCases/TypeCheck/vptr-corrupted-vtable-itanium.cpp (3124 of 3269) PASS: UBSan-ThreadSanitizer-x86_64 :: TestCases/TypeCheck/vptr-non-unique-typeinfo.cpp (3125 of 3269) UNSUPPORTED: UBSan-ThreadSanitizer-x86_64 :: TestCases/TypeCheck/vptr-ptrauth-unauthenticated.cpp (3126 of 3269) PASS: UBSan-ThreadSanitizer-x86_64 :: TestCases/Pointer/nullptr-and-nonzero-offset-variable.cpp (3127 of 3269) PASS: UBSan-ThreadSanitizer-x86_64 :: TestCases/TypeCheck/vptr-virtual-base-construction.cpp (3128 of 3269) PASS: UBSan-ThreadSanitizer-x86_64 :: TestCases/TypeCheck/vptr-virtual-base.cpp (3129 of 3269) PASS: libFuzzer :: acquire-crash-state.test (3130 of 3269) UNSUPPORTED: libFuzzer :: afl-driver-close-fd-mask.test (3131 of 3269) PASS: UBSan-ThreadSanitizer-x86_64 :: TestCases/TypeCheck/misaligned.cpp (3132 of 3269) UNSUPPORTED: libFuzzer :: afl-driver.test (3133 of 3269) PASS: libFuzzer :: bad-strcmp.test (3134 of 3269) UNSUPPORTED: libFuzzer :: bcmp.test (3135 of 3269) PASS: libFuzzer :: bogus-initialize.test (3136 of 3269) PASS: libFuzzer :: afl-driver-stderr.test (3137 of 3269) PASS: libFuzzer :: buffer-overflow-on-input.test (3138 of 3269) PASS: libFuzzer :: caller-callee.test (3139 of 3269) UNSUPPORTED: libFuzzer :: compressed.test (3140 of 3269) PASS: libFuzzer :: counters.test (3141 of 3269) PASS: libFuzzer :: coverage.test (3142 of 3269) PASS: libFuzzer :: cross_over.test (3143 of 3269) PASS: libFuzzer :: cross_over_copy.test (3144 of 3269) PASS: libFuzzer :: cross_over_insert.test (3145 of 3269) UNSUPPORTED: libFuzzer :: cross_over_uniform_dist.test (3146 of 3269) UNSUPPORTED: libFuzzer :: custom-allocator.test (3147 of 3269) PASS: UBSan-ThreadSanitizer-x86_64 :: TestCases/TypeCheck/vptr.cpp (3148 of 3269) UNSUPPORTED: libFuzzer :: dataflow.test (3149 of 3269) PASS: libFuzzer :: cleanse.test (3150 of 3269) UNSUPPORTED: libFuzzer :: deep-recursion.test (3151 of 3269) PASS: libFuzzer :: dead-stripping.test (3152 of 3269) UNSUPPORTED: libFuzzer :: disable-leaks.test (3153 of 3269) PASS: libFuzzer :: cxxstring.test (3154 of 3269) UNSUPPORTED: libFuzzer :: entropic-scale-per-exec-time.test (3155 of 3269) UNSUPPORTED: libFuzzer :: equivalence-signals.test (3156 of 3269) UNSUPPORTED: libFuzzer :: equivalence.test (3157 of 3269) PASS: libFuzzer :: dso.test (3158 of 3269) PASS: libFuzzer :: deprecated-instrumentation.test (3159 of 3269) UNSUPPORTED: libFuzzer :: extra-counters.test (3160 of 3269) UNSUPPORTED: libFuzzer :: features_dir.test (3161 of 3269) UNSUPPORTED: libFuzzer :: focus-function.test (3162 of 3269) UNSUPPORTED: libFuzzer :: fork-sigusr.test (3163 of 3269) UNSUPPORTED: libFuzzer :: fork-ubsan.test (3164 of 3269) UNSUPPORTED: libFuzzer :: fork.test (3165 of 3269) UNSUPPORTED: libFuzzer :: fork_corpus_groups.test (3166 of 3269) PASS: libFuzzer :: exit-report.test (3167 of 3269) PASS: libFuzzer :: full-coverage-set.test (3168 of 3269) PASS: libFuzzer :: full-coverage.test (3169 of 3269) PASS: libFuzzer :: fuzzer-alignment-assumption.test (3170 of 3269) PASS: libFuzzer :: exit_on_src_pos.test (3171 of 3269) PASS: libFuzzer :: fuzzer-customcrossoverandmutate.test (3172 of 3269) PASS: libFuzzer :: fuzzer-customcrossover.test (3173 of 3269) PASS: libFuzzer :: fuzzer-dict.test (3174 of 3269) PASS: libFuzzer :: fuzzer-fdmask.test (3175 of 3269) PASS: libFuzzer :: fuzzer-custommutator.test (3176 of 3269) PASS: libFuzzer :: fuzzer-finalstats.test (3177 of 3269) PASS: libFuzzer :: fuzzer-flags.test (3178 of 3269) PASS: libFuzzer :: fuzzer-implicit-integer-sign-change.test (3179 of 3269) PASS: libFuzzer :: fuzzer-dirs.test (3180 of 3269) PASS: libFuzzer :: fuzzer-implicit-signed-integer-truncation-or-sign-change.test (3181 of 3269) UNSUPPORTED: libFuzzer :: fuzzer-leak.test (3182 of 3269) UNSUPPORTED: libFuzzer :: fuzzer-oom-with-profile.test (3183 of 3269) PASS: libFuzzer :: fuzzer-implicit-signed-integer-truncation.test (3184 of 3269) PASS: libFuzzer :: fuzzer-implicit-unsigned-integer-truncation.test (3185 of 3269) PASS: libFuzzer :: fuzzer-printcovpcs.test (3186 of 3269) PASS: libFuzzer :: fuzzer-seed.test (3187 of 3269) PASS: libFuzzer :: fuzzer-runs.test (3188 of 3269) PASS: libFuzzer :: fuzzer-segv.test (3189 of 3269) PASS: libFuzzer :: fuzzer-singleinputs.test (3190 of 3269) PASS: libFuzzer :: fuzzer-oom.test (3191 of 3269) PASS: libFuzzer :: fuzzer-ubsan.test (3192 of 3269) UNSUPPORTED: libFuzzer :: gc-sections.test (3193 of 3269) PASS: libFuzzer :: fuzzer-threaded.test (3194 of 3269) UNSUPPORTED: libFuzzer :: keep-seed.test (3195 of 3269) PASS: libFuzzer :: initialize.test (3196 of 3269) PASS: libFuzzer :: len_control.test (3197 of 3269) UNSUPPORTED: libFuzzer :: libcxx.test (3198 of 3269) UNSUPPORTED: libFuzzer :: magic-separator.test (3199 of 3269) PASS: libFuzzer :: max-number-of-runs.test (3200 of 3269) PASS: libFuzzer :: memcmp.test (3201 of 3269) PASS: libFuzzer :: memcmp64.test (3202 of 3269) PASS: libFuzzer :: fuzzer-timeout.test (3203 of 3269) PASS: libFuzzer :: merge-posix.test (3204 of 3269) UNSUPPORTED: libFuzzer :: merge-sigusr.test (3205 of 3269) PASS: libFuzzer :: merge-control-file.test (3206 of 3269) PASS: libFuzzer :: merge_two_step.test (3207 of 3269) PASS: libFuzzer :: merge.test (3208 of 3269) PASS: libFuzzer :: large.test (3209 of 3269) PASS: libFuzzer :: minimize_timeout.test (3210 of 3269) UNSUPPORTED: libFuzzer :: msan-custom-mutator.test (3211 of 3269) UNSUPPORTED: libFuzzer :: msan-param-unpoison.test (3212 of 3269) UNSUPPORTED: libFuzzer :: msan.test (3213 of 3269) UNSUPPORTED: libFuzzer :: mutation-graph.test (3214 of 3269) UNSUPPORTED: libFuzzer :: noasan-bcmp.test (3215 of 3269) UNSUPPORTED: libFuzzer :: noasan-memcmp.test (3216 of 3269) UNSUPPORTED: libFuzzer :: noasan-memcmp64.test (3217 of 3269) UNSUPPORTED: libFuzzer :: noasan-strcmp.test (3218 of 3269) UNSUPPORTED: libFuzzer :: noasan-strncmp.test (3219 of 3269) UNSUPPORTED: libFuzzer :: noasan-strstr.test (3220 of 3269) PASS: libFuzzer :: not-instrumented.test (3221 of 3269) PASS: libFuzzer :: minimize_two_crashes.test (3222 of 3269) PASS: libFuzzer :: null-deref-on-empty.test (3223 of 3269) UNSUPPORTED: libFuzzer :: only-some-bytes-fork.test (3224 of 3269) UNSUPPORTED: libFuzzer :: only-some-bytes.test (3225 of 3269) UNSUPPORTED: libFuzzer :: out-of-process-fuzz.test (3226 of 3269) PASS: libFuzzer :: overwrite-input.test (3227 of 3269) UNSUPPORTED: libFuzzer :: print-func.test (3228 of 3269) PASS: libFuzzer :: null-deref.test (3229 of 3269) PASS: libFuzzer :: recommended-dictionary.test (3230 of 3269) PASS: libFuzzer :: read-binary.test (3231 of 3269) PASS: libFuzzer :: reduce_inputs.test (3232 of 3269) PASS: libFuzzer :: repeated-bytes.test (3233 of 3269) PASS: libFuzzer :: reload.test (3234 of 3269) PASS: libFuzzer :: seed_inputs.test (3235 of 3269) PASS: libFuzzer :: set_cover_merge.test (3236 of 3269) UNSUPPORTED: libFuzzer :: sigint.test (3237 of 3269) UNSUPPORTED: libFuzzer :: sigusr.test (3238 of 3269) UNSUPPORTED: libFuzzer :: simple-cmp.test (3239 of 3269) PASS: libFuzzer :: shrink.test (3240 of 3269) PASS: libFuzzer :: simple.test (3241 of 3269) PASS: libFuzzer :: standalone.test (3242 of 3269) PASS: libFuzzer :: stack-overflow-with-asan.test (3243 of 3269) PASS: libFuzzer :: minimize_crash.test (3244 of 3269) PASS: libFuzzer :: strcmp.test (3245 of 3269) PASS: libFuzzer :: strncmp-oob.test (3246 of 3269) PASS: libFuzzer :: strstr.test (3247 of 3269) PASS: libFuzzer :: strncmp.test (3248 of 3269) PASS: libFuzzer :: symbolize-deadlock.test (3249 of 3269) UNSUPPORTED: libFuzzer :: trace-malloc-2.test (3250 of 3269) UNSUPPORTED: libFuzzer :: trace-malloc-threaded.test (3251 of 3269) UNSUPPORTED: libFuzzer :: trace-malloc-unbalanced.test (3252 of 3269) PASS: libFuzzer :: three-bytes.test (3253 of 3269) PASS: libFuzzer :: trace-malloc.test (3254 of 3269) UNSUPPORTED: libFuzzer :: uncaught-exception.test (3255 of 3269) PASS: libFuzzer :: swap-cmp.test (3256 of 3269) PASS: libFuzzer :: ulimit.test (3257 of 3269) PASS: libFuzzer :: value-profile-cmp2.test (3258 of 3269) PASS: libFuzzer :: value-profile-cmp3.test (3259 of 3269) PASS: libFuzzer :: value-profile-cmp4.test (3260 of 3269) PASS: libFuzzer :: value-profile-div.test (3261 of 3269) PASS: libFuzzer :: value-profile-cmp.test (3262 of 3269) PASS: libFuzzer :: value-profile-load.test (3263 of 3269) PASS: libFuzzer :: value-profile-strcmp.test (3264 of 3269) PASS: libFuzzer :: value-profile-set.test (3265 of 3269) PASS: libFuzzer :: value-profile-strncmp.test (3266 of 3269) UNSUPPORTED: libFuzzer :: windows-opt-ref.test (3267 of 3269) PASS: libFuzzer :: value-profile-mem.test (3268 of 3269) PASS: libFuzzer :: value-profile-switch.test (3269 of 3269)

Hide Details

24 warning(s) in tests ******************** Failed Tests (1): ThreadSanitizer-x86_64 :: Darwin/dyld-insert-libraries.c

Hide Details

Hide Details

Testing Time: 1002.69s Unsupported : 1028 Passed : 2217 Expectedly Failed: 23 Failed : 1 FAILED: test/CMakeFiles/check-compiler-rt cd /Users/buildslave/jenkins/workspace/clang-stage2-Rthinlto/clang-build/Build/tools/clang/runtime/compiler-rt-bins/test && /usr/local/Frameworks/Python.framework/Versions/3.7/bin/python3.7 /Users/buildslave/jenkins/workspace/clang-stage2-Rthinlto/clang-build/Build/./bin/llvm-lit --xunit-xml-output=testresults.xunit.xml -v -vv --timeout=600 /Users/buildslave/jenkins/workspace/clang-stage2-Rthinlto/clang-build/Build/tools/clang/runtime/compiler-rt-bins/test/builtins/TestCases /Users/buildslave/jenkins/workspace/clang-stage2-Rthinlto/clang-build/Build/tools/clang/runtime/compiler-rt-bins/test/builtins/Unit/X86_64DarwinConfig /Users/buildslave/jenkins/workspace/clang-stage2-Rthinlto/clang-build/Build/tools/clang/runtime/compiler-rt-bins/test/lsan/X86_64LsanConfig /Users/buildslave/jenkins/workspace/clang-stage2-Rthinlto/clang-build/Build/tools/clang/runtime/compiler-rt-bins/test/lsan/X86_64AsanConfig /Users/buildslave/jenkins/workspace/clang-stage2-Rthinlto/clang-build/Build/tools/clang/runtime/compiler-rt-bins/test/ubsan/Standalone-x86_64 /Users/buildslave/jenkins/workspace/clang-stage2-Rthinlto/clang-build/Build/tools/clang/runtime/compiler-rt-bins/test/ubsan/AddressSanitizer-x86_64 /Users/buildslave/jenkins/workspace/clang-stage2-Rthinlto/clang-build/Build/tools/clang/runtime/compiler-rt-bins/test/ubsan/ThreadSanitizer-x86_64 /Users/buildslave/jenkins/workspace/clang-stage2-Rthinlto/clang-build/Build/tools/clang/runtime/compiler-rt-bins/test/ubsan/StandaloneStatic-x86_64 /Users/buildslave/jenkins/workspace/clang-stage2-Rthinlto/clang-build/Build/tools/clang/runtime/compiler-rt-bins/test/cfi/Standalone-x86_64 /Users/buildslave/jenkins/workspace/clang-stage2-Rthinlto/clang-build/Build/tools/clang/runtime/compiler-rt-bins/test/cfi/Devirt-x86_64 /Users/buildslave/jenkins/workspace/clang-stage2-Rthinlto/clang-build/Build/tools/clang/runtime/compiler-rt-bins/test/sanitizer_common/asan-x86_64-Darwin /Users/buildslave/jenkins/workspace/clang-stage2-Rthinlto/clang-build/Build/tools/clang/runtime/compiler-rt-bins/test/sanitizer_common/lsan-x86_64-Darwin /Users/buildslave/jenkins/workspace/clang-stage2-Rthinlto/clang-build/Build/tools/clang/runtime/compiler-rt-bins/test/sanitizer_common/tsan-x86_64-Darwin /Users/buildslave/jenkins/workspace/clang-stage2-Rthinlto/clang-build/Build/tools/clang/runtime/compiler-rt-bins/test/sanitizer_common/ubsan-x86_64-Darwin /Users/buildslave/jenkins/workspace/clang-stage2-Rthinlto/clang-build/Build/tools/clang/runtime/compiler-rt-bins/test/sanitizer_common/Unit /Users/buildslave/jenkins/workspace/clang-stage2-Rthinlto/clang-build/Build/tools/clang/runtime/compiler-rt-bins/test/fuzzer/unit /Users/buildslave/jenkins/workspace/clang-stage2-Rthinlto/clang-build/Build/tools/clang/runtime/compiler-rt-bins/test/fuzzer/X86_64DefaultDarwinConfig/ /Users/buildslave/jenkins/workspace/clang-stage2-Rthinlto/clang-build/Build/tools/clang/runtime/compiler-rt-bins/test/asan/X86_64DarwinConfig /Users/buildslave/jenkins/workspace/clang-stage2-Rthinlto/clang-build/Build/tools/clang/runtime/compiler-rt-bins/test/asan/Unit /Users/buildslave/jenkins/workspace/clang-stage2-Rthinlto/clang-build/Build/tools/clang/runtime/compiler-rt-bins/test/tsan/X86_64Config /Users/buildslave/jenkins/workspace/clang-stage2-Rthinlto/clang-build/Build/tools/clang/runtime/compiler-rt-bins/test/tsan/Unit /Users/buildslave/jenkins/workspace/clang-stage2-Rthinlto/clang-build/Build/tools/clang/runtime/compiler-rt-bins/test/ubsan_minimal/x86_64 /Users/buildslave/jenkins/workspace/clang-stage2-Rthinlto/clang-build/Build/tools/clang/runtime/compiler-rt-bins/test/profile/Profile-x86_64 /Users/buildslave/jenkins/workspace/clang-stage2-Rthinlto/clang-build/Build/tools/clang/runtime/compiler-rt-bins/test/xray/X86_64DarwinConfig /Users/buildslave/jenkins/workspace/clang-stage2-Rthinlto/clang-build/Build/tools/clang/runtime/compiler-rt-bins/test/xray/X86_64HDarwinConfig /Users/buildslave/jenkins/workspace/clang-stage2-Rthinlto/clang-build/Build/tools/clang/runtime/compiler-rt-bins/test/orc/X86_64DarwinConfig /Users/buildslave/jenkins/workspace/clang-stage2-Rthinlto/clang-build/Build/tools/clang/runtime/compiler-rt-bins/test/orc/X86_64HDarwinConfig /Users/buildslave/jenkins/workspace/clang-stage2-Rthinlto/clang-build/Build/tools/clang/runtime/compiler-rt-bins/test/shadowcallstack/arm64 ninja: build stopped: subcommand failed. FAILED: tools/clang/runtime/CMakeFiles/check-compiler-rt cd /Users/buildslave/jenkins/workspace/clang-stage2-Rthinlto/clang-build/Build/tools/clang/runtime/compiler-rt-bins && /usr/local/Cellar/cmake/3.17.2/bin/cmake --build . --target check-all --config RelWithDebInfo ninja: build stopped: cannot make progress due to previous errors. [Pipeline] } [Pipeline] // timeout [Pipeline] junit Recording test results [Checks API] No suitable checks publisher found. [Pipeline] } [Pipeline] // stage [Pipeline] stage [Pipeline] { (Declarative: Post Actions) [Pipeline] scanForIssues [Clang] Sleeping for 5 seconds due to JENKINS-32191... [Clang] Parsing console log (workspace: '/Users/buildslave/jenkins/workspace/clang-stage2-Rthinlto') [Clang] -> found 12 issues (skipped 37 duplicates) [Clang] Parsing console log (workspace: '/Users/buildslave/jenkins/workspace/clang-stage2-Rthinlto') [Clang] [-ERROR-] Can't create fingerprints for some files: [Clang] [-ERROR-] - '/Users/buildslave/jenkins/workspace/clang-stage2-Rthinlto/clang-build/Build/tools/clang/sanitizer_common/sanitizer_mac.cpp', IO exception has been thrown: java.nio.file.NoSuchFileException: /Users/buildslave/jenkins/workspace/clang-stage2-Rthinlto/clang-build/Build/tools/clang/sanitizer_common/sanitizer_mac.cpp [Clang] [-ERROR-] - '/Users/buildslave/jenkins/workspace/clang-stage2-Rthinlto/clang-build/Build/tools/clang/sanitizer_common/sanitizer_mac.cpp', IO exception has been thrown: java.nio.file.NoSuchFileException: /Users/buildslave/jenkins/workspace/clang-stage2-Rthinlto/clang-build/Build/tools/clang/sanitizer_common/sanitizer_mac.cpp [Clang] [-ERROR-] - '/Users/buildslave/jenkins/workspace/clang-stage2-Rthinlto/clang-build/Build/tools/clang/sanitizer_common/sanitizer_mac.cpp', IO exception has been thrown: java.nio.file.NoSuchFileException: /Users/buildslave/jenkins/workspace/clang-stage2-Rthinlto/clang-build/Build/tools/clang/sanitizer_common/sanitizer_mac.cpp [Clang] [-ERROR-] - '/Users/buildslave/jenkins/workspace/clang-stage2-Rthinlto/clang-build/Build/tools/clang/sanitizer_common/sanitizer_mac.cpp', IO exception has been thrown: java.nio.file.NoSuchFileException: /Users/buildslave/jenkins/workspace/clang-stage2-Rthinlto/clang-build/Build/tools/clang/sanitizer_common/sanitizer_mac.cpp [Clang] [-ERROR-] - '/Users/buildslave/jenkins/workspace/clang-stage2-Rthinlto/clang-build/Build/tools/clang/sanitizer_common/sanitizer_mac.cpp', IO exception has been thrown: java.nio.file.NoSuchFileException: /Users/buildslave/jenkins/workspace/clang-stage2-Rthinlto/clang-build/Build/tools/clang/sanitizer_common/sanitizer_mac.cpp [Clang] [-ERROR-] - '/Users/buildslave/jenkins/workspace/clang-stage2-Rthinlto/clang-build/Build/tools/clang/sanitizer_common/sanitizer_mac.cpp', IO exception has been thrown: java.nio.file.NoSuchFileException: /Users/buildslave/jenkins/workspace/clang-stage2-Rthinlto/clang-build/Build/tools/clang/sanitizer_common/sanitizer_mac.cpp [Clang] [-ERROR-] - '/Users/buildslave/jenkins/workspace/clang-stage2-Rthinlto/clang-build/Build/tools/clang/sanitizer_common/sanitizer_mac.cpp', IO exception has been thrown: java.nio.file.NoSuchFileException: /Users/buildslave/jenkins/workspace/clang-stage2-Rthinlto/clang-build/Build/tools/clang/sanitizer_common/sanitizer_mac.cpp [Clang] [-ERROR-] - '/Users/buildslave/jenkins/workspace/clang-stage2-Rthinlto/clang-build/Build/tools/clang/sanitizer_common/sanitizer_mac.cpp', IO exception has been thrown: java.nio.file.NoSuchFileException: /Users/buildslave/jenkins/workspace/clang-stage2-Rthinlto/clang-build/Build/tools/clang/sanitizer_common/sanitizer_mac.cpp [Clang] [-ERROR-] - '/Users/buildslave/jenkins/workspace/clang-stage2-Rthinlto/clang-build/Build/tools/clang/runtime/compiler-rt-bins/llvm-lit: /Users/buildslave/jenkins/workspace/clang-stage2-Rthinlto/llvm-project/compiler-rt/test/lit.common.cfg.py', IO exception has been thrown: java.nio.file.NoSuchFileException: /Users/buildslave/jenkins/workspace/clang-stage2-Rthinlto/clang-build/Build/tools/clang/runtime/compiler-rt-bins/llvm-lit: /Users/buildslave/jenkins/workspace/clang-stage2-Rthinlto/llvm-project/compiler-rt/test/lit.common.cfg.py [Clang] -> found 12 issues (skipped 37 duplicates) [Clang] Successfully parsed console log [Clang] -> found 12 issues (skipped 37 duplicates) [Clang] Parsing console log (workspace: '/Users/buildslave/jenkins/workspace/clang-stage2-Rthinlto') [Clang] Post processing issues on 'green-dragon-22' with source code encoding 'UTF-8' [Clang] Creating SCM blamer to obtain author and commit information for affected files [Clang] -> No blamer installed yet. You need to install the 'git-forensics' plugin to enable blaming for Git. [Clang] Resolving file names for all issues in source directory '/Users/buildslave/jenkins/workspace/clang-stage2-Rthinlto' [Clang] -> resolved paths in source directory (2 found, 2 not found) [Clang] Resolving module names from module definitions (build.xml, pom.xml, or Manifest.mf files) [Clang] -> resolved module names for 12 issues [Clang] Resolving package names (or namespaces) by parsing the affected files [Clang] -> resolved package names of 4 affected files [Clang] No filter has been set, publishing all 12 issues [Clang] Creating fingerprints for all affected code blocks to track issues over different builds [Clang] -> created fingerprints for 3 issues (skipped 9 issues) [Clang] Copying affected files to Jenkins' build folder '/Users/Shared/Jenkins/Home/jobs/clang-stage2-Rthinlto/builds/4471/files-with-issues' [Clang] -> 2 copied, 0 not in workspace, 9 not-found, 0 with I/O error [Clang] Repository miner is not configured, skipping repository mining [Pipeline] emailext Warning: nikita.ppv@gmail.com is not a recognized user, but sending mail anyway Warning: mgorny@gentoo.org is not a recognized user, but sending mail anyway Warning: mydeveloperday@gmail.com is not a recognized user, but sending mail anyway Warning: arjunpitchanathan@gmail.com is not a recognized user, but sending mail anyway Warning: i@maskray.me is not a recognized user, but sending mail anyway Warning: dvyukov@google.com is not a recognized user, but sending mail anyway Warning: markus.boeck02@gmail.com is not a recognized user, but sending mail anyway Warning: llvm-dev@redking.me.uk is not a recognized user, but sending mail anyway Warning: jim@andestech.com is not a recognized user, but sending mail anyway Warning: david.green@arm.com is not a recognized user, but sending mail anyway Warning: clementval@gmail.com is not a recognized user, but sending mail anyway Warning: kazu@google.com is not a recognized user, but sending mail anyway Warning: nikita.ppv@gmail.com is not a recognized user, but sending mail anyway Warning: mgorny@gentoo.org is not a recognized user, but sending mail anyway Warning: mydeveloperday@gmail.com is not a recognized user, but sending mail anyway Warning: arjunpitchanathan@gmail.com is not a recognized user, but sending mail anyway Warning: i@maskray.me is not a recognized user, but sending mail anyway Warning: dvyukov@google.com is not a recognized user, but sending mail anyway Warning: markus.boeck02@gmail.com is not a recognized user, but sending mail anyway Warning: llvm-dev@redking.me.uk is not a recognized user, but sending mail anyway Warning: jim@andestech.com is not a recognized user, but sending mail anyway Warning: david.green@arm.com is not a recognized user, but sending mail anyway Warning: clementval@gmail.com is not a recognized user, but sending mail anyway Warning: kazu@google.com is not a recognized user, but sending mail anyway

Hide Details

Begin Pre-Send Script... Sending email to: Jessica Paquette <jonathan_roelofs@apple.com> Jessica Paquette <jonathan_roelofs@apple.com> Azhar Mohammed <azhar@apple.com>
[Pipeline] } [Pipeline] // stage [Pipeline] } [Pipeline] // withEnv [Pipeline] } [Pipeline] // node [Pipeline] End of Pipeline Triggering a new build of Debug Info Statistics #4879 Finished: UNSTABLE