Console Output

Skipping 9,511 KB.. Full Log
PASS: lldb-shell :: SymbolFile/DWARF/x86/dwarf5-debug_line.s (884 of 2410)
UNSUPPORTED: lldb-api :: commands/trace/multiple-threads/TestTraceStartStopMultipleThreads.py (885 of 2410)
PASS: lldb-api :: functionalities/data-formatter/data-formatter-skip-summary/TestDataFormatterSkipSummary.py (886 of 2410)
PASS: lldb-unit :: Utility/./UtilityTests/StreamTest.PutHex32ByteOrderBig (887 of 2410)
PASS: lldb-unit :: DataFormatter/./LLDBFormatterTests/TypeMatcherTests.RegexName (888 of 2410)
UNSUPPORTED: lldb-api :: functionalities/data-formatter/data-formatter-stl/libstdcpp/list/TestDataFormatterStdList.py (889 of 2410)
PASS: lldb-unit :: Utility/./UtilityTests/StreamTest.PutPtr (890 of 2410)
PASS: lldb-unit :: Utility/./UtilityTests/BinaryStreamTest.PutSLEB128EightBytes (891 of 2410)
PASS: lldb-unit :: Process/Utility/./ProcessUtilityTests/MemoryTagManagerAArch64MTETest.MakeTaggedRange (892 of 2410)
PASS: lldb-unit :: Process/minidump/./LLDBMinidumpTests/MinidumpParserTest.GetThreadContext_x86_32_wow64 (893 of 2410)
PASS: lldb-api :: lang/objcxx/hide-runtime-values/TestObjCXXHideRuntimeValues.py (894 of 2410)
PASS: lldb-unit :: SymbolFile/NativePDB/./SymbolFileNativePDBTests/PDBFPOProgramToDWARFExpressionTests.SingleAssignmentRegisterRef (895 of 2410)
UNSUPPORTED: lldb-shell :: Subprocess/clone-follow-parent.test (896 of 2410)
PASS: lldb-unit :: Utility/./UtilityTests/RecordReplayTest.InstrumentedBarPtr (897 of 2410)
PASS: lldb-unit :: Utility/./UtilityTests/StreamTest.Indent (898 of 2410)
PASS: lldb-api :: lang/cpp/unique-types/TestUniqueTypes.py (899 of 2410)
PASS: lldb-unit :: UnwindAssembly/x86/./UnwindAssemblyx86Tests/Testx86AssemblyInspectionEngine.TestSubRSP (900 of 2410)
PASS: lldb-api :: functionalities/breakpoint/breakpoint_command/TestBreakpointCommandsFromPython.py (901 of 2410)
PASS: lldb-api :: commands/watchpoints/step_over_watchpoint/TestStepOverWatchpoint.py (902 of 2410)
PASS: lldb-unit :: Utility/./UtilityTests/ArchSpecTest.YAML (903 of 2410)
PASS: lldb-api :: lang/objc/objc-super/TestObjCSuper.py (904 of 2410)
PASS: lldb-api :: commands/disassemble/basic/TestDisassembleBreakpoint.py (905 of 2410)
PASS: lldb-unit :: Utility/./UtilityTests/DataExtractorTest.GetCStrAtNullOffset (906 of 2410)
PASS: lldb-unit :: ScriptInterpreter/Python/./ScriptInterpreterPythonTests/PythonDataObjectsTest.TestPythonBoolean (907 of 2410)
PASS: lldb-shell :: ObjectFile/Breakpad/sections-trailing-func.test (908 of 2410)
PASS: lldb-api :: commands/expression/test/TestExprs.py (909 of 2410)
PASS: lldb-shell :: SymbolFile/Breakpad/stack-cfi-parsing.test (910 of 2410)
PASS: lldb-unit :: Utility/./UtilityTests/StringListTest.InsertStringAtIndexStart (911 of 2410)
PASS: lldb-unit :: Expression/./ExpressionTests/DWARFExpressionMockProcessTest.DW_OP_deref (912 of 2410)
PASS: lldb-api :: commands/add-dsym/uuid/TestAddDsymCommand.py (913 of 2410)
PASS: lldb-api :: python_api/watchpoint/TestWatchpointIgnoreCount.py (914 of 2410)
PASS: lldb-unit :: Process/gdb-remote/./ProcessGdbRemoteTests/GDBRemoteCommunicationClientTest.WriteMemoryTags (915 of 2410)
PASS: lldb-unit :: Utility/./UtilityTests/DataExtractorTest.GetDoubleUnaligned (916 of 2410)
PASS: lldb-unit :: Utility/./UtilityTests/StringExtractorTest.GetHexBytes_Underflow (917 of 2410)
PASS: lldb-shell :: Breakpoint/debug_rnglist_basic.test (918 of 2410)
PASS: lldb-unit :: Utility/./UtilityTests/RegularExpression.Match (919 of 2410)
PASS: lldb-api :: commands/expression/import-std-module/unique_ptr-dbg-info-content/TestUniquePtrDbgInfoContent.py (920 of 2410)
PASS: lldb-api :: lang/objc/global_ptrs/TestGlobalObjects.py (921 of 2410)
PASS: lldb-unit :: Process/Utility/./ProcessUtilityTests/ProcSMapTests/LinuxProcSMapsTestFixture.ParseSMapRegions/1 (922 of 2410)
PASS: lldb-unit :: Process/gdb-remote/./ProcessGdbRemoteTests/GDBRemoteClientBaseTest.SendContinueAndInterrupt2PacketBug (923 of 2410)
PASS: lldb-unit :: Utility/./UtilityTests/ArgsTest.StringListConstructor (924 of 2410)
PASS: lldb-unit :: debugserver/./debugserverTests/RNBSocket.LoopBackListenIPv4 (925 of 2410)
PASS: lldb-api :: commands/expression/invalid-args/TestInvalidArgsExpression.py (926 of 2410)
PASS: lldb-unit :: ObjectFile/PECOFF/./ObjectFilePECOFFTests/PECallFrameInfoTest.Basic_eh (927 of 2410)
PASS: lldb-api :: lang/cpp/template-function/TestTemplateFunctions.py (928 of 2410)
PASS: lldb-unit :: ScriptInterpreter/Python/./ScriptInterpreterPythonTests/PythonDataObjectsTest.TestPythonString (929 of 2410)
PASS: lldb-unit :: Symbol/./SymbolTests/TestTypeSystemClang.TestGetTypeClassNested (930 of 2410)
PASS: lldb-api :: functionalities/data-formatter/data-formatter-proper-plurals/TestFormattersOneIsSingular.py (931 of 2410)
PASS: lldb-api :: functionalities/data-formatter/nsarraysynth/TestNSArraySynthetic.py (932 of 2410)
PASS: lldb-unit :: Utility/./UtilityTests/DataExtractorTest.GetCStr (933 of 2410)
UNSUPPORTED: lldb-api :: tools/lldb-server/registers-target-xml-reading/TestGdbRemoteTargetXmlPacket.py (934 of 2410)
PASS: lldb-api :: functionalities/data-formatter/summary-string-onfail/Test-rdar-9974002.py (935 of 2410)
PASS: lldb-unit :: Host/./HostTests/File.GetWaitableHandleFileno (936 of 2410)
PASS: lldb-api :: python_api/function_symbol/TestDisasmAPI.py (937 of 2410)
PASS: lldb-api :: functionalities/unwind/noreturn/module-end/TestNoReturnModuleEnd.py (938 of 2410)
UNSUPPORTED: lldb-api :: functionalities/thread/state/TestThreadStates.py (939 of 2410)
PASS: lldb-unit :: Utility/./UtilityTests/ArgsTest.TestArgv (940 of 2410)
PASS: lldb-api :: commands/expression/deleting-implicit-copy-constructor/TestDeletingImplicitCopyConstructor.py (941 of 2410)
PASS: lldb-unit :: Symbol/./SymbolTests/TestTypeSystemClang.TestGetEnumIntegerTypeBasicTypes (942 of 2410)
PASS: lldb-unit :: Host/./HostTests/NativeProcessProtocolTest.ReadMemoryWithoutTrap (943 of 2410)
PASS: lldb-shell :: Register/Core/x86-32-linux-gp.test (944 of 2410)
PASS: lldb-api :: functionalities/gdb_remote_client/TestArmRegisterDefinition.py (945 of 2410)
PASS: lldb-api :: macosx/debugserver-exit-code/TestDebugServerExitCode.py (946 of 2410)
PASS: lldb-api :: lang/objcxx/conflicting-names-class-update-utility-expr/TestObjCConflictingNamesForClassUpdateExpr.py (947 of 2410)
PASS: lldb-unit :: UnwindAssembly/x86/./UnwindAssemblyx86Tests/Testx86AssemblyInspectionEngine.TestAddRSP (948 of 2410)
PASS: lldb-unit :: ObjectFile/PECOFF/./ObjectFilePECOFFTests/PECallFrameInfoTest.Chained_eh (949 of 2410)
UNSUPPORTED: lldb-api :: tools/lldb-server/vCont-threads/TestGdbRemote_vContThreads.py (950 of 2410)
PASS: lldb-shell :: Register/Core/x86-32-netbsd-multithread.test (951 of 2410)
PASS: lldb-unit :: Utility/./UtilityTests/StreamTest.PutHex32ByteOrderLittle (952 of 2410)
PASS: lldb-unit :: Utility/./UtilityTests/StringExtractorTest.GetHexBytesAvail_Partial (953 of 2410)
PASS: lldb-unit :: Utility/./UtilityTests/StreamTest.PutCStringWithStringRef (954 of 2410)
PASS: lldb-unit :: UnwindAssembly/x86/./UnwindAssemblyx86Tests/Testx86AssemblyInspectionEngine.TestPopEDI (955 of 2410)
PASS: lldb-api :: lang/cpp/namespace/TestNamespace.py (956 of 2410)
PASS: lldb-unit :: Utility/./UtilityTests/ArgsTest.ReplaceArgumentAtIndexLonger (957 of 2410)
PASS: lldb-api :: lang/objc/cpp_keyword_identifiers/TestCppKeywordsAsObjCIdentifiers.py (958 of 2410)
PASS: lldb-shell :: SymbolFile/DWARF/x86/debug_loc.s (959 of 2410)
PASS: lldb-unit :: Utility/./UtilityTests/CompletionRequest.Constructor (960 of 2410)
PASS: lldb-api :: functionalities/unwind/sigtramp/TestSigtrampUnwind.py (961 of 2410)
PASS: lldb-api :: tools/lldb-vscode/correct-thread/TestVSCode_correct_thread.py (962 of 2410)
PASS: lldb-shell :: lldb-server/TestGdbserverPort.test (963 of 2410)
PASS: lldb-unit :: Utility/./UtilityTests/RangeTest.EqualInvalid (964 of 2410)
PASS: lldb-unit :: Utility/./UtilityTests/StringListTest.LongestCommonPrefixEmpty (965 of 2410)
PASS: lldb-api :: functionalities/plugins/python_os_plugin/TestPythonOSPlugin.py (966 of 2410)
UNSUPPORTED: lldb-api :: commands/trace/TestTraceStartStop.py (967 of 2410)
PASS: lldb-api :: macosx/thread-names/TestInterruptThreadNames.py (968 of 2410)
PASS: lldb-api :: functionalities/breakpoint/breakpoint_language/TestBreakpointLanguage.py (969 of 2410)
UNSUPPORTED: lldb-api :: functionalities/tsan/thread_leak/TestTsanThreadLeak.py (970 of 2410)
PASS: lldb-shell :: SymbolFile/DWARF/x86/dir-separator-no-comp-dir-relative-name.s (971 of 2410)
PASS: lldb-unit :: Utility/./UtilityTests/RangeTest.DoesIntersect (972 of 2410)
PASS: lldb-unit :: Utility/./UtilityTests/EnvironmentTest.EnvpConversion (973 of 2410)
PASS: lldb-api :: functionalities/data-formatter/nsdictionarysynth/TestNSDictionarySynthetic.py (974 of 2410)
PASS: lldb-unit :: Utility/./UtilityTests/Flags.AllSet (975 of 2410)
PASS: lldb-api :: commands/expression/import-std-module/conflicts/TestStdModuleWithConflicts.py (976 of 2410)
PASS: lldb-api :: tools/lldb-server/TestGdbRemoteAttachWait.py (977 of 2410)
PASS: lldb-api :: lang/cpp/pointer_to_member_type_depending_on_parent_size/TestPointerToMemberTypeDependingOnParentSize.py (978 of 2410)
PASS: lldb-unit :: Utility/./UtilityTests/SubsystemRAIITest.NormalSubsystem (979 of 2410)
PASS: lldb-unit :: Host/./HostTests/PipeTest.OpenAsReader (980 of 2410)
PASS: lldb-unit :: Utility/./UtilityTests/ArchSpecTest.TripleComponentsWereSpecified (981 of 2410)
PASS: lldb-shell :: ObjectFile/PECOFF/section-types.yaml (982 of 2410)
PASS: lldb-api :: lang/objc/self/TestObjCSelf.py (983 of 2410)
PASS: lldb-unit :: Process/gdb-remote/./ProcessGdbRemoteTests/GDBRemoteClientBaseTest.SendContinueAndAsyncPacket (984 of 2410)
PASS: lldb-unit :: Language/CLanguages/./LanguageCLanguagesTests/CLanguages.LookupCLanguagesByLanguageType (985 of 2410)
UNSUPPORTED: lldb-shell :: ScriptInterpreter/Lua/quit.test (986 of 2410)
PASS: lldb-shell :: SymbolFile/DWARF/x86/DW_AT_declaration-with-children.s (987 of 2410)
PASS: lldb-unit :: Utility/./UtilityTests/StringListTest.InsertStringAtIndexMove (988 of 2410)
PASS: lldb-api :: lang/mixed/TestMixedLanguages.py (989 of 2410)
PASS: lldb-api :: functionalities/load_unload/TestLoadUnload.py (990 of 2410)
PASS: lldb-api :: commands/process/launch/TestProcessLaunch.py (991 of 2410)
PASS: lldb-unit :: UnwindAssembly/x86/./UnwindAssemblyx86Tests/Testx86AssemblyInspectionEngine.TestPushEBP (992 of 2410)
UNSUPPORTED: lldb-api :: commands/register/register/aarch64_sve_registers/rw_access_static_config/TestSVERegisters.py (993 of 2410)
PASS: lldb-unit :: Utility/./UtilityTests/VASprintfTest.BufferResize (994 of 2410)
UNSUPPORTED: lldb-shell :: ScriptInterpreter/Lua/io.test (995 of 2410)
PASS: lldb-unit :: Platform/Android/./AdbClientTests/AdbClientTest.CreateByDeviceId (996 of 2410)
PASS: lldb-unit :: Signals/./SignalsTests/UnixSignalsTest.GetFilteredSignals (997 of 2410)
PASS: lldb-api :: python_api/sberror/TestSBError.py (998 of 2410)
PASS: lldb-api :: commands/target/stop-hooks/TestStopHookScripted.py (999 of 2410)
PASS: lldb-unit :: Utility/./UtilityTests/RecordReplayTest.InstrumentedBarRef (1000 of 2410)
UNSUPPORTED: lldb-shell :: Subprocess/fork-follow-child-wp.test (1001 of 2410)
PASS: lldb-unit :: SymbolFile/DWARF/./SymbolFileDWARFTests/XcodeSDKModuleTests.TestModuleGetXcodeSDK (1002 of 2410)
PASS: lldb-shell :: SymbolFile/DWARF/x86/dwp.s (1003 of 2410)
PASS: lldb-api :: functionalities/thread/concurrent_events/TestConcurrentDelayedCrashWithBreakpointWatchpoint.py (1004 of 2410)
PASS: lldb-shell :: Breakpoint/debug_rnglist_offset_pair.test (1005 of 2410)
PASS: lldb-api :: tools/lldb-vscode/breakpoint/TestVSCode_setBreakpoints.py (1006 of 2410)
PASS: lldb-api :: python_api/lldbutil/iter/TestRegistersIterator.py (1007 of 2410)
UNSUPPORTED: lldb-api :: commands/platform/connect/TestPlatformConnect.py (1008 of 2410)
PASS: lldb-unit :: DataFormatter/./LLDBFormatterTests/TypeMatcherTests.CreatedBySameMatchStringExactNamePrefixes (1009 of 2410)
PASS: lldb-api :: commands/expression/import-std-module/weak_ptr-dbg-info-content/TestDbgInfoContentWeakPtrFromStdModule.py (1010 of 2410)
PASS: lldb-unit :: Utility/./UtilityTests/AnsiTerminal.AtStart (1011 of 2410)
PASS: lldb-unit :: Symbol/./SymbolTests/TestTypeSystemClang.TestGetEnumIntegerTypeUnexpectedType (1012 of 2410)
PASS: lldb-api :: functionalities/non-overlapping-index-variable-i/TestIndexVariable.py (1013 of 2410)
PASS: lldb-api :: lang/cpp/dynamic-value-same-basename/TestDynamicValueSameBase.py (1014 of 2410)
PASS: lldb-api :: functionalities/data-formatter/data-formatter-enum-format/TestDataFormatterEnumFormat.py (1015 of 2410)
UNSUPPORTED: lldb-api :: tools/lldb-server/TestGdbRemoteModuleInfo.py (1016 of 2410)
PASS: lldb-unit :: Utility/./UtilityTests/StringListTest.JoinEmpty (1017 of 2410)
PASS: lldb-shell :: Commands/command-thread-select.test (1018 of 2410)
PASS: lldb-api :: commands/expression/call-function/TestCallBuiltinFunction.py (1019 of 2410)
PASS: lldb-unit :: Utility/./UtilityTests/RecordReplayTest.InvalidSequence (1020 of 2410)
PASS: lldb-api :: commands/expression/regression-access-function-template-in-record/TestRegressionAccessFunctionTemplateInRecord.py (1021 of 2410)
PASS: lldb-api :: functionalities/data-formatter/data-formatter-stl/libcxx/list/TestDataFormatterLibcxxList.py (1022 of 2410)
UNSUPPORTED: lldb-api :: tools/lldb-server/memory-tagging/TestGdbRemoteMemoryTagging.py (1023 of 2410)
PASS: lldb-unit :: Language/Highlighting/./HighlighterTests/HighlighterTest.ClangStringLiterals (1024 of 2410)
PASS: lldb-api :: python_api/hello_world/TestHelloWorld.py (1025 of 2410)
PASS: lldb-api :: lang/objc/objc-static-method/TestObjCStaticMethod.py (1026 of 2410)
PASS: lldb-api :: functionalities/data-formatter/data-formatter-stl/libcxx/queue/TestDataFormatterLibcxxQueue.py (1027 of 2410)
PASS: lldb-api :: functionalities/breakpoint/breakpoint_locations/TestBreakpointLocations.py (1028 of 2410)
PASS: lldb-unit :: Utility/./UtilityTests/DataExtractorTest.GetCStrUnterminated (1029 of 2410)
PASS: lldb-api :: tools/lldb-server/TestGdbRemote_qThreadStopInfo.py (1030 of 2410)
PASS: lldb-unit :: Utility/./UtilityTests/StringExtractorTest.GetU32LittleEndian (1031 of 2410)
PASS: lldb-api :: lang/objc/objc-optimized/TestObjcOptimized.py (1032 of 2410)
PASS: lldb-shell :: Quit/TestQuitExitCodeTooManyArgs.test (1033 of 2410)
PASS: lldb-unit :: Utility/./UtilityTests/RecordReplayTest.InstrumentedFooSameThis (1034 of 2410)
PASS: lldb-api :: functionalities/gdb_remote_client/TestRestartBug.py (1035 of 2410)
PASS: lldb-shell :: ObjectFile/ELF/PT_LOAD.yaml (1036 of 2410)
PASS: lldb-shell :: Process/UnsupportedLanguage.test (1037 of 2410)
PASS: lldb-shell :: ObjectFile/wasm/basic.yaml (1038 of 2410)
PASS: lldb-shell :: SymbolFile/DWARF/x86/dwo-type-in-main-file.s (1039 of 2410)
UNSUPPORTED: lldb-api :: arm/breakpoint-thumb-codesection/TestBreakpointThumbCodesection.py (1040 of 2410)
PASS: lldb-api :: lang/cpp/offsetof/TestOffsetofCpp.py (1041 of 2410)
PASS: lldb-api :: functionalities/postmortem/minidump-new/TestMiniDumpNew.py (1042 of 2410)
PASS: lldb-shell :: SymbolFile/DWARF/x86/DW_TAG_variable-DW_AT_const_value.s (1043 of 2410)
PASS: lldb-api :: functionalities/data-formatter/data-formatter-stl/libcxx/tuple/TestDataFormatterLibcxxTuple.py (1044 of 2410)
PASS: lldb-shell :: SymbolFile/DWARF/x86/DW_AT_low_pc-addrx.s (1045 of 2410)
PASS: lldb-unit :: Utility/./UtilityTests/RangeDataVector.FindEntryIndexesThatContain (1046 of 2410)
PASS: lldb-unit :: Language/Highlighting/./HighlighterTests/HighlighterTest.ClangCommas (1047 of 2410)
PASS: lldb-api :: functionalities/breakpoint/source_regexp/TestSourceRegexBreakpoints.py (1048 of 2410)
UNSUPPORTED: lldb-shell :: ScriptInterpreter/Lua/partial_statements.test (1049 of 2410)
PASS: lldb-unit :: Symbol/./SymbolTests/PostfixExpression.ParseFPOProgram (1050 of 2410)
PASS: lldb-unit :: UnwindAssembly/x86/./UnwindAssemblyx86Tests/Testx86AssemblyInspectionEngine.TestSubESP (1051 of 2410)
PASS: lldb-unit :: Process/minidump/./LLDBMinidumpTests/MinidumpParserTest.GetExceptionStream (1052 of 2410)
PASS: lldb-shell :: SymbolFile/DWARF/x86/inline-function-address.ll (1053 of 2410)
PASS: lldb-shell :: ObjectFile/PECOFF/sections.yaml (1054 of 2410)
UNSUPPORTED: lldb-api :: functionalities/asan/TestReportData.py (1055 of 2410)
PASS: lldb-api :: types/TestShortTypeExpr.py (1056 of 2410)
PASS: lldb-shell :: BuildScript/script-args.test (1057 of 2410)
UNSUPPORTED: lldb-api :: functionalities/ptrauth_diagnostics/brkC47x_code/TestPtrauthBRKc47xDiagnostic.py (1058 of 2410)
PASS: lldb-api :: commands/target/create-deps/TestTargetCreateDeps.py (1059 of 2410)
PASS: lldb-unit :: Language/CPlusPlus/./LanguageCPlusPlusTests/CPlusPlusLanguage.MethodNameParsing (1060 of 2410)
UNSUPPORTED: lldb-api :: functionalities/ptr_refs/TestPtrRefs.py (1061 of 2410)
PASS: lldb-unit :: Symbol/./SymbolTests/Type.GetTypeScopeAndBasename (1062 of 2410)
PASS: lldb-shell :: Reproducer/TestPythonImport.test (1063 of 2410)
PASS: lldb-unit :: Utility/./UtilityTests/StringExtractorTest.GetHexU8_Exact (1064 of 2410)
PASS: lldb-unit :: Symbol/./SymbolTests/LineEntryTest.GetSameLineContiguousAddressRangeOneInline (1065 of 2410)
PASS: lldb-shell :: ScriptInterpreter/Python/sb_address_exception.test (1066 of 2410)
PASS: lldb-unit :: Utility/./UtilityTests/Flags.AnyClear (1067 of 2410)
PASS: lldb-unit :: Utility/./UtilityTests/UserIDResolver.GetUserName (1068 of 2410)
PASS: lldb-unit :: Utility/./UtilityTests/StreamTest.PutBytesAsRawHex8ToLittleEndian (1069 of 2410)
PASS: lldb-shell :: SymbolFile/Breakpad/unwind-via-raSearch.test (1070 of 2410)
PASS: lldb-unit :: Utility/./UtilityTests/StringListTest.JoinSingle (1071 of 2410)
PASS: lldb-api :: functionalities/backticks/TestBackticksWithoutATarget.py (1072 of 2410)
UNSUPPORTED: lldb-api :: benchmarks/expression/TestRepeatedExprs.py (1073 of 2410)
PASS: lldb-shell :: Settings/TestEchoCommands.test (1074 of 2410)
PASS: lldb-api :: lang/cpp/dereferencing_references/TestCPPDereferencingReferences.py (1075 of 2410)
PASS: lldb-unit :: SymbolFile/NativePDB/./SymbolFileNativePDBTests/PDBFPOProgramToDWARFExpressionTests.UnresolvedCyclicRegisterAssignmentReference (1076 of 2410)
PASS: lldb-api :: tools/lldb-vscode/runInTerminal/TestVSCode_runInTerminal.py (1077 of 2410)
UNSUPPORTED: lldb-shell :: SymbolFile/PDB/compilands.test (1078 of 2410)
PASS: lldb-api :: lang/cpp/class_types/TestClassTypesDisassembly.py (1079 of 2410)
PASS: lldb-api :: functionalities/breakpoint/breakpoint_ignore_count/TestBreakpointIgnoreCount.py (1080 of 2410)
PASS: lldb-api :: macosx/universal/TestUniversal.py (1081 of 2410)
PASS: lldb-unit :: Utility/./UtilityTests/OptionsWithRawTest.QuotedSuffix (1082 of 2410)
UNSUPPORTED: lldb-shell :: SymbolFile/DWARF/split-dwarf-expression-eval-bug.cpp (1083 of 2410)
UNSUPPORTED: lldb-api :: iohandler/resize/TestIOHandlerResize.py (1084 of 2410)
UNSUPPORTED: lldb-api :: commands/expression/multiline-completion/TestMultilineCompletion.py (1085 of 2410)
PASS: lldb-unit :: Core/./LLDBCoreTests/SourceLocationSpecTest.FileLineColumnComponents (1086 of 2410)
PASS: lldb-unit :: Symbol/./SymbolTests/TestTypeSystemClang.TestGetBasicTypeFromEnum (1087 of 2410)
UNSUPPORTED: lldb-shell :: SymbolFile/PDB/udt-layout.test (1088 of 2410)
PASS: lldb-unit :: UnwindAssembly/x86/./UnwindAssemblyx86Tests/Testx86AssemblyInspectionEngine.Testi386IgnoredRegisters (1089 of 2410)
PASS: lldb-shell :: Register/Core/x86-64-netbsd-fp.test (1090 of 2410)
XFAIL: lldb-shell :: Register/x86-64-fp-write.test (1091 of 2410)
PASS: lldb-unit :: Utility/./UtilityTests/StringExtractorTest.DecodeHexU8_InvalidHex (1092 of 2410)
PASS: lldb-shell :: SymbolFile/DWARF/x86/debug-line-basic.s (1093 of 2410)
PASS: lldb-api :: commands/expression/function_template_specialization_temp_args/TestFunctionTemplateSpecializationTempArgs.py (1094 of 2410)
PASS: lldb-unit :: Expression/./ExpressionTests/DiagnosticManagerTest.PutStringMultiple (1095 of 2410)
PASS: lldb-unit :: Core/./LLDBCoreTests/ModuleSpecTest.InvalidInMemoryBufferValidFile (1096 of 2410)
PASS: lldb-api :: lang/objc/hidden-ivars/TestHiddenIvars.py (1097 of 2410)
PASS: lldb-api :: commands/settings/use_source_cache/TestUseSourceCache.py (1098 of 2410)
PASS: lldb-api :: lang/objc/objc-new-syntax/TestObjCNewSyntaxDictionary.py (1099 of 2410)
PASS: lldb-shell :: Commands/command-source.test (1100 of 2410)
PASS: lldb-unit :: Host/./HostTests/SocketTests/SocketTest.TCPGetConnectURI/ipv6 (1101 of 2410)
PASS: lldb-shell :: Commands/command-regex-unalias.test (1102 of 2410)
PASS: lldb-unit :: Process/minidump/./LLDBMinidumpTests/MinidumpParserTest.GetLinuxProcStatus (1103 of 2410)
PASS: lldb-unit :: Process/gdb-remote/./ProcessGdbRemoteTests/GDBRemoteClientBaseTest.SendContinueAndLateInterrupt (1104 of 2410)
PASS: lldb-unit :: Utility/./UtilityTests/StringListTest.AppendListCStringArrayEmpty (1105 of 2410)
PASS: lldb-shell :: Register/Core/x86-64-freebsd-addr.test (1106 of 2410)
PASS: lldb-unit :: Utility/./UtilityTests/StreamTest.AddressSize (1107 of 2410)
PASS: lldb-api :: functionalities/object-file/TestImageListMultiArchitecture.py (1108 of 2410)
PASS: lldb-api :: lang/c/stepping/TestThreadStepInAvoidRegexp.py (1109 of 2410)
PASS: lldb-api :: commands/frame/diagnose/local-variable/TestLocalVariable.py (1110 of 2410)
PASS: lldb-shell :: Process/TestEnvironment.test (1111 of 2410)
PASS: lldb-api :: functionalities/thread/concurrent_events/TestConcurrentSignalNWatchNBreak.py (1112 of 2410)
PASS: lldb-shell :: Reproducer/TestDSYM.test (1113 of 2410)
PASS: lldb-unit :: Utility/./UtilityTests/ScalarTest.Equality (1114 of 2410)
PASS: lldb-api :: commands/target/stop-hooks/TestStopHooks.py (1115 of 2410)
PASS: lldb-api :: commands/expression/import-std-module/vector-of-vectors/TestVectorOfVectorsFromStdModule.py (1116 of 2410)
PASS: lldb-api :: macosx/lc-note/firmware-corefile/TestFirmwareCorefiles.py (1117 of 2410)
PASS: lldb-api :: functionalities/data-formatter/hexcaps/TestDataFormatterHexCaps.py (1118 of 2410)
PASS: lldb-unit :: Expression/./ExpressionTests/DWARFExpression.DW_OP_convert (1119 of 2410)
PASS: lldb-unit :: Utility/./UtilityTests/OptionsWithRawTest.MultiWordSuffix (1120 of 2410)
PASS: lldb-api :: functionalities/data-formatter/data-formatter-objc/TestDataFormatterObjNSException.py (1121 of 2410)
PASS: lldb-api :: functionalities/gdb_remote_client/TestRecognizeBreakpoint.py (1122 of 2410)
XFAIL: lldb-shell :: Register/x86-64-ymm-write.test (1123 of 2410)
UNSUPPORTED: lldb-api :: functionalities/dyld-launch-linux/TestDyldLaunchLinux.py (1124 of 2410)
PASS: lldb-unit :: Process/Utility/./ProcessUtilityTests/RegisterContext_x86Test.AbridgedToFullTagWord (1125 of 2410)
PASS: lldb-unit :: Utility/./UtilityTests/UriParserTest.Empty (1126 of 2410)
PASS: lldb-shell :: ObjectFile/ELF/section-permissions.yaml (1127 of 2410)
PASS: lldb-unit :: Process/minidump/./LLDBMinidumpTests/MinidumpParserTest.GetMemoryRegionInfoFromMemoryList (1128 of 2410)
UNSUPPORTED: lldb-shell :: SymbolFile/PDB/func-symbols.test (1129 of 2410)
PASS: lldb-unit :: ScriptInterpreter/Python/./ScriptInterpreterPythonTests/PythonDataObjectsTest.TestModuleNameResolutionNoDot (1130 of 2410)
PASS: lldb-api :: commands/thread/select/TestThreadSelect.py (1131 of 2410)
PASS: lldb-shell :: SymbolFile/DWARF/x86/dwarf5-atomic.s (1132 of 2410)
PASS: lldb-unit :: Utility/./UtilityTests/UriParserTest.PortOverflow (1133 of 2410)
PASS: lldb-api :: commands/session/save/TestSessionSave.py (1134 of 2410)
PASS: lldb-shell :: Breakpoint/jit-loader_rtdyld_elf.test (1135 of 2410)
PASS: lldb-shell :: ObjectFile/ELF/PT_LOAD-overlap-PT_TLS.yaml (1136 of 2410)
PASS: lldb-unit :: Utility/./UtilityTests/CompletionRequest.FakeLastArg (1137 of 2410)
PASS: lldb-api :: functionalities/thread_plan/TestThreadPlanCommands.py (1138 of 2410)
PASS: lldb-unit :: ScriptInterpreter/Python/./ScriptInterpreterPythonTests/PythonDataObjectsTest.TestPythonIntegerToStr (1139 of 2410)
PASS: lldb-api :: commands/expression/completion-in-lambda-and-unnamed-class/TestCompletionInLambdaAndUnnamedClass.py (1140 of 2410)
PASS: lldb-unit :: Host/./HostTests/SocketTests/SocketTest.TCPListen0ConnectAccept/ipv4 (1141 of 2410)
PASS: lldb-unit :: debugserver/./debugserverTests/RNBSocket.LoopBackConnectIPv6 (1142 of 2410)
PASS: lldb-unit :: Process/minidump/./LLDBMinidumpTests/MinidumpParserTest.InvalidMinidump (1143 of 2410)
PASS: lldb-unit :: Expression/./ExpressionTests/CppModuleConfigurationTest.LibCppV2 (1144 of 2410)
PASS: lldb-shell :: ScriptInterpreter/Python/fail_breakpoint_oneline.test (1145 of 2410)
PASS: lldb-shell :: SymbolFile/NativePDB/function-types-classes.cpp (1146 of 2410)
PASS: lldb-unit :: Utility/./UtilityTests/RegularExpression.Invalid (1147 of 2410)
PASS: lldb-unit :: Utility/./UtilityTests/BinaryStreamTest.PutSLEB128MaxValue (1148 of 2410)
PASS: lldb-api :: python_api/objc_type/TestObjCType.py (1149 of 2410)
PASS: lldb-unit :: Utility/./UtilityTests/StringExtractorTest.GetHexBytes_Partial (1150 of 2410)
PASS: lldb-unit :: Utility/./UtilityTests/ScalarTest.TruncOrExtendTo (1151 of 2410)
PASS: lldb-unit :: Host/./HostTests/SocketTests/SocketTest.UDPConnect/ipv6 (1152 of 2410)
PASS: lldb-shell :: ObjectFile/PDB/object.test (1153 of 2410)
PASS: lldb-unit :: Expression/./ExpressionTests/CppModuleConfigurationTest.UnrelatedLibrary (1154 of 2410)
PASS: lldb-shell :: Register/Core/x86-64-freebsd-gp.test (1155 of 2410)
UNSUPPORTED: lldb-api :: commands/trace/TestTraceLoad.py (1156 of 2410)
PASS: lldb-api :: macosx/profile_vrs_detach/TestDetachVrsProfile.py (1157 of 2410)
UNSUPPORTED: lldb-api :: linux/mix-dwo-and-regular-objects/TestMixedDwarfBinary.py (1158 of 2410)
PASS: lldb-unit :: ObjectFile/Breakpad/./ObjectFileBreakpadTests/InfoRecord.parse (1159 of 2410)
PASS: lldb-shell :: ScriptInterpreter/None/import_module.test (1160 of 2410)
PASS: lldb-unit :: Utility/./UtilityTests/CompletionRequest.DuplicateFiltering (1161 of 2410)
PASS: lldb-api :: functionalities/tail_call_frames/disambiguate_call_site/TestDisambiguateCallSite.py (1162 of 2410)
PASS: lldb-shell :: Breakpoint/single-file-split-dwarf.test (1163 of 2410)
PASS: lldb-unit :: Process/minidump/./LLDBMinidumpTests/MinidumpParserTest.GetThreadsAndGetThreadContext (1164 of 2410)
PASS: lldb-api :: functionalities/breakpoint/scripted_bkpt/TestScriptedResolver.py (1165 of 2410)
PASS: lldb-unit :: Symbol/./SymbolTests/TestTypeSystemClang.TestGetTypeClassTypeOf (1166 of 2410)
PASS: lldb-unit :: Utility/./UtilityTests/StreamTeeTest.CopyConstructor (1167 of 2410)
PASS: lldb-unit :: Utility/./UtilityTests/UriParserTest.LongPath (1168 of 2410)
PASS: lldb-api :: commands/expression/unwind_expression/TestUnwindExpression.py (1169 of 2410)
PASS: lldb-unit :: Expression/./ExpressionTests/DiagnosticManagerTest.GetStringSeverityLabels (1170 of 2410)
PASS: lldb-api :: commands/expression/import-std-module/forward_list/TestForwardListFromStdModule.py (1171 of 2410)
PASS: lldb-shell :: Minidump/Windows/broken-unwind.test (1172 of 2410)
PASS: lldb-api :: functionalities/thread/concurrent_events/TestConcurrentDelayWatchBreak.py (1173 of 2410)
PASS: lldb-unit :: Core/./LLDBCoreTests/SourceFileCache.FindSourceFileNotFound (1174 of 2410)
PASS: lldb-shell :: Error/assert.test (1175 of 2410)
PASS: lldb-unit :: Utility/./UtilityTests/StreamTest.AddressSuffix (1176 of 2410)
PASS: lldb-unit :: SymbolFile/DWARF/./SymbolFileDWARFTests/DWARFDIETest.ChildIteration (1177 of 2410)
PASS: lldb-unit :: Expression/./ExpressionTests/CppModuleConfigurationTest.Linux (1178 of 2410)
FAIL: lldb-unit :: Host/./HostTests/SocketTests/SocketTest.DomainGetConnectURI/ipv6 (1179 of 2410)
******************** TEST 'lldb-unit :: Host/./HostTests/SocketTests/SocketTest.DomainGetConnectURI/ipv6' FAILED ********************
Script:
--
/Users/buildslave/jenkins/workspace/lldb-cmake-sanitized/lldb-build/tools/lldb/unittests/Host/./HostTests --gtest_filter=SocketTests/SocketTest.DomainGetConnectURI/ipv6
--
Note: Google Test filter = SocketTests/SocketTest.DomainGetConnectURI/ipv6
[==========] Running 1 test from 1 test suite.
[----------] Global test environment set-up.
[----------] 1 test from SocketTests/SocketTest
[ RUN      ] SocketTests/SocketTest.DomainGetConnectURI/ipv6
/Users/buildslave/jenkins/workspace/lldb-cmake-sanitized/llvm-project/lldb/unittests/Host/SocketTest.cpp:226: Failure
Expected equality of these values:
  socket_b_up->GetRemoteConnectionURI()
    Which is: "unix-connect://\0\0\0\0\0\0\0\0\0\0\0\0\0"
  ""
[  FAILED  ] SocketTests/SocketTest.DomainGetConnectURI/ipv6, where GetParam() = 32-byte object <01-BE BE-BE BE-BE BE-BE 06-3A 3A-31 00-00 00-00 A0-95 7B-04 01-00 00-00 7D-19 7C-04 01-00 00-00> (1 ms)
[----------] 1 test from SocketTests/SocketTest (1 ms total)

Hide Details

[----------] Global test environment tear-down [==========] 1 test from 1 test suite ran. (2 ms total) [ PASSED ] 0 tests. [ FAILED ] 1 test, listed below: [ FAILED ] SocketTests/SocketTest.DomainGetConnectURI/ipv6, where GetParam() = 32-byte object <01-BE BE-BE BE-BE BE-BE 06-3A 3A-31 00-00 00-00 A0-95 7B-04 01-00 00-00 7D-19 7C-04 01-00 00-00>

Hide Details

1 FAILED TEST

Hide Details

******************** PASS: lldb-unit :: Host/./HostTests/SocketTests/SocketTest.TCPListen0ConnectAccept/ipv6 (1180 of 2410) PASS: lldb-shell :: Register/Core/x86-32-netbsd-gp.test (1181 of 2410) PASS: lldb-api :: functionalities/thread/thread_specific_break/TestThreadSpecificBreakpoint.py (1182 of 2410) PASS: lldb-api :: functionalities/data-formatter/data-formatter-stl/libcxx/multimap/TestDataFormatterLibccMultiMap.py (1183 of 2410) PASS: lldb-api :: lang/cpp/static_members/TestCPPStaticMembers.py (1184 of 2410) PASS: lldb-api :: tools/lldb-server/TestGdbRemoteAttachOrWait.py (1185 of 2410) PASS: lldb-unit :: Editline/./EditlineTests/EditlineTestFixture.EditlineReceivesSingleLineText (1186 of 2410) PASS: lldb-unit :: Process/gdb-remote/./ProcessGdbRemoteTests/GDBRemoteClientBaseTest.SendContinueAndWait (1187 of 2410) PASS: lldb-shell :: SymbolFile/DWARF/x86/debug-types-dwo-cross-reference.cpp (1188 of 2410) PASS: lldb-unit :: Utility/./UtilityTests/StreamTest.PutSLEB128 (1189 of 2410) PASS: lldb-api :: functionalities/data-formatter/typedef_array/TestTypedefArray.py (1190 of 2410) PASS: lldb-api :: functionalities/data-formatter/data-formatter-script/TestDataFormatterScript.py (1191 of 2410) UNSUPPORTED: lldb-shell :: Watchpoint/netbsd-nouserdbregs.test (1192 of 2410) PASS: lldb-api :: python_api/type/TestTypeList.py (1193 of 2410) PASS: lldb-unit :: Host/./HostTests/SocketTests/SocketTest.TCPListen0GetPort/ipv6 (1194 of 2410) PASS: lldb-api :: functionalities/data-formatter/data-formatter-objc/TestDataFormatterObjCNSBundle.py (1195 of 2410) PASS: lldb-api :: tools/lldb-server/TestAppleSimulatorOSType.py (1196 of 2410) PASS: lldb-shell :: SymbolFile/Breakpad/symtab-macho.test (1197 of 2410) PASS: lldb-shell :: Reproducer/TestVersionCheck.test (1198 of 2410) PASS: lldb-shell :: SymbolFile/DWARF/x86/dir-separator-no-comp-dir.s (1199 of 2410) PASS: lldb-api :: functionalities/thread/concurrent_events/TestConcurrentTwoBreakpointThreads.py (1200 of 2410) PASS: lldb-api :: commands/expression/top-level/TestTopLevelExprs.py (1201 of 2410) PASS: lldb-api :: functionalities/thread/backtrace_limit/TestBacktraceLimit.py (1202 of 2410) PASS: lldb-unit :: Utility/./UtilityTests/ConstStringTest.UpdateMangledCounterpart (1203 of 2410) PASS: lldb-api :: functionalities/gdb_remote_client/TestGDBRemoteDiskFileCompletion.py (1204 of 2410) PASS: lldb-api :: commands/process/attach/attach_denied/TestAttachDenied.py (1205 of 2410) PASS: lldb-api :: lang/cpp/non-type-template-param/TestCppNonTypeTemplateParam.py (1206 of 2410) PASS: lldb-unit :: Core/./LLDBCoreTests/FormatEntityTest.DefinitionConstructionNameTypeData (1207 of 2410) PASS: lldb-api :: functionalities/thread/backtrace_all/TestBacktraceAll.py (1208 of 2410) PASS: lldb-api :: commands/expression/codegen-crash-typedefdecl-not-in_declcontext/TestCodegenCrashTypedefDeclNotInDeclContext.py (1209 of 2410) PASS: lldb-shell :: Settings/TestFrameFormatNoColor.test (1210 of 2410) PASS: lldb-shell :: SymbolFile/DWARF/x86/dwp-debug-types.s (1211 of 2410) PASS: lldb-unit :: Utility/./UtilityTests/VMRange.ContainsRange (1212 of 2410) UNSUPPORTED: lldb-api :: functionalities/breakpoint/hardware_breakpoints/hardware_breakpoint_on_multiple_threads/TestHWBreakMultiThread.py (1213 of 2410) PASS: lldb-unit :: Interpreter/./InterpreterTests/CompletionTest.DirCompletionUsername (1214 of 2410) PASS: lldb-unit :: Utility/./UtilityTests/StreamTeeTest.SetStreamAtIndexOverwrite (1215 of 2410) PASS: lldb-unit :: Host/./HostTests/NativeProcessProtocolTest.ReadCStringFromMemory_CrossPageBoundary (1216 of 2410) PASS: lldb-api :: python_api/value/linked_list/TestValueAPILinkedList.py (1217 of 2410) PASS: lldb-shell :: SymbolFile/NativePDB/globals-bss.cpp (1218 of 2410) UNSUPPORTED: lldb-api :: commands/gui/viewlarge/TestGuiViewLarge.py (1219 of 2410) PASS: lldb-unit :: UnwindAssembly/x86/./UnwindAssemblyx86Tests/Testx86AssemblyInspectionEngine.TestPushR12 (1220 of 2410) PASS: lldb-unit :: Symbol/./SymbolTests/DWARFCallFrameInfoTest.Basic_eh (1221 of 2410) PASS: lldb-unit :: Utility/./UtilityTests/ArgsTest.TestSingleQuotedArgWithSpace (1222 of 2410) PASS: lldb-unit :: Utility/./UtilityTests/UriParserTest.SchemeHostSeparator (1223 of 2410) PASS: lldb-unit :: Process/minidump/./LLDBMinidumpTests/MinidumpParserTest.GetLinuxProcStatus_no_stream (1224 of 2410) PASS: lldb-unit :: UnwindAssembly/x86/./UnwindAssemblyx86Tests/Testx86AssemblyInspectionEngine.TestSpArithx86_64Augmented (1225 of 2410) PASS: lldb-api :: functionalities/return-value/TestReturnValue.py (1226 of 2410) PASS: lldb-api :: commands/expression/import-std-module/deque-dbg-info-content/TestDbgInfoContentDequeFromStdModule.py (1227 of 2410) PASS: lldb-unit :: ScriptInterpreter/Python/./ScriptInterpreterPythonTests/PythonDataObjectsTest.TestPythonListValueEquality (1228 of 2410) UNSUPPORTED: lldb-shell :: SymbolFile/PDB/function-level-linking.test (1229 of 2410) PASS: lldb-shell :: Minidump/memory-region.yaml (1230 of 2410) PASS: lldb-unit :: Process/gdb-remote/./ProcessGdbRemoteTests/GDBRemoteCommunicationClientTest.SyncThreadState (1231 of 2410) PASS: lldb-api :: commands/expression/persistent_types/TestPersistentTypes.py (1232 of 2410) PASS: lldb-shell :: ObjectFile/ELF/netbsd-exec-8.99.30-amd64.yaml (1233 of 2410) PASS: lldb-api :: functionalities/recursion/TestValueObjectRecursion.py (1234 of 2410) PASS: lldb-api :: lang/cpp/keywords_enabled/TestCppKeywordsEnabled.py (1235 of 2410) UNSUPPORTED: lldb-shell :: Register/x86-64-xmm16-read.test (1236 of 2410) UNSUPPORTED: lldb-shell :: ScriptInterpreter/Lua/fail_breakpoint_oneline.test (1237 of 2410) PASS: lldb-unit :: Core/./LLDBCoreTests/DumpDataExtractorTest.NullStream (1238 of 2410) PASS: lldb-shell :: ObjectFile/PECOFF/basic-info.yaml (1239 of 2410) PASS: lldb-api :: functionalities/data-formatter/type_summary_list_arg/TestTypeSummaryListArg.py (1240 of 2410) PASS: lldb-unit :: Utility/./UtilityTests/StreamTest.AddressNoSuffix (1241 of 2410) PASS: lldb-unit :: Utility/./UtilityTests/ProcessInfoTest.Constructor (1242 of 2410) PASS: lldb-unit :: ObjectFile/Breakpad/./ObjectFileBreakpadTests/LineRecord.parse (1243 of 2410) PASS: lldb-unit :: Utility/./UtilityTests/RangeDataVector.FindEntryIndexesThatContain_Overlap (1244 of 2410) PASS: lldb-shell :: Register/Core/x86-32-netbsd-addr.test (1245 of 2410) XFAIL: lldb-shell :: Register/x86-mm-xmm-read.test (1246 of 2410) PASS: lldb-api :: commands/expression/issue_11588/Test11588.py (1247 of 2410) PASS: lldb-unit :: Symbol/./SymbolTests/TestTypeSystemClang.TestFunctionTemplateInRecordConstruction (1248 of 2410) PASS: lldb-unit :: Expression/./ExpressionTests/DiagnosticManagerTest.GetStringPreserveOrder (1249 of 2410) PASS: lldb-unit :: Utility/./UtilityTests/SerializationRountripTest.SerializeDeserializeObjectReference (1250 of 2410) PASS: lldb-api :: python_api/symbol-context/TestSymbolContext.py (1251 of 2410) PASS: lldb-api :: tools/lldb-vscode/attach/TestVSCode_attach.py (1252 of 2410) PASS: lldb-unit :: Utility/./UtilityTests/ScalarTest.ComparisonFloat (1253 of 2410) UNSUPPORTED: lldb-shell :: ScriptInterpreter/Lua/breakpoint_oneline_callback.test (1254 of 2410) PASS: lldb-api :: functionalities/reproducers/fs-case-sensitivity/TestReproducerFSCaseSensitivity.py (1255 of 2410) PASS: lldb-unit :: Utility/./UtilityTests/FileSpecTest.PrependPathComponent (1256 of 2410) PASS: lldb-unit :: Utility/./UtilityTests/OptionsWithRawTest.WhitespaceInput (1257 of 2410) PASS: lldb-unit :: Utility/./UtilityTests/VMRange.Clear (1258 of 2410) UNSUPPORTED: lldb-shell :: Register/x86-64-ymm16-read.test (1259 of 2410) PASS: lldb-shell :: Register/Core/x86-32-linux-multithread.test (1260 of 2410) PASS: lldb-api :: functionalities/data-formatter/poarray/TestPrintObjectArray.py (1261 of 2410) PASS: lldb-api :: lang/objc/modules/TestObjCModules.py (1262 of 2410) PASS: lldb-unit :: Utility/./UtilityTests/StringListTest.AppendList (1263 of 2410) PASS: lldb-unit :: Core/./LLDBCoreTests/FormatEntityTest.DefinitionConstructionNameAndType (1264 of 2410) PASS: lldb-unit :: Utility/./UtilityTests/CompletionRequest.TryCompleteCurrentArgBad (1265 of 2410) PASS: lldb-shell :: SymbolFile/DWARF/x86/debug_loclists-dwp.s (1266 of 2410) PASS: lldb-unit :: Utility/./UtilityTests/XcodeSDKTest.MergeTest (1267 of 2410) UNSUPPORTED: lldb-api :: benchmarks/expression/TestExpressionCmd.py (1268 of 2410) PASS: lldb-api :: functionalities/memory/tag/TestMemoryTag.py (1269 of 2410) UNSUPPORTED: lldb-shell :: SymbolFile/NativePDB/ast-functions-msvc.cpp (1270 of 2410) PASS: lldb-api :: macosx/macCatalyst/TestMacCatalyst.py (1271 of 2410) PASS: lldb-unit :: Utility/./UtilityTests/StringListTest.CopyList (1272 of 2410) PASS: lldb-shell :: SymbolFile/DWARF/x86/split-dwarf-inlining.cpp (1273 of 2410) PASS: lldb-api :: commands/target/stop-hook/disable/TestTargetStopHookDisable.py (1274 of 2410) PASS: lldb-unit :: UnwindAssembly/x86/./UnwindAssemblyx86Tests/Testx86AssemblyInspectionEngine.TestPush0 (1275 of 2410) PASS: lldb-shell :: ObjectFile/ELF/compressed-sections.yaml (1276 of 2410) UNSUPPORTED: lldb-api :: tools/lldb-server/TestGdbRemoteFork.py (1277 of 2410) XFAIL: lldb-shell :: Register/x86-fp-write.test (1278 of 2410) PASS: lldb-shell :: Minidump/memory-region-from-module.yaml (1279 of 2410) UNSUPPORTED: lldb-api :: tools/lldb-server/TestGdbRemotePlatformFile.py (1280 of 2410) PASS: lldb-unit :: Expression/./ExpressionTests/DiagnosticManagerTest.HasFixits (1281 of 2410) PASS: lldb-shell :: Commands/command-script-import.test (1282 of 2410) PASS: lldb-api :: python_api/target/TestTargetAPI.py (1283 of 2410) PASS: lldb-shell :: Unwind/eh-frame-dwarf-unwind.test (1284 of 2410) UNSUPPORTED: lldb-shell :: SymbolFile/NativePDB/stack_unwinding01.cpp (1285 of 2410) UNSUPPORTED: lldb-shell :: ScriptInterpreter/Lua/persistent_state.test (1286 of 2410) PASS: lldb-unit :: Utility/./UtilityTests/StringExtractorTest.DecodeHexU8_Underflow2 (1287 of 2410) PASS: lldb-api :: lang/cpp/frame-var-anon-unions/TestFrameVariableAnonymousUnions.py (1288 of 2410) PASS: lldb-unit :: Utility/./UtilityTests/ScalarTest.Promotion (1289 of 2410) UNSUPPORTED: lldb-shell :: Register/x86-64-zmm-write.test (1290 of 2410) PASS: lldb-unit :: Utility/./UtilityTests/StringListTest.AppendStringCString (1291 of 2410) PASS: lldb-unit :: Language/Highlighting/./HighlighterTests/HighlighterTest.DefaultHighlighterWithCursor (1292 of 2410) PASS: lldb-api :: commands/command/invalid-args/TestInvalidArgsCommand.py (1293 of 2410) PASS: lldb-unit :: Core/./LLDBCoreTests/ModuleSpecTest.TestMachOFile (1294 of 2410) PASS: lldb-shell :: ObjectFile/MachO/lc_build_version.yaml (1295 of 2410) PASS: lldb-unit :: Utility/./UtilityTests/ArchSpecTest.MergeFromMachOUnknown (1296 of 2410) PASS: lldb-api :: lang/objc/objc_direct-methods/TestObjCDirectMethods.py (1297 of 2410) PASS: lldb-api :: commands/frame/recognizer/TestFrameRecognizer.py (1298 of 2410) PASS: lldb-unit :: Process/minidump/./LLDBMinidumpTests/MinidumpParserTest.GetMemoryRegionInfoLinuxMaps (1299 of 2410) PASS: lldb-unit :: Utility/./UtilityTests/StreamTeeTest.AppendStream (1300 of 2410) PASS: lldb-unit :: Process/minidump/./LLDBMinidumpTests/MinidumpParserTest.GetMemoryRegionInfoLinuxMapsError (1301 of 2410) PASS: lldb-api :: python_api/sbvalue_const_addrof/TestSBValueConstAddrOf.py (1302 of 2410) PASS: lldb-api :: functionalities/show_location/TestShowLocationDwarf5.py (1303 of 2410) PASS: lldb-unit :: Utility/./UtilityTests/NameMatchesTest.StartsWith (1304 of 2410) PASS: lldb-api :: lang/cpp/limit-debug-info/TestWithLimitDebugInfo.py (1305 of 2410) PASS: lldb-unit :: Expression/./ExpressionTests/DiagnosticManagerTest.GetStringNoDiags (1306 of 2410) PASS: lldb-shell :: ExecControl/StopHook/stop-hook.test (1307 of 2410) PASS: lldb-shell :: ObjectFile/ELF/short-build-id.yaml (1308 of 2410) PASS: lldb-unit :: Process/Utility/./ProcessUtilityTests/MemoryTagManagerAArch64MTETest.ExpandToGranule (1309 of 2410) UNSUPPORTED: lldb-api :: tools/lldb-vscode/completions/TestVSCode_completions.py (1310 of 2410) PASS: lldb-api :: functionalities/mtc/simple/TestMTCSimple.py (1311 of 2410) PASS: lldb-api :: commands/target/stop-hook/enable/TestTargetStopHookEnable.py (1312 of 2410) PASS: lldb-api :: lang/cpp/inlines/TestInlines.py (1313 of 2410) PASS: lldb-api :: commands/expression/import-std-module/forward_decl_from_module/TestForwardDeclFromStdModule.py (1314 of 2410) PASS: lldb-api :: functionalities/data-formatter/data-formatter-stl/libcxx/forward_list/TestDataFormatterLibcxxForwardList.py (1315 of 2410) PASS: lldb-api :: functionalities/breakpoint/inlined_breakpoints/TestInlinedBreakpoints.py (1316 of 2410) PASS: lldb-unit :: Target/./TargetTests/MemoryRegionInfoTest.Formatv (1317 of 2410) PASS: lldb-shell :: Driver/TestConvenienceVariables.test (1318 of 2410) PASS: lldb-api :: lang/objc/objc-ivar-offsets/TestObjCIvarOffsets.py (1319 of 2410) PASS: lldb-api :: commands/target/select/TestTargetSelect.py (1320 of 2410) PASS: lldb-api :: commands/reproducer/invalid-args/TestInvalidArgsReproducer.py (1321 of 2410) PASS: lldb-api :: commands/expression/call-throws/TestCallThatThrows.py (1322 of 2410) PASS: lldb-unit :: Utility/./UtilityTests/StringLexerTest.HasAtLeast (1323 of 2410) UNSUPPORTED: lldb-shell :: Register/x86-ymm-read.test (1324 of 2410) PASS: lldb-unit :: Target/./TargetTests/PathMappingListTest.RelativeTests (1325 of 2410) PASS: lldb-api :: functionalities/inferior-changed/TestInferiorChanged.py (1326 of 2410) PASS: lldb-shell :: Register/Core/x86-64-linux-gp.test (1327 of 2410) PASS: lldb-api :: functionalities/gdb_remote_client/TestPlatformClient.py (1328 of 2410) PASS: lldb-unit :: Process/Utility/./ProcessUtilityTests/RegisterContext_x86Test.FullToAbridgedTagWord (1329 of 2410) PASS: lldb-unit :: Utility/./UtilityTests/VMRange.CollectionContains (1330 of 2410) PASS: lldb-unit :: Host/./HostTests/SocketTests/SocketTest.TCPGetConnectURI/ipv4 (1331 of 2410) PASS: lldb-unit :: Utility/./UtilityTests/BinaryStreamTest.PutULEB128OneByte (1332 of 2410) PASS: lldb-shell :: SymbolFile/DWARF/x86/find-method.cpp (1333 of 2410) PASS: lldb-shell :: SymbolFile/DWARF/x86/dwarf5_tu_index_abbrev_offset.s (1334 of 2410) PASS: lldb-api :: python_api/sbdata/TestSBData.py (1335 of 2410) PASS: lldb-unit :: Utility/./UtilityTests/BinaryStreamTest.PutSLEB128ThreeBytes (1336 of 2410) PASS: lldb-unit :: Language/CPlusPlus/./LanguageCPlusPlusTests/CPlusPlusLanguage.CPlusPlusNameParser (1337 of 2410) PASS: lldb-unit :: Utility/./UtilityTests/UriParserTest.BracketedHostname (1338 of 2410) PASS: lldb-api :: python_api/interpreter/TestCommandInterpreterAPI.py (1339 of 2410) PASS: lldb-unit :: Core/./LLDBCoreTests/SourceLocationSpecTest.OperatorBool (1340 of 2410) PASS: lldb-unit :: Language/Highlighting/./HighlighterTests/HighlighterTest.ClangCursorOutOfBounds (1341 of 2410) PASS: lldb-shell :: SymbolFile/DWARF/x86/parallel-indexing-stress.s (1342 of 2410) PASS: lldb-api :: commands/frame/diagnose/inheritance/TestDiagnoseInheritance.py (1343 of 2410) PASS: lldb-unit :: Utility/./UtilityTests/Predicate.WaitForValueNotEqualTo (1344 of 2410) PASS: lldb-unit :: Language/CPlusPlus/./LanguageCPlusPlusTests/CPlusPlusLanguage.ExtractContextAndIdentifier (1345 of 2410) PASS: lldb-unit :: Process/Utility/./ProcessUtilityTests/ProcSMapTests/LinuxProcSMapsTestFixture.ParseSMapRegions/2 (1346 of 2410) UNSUPPORTED: lldb-api :: functionalities/breakpoint/hardware_breakpoints/write_memory_with_hw_breakpoint/TestWriteMemoryWithHWBreakpoint.py (1347 of 2410) PASS: lldb-api :: lang/objc/modules-app-update/TestClangModulesAppUpdate.py (1348 of 2410) PASS: lldb-unit :: Host/./HostTests/NativeProcessProtocolTest.SetBreakpointFailVerify (1349 of 2410) PASS: lldb-api :: lang/cpp/gmodules-templates/TestGModules.py (1350 of 2410) PASS: lldb-shell :: ObjectFile/ELF/section-addresses.yaml (1351 of 2410) PASS: lldb-api :: functionalities/thread/concurrent_events/TestConcurrentTwoWatchpointsOneBreakpoint.py (1352 of 2410) PASS: lldb-api :: lang/c/strings/TestCStrings.py (1353 of 2410) PASS: lldb-unit :: Utility/./UtilityTests/XcodeSDKTest.SDKSupportsSwift (1354 of 2410) PASS: lldb-unit :: Utility/./UtilityTests/StringListTest.SplitIntoLinesSingleTrailingCR (1355 of 2410) PASS: lldb-unit :: Utility/./UtilityTests/RangeTest.NotEqual (1356 of 2410) UNSUPPORTED: lldb-shell :: SymbolFile/target-symbols-add-unwind.test (1357 of 2410) PASS: lldb-api :: lang/objc/rdar-10967107/TestRdar10967107.py (1358 of 2410) PASS: lldb-shell :: SymbolFile/NativePDB/break-by-line.cpp (1359 of 2410) PASS: lldb-api :: commands/expression/import-std-module/list-dbg-info-content/TestDbgInfoContentListFromStdModule.py (1360 of 2410) PASS: lldb-unit :: Utility/./UtilityTests/ConstStringTest.FromMidOfBufferStringRef (1361 of 2410) PASS: lldb-unit :: UnwindAssembly/x86/./UnwindAssemblyx86Tests/Testx86AssemblyInspectionEngine.TestSimple32bitFrameFunction (1362 of 2410) PASS: lldb-shell :: SymbolFile/DWARF/x86/gnu-style-compression.cpp (1363 of 2410) PASS: lldb-unit :: Target/./TargetTests/StackFrameRecognizerTest.NullModuleRegex (1364 of 2410) PASS: lldb-unit :: Host/./HostTests/SocketAddressTest.GetAddressInfo (1365 of 2410) PASS: lldb-unit :: Host/./HostTests/Host.WaitStatusFormat (1366 of 2410) PASS: lldb-shell :: SymbolFile/DWARF/x86/DW_OP_piece-smaller-than-struct.s (1367 of 2410) UNSUPPORTED: lldb-shell :: SymbolFile/PDB/ast-restore.test (1368 of 2410) PASS: lldb-unit :: Platform/./LLDBPlatformTests/PlatformAppleSimulatorTest.TestSimHasSimEnvionament (1369 of 2410) UNSUPPORTED: lldb-api :: terminal/TestEditline.py (1370 of 2410) PASS: lldb-shell :: Process/Optimization.test (1371 of 2410) PASS: lldb-api :: functionalities/breakpoint/comp_dir_symlink/TestCompDirSymLink.py (1372 of 2410) PASS: lldb-unit :: Expression/./ExpressionTests/ClangExpressionDeclMapTest.TestUnknownIdentifierLookup (1373 of 2410) PASS: lldb-api :: macosx/version_zero/TestGetVersionZeroVersion.py (1374 of 2410) UNSUPPORTED: lldb-shell :: ScriptInterpreter/Lua/breakpoint_callback.test (1375 of 2410) PASS: lldb-shell :: SymbolFile/DWARF/x86/find-basic-variable.cpp (1376 of 2410) PASS: lldb-unit :: Process/Utility/./ProcessUtilityTests/MemoryTagManagerAArch64MTETest.UnpackTagsData (1377 of 2410) PASS: lldb-api :: functionalities/wrong_commands/TestWrongCommands.py (1378 of 2410) PASS: lldb-unit :: ScriptInterpreter/Python/./ScriptInterpreterPythonTests/PythonDataObjectsTest.TestGlobalNameResolutionWithDot (1379 of 2410) PASS: lldb-unit :: Interpreter/./InterpreterTests/OptionValueFileColonLine.setFromString (1380 of 2410) PASS: lldb-unit :: Utility/./UtilityTests/EnvironmentTest.EnvpConstruction (1381 of 2410) PASS: lldb-api :: lang/cpp/nsimport/TestCppNsImport.py (1382 of 2410) PASS: lldb-unit :: Process/gdb-remote/./ProcessGdbRemoteTests/GDBRemoteCommunicationClientTest.TestPacketSpeedJSON (1383 of 2410) UNSUPPORTED: lldb-api :: commands/trace/TestTraceSchema.py (1384 of 2410) PASS: lldb-unit :: Host/./HostTests/SocketTests/SocketTest.DecodeHostAndPort/ipv6 (1385 of 2410) PASS: lldb-unit :: Utility/./UtilityTests/SubsystemRAIITest.SubsystemWithErrorSuccess (1386 of 2410) PASS: lldb-api :: commands/platform/basic/TestPlatformPython.py (1387 of 2410) PASS: lldb-unit :: Core/./LLDBCoreTests/ModuleSpecTest.TestCOFFFile (1388 of 2410) UNSUPPORTED: lldb-shell :: SymbolFile/PDB/variables-locations.test (1389 of 2410) PASS: lldb-unit :: Utility/./UtilityTests/StringListTest.GetMaxStringLengthMixed (1390 of 2410) PASS: lldb-api :: lang/cpp/thread_local/TestThreadLocal.py (1391 of 2410) PASS: lldb-api :: functionalities/memory/cache/TestMemoryCache.py (1392 of 2410) PASS: lldb-unit :: Utility/./UtilityTests/NameMatchesTest.RegularExpression (1393 of 2410) PASS: lldb-shell :: ObjectFile/ELF/gnu-debuglink.yaml (1394 of 2410) PASS: lldb-api :: lang/objc/objc-stepping/TestObjCStepping.py (1395 of 2410) PASS: lldb-api :: functionalities/thread/concurrent_events/TestConcurrentManyBreakpoints.py (1396 of 2410) PASS: lldb-unit :: Target/./TargetTests/RemoteAwarePlatformTest.TestResolveExecutabelOnClientByPlatform (1397 of 2410) PASS: lldb-api :: python_api/sbtype_typeclass/TestSBTypeTypeClass.py (1398 of 2410) PASS: lldb-shell :: SymbolFile/DWARF/x86/find-variable-file.cpp (1399 of 2410) PASS: lldb-shell :: BuildScript/modes.test (1400 of 2410) PASS: lldb-api :: macosx/thread_suspend/TestInternalThreadSuspension.py (1401 of 2410) PASS: lldb-unit :: ScriptInterpreter/Python/./ScriptInterpreterPythonTests/PythonDataObjectsTest.TestPythonTupleInitializerList2 (1402 of 2410) UNSUPPORTED: lldb-api :: macosx/macCatalystAppMacOSFramework/TestMacCatalystAppWithMacOSFramework.py (1403 of 2410) PASS: lldb-unit :: Utility/./UtilityTests/RangeDataVector.FindEntryThatContains (1404 of 2410) PASS: lldb-unit :: tools/lldb-server/tests/./LLDBServerTests/TestBase.DebugserverEnv (1405 of 2410) PASS: lldb-unit :: ScriptInterpreter/Python/./ScriptInterpreterPythonTests/PythonDataObjectsTest.TestPythonIntegerToStructuredInteger (1406 of 2410) PASS: lldb-unit :: Utility/./UtilityTests/StatusTest.ErrorConversion (1407 of 2410) PASS: lldb-api :: commands/frame/select/TestFrameSelect.py (1408 of 2410) PASS: lldb-unit :: Utility/./UtilityTests/StringExtractorTest.GetHexBytesAvail_OddPair (1409 of 2410) PASS: lldb-api :: api/command-return-object/TestSBCommandReturnObject.py (1410 of 2410) PASS: lldb-shell :: ScriptInterpreter/Python/scripted_breakpoint_lua.test (1411 of 2410) UNSUPPORTED: lldb-shell :: ScriptInterpreter/Lua/print.test (1412 of 2410) PASS: lldb-api :: lang/c/forward/TestForwardDeclaration.py (1413 of 2410) PASS: lldb-api :: functionalities/inline-stepping/TestInlineStepping.py (1414 of 2410) PASS: lldb-shell :: SymbolFile/NativePDB/bitfields.cpp (1415 of 2410) PASS: lldb-api :: functionalities/data-formatter/array_typedef/TestArrayTypedef.py (1416 of 2410) PASS: lldb-shell :: ObjectFile/ELF/PT_LOAD-overlap.yaml (1417 of 2410) UNSUPPORTED: lldb-shell :: Register/x86-fp-read.test (1418 of 2410) UNSUPPORTED: lldb-api :: commands/gui/basicdebug/TestGuiBasicDebug.py (1419 of 2410) PASS: lldb-unit :: Utility/./UtilityTests/RangeTest.Equal (1420 of 2410) UNSUPPORTED: lldb-shell :: ObjectFile/ELF/minidebuginfo-set-and-hit-breakpoint.test (1421 of 2410) UNSUPPORTED: lldb-api :: functionalities/gdb_remote_client/TestQemuAArch64TargetXml.py (1422 of 2410) PASS: lldb-api :: commands/frame/diagnose/dereference-argument/TestDiagnoseDereferenceArgument.py (1423 of 2410) PASS: lldb-api :: lang/objc/foundation/TestSymbolTable.py (1424 of 2410) PASS: lldb-unit :: Process/Utility/./ProcessUtilityTests/MemoryTagManagerAArch64MTETest.AddressDiff (1425 of 2410) UNSUPPORTED: lldb-shell :: Register/x86-zmm-write.test (1426 of 2410) PASS: lldb-api :: lang/cpp/this/TestCPPThis.py (1427 of 2410) PASS: lldb-api :: commands/watchpoints/watchpoint_commands/condition/TestWatchpointConditionCmd.py (1428 of 2410) PASS: lldb-shell :: Reproducer/Functionalities/TestDataFormatter.test (1429 of 2410) UNSUPPORTED: lldb-shell :: Register/x86-db-read.test (1430 of 2410) PASS: lldb-unit :: Utility/./UtilityTests/StreamTest.SetIndentLevel (1431 of 2410) PASS: lldb-shell :: SymbolFile/DWARF/x86/DW_TAG_basic_type_DW_ATE_UTF_nonC.ll (1432 of 2410) PASS: lldb-api :: functionalities/gdb_remote_client/TestProcessConnect.py (1433 of 2410) PASS: lldb-shell :: SymbolFile/NativePDB/function-types-builtins.cpp (1434 of 2410) PASS: lldb-api :: functionalities/memory-region/TestMemoryRegion.py (1435 of 2410) PASS: lldb-unit :: Utility/./UtilityTests/FileSpecTest.EqualDotsPosix (1436 of 2410) PASS: lldb-shell :: Register/Core/x86-64-freebsd-multithread.test (1437 of 2410) PASS: lldb-api :: functionalities/lazy-loading/TestLazyLoading.py (1438 of 2410) UNSUPPORTED: lldb-api :: functionalities/gdb_remote_client/TestWasm.py (1439 of 2410) UNSUPPORTED: lldb-api :: tools/lldb-server/TestGdbRemoteCompletion.py (1440 of 2410) PASS: lldb-api :: functionalities/signal/raise/TestRaise.py (1441 of 2410) PASS: lldb-api :: functionalities/data-formatter/data-formatter-stl/libcxx/vbool/TestDataFormatterLibcxxVBool.py (1442 of 2410) PASS: lldb-api :: commands/expression/persistent_variables/TestPersistentVariables.py (1443 of 2410) PASS: lldb-api :: commands/watchpoints/watchpoint_events/TestWatchpointEvents.py (1444 of 2410) PASS: lldb-unit :: Utility/./UtilityTests/StringListTest.GetMaxStringLengthDecreasingSize (1445 of 2410) PASS: lldb-api :: commands/target/create-no-such-arch/TestNoSuchArch.py (1446 of 2410) PASS: lldb-unit :: Utility/./UtilityTests/FileSpecTest.FormatFileSpec (1447 of 2410) PASS: lldb-shell :: Settings/TestStopCommandSourceOnError.test (1448 of 2410) PASS: lldb-api :: python_api/module_section/TestModuleAndSection.py (1449 of 2410) PASS: lldb-unit :: Utility/./UtilityTests/LogChannelTest.List (1450 of 2410) PASS: lldb-api :: functionalities/breakpoint/hardware_breakpoints/require_hw_breakpoints/TestRequireHWBreakpoints.py (1451 of 2410) PASS: lldb-api :: commands/expression/class_template_specialization_empty_pack/TestClassTemplateSpecializationParametersHandling.py (1452 of 2410) PASS: lldb-shell :: Driver/TestPositionalArgs.test (1453 of 2410) PASS: lldb-api :: commands/expression/import-std-module/basic/TestImportStdModule.py (1454 of 2410) PASS: lldb-api :: functionalities/data-formatter/stringprinter/TestStringPrinter.py (1455 of 2410) PASS: lldb-unit :: Utility/./UtilityTests/TimerTest.CategoryTimes (1456 of 2410) PASS: lldb-api :: tools/lldb-server/TestGdbRemoteRegisterState.py (1457 of 2410) PASS: lldb-unit :: Target/./TargetTests/ExecutionContextTest.GetByteOrderProcess (1458 of 2410) PASS: lldb-api :: lang/c/local_variables/TestLocalVariables.py (1459 of 2410) PASS: lldb-shell :: Settings/TestSettingsWrite.test (1460 of 2410) PASS: lldb-api :: commands/expression/static-initializers/TestStaticInitializers.py (1461 of 2410) PASS: lldb-unit :: ScriptInterpreter/Python/./ScriptInterpreterPythonTests/PythonDataObjectsTest.TestPythonDictionaryToStructuredDictionary (1462 of 2410) PASS: lldb-api :: functionalities/process_crash_info/TestProcessCrashInfo.py (1463 of 2410) PASS: lldb-api :: commands/expression/import-std-module/no-std-module/TestMissingStdModule.py (1464 of 2410) PASS: lldb-shell :: SymbolFile/DWARF/x86/static_scope.s (1465 of 2410) PASS: lldb-api :: lang/c/shared_lib_stripped_symbols/TestSharedLibStrippedSymbols.py (1466 of 2410) PASS: lldb-shell :: ScriptInterpreter/Python/eof.test (1467 of 2410) PASS: lldb-unit :: Language/Highlighting/./HighlighterTests/HighlighterTest.ClangTrailingBackslashMissingNewLine (1468 of 2410) PASS: lldb-unit :: SymbolFile/NativePDB/./SymbolFileNativePDBTests/PDBFPOProgramToDWARFExpressionTests.InvalidAssignmentMultiple (1469 of 2410) PASS: lldb-unit :: Utility/./UtilityTests/BinaryStreamTest.PutSLEB128OneByte (1470 of 2410) PASS: lldb-api :: functionalities/data-formatter/setvaluefromcstring/TestSetValueFromCString.py (1471 of 2410) PASS: lldb-api :: lang/cpp/global_operators/TestCppGlobalOperators.py (1472 of 2410) PASS: lldb-unit :: Utility/./UtilityTests/StringListTest.GetMaxStringLengthEmpty (1473 of 2410) PASS: lldb-unit :: Host/./HostTests/NativeProcessProtocolTest.ReadCStringFromMemory (1474 of 2410) PASS: lldb-unit :: Utility/./UtilityTests/ProcessInstanceInfoMatch.Name (1475 of 2410) PASS: lldb-unit :: Utility/./UtilityTests/StreamTest.AddressRangeInvalidRange (1476 of 2410) PASS: lldb-api :: commands/expression/context-object/TestContextObject.py (1477 of 2410) PASS: lldb-unit :: UnwindAssembly/x86/./UnwindAssemblyx86Tests/Testx86AssemblyInspectionEngine.TestCALLNextInsn (1478 of 2410) PASS: lldb-unit :: Utility/./UtilityTests/ScalarTest.SetValueFromData (1479 of 2410) PASS: lldb-api :: types/TestLongTypesExpr.py (1480 of 2410) PASS: lldb-api :: lang/cpp/incomplete-types/TestCppIncompleteTypes.py (1481 of 2410) PASS: lldb-unit :: Expression/./ExpressionTests/CppModuleConfigurationTest.MissingLibCpp (1482 of 2410) UNSUPPORTED: lldb-api :: commands/trace/TestTraceSave.py (1483 of 2410) PASS: lldb-unit :: API/./APITests/SBCommandInterpreterTest.SingleWordCommand (1484 of 2410) PASS: lldb-unit :: ScriptInterpreter/Python/./ScriptInterpreterPythonTests/PythonDataObjectsTest.TestPythonTupleValues (1485 of 2410) PASS: lldb-api :: commands/gui/invalid-args/TestInvalidArgsGui.py (1486 of 2410) UNSUPPORTED: lldb-api :: benchmarks/frame_variable/TestFrameVariableResponse.py (1487 of 2410) PASS: lldb-api :: commands/expression/dont_allow_jit/TestAllowJIT.py (1488 of 2410) PASS: lldb-unit :: Symbol/./SymbolTests/TestClangASTImporter.MetadataPropagationIndirectImport (1489 of 2410) UNSUPPORTED: lldb-api :: commands/register/register/intel_xtended_registers/mpx_bound_violation/TestBoundViolation.py (1490 of 2410) UNSUPPORTED: lldb-shell :: SymbolFile/DWARF/x86/DW_TAG_GNU_call_site-DW_AT_low_pc.s (1491 of 2410) PASS: lldb-unit :: Expression/./ExpressionTests/DiagnosticManagerTest.AppendMessageAttachToLastDiag (1492 of 2410) UNSUPPORTED: lldb-api :: functionalities/data-formatter/data-formatter-stl/libstdcpp/vbool/TestDataFormatterStdVBool.py (1493 of 2410) PASS: lldb-api :: lang/objc/objc-property/TestObjCProperty.py (1494 of 2410) PASS: lldb-api :: lang/c/stepping/TestStepAndBreakpoints.py (1495 of 2410) PASS: lldb-unit :: Core/./LLDBCoreTests/MangledTest.EmptyForInvalidName (1496 of 2410) PASS: lldb-api :: commands/expression/radar_8638051/Test8638051.py (1497 of 2410) PASS: lldb-unit :: Utility/./UtilityTests/UUIDTest.Validity (1498 of 2410) UNSUPPORTED: lldb-api :: linux/aarch64/mte_tag_access/TestAArch64LinuxMTEMemoryTagAccess.py (1499 of 2410) PASS: lldb-unit :: Process/minidump/./LLDBMinidumpTests/RegisterContextMinidump.ConvertMinidumpContext_x86_64 (1500 of 2410) PASS: lldb-unit :: SymbolFile/NativePDB/./SymbolFileNativePDBTests/PDBFPOProgramToDWARFExpressionTests.MultipleDependentAssignments (1501 of 2410) PASS: lldb-shell :: Register/Core/x86-32-linux-addr.test (1502 of 2410) UNSUPPORTED: lldb-api :: functionalities/exec/TestExec.py (1503 of 2410) UNSUPPORTED: lldb-api :: functionalities/thread/create_during_step/TestCreateDuringStep.py (1504 of 2410) PASS: lldb-api :: python_api/frame/get-variables/TestGetVariables.py (1505 of 2410) UNSUPPORTED: lldb-shell :: Subprocess/vfork-follow-child-softbp.test (1506 of 2410) UNSUPPORTED: lldb-shell :: ScriptInterpreter/Lua/command_script_import.test (1507 of 2410) PASS: lldb-unit :: Utility/./UtilityTests/XcodeSDKTest.GetCanonicalNameAndConstruct (1508 of 2410) PASS: lldb-unit :: Symbol/./SymbolTests/TestTypeSystemClang.TestRecordHasFields (1509 of 2410) PASS: lldb-unit :: Utility/./UtilityTests/StreamTest.PutCString (1510 of 2410) PASS: lldb-unit :: Process/gdb-remote/./ProcessGdbRemoteTests/GDBRemoteCommunicationClientTest.GetModulesInfoInvalidResponse (1511 of 2410) PASS: lldb-api :: lang/c/function_types/TestFunctionTypes.py (1512 of 2410) PASS: lldb-unit :: Utility/./UtilityTests/DataExtractorTest.GetMaxU64 (1513 of 2410) PASS: lldb-api :: lang/c/stepping/TestThreadStepping.py (1514 of 2410) PASS: lldb-unit :: UnwindAssembly/x86/./UnwindAssemblyx86Tests/Testx86AssemblyInspectionEngine.TestSpillRegToStackViaMOVi386 (1515 of 2410) PASS: lldb-shell :: ObjectFile/ELF/aarch64-relocations.yaml (1516 of 2410) PASS: lldb-api :: functionalities/thread/state_after_expression/TestStateAfterExpression.py (1517 of 2410) PASS: lldb-unit :: Process/gdb-remote/./ProcessGdbRemoteTests/GDBRemoteClientBaseTest.SendContinueAndInterrupt (1518 of 2410) PASS: lldb-unit :: Utility/./UtilityTests/TimerTest.CategoryTimes2 (1519 of 2410) PASS: lldb-unit :: Utility/./UtilityTests/UriParserTest.BadPort2 (1520 of 2410) UNSUPPORTED: lldb-shell :: Unwind/eh-frame-small-fde.test (1521 of 2410) PASS: lldb-api :: tools/lldb-server/TestGdbRemoteProcessInfo.py (1522 of 2410) PASS: lldb-api :: lang/objc/ivar-IMP/TestObjCiVarIMP.py (1523 of 2410) PASS: lldb-api :: commands/watchpoints/watchpoint_commands/command/TestWatchpointCommandLLDB.py (1524 of 2410) PASS: lldb-api :: functionalities/postmortem/elf-core/gcore/TestGCore.py (1525 of 2410) PASS: lldb-api :: commands/expression/calculator_mode/TestCalculatorMode.py (1526 of 2410) PASS: lldb-unit :: UnwindAssembly/x86/./UnwindAssemblyx86Tests/Testx86AssemblyInspectionEngine.TestSimplei386ugmented (1527 of 2410) PASS: lldb-unit :: Utility/./UtilityTests/RangeTest.ContainsRangeStartingFromZero (1528 of 2410) UNSUPPORTED: lldb-api :: android/platform/TestDefaultCacheLineSize.py (1529 of 2410) PASS: lldb-unit :: Expression/./ExpressionTests/DiagnosticManagerTest.FixedExpression (1530 of 2410) PASS: lldb-unit :: Signals/./SignalsTests/UnixSignalsTest.VersionChange (1531 of 2410) UNSUPPORTED: lldb-shell :: Reproducer/TestLuaImport.test (1532 of 2410) PASS: lldb-api :: types/TestFloatTypes.py (1533 of 2410) PASS: lldb-api :: lang/objc/objc++/TestObjCXX.py (1534 of 2410) PASS: lldb-shell :: SymbolFile/DWARF/x86/debug-names-compressed.cpp (1535 of 2410) PASS: lldb-unit :: Symbol/./SymbolTests/LineEntryTest.GetAllExactLineColumnMatches (1536 of 2410) PASS: lldb-unit :: Target/./TargetTests/PathMappingListTest.AbsoluteTests (1537 of 2410) PASS: lldb-unit :: Host/./HostTests/HostInfoTestInitialization.InitTwice (1538 of 2410) PASS: lldb-unit :: Utility/./UtilityTests/StructuredDataTest.StringDump (1539 of 2410) PASS: lldb-api :: lang/objc/real-definition/TestRealDefinition.py (1540 of 2410) PASS: lldb-api :: lang/objc/objc-new-syntax/TestObjCNewSyntaxLiteral.py (1541 of 2410) PASS: lldb-unit :: Process/Utility/./ProcessUtilityTests/ProcMapTests/LinuxProcMapsTestFixture.ParseMapRegions/1 (1542 of 2410) UNSUPPORTED: lldb-api :: functionalities/tsan/basic/TestTsanBasic.py (1543 of 2410) PASS: lldb-api :: functionalities/gdb_remote_client/TestMemoryRegionDirtyPages.py (1544 of 2410) PASS: lldb-api :: functionalities/step-vrs-interrupt/TestStepVrsInterruptTimeout.py (1545 of 2410) PASS: lldb-api :: commands/expression/import-std-module/deque-basic/TestDequeFromStdModule.py (1546 of 2410) PASS: lldb-unit :: Process/minidump/./LLDBMinidumpTests/MinidumpParserTest.MinidumpDuplicateModuleMappedFirst (1547 of 2410) PASS: lldb-api :: functionalities/data-formatter/data-formatter-stl/libcxx/map/TestDataFormatterLibccMap.py (1548 of 2410) PASS: lldb-shell :: SymbolFile/DWARF/deterministic-build.cpp (1549 of 2410) PASS: lldb-shell :: Reproducer/TestDiscard.test (1550 of 2410) PASS: lldb-api :: functionalities/thread/concurrent_events/TestConcurrentSignalBreak.py (1551 of 2410) PASS: lldb-unit :: Symbol/./SymbolTests/TestTypeSystemClang.TestDisplayName (1552 of 2410) PASS: lldb-api :: lang/cpp/subst_template_type_param/TestSubstTemplateTypeParam.py (1553 of 2410) PASS: lldb-api :: functionalities/data-formatter/data-formatter-python-synth/TestDataFormatterPythonSynth.py (1554 of 2410) PASS: lldb-shell :: ScriptInterpreter/Python/command_relative_import.test (1555 of 2410) PASS: lldb-unit :: SymbolFile/DWARF/./SymbolFileDWARFTests/SymbolFileDWARFTests.TestAbbrevOrder1Start5 (1556 of 2410) PASS: lldb-api :: macosx/load-kext/TestLoadKext.py (1557 of 2410) PASS: lldb-api :: lang/cpp/class_static/TestStaticVariables.py (1558 of 2410) PASS: lldb-api :: lang/cpp/unsigned_types/TestUnsignedTypes.py (1559 of 2410) PASS: lldb-unit :: Process/minidump/./LLDBMinidumpTests/MinidumpParserTest.GetFilteredModuleList (1560 of 2410) PASS: lldb-unit :: Language/Highlighting/./HighlighterTests/HighlighterTest.FallbackHighlighter (1561 of 2410) PASS: lldb-api :: functionalities/breakpoint/cpp_exception/TestCPPExceptionBreakpoint.py (1562 of 2410) PASS: lldb-api :: iohandler/resize/TestIOHandlerResizeNoEditline.py (1563 of 2410) PASS: lldb-unit :: Utility/./UtilityTests/StreamTest.PutHex64ByteOrderLittle (1564 of 2410) PASS: lldb-shell :: Reproducer/TestSynchronous.test (1565 of 2410) PASS: lldb-unit :: Symbol/./SymbolTests/TestClangASTImporter.CopyTypeTagDecl (1566 of 2410) PASS: lldb-api :: functionalities/breakpoint/breakpoint_command/TestRegexpBreakCommand.py (1567 of 2410) PASS: lldb-shell :: SymbolFile/DWARF/x86/inline-function-address-shared.test (1568 of 2410) PASS: lldb-unit :: ScriptInterpreter/Python/./ScriptInterpreterPythonTests/PythonDataObjectsTest.TestPythonDictionaryManipulation (1569 of 2410) UNSUPPORTED: lldb-api :: python_api/event/TestEvents.py (1570 of 2410) PASS: lldb-api :: functionalities/memory/find/TestMemoryFind.py (1571 of 2410) PASS: lldb-api :: lang/c/inlines/TestRedefinitionsInInlines.py (1572 of 2410) UNSUPPORTED: lldb-api :: commands/expression/call-restarts/TestCallThatRestarts.py (1573 of 2410) PASS: lldb-shell :: Reproducer/TestGDBRemoteRepro.test (1574 of 2410) PASS: lldb-api :: lang/cpp/breakpoint-commands/TestCPPBreakpointCommands.py (1575 of 2410) PASS: lldb-api :: lang/objc/foundation/TestObjCMethodsNSError.py (1576 of 2410) PASS: lldb-api :: functionalities/fat_archives/TestFatArchives.py (1577 of 2410) PASS: lldb-api :: functionalities/multidebugger_commands/TestMultipleDebuggersCommands.py (1578 of 2410) PASS: lldb-unit :: Utility/./UtilityTests/StringListTest.JoinNonSpace (1579 of 2410) PASS: lldb-unit :: Core/./LLDBCoreTests/ModuleSpecTest.InvalidInMemoryBuffer (1580 of 2410) PASS: lldb-unit :: Symbol/./SymbolTests/TestClangASTImporter.CompleteFwdDeclWithOtherOrigin (1581 of 2410) PASS: lldb-unit :: Utility/./UtilityTests/StringExtractorTest.GetHexU8_InvalidHex (1582 of 2410) PASS: lldb-unit :: Core/./LLDBCoreTests/MangledTest.NameIndexes_FindFunctionSymbols (1583 of 2410) UNSUPPORTED: lldb-shell :: SymbolFile/DWARF/x86/DW_TAG_variable-DW_AT_decl_file-DW_AT_abstract_origin-crosscu1.s (1584 of 2410) PASS: lldb-unit :: ObjectFile/Breakpad/./ObjectFileBreakpadTests/StackCFIRecord.parse (1585 of 2410) PASS: lldb-unit :: Utility/./UtilityTests/StatusTest.Formatv (1586 of 2410) PASS: lldb-shell :: Reproducer/TestVerify.test (1587 of 2410) PASS: lldb-api :: commands/target/auto-install-main-executable/TestAutoInstallMainExecutable.py (1588 of 2410) UNSUPPORTED: lldb-api :: functionalities/ptrauth_diagnostics/BRAA_error/TestPtrauthBRAADiagnostic.py (1589 of 2410) PASS: lldb-api :: lang/objc/foundation/TestObjectDescriptionAPI.py (1590 of 2410) PASS: lldb-api :: functionalities/breakpoint/dummy_target_breakpoints/TestBreakpointsWithNoTargets.py (1591 of 2410) PASS: lldb-unit :: ObjectFile/PECOFF/./ObjectFilePECOFFTests/PECallFrameInfoTest.Frame_reg_eh (1592 of 2410) PASS: lldb-api :: python_api/watchpoint/watchlocation/TestSetWatchlocation.py (1593 of 2410) PASS: lldb-unit :: Symbol/./SymbolTests/TestTypeSystemClang.TestOwningModule (1594 of 2410) PASS: lldb-api :: commands/expression/weak_symbols/TestWeakSymbols.py (1595 of 2410) PASS: lldb-api :: lang/cpp/gmodules/TestWithModuleDebugging.py (1596 of 2410) PASS: lldb-unit :: DataFormatter/./LLDBFormatterTests/TypeMatcherTests.ExactName (1597 of 2410) PASS: lldb-shell :: SymbolFile/DWARF/x86/debug_loc-aslr.s (1598 of 2410) UNSUPPORTED: lldb-shell :: Subprocess/fork-follow-child.test (1599 of 2410) PASS: lldb-api :: lang/cpp/lambdas/TestLambdas.py (1600 of 2410) PASS: lldb-unit :: Utility/./UtilityTests/RangeTest.SizeTypes (1601 of 2410) PASS: lldb-api :: commands/expression/error-limit/TestExprErrorLimit.py (1602 of 2410) PASS: lldb-api :: functionalities/gdb_remote_client/TestqOffsets.py (1603 of 2410) PASS: lldb-unit :: Utility/./UtilityTests/StringLexerTest.Next (1604 of 2410) PASS: lldb-shell :: Driver/TestNoUseColor.test (1605 of 2410) PASS: lldb-api :: functionalities/pointer_num_children/TestPointerNumChildren.py (1606 of 2410) UNSUPPORTED: lldb-api :: commands/gui/basic/TestGuiBasic.py (1607 of 2410) PASS: lldb-unit :: Utility/./UtilityTests/ScalarTest.LongLongAssigmentOperator (1608 of 2410) PASS: lldb-unit :: Utility/./UtilityTests/AnsiTerminal.Twice (1609 of 2410) PASS: lldb-api :: types/TestFloatTypesExpr.py (1610 of 2410) PASS: lldb-shell :: SymbolFile/DWARF/anon_class_w_and_wo_export_symbols.ll (1611 of 2410) PASS: lldb-shell :: Minidump/Windows/Sigsegv/sigsegv.test (1612 of 2410) UNSUPPORTED: lldb-api :: macosx/corefile-exception-reason/TestCorefileExceptionReason.py (1613 of 2410) PASS: lldb-api :: lang/objc/orderedset/TestOrderedSet.py (1614 of 2410) PASS: lldb-unit :: Symbol/./SymbolTests/TestClangASTImporter.DeportTypeTagDecl (1615 of 2410) PASS: lldb-api :: functionalities/set-data/TestSetData.py (1616 of 2410) PASS: lldb-unit :: Utility/./UtilityTests/BroadcasterTest.EventTypeHasListeners (1617 of 2410) PASS: lldb-api :: commands/expression/import-std-module/retry-with-std-module/TestRetryWithStdModule.py (1618 of 2410) PASS: lldb-api :: commands/expression/save_jit_objects/TestSaveJITObjects.py (1619 of 2410) PASS: lldb-api :: functionalities/data-formatter/data-formatter-caching/TestDataFormatterCaching.py (1620 of 2410) PASS: lldb-unit :: Utility/./UtilityTests/ArchSpecTest.MergeFrom (1621 of 2410) PASS: lldb-api :: python_api/breakpoint/TestBreakpointAPI.py (1622 of 2410) PASS: lldb-unit :: Process/gdb-remote/./ProcessGdbRemoteTests/PortMapTest.Constructors (1623 of 2410) PASS: lldb-shell :: SymbolFile/DWARF/x86/compilercontext.ll (1624 of 2410) PASS: lldb-api :: functionalities/postmortem/mach-core/TestMachCore.py (1625 of 2410) PASS: lldb-shell :: SymbolFile/DWARF/x86/debug_loc_and_loclists.s (1626 of 2410) PASS: lldb-shell :: Reproducer/TestDebugSymbols.test (1627 of 2410) PASS: lldb-unit :: Utility/./UtilityTests/UriParserTest.TypicalPortPathIPv4 (1628 of 2410) PASS: lldb-unit :: Utility/./UtilityTests/StringListTest.LongestCommonPrefixSingleElement (1629 of 2410) PASS: lldb-api :: macosx/dyld-trie-symbols/TestDyldTrieSymbols.py (1630 of 2410) PASS: lldb-unit :: Utility/./UtilityTests/AnsiTerminal.KnownPrefix (1631 of 2410) PASS: lldb-unit :: Utility/./UtilityTests/RangeTest.NotEqualInvalid (1632 of 2410) UNSUPPORTED: lldb-api :: tools/lldb-server/libraries-svr4/TestGdbRemoteLibrariesSvr4Support.py (1633 of 2410) UNSUPPORTED: lldb-shell :: ScriptInterpreter/Lua/breakpoint_function_callback.test (1634 of 2410) PASS: lldb-unit :: Utility/./UtilityTests/FileSpecTest.FileAndDirectoryComponents (1635 of 2410) PASS: lldb-api :: commands/watchpoints/watchpoint_commands/command/TestWatchpointCommandPython.py (1636 of 2410) PASS: lldb-unit :: Expression/./ExpressionTests/DWARFExpression.DW_OP_unknown (1637 of 2410) PASS: lldb-shell :: Driver/TestTarget.test (1638 of 2410) PASS: lldb-shell :: Register/Core/aarch64-freebsd-multithread.test (1639 of 2410) PASS: lldb-unit :: tools/lldb-server/tests/./LLDBServerTests/StandardStartupTest.TestStopReplyContainsThreadPcs (1640 of 2410) PASS: lldb-api :: python_api/function_symbol/TestSymbolAPI.py (1641 of 2410) PASS: lldb-unit :: Host/./HostTests/HostInfoTest.GetXcodeSDK (1642 of 2410) PASS: lldb-api :: lang/cpp/typeof/TestTypeOfDeclTypeExpr.py (1643 of 2410) PASS: lldb-unit :: Symbol/./SymbolTests/LineEntryTest.GetAllExactLineMatchesWithoutColumn (1644 of 2410) PASS: lldb-unit :: Process/gdb-remote/./ProcessGdbRemoteTests/GDBRemoteCommunicationClientTest.GetMemoryRegionInfoInvalidResponse (1645 of 2410) PASS: lldb-shell :: Reproducer/TestDriverOptions.test (1646 of 2410) PASS: lldb-unit :: Utility/./UtilityTests/FileSpecTest.GuessPathStyle (1647 of 2410) PASS: lldb-api :: python_api/signals/TestSignalsAPI.py (1648 of 2410) PASS: lldb-unit :: Utility/./UtilityTests/StreamTest.PutNHex8 (1649 of 2410) PASS: lldb-unit :: ObjectFile/Breakpad/./ObjectFileBreakpadTests/ModuleRecord.parse (1650 of 2410) PASS: lldb-api :: commands/expression/two-files/TestObjCTypeQueryFromOtherCompileUnit.py (1651 of 2410) PASS: lldb-api :: macosx/find-dsym/deep-bundle/TestDeepBundle.py (1652 of 2410) PASS: lldb-unit :: Utility/./UtilityTests/Flags.GetBitSize (1653 of 2410) PASS: lldb-unit :: Host/./HostTests/ConnectionFileDescriptorTest.TCPGetURIv6 (1654 of 2410) PASS: lldb-shell :: Reproducer/TestCrash.test (1655 of 2410) PASS: lldb-unit :: Utility/./UtilityTests/ArgsTest.AppendArguments (1656 of 2410) PASS: lldb-shell :: Commands/command-backtrace-parser-2.test (1657 of 2410) PASS: lldb-unit :: Utility/./UtilityTests/ScalarTest.Getters (1658 of 2410) PASS: lldb-api :: lang/objc/foundation/TestObjCMethods.py (1659 of 2410) XFAIL: lldb-shell :: Register/x86-64-fp-read.test (1660 of 2410) PASS: lldb-unit :: Utility/./UtilityTests/OptionsWithRawTest.UnterminatedQuote (1661 of 2410) PASS: lldb-unit :: Symbol/./SymbolTests/TestTypeSystemClang.TestGetTypeClassTypeOfExpr (1662 of 2410) PASS: lldb-api :: lang/cpp/struct_with_keyword_name/TestStructWithKeywordName.py (1663 of 2410) PASS: lldb-unit :: Core/./LLDBCoreTests/RichManglingContextTest.IPDRealloc (1664 of 2410) PASS: lldb-unit :: SymbolFile/NativePDB/./SymbolFileNativePDBTests/PDBFPOProgramToDWARFExpressionTests.UnresolvedRegisterAssignmentReference (1665 of 2410) PASS: lldb-unit :: Symbol/./SymbolTests/TestTypeSystemClang.TestGetTypeClassDeclType (1666 of 2410) PASS: lldb-api :: functionalities/tail_call_frames/ambiguous_tail_call_seq2/TestAmbiguousTailCallSeq2.py (1667 of 2410) PASS: lldb-unit :: ScriptInterpreter/Python/./ScriptInterpreterPythonTests/PythonDataObjectsTest.TestPythonFile (1668 of 2410) PASS: lldb-api :: functionalities/breakpoint/breakpoint_by_file_colon_line/TestBreakpointByFileColonLine.py (1669 of 2410) PASS: lldb-api :: functionalities/data-formatter/builtin-formats/TestBuiltinFormats.py (1670 of 2410) PASS: lldb-unit :: Process/gdb-remote/./ProcessGdbRemoteTests/GDBRemoteCommunicationTest.ReadPacket_checksum (1671 of 2410) PASS: lldb-api :: lang/cpp/unicode-literals/TestUnicodeLiterals.py (1672 of 2410) PASS: lldb-api :: functionalities/source-map/TestTargetSourceMap.py (1673 of 2410) PASS: lldb-api :: python_api/sbenvironment/TestSBEnvironment.py (1674 of 2410) UNSUPPORTED: lldb-shell :: Register/x86-gp-read.test (1675 of 2410) UNSUPPORTED: lldb-api :: commands/watchpoints/variable_out_of_scope/TestWatchedVarHitWhenInScope.py (1676 of 2410) PASS: lldb-unit :: Process/Utility/./ProcessUtilityTests/ProcSMapTests/LinuxProcSMapsTestFixture.ParseSMapRegions/7 (1677 of 2410) PASS: lldb-shell :: SymbolFile/DWARF/x86/find-method-local-struct.cpp (1678 of 2410) PASS: lldb-api :: functionalities/tail_call_frames/unambiguous_sequence/TestUnambiguousTailCalls.py (1679 of 2410) PASS: lldb-unit :: Language/Highlighting/./HighlighterTests/HighlighterTest.ClangCursorPos (1680 of 2410) PASS: lldb-api :: functionalities/breakpoint/auto_continue/TestBreakpointAutoContinue.py (1681 of 2410) PASS: lldb-api :: api/multithreaded/TestMultithreaded.py (1682 of 2410) PASS: lldb-api :: commands/expression/completion-crash-incomplete-record/TestCompletionCrashIncompleteRecord.py (1683 of 2410) PASS: lldb-api :: functionalities/gdb_remote_client/TestMultiprocess.py (1684 of 2410) PASS: lldb-api :: functionalities/data-formatter/data-formatter-stl/libcxx/bitset/TestDataFormatterLibcxxBitset.py (1685 of 2410) PASS: lldb-unit :: Utility/./UtilityTests/LogTest.Unregister (1686 of 2410) UNSUPPORTED: lldb-shell :: SymbolFile/PDB/function-nested-block.test (1687 of 2410) PASS: lldb-api :: commands/settings/TestSettings.py (1688 of 2410) PASS: lldb-api :: terminal/TestSTTYBeforeAndAfter.py (1689 of 2410) PASS: lldb-unit :: Symbol/./SymbolTests/TestTypeSystemClang.TestGetBasicTypeFromName (1690 of 2410) PASS: lldb-api :: commands/command/script/TestCommandScript.py (1691 of 2410) PASS: lldb-shell :: Breakpoint/debug_rnglistx_rlex.test (1692 of 2410) XFAIL: lldb-shell :: Register/x86-mm-xmm-write.test (1693 of 2410) PASS: lldb-unit :: Utility/./UtilityTests/ArgsTest.TestOverwriteArgs (1694 of 2410) PASS: lldb-unit :: Utility/./UtilityTests/StringExtractorTest.DecodeHexU8_Extra (1695 of 2410) PASS: lldb-unit :: Core/./LLDBCoreTests/FormatEntityTest.DefinitionConstructionNameAndString (1696 of 2410) PASS: lldb-unit :: Utility/./UtilityTests/BinaryStreamTest.PutULEB128ThreeBytes (1697 of 2410) PASS: lldb-unit :: Utility/./UtilityTests/Flags.Reset (1698 of 2410) PASS: lldb-api :: lang/objc/unicode-string/TestUnicodeString.py (1699 of 2410) PASS: lldb-unit :: Core/./LLDBCoreTests/RichManglingContextTest.FromCxxMethodName (1700 of 2410) PASS: lldb-unit :: Utility/./UtilityTests/BinaryStreamTest.PutULEB128TwoBytes (1701 of 2410) PASS: lldb-unit :: Symbol/./SymbolTests/TestTypeSystemMap.GetTypeSystemForLanguageWithNoTarget (1702 of 2410) UNSUPPORTED: lldb-shell :: SymbolFile/DWARF/dwarf5-lazy-dwo.c (1703 of 2410) PASS: lldb-unit :: Utility/./UtilityTests/CompletionRequest.TestCompletionOwnership (1704 of 2410) PASS: lldb-unit :: Utility/./UtilityTests/StreamTeeTest.Constructor2Streams (1705 of 2410) PASS: lldb-unit :: Process/gdb-remote/./ProcessGdbRemoteTests/GDBRemoteClientBaseTest.SendPacketAndReceiveResponseWithOutputSupport (1706 of 2410) PASS: lldb-shell :: Heap/heap-cstr.test (1707 of 2410) PASS: lldb-shell :: SymbolFile/DWARF/x86/win-i386-line-table.s (1708 of 2410) XFAIL: lldb-shell :: SymbolFile/DWARF/find-type-in-function.cpp (1709 of 2410) PASS: lldb-api :: commands/frame/diagnose/array/TestArray.py (1710 of 2410) PASS: lldb-unit :: Language/Highlighting/./HighlighterTests/HighlighterTest.ClangTrailingBackslashBeforeNewline (1711 of 2410) PASS: lldb-api :: lang/c/global_variables/TestGlobalVariables.py (1712 of 2410) PASS: lldb-unit :: Process/Utility/./ProcessUtilityTests/ProcSMapTests/LinuxProcSMapsTestFixture.ParseSMapRegions/0 (1713 of 2410) PASS: lldb-api :: lang/objc/modules-non-objc-target/TestObjCModulesNonObjCTarget.py (1714 of 2410) PASS: lldb-unit :: Process/minidump/./LLDBMinidumpTests/MinidumpParserTest.GetThreadContext_x86_64 (1715 of 2410) PASS: lldb-api :: functionalities/inferior-crashing/recursive-inferior/TestRecursiveInferior.py (1716 of 2410) PASS: lldb-unit :: Utility/./UtilityTests/ScalarTest.GetValue (1717 of 2410) UNSUPPORTED: lldb-api :: lang/objc/conflicting-class-list-function-from-user/TestObjCClassListFunctionFromUser.py (1718 of 2410) PASS: lldb-unit :: Process/minidump/./LLDBMinidumpTests/MinidumpParserTest.GetPidWindows (1719 of 2410) PASS: lldb-shell :: Breakpoint/breakpoint-command.test (1720 of 2410) PASS: lldb-shell :: SymbolFile/Breakpad/line-table-mixed-path-styles.test (1721 of 2410) PASS: lldb-unit :: Language/Highlighting/./HighlighterTests/HighlighterTest.ClangIdentifiers (1722 of 2410) PASS: lldb-api :: commands/expression/persistent_ptr_update/TestPersistentPtrUpdate.py (1723 of 2410) PASS: lldb-unit :: Host/./HostTests/SocketTests/SocketTest.TCPListen0GetPort/ipv4 (1724 of 2410) PASS: lldb-unit :: Utility/./UtilityTests/XcodeSDKTest.FindXcodeContentsDirectoryInPath (1725 of 2410) UNSUPPORTED: lldb-shell :: ScriptInterpreter/Lua/watchpoint_callback.test (1726 of 2410) PASS: lldb-api :: functionalities/breakpoint/breakpoint_command/TestBreakpointCommand.py (1727 of 2410) PASS: lldb-unit :: Core/./LLDBCoreTests/UniqueCStringMap.NoDefaultConstructor (1728 of 2410) PASS: lldb-unit :: Utility/./UtilityTests/ArchSpecTest.Compatibility (1729 of 2410) PASS: lldb-api :: commands/expression/po_verbosity/TestPoVerbosity.py (1730 of 2410) PASS: lldb-api :: lang/cpp/bitfields/TestCppBitfields.py (1731 of 2410) PASS: lldb-unit :: Interpreter/./InterpreterTests/TestProperties.DeepCopy (1732 of 2410) PASS: lldb-api :: lang/objc/bitfield_ivars/TestBitfieldIvars.py (1733 of 2410) PASS: lldb-unit :: ScriptInterpreter/Python/./ScriptInterpreterPythonTests/PythonDataObjectsTest.TestPythonTupleToStructuredList (1734 of 2410) PASS: lldb-shell :: Register/Core/x86-64-linux-multithread.test (1735 of 2410) PASS: lldb-shell :: Register/x86-64-gp-read.test (1736 of 2410) PASS: lldb-shell :: ObjectFile/ELF/basic-info.yaml (1737 of 2410) UNSUPPORTED: lldb-shell :: Unwind/unwind-plan-dwarf-dump.test (1738 of 2410) PASS: lldb-api :: lang/cpp/this_class_type_mixing/TestThisClassTypeMixing.py (1739 of 2410) PASS: lldb-unit :: Utility/./UtilityTests/BinaryStreamTest.PutSLEB128One (1740 of 2410) PASS: lldb-api :: commands/watchpoints/multiple_threads/TestWatchpointMultipleThreads.py (1741 of 2410) PASS: lldb-unit :: Utility/./UtilityTests/ScalarTest.GetBytes (1742 of 2410) PASS: lldb-api :: commands/platform/sdk/TestPlatformSDK.py (1743 of 2410) PASS: lldb-unit :: ScriptInterpreter/Python/./ScriptInterpreterPythonTests/PythonDataObjectsTest.TestPythonCallableCheck (1744 of 2410) PASS: lldb-api :: commands/log/invalid-args/TestInvalidArgsLog.py (1745 of 2410) PASS: lldb-unit :: Utility/./UtilityTests/StreamTest.PutMaxHex64ByteOrderBig (1746 of 2410) PASS: lldb-api :: commands/settings/quoting/TestQuoting.py (1747 of 2410) PASS: lldb-shell :: Quit/TestQuitExitCode0.test (1748 of 2410) PASS: lldb-unit :: Process/Utility/./ProcessUtilityTests/ProcSMapTests/LinuxProcSMapsTestFixture.ParseSMapRegions/9 (1749 of 2410) PASS: lldb-api :: functionalities/thread/concurrent_events/TestConcurrentDelaySignalWatch.py (1750 of 2410) PASS: lldb-api :: commands/expression/rdar42038760/TestScalarURem.py (1751 of 2410) PASS: lldb-shell :: ObjectFile/PECOFF/uuid.yaml (1752 of 2410) PASS: lldb-unit :: Utility/./UtilityTests/StreamTest.PutBytesAsRawHex8ToBigEndian (1753 of 2410) PASS: lldb-unit :: Thread/./ThreadTests/ThreadTest.GetPrivateStopInfo (1754 of 2410) PASS: lldb-unit :: Utility/./UtilityTests/RecordReplayTest.InstrumentedFoo (1755 of 2410) PASS: lldb-api :: commands/process/attach-resume/TestAttachResume.py (1756 of 2410) PASS: lldb-api :: commands/expression/ignore-artificial-constructors/TestIgnoreArtificialConstructors.py (1757 of 2410) PASS: lldb-shell :: SymbolFile/DWARF/x86/find-inline-method.s (1758 of 2410) PASS: lldb-shell :: SymbolFile/NativePDB/ast-methods.cpp (1759 of 2410) PASS: lldb-unit :: UnwindAssembly/x86/./UnwindAssemblyx86Tests/Testx86AssemblyInspectionEngine.TestPushESI (1760 of 2410) PASS: lldb-api :: lang/objc/objc-dyn-sbtype/TestObjCDynamicSBType.py (1761 of 2410) PASS: lldb-shell :: Commands/command-disassemble-process.yaml (1762 of 2410) PASS: lldb-api :: commands/watchpoints/watchpoint_size/TestWatchpointSizes.py (1763 of 2410) PASS: lldb-api :: tools/lldb-server/TestGdbRemoteThreadsInStopReply.py (1764 of 2410) PASS: lldb-api :: lang/cpp/class_types/TestClassTypes.py (1765 of 2410) PASS: lldb-api :: functionalities/completion/TestCompletion.py (1766 of 2410) PASS: lldb-api :: functionalities/breakpoint/breakpoint_conditions/TestBreakpointConditions.py (1767 of 2410) PASS: lldb-api :: functionalities/stats_api/TestStatisticsAPI.py (1768 of 2410) PASS: lldb-unit :: Utility/./UtilityTests/BinaryStreamTest.PutULEB128FourBytes (1769 of 2410) PASS: lldb-shell :: SymbolFile/Breakpad/unwind-via-stack-win-no-memory-info.yaml (1770 of 2410) PASS: lldb-shell :: ObjectFile/ELF/PT_TLS-overlap-PT_LOAD.yaml (1771 of 2410) PASS: lldb-api :: functionalities/data-formatter/data-formatter-synth/TestDataFormatterSynth.py (1772 of 2410) PASS: lldb-api :: functionalities/load_using_paths/TestLoadUsingPaths.py (1773 of 2410) PASS: lldb-shell :: ObjectFile/Breakpad/sections.test (1774 of 2410) PASS: lldb-unit :: Utility/./UtilityTests/ScalarTest.CastOperations (1775 of 2410) PASS: lldb-api :: functionalities/data-formatter/data-formatter-stl/libcxx/unique_ptr/TestDataFormatterLibcxxUniquePtr.py (1776 of 2410) UNSUPPORTED: lldb-shell :: Register/x86-ymm-write.test (1777 of 2410) PASS: lldb-api :: functionalities/breakpoint/cpp/TestCPPBreakpointLocations.py (1778 of 2410) PASS: lldb-unit :: Utility/./UtilityTests/BinaryStreamTest.PutSLEB128NineBytes (1779 of 2410) PASS: lldb-unit :: Symbol/./SymbolTests/TestClangASTImporter.CanImportInvalidType (1780 of 2410) PASS: lldb-api :: commands/watchpoints/watchpoint_commands/TestWatchpointCommands.py (1781 of 2410) PASS: lldb-api :: macosx/safe-to-func-call/TestSafeFuncCalls.py (1782 of 2410) UNSUPPORTED: lldb-api :: functionalities/ubsan/basic/TestUbsanBasic.py (1783 of 2410) PASS: lldb-unit :: Process/Utility/./ProcessUtilityTests/ProcSMapTests/LinuxProcSMapsTestFixture.ParseSMapRegions/8 (1784 of 2410) PASS: lldb-api :: functionalities/data-formatter/data-formatter-stl/libcxx/function/TestLibCxxFunction.py (1785 of 2410) PASS: lldb-api :: tools/lldb-server/inferior-crash/TestGdbRemoteAbort.py (1786 of 2410) PASS: lldb-shell :: Register/Core/x86-64-netbsd-addr.test (1787 of 2410) PASS: lldb-unit :: Utility/./UtilityTests/AnsiTerminal.Basic (1788 of 2410) PASS: lldb-api :: lang/cpp/function_refs/TestFunctionRefs.py (1789 of 2410) PASS: lldb-api :: lang/c/shared_lib/TestSharedLib.py (1790 of 2410) PASS: lldb-api :: lang/c/unions/TestUnionMembers.py (1791 of 2410) PASS: lldb-unit :: Utility/./UtilityTests/StreamTest.AddressRange (1792 of 2410) PASS: lldb-api :: functionalities/thread/concurrent_events/TestConcurrentSignalWatchBreak.py (1793 of 2410) PASS: lldb-api :: functionalities/postmortem/minidump-new/TestMiniDumpUUID.py (1794 of 2410) PASS: lldb-unit :: Process/gdb-remote/./ProcessGdbRemoteTests/GDBRemoteCommunicationServerTest.SendErrorResponse_ErrorList (1795 of 2410) PASS: lldb-unit :: Host/./HostTests/SocketTests/SocketTest.TCPGetAddress/ipv6 (1796 of 2410) PASS: lldb-unit :: UnwindAssembly/x86/./UnwindAssemblyx86Tests/Testx86AssemblyInspectionEngine.Test32bitFramelessSmallStackFrame (1797 of 2410) PASS: lldb-unit :: ScriptInterpreter/Python/./ScriptInterpreterPythonTests/PythonDataObjectsTest.TestPythonListManipulation (1798 of 2410) PASS: lldb-unit :: Utility/./UtilityTests/ConstStringTest.format_provider (1799 of 2410) PASS: lldb-unit :: Utility/./UtilityTests/StreamTest.PutULEB128 (1800 of 2410) UNSUPPORTED: lldb-api :: commands/trace/TestTraceExport.py (1801 of 2410) PASS: lldb-unit :: Utility/./UtilityTests/StringExtractorGDBRemoteTest.GetPidTid (1802 of 2410) PASS: lldb-api :: functionalities/float-display/TestFloatDisplay.py (1803 of 2410) PASS: lldb-unit :: Utility/./UtilityTests/StreamTest.ShiftOperatorChars (1804 of 2410) PASS: lldb-unit :: Language/Highlighting/./HighlighterTests/HighlighterTest.Keywords (1805 of 2410) PASS: lldb-unit :: ScriptInterpreter/Python/./ScriptInterpreterPythonTests/PythonDataObjectsTest.TestPythonStringToStructuredString (1806 of 2410) PASS: lldb-shell :: Breakpoint/split-dwarf5-debug-stroffsets.test (1807 of 2410) PASS: lldb-unit :: Utility/./UtilityTests/RangeTest.ContainsAddrInvalid (1808 of 2410) PASS: lldb-unit :: Process/gdb-remote/./ProcessGdbRemoteTests/GDBRemoteCommunicationServerTest.SendErrorResponse_Status (1809 of 2410) PASS: lldb-unit :: Process/minidump/./LLDBMinidumpTests/RegisterContextMinidump.CheckRegisterContextMinidump_ARM (1810 of 2410) PASS: lldb-api :: functionalities/thread/concurrent_events/TestConcurrentCrashWithWatchpoint.py (1811 of 2410) PASS: lldb-unit :: UnwindAssembly/x86/./UnwindAssemblyx86Tests/Testx86AssemblyInspectionEngine.TestStackRealign32BitDisp_x86_64 (1812 of 2410) PASS: lldb-shell :: Settings/TestSettingsSet.test (1813 of 2410) PASS: lldb-unit :: Utility/./UtilityTests/FileSpecTest.Match (1814 of 2410) PASS: lldb-api :: lang/objc/modules-objc-property/TestModulesObjCProperty.py (1815 of 2410) PASS: lldb-shell :: SymbolFile/DWARF/x86/find-variable-dwo.cpp (1816 of 2410) PASS: lldb-unit :: Interpreter/./InterpreterTests/OptionArgParserTest.toScriptLanguage (1817 of 2410) PASS: lldb-api :: functionalities/data-formatter/data-formatter-stl/libcxx/set/TestDataFormatterLibcxxSet.py (1818 of 2410) PASS: lldb-unit :: Utility/./UtilityTests/RegularExpression.CopyAssignment (1819 of 2410) PASS: lldb-unit :: Process/minidump/./LLDBMinidumpTests/MinidumpParserTest.MinidumpDuplicateModuleMappedSecond (1820 of 2410) PASS: lldb-api :: lang/cpp/exceptions/TestCPPExceptionBreakpoints.py (1821 of 2410) UNSUPPORTED: lldb-shell :: SymbolFile/PDB/vbases.test (1822 of 2410) PASS: lldb-api :: functionalities/postmortem/elf-core/TestLinuxCore.py (1823 of 2410) PASS: lldb-unit :: Utility/./UtilityTests/StringListTest.GetSize (1824 of 2410) PASS: lldb-api :: functionalities/tail_call_frames/disambiguate_tail_call_seq/TestDisambiguateTailCallSeq.py (1825 of 2410) PASS: lldb-api :: functionalities/type_get_module/TestTypeGetModule.py (1826 of 2410) PASS: lldb-unit :: Signals/./SignalsTests/UnixSignalsTest.Iteration (1827 of 2410) PASS: lldb-api :: types/TestLongTypes.py (1828 of 2410) PASS: lldb-unit :: Utility/./UtilityTests/SerializationRountripTest.SerializeDeserializeCString (1829 of 2410) PASS: lldb-shell :: SymbolFile/Breakpad/line-table-edgecases.test (1830 of 2410) UNSUPPORTED: lldb-api :: functionalities/tsan/multiple/TestTsanMultiple.py (1831 of 2410) PASS: lldb-unit :: Utility/./UtilityTests/GeneratorTest.Get (1832 of 2410) PASS: lldb-api :: functionalities/breakpoint/serialize/TestBreakpointSerialization.py (1833 of 2410) PASS: lldb-api :: macosx/duplicate-archive-members/TestDuplicateMembers.py (1834 of 2410) PASS: lldb-shell :: Minidump/disassemble-no-module.yaml (1835 of 2410) PASS: lldb-shell :: SymbolFile/DWARF/x86/find-function-regex.cpp (1836 of 2410) PASS: lldb-unit :: Utility/./UtilityTests/BinaryStreamTest.PutULEB128Zero (1837 of 2410) PASS: lldb-api :: lang/cpp/class-template-parameter-pack/TestClassTemplateParameterPack.py (1838 of 2410) PASS: lldb-unit :: Utility/./UtilityTests/OptionsWithRawTest.ArgsButNoDelimiter (1839 of 2410) UNSUPPORTED: lldb-api :: commands/watchpoints/hello_watchlocation/TestWatchLocation.py (1840 of 2410) PASS: lldb-unit :: Utility/./UtilityTests/ArgsTest.TestSingleArgWithQuotedSpace (1841 of 2410) PASS: lldb-unit :: Utility/./UtilityTests/OptionsWithRawTest.EmptySuffix (1842 of 2410) PASS: lldb-api :: functionalities/breakpoint/move_nearest/TestMoveNearest.py (1843 of 2410) PASS: lldb-unit :: Language/Highlighting/./HighlighterTests/HighlighterTest.HighlighterSelectionPath (1844 of 2410) PASS: lldb-unit :: ScriptInterpreter/Python/./ScriptInterpreterPythonTests/PythonDataObjectsTest.TestPythonTupleInitializerList (1845 of 2410) PASS: lldb-api :: functionalities/thread/concurrent_events/TestConcurrentCrashWithBreak.py (1846 of 2410) PASS: lldb-unit :: Utility/./UtilityTests/StreamTeeTest.Constructor1Stream (1847 of 2410) PASS: lldb-shell :: SymbolFile/DWARF/x86/debug_ranges-missing-section.s (1848 of 2410) PASS: lldb-api :: functionalities/gdb_remote_client/TestGDBRemotePlatformFile.py (1849 of 2410) PASS: lldb-unit :: Utility/./UtilityTests/Flags.Test (1850 of 2410) PASS: lldb-unit :: Process/minidump/./LLDBMinidumpTests/MinidumpParserTest.GetMemory (1851 of 2410) PASS: lldb-unit :: Utility/./UtilityTests/ScalarTest.Scalar_512 (1852 of 2410) PASS: lldb-shell :: SymbolFile/NativePDB/nested-types.cpp (1853 of 2410) PASS: lldb-unit :: Utility/./UtilityTests/SerializationRountripTest.SerializeDeserializePod (1854 of 2410) PASS: lldb-unit :: debugserver/./debugserverTests/JSON.Parse (1855 of 2410) PASS: lldb-unit :: Utility/./UtilityTests/ArgsTest.TestAppendArg (1856 of 2410) PASS: lldb-api :: commands/expression/fixits/TestFixIts.py (1857 of 2410) PASS: lldb-api :: lang/c/complex_int/TestComplexInt.py (1858 of 2410) PASS: lldb-unit :: Utility/./UtilityTests/StringListTest.InsertStringAtIndexEnd (1859 of 2410) PASS: lldb-shell :: ObjectFile/ELF/section-types-edgecases.yaml (1860 of 2410) PASS: lldb-unit :: Host/./HostTests/SocketTests/SocketTest.DomainListenConnectAccept/ipv6 (1861 of 2410) PASS: lldb-api :: functionalities/data-formatter/data-formatter-stl/libcxx/variant/TestDataFormatterLibcxxVariant.py (1862 of 2410) PASS: lldb-api :: functionalities/rerun/TestRerun.py (1863 of 2410) PASS: lldb-shell :: Reproducer/TestDump.test (1864 of 2410) PASS: lldb-unit :: Utility/./UtilityTests/OptionsWithRawTest.EmptyInput (1865 of 2410) PASS: lldb-api :: functionalities/data-formatter/data-formatter-objc/TestDataFormatterObjCExpr.py (1866 of 2410) PASS: lldb-unit :: Utility/./UtilityTests/CompletionRequest.TryCompleteCurrentArgMode (1867 of 2410) PASS: lldb-unit :: Core/./LLDBCoreTests/SourceFileCache.FindSourceFileFound (1868 of 2410) UNSUPPORTED: lldb-api :: commands/trace/TestTraceTimestampCounters.py (1869 of 2410) PASS: lldb-api :: functionalities/gdb_remote_client/TestNoWatchpointSupportInfo.py (1870 of 2410) UNSUPPORTED: lldb-shell :: SymbolFile/PDB/typedefs.test (1871 of 2410) PASS: lldb-unit :: Process/gdb-remote/./ProcessGdbRemoteTests/GDBRemoteCommunicationServerTest.SendErrorResponse_UnimplementedError (1872 of 2410) PASS: lldb-unit :: Utility/./UtilityTests/StringExtractorTest.GetU64LittleEndian (1873 of 2410) PASS: lldb-unit :: Core/./LLDBCoreTests/MangledTest.ResultForValidName (1874 of 2410) PASS: lldb-api :: functionalities/dynamic_value_child_count/TestDynamicValueChildCount.py (1875 of 2410) PASS: lldb-api :: lang/objcxx/objcxx-ivar-vector/TestIvarVector.py (1876 of 2410) PASS: lldb-api :: lang/cpp/printf/TestPrintf.py (1877 of 2410) PASS: lldb-api :: macosx/order/TestOrderFile.py (1878 of 2410) PASS: lldb-unit :: UnwindAssembly/x86/./UnwindAssemblyx86Tests/Testx86AssemblyInspectionEngine.TestPushR15 (1879 of 2410) UNSUPPORTED: lldb-shell :: Register/aarch64-fp-read.test (1880 of 2410) PASS: lldb-shell :: ScriptInterpreter/Python/command_import.test (1881 of 2410) PASS: lldb-unit :: UnwindAssembly/x86/./UnwindAssemblyx86Tests/Testx86AssemblyInspectionEngine.TestStackRealign8BitDisp_i386 (1882 of 2410) PASS: lldb-api :: types/TestDoubleTypes.py (1883 of 2410) PASS: lldb-unit :: Language/Highlighting/./HighlighterTests/HighlighterTest.DefaultHighlighter (1884 of 2410) PASS: lldb-unit :: Process/Utility/./ProcessUtilityTests/MemoryTagManagerAArch64MTETest.PackTags (1885 of 2410) PASS: lldb-api :: commands/expression/namespace_local_var_same_name_obj_c/TestNamespaceLocalVarSameNameObjC.py (1886 of 2410) PASS: lldb-shell :: Driver/TestHelp.test (1887 of 2410) PASS: lldb-api :: functionalities/breakpoint/step_over_breakpoint/TestStepOverBreakpoint.py (1888 of 2410) UNSUPPORTED: lldb-shell :: Subprocess/clone-follow-parent-wp.test (1889 of 2410) PASS: lldb-api :: lang/cpp/signed_types/TestSignedTypes.py (1890 of 2410) PASS: lldb-unit :: Utility/./UtilityTests/SharedCluster.ClusterManager (1891 of 2410) PASS: lldb-api :: functionalities/thread/concurrent_events/TestConcurrentTwoWatchpointsOneDelayBreakpoint.py (1892 of 2410) PASS: lldb-api :: lang/objc/variadic_methods/TestVariadicMethods.py (1893 of 2410) PASS: lldb-shell :: SymbolFile/NativePDB/source-list.cpp (1894 of 2410) PASS: lldb-api :: commands/expression/persistent_types/TestNestedPersistentTypes.py (1895 of 2410) PASS: lldb-api :: functionalities/data-formatter/data-formatter-objc/TestDataFormatterObjCNSDate.py (1896 of 2410) PASS: lldb-unit :: Utility/./UtilityTests/StringListTest.Join (1897 of 2410) PASS: lldb-unit :: Utility/./UtilityTests/StringExtractorTest.InitEmpty (1898 of 2410) PASS: lldb-shell :: Recognizer/assert.test (1899 of 2410) PASS: lldb-unit :: Utility/./UtilityTests/FileSpecTest.CopyByAppendingPathComponent (1900 of 2410) PASS: lldb-unit :: Process/gdb-remote/./ProcessGdbRemoteTests/PortMapTest.FreePort (1901 of 2410) PASS: lldb-unit :: Utility/./UtilityTests/RangeTest.ClearWithStarAddress (1902 of 2410) PASS: lldb-api :: tools/lldb-server/TestGdbRemoteAttach.py (1903 of 2410) PASS: lldb-unit :: ScriptInterpreter/Python/./ScriptInterpreterPythonTests/PythonDataObjectsTest.TestExceptions (1904 of 2410) PASS: lldb-unit :: Symbol/./SymbolTests/TestCreateClassTemplateDecl.FindExistingTemplates (1905 of 2410) PASS: lldb-unit :: Utility/./UtilityTests/UriParserTest.BracketedHostnameWithPortIPv6 (1906 of 2410) PASS: lldb-api :: lang/c/array_types/TestArrayTypes.py (1907 of 2410) PASS: lldb-api :: lang/objc/objc-baseclass-sbtype/TestObjCBaseClassSBType.py (1908 of 2410) PASS: lldb-unit :: Symbol/./SymbolTests/TestScratchTypeSystemClang.InferSubASTFromLangOpts (1909 of 2410) PASS: lldb-unit :: Utility/./UtilityTests/UriParserTest.BracketedHostnameWithPortIPv4 (1910 of 2410) PASS: lldb-unit :: Utility/./UtilityTests/LogChannelTest.EnableOptions (1911 of 2410) PASS: lldb-api :: python_api/exprpath_synthetic/TestExprPathSynthetic.py (1912 of 2410) PASS: lldb-api :: functionalities/abbreviation/TestCommonShortSpellings.py (1913 of 2410) PASS: lldb-shell :: SymbolFile/DWARF/DW_AT_range-DW_FORM_sec_offset.s (1914 of 2410) PASS: lldb-shell :: SymbolFile/DWARF/x86/debug_rnglists-dwo.s (1915 of 2410) PASS: lldb-api :: functionalities/deleted-executable/TestDeletedExecutable.py (1916 of 2410) PASS: lldb-unit :: Utility/./UtilityTests/ArgsTest.DoubleQuotedItem (1917 of 2410) PASS: lldb-api :: commands/command/nested_alias/TestNestedAlias.py (1918 of 2410) PASS: lldb-shell :: SymbolFile/DWARF/x86/debug_rnglists.s (1919 of 2410) PASS: lldb-api :: functionalities/data-formatter/user-format-vs-summary/TestUserFormatVsSummary.py (1920 of 2410) PASS: lldb-unit :: Process/Utility/./ProcessUtilityTests/ProcMapTests/LinuxProcMapsTestFixture.ParseMapRegions/0 (1921 of 2410) PASS: lldb-unit :: Expression/./ExpressionTests/DiagnosticManagerTest.PutStringSeverities (1922 of 2410) PASS: lldb-api :: commands/statistics/basic/TestStats.py (1923 of 2410) PASS: lldb-shell :: Reproducer/TestFileRepro.test (1924 of 2410) PASS: lldb-api :: api/log/TestAPILog.py (1925 of 2410) PASS: lldb-unit :: Process/gdb-remote/./ProcessGdbRemoteTests/GDBRemoteCommunicationClientTest.SendSignalsToIgnore (1926 of 2410) PASS: lldb-shell :: Reproducer/TestRelativePath.test (1927 of 2410) PASS: lldb-unit :: Utility/./UtilityTests/StringListTest.ShiftStdString (1928 of 2410) PASS: lldb-api :: commands/expression/import-std-module/sysroot/TestStdModuleSysroot.py (1929 of 2410) PASS: lldb-unit :: Utility/./UtilityTests/DataExtractorTest.GetMaxU64_unchecked (1930 of 2410) PASS: lldb-api :: functionalities/breakpoint/address_breakpoints/TestAddressBreakpoints.py (1931 of 2410) PASS: lldb-shell :: SymbolFile/DWARF/x86/DW_AT_data_bit_offset-DW_OP_stack_value.s (1932 of 2410) XFAIL: lldb-shell :: Expr/nodefaultlib.cpp (1933 of 2410) PASS: lldb-api :: functionalities/plugins/python_os_plugin/stepping_plugin_threads/TestOSPluginStepping.py (1934 of 2410) PASS: lldb-unit :: ObjectFile/Breakpad/./ObjectFileBreakpadTests/FileRecord.parse (1935 of 2410) PASS: lldb-unit :: UnwindAssembly/x86/./UnwindAssemblyx86Tests/Testx86AssemblyInspectionEngine.TestSimplex86_64Augmented (1936 of 2410) PASS: lldb-shell :: ObjectFile/ELF/section-overlap.yaml (1937 of 2410) PASS: lldb-api :: lang/cpp/operators/TestCppOperators.py (1938 of 2410) PASS: lldb-shell :: SymbolFile/DWARF/clang-ast-from-dwarf-objc-property.m (1939 of 2410) PASS: lldb-shell :: SymbolFile/DWARF/x86/dwarf5-debug_line-file-index.s (1940 of 2410) PASS: lldb-api :: commands/expression/import-std-module/stack/TestStackFromStdModule.py (1941 of 2410) PASS: lldb-api :: functionalities/process_group/TestChangeProcessGroup.py (1942 of 2410) PASS: lldb-unit :: Utility/./UtilityTests/ArgsTest.TestQuotedTrailingBackslash (1943 of 2410) PASS: lldb-unit :: Symbol/./SymbolTests/PostfixExpression.ParseOneExpression (1944 of 2410) PASS: lldb-unit :: Utility/./UtilityTests/StringLexerTest.PutBack (1945 of 2410) PASS: lldb-api :: lang/c/find_struct_type/TestFindStructTypes.py (1946 of 2410) PASS: lldb-shell :: SymbolFile/DWARF/x86/DW_AT_decl_file-DW_AT_specification-crosscu.s (1947 of 2410) PASS: lldb-shell :: Commands/CommandScriptImmediateOutput/CommandScriptImmediateOutputFile.test (1948 of 2410) PASS: lldb-api :: python_api/section/TestSectionAPI.py (1949 of 2410) UNSUPPORTED: lldb-api :: functionalities/thread/break_after_join/TestBreakAfterJoin.py (1950 of 2410) PASS: lldb-api :: commands/register/register/register_command/TestRegisters.py (1951 of 2410) UNSUPPORTED: lldb-shell :: ObjectFile/ELF/minidebuginfo-no-lzma.yaml (1952 of 2410) PASS: lldb-api :: lang/objc/foundation/TestObjCMethodsNSArray.py (1953 of 2410) PASS: lldb-api :: lang/cpp/rvalue-references/TestRvalueReferences.py (1954 of 2410) PASS: lldb-shell :: SymbolFile/DWARF/x86/debug_line-tombstone.s (1955 of 2410) PASS: lldb-unit :: Utility/./UtilityTests/ScalarTest.Comparison (1956 of 2410) PASS: lldb-shell :: ScriptInterpreter/Python/Crashlog/parser_text.test (1957 of 2410) PASS: lldb-unit :: Utility/./UtilityTests/StringExtractorTest.GetHexU8_Extra_NoEof (1958 of 2410) PASS: lldb-unit :: Expression/./ExpressionTests/DWARFExpression.DW_OP_piece (1959 of 2410) PASS: lldb-api :: lang/cpp/template-arguments/TestCppTemplateArguments.py (1960 of 2410) PASS: lldb-api :: lang/cpp/elaborated-types/TestElaboratedTypes.py (1961 of 2410) PASS: lldb-api :: functionalities/tail_call_frames/disambiguate_paths_to_common_sink/TestDisambiguatePathsToCommonSink.py (1962 of 2410) PASS: lldb-unit :: Utility/./UtilityTests/StringLexerTest.NextIf (1963 of 2410) PASS: lldb-unit :: Language/Highlighting/./HighlighterTests/HighlighterTest.ClangSquareBrackets (1964 of 2410) PASS: lldb-unit :: Process/minidump/./LLDBMinidumpTests/MinidumpParserTest.GetMiscInfo_no_stream (1965 of 2410) PASS: lldb-api :: lang/objc/radar-9691614/TestObjCMethodReturningBOOL.py (1966 of 2410) PASS: lldb-api :: functionalities/data-formatter/data-formatter-objc/TestDataFormatterObjCCF.py (1967 of 2410) PASS: lldb-api :: macosx/add-dsym/TestAddDsymDownload.py (1968 of 2410) PASS: lldb-unit :: Utility/./UtilityTests/OptionsWithRawTest.WhitespaceSuffix (1969 of 2410) PASS: lldb-api :: commands/expression/entry-bp/TestExprEntryBP.py (1970 of 2410) PASS: lldb-unit :: Utility/./UtilityTests/StringListTest.CopyListEmpty (1971 of 2410) PASS: lldb-unit :: Utility/./UtilityTests/DataExtractorTest.GetDouble (1972 of 2410) PASS: lldb-api :: python_api/class_members/TestSBTypeClassMembers.py (1973 of 2410) PASS: lldb-api :: lang/objc/objc-struct-argument/TestObjCStructArgument.py (1974 of 2410) PASS: lldb-unit :: Utility/./UtilityTests/RangeTest.ContainsEndInclusiveInvalid (1975 of 2410) PASS: lldb-api :: lang/objc/blocks/TestObjCIvarsInBlocks.py (1976 of 2410) PASS: lldb-api :: functionalities/data-formatter/frameformat_smallstruct/TestFrameFormatSmallStruct.py (1977 of 2410) PASS: lldb-shell :: ObjectFile/Breakpad/uuid-matching-mac.test (1978 of 2410) PASS: lldb-unit :: Utility/./UtilityTests/UserIDResolver.GetGroupName (1979 of 2410) PASS: lldb-api :: commands/expression/timeout/TestCallWithTimeout.py (1980 of 2410) PASS: lldb-unit :: Utility/./UtilityTests/OptionsWithRawTest.EmptySuffixSingleWhitespace (1981 of 2410) PASS: lldb-api :: python_api/lldbutil/iter/TestLLDBIterator.py (1982 of 2410) PASS: lldb-unit :: Core/./LLDBCoreTests/SourceLocationSpecTest.Compare (1983 of 2410) UNSUPPORTED: lldb-shell :: Subprocess/fork-follow-parent-softbp.test (1984 of 2410) PASS: lldb-shell :: Commands/command-target-modules-dump-sections.yaml (1985 of 2410) UNSUPPORTED: lldb-shell :: ExecControl/StopHook/stop-hook-threads.test (1986 of 2410) PASS: lldb-shell :: Register/Core/x86-32-linux-fp.test (1987 of 2410) PASS: lldb-unit :: Host/./HostTests/MainLoopTest.ReadObject (1988 of 2410) PASS: lldb-unit :: Utility/./UtilityTests/PassiveReplayTest.InstrumentedFoo (1989 of 2410) PASS: lldb-unit :: Utility/./UtilityTests/AnsiTerminal.Incomplete (1990 of 2410) PASS: lldb-api :: lang/cpp/scope/TestCppScope.py (1991 of 2410) PASS: lldb-unit :: ScriptInterpreter/Python/./ScriptInterpreterPythonTests/PythonDataObjectsTest.TestOwnedReferences (1992 of 2410) PASS: lldb-unit :: Utility/./UtilityTests/RangeTest.LessThanInvalid (1993 of 2410) PASS: lldb-unit :: Expression/./ExpressionTests/CppModuleConfigurationTest.IgnoreLibStdCpp (1994 of 2410) PASS: lldb-unit :: Utility/./UtilityTests/ListenerTest.GetEventWait (1995 of 2410) PASS: lldb-unit :: Utility/./UtilityTests/TimeoutTest.Format (1996 of 2410) PASS: lldb-unit :: Utility/./UtilityTests/StringListTest.InsertStringAtIndexStdString (1997 of 2410) PASS: lldb-api :: tools/lldb-vscode/console/TestVSCode_console.py (1998 of 2410) PASS: lldb-unit :: Utility/./UtilityTests/StreamTest.ShiftOperatorStrings (1999 of 2410) PASS: lldb-shell :: ObjectFile/ELF/minidebuginfo-find-symbols.yaml (2000 of 2410) PASS: lldb-api :: tools/lldb-server/signal-filtering/TestGdbRemote_QPassSignals.py (2001 of 2410) PASS: lldb-unit :: Utility/./UtilityTests/StreamTeeTest.DefaultConstructor (2002 of 2410) PASS: lldb-api :: lang/c/enum_types/TestEnumTypes.py (2003 of 2410) PASS: lldb-api :: commands/process/launch-with-shellexpand/TestLaunchWithShellExpand.py (2004 of 2410) PASS: lldb-shell :: ObjectFile/ELF/base-address.yaml (2005 of 2410) UNSUPPORTED: lldb-shell :: SymbolFile/Breakpad/stack-cfi-arm.yaml (2006 of 2410) PASS: lldb-unit :: Core/./LLDBCoreTests/DumpDataExtractorTest.MultiLine (2007 of 2410) UNSUPPORTED: lldb-api :: commands/gui/breakpoints/TestGuiBreakpoints.py (2008 of 2410) PASS: lldb-unit :: Core/./LLDBCoreTests/FormatEntity.LookupAllEntriesInTree (2009 of 2410) PASS: lldb-unit :: Language/Highlighting/./HighlighterTests/HighlighterTest.ClangCursorPosEndOfLine (2010 of 2410) UNSUPPORTED: lldb-api :: repl/clang/TestClangREPL.py (2011 of 2410) PASS: lldb-shell :: ObjectFile/ELF/PT_LOAD-overlap-PT_INTERP.yaml (2012 of 2410) PASS: lldb-api :: functionalities/gdb_remote_client/TestJLink6Armv7RegisterDefinition.py (2013 of 2410) PASS: lldb-unit :: Utility/./UtilityTests/SerializationRountripTest.SerializeDeserializeObjectPointer (2014 of 2410) PASS: lldb-api :: commands/expression/persist_objc_pointeetype/TestPersistObjCPointeeType.py (2015 of 2410) PASS: lldb-api :: functionalities/data-formatter/data-formatter-ptr-to-array/TestPtrToArrayFormatting.py (2016 of 2410) PASS: lldb-api :: lang/cpp/function-qualifiers/TestCppFunctionQualifiers.py (2017 of 2410) PASS: lldb-unit :: UnwindAssembly/x86/./UnwindAssemblyx86Tests/Testx86AssemblyInspectionEngine.TestPushEAX (2018 of 2410) PASS: lldb-shell :: ObjectFile/MachO/subsections.yaml (2019 of 2410) UNSUPPORTED: lldb-shell :: Subprocess/clone-follow-child-wp.test (2020 of 2410) PASS: lldb-unit :: Utility/./UtilityTests/DataExtractorTest.GetFloatUnaligned (2021 of 2410) PASS: lldb-unit :: Utility/./UtilityTests/BroadcasterTest.BroadcastEvent (2022 of 2410) PASS: lldb-unit :: Host/./HostTests/SocketTests/SocketTest.UDPGetConnectURI/ipv6 (2023 of 2410) PASS: lldb-api :: functionalities/data-formatter/data-formatter-stl/libcxx/shared_ptr/TestDataFormatterLibcxxSharedPtr.py (2024 of 2410) PASS: lldb-shell :: Minidump/fb-dump.test (2025 of 2410) PASS: lldb-api :: macosx/lc-note/kern-ver-str/TestKernVerStrLCNOTE.py (2026 of 2410) PASS: lldb-api :: lang/objc/foundation/TestRuntimeTypes.py (2027 of 2410) PASS: lldb-api :: lang/c/unicode/TestUnicodeSymbols.py (2028 of 2410) PASS: lldb-unit :: Utility/./UtilityTests/StringListTest.AppendStringStdString (2029 of 2410) PASS: lldb-api :: functionalities/breakpoint/objc/TestObjCBreakpoints.py (2030 of 2410) PASS: lldb-unit :: Utility/./UtilityTests/Flags.AllClear (2031 of 2410) PASS: lldb-unit :: SymbolFile/DWARF/./SymbolFileDWARFTests/DWARFUnitTest.MissingSentinel (2032 of 2410) PASS: lldb-unit :: Utility/./UtilityTests/UriParserTest.SchemeHostSeparator3 (2033 of 2410) PASS: lldb-unit :: Interpreter/./InterpreterTests/OptionArgParserTest.toChar (2034 of 2410) PASS: lldb-shell :: Register/Core/x86-64-netbsd-gp.test (2035 of 2410) PASS: lldb-unit :: Utility/./UtilityTests/StreamTest.AddressRangeEmptyRange (2036 of 2410) PASS: lldb-api :: python_api/findvalue_duplist/TestSBFrameFindValue.py (2037 of 2410) XFAIL: lldb-shell :: Unwind/prefer-debug-over-eh-frame.test (2038 of 2410) PASS: lldb-unit :: ScriptInterpreter/Python/./ScriptInterpreterPythonTests/PythonDataObjectsTest.TestPythonInteger (2039 of 2410) PASS: lldb-unit :: Process/minidump/./LLDBMinidumpTests/MinidumpParserTest.GetMemoryRegionInfoFromMemory64List (2040 of 2410) PASS: lldb-unit :: Process/gdb-remote/./ProcessGdbRemoteTests/GDBRemoteClientBaseTest.InterruptNoResponse (2041 of 2410) PASS: lldb-shell :: Breakpoint/debug_addrx.test (2042 of 2410) PASS: lldb-api :: functionalities/gdb_remote_client/TestGDBRemoteClient.py (2043 of 2410) PASS: lldb-api :: functionalities/thread/concurrent_events/TestConcurrentBreakpointDelayBreakpointOneSignal.py (2044 of 2410) PASS: lldb-unit :: Utility/./UtilityTests/LogTest.Register (2045 of 2410) UNSUPPORTED: lldb-api :: tools/lldb-server/TestGdbRemoteSaveCore.py (2046 of 2410) PASS: lldb-shell :: ScriptInterpreter/Python/Crashlog/parser_json.test (2047 of 2410) PASS: lldb-api :: commands/frame/diagnose/bad-reference/TestBadReference.py (2048 of 2410) PASS: lldb-unit :: Utility/./UtilityTests/StreamTest.PutMaxHex64ByteOrderLittle (2049 of 2410) PASS: lldb-unit :: Symbol/./SymbolTests/DWARFCallFrameInfoTest.Basic_dwarf4 (2050 of 2410) PASS: lldb-api :: commands/expression/rdar44436068/Test128BitsInteger.py (2051 of 2410) PASS: lldb-unit :: Core/./LLDBCoreTests/RichManglingContextTest.Basic (2052 of 2410) PASS: lldb-api :: arm/emulation/TestEmulations.py (2053 of 2410) PASS: lldb-unit :: Utility/./UtilityTests/RegisterValueTest.GetSet8 (2054 of 2410) PASS: lldb-unit :: Host/./HostTests/FileSystemTest.GetByteSize (2055 of 2410) PASS: lldb-api :: commands/expression/char/TestExprsChar.py (2056 of 2410) PASS: lldb-unit :: Utility/./UtilityTests/RangeTest.ContainsEndInclusive (2057 of 2410) PASS: lldb-unit :: Symbol/./SymbolTests/TestTypeSystemClang.TestNotDeletingUserCopyCstrDueToMoveCStr (2058 of 2410) UNSUPPORTED: lldb-shell :: SymbolFile/dissassemble-entry-point.s (2059 of 2410) PASS: lldb-api :: functionalities/data-formatter/format-propagation/TestFormatPropagation.py (2060 of 2410) PASS: lldb-api :: functionalities/thread/jump/TestThreadJump.py (2061 of 2410) PASS: lldb-shell :: Commands/command-backtrace-parser-1.test (2062 of 2410) PASS: lldb-unit :: API/./APITests/SBStructuredDataTest.NullImpl (2063 of 2410) PASS: lldb-api :: commands/expression/import-std-module/missing-module-sources/TestStdModuleSourcesMissing.py (2064 of 2410) PASS: lldb-api :: functionalities/memory/read/TestMemoryRead.py (2065 of 2410) PASS: lldb-unit :: Interpreter/./InterpreterTests/OptionValueString.DeepCopy (2066 of 2410) PASS: lldb-unit :: Symbol/./SymbolTests/Type.CompilerContextPattern (2067 of 2410) PASS: lldb-unit :: Utility/./UtilityTests/BinaryStreamTest.PutULEB128SixBytes (2068 of 2410) PASS: lldb-shell :: Commands/command-breakpoint-col.test (2069 of 2410) UNSUPPORTED: lldb-api :: lang/c/typedef/Testtypedef.py (2070 of 2410) PASS: lldb-api :: lang/cpp/char8_t/TestCxxChar8_t.py (2071 of 2410) PASS: lldb-api :: commands/watchpoints/hello_watchpoint/TestMyFirstWatchpoint.py (2072 of 2410) PASS: lldb-unit :: Platform/./LLDBPlatformTests/PlatformAppleSimulatorTest.TestHostPlatformToSim (2073 of 2410) PASS: lldb-api :: lang/objc/rdar-11355592/TestRdar11355592.py (2074 of 2410) PASS: lldb-shell :: ObjectFile/ELF/minidebuginfo-corrupt-xz.yaml (2075 of 2410) PASS: lldb-unit :: Process/minidump/./LLDBMinidumpTests/MinidumpParserTest.GetPidWow64 (2076 of 2410) PASS: lldb-unit :: Utility/./UtilityTests/FileSpecTest.Equal (2077 of 2410) PASS: lldb-unit :: SymbolFile/NativePDB/./SymbolFileNativePDBTests/PDBFPOProgramToDWARFExpressionTests.UnresolvedDependentCyclicRegisterAssignmentReference (2078 of 2410) PASS: lldb-api :: python_api/watchpoint/TestSetWatchpoint.py (2079 of 2410) PASS: lldb-shell :: Reproducer/TestProcessList.test (2080 of 2410) PASS: lldb-api :: types/TestRecursiveTypes.py (2081 of 2410) PASS: lldb-api :: functionalities/breakpoint/global_constructor/TestBreakpointInGlobalConstructor.py (2082 of 2410) PASS: lldb-unit :: UnwindAssembly/x86/./UnwindAssemblyx86Tests/Testx86AssemblyInspectionEngine.Test64bitFramelessSmallStackFrame (2083 of 2410) PASS: lldb-unit :: Platform/./LLDBPlatformTests/PlatformDarwinTest.FindComponentInPath (2084 of 2410) PASS: lldb-unit :: Core/./LLDBCoreTests/SourceLocationSpecTest.Equal (2085 of 2410) PASS: lldb-unit :: SymbolFile/NativePDB/./SymbolFileNativePDBTests/PDBFPOProgramToDWARFExpressionTests.InvalidOpUnary (2086 of 2410) PASS: lldb-shell :: SymbolFile/Breakpad/line-table.test (2087 of 2410) PASS: lldb-unit :: Utility/./UtilityTests/RangeDataVector.CustomSort (2088 of 2410) PASS: lldb-unit :: Utility/./UtilityTests/AnsiTerminal.Unknown (2089 of 2410) PASS: lldb-api :: functionalities/tail_call_frames/thread_step_out_message/TestArtificialFrameStepOutMessage.py (2090 of 2410) PASS: lldb-shell :: SymbolFile/DWARF/x86/DW_TAG_variable-invalid_location.s (2091 of 2410) PASS: lldb-unit :: Utility/./UtilityTests/XcodeSDKTest.SDKSupportsModules (2092 of 2410) PASS: lldb-api :: commands/expression/argument_passing_restrictions/TestArgumentPassingRestrictions.py (2093 of 2410) PASS: lldb-api :: tools/lldb-server/commandline/TestGdbRemoteConnection.py (2094 of 2410) PASS: lldb-api :: functionalities/step_scripted/TestStepScripted.py (2095 of 2410) PASS: lldb-unit :: Host/./HostTests/SocketTests/SocketTest.DecodeHostAndPort/ipv4 (2096 of 2410) PASS: lldb-shell :: ObjectFile/ELF/PT_LOAD-overlap-section.yaml (2097 of 2410) PASS: lldb-unit :: Expression/./ExpressionTests/CppModuleConfigurationTest.AmbiguousCLib (2098 of 2410) PASS: lldb-shell :: SymbolFile/NativePDB/break-by-function.cpp (2099 of 2410) PASS: lldb-shell :: SymbolFile/DWARF/x86/debug_loclists-dwo.s (2100 of 2410) PASS: lldb-api :: tools/lldb-vscode/stackTrace/TestVSCode_stackTrace.py (2101 of 2410) PASS: lldb-api :: lang/cpp/namespace/TestNamespaceLookup.py (2102 of 2410) PASS: lldb-api :: lang/cpp/type_lookup/TestCppTypeLookup.py (2103 of 2410) PASS: lldb-api :: functionalities/postmortem/minidump/TestMiniDump.py (2104 of 2410) PASS: lldb-unit :: Symbol/./SymbolTests/TestTypeSystemClang.AddMethodToObjCObjectType (2105 of 2410) PASS: lldb-api :: functionalities/data-formatter/data-formatter-stl/libcxx/iterator/TestDataFormatterLibccIterator.py (2106 of 2410) UNSUPPORTED: lldb-api :: linux/aarch64/mte_memory_region/TestAArch64LinuxMTEMemoryRegion.py (2107 of 2410) PASS: lldb-shell :: SymbolFile/Breakpad/unwind-via-stack-win.test (2108 of 2410) PASS: lldb-unit :: Utility/./UtilityTests/BinaryStreamTest.PutULEB128FiveBytes (2109 of 2410) PASS: lldb-unit :: Utility/./UtilityTests/StringListTest.RemoveBlankLines (2110 of 2410) PASS: lldb-api :: commands/disassemble/basic/TestFrameDisassemble.py (2111 of 2410) PASS: lldb-api :: functionalities/inferior-assert/TestInferiorAssert.py (2112 of 2410) PASS: lldb-unit :: Utility/./UtilityTests/PassiveReplayTest.InstrumentedBar (2113 of 2410) PASS: lldb-api :: commands/target/basic/TestTargetCommand.py (2114 of 2410) PASS: lldb-unit :: Process/minidump/./LLDBMinidumpTests/MinidumpParserTest.GetMiscInfoWindows (2115 of 2410) PASS: lldb-shell :: Register/x86-multithread-write.test (2116 of 2410) UNSUPPORTED: lldb-shell :: Register/x86-64-zmm-read.test (2117 of 2410) PASS: lldb-api :: functionalities/tail_call_frames/cross_object/TestCrossObjectTailCalls.py (2118 of 2410) PASS: lldb-unit :: Host/./HostTests/ProcessLaunchInfoTest.Constructor (2119 of 2410) PASS: lldb-api :: functionalities/breakpoint/address_breakpoints/TestBadAddressBreakpoints.py (2120 of 2410) PASS: lldb-unit :: Utility/./UtilityTests/StringListTest.JoinMultiCharSeparator (2121 of 2410) PASS: lldb-api :: functionalities/tail_call_frames/sbapi_support/TestTailCallFrameSBAPI.py (2122 of 2410) PASS: lldb-unit :: debugserver/./debugserverTests/RNBSocket.LoopBackConnectIPv4 (2123 of 2410) PASS: lldb-unit :: DataFormatter/./LLDBFormatterTests/TypeMatcherTests.GetMatchStringRegex (2124 of 2410) PASS: lldb-unit :: Utility/./UtilityTests/LogChannelEnabledTest.log_options (2125 of 2410) PASS: lldb-api :: functionalities/data-formatter/data-formatter-stl/libcxx/unordered/TestDataFormatterUnordered.py (2126 of 2410) PASS: lldb-shell :: Reproducer/Functionalities/TestExpressionEvaluation.test (2127 of 2410) PASS: lldb-api :: lang/objc/single-entry-dictionary/TestObjCSingleEntryDictionary.py (2128 of 2410) PASS: lldb-unit :: Symbol/./SymbolTests/TestTypeSystemClang.GetExeModuleWhenMissingSymbolFile (2129 of 2410) PASS: lldb-unit :: Utility/./UtilityTests/RecordReplayTest.ValidSequence (2130 of 2410) PASS: lldb-api :: tools/lldb-vscode/launch/TestVSCode_launch.py (2131 of 2410) PASS: lldb-shell :: VSCode/TestOptions.test (2132 of 2410) PASS: lldb-api :: lang/cpp/std-function-step-into-callable/TestStdFunctionStepIntoCallable.py (2133 of 2410) UNSUPPORTED: lldb-api :: iohandler/unicode/TestUnicode.py (2134 of 2410) PASS: lldb-api :: functionalities/thread/concurrent_events/TestConcurrentManyWatchpoints.py (2135 of 2410) PASS: lldb-unit :: Utility/./UtilityTests/PassiveReplayTest.InstrumentedFooInvalid (2136 of 2410) PASS: lldb-unit :: SymbolFile/NativePDB/./SymbolFileNativePDBTests/PDBFPOProgramToDWARFExpressionTests.MultipleIndependentAssignments (2137 of 2410) PASS: lldb-unit :: SymbolFile/DWARF/./SymbolFileDWARFTests/DWARFASTParserClangTests.EnsureAllDIEsInDeclContextHaveBeenParsedParsesOnlyMatchingEntries (2138 of 2410) PASS: lldb-api :: functionalities/thread/exit_during_expression/TestExitDuringExpression.py (2139 of 2410) PASS: lldb-unit :: Utility/./UtilityTests/UriParserTest.SchemeHostSeparator2 (2140 of 2410) PASS: lldb-unit :: Utility/./UtilityTests/RangeTest.Clear (2141 of 2410) PASS: lldb-api :: functionalities/data-formatter/nssetsynth/TestNSSetSynthetic.py (2142 of 2410) PASS: lldb-unit :: Language/Highlighting/./HighlighterTests/HighlighterTest.ClangPPDirectives (2143 of 2410) PASS: lldb-unit :: Target/./TargetTests/PathMappingListTest.CrossPlatformTests (2144 of 2410) PASS: lldb-unit :: Utility/./UtilityTests/UriParserTest.BracketedHostnameWithColon (2145 of 2410) PASS: lldb-api :: functionalities/data-formatter/data-formatter-objc/nsstring/TestDataFormatterNSString.py (2146 of 2410) PASS: lldb-unit :: Utility/./UtilityTests/RangeTest.Union (2147 of 2410) PASS: lldb-api :: commands/platform/file/read/TestPlatformFileRead.py (2148 of 2410) PASS: lldb-unit :: Expression/./ExpressionTests/DiagnosticManagerTest.AddDiagnostic (2149 of 2410) PASS: lldb-unit :: Utility/./UtilityTests/ScalarTest.RightShiftOperator (2150 of 2410) UNSUPPORTED: lldb-api :: commands/watchpoints/watch_tagged_addr/TestWatchTaggedAddress.py (2151 of 2410) PASS: lldb-api :: python_api/process/TestProcessAPI.py (2152 of 2410) PASS: lldb-api :: tools/lldb-server/TestLldbGdbServer.py (2153 of 2410) PASS: lldb-api :: python_api/watchpoint/condition/TestWatchpointConditionAPI.py (2154 of 2410) PASS: lldb-unit :: Utility/./UtilityTests/ArgsTest.GetShellSafeArgument (2155 of 2410) PASS: lldb-api :: commands/expression/radar_9531204/TestPrintfAfterUp.py (2156 of 2410) PASS: lldb-unit :: Utility/./UtilityTests/StringListTest.JoinThree (2157 of 2410) PASS: lldb-api :: functionalities/thread/concurrent_events/TestConcurrentBreakpointOneDelayBreakpointThreads.py (2158 of 2410) PASS: lldb-shell :: SymbolFile/NativePDB/s_constant.cpp (2159 of 2410) UNSUPPORTED: lldb-shell :: Register/arm-fp-read.test (2160 of 2410) UNSUPPORTED: lldb-api :: tools/lldb-vscode/disconnect/TestVSCode_disconnect.py (2161 of 2410) PASS: lldb-api :: lang/cpp/virtual-overload/TestVirtualOverload.py (2162 of 2410) UNSUPPORTED: lldb-api :: functionalities/tty/TestTerminal.py (2163 of 2410) PASS: lldb-api :: python_api/thread/TestThreadAPI.py (2164 of 2410) PASS: lldb-api :: functionalities/breakpoint/debugbreak/TestDebugBreak.py (2165 of 2410) PASS: lldb-unit :: Utility/./UtilityTests/DataExtractorTest.GetBitfield (2166 of 2410) PASS: lldb-shell :: SymbolFile/DWARF/x86/dwarf5_locations.s (2167 of 2410) PASS: lldb-unit :: ObjectFile/ELF/./ObjectFileELFTests/ObjectFileELFTest.GetSymtab_NoSymEntryPointArmThumbAddressClass (2168 of 2410) PASS: lldb-unit :: UnwindAssembly/x86/./UnwindAssemblyx86Tests/Testx86AssemblyInspectionEngine.TestPopEBX (2169 of 2410) PASS: lldb-api :: functionalities/var_path/TestVarPath.py (2170 of 2410) PASS: lldb-unit :: Symbol/./SymbolTests/TestClangASTImporter.MetadataPropagationAfterCopying (2171 of 2410) UNSUPPORTED: lldb-api :: functionalities/disassemble/aarch64-adrp-add/TestAArch64AdrpAdd.py (2172 of 2410) PASS: lldb-unit :: Utility/./UtilityTests/StringLexerTest.GetUnlexed (2173 of 2410) PASS: lldb-api :: functionalities/thread/concurrent_events/TestConcurrentWatchpointDelayWatchpointOneBreakpoint.py (2174 of 2410) PASS: lldb-shell :: SymbolFile/NativePDB/ast-functions.cpp (2175 of 2410) PASS: lldb-shell :: SymbolFile/DWARF/x86/DW_AT_const_value-bitfields.s (2176 of 2410) PASS: lldb-unit :: Utility/./UtilityTests/FileSpecTest.GetPath (2177 of 2410) PASS: lldb-api :: python_api/watchpoint/TestWatchpointIter.py (2178 of 2410) PASS: lldb-unit :: UnwindAssembly/x86/./UnwindAssemblyx86Tests/Testx86AssemblyInspectionEngine.TestPopR12 (2179 of 2410) UNSUPPORTED: lldb-api :: macosx/posix_spawn/TestLaunchProcessPosixSpawn.py (2180 of 2410) PASS: lldb-api :: functionalities/gdb_remote_client/TestWriteMemory.py (2181 of 2410) PASS: lldb-api :: functionalities/data-formatter/data-formatter-synthtype/TestDataFormatterSynthType.py (2182 of 2410) PASS: lldb-shell :: SymbolFile/DWARF/x86/debug-types-missing-signature.test (2183 of 2410) PASS: lldb-api :: functionalities/signal/handle-abrt/TestHandleAbort.py (2184 of 2410) PASS: lldb-api :: python_api/name_lookup/TestNameLookup.py (2185 of 2410) PASS: lldb-unit :: Utility/./UtilityTests/StringListTest.ForRangeEmpty (2186 of 2410) PASS: lldb-api :: functionalities/thread/concurrent_events/TestConcurrentTwoBreakpointsOneDelaySignal.py (2187 of 2410) PASS: lldb-api :: functionalities/gdb_remote_client/TestGDBServerTargetXML.py (2188 of 2410) PASS: lldb-shell :: SymbolFile/NativePDB/disassembly.cpp (2189 of 2410) UNSUPPORTED: lldb-api :: benchmarks/libcxxmap/TestBenchmarkLibcxxMap.py (2190 of 2410) PASS: lldb-api :: functionalities/limit-debug-info/TestLimitDebugInfo.py (2191 of 2410) UNSUPPORTED: lldb-api :: functionalities/data-formatter/data-formatter-stl/libstdcpp/smart_ptr/TestDataFormatterStdSmartPtr.py (2192 of 2410) PASS: lldb-unit :: Process/gdb-remote/./ProcessGdbRemoteTests/GDBRemoteClientBaseTest.SendContinueDelegateInterface (2193 of 2410) PASS: lldb-api :: lang/c/step-target/TestStepTarget.py (2194 of 2410) PASS: lldb-api :: tools/lldb-vscode/evaluate/TestVSCode_evaluate.py (2195 of 2410) PASS: lldb-api :: lang/objc/objc-ivar-protocols/TestIvarProtocols.py (2196 of 2410) UNSUPPORTED: lldb-api :: functionalities/data-formatter/data-formatter-stl/libstdcpp/map/TestDataFormatterStdMap.py (2197 of 2410) PASS: lldb-unit :: Utility/./UtilityTests/UriParserTest.Minimal (2198 of 2410) UNSUPPORTED: lldb-api :: commands/expression/import-std-module/pair/TestPairFromStdModule.py (2199 of 2410) PASS: lldb-shell :: SymbolFile/DWARF/x86/dwp-separate-debug-file.cpp (2200 of 2410) PASS: lldb-api :: commands/expression/scoped_enums/TestScopedEnumType.py (2201 of 2410) PASS: lldb-api :: sanity/TestModuleCacheSanity.py (2202 of 2410) PASS: lldb-api :: functionalities/breakpoint/breakpoint_ids/TestBreakpointIDs.py (2203 of 2410) PASS: lldb-api :: lang/cpp/class-template-non-type-parameter-pack/TestClassTemplateNonTypeParameterPack.py (2204 of 2410) PASS: lldb-api :: functionalities/data-formatter/vector-types/TestVectorTypesFormatting.py (2205 of 2410) PASS: lldb-unit :: Utility/./UtilityTests/NameMatchesTest.Ignore (2206 of 2410) PASS: lldb-api :: functionalities/thread/concurrent_events/TestConcurrentDelayedCrashWithBreakpointSignal.py (2207 of 2410) PASS: lldb-api :: functionalities/data-formatter/language_category_updates/TestDataFormatterLanguageCategoryUpdates.py (2208 of 2410) PASS: lldb-unit :: Symbol/./SymbolTests/TestTypeSystemClang.TestGetEnumIntegerTypeInvalid (2209 of 2410) PASS: lldb-unit :: Utility/./UtilityTests/RegularExpression.Empty (2210 of 2410) PASS: lldb-unit :: Utility/./UtilityTests/ArgsTest.BareSingleQuote (2211 of 2410) PASS: lldb-unit :: UnwindAssembly/x86/./UnwindAssemblyx86Tests/Testx86AssemblyInspectionEngine.TestPushExtended (2212 of 2410) PASS: lldb-api :: commands/session/history/TestSessionHistory.py (2213 of 2410) PASS: lldb-shell :: Register/Core/x86-32-freebsd-gp.test (2214 of 2410) PASS: lldb-api :: functionalities/data-formatter/data-formatter-globals/TestDataFormatterGlobals.py (2215 of 2410) UNSUPPORTED: lldb-api :: commands/register/register/intel_xtended_registers/mpx_offset_intersection/TestMPXOffsetIntersection.py (2216 of 2410) PASS: lldb-api :: lang/cpp/overloaded-functions/TestOverloadedFunctions.py (2217 of 2410) PASS: lldb-shell :: SymbolFile/DWARF/x86/DW_AT_location-DW_AT_const_value.s (2218 of 2410) UNSUPPORTED: lldb-shell :: BuildScript/toolchain-clang-cl.test (2219 of 2410) PASS: lldb-unit :: DataFormatter/./LLDBFormatterTests/TypeMatcherTests.RegexMatchPart (2220 of 2410) PASS: lldb-unit :: Process/gdb-remote/./ProcessGdbRemoteTests/PortMapTest.AllowPort (2221 of 2410) PASS: lldb-unit :: Utility/./UtilityTests/StringExtractorTest.GetHexBytes_OddPair (2222 of 2410) PASS: lldb-unit :: Process/gdb-remote/./ProcessGdbRemoteTests/GDBRemoteCommunicationServerTest.SendErrorResponse_StringError (2223 of 2410) PASS: lldb-api :: commands/expression/import-std-module/queue/TestQueueFromStdModule.py (2224 of 2410) PASS: lldb-api :: functionalities/data-formatter/ptr_ref_typedef/TestPtrRef2Typedef.py (2225 of 2410) PASS: lldb-api :: functionalities/data-formatter/data-formatter-stl/libcxx/string/TestDataFormatterLibcxxString.py (2226 of 2410) PASS: lldb-api :: assert_messages_test/TestAssertMessages.py (2227 of 2410) PASS: lldb-unit :: Utility/./UtilityTests/ArgsTest.TestTrailingBackslash (2228 of 2410) UNSUPPORTED: lldb-api :: commands/register/register/aarch64_dynamic_regset/TestArm64DynamicRegsets.py (2229 of 2410) PASS: lldb-unit :: Utility/./UtilityTests/SerializationRountripTest.SerializeDeserializeCStringNull (2230 of 2410) UNSUPPORTED: lldb-shell :: Unwind/eh-frame-augment-noop.test (2231 of 2410) PASS: lldb-unit :: Utility/./UtilityTests/StatusTest.ErrorCodeConstructor (2232 of 2410) PASS: lldb-unit :: Utility/./UtilityTests/StringExtractorTest.GetU64BigEndian (2233 of 2410) UNSUPPORTED: lldb-api :: functionalities/tsan/thread_numbers/TestTsanThreadNumbers.py (2234 of 2410) PASS: lldb-api :: commands/platform/process/list/TestProcessList.py (2235 of 2410) PASS: lldb-shell :: Reproducer/TestReuseDirectory.test (2236 of 2410) PASS: lldb-api :: macosx/builtin-debugtrap/TestBuiltinDebugTrap.py (2237 of 2410) PASS: lldb-api :: lang/cpp/class-template-type-parameter-pack/TestClassTemplateTypeParameterPack.py (2238 of 2410) PASS: lldb-unit :: Utility/./UtilityTests/OptionsWithRawTest.SingleWhitespaceInput (2239 of 2410) PASS: lldb-unit :: ScriptInterpreter/Python/./ScriptInterpreterPythonTests/PythonDataObjectsTest.TestPythonCallableInvoke (2240 of 2410) PASS: lldb-unit :: Process/minidump/./LLDBMinidumpTests/MinidumpParserTest.GetThreadContext_x86_32 (2241 of 2410) PASS: lldb-api :: functionalities/gdb_remote_client/TestThreadInfoTrailingComma.py (2242 of 2410) UNSUPPORTED: lldb-api :: linux/thread/create_during_instruction_step/TestCreateDuringInstructionStep.py (2243 of 2410) PASS: lldb-api :: macosx/add-dsym/TestAddDsymMidExecutionCommand.py (2244 of 2410) PASS: lldb-shell :: ObjectFile/ELF/avr-basic-info.yaml (2245 of 2410) PASS: lldb-api :: commands/frame/language/TestGuessLanguage.py (2246 of 2410) PASS: lldb-api :: functionalities/data-formatter/refpointer-recursion/TestDataFormatterRefPtrRecursion.py (2247 of 2410) PASS: lldb-unit :: Core/./LLDBCoreTests/DumpDataExtractorTest.ItemByteSizeErrors (2248 of 2410) PASS: lldb-shell :: Commands/command-stop-hook-output.test (2249 of 2410) PASS: lldb-api :: functionalities/thread/concurrent_events/TestConcurrentTwoBreakpointsOneSignal.py (2250 of 2410) UNSUPPORTED: lldb-shell :: SymbolFile/NativePDB/local-variables.cpp (2251 of 2410) PASS: lldb-unit :: UnwindAssembly/x86/./UnwindAssemblyx86Tests/Testx86AssemblyInspectionEngine.Test32bitFramelessBigStackFrame (2252 of 2410) PASS: lldb-unit :: Expression/./ExpressionTests/DiagnosticManagerTest.AppendMessageSubsequentDiags (2253 of 2410) PASS: lldb-api :: lang/objc/foundation/TestConstStrings.py (2254 of 2410) PASS: lldb-api :: macosx/nslog/TestDarwinNSLogOutput.py (2255 of 2410) PASS: lldb-unit :: ObjectFile/Breakpad/./ObjectFileBreakpadTests/FuncRecord.parse (2256 of 2410) PASS: lldb-unit :: Utility/./UtilityTests/RegisterValueTest.GetScalarValue (2257 of 2410) PASS: lldb-unit :: Utility/./UtilityTests/Flags.Clear (2258 of 2410) PASS: lldb-api :: commands/expression/pr35310/TestExprsBug35310.py (2259 of 2410) PASS: lldb-shell :: SymbolFile/DWARF/x86/dwarf5-implicit-const.s (2260 of 2410) PASS: lldb-shell :: SymbolFile/DWARF/x86/module-ownership.mm (2261 of 2410) PASS: lldb-api :: tools/lldb-vscode/coreFile/TestVSCode_coreFile.py (2262 of 2410) PASS: lldb-api :: lang/c/vla/TestVLA.py (2263 of 2410) PASS: lldb-api :: commands/watchpoints/watchpoint_on_vectors/TestValueOfVectorVariable.py (2264 of 2410) PASS: lldb-unit :: Symbol/./SymbolTests/DWARFCallFrameInfoTest.Basic_dwarf3 (2265 of 2410) PASS: lldb-api :: commands/watchpoints/watchpoint_count/TestWatchpointCount.py (2266 of 2410) PASS: lldb-api :: lang/objc/warnings-in-expr-parser/TestObjCWarningsInExprParser.py (2267 of 2410) PASS: lldb-api :: lang/objc/modules-cache/TestClangModulesCache.py (2268 of 2410) PASS: lldb-unit :: Utility/./UtilityTests/StreamTeeTest.SetStreamAtIndexOutOfBounds (2269 of 2410) PASS: lldb-api :: functionalities/gdb_remote_client/TestTargetXMLArch.py (2270 of 2410) PASS: lldb-unit :: ScriptInterpreter/Python/./ScriptInterpreterPythonTests/PythonDataObjectsTest.TestDictionaryResolutionWithDot (2271 of 2410) PASS: lldb-unit :: Process/gdb-remote/./ProcessGdbRemoteTests/GDBRemoteCommunicationClientTest.SaveRestoreRegistersNoSuffix (2272 of 2410) PASS: lldb-shell :: SymbolFile/DWARF/x86/dwarf5-index-is-used.cpp (2273 of 2410) PASS: lldb-unit :: Expression/./ExpressionTests/CppModuleConfigurationTest.LinuxLocalLibCpp (2274 of 2410) PASS: lldb-api :: python_api/sblaunchinfo/TestSBLaunchInfo.py (2275 of 2410) PASS: lldb-unit :: Language/Highlighting/./HighlighterTests/HighlighterTest.ClangCursorPosBeforeOtherToken (2276 of 2410) UNSUPPORTED: lldb-shell :: Register/x86-zmm-read.test (2277 of 2410) PASS: lldb-api :: functionalities/value_md5_crash/TestValueMD5Crash.py (2278 of 2410) PASS: lldb-unit :: Utility/./UtilityTests/StreamTeeTest.Write (2279 of 2410) PASS: lldb-shell :: Breakpoint/case-sensitive.test (2280 of 2410) PASS: lldb-shell :: Breakpoint/jit-loader_jitlink_elf.test (2281 of 2410) PASS: lldb-unit :: Utility/./UtilityTests/StringExtractorTest.DecodeHexU8_InvalidHex2 (2282 of 2410) PASS: lldb-unit :: SymbolFile/DWARF/./SymbolFileDWARFTests/SymbolFileDWARFTests.TestAbbrevNullAttrValidForm (2283 of 2410) PASS: lldb-unit :: Utility/./UtilityTests/StringExtractorTest.GetHexBytes_OddPair2 (2284 of 2410) PASS: lldb-unit :: Utility/./UtilityTests/VMRange.Comparison (2285 of 2410) PASS: lldb-unit :: Interpreter/./InterpreterTests/OptionValueArgs.DeepCopy (2286 of 2410) PASS: lldb-shell :: SymbolFile/DWARF/x86/debug-types-line-tables.s (2287 of 2410) UNSUPPORTED: lldb-api :: commands/gui/expand-threads-tree/TestGuiExpandThreadsTree.py (2288 of 2410) PASS: lldb-api :: functionalities/gdb_remote_client/TestFork.py (2289 of 2410) PASS: lldb-api :: commands/expression/anonymous-struct/TestCallUserAnonTypedef.py (2290 of 2410) PASS: lldb-shell :: SymbolFile/Breakpad/line-table-discontinuous-file-ids.test (2291 of 2410) PASS: lldb-unit :: Process/minidump/./LLDBMinidumpTests/MinidumpParserTest.MinidumpDuplicateModuleSeparateCode (2292 of 2410) PASS: lldb-api :: functionalities/stop-on-sharedlibrary-load/TestStopOnSharedlibraryEvents.py (2293 of 2410) UNSUPPORTED: lldb-shell :: SymbolFile/PDB/enums-layout.test (2294 of 2410) PASS: lldb-shell :: ScriptInterpreter/Python/silent_command_script_import.test (2295 of 2410) PASS: lldb-unit :: UnwindAssembly/x86/./UnwindAssemblyx86Tests/Testx86AssemblyInspectionEngine.TestSpillRegToStackViaMOVx86_64 (2296 of 2410) PASS: lldb-shell :: Register/x86-64-read.test (2297 of 2410) PASS: lldb-unit :: ScriptInterpreter/Python/./ScriptInterpreterPythonTests/PythonDataObjectsTest.TestPythonByteArray (2298 of 2410) PASS: lldb-unit :: Host/./HostTests/HostInfoTest.GetHostname (2299 of 2410) PASS: lldb-unit :: Core/./LLDBCoreTests/MangledTest.ResultForValidRustV0Name (2300 of 2410) PASS: lldb-api :: commands/source/info/TestSourceInfo.py (2301 of 2410) PASS: lldb-unit :: Expression/./ExpressionTests/DWARFExpression.DW_OP_pick (2302 of 2410) PASS: lldb-shell :: SymbolFile/DWARF/dwo-relative-path.s (2303 of 2410) PASS: lldb-unit :: Utility/./UtilityTests/ConstStringTest.CompareConstString (2304 of 2410) PASS: lldb-api :: commands/apropos/basic/TestApropos.py (2305 of 2410) PASS: lldb-shell :: SymbolFile/NativePDB/ast-types.cpp (2306 of 2410) PASS: lldb-api :: sample_test/TestSampleInlineTest.py (2307 of 2410) PASS: lldb-shell :: Unwind/thread-step-out-ret-addr-check.test (2308 of 2410) PASS: lldb-api :: functionalities/data-formatter/pyobjsynthprovider/TestPyObjSynthProvider.py (2309 of 2410) PASS: lldb-unit :: UnwindAssembly/x86/./UnwindAssemblyx86Tests/Testx86AssemblyInspectionEngine.TestAddESP (2310 of 2410) PASS: lldb-unit :: Utility/./UtilityTests/XcodeSDKTest.ParseTest (2311 of 2410) PASS: lldb-unit :: Process/minidump/./LLDBMinidumpTests/MinidumpParserTest.GetArchitectureWindows (2312 of 2410) PASS: lldb-unit :: Utility/./UtilityTests/UUIDTest.SetFromStringRef (2313 of 2410) UNSUPPORTED: lldb-shell :: SymbolFile/DWARF/x86/dwarf5-line-strp.s (2314 of 2410) PASS: lldb-shell :: Breakpoint/debug_rnglist_rlestartend.test (2315 of 2410) PASS: lldb-api :: lang/cpp/template/TestTemplateArgs.py (2316 of 2410) PASS: lldb-unit :: Utility/./UtilityTests/StringExtractorTest.GetHexBytes_FullString (2317 of 2410) PASS: lldb-unit :: Utility/./UtilityTests/CompletionRequest.DuplicateFilteringWithComments (2318 of 2410) PASS: lldb-api :: python_api/sbplatform/TestSBPlatform.py (2319 of 2410) PASS: lldb-unit :: Utility/./UtilityTests/StreamTest.PutHex64ByteOrderBig (2320 of 2410) PASS: lldb-unit :: Utility/./UtilityTests/Flags.IsClear (2321 of 2410) PASS: lldb-unit :: Core/./LLDBCoreTests/MangledTest.ResultForBlockInvocation (2322 of 2410) PASS: lldb-unit :: Utility/./UtilityTests/StringListTest.CopyListSingle (2323 of 2410) PASS: lldb-api :: functionalities/breakpoint/breakpoint_options/TestBreakpointOptions.py (2324 of 2410) PASS: lldb-api :: functionalities/target_var/no_vars/TestTargetVarNoVars.py (2325 of 2410) PASS: lldb-unit :: Process/minidump/./LLDBMinidumpTests/MinidumpParserTest.GetArchitecture (2326 of 2410) UNSUPPORTED: lldb-api :: functionalities/tsan/global_location/TestTsanGlobalLocation.py (2327 of 2410) PASS: lldb-api :: commands/process/attach/TestProcessAttach.py (2328 of 2410) PASS: lldb-api :: lang/objc/exceptions/TestObjCExceptions.py (2329 of 2410) PASS: lldb-api :: macosx/find-app-in-bundle/TestFindAppInBundle.py (2330 of 2410) UNSUPPORTED: lldb-api :: functionalities/longjmp/TestLongjmp.py (2331 of 2410) PASS: lldb-unit :: Utility/./UtilityTests/ProcessInstanceInfo.DumpTable_invalidUID (2332 of 2410) PASS: lldb-unit :: Process/gdb-remote/./ProcessGdbRemoteTests/GDBRemoteCommunicationClientTest.GetModulesInfo (2333 of 2410) PASS: lldb-unit :: Symbol/./SymbolTests/TestTypeSystemClang.TestBuiltinTypeForEncodingAndBitSize (2334 of 2410) PASS: lldb-shell :: ObjectFile/ELF/section-types.yaml (2335 of 2410) PASS: lldb-unit :: Symbol/./SymbolTests/TestTypeSystemClang.TestFunctionTemplateConstruction (2336 of 2410) PASS: lldb-api :: commands/watchpoints/watchpoint_set_command/TestWatchLocationWithWatchSet.py (2337 of 2410) PASS: lldb-unit :: Utility/./UtilityTests/StringExtractorTest.GetHexU8_Underflow (2338 of 2410) PASS: lldb-shell :: ObjectFile/ELF/netbsd-core-amd64.test (2339 of 2410) PASS: lldb-unit :: Host/./HostTests/SocketAddressTest.Set (2340 of 2410) PASS: lldb-unit :: API/./APITests/SBCommandInterpreterTest.MultiWordCommand (2341 of 2410) PASS: lldb-api :: macosx/save_crashlog/TestSaveCrashlog.py (2342 of 2410) PASS: lldb-api :: functionalities/thread/concurrent_events/TestConcurrentSignalDelayWatch.py (2343 of 2410) PASS: lldb-shell :: SymbolFile/DWARF/x86/apple-index-is-used.cpp (2344 of 2410) PASS: lldb-api :: functionalities/breakpoint/consecutive_breakpoints/TestConsecutiveBreakpoints.py (2345 of 2410) UNSUPPORTED: lldb-api :: functionalities/ptrauth_diagnostics/BLRAA_error/TestPtrauthBLRAADiagnostic.py (2346 of 2410) PASS: lldb-unit :: ObjectFile/Breakpad/./ObjectFileBreakpadTests/Record.classify (2347 of 2410) UNSUPPORTED: lldb-api :: benchmarks/continue/TestBenchmarkContinue.py (2348 of 2410) PASS: lldb-shell :: BuildScript/toolchain-clang.test (2349 of 2410) PASS: lldb-unit :: Target/./TargetTests/PathMappingListTest.RemapRoot (2350 of 2410) PASS: lldb-api :: macosx/DBGSourcePathRemapping/TestDSYMSourcePathRemapping.py (2351 of 2410) PASS: lldb-unit :: Process/Utility/./ProcessUtilityTests/ProcMapTests/LinuxProcMapsTestFixture.ParseMapRegions/3 (2352 of 2410) PASS: lldb-shell :: Register/Core/x86-64-freebsd-fp.test (2353 of 2410) PASS: lldb-shell :: ObjectFile/ELF/many-sections.s (2354 of 2410) PASS: lldb-unit :: Utility/./UtilityTests/StringExtractorTest.GetHexU8_Extra (2355 of 2410) PASS: lldb-api :: commands/expression/xvalue/TestXValuePrinting.py (2356 of 2410) PASS: lldb-shell :: Expr/TestMultilineExpr.test (2357 of 2410) UNSUPPORTED: lldb-api :: lang/objc/objc-dynamic-value/TestObjCDynamicValue.py (2358 of 2410) PASS: lldb-unit :: ScriptInterpreter/Python/./ScriptInterpreterPythonTests/PythonDataObjectsTest.TestPythonBytes (2359 of 2410) PASS: lldb-api :: functionalities/type_lookup/TestTypeLookup.py (2360 of 2410) PASS: lldb-unit :: Core/./LLDBCoreTests/DumpDataExtractorTest.FormatCharArray (2361 of 2410) PASS: lldb-unit :: Utility/./UtilityTests/FileSpecTest.RemoveLastPathComponent (2362 of 2410) PASS: lldb-unit :: Process/gdb-remote/./ProcessGdbRemoteTests/GDBRemoteCommunicationClientTest.GetQOffsets (2363 of 2410) PASS: lldb-unit :: Process/gdb-remote/./ProcessGdbRemoteTests/GDBRemoteClientBaseTest.SendContinueDelegateStructuredDataReceipt (2364 of 2410) PASS: lldb-unit :: Symbol/./SymbolTests/LineEntryTest.GetSameLineContiguousAddressRangeNestedInline (2365 of 2410) PASS: lldb-api :: lang/objc/objc-ivar-stripped/TestObjCIvarStripped.py (2366 of 2410) PASS: lldb-unit :: Utility/./UtilityTests/StringLexerTest.Peek (2367 of 2410) PASS: lldb-api :: lang/objc/objc-runtime-ivars/TestRuntimeIvars.py (2368 of 2410) PASS: lldb-unit :: Utility/./UtilityTests/UriParserTest.BracketedHostnamePort (2369 of 2410) PASS: lldb-api :: functionalities/data-formatter/var-in-aggregate-misuse/TestVarInAggregateMisuse.py (2370 of 2410) PASS: lldb-shell :: SymbolFile/NativePDB/function-types-calling-conv.cpp (2371 of 2410) PASS: lldb-unit :: Utility/./UtilityTests/RangeTest.SetRangeBase (2372 of 2410) PASS: lldb-api :: lang/objc/print-obj/TestPrintObj.py (2373 of 2410) PASS: lldb-api :: functionalities/thread/exit_during_step/TestExitDuringStep.py (2374 of 2410) PASS: lldb-api :: functionalities/data-formatter/data-formatter-smart-array/TestDataFormatterSmartArray.py (2375 of 2410) UNSUPPORTED: lldb-api :: commands/expression/macros/TestMacros.py (2376 of 2410) PASS: lldb-unit :: Utility/./UtilityTests/ArgsTest.ReplaceArgumentAtIndexShort (2377 of 2410) PASS: lldb-unit :: Language/Highlighting/./HighlighterTests/HighlighterTest.ClangCursorPosInOtherToken (2378 of 2410) PASS: lldb-unit :: DataFormatter/./LLDBFormatterTests/TypeMatcherTests.CreatedBySameMatchString (2379 of 2410) PASS: lldb-api :: functionalities/thread/concurrent_events/TestConcurrentDelaySignalBreak.py (2380 of 2410) PASS: lldb-api :: tools/lldb-server/memory-allocation/TestGdbRemoteMemoryAllocation.py (2381 of 2410) UNSUPPORTED: lldb-api :: functionalities/thread/thread_specific_break_plus_condition/TestThreadSpecificBpPlusCondition.py (2382 of 2410) PASS: lldb-unit :: Utility/./UtilityTests/LogChannelTest.Enable (2383 of 2410) PASS: lldb-unit :: Utility/./UtilityTests/SubsystemRAIITest.SubsystemWithErrorFailure (2384 of 2410) PASS: lldb-unit :: Expression/./ExpressionTests/DiagnosticManagerTest.GetStringMultipleDiags (2385 of 2410) PASS: lldb-api :: functionalities/data-formatter/data-formatter-objc/TestDataFormatterObjCNSError.py (2386 of 2410) PASS: lldb-unit :: Utility/./UtilityTests/StreamTest.PutHex8 (2387 of 2410) UNSUPPORTED: lldb-api :: functionalities/data-formatter/data-formatter-stl/libstdcpp/vector/TestDataFormatterStdVector.py (2388 of 2410) PASS: lldb-api :: commands/platform/file/close/TestPlatformFileClose.py (2389 of 2410) PASS: lldb-unit :: Utility/./UtilityTests/BinaryStreamTest.PutSLEB128SixBytes (2390 of 2410) PASS: lldb-api :: functionalities/thread/num_threads/TestNumThreads.py (2391 of 2410) PASS: lldb-api :: functionalities/thread/concurrent_events/TestConcurrentTwoWatchpointsOneSignal.py (2392 of 2410) PASS: lldb-unit :: UnwindAssembly/x86/./UnwindAssemblyx86Tests/Testx86AssemblyInspectionEngine.Test32BitOnlyInstruction (2393 of 2410) PASS: lldb-unit :: Utility/./UtilityTests/TimerTest.CategoryTimesNested (2394 of 2410) PASS: lldb-unit :: Utility/./UtilityTests/UriParserTest.MinimalPortPath (2395 of 2410) PASS: lldb-api :: lang/cpp/symbols/TestSymbols.py (2396 of 2410) UNSUPPORTED: lldb-api :: arm/breakpoint-it/TestBreakpointIt.py (2397 of 2410) PASS: lldb-unit :: Utility/./UtilityTests/StringLexerTest.AdvanceIf (2398 of 2410) PASS: lldb-unit :: Symbol/./SymbolTests/TestTypeSystemMap.GetTypeSystemForLanguageWithNoModule (2399 of 2410) PASS: lldb-unit :: UnwindAssembly/x86/./UnwindAssemblyx86Tests/Testx86AssemblyInspectionEngine.TestPushR13 (2400 of 2410) PASS: lldb-api :: python_api/sbvalue_persist/TestSBValuePersist.py (2401 of 2410) PASS: lldb-api :: lang/cpp/function-local-class/TestCppFunctionLocalClass.py (2402 of 2410) PASS: lldb-shell :: Quit/TestQuitExitCodeNonInt.test (2403 of 2410) PASS: lldb-api :: lang/cpp/chained-calls/TestCppChainedCalls.py (2404 of 2410) PASS: lldb-api :: lang/cpp/reference-to-outer-type/TestCppReferenceToOuterClass.py (2405 of 2410) PASS: lldb-unit :: Utility/./UtilityTests/RecordReplayTest.InstrumentedBar (2406 of 2410) PASS: lldb-api :: functionalities/data-formatter/data-formatter-named-summaries/TestDataFormatterNamedSummaries.py (2407 of 2410) PASS: lldb-api :: lang/cpp/virtual-functions/TestCppVirtualFunctions.py (2408 of 2410) PASS: lldb-api :: lang/cpp/constructors/TestCppConstructors.py (2409 of 2410) PASS: lldb-api :: commands/expression/import-std-module/list/TestListFromStdModule.py (2410 of 2410) Slowest Tests: -------------------------------------------------------------------------- 267.56s: lldb-api :: tools/lldb-server/TestLldbGdbServer.py 193.71s: lldb-api :: functionalities/memory-region/TestMemoryRegion.py 142.43s: lldb-api :: api/multithreaded/TestMultithreaded.py 126.61s: lldb-api :: macosx/skinny-corefile/TestSkinnyCorefile.py 115.89s: lldb-api :: macosx/stack-corefile/TestStackCorefile.py 91.66s: lldb-api :: functionalities/gdb_remote_client/TestWasm.py 85.67s: lldb-api :: types/TestLongTypesExpr.py 73.16s: lldb-api :: lang/objc/exceptions/TestObjCExceptions.py 71.49s: lldb-api :: commands/expression/import-std-module/queue/TestQueueFromStdModule.py 70.38s: lldb-api :: commands/expression/import-std-module/stack/TestStackFromStdModule.py 65.29s: lldb-api :: lang/objc/hidden-ivars/TestHiddenIvars.py 63.70s: lldb-api :: lang/cpp/namespace/TestNamespaceLookup.py 62.91s: lldb-api :: lang/objc/objc-new-syntax/TestObjCNewSyntaxLiteral.py 61.21s: lldb-api :: commands/expression/import-std-module/vector/TestVectorFromStdModule.py 58.16s: lldb-api :: lang/objc/foundation/TestObjCMethods.py 54.55s: lldb-api :: types/TestIntegerTypeExpr.py 51.16s: lldb-api :: commands/expression/import-std-module/deque-basic/TestDequeFromStdModule.py 51.03s: lldb-api :: tools/lldb-server/TestGdbRemoteThreadsInStopReply.py 50.71s: lldb-api :: python_api/target/TestTargetAPI.py 48.70s: lldb-api :: types/TestLongTypes.py

Hide Details

Tests Times: -------------------------------------------------------------------------- [ Range ] :: [ Percentage ] :: [ Count ] -------------------------------------------------------------------------- [260s,280s) :: [ ] :: [ 1/2410] [240s,260s) :: [ ] :: [ 0/2410] [220s,240s) :: [ ] :: [ 0/2410] [200s,220s) :: [ ] :: [ 1/2410] [180s,200s) :: [ ] :: [ 0/2410] [160s,180s) :: [ ] :: [ 0/2410] [140s,160s) :: [ ] :: [ 1/2410] [120s,140s) :: [ ] :: [ 2/2410] [100s,120s) :: [ ] :: [ 0/2410] [ 80s,100s) :: [ ] :: [ 2/2410] [ 60s, 80s) :: [ ] :: [ 8/2410] [ 40s, 60s) :: [ ] :: [ 17/2410] [ 20s, 40s) :: [* ] :: [ 79/2410] [ 0s, 20s) :: [************************************** ] :: [2299/2410] -------------------------------------------------------------------------- ******************** Failed Tests (2): lldb-unit :: Host/./HostTests/SocketTests/SocketTest.DomainGetConnectURI/ipv4 lldb-unit :: Host/./HostTests/SocketTests/SocketTest.DomainGetConnectURI/ipv6

Hide Details

Hide Details

Testing Time: 2582.90s Unsupported : 231 Passed : 2167 Expectedly Failed: 10 Failed : 2 FAILED: tools/lldb/test/CMakeFiles/check-lldb cd /Users/buildslave/jenkins/workspace/lldb-cmake-sanitized/lldb-build/tools/lldb/test && /usr/local/Frameworks/Python.framework/Versions/3.7/bin/python3.7 /Users/buildslave/jenkins/workspace/lldb-cmake-sanitized/lldb-build/./bin/llvm-lit -v --time-tests --shuffle --xunit-xml-output=/Users/buildslave/jenkins/workspace/lldb-cmake-sanitized/test/results.xml -v -j 4 --timeout 1200 /Users/buildslave/jenkins/workspace/lldb-cmake-sanitized/lldb-build/tools/lldb/test ninja: build stopped: subcommand failed. Command failed: Command '['/usr/bin/env', 'TERM=vt100', '/usr/local/bin/ninja', '-v', 'check-lldb']' returned non-zero exit status 1. Command: ['/usr/bin/env', 'TERM=vt100', '/usr/local/bin/ninja', '-v', 'check-lldb'] [Pipeline] } [Pipeline] // timeout [Pipeline] } [Pipeline] // stage [Pipeline] stage [Pipeline] { (Declarative: Post Actions) [Pipeline] scanForIssues [Clang] Sleeping for 5 seconds due to JENKINS-32191... [Clang] Parsing console log (workspace: '/Users/buildslave/jenkins/workspace/lldb-cmake-sanitized') [Clang] -> found 4 issues (skipped 0 duplicates) [Clang] Parsing console log (workspace: '/Users/buildslave/jenkins/workspace/lldb-cmake-sanitized') [Clang] -> found 4 issues (skipped 0 duplicates) [Clang] Successfully parsed console log [Clang] -> found 4 issues (skipped 0 duplicates) [Clang] Parsing console log (workspace: '/Users/buildslave/jenkins/workspace/lldb-cmake-sanitized') [Clang] Post processing issues on 'green-dragon-23' with source code encoding 'UTF-8' [Clang] Creating SCM blamer to obtain author and commit information for affected files [Clang] -> No blamer installed yet. You need to install the 'git-forensics' plugin to enable blaming for Git. [Clang] Resolving file names for all issues in source directory '/Users/buildslave/jenkins/workspace/lldb-cmake-sanitized' [Clang] -> resolved paths in source directory (4 found, 0 not found) [Clang] Resolving module names from module definitions (build.xml, pom.xml, or Manifest.mf files) [Clang] -> resolved module names for 4 issues [Clang] Resolving package names (or namespaces) by parsing the affected files [Clang] -> resolved package names of 4 affected files [Clang] No filter has been set, publishing all 4 issues [Clang] Creating fingerprints for all affected code blocks to track issues over different builds [Clang] -> created fingerprints for 4 issues (skipped 0 issues) [Clang] Copying affected files to Jenkins' build folder '/Users/Shared/Jenkins/Home/jobs/lldb-cmake-sanitized/builds/1987/files-with-issues' [Clang] -> 4 copied, 0 not in workspace, 0 not-found, 0 with I/O error [Clang] Repository miner is not configured, skipping repository mining [Pipeline] junit Recording test results [Checks API] No suitable checks publisher found. [Pipeline] } [Pipeline] // stage [Pipeline] } [Pipeline] // withEnv [Pipeline] } [Pipeline] // node [Pipeline] End of Pipeline ERROR: script returned exit code 1 Finished: FAILURE