Console Output

Skipping 675 KB.. Full Log

Hide Details

Write auxiliary files write-file /Users/buildslave/jenkins/workspace/lldb-cmake-standalone/lldb-xcode-build/lldb.build/Release/ALL_BUILD.build/Script-FACE46A3C655487C8CD4507B.sh chmod 0755 /Users/buildslave/jenkins/workspace/lldb-cmake-standalone/lldb-xcode-build/lldb.build/Release/ALL_BUILD.build/Script-FACE46A3C655487C8CD4507B.sh

Hide Details

PhaseScriptExecution CMake\ Rules /Users/buildslave/jenkins/workspace/lldb-cmake-standalone/lldb-xcode-build/lldb.build/Release/ALL_BUILD.build/Script-FACE46A3C655487C8CD4507B.sh cd /Users/buildslave/jenkins/workspace/lldb-cmake-standalone/llvm-project/lldb /bin/sh -c /Users/buildslave/jenkins/workspace/lldb-cmake-standalone/lldb-xcode-build/lldb.build/Release/ALL_BUILD.build/Script-FACE46A3C655487C8CD4507B.sh echo ""

Hide Details

echo Build\ all\ projects Build all projects

Hide Details

** BUILD SUCCEEDED **

Hide Details

Completed at: 2021-07-31T21:40:10 @@@@@@ [Pipeline] } [Pipeline] // timeout [Pipeline] } [Pipeline] // stage [Pipeline] stage [Pipeline] { (Xcode Standalone Test (build tree)) [Pipeline] timeout Timeout set to expire in 30 min [Pipeline] { [Pipeline] sh + set -u + export PATH=/usr/local/bin:/usr/local/sbin:/usr/bin:/bin:/usr/sbin:/sbin:/usr/bin:/usr/local/bin + PATH=/usr/local/bin:/usr/local/sbin:/usr/bin:/bin:/usr/sbin:/sbin:/usr/bin:/usr/local/bin + python /Users/buildslave/jenkins/workspace/lldb-cmake-standalone/llvm-zorg/zorg/jenkins/monorepo_build.py lldb-cmake-xcode test --assertions --cmake-type=Release
Clean

Hide Details

@@@ Clean @@@ Completed at: 2021-07-31T21:40:12 @@@@@@
Run Tests

Hide Details

@@@ Run Tests @@@ cd /Users/buildslave/jenkins/workspace/lldb-cmake-standalone/lldb-xcode-build '/usr/bin/env' 'TERM=vt100' '/usr/local/bin/cmake' '--build' '.' '--config' 'Release' '--target' 'check-lldb' Command line invocation: /Applications/Xcode.app/Contents/Developer/usr/bin/xcodebuild -project lldb.xcodeproj build -target check-lldb -configuration Release -hideShellScriptEnvironment

Hide Details

User defaults from command line: HideShellScriptEnvironment = YES

Hide Details

Prepare build note: Using legacy build system === BUILD AGGREGATE TARGET ZERO_CHECK OF PROJECT lldb WITH CONFIGURATION Release ===

Hide Details

Check dependencies

Hide Details

PhaseScriptExecution CMake\ Rules /Users/buildslave/jenkins/workspace/lldb-cmake-standalone/lldb-xcode-build/lldb.build/Release/ZERO_CHECK.build/Script-4F4833DA8B824044ADC3E140.sh cd /Users/buildslave/jenkins/workspace/lldb-cmake-standalone/llvm-project/lldb /bin/sh -c /Users/buildslave/jenkins/workspace/lldb-cmake-standalone/lldb-xcode-build/lldb.build/Release/ZERO_CHECK.build/Script-4F4833DA8B824044ADC3E140.sh echo ""

Hide Details

make -f /Users/buildslave/jenkins/workspace/lldb-cmake-standalone/lldb-xcode-build/CMakeScripts/ReRunCMake.make make[1]: `/Users/buildslave/jenkins/workspace/lldb-cmake-standalone/lldb-xcode-build/CMakeFiles/cmake.check_cache' is up to date.

Hide Details

=== BUILD AGGREGATE TARGET swig_wrapper_python OF PROJECT lldb WITH CONFIGURATION Release ===

Hide Details

Check dependencies

Hide Details

PhaseScriptExecution CMake\ Rules /Users/buildslave/jenkins/workspace/lldb-cmake-standalone/lldb-xcode-build/bindings/python/lldb.build/Release/swig_wrapper_python.build/Script-680D1123C94E439C80E44729.sh cd /Users/buildslave/jenkins/workspace/lldb-cmake-standalone/llvm-project/lldb /bin/sh -c /Users/buildslave/jenkins/workspace/lldb-cmake-standalone/lldb-xcode-build/bindings/python/lldb.build/Release/swig_wrapper_python.build/Script-680D1123C94E439C80E44729.sh make: Nothing to be done for `all'.

Hide Details

=== BUILD TARGET lldbBase OF PROJECT lldb WITH CONFIGURATION Release ===

Hide Details

Check dependencies

Hide Details

PhaseScriptExecution CMake\ Rules /Users/buildslave/jenkins/workspace/lldb-cmake-standalone/lldb-xcode-build/source/lldb.build/Release/lldbBase.build/Script-9AE14DE810A049F5B355A591.sh cd /Users/buildslave/jenkins/workspace/lldb-cmake-standalone/llvm-project/lldb /bin/sh -c /Users/buildslave/jenkins/workspace/lldb-cmake-standalone/lldb-xcode-build/source/lldb.build/Release/lldbBase.build/Script-9AE14DE810A049F5B355A591.sh make: Nothing to be done for `all'.

Hide Details

=== BUILD AGGREGATE TARGET clang-tablegen-targets OF PROJECT lldb WITH CONFIGURATION Release ===

Hide Details

Check dependencies

Hide Details

=== BUILD AGGREGATE TARGET intrinsics_gen OF PROJECT lldb WITH CONFIGURATION Release ===

Hide Details

Check dependencies

Hide Details

=== BUILD TARGET lldb-tblgen OF PROJECT lldb WITH CONFIGURATION Release ===

Hide Details

Check dependencies

Hide Details

=== BUILD AGGREGATE TARGET LLDBOptionsGen OF PROJECT lldb WITH CONFIGURATION Release ===

Hide Details

Check dependencies

Hide Details

PhaseScriptExecution CMake\ Rules /Users/buildslave/jenkins/workspace/lldb-cmake-standalone/lldb-xcode-build/source/Commands/lldb.build/Release/LLDBOptionsGen.build/Script-ACC883F113B84C8FADD7DD6D.sh cd /Users/buildslave/jenkins/workspace/lldb-cmake-standalone/llvm-project/lldb /bin/sh -c /Users/buildslave/jenkins/workspace/lldb-cmake-standalone/lldb-xcode-build/source/Commands/lldb.build/Release/LLDBOptionsGen.build/Script-ACC883F113B84C8FADD7DD6D.sh echo "Building CommandOptions.inc..." Building CommandOptions.inc... /Users/buildslave/jenkins/workspace/lldb-cmake-standalone/lldb-xcode-build/Release/bin/lldb-tblgen -gen-lldb-option-defs -I /Users/buildslave/jenkins/workspace/lldb-cmake-standalone/llvm-project/lldb/source/Commands -I/Users/buildslave/jenkins/workspace/lldb-cmake-standalone/lldb-xcode-build/source -I/Users/buildslave/jenkins/workspace/lldb-cmake-standalone/llvm-project/lldb/include -I/Users/buildslave/jenkins/workspace/lldb-cmake-standalone/lldb-xcode-build/include -I/Users/buildslave/jenkins/workspace/lldb-cmake-standalone/lldb-xcode-build/include -I/Users/buildslave/jenkins/workspace/lldb-cmake-standalone/llvm-project/llvm/include -I/Users/buildslave/jenkins/workspace/lldb-cmake-standalone/clang-build/include -I/Users/buildslave/jenkins/workspace/lldb-cmake-standalone/llvm-project/clang/include -I/Users/buildslave/jenkins/workspace/lldb-cmake-standalone/clang-build/tools/clang/include -I/usr/local/Cellar/python/3.7.0/Frameworks/Python.framework/Versions/3.7/include/python3.7m -I/Users/buildslave/jenkins/workspace/lldb-cmake-standalone/llvm-project/lldb/tools/clang/include -I/Users/buildslave/jenkins/workspace/lldb-cmake-standalone/lldb-xcode-build/../clang/include -I/usr/local/include -I/Applications/Xcode.app/Contents/Developer/Platforms/MacOSX.platform/Developer/SDKs/MacOSX10.15.sdk/usr/include/libxml2 -I/Applications/Xcode.app/Contents/Developer/Platforms/MacOSX.platform/Developer/SDKs/MacOSX10.15.sdk/usr/include/libxml2 -I/Users/buildslave/jenkins/workspace/lldb-cmake-standalone/llvm-project/lldb/source/. /Users/buildslave/jenkins/workspace/lldb-cmake-standalone/llvm-project/lldb/source/Commands/Options.td --write-if-changed -o /Users/buildslave/jenkins/workspace/lldb-cmake-standalone/lldb-xcode-build/source/Commands/CommandOptions.inc

Hide Details

=== BUILD AGGREGATE TARGET LLDBCorePropertiesEnumGen OF PROJECT lldb WITH CONFIGURATION Release ===

Hide Details

Check dependencies

Hide Details

PhaseScriptExecution CMake\ Rules /Users/buildslave/jenkins/workspace/lldb-cmake-standalone/lldb-xcode-build/source/Core/lldb.build/Release/LLDBCorePropertiesEnumGen.build/Script-27A37322799B48568024D4C9.sh cd /Users/buildslave/jenkins/workspace/lldb-cmake-standalone/llvm-project/lldb /bin/sh -c /Users/buildslave/jenkins/workspace/lldb-cmake-standalone/lldb-xcode-build/source/Core/lldb.build/Release/LLDBCorePropertiesEnumGen.build/Script-27A37322799B48568024D4C9.sh echo "Building CorePropertiesEnum.inc..." Building CorePropertiesEnum.inc... /Users/buildslave/jenkins/workspace/lldb-cmake-standalone/lldb-xcode-build/Release/bin/lldb-tblgen -gen-lldb-property-enum-defs -I /Users/buildslave/jenkins/workspace/lldb-cmake-standalone/llvm-project/lldb/source/Core -I/Users/buildslave/jenkins/workspace/lldb-cmake-standalone/lldb-xcode-build/source -I/Users/buildslave/jenkins/workspace/lldb-cmake-standalone/llvm-project/lldb/include -I/Users/buildslave/jenkins/workspace/lldb-cmake-standalone/lldb-xcode-build/include -I/Users/buildslave/jenkins/workspace/lldb-cmake-standalone/lldb-xcode-build/include -I/Users/buildslave/jenkins/workspace/lldb-cmake-standalone/llvm-project/llvm/include -I/Users/buildslave/jenkins/workspace/lldb-cmake-standalone/clang-build/include -I/Users/buildslave/jenkins/workspace/lldb-cmake-standalone/llvm-project/clang/include -I/Users/buildslave/jenkins/workspace/lldb-cmake-standalone/clang-build/tools/clang/include -I/usr/local/Cellar/python/3.7.0/Frameworks/Python.framework/Versions/3.7/include/python3.7m -I/Users/buildslave/jenkins/workspace/lldb-cmake-standalone/llvm-project/lldb/tools/clang/include -I/Users/buildslave/jenkins/workspace/lldb-cmake-standalone/lldb-xcode-build/../clang/include -I/usr/local/include -I/Applications/Xcode.app/Contents/Developer/Platforms/MacOSX.platform/Developer/SDKs/MacOSX10.15.sdk/usr/include/libxml2 -I/Applications/Xcode.app/Contents/Developer/Platforms/MacOSX.platform/Developer/SDKs/MacOSX10.15.sdk/usr/include/libxml2 -I/Users/buildslave/jenkins/workspace/lldb-cmake-standalone/llvm-project/lldb/source/. /Users/buildslave/jenkins/workspace/lldb-cmake-standalone/llvm-project/lldb/source/Core/CoreProperties.td --write-if-changed -o /Users/buildslave/jenkins/workspace/lldb-cmake-standalone/lldb-xcode-build/source/Core/CorePropertiesEnum.inc

Hide Details

=== BUILD AGGREGATE TARGET LLDBCorePropertiesGen OF PROJECT lldb WITH CONFIGURATION Release ===

Hide Details

Check dependencies

Hide Details

PhaseScriptExecution CMake\ Rules /Users/buildslave/jenkins/workspace/lldb-cmake-standalone/lldb-xcode-build/source/Core/lldb.build/Release/LLDBCorePropertiesGen.build/Script-A514BAD9824B4623BCD2F646.sh cd /Users/buildslave/jenkins/workspace/lldb-cmake-standalone/llvm-project/lldb /bin/sh -c /Users/buildslave/jenkins/workspace/lldb-cmake-standalone/lldb-xcode-build/source/Core/lldb.build/Release/LLDBCorePropertiesGen.build/Script-A514BAD9824B4623BCD2F646.sh echo "Building CoreProperties.inc..." Building CoreProperties.inc... /Users/buildslave/jenkins/workspace/lldb-cmake-standalone/lldb-xcode-build/Release/bin/lldb-tblgen -gen-lldb-property-defs -I /Users/buildslave/jenkins/workspace/lldb-cmake-standalone/llvm-project/lldb/source/Core -I/Users/buildslave/jenkins/workspace/lldb-cmake-standalone/lldb-xcode-build/source -I/Users/buildslave/jenkins/workspace/lldb-cmake-standalone/llvm-project/lldb/include -I/Users/buildslave/jenkins/workspace/lldb-cmake-standalone/lldb-xcode-build/include -I/Users/buildslave/jenkins/workspace/lldb-cmake-standalone/lldb-xcode-build/include -I/Users/buildslave/jenkins/workspace/lldb-cmake-standalone/llvm-project/llvm/include -I/Users/buildslave/jenkins/workspace/lldb-cmake-standalone/clang-build/include -I/Users/buildslave/jenkins/workspace/lldb-cmake-standalone/llvm-project/clang/include -I/Users/buildslave/jenkins/workspace/lldb-cmake-standalone/clang-build/tools/clang/include -I/usr/local/Cellar/python/3.7.0/Frameworks/Python.framework/Versions/3.7/include/python3.7m -I/Users/buildslave/jenkins/workspace/lldb-cmake-standalone/llvm-project/lldb/tools/clang/include -I/Users/buildslave/jenkins/workspace/lldb-cmake-standalone/lldb-xcode-build/../clang/include -I/usr/local/include -I/Applications/Xcode.app/Contents/Developer/Platforms/MacOSX.platform/Developer/SDKs/MacOSX10.15.sdk/usr/include/libxml2 -I/Applications/Xcode.app/Contents/Developer/Platforms/MacOSX.platform/Developer/SDKs/MacOSX10.15.sdk/usr/include/libxml2 -I/Users/buildslave/jenkins/workspace/lldb-cmake-standalone/llvm-project/lldb/source/. /Users/buildslave/jenkins/workspace/lldb-cmake-standalone/llvm-project/lldb/source/Core/CoreProperties.td --write-if-changed -o /Users/buildslave/jenkins/workspace/lldb-cmake-standalone/lldb-xcode-build/source/Core/CoreProperties.inc

Hide Details

=== BUILD TARGET lldbUtility OF PROJECT lldb WITH CONFIGURATION Release ===

Hide Details

Check dependencies

Hide Details

=== BUILD TARGET lldbHostMacOSXObjCXX OF PROJECT lldb WITH CONFIGURATION Release ===

Hide Details

Check dependencies

Hide Details

=== BUILD TARGET lldbHost OF PROJECT lldb WITH CONFIGURATION Release ===

Hide Details

Check dependencies

Hide Details

=== BUILD AGGREGATE TARGET LLDBInterpreterPropertiesEnumGen OF PROJECT lldb WITH CONFIGURATION Release ===

Hide Details

Check dependencies

Hide Details

PhaseScriptExecution CMake\ Rules /Users/buildslave/jenkins/workspace/lldb-cmake-standalone/lldb-xcode-build/source/Interpreter/lldb.build/Release/LLDBInterpreterPropertiesEnumGen.build/Script-392262FF2E3E4C40B8FC4295.sh cd /Users/buildslave/jenkins/workspace/lldb-cmake-standalone/llvm-project/lldb /bin/sh -c /Users/buildslave/jenkins/workspace/lldb-cmake-standalone/lldb-xcode-build/source/Interpreter/lldb.build/Release/LLDBInterpreterPropertiesEnumGen.build/Script-392262FF2E3E4C40B8FC4295.sh echo "Building InterpreterPropertiesEnum.inc..." Building InterpreterPropertiesEnum.inc... /Users/buildslave/jenkins/workspace/lldb-cmake-standalone/lldb-xcode-build/Release/bin/lldb-tblgen -gen-lldb-property-enum-defs -I /Users/buildslave/jenkins/workspace/lldb-cmake-standalone/llvm-project/lldb/source/Interpreter -I/Users/buildslave/jenkins/workspace/lldb-cmake-standalone/lldb-xcode-build/source -I/Users/buildslave/jenkins/workspace/lldb-cmake-standalone/llvm-project/lldb/include -I/Users/buildslave/jenkins/workspace/lldb-cmake-standalone/lldb-xcode-build/include -I/Users/buildslave/jenkins/workspace/lldb-cmake-standalone/lldb-xcode-build/include -I/Users/buildslave/jenkins/workspace/lldb-cmake-standalone/llvm-project/llvm/include -I/Users/buildslave/jenkins/workspace/lldb-cmake-standalone/clang-build/include -I/Users/buildslave/jenkins/workspace/lldb-cmake-standalone/llvm-project/clang/include -I/Users/buildslave/jenkins/workspace/lldb-cmake-standalone/clang-build/tools/clang/include -I/usr/local/Cellar/python/3.7.0/Frameworks/Python.framework/Versions/3.7/include/python3.7m -I/Users/buildslave/jenkins/workspace/lldb-cmake-standalone/llvm-project/lldb/tools/clang/include -I/Users/buildslave/jenkins/workspace/lldb-cmake-standalone/lldb-xcode-build/../clang/include -I/usr/local/include -I/Applications/Xcode.app/Contents/Developer/Platforms/MacOSX.platform/Developer/SDKs/MacOSX10.15.sdk/usr/include/libxml2 -I/Applications/Xcode.app/Contents/Developer/Platforms/MacOSX.platform/Developer/SDKs/MacOSX10.15.sdk/usr/include/libxml2 -I/Users/buildslave/jenkins/workspace/lldb-cmake-standalone/llvm-project/lldb/source/. /Users/buildslave/jenkins/workspace/lldb-cmake-standalone/llvm-project/lldb/source/Interpreter/InterpreterProperties.td --write-if-changed -o /Users/buildslave/jenkins/workspace/lldb-cmake-standalone/lldb-xcode-build/source/Interpreter/InterpreterPropertiesEnum.inc

Hide Details

=== BUILD AGGREGATE TARGET LLDBInterpreterPropertiesGen OF PROJECT lldb WITH CONFIGURATION Release ===

Hide Details

Check dependencies

Hide Details

PhaseScriptExecution CMake\ Rules /Users/buildslave/jenkins/workspace/lldb-cmake-standalone/lldb-xcode-build/source/Interpreter/lldb.build/Release/LLDBInterpreterPropertiesGen.build/Script-27ECE38872ED467EA6B9BD11.sh cd /Users/buildslave/jenkins/workspace/lldb-cmake-standalone/llvm-project/lldb /bin/sh -c /Users/buildslave/jenkins/workspace/lldb-cmake-standalone/lldb-xcode-build/source/Interpreter/lldb.build/Release/LLDBInterpreterPropertiesGen.build/Script-27ECE38872ED467EA6B9BD11.sh echo "Building InterpreterProperties.inc..." Building InterpreterProperties.inc... /Users/buildslave/jenkins/workspace/lldb-cmake-standalone/lldb-xcode-build/Release/bin/lldb-tblgen -gen-lldb-property-defs -I /Users/buildslave/jenkins/workspace/lldb-cmake-standalone/llvm-project/lldb/source/Interpreter -I/Users/buildslave/jenkins/workspace/lldb-cmake-standalone/lldb-xcode-build/source -I/Users/buildslave/jenkins/workspace/lldb-cmake-standalone/llvm-project/lldb/include -I/Users/buildslave/jenkins/workspace/lldb-cmake-standalone/lldb-xcode-build/include -I/Users/buildslave/jenkins/workspace/lldb-cmake-standalone/lldb-xcode-build/include -I/Users/buildslave/jenkins/workspace/lldb-cmake-standalone/llvm-project/llvm/include -I/Users/buildslave/jenkins/workspace/lldb-cmake-standalone/clang-build/include -I/Users/buildslave/jenkins/workspace/lldb-cmake-standalone/llvm-project/clang/include -I/Users/buildslave/jenkins/workspace/lldb-cmake-standalone/clang-build/tools/clang/include -I/usr/local/Cellar/python/3.7.0/Frameworks/Python.framework/Versions/3.7/include/python3.7m -I/Users/buildslave/jenkins/workspace/lldb-cmake-standalone/llvm-project/lldb/tools/clang/include -I/Users/buildslave/jenkins/workspace/lldb-cmake-standalone/lldb-xcode-build/../clang/include -I/usr/local/include -I/Applications/Xcode.app/Contents/Developer/Platforms/MacOSX.platform/Developer/SDKs/MacOSX10.15.sdk/usr/include/libxml2 -I/Applications/Xcode.app/Contents/Developer/Platforms/MacOSX.platform/Developer/SDKs/MacOSX10.15.sdk/usr/include/libxml2 -I/Users/buildslave/jenkins/workspace/lldb-cmake-standalone/llvm-project/lldb/source/. /Users/buildslave/jenkins/workspace/lldb-cmake-standalone/llvm-project/lldb/source/Interpreter/InterpreterProperties.td --write-if-changed -o /Users/buildslave/jenkins/workspace/lldb-cmake-standalone/lldb-xcode-build/source/Interpreter/InterpreterProperties.inc

Hide Details

=== BUILD AGGREGATE TARGET LLDBPluginSymbolFileDWARFPropertiesEnumGen OF PROJECT lldb WITH CONFIGURATION Release ===

Hide Details

Check dependencies

Hide Details

PhaseScriptExecution CMake\ Rules /Users/buildslave/jenkins/workspace/lldb-cmake-standalone/lldb-xcode-build/source/Plugins/SymbolFile/DWARF/lldb.build/Release/LLDBPluginSymbolFileDWARFPropertiesEnumGen.build/Script-B2C4C38C6CE74E1695ADAA86.sh cd /Users/buildslave/jenkins/workspace/lldb-cmake-standalone/llvm-project/lldb /bin/sh -c /Users/buildslave/jenkins/workspace/lldb-cmake-standalone/lldb-xcode-build/source/Plugins/SymbolFile/DWARF/lldb.build/Release/LLDBPluginSymbolFileDWARFPropertiesEnumGen.build/Script-B2C4C38C6CE74E1695ADAA86.sh echo "Building SymbolFileDWARFPropertiesEnum.inc..." Building SymbolFileDWARFPropertiesEnum.inc... /Users/buildslave/jenkins/workspace/lldb-cmake-standalone/lldb-xcode-build/Release/bin/lldb-tblgen -gen-lldb-property-enum-defs -I /Users/buildslave/jenkins/workspace/lldb-cmake-standalone/llvm-project/lldb/source/Plugins/SymbolFile/DWARF -I/Users/buildslave/jenkins/workspace/lldb-cmake-standalone/lldb-xcode-build/source -I/Users/buildslave/jenkins/workspace/lldb-cmake-standalone/llvm-project/lldb/include -I/Users/buildslave/jenkins/workspace/lldb-cmake-standalone/lldb-xcode-build/include -I/Users/buildslave/jenkins/workspace/lldb-cmake-standalone/lldb-xcode-build/include -I/Users/buildslave/jenkins/workspace/lldb-cmake-standalone/llvm-project/llvm/include -I/Users/buildslave/jenkins/workspace/lldb-cmake-standalone/clang-build/include -I/Users/buildslave/jenkins/workspace/lldb-cmake-standalone/llvm-project/clang/include -I/Users/buildslave/jenkins/workspace/lldb-cmake-standalone/clang-build/tools/clang/include -I/usr/local/Cellar/python/3.7.0/Frameworks/Python.framework/Versions/3.7/include/python3.7m -I/Users/buildslave/jenkins/workspace/lldb-cmake-standalone/llvm-project/lldb/tools/clang/include -I/Users/buildslave/jenkins/workspace/lldb-cmake-standalone/lldb-xcode-build/../clang/include -I/usr/local/include -I/Applications/Xcode.app/Contents/Developer/Platforms/MacOSX.platform/Developer/SDKs/MacOSX10.15.sdk/usr/include/libxml2 -I/Applications/Xcode.app/Contents/Developer/Platforms/MacOSX.platform/Developer/SDKs/MacOSX10.15.sdk/usr/include/libxml2 -I/Users/buildslave/jenkins/workspace/lldb-cmake-standalone/llvm-project/lldb/source/. /Users/buildslave/jenkins/workspace/lldb-cmake-standalone/llvm-project/lldb/source/Plugins/SymbolFile/DWARF/SymbolFileDWARFProperties.td --write-if-changed -o /Users/buildslave/jenkins/workspace/lldb-cmake-standalone/lldb-xcode-build/source/Plugins/SymbolFile/DWARF/SymbolFileDWARFPropertiesEnum.inc

Hide Details

=== BUILD AGGREGATE TARGET LLDBPluginSymbolFileDWARFPropertiesGen OF PROJECT lldb WITH CONFIGURATION Release ===

Hide Details

Check dependencies

Hide Details

PhaseScriptExecution CMake\ Rules /Users/buildslave/jenkins/workspace/lldb-cmake-standalone/lldb-xcode-build/source/Plugins/SymbolFile/DWARF/lldb.build/Release/LLDBPluginSymbolFileDWARFPropertiesGen.build/Script-25E5464E2A0247C197DBB12F.sh cd /Users/buildslave/jenkins/workspace/lldb-cmake-standalone/llvm-project/lldb /bin/sh -c /Users/buildslave/jenkins/workspace/lldb-cmake-standalone/lldb-xcode-build/source/Plugins/SymbolFile/DWARF/lldb.build/Release/LLDBPluginSymbolFileDWARFPropertiesGen.build/Script-25E5464E2A0247C197DBB12F.sh echo "Building SymbolFileDWARFProperties.inc..." Building SymbolFileDWARFProperties.inc... /Users/buildslave/jenkins/workspace/lldb-cmake-standalone/lldb-xcode-build/Release/bin/lldb-tblgen -gen-lldb-property-defs -I /Users/buildslave/jenkins/workspace/lldb-cmake-standalone/llvm-project/lldb/source/Plugins/SymbolFile/DWARF -I/Users/buildslave/jenkins/workspace/lldb-cmake-standalone/lldb-xcode-build/source -I/Users/buildslave/jenkins/workspace/lldb-cmake-standalone/llvm-project/lldb/include -I/Users/buildslave/jenkins/workspace/lldb-cmake-standalone/lldb-xcode-build/include -I/Users/buildslave/jenkins/workspace/lldb-cmake-standalone/lldb-xcode-build/include -I/Users/buildslave/jenkins/workspace/lldb-cmake-standalone/llvm-project/llvm/include -I/Users/buildslave/jenkins/workspace/lldb-cmake-standalone/clang-build/include -I/Users/buildslave/jenkins/workspace/lldb-cmake-standalone/llvm-project/clang/include -I/Users/buildslave/jenkins/workspace/lldb-cmake-standalone/clang-build/tools/clang/include -I/usr/local/Cellar/python/3.7.0/Frameworks/Python.framework/Versions/3.7/include/python3.7m -I/Users/buildslave/jenkins/workspace/lldb-cmake-standalone/llvm-project/lldb/tools/clang/include -I/Users/buildslave/jenkins/workspace/lldb-cmake-standalone/lldb-xcode-build/../clang/include -I/usr/local/include -I/Applications/Xcode.app/Contents/Developer/Platforms/MacOSX.platform/Developer/SDKs/MacOSX10.15.sdk/usr/include/libxml2 -I/Applications/Xcode.app/Contents/Developer/Platforms/MacOSX.platform/Developer/SDKs/MacOSX10.15.sdk/usr/include/libxml2 -I/Users/buildslave/jenkins/workspace/lldb-cmake-standalone/llvm-project/lldb/source/. /Users/buildslave/jenkins/workspace/lldb-cmake-standalone/llvm-project/lldb/source/Plugins/SymbolFile/DWARF/SymbolFileDWARFProperties.td --write-if-changed -o /Users/buildslave/jenkins/workspace/lldb-cmake-standalone/lldb-xcode-build/source/Plugins/SymbolFile/DWARF/SymbolFileDWARFProperties.inc

Hide Details

=== BUILD AGGREGATE TARGET LLDBTargetPropertiesEnumGen OF PROJECT lldb WITH CONFIGURATION Release ===

Hide Details

Check dependencies

Hide Details

PhaseScriptExecution CMake\ Rules /Users/buildslave/jenkins/workspace/lldb-cmake-standalone/lldb-xcode-build/source/Target/lldb.build/Release/LLDBTargetPropertiesEnumGen.build/Script-01F3C7FAC3764CBDBFB7E7C5.sh cd /Users/buildslave/jenkins/workspace/lldb-cmake-standalone/llvm-project/lldb /bin/sh -c /Users/buildslave/jenkins/workspace/lldb-cmake-standalone/lldb-xcode-build/source/Target/lldb.build/Release/LLDBTargetPropertiesEnumGen.build/Script-01F3C7FAC3764CBDBFB7E7C5.sh echo "Building TargetPropertiesEnum.inc..." Building TargetPropertiesEnum.inc... /Users/buildslave/jenkins/workspace/lldb-cmake-standalone/lldb-xcode-build/Release/bin/lldb-tblgen -gen-lldb-property-enum-defs -I /Users/buildslave/jenkins/workspace/lldb-cmake-standalone/llvm-project/lldb/source/Target -I/Users/buildslave/jenkins/workspace/lldb-cmake-standalone/lldb-xcode-build/source -I/Users/buildslave/jenkins/workspace/lldb-cmake-standalone/llvm-project/lldb/include -I/Users/buildslave/jenkins/workspace/lldb-cmake-standalone/lldb-xcode-build/include -I/Users/buildslave/jenkins/workspace/lldb-cmake-standalone/lldb-xcode-build/include -I/Users/buildslave/jenkins/workspace/lldb-cmake-standalone/llvm-project/llvm/include -I/Users/buildslave/jenkins/workspace/lldb-cmake-standalone/clang-build/include -I/Users/buildslave/jenkins/workspace/lldb-cmake-standalone/llvm-project/clang/include -I/Users/buildslave/jenkins/workspace/lldb-cmake-standalone/clang-build/tools/clang/include -I/usr/local/Cellar/python/3.7.0/Frameworks/Python.framework/Versions/3.7/include/python3.7m -I/Users/buildslave/jenkins/workspace/lldb-cmake-standalone/llvm-project/lldb/tools/clang/include -I/Users/buildslave/jenkins/workspace/lldb-cmake-standalone/lldb-xcode-build/../clang/include -I/usr/local/include -I/Applications/Xcode.app/Contents/Developer/Platforms/MacOSX.platform/Developer/SDKs/MacOSX10.15.sdk/usr/include/libxml2 -I/Applications/Xcode.app/Contents/Developer/Platforms/MacOSX.platform/Developer/SDKs/MacOSX10.15.sdk/usr/include/libxml2 -I/Users/buildslave/jenkins/workspace/lldb-cmake-standalone/llvm-project/lldb/source/. /Users/buildslave/jenkins/workspace/lldb-cmake-standalone/llvm-project/lldb/source/Target/TargetProperties.td --write-if-changed -o /Users/buildslave/jenkins/workspace/lldb-cmake-standalone/lldb-xcode-build/source/Target/TargetPropertiesEnum.inc

Hide Details

=== BUILD AGGREGATE TARGET LLDBTargetPropertiesGen OF PROJECT lldb WITH CONFIGURATION Release ===

Hide Details

Check dependencies

Hide Details

PhaseScriptExecution CMake\ Rules /Users/buildslave/jenkins/workspace/lldb-cmake-standalone/lldb-xcode-build/source/Target/lldb.build/Release/LLDBTargetPropertiesGen.build/Script-2BE84A15053A4F01BE1647C0.sh cd /Users/buildslave/jenkins/workspace/lldb-cmake-standalone/llvm-project/lldb /bin/sh -c /Users/buildslave/jenkins/workspace/lldb-cmake-standalone/lldb-xcode-build/source/Target/lldb.build/Release/LLDBTargetPropertiesGen.build/Script-2BE84A15053A4F01BE1647C0.sh echo "Building TargetProperties.inc..." Building TargetProperties.inc... /Users/buildslave/jenkins/workspace/lldb-cmake-standalone/lldb-xcode-build/Release/bin/lldb-tblgen -gen-lldb-property-defs -I /Users/buildslave/jenkins/workspace/lldb-cmake-standalone/llvm-project/lldb/source/Target -I/Users/buildslave/jenkins/workspace/lldb-cmake-standalone/lldb-xcode-build/source -I/Users/buildslave/jenkins/workspace/lldb-cmake-standalone/llvm-project/lldb/include -I/Users/buildslave/jenkins/workspace/lldb-cmake-standalone/lldb-xcode-build/include -I/Users/buildslave/jenkins/workspace/lldb-cmake-standalone/lldb-xcode-build/include -I/Users/buildslave/jenkins/workspace/lldb-cmake-standalone/llvm-project/llvm/include -I/Users/buildslave/jenkins/workspace/lldb-cmake-standalone/clang-build/include -I/Users/buildslave/jenkins/workspace/lldb-cmake-standalone/llvm-project/clang/include -I/Users/buildslave/jenkins/workspace/lldb-cmake-standalone/clang-build/tools/clang/include -I/usr/local/Cellar/python/3.7.0/Frameworks/Python.framework/Versions/3.7/include/python3.7m -I/Users/buildslave/jenkins/workspace/lldb-cmake-standalone/llvm-project/lldb/tools/clang/include -I/Users/buildslave/jenkins/workspace/lldb-cmake-standalone/lldb-xcode-build/../clang/include -I/usr/local/include -I/Applications/Xcode.app/Contents/Developer/Platforms/MacOSX.platform/Developer/SDKs/MacOSX10.15.sdk/usr/include/libxml2 -I/Applications/Xcode.app/Contents/Developer/Platforms/MacOSX.platform/Developer/SDKs/MacOSX10.15.sdk/usr/include/libxml2 -I/Users/buildslave/jenkins/workspace/lldb-cmake-standalone/llvm-project/lldb/source/. /Users/buildslave/jenkins/workspace/lldb-cmake-standalone/llvm-project/lldb/source/Target/TargetProperties.td --write-if-changed -o /Users/buildslave/jenkins/workspace/lldb-cmake-standalone/lldb-xcode-build/source/Target/TargetProperties.inc

Hide Details

=== BUILD TARGET lldbTarget OF PROJECT lldb WITH CONFIGURATION Release ===

Hide Details

Check dependencies

Hide Details

=== BUILD TARGET lldbSymbol OF PROJECT lldb WITH CONFIGURATION Release ===

Hide Details

Check dependencies

Hide Details

=== BUILD TARGET lldbPluginTypeSystemClang OF PROJECT lldb WITH CONFIGURATION Release ===

Hide Details

Check dependencies

Hide Details

=== BUILD TARGET lldbPluginSymbolFilePDB OF PROJECT lldb WITH CONFIGURATION Release ===

Hide Details

Check dependencies

Hide Details

=== BUILD TARGET lldbPluginSymbolFileNativePDB OF PROJECT lldb WITH CONFIGURATION Release ===

Hide Details

Check dependencies

Hide Details

=== BUILD TARGET lldbPluginSymbolFileDWARF OF PROJECT lldb WITH CONFIGURATION Release ===

Hide Details

Check dependencies

Hide Details

=== BUILD TARGET lldbPluginProcessUtility OF PROJECT lldb WITH CONFIGURATION Release ===

Hide Details

Check dependencies

Hide Details

=== BUILD TARGET lldbPluginObjectFileJIT OF PROJECT lldb WITH CONFIGURATION Release ===

Hide Details

Check dependencies

Hide Details

=== BUILD TARGET lldbPluginObjectFilePDB OF PROJECT lldb WITH CONFIGURATION Release ===

Hide Details

Check dependencies

Hide Details

=== BUILD TARGET lldbPluginRenderScriptRuntime OF PROJECT lldb WITH CONFIGURATION Release ===

Hide Details

Check dependencies

Hide Details

=== BUILD TARGET lldbPluginAppleObjCRuntime OF PROJECT lldb WITH CONFIGURATION Release ===

Hide Details

Check dependencies

Hide Details

=== BUILD TARGET lldbPluginObjCRuntime OF PROJECT lldb WITH CONFIGURATION Release ===

Hide Details

Check dependencies

Hide Details

=== BUILD TARGET lldbPluginCPPRuntime OF PROJECT lldb WITH CONFIGURATION Release ===

Hide Details

Check dependencies

Hide Details

=== BUILD TARGET lldbPluginObjCLanguage OF PROJECT lldb WITH CONFIGURATION Release ===

Hide Details

Check dependencies

Hide Details

=== BUILD TARGET lldbPluginCPlusPlusLanguage OF PROJECT lldb WITH CONFIGURATION Release ===

Hide Details

Check dependencies

Hide Details

=== BUILD TARGET lldbPluginClangCommon OF PROJECT lldb WITH CONFIGURATION Release ===

Hide Details

Check dependencies

Hide Details

=== BUILD TARGET lldbPluginExpressionParserClang OF PROJECT lldb WITH CONFIGURATION Release ===

Hide Details

Check dependencies

Hide Details

=== BUILD TARGET lldbInterpreter OF PROJECT lldb WITH CONFIGURATION Release ===

Hide Details

Check dependencies

Hide Details

=== BUILD TARGET lldbExpression OF PROJECT lldb WITH CONFIGURATION Release ===

Hide Details

Check dependencies

Hide Details

=== BUILD TARGET lldbDataFormatters OF PROJECT lldb WITH CONFIGURATION Release ===

Hide Details

Check dependencies

Hide Details

=== BUILD TARGET lldbCore OF PROJECT lldb WITH CONFIGURATION Release ===

Hide Details

Check dependencies

Hide Details

=== BUILD TARGET lldbCommands OF PROJECT lldb WITH CONFIGURATION Release ===

Hide Details

Check dependencies

Hide Details

=== BUILD TARGET lldbBreakpoint OF PROJECT lldb WITH CONFIGURATION Release ===

Hide Details

Check dependencies

Hide Details

=== BUILD AGGREGATE TARGET LLDBPluginPlatformMacOSXPropertiesEnumGen OF PROJECT lldb WITH CONFIGURATION Release ===

Hide Details

Check dependencies

Hide Details

PhaseScriptExecution CMake\ Rules /Users/buildslave/jenkins/workspace/lldb-cmake-standalone/lldb-xcode-build/source/Plugins/Platform/MacOSX/lldb.build/Release/LLDBPluginPlatformMacOSXPropertiesEnumGen.build/Script-C7E58AEE43BF4E4780CEE8C5.sh cd /Users/buildslave/jenkins/workspace/lldb-cmake-standalone/llvm-project/lldb /bin/sh -c /Users/buildslave/jenkins/workspace/lldb-cmake-standalone/lldb-xcode-build/source/Plugins/Platform/MacOSX/lldb.build/Release/LLDBPluginPlatformMacOSXPropertiesEnumGen.build/Script-C7E58AEE43BF4E4780CEE8C5.sh echo "Building PlatformMacOSXPropertiesEnum.inc..." Building PlatformMacOSXPropertiesEnum.inc... /Users/buildslave/jenkins/workspace/lldb-cmake-standalone/lldb-xcode-build/Release/bin/lldb-tblgen -gen-lldb-property-enum-defs -I /Users/buildslave/jenkins/workspace/lldb-cmake-standalone/llvm-project/lldb/source/Plugins/Platform/MacOSX -I/Users/buildslave/jenkins/workspace/lldb-cmake-standalone/lldb-xcode-build/source -I/Users/buildslave/jenkins/workspace/lldb-cmake-standalone/llvm-project/lldb/include -I/Users/buildslave/jenkins/workspace/lldb-cmake-standalone/lldb-xcode-build/include -I/Users/buildslave/jenkins/workspace/lldb-cmake-standalone/lldb-xcode-build/include -I/Users/buildslave/jenkins/workspace/lldb-cmake-standalone/llvm-project/llvm/include -I/Users/buildslave/jenkins/workspace/lldb-cmake-standalone/clang-build/include -I/Users/buildslave/jenkins/workspace/lldb-cmake-standalone/llvm-project/clang/include -I/Users/buildslave/jenkins/workspace/lldb-cmake-standalone/clang-build/tools/clang/include -I/usr/local/Cellar/python/3.7.0/Frameworks/Python.framework/Versions/3.7/include/python3.7m -I/Users/buildslave/jenkins/workspace/lldb-cmake-standalone/llvm-project/lldb/tools/clang/include -I/Users/buildslave/jenkins/workspace/lldb-cmake-standalone/lldb-xcode-build/../clang/include -I/usr/local/include -I/Applications/Xcode.app/Contents/Developer/Platforms/MacOSX.platform/Developer/SDKs/MacOSX10.15.sdk/usr/include/libxml2 -I/Applications/Xcode.app/Contents/Developer/Platforms/MacOSX.platform/Developer/SDKs/MacOSX10.15.sdk/usr/include/libxml2 -I/Users/buildslave/jenkins/workspace/lldb-cmake-standalone/llvm-project/lldb/source/. /Users/buildslave/jenkins/workspace/lldb-cmake-standalone/llvm-project/lldb/source/Plugins/Platform/MacOSX/PlatformMacOSXProperties.td --write-if-changed -o /Users/buildslave/jenkins/workspace/lldb-cmake-standalone/lldb-xcode-build/source/Plugins/Platform/MacOSX/PlatformMacOSXPropertiesEnum.inc

Hide Details

=== BUILD AGGREGATE TARGET LLDBPluginPlatformMacOSXPropertiesGen OF PROJECT lldb WITH CONFIGURATION Release ===

Hide Details

Check dependencies

Hide Details

PhaseScriptExecution CMake\ Rules /Users/buildslave/jenkins/workspace/lldb-cmake-standalone/lldb-xcode-build/source/Plugins/Platform/MacOSX/lldb.build/Release/LLDBPluginPlatformMacOSXPropertiesGen.build/Script-504D6D18953A4FBBB58FA7F2.sh cd /Users/buildslave/jenkins/workspace/lldb-cmake-standalone/llvm-project/lldb /bin/sh -c /Users/buildslave/jenkins/workspace/lldb-cmake-standalone/lldb-xcode-build/source/Plugins/Platform/MacOSX/lldb.build/Release/LLDBPluginPlatformMacOSXPropertiesGen.build/Script-504D6D18953A4FBBB58FA7F2.sh echo "Building PlatformMacOSXProperties.inc..." Building PlatformMacOSXProperties.inc... /Users/buildslave/jenkins/workspace/lldb-cmake-standalone/lldb-xcode-build/Release/bin/lldb-tblgen -gen-lldb-property-defs -I /Users/buildslave/jenkins/workspace/lldb-cmake-standalone/llvm-project/lldb/source/Plugins/Platform/MacOSX -I/Users/buildslave/jenkins/workspace/lldb-cmake-standalone/lldb-xcode-build/source -I/Users/buildslave/jenkins/workspace/lldb-cmake-standalone/llvm-project/lldb/include -I/Users/buildslave/jenkins/workspace/lldb-cmake-standalone/lldb-xcode-build/include -I/Users/buildslave/jenkins/workspace/lldb-cmake-standalone/lldb-xcode-build/include -I/Users/buildslave/jenkins/workspace/lldb-cmake-standalone/llvm-project/llvm/include -I/Users/buildslave/jenkins/workspace/lldb-cmake-standalone/clang-build/include -I/Users/buildslave/jenkins/workspace/lldb-cmake-standalone/llvm-project/clang/include -I/Users/buildslave/jenkins/workspace/lldb-cmake-standalone/clang-build/tools/clang/include -I/usr/local/Cellar/python/3.7.0/Frameworks/Python.framework/Versions/3.7/include/python3.7m -I/Users/buildslave/jenkins/workspace/lldb-cmake-standalone/llvm-project/lldb/tools/clang/include -I/Users/buildslave/jenkins/workspace/lldb-cmake-standalone/lldb-xcode-build/../clang/include -I/usr/local/include -I/Applications/Xcode.app/Contents/Developer/Platforms/MacOSX.platform/Developer/SDKs/MacOSX10.15.sdk/usr/include/libxml2 -I/Applications/Xcode.app/Contents/Developer/Platforms/MacOSX.platform/Developer/SDKs/MacOSX10.15.sdk/usr/include/libxml2 -I/Users/buildslave/jenkins/workspace/lldb-cmake-standalone/llvm-project/lldb/source/. /Users/buildslave/jenkins/workspace/lldb-cmake-standalone/llvm-project/lldb/source/Plugins/Platform/MacOSX/PlatformMacOSXProperties.td --write-if-changed -o /Users/buildslave/jenkins/workspace/lldb-cmake-standalone/lldb-xcode-build/source/Plugins/Platform/MacOSX/PlatformMacOSXProperties.inc

Hide Details

=== BUILD TARGET lldbPluginPlatformMacOSXObjCXX OF PROJECT lldb WITH CONFIGURATION Release ===

Hide Details

Check dependencies

Hide Details

=== BUILD TARGET lldbPluginPlatformPOSIX OF PROJECT lldb WITH CONFIGURATION Release ===

Hide Details

Check dependencies

Hide Details

=== BUILD TARGET lldbPluginPlatformMacOSX OF PROJECT lldb WITH CONFIGURATION Release ===

Hide Details

Check dependencies

Hide Details

=== BUILD AGGREGATE TARGET LLDBPluginProcessGDBRemotePropertiesEnumGen OF PROJECT lldb WITH CONFIGURATION Release ===

Hide Details

Check dependencies

Hide Details

PhaseScriptExecution CMake\ Rules /Users/buildslave/jenkins/workspace/lldb-cmake-standalone/lldb-xcode-build/source/Plugins/Process/gdb-remote/lldb.build/Release/LLDBPluginProcessGDBRemotePropertiesEnumGen.build/Script-86CE5452664A49E0A2B7DD98.sh cd /Users/buildslave/jenkins/workspace/lldb-cmake-standalone/llvm-project/lldb /bin/sh -c /Users/buildslave/jenkins/workspace/lldb-cmake-standalone/lldb-xcode-build/source/Plugins/Process/gdb-remote/lldb.build/Release/LLDBPluginProcessGDBRemotePropertiesEnumGen.build/Script-86CE5452664A49E0A2B7DD98.sh echo "Building ProcessGDBRemotePropertiesEnum.inc..." Building ProcessGDBRemotePropertiesEnum.inc... /Users/buildslave/jenkins/workspace/lldb-cmake-standalone/lldb-xcode-build/Release/bin/lldb-tblgen -gen-lldb-property-enum-defs -I /Users/buildslave/jenkins/workspace/lldb-cmake-standalone/llvm-project/lldb/source/Plugins/Process/gdb-remote -I/Users/buildslave/jenkins/workspace/lldb-cmake-standalone/lldb-xcode-build/source -I/Users/buildslave/jenkins/workspace/lldb-cmake-standalone/llvm-project/lldb/include -I/Users/buildslave/jenkins/workspace/lldb-cmake-standalone/lldb-xcode-build/include -I/Users/buildslave/jenkins/workspace/lldb-cmake-standalone/lldb-xcode-build/include -I/Users/buildslave/jenkins/workspace/lldb-cmake-standalone/llvm-project/llvm/include -I/Users/buildslave/jenkins/workspace/lldb-cmake-standalone/clang-build/include -I/Users/buildslave/jenkins/workspace/lldb-cmake-standalone/llvm-project/clang/include -I/Users/buildslave/jenkins/workspace/lldb-cmake-standalone/clang-build/tools/clang/include -I/usr/local/Cellar/python/3.7.0/Frameworks/Python.framework/Versions/3.7/include/python3.7m -I/Users/buildslave/jenkins/workspace/lldb-cmake-standalone/llvm-project/lldb/tools/clang/include -I/Users/buildslave/jenkins/workspace/lldb-cmake-standalone/lldb-xcode-build/../clang/include -I/usr/local/include -I/Applications/Xcode.app/Contents/Developer/Platforms/MacOSX.platform/Developer/SDKs/MacOSX10.15.sdk/usr/include/libxml2 -I/Applications/Xcode.app/Contents/Developer/Platforms/MacOSX.platform/Developer/SDKs/MacOSX10.15.sdk/usr/include/libxml2 -I/Users/buildslave/jenkins/workspace/lldb-cmake-standalone/llvm-project/lldb/source/. /Users/buildslave/jenkins/workspace/lldb-cmake-standalone/llvm-project/lldb/source/Plugins/Process/gdb-remote/ProcessGDBRemoteProperties.td --write-if-changed -o /Users/buildslave/jenkins/workspace/lldb-cmake-standalone/lldb-xcode-build/source/Plugins/Process/gdb-remote/ProcessGDBRemotePropertiesEnum.inc

Hide Details

=== BUILD AGGREGATE TARGET LLDBPluginProcessGDBRemotePropertiesGen OF PROJECT lldb WITH CONFIGURATION Release ===

Hide Details

Check dependencies

Hide Details

PhaseScriptExecution CMake\ Rules /Users/buildslave/jenkins/workspace/lldb-cmake-standalone/lldb-xcode-build/source/Plugins/Process/gdb-remote/lldb.build/Release/LLDBPluginProcessGDBRemotePropertiesGen.build/Script-CA9A03917B80456B87B75355.sh cd /Users/buildslave/jenkins/workspace/lldb-cmake-standalone/llvm-project/lldb /bin/sh -c /Users/buildslave/jenkins/workspace/lldb-cmake-standalone/lldb-xcode-build/source/Plugins/Process/gdb-remote/lldb.build/Release/LLDBPluginProcessGDBRemotePropertiesGen.build/Script-CA9A03917B80456B87B75355.sh echo "Building ProcessGDBRemoteProperties.inc..." Building ProcessGDBRemoteProperties.inc... /Users/buildslave/jenkins/workspace/lldb-cmake-standalone/lldb-xcode-build/Release/bin/lldb-tblgen -gen-lldb-property-defs -I /Users/buildslave/jenkins/workspace/lldb-cmake-standalone/llvm-project/lldb/source/Plugins/Process/gdb-remote -I/Users/buildslave/jenkins/workspace/lldb-cmake-standalone/lldb-xcode-build/source -I/Users/buildslave/jenkins/workspace/lldb-cmake-standalone/llvm-project/lldb/include -I/Users/buildslave/jenkins/workspace/lldb-cmake-standalone/lldb-xcode-build/include -I/Users/buildslave/jenkins/workspace/lldb-cmake-standalone/lldb-xcode-build/include -I/Users/buildslave/jenkins/workspace/lldb-cmake-standalone/llvm-project/llvm/include -I/Users/buildslave/jenkins/workspace/lldb-cmake-standalone/clang-build/include -I/Users/buildslave/jenkins/workspace/lldb-cmake-standalone/llvm-project/clang/include -I/Users/buildslave/jenkins/workspace/lldb-cmake-standalone/clang-build/tools/clang/include -I/usr/local/Cellar/python/3.7.0/Frameworks/Python.framework/Versions/3.7/include/python3.7m -I/Users/buildslave/jenkins/workspace/lldb-cmake-standalone/llvm-project/lldb/tools/clang/include -I/Users/buildslave/jenkins/workspace/lldb-cmake-standalone/lldb-xcode-build/../clang/include -I/usr/local/include -I/Applications/Xcode.app/Contents/Developer/Platforms/MacOSX.platform/Developer/SDKs/MacOSX10.15.sdk/usr/include/libxml2 -I/Applications/Xcode.app/Contents/Developer/Platforms/MacOSX.platform/Developer/SDKs/MacOSX10.15.sdk/usr/include/libxml2 -I/Users/buildslave/jenkins/workspace/lldb-cmake-standalone/llvm-project/lldb/source/. /Users/buildslave/jenkins/workspace/lldb-cmake-standalone/llvm-project/lldb/source/Plugins/Process/gdb-remote/ProcessGDBRemoteProperties.td --write-if-changed -o /Users/buildslave/jenkins/workspace/lldb-cmake-standalone/lldb-xcode-build/source/Plugins/Process/gdb-remote/ProcessGDBRemoteProperties.inc

Hide Details

=== BUILD TARGET lldbPluginProcessGDBRemote OF PROJECT lldb WITH CONFIGURATION Release ===

Hide Details

Check dependencies

Hide Details

=== BUILD TARGET lldbInitialization OF PROJECT lldb WITH CONFIGURATION Release ===

Hide Details

Check dependencies

Hide Details

=== BUILD TARGET lldbPluginABIX86 OF PROJECT lldb WITH CONFIGURATION Release ===

Hide Details

Check dependencies

Hide Details

=== BUILD TARGET lldbPluginArchitectureArm OF PROJECT lldb WITH CONFIGURATION Release ===

Hide Details

Check dependencies

Hide Details

=== BUILD TARGET lldbPluginArchitectureMips OF PROJECT lldb WITH CONFIGURATION Release ===

Hide Details

Check dependencies

Hide Details

=== BUILD TARGET lldbPluginArchitecturePPC64 OF PROJECT lldb WITH CONFIGURATION Release ===

Hide Details

Check dependencies

Hide Details

=== BUILD TARGET lldbPluginArchitectureAArch64 OF PROJECT lldb WITH CONFIGURATION Release ===

Hide Details

Check dependencies

Hide Details

=== BUILD TARGET lldbPluginDisassemblerLLVMC OF PROJECT lldb WITH CONFIGURATION Release ===

Hide Details

Check dependencies

Hide Details

=== BUILD AGGREGATE TARGET LLDBPluginDynamicLoaderDarwinKernelPropertiesEnumGen OF PROJECT lldb WITH CONFIGURATION Release ===

Hide Details

Check dependencies

Hide Details

PhaseScriptExecution CMake\ Rules /Users/buildslave/jenkins/workspace/lldb-cmake-standalone/lldb-xcode-build/source/Plugins/DynamicLoader/Darwin-Kernel/lldb.build/Release/LLDBPluginDynamicLoaderDarwinKernelPropertiesEnumGen.build/Script-E284F686FA554667BF88CEE5.sh cd /Users/buildslave/jenkins/workspace/lldb-cmake-standalone/llvm-project/lldb /bin/sh -c /Users/buildslave/jenkins/workspace/lldb-cmake-standalone/lldb-xcode-build/source/Plugins/DynamicLoader/Darwin-Kernel/lldb.build/Release/LLDBPluginDynamicLoaderDarwinKernelPropertiesEnumGen.build/Script-E284F686FA554667BF88CEE5.sh echo "Building DynamicLoaderDarwinKernelPropertiesEnum.inc..." Building DynamicLoaderDarwinKernelPropertiesEnum.inc... /Users/buildslave/jenkins/workspace/lldb-cmake-standalone/lldb-xcode-build/Release/bin/lldb-tblgen -gen-lldb-property-enum-defs -I /Users/buildslave/jenkins/workspace/lldb-cmake-standalone/llvm-project/lldb/source/Plugins/DynamicLoader/Darwin-Kernel -I/Users/buildslave/jenkins/workspace/lldb-cmake-standalone/lldb-xcode-build/source -I/Users/buildslave/jenkins/workspace/lldb-cmake-standalone/llvm-project/lldb/include -I/Users/buildslave/jenkins/workspace/lldb-cmake-standalone/lldb-xcode-build/include -I/Users/buildslave/jenkins/workspace/lldb-cmake-standalone/lldb-xcode-build/include -I/Users/buildslave/jenkins/workspace/lldb-cmake-standalone/llvm-project/llvm/include -I/Users/buildslave/jenkins/workspace/lldb-cmake-standalone/clang-build/include -I/Users/buildslave/jenkins/workspace/lldb-cmake-standalone/llvm-project/clang/include -I/Users/buildslave/jenkins/workspace/lldb-cmake-standalone/clang-build/tools/clang/include -I/usr/local/Cellar/python/3.7.0/Frameworks/Python.framework/Versions/3.7/include/python3.7m -I/Users/buildslave/jenkins/workspace/lldb-cmake-standalone/llvm-project/lldb/tools/clang/include -I/Users/buildslave/jenkins/workspace/lldb-cmake-standalone/lldb-xcode-build/../clang/include -I/usr/local/include -I/Applications/Xcode.app/Contents/Developer/Platforms/MacOSX.platform/Developer/SDKs/MacOSX10.15.sdk/usr/include/libxml2 -I/Applications/Xcode.app/Contents/Developer/Platforms/MacOSX.platform/Developer/SDKs/MacOSX10.15.sdk/usr/include/libxml2 -I/Users/buildslave/jenkins/workspace/lldb-cmake-standalone/llvm-project/lldb/source/. /Users/buildslave/jenkins/workspace/lldb-cmake-standalone/llvm-project/lldb/source/Plugins/DynamicLoader/Darwin-Kernel/DynamicLoaderDarwinKernelProperties.td --write-if-changed -o /Users/buildslave/jenkins/workspace/lldb-cmake-standalone/lldb-xcode-build/source/Plugins/DynamicLoader/Darwin-Kernel/DynamicLoaderDarwinKernelPropertiesEnum.inc

Hide Details

=== BUILD AGGREGATE TARGET LLDBPluginDynamicLoaderDarwinKernelPropertiesGen OF PROJECT lldb WITH CONFIGURATION Release ===

Hide Details

Check dependencies

Hide Details

PhaseScriptExecution CMake\ Rules /Users/buildslave/jenkins/workspace/lldb-cmake-standalone/lldb-xcode-build/source/Plugins/DynamicLoader/Darwin-Kernel/lldb.build/Release/LLDBPluginDynamicLoaderDarwinKernelPropertiesGen.build/Script-1B597F67E57D4F28902A7815.sh cd /Users/buildslave/jenkins/workspace/lldb-cmake-standalone/llvm-project/lldb /bin/sh -c /Users/buildslave/jenkins/workspace/lldb-cmake-standalone/lldb-xcode-build/source/Plugins/DynamicLoader/Darwin-Kernel/lldb.build/Release/LLDBPluginDynamicLoaderDarwinKernelPropertiesGen.build/Script-1B597F67E57D4F28902A7815.sh echo "Building DynamicLoaderDarwinKernelProperties.inc..." Building DynamicLoaderDarwinKernelProperties.inc... /Users/buildslave/jenkins/workspace/lldb-cmake-standalone/lldb-xcode-build/Release/bin/lldb-tblgen -gen-lldb-property-defs -I /Users/buildslave/jenkins/workspace/lldb-cmake-standalone/llvm-project/lldb/source/Plugins/DynamicLoader/Darwin-Kernel -I/Users/buildslave/jenkins/workspace/lldb-cmake-standalone/lldb-xcode-build/source -I/Users/buildslave/jenkins/workspace/lldb-cmake-standalone/llvm-project/lldb/include -I/Users/buildslave/jenkins/workspace/lldb-cmake-standalone/lldb-xcode-build/include -I/Users/buildslave/jenkins/workspace/lldb-cmake-standalone/lldb-xcode-build/include -I/Users/buildslave/jenkins/workspace/lldb-cmake-standalone/llvm-project/llvm/include -I/Users/buildslave/jenkins/workspace/lldb-cmake-standalone/clang-build/include -I/Users/buildslave/jenkins/workspace/lldb-cmake-standalone/llvm-project/clang/include -I/Users/buildslave/jenkins/workspace/lldb-cmake-standalone/clang-build/tools/clang/include -I/usr/local/Cellar/python/3.7.0/Frameworks/Python.framework/Versions/3.7/include/python3.7m -I/Users/buildslave/jenkins/workspace/lldb-cmake-standalone/llvm-project/lldb/tools/clang/include -I/Users/buildslave/jenkins/workspace/lldb-cmake-standalone/lldb-xcode-build/../clang/include -I/usr/local/include -I/Applications/Xcode.app/Contents/Developer/Platforms/MacOSX.platform/Developer/SDKs/MacOSX10.15.sdk/usr/include/libxml2 -I/Applications/Xcode.app/Contents/Developer/Platforms/MacOSX.platform/Developer/SDKs/MacOSX10.15.sdk/usr/include/libxml2 -I/Users/buildslave/jenkins/workspace/lldb-cmake-standalone/llvm-project/lldb/source/. /Users/buildslave/jenkins/workspace/lldb-cmake-standalone/llvm-project/lldb/source/Plugins/DynamicLoader/Darwin-Kernel/DynamicLoaderDarwinKernelProperties.td --write-if-changed -o /Users/buildslave/jenkins/workspace/lldb-cmake-standalone/lldb-xcode-build/source/Plugins/DynamicLoader/Darwin-Kernel/DynamicLoaderDarwinKernelProperties.inc

Hide Details

=== BUILD TARGET lldbPluginDynamicLoaderDarwinKernel OF PROJECT lldb WITH CONFIGURATION Release ===

Hide Details

Check dependencies

Hide Details

=== BUILD TARGET lldbPluginDynamicLoaderMacOSXDYLD OF PROJECT lldb WITH CONFIGURATION Release ===

Hide Details

Check dependencies

Hide Details

=== BUILD TARGET lldbPluginObjectFileELF OF PROJECT lldb WITH CONFIGURATION Release ===

Hide Details

Check dependencies

Hide Details

=== BUILD TARGET lldbPluginProcessElfCore OF PROJECT lldb WITH CONFIGURATION Release ===

Hide Details

Check dependencies

Hide Details

=== BUILD TARGET lldbPluginDynamicLoaderPosixDYLD OF PROJECT lldb WITH CONFIGURATION Release ===

Hide Details

Check dependencies

Hide Details

=== BUILD TARGET lldbPluginDynamicLoaderStatic OF PROJECT lldb WITH CONFIGURATION Release ===

Hide Details

Check dependencies

Hide Details

=== BUILD TARGET lldbPluginDynamicLoaderHexagonDYLD OF PROJECT lldb WITH CONFIGURATION Release ===

Hide Details

Check dependencies

Hide Details

=== BUILD TARGET lldbPluginDynamicLoaderWindowsDYLD OF PROJECT lldb WITH CONFIGURATION Release ===

Hide Details

Check dependencies

Hide Details

=== BUILD TARGET lldbPluginDynamicLoaderWasmDYLD OF PROJECT lldb WITH CONFIGURATION Release ===

Hide Details

Check dependencies

Hide Details

=== BUILD TARGET lldbPluginInstructionARM OF PROJECT lldb WITH CONFIGURATION Release ===

Hide Details

Check dependencies

Hide Details

=== BUILD TARGET lldbPluginInstructionARM64 OF PROJECT lldb WITH CONFIGURATION Release ===

Hide Details

Check dependencies

Hide Details

=== BUILD TARGET lldbPluginInstructionMIPS OF PROJECT lldb WITH CONFIGURATION Release ===

Hide Details

Check dependencies

Hide Details

=== BUILD TARGET lldbPluginInstructionMIPS64 OF PROJECT lldb WITH CONFIGURATION Release ===

Hide Details

Check dependencies

Hide Details

=== BUILD TARGET lldbPluginInstructionPPC64 OF PROJECT lldb WITH CONFIGURATION Release ===

Hide Details

Check dependencies

Hide Details

=== BUILD TARGET lldbPluginInstrumentationRuntimeASan OF PROJECT lldb WITH CONFIGURATION Release ===

Hide Details

Check dependencies

Hide Details

=== BUILD TARGET lldbPluginInstrumentationRuntimeMainThreadChecker OF PROJECT lldb WITH CONFIGURATION Release ===

Hide Details

Check dependencies

Hide Details

=== BUILD TARGET lldbPluginInstrumentationRuntimeTSan OF PROJECT lldb WITH CONFIGURATION Release ===

Hide Details

Check dependencies

Hide Details

=== BUILD TARGET lldbPluginInstrumentationRuntimeUBSan OF PROJECT lldb WITH CONFIGURATION Release ===

Hide Details

Check dependencies

Hide Details

=== BUILD AGGREGATE TARGET LLDBPluginJITLoaderGDBPropertiesEnumGen OF PROJECT lldb WITH CONFIGURATION Release ===

Hide Details

Check dependencies

Hide Details

PhaseScriptExecution CMake\ Rules /Users/buildslave/jenkins/workspace/lldb-cmake-standalone/lldb-xcode-build/source/Plugins/JITLoader/GDB/lldb.build/Release/LLDBPluginJITLoaderGDBPropertiesEnumGen.build/Script-051FB106FDA6450395B72862.sh cd /Users/buildslave/jenkins/workspace/lldb-cmake-standalone/llvm-project/lldb /bin/sh -c /Users/buildslave/jenkins/workspace/lldb-cmake-standalone/lldb-xcode-build/source/Plugins/JITLoader/GDB/lldb.build/Release/LLDBPluginJITLoaderGDBPropertiesEnumGen.build/Script-051FB106FDA6450395B72862.sh echo "Building JITLoaderGDBPropertiesEnum.inc..." Building JITLoaderGDBPropertiesEnum.inc... /Users/buildslave/jenkins/workspace/lldb-cmake-standalone/lldb-xcode-build/Release/bin/lldb-tblgen -gen-lldb-property-enum-defs -I /Users/buildslave/jenkins/workspace/lldb-cmake-standalone/llvm-project/lldb/source/Plugins/JITLoader/GDB -I/Users/buildslave/jenkins/workspace/lldb-cmake-standalone/lldb-xcode-build/source -I/Users/buildslave/jenkins/workspace/lldb-cmake-standalone/llvm-project/lldb/include -I/Users/buildslave/jenkins/workspace/lldb-cmake-standalone/lldb-xcode-build/include -I/Users/buildslave/jenkins/workspace/lldb-cmake-standalone/lldb-xcode-build/include -I/Users/buildslave/jenkins/workspace/lldb-cmake-standalone/llvm-project/llvm/include -I/Users/buildslave/jenkins/workspace/lldb-cmake-standalone/clang-build/include -I/Users/buildslave/jenkins/workspace/lldb-cmake-standalone/llvm-project/clang/include -I/Users/buildslave/jenkins/workspace/lldb-cmake-standalone/clang-build/tools/clang/include -I/usr/local/Cellar/python/3.7.0/Frameworks/Python.framework/Versions/3.7/include/python3.7m -I/Users/buildslave/jenkins/workspace/lldb-cmake-standalone/llvm-project/lldb/tools/clang/include -I/Users/buildslave/jenkins/workspace/lldb-cmake-standalone/lldb-xcode-build/../clang/include -I/usr/local/include -I/Applications/Xcode.app/Contents/Developer/Platforms/MacOSX.platform/Developer/SDKs/MacOSX10.15.sdk/usr/include/libxml2 -I/Applications/Xcode.app/Contents/Developer/Platforms/MacOSX.platform/Developer/SDKs/MacOSX10.15.sdk/usr/include/libxml2 -I/Users/buildslave/jenkins/workspace/lldb-cmake-standalone/llvm-project/lldb/source/. /Users/buildslave/jenkins/workspace/lldb-cmake-standalone/llvm-project/lldb/source/Plugins/JITLoader/GDB/JITLoaderGDBProperties.td --write-if-changed -o /Users/buildslave/jenkins/workspace/lldb-cmake-standalone/lldb-xcode-build/source/Plugins/JITLoader/GDB/JITLoaderGDBPropertiesEnum.inc

Hide Details

=== BUILD AGGREGATE TARGET LLDBPluginJITLoaderGDBPropertiesGen OF PROJECT lldb WITH CONFIGURATION Release ===

Hide Details

Check dependencies

Hide Details

PhaseScriptExecution CMake\ Rules /Users/buildslave/jenkins/workspace/lldb-cmake-standalone/lldb-xcode-build/source/Plugins/JITLoader/GDB/lldb.build/Release/LLDBPluginJITLoaderGDBPropertiesGen.build/Script-50A0065AE36E4B8781F7BB19.sh cd /Users/buildslave/jenkins/workspace/lldb-cmake-standalone/llvm-project/lldb /bin/sh -c /Users/buildslave/jenkins/workspace/lldb-cmake-standalone/lldb-xcode-build/source/Plugins/JITLoader/GDB/lldb.build/Release/LLDBPluginJITLoaderGDBPropertiesGen.build/Script-50A0065AE36E4B8781F7BB19.sh echo "Building JITLoaderGDBProperties.inc..." Building JITLoaderGDBProperties.inc... /Users/buildslave/jenkins/workspace/lldb-cmake-standalone/lldb-xcode-build/Release/bin/lldb-tblgen -gen-lldb-property-defs -I /Users/buildslave/jenkins/workspace/lldb-cmake-standalone/llvm-project/lldb/source/Plugins/JITLoader/GDB -I/Users/buildslave/jenkins/workspace/lldb-cmake-standalone/lldb-xcode-build/source -I/Users/buildslave/jenkins/workspace/lldb-cmake-standalone/llvm-project/lldb/include -I/Users/buildslave/jenkins/workspace/lldb-cmake-standalone/lldb-xcode-build/include -I/Users/buildslave/jenkins/workspace/lldb-cmake-standalone/lldb-xcode-build/include -I/Users/buildslave/jenkins/workspace/lldb-cmake-standalone/llvm-project/llvm/include -I/Users/buildslave/jenkins/workspace/lldb-cmake-standalone/clang-build/include -I/Users/buildslave/jenkins/workspace/lldb-cmake-standalone/llvm-project/clang/include -I/Users/buildslave/jenkins/workspace/lldb-cmake-standalone/clang-build/tools/clang/include -I/usr/local/Cellar/python/3.7.0/Frameworks/Python.framework/Versions/3.7/include/python3.7m -I/Users/buildslave/jenkins/workspace/lldb-cmake-standalone/llvm-project/lldb/tools/clang/include -I/Users/buildslave/jenkins/workspace/lldb-cmake-standalone/lldb-xcode-build/../clang/include -I/usr/local/include -I/Applications/Xcode.app/Contents/Developer/Platforms/MacOSX.platform/Developer/SDKs/MacOSX10.15.sdk/usr/include/libxml2 -I/Applications/Xcode.app/Contents/Developer/Platforms/MacOSX.platform/Developer/SDKs/MacOSX10.15.sdk/usr/include/libxml2 -I/Users/buildslave/jenkins/workspace/lldb-cmake-standalone/llvm-project/lldb/source/. /Users/buildslave/jenkins/workspace/lldb-cmake-standalone/llvm-project/lldb/source/Plugins/JITLoader/GDB/JITLoaderGDBProperties.td --write-if-changed -o /Users/buildslave/jenkins/workspace/lldb-cmake-standalone/lldb-xcode-build/source/Plugins/JITLoader/GDB/JITLoaderGDBProperties.inc

Hide Details

=== BUILD TARGET lldbPluginObjectFileMachO OF PROJECT lldb WITH CONFIGURATION Release ===

Hide Details

Check dependencies

Hide Details

=== BUILD TARGET lldbPluginJITLoaderGDB OF PROJECT lldb WITH CONFIGURATION Release ===

Hide Details

Check dependencies

Hide Details

=== BUILD TARGET lldbPluginObjCPlusPlusLanguage OF PROJECT lldb WITH CONFIGURATION Release ===

Hide Details

Check dependencies

Hide Details

=== BUILD TARGET lldbPluginCXXItaniumABI OF PROJECT lldb WITH CONFIGURATION Release ===

Hide Details

Check dependencies

Hide Details

=== BUILD TARGET lldbPluginMemoryHistoryASan OF PROJECT lldb WITH CONFIGURATION Release ===

Hide Details

Check dependencies

Hide Details

=== BUILD TARGET lldbPluginObjectContainerBSDArchive OF PROJECT lldb WITH CONFIGURATION Release ===

Hide Details

Check dependencies

Hide Details

=== BUILD TARGET lldbPluginObjectContainerMachOArchive OF PROJECT lldb WITH CONFIGURATION Release ===

Hide Details

Check dependencies

Hide Details

=== BUILD TARGET lldbPluginObjectFileBreakpad OF PROJECT lldb WITH CONFIGURATION Release ===

Hide Details

Check dependencies

Hide Details

=== BUILD TARGET lldbPluginObjectFilePECOFF OF PROJECT lldb WITH CONFIGURATION Release ===

Hide Details

Check dependencies

Hide Details

=== BUILD TARGET lldbPluginObjectFileWasm OF PROJECT lldb WITH CONFIGURATION Release ===

Hide Details

Check dependencies

Hide Details

=== BUILD TARGET lldbPluginOperatingSystemPython OF PROJECT lldb WITH CONFIGURATION Release ===

Hide Details

Check dependencies

Hide Details

=== BUILD TARGET lldbPluginPlatformLinux OF PROJECT lldb WITH CONFIGURATION Release ===

Hide Details

Check dependencies

Hide Details

=== BUILD TARGET lldbPluginPlatformFreeBSD OF PROJECT lldb WITH CONFIGURATION Release ===

Hide Details

Check dependencies

Hide Details

=== BUILD TARGET lldbPluginPlatformNetBSD OF PROJECT lldb WITH CONFIGURATION Release ===

Hide Details

Check dependencies

Hide Details

=== BUILD TARGET lldbPluginPlatformOpenBSD OF PROJECT lldb WITH CONFIGURATION Release ===

Hide Details

Check dependencies

Hide Details

=== BUILD TARGET lldbPluginPlatformWindows OF PROJECT lldb WITH CONFIGURATION Release ===

Hide Details

Check dependencies

Hide Details

=== BUILD TARGET lldbPluginPlatformGDB OF PROJECT lldb WITH CONFIGURATION Release ===

Hide Details

Check dependencies

Hide Details

=== BUILD TARGET lldbPluginPlatformAndroid OF PROJECT lldb WITH CONFIGURATION Release ===

Hide Details

Check dependencies

Hide Details

=== BUILD AGGREGATE TARGET LLDBPluginProcessMacOSXKernelPropertiesEnumGen OF PROJECT lldb WITH CONFIGURATION Release ===

Hide Details

Check dependencies

Hide Details

PhaseScriptExecution CMake\ Rules /Users/buildslave/jenkins/workspace/lldb-cmake-standalone/lldb-xcode-build/source/Plugins/Process/MacOSX-Kernel/lldb.build/Release/LLDBPluginProcessMacOSXKernelPropertiesEnumGen.build/Script-D2D0649037D14E0798D8AE56.sh cd /Users/buildslave/jenkins/workspace/lldb-cmake-standalone/llvm-project/lldb /bin/sh -c /Users/buildslave/jenkins/workspace/lldb-cmake-standalone/lldb-xcode-build/source/Plugins/Process/MacOSX-Kernel/lldb.build/Release/LLDBPluginProcessMacOSXKernelPropertiesEnumGen.build/Script-D2D0649037D14E0798D8AE56.sh echo "Building ProcessKDPPropertiesEnum.inc..." Building ProcessKDPPropertiesEnum.inc... /Users/buildslave/jenkins/workspace/lldb-cmake-standalone/lldb-xcode-build/Release/bin/lldb-tblgen -gen-lldb-property-enum-defs -I /Users/buildslave/jenkins/workspace/lldb-cmake-standalone/llvm-project/lldb/source/Plugins/Process/MacOSX-Kernel -I/Users/buildslave/jenkins/workspace/lldb-cmake-standalone/lldb-xcode-build/source -I/Users/buildslave/jenkins/workspace/lldb-cmake-standalone/llvm-project/lldb/include -I/Users/buildslave/jenkins/workspace/lldb-cmake-standalone/lldb-xcode-build/include -I/Users/buildslave/jenkins/workspace/lldb-cmake-standalone/lldb-xcode-build/include -I/Users/buildslave/jenkins/workspace/lldb-cmake-standalone/llvm-project/llvm/include -I/Users/buildslave/jenkins/workspace/lldb-cmake-standalone/clang-build/include -I/Users/buildslave/jenkins/workspace/lldb-cmake-standalone/llvm-project/clang/include -I/Users/buildslave/jenkins/workspace/lldb-cmake-standalone/clang-build/tools/clang/include -I/usr/local/Cellar/python/3.7.0/Frameworks/Python.framework/Versions/3.7/include/python3.7m -I/Users/buildslave/jenkins/workspace/lldb-cmake-standalone/llvm-project/lldb/tools/clang/include -I/Users/buildslave/jenkins/workspace/lldb-cmake-standalone/lldb-xcode-build/../clang/include -I/usr/local/include -I/Applications/Xcode.app/Contents/Developer/Platforms/MacOSX.platform/Developer/SDKs/MacOSX10.15.sdk/usr/include/libxml2 -I/Applications/Xcode.app/Contents/Developer/Platforms/MacOSX.platform/Developer/SDKs/MacOSX10.15.sdk/usr/include/libxml2 -I/Users/buildslave/jenkins/workspace/lldb-cmake-standalone/llvm-project/lldb/source/. /Users/buildslave/jenkins/workspace/lldb-cmake-standalone/llvm-project/lldb/source/Plugins/Process/MacOSX-Kernel/ProcessKDPProperties.td --write-if-changed -o /Users/buildslave/jenkins/workspace/lldb-cmake-standalone/lldb-xcode-build/source/Plugins/Process/MacOSX-Kernel/ProcessKDPPropertiesEnum.inc

Hide Details

=== BUILD AGGREGATE TARGET LLDBPluginProcessMacOSXKernelPropertiesGen OF PROJECT lldb WITH CONFIGURATION Release ===

Hide Details

Check dependencies

Hide Details

PhaseScriptExecution CMake\ Rules /Users/buildslave/jenkins/workspace/lldb-cmake-standalone/lldb-xcode-build/source/Plugins/Process/MacOSX-Kernel/lldb.build/Release/LLDBPluginProcessMacOSXKernelPropertiesGen.build/Script-6BE4F187340A4F758E9D7F0D.sh cd /Users/buildslave/jenkins/workspace/lldb-cmake-standalone/llvm-project/lldb /bin/sh -c /Users/buildslave/jenkins/workspace/lldb-cmake-standalone/lldb-xcode-build/source/Plugins/Process/MacOSX-Kernel/lldb.build/Release/LLDBPluginProcessMacOSXKernelPropertiesGen.build/Script-6BE4F187340A4F758E9D7F0D.sh echo "Building ProcessKDPProperties.inc..." Building ProcessKDPProperties.inc... /Users/buildslave/jenkins/workspace/lldb-cmake-standalone/lldb-xcode-build/Release/bin/lldb-tblgen -gen-lldb-property-defs -I /Users/buildslave/jenkins/workspace/lldb-cmake-standalone/llvm-project/lldb/source/Plugins/Process/MacOSX-Kernel -I/Users/buildslave/jenkins/workspace/lldb-cmake-standalone/lldb-xcode-build/source -I/Users/buildslave/jenkins/workspace/lldb-cmake-standalone/llvm-project/lldb/include -I/Users/buildslave/jenkins/workspace/lldb-cmake-standalone/lldb-xcode-build/include -I/Users/buildslave/jenkins/workspace/lldb-cmake-standalone/lldb-xcode-build/include -I/Users/buildslave/jenkins/workspace/lldb-cmake-standalone/llvm-project/llvm/include -I/Users/buildslave/jenkins/workspace/lldb-cmake-standalone/clang-build/include -I/Users/buildslave/jenkins/workspace/lldb-cmake-standalone/llvm-project/clang/include -I/Users/buildslave/jenkins/workspace/lldb-cmake-standalone/clang-build/tools/clang/include -I/usr/local/Cellar/python/3.7.0/Frameworks/Python.framework/Versions/3.7/include/python3.7m -I/Users/buildslave/jenkins/workspace/lldb-cmake-standalone/llvm-project/lldb/tools/clang/include -I/Users/buildslave/jenkins/workspace/lldb-cmake-standalone/lldb-xcode-build/../clang/include -I/usr/local/include -I/Applications/Xcode.app/Contents/Developer/Platforms/MacOSX.platform/Developer/SDKs/MacOSX10.15.sdk/usr/include/libxml2 -I/Applications/Xcode.app/Contents/Developer/Platforms/MacOSX.platform/Developer/SDKs/MacOSX10.15.sdk/usr/include/libxml2 -I/Users/buildslave/jenkins/workspace/lldb-cmake-standalone/llvm-project/lldb/source/. /Users/buildslave/jenkins/workspace/lldb-cmake-standalone/llvm-project/lldb/source/Plugins/Process/MacOSX-Kernel/ProcessKDPProperties.td --write-if-changed -o /Users/buildslave/jenkins/workspace/lldb-cmake-standalone/lldb-xcode-build/source/Plugins/Process/MacOSX-Kernel/ProcessKDPProperties.inc

Hide Details

=== BUILD TARGET lldbPluginProcessMacOSXKernel OF PROJECT lldb WITH CONFIGURATION Release ===

Hide Details

Check dependencies

Hide Details

=== BUILD TARGET lldbPluginScriptedProcess OF PROJECT lldb WITH CONFIGURATION Release ===

Hide Details

Check dependencies

Hide Details

=== BUILD TARGET lldbPluginProcessMachCore OF PROJECT lldb WITH CONFIGURATION Release ===

Hide Details

Check dependencies

Hide Details

=== BUILD TARGET lldbPluginProcessMinidump OF PROJECT lldb WITH CONFIGURATION Release ===

Hide Details

Check dependencies

Hide Details

=== BUILD TARGET lldbPluginScriptInterpreterNone OF PROJECT lldb WITH CONFIGURATION Release ===

Hide Details

Check dependencies

Hide Details

=== BUILD TARGET lldbPluginScriptInterpreterPython OF PROJECT lldb WITH CONFIGURATION Release ===

Hide Details

Check dependencies

Hide Details

=== BUILD AGGREGATE TARGET LLDBPluginStructuredDataDarwinLogPropertiesEnumGen OF PROJECT lldb WITH CONFIGURATION Release ===

Hide Details

Check dependencies

Hide Details

PhaseScriptExecution CMake\ Rules /Users/buildslave/jenkins/workspace/lldb-cmake-standalone/lldb-xcode-build/source/Plugins/StructuredData/DarwinLog/lldb.build/Release/LLDBPluginStructuredDataDarwinLogPropertiesEnumGen.build/Script-80F3DF5E660E49778F942766.sh cd /Users/buildslave/jenkins/workspace/lldb-cmake-standalone/llvm-project/lldb /bin/sh -c /Users/buildslave/jenkins/workspace/lldb-cmake-standalone/lldb-xcode-build/source/Plugins/StructuredData/DarwinLog/lldb.build/Release/LLDBPluginStructuredDataDarwinLogPropertiesEnumGen.build/Script-80F3DF5E660E49778F942766.sh echo "Building StructuredDataDarwinLogPropertiesEnum.inc..." Building StructuredDataDarwinLogPropertiesEnum.inc... /Users/buildslave/jenkins/workspace/lldb-cmake-standalone/lldb-xcode-build/Release/bin/lldb-tblgen -gen-lldb-property-enum-defs -I /Users/buildslave/jenkins/workspace/lldb-cmake-standalone/llvm-project/lldb/source/Plugins/StructuredData/DarwinLog -I/Users/buildslave/jenkins/workspace/lldb-cmake-standalone/lldb-xcode-build/source -I/Users/buildslave/jenkins/workspace/lldb-cmake-standalone/llvm-project/lldb/include -I/Users/buildslave/jenkins/workspace/lldb-cmake-standalone/lldb-xcode-build/include -I/Users/buildslave/jenkins/workspace/lldb-cmake-standalone/lldb-xcode-build/include -I/Users/buildslave/jenkins/workspace/lldb-cmake-standalone/llvm-project/llvm/include -I/Users/buildslave/jenkins/workspace/lldb-cmake-standalone/clang-build/include -I/Users/buildslave/jenkins/workspace/lldb-cmake-standalone/llvm-project/clang/include -I/Users/buildslave/jenkins/workspace/lldb-cmake-standalone/clang-build/tools/clang/include -I/usr/local/Cellar/python/3.7.0/Frameworks/Python.framework/Versions/3.7/include/python3.7m -I/Users/buildslave/jenkins/workspace/lldb-cmake-standalone/llvm-project/lldb/tools/clang/include -I/Users/buildslave/jenkins/workspace/lldb-cmake-standalone/lldb-xcode-build/../clang/include -I/usr/local/include -I/Applications/Xcode.app/Contents/Developer/Platforms/MacOSX.platform/Developer/SDKs/MacOSX10.15.sdk/usr/include/libxml2 -I/Applications/Xcode.app/Contents/Developer/Platforms/MacOSX.platform/Developer/SDKs/MacOSX10.15.sdk/usr/include/libxml2 -I/Users/buildslave/jenkins/workspace/lldb-cmake-standalone/llvm-project/lldb/source/. /Users/buildslave/jenkins/workspace/lldb-cmake-standalone/llvm-project/lldb/source/Plugins/StructuredData/DarwinLog/StructuredDataDarwinLogProperties.td --write-if-changed -o /Users/buildslave/jenkins/workspace/lldb-cmake-standalone/lldb-xcode-build/source/Plugins/StructuredData/DarwinLog/StructuredDataDarwinLogPropertiesEnum.inc

Hide Details

=== BUILD AGGREGATE TARGET LLDBPluginStructuredDataDarwinLogPropertiesGen OF PROJECT lldb WITH CONFIGURATION Release ===

Hide Details

Check dependencies

Hide Details

PhaseScriptExecution CMake\ Rules /Users/buildslave/jenkins/workspace/lldb-cmake-standalone/lldb-xcode-build/source/Plugins/StructuredData/DarwinLog/lldb.build/Release/LLDBPluginStructuredDataDarwinLogPropertiesGen.build/Script-776913F505E946DD858F0270.sh cd /Users/buildslave/jenkins/workspace/lldb-cmake-standalone/llvm-project/lldb /bin/sh -c /Users/buildslave/jenkins/workspace/lldb-cmake-standalone/lldb-xcode-build/source/Plugins/StructuredData/DarwinLog/lldb.build/Release/LLDBPluginStructuredDataDarwinLogPropertiesGen.build/Script-776913F505E946DD858F0270.sh echo "Building StructuredDataDarwinLogProperties.inc..." Building StructuredDataDarwinLogProperties.inc... /Users/buildslave/jenkins/workspace/lldb-cmake-standalone/lldb-xcode-build/Release/bin/lldb-tblgen -gen-lldb-property-defs -I /Users/buildslave/jenkins/workspace/lldb-cmake-standalone/llvm-project/lldb/source/Plugins/StructuredData/DarwinLog -I/Users/buildslave/jenkins/workspace/lldb-cmake-standalone/lldb-xcode-build/source -I/Users/buildslave/jenkins/workspace/lldb-cmake-standalone/llvm-project/lldb/include -I/Users/buildslave/jenkins/workspace/lldb-cmake-standalone/lldb-xcode-build/include -I/Users/buildslave/jenkins/workspace/lldb-cmake-standalone/lldb-xcode-build/include -I/Users/buildslave/jenkins/workspace/lldb-cmake-standalone/llvm-project/llvm/include -I/Users/buildslave/jenkins/workspace/lldb-cmake-standalone/clang-build/include -I/Users/buildslave/jenkins/workspace/lldb-cmake-standalone/llvm-project/clang/include -I/Users/buildslave/jenkins/workspace/lldb-cmake-standalone/clang-build/tools/clang/include -I/usr/local/Cellar/python/3.7.0/Frameworks/Python.framework/Versions/3.7/include/python3.7m -I/Users/buildslave/jenkins/workspace/lldb-cmake-standalone/llvm-project/lldb/tools/clang/include -I/Users/buildslave/jenkins/workspace/lldb-cmake-standalone/lldb-xcode-build/../clang/include -I/usr/local/include -I/Applications/Xcode.app/Contents/Developer/Platforms/MacOSX.platform/Developer/SDKs/MacOSX10.15.sdk/usr/include/libxml2 -I/Applications/Xcode.app/Contents/Developer/Platforms/MacOSX.platform/Developer/SDKs/MacOSX10.15.sdk/usr/include/libxml2 -I/Users/buildslave/jenkins/workspace/lldb-cmake-standalone/llvm-project/lldb/source/. /Users/buildslave/jenkins/workspace/lldb-cmake-standalone/llvm-project/lldb/source/Plugins/StructuredData/DarwinLog/StructuredDataDarwinLogProperties.td --write-if-changed -o /Users/buildslave/jenkins/workspace/lldb-cmake-standalone/lldb-xcode-build/source/Plugins/StructuredData/DarwinLog/StructuredDataDarwinLogProperties.inc

Hide Details

=== BUILD TARGET lldbPluginStructuredDataDarwinLog OF PROJECT lldb WITH CONFIGURATION Release ===

Hide Details

Check dependencies

Hide Details

=== BUILD TARGET lldbPluginSymbolFileBreakpad OF PROJECT lldb WITH CONFIGURATION Release ===

Hide Details

Check dependencies

Hide Details

=== BUILD TARGET lldbPluginSymbolFileSymtab OF PROJECT lldb WITH CONFIGURATION Release ===

Hide Details

Check dependencies

Hide Details

=== BUILD TARGET lldbPluginSystemRuntimeMacOSX OF PROJECT lldb WITH CONFIGURATION Release ===

Hide Details

Check dependencies

Hide Details

=== BUILD TARGET lldbPluginSymbolVendorMacOSX OF PROJECT lldb WITH CONFIGURATION Release ===

Hide Details

Check dependencies

Hide Details

=== BUILD TARGET lldbPluginSymbolVendorELF OF PROJECT lldb WITH CONFIGURATION Release ===

Hide Details

Check dependencies

Hide Details

=== BUILD TARGET lldbPluginSymbolVendorWasm OF PROJECT lldb WITH CONFIGURATION Release ===

Hide Details

Check dependencies

Hide Details

=== BUILD TARGET lldbPluginTraceExporterCommon OF PROJECT lldb WITH CONFIGURATION Release ===

Hide Details

Check dependencies

Hide Details

=== BUILD AGGREGATE TARGET TraceExporterCTFOptionsGen OF PROJECT lldb WITH CONFIGURATION Release ===

Hide Details

Check dependencies

Hide Details

PhaseScriptExecution CMake\ Rules /Users/buildslave/jenkins/workspace/lldb-cmake-standalone/lldb-xcode-build/source/Plugins/TraceExporter/ctf/lldb.build/Release/TraceExporterCTFOptionsGen.build/Script-711C6FC9FE9540BE87285F6B.sh cd /Users/buildslave/jenkins/workspace/lldb-cmake-standalone/llvm-project/lldb /bin/sh -c /Users/buildslave/jenkins/workspace/lldb-cmake-standalone/lldb-xcode-build/source/Plugins/TraceExporter/ctf/lldb.build/Release/TraceExporterCTFOptionsGen.build/Script-711C6FC9FE9540BE87285F6B.sh echo "Building TraceExporterCTFCommandOptions.inc..." Building TraceExporterCTFCommandOptions.inc... /Users/buildslave/jenkins/workspace/lldb-cmake-standalone/lldb-xcode-build/Release/bin/lldb-tblgen -gen-lldb-option-defs -I /Users/buildslave/jenkins/workspace/lldb-cmake-standalone/llvm-project/lldb/source/Plugins/TraceExporter/ctf -I/Users/buildslave/jenkins/workspace/lldb-cmake-standalone/lldb-xcode-build/source -I/Users/buildslave/jenkins/workspace/lldb-cmake-standalone/llvm-project/lldb/include -I/Users/buildslave/jenkins/workspace/lldb-cmake-standalone/lldb-xcode-build/include -I/Users/buildslave/jenkins/workspace/lldb-cmake-standalone/lldb-xcode-build/include -I/Users/buildslave/jenkins/workspace/lldb-cmake-standalone/llvm-project/llvm/include -I/Users/buildslave/jenkins/workspace/lldb-cmake-standalone/clang-build/include -I/Users/buildslave/jenkins/workspace/lldb-cmake-standalone/llvm-project/clang/include -I/Users/buildslave/jenkins/workspace/lldb-cmake-standalone/clang-build/tools/clang/include -I/usr/local/Cellar/python/3.7.0/Frameworks/Python.framework/Versions/3.7/include/python3.7m -I/Users/buildslave/jenkins/workspace/lldb-cmake-standalone/llvm-project/lldb/tools/clang/include -I/Users/buildslave/jenkins/workspace/lldb-cmake-standalone/lldb-xcode-build/../clang/include -I/usr/local/include -I/Applications/Xcode.app/Contents/Developer/Platforms/MacOSX.platform/Developer/SDKs/MacOSX10.15.sdk/usr/include/libxml2 -I/Applications/Xcode.app/Contents/Developer/Platforms/MacOSX.platform/Developer/SDKs/MacOSX10.15.sdk/usr/include/libxml2 -I/Users/buildslave/jenkins/workspace/lldb-cmake-standalone/llvm-project/lldb/source/. /Users/buildslave/jenkins/workspace/lldb-cmake-standalone/llvm-project/lldb/source/Plugins/TraceExporter/ctf/TraceExporterCTFOptions.td --write-if-changed -o /Users/buildslave/jenkins/workspace/lldb-cmake-standalone/lldb-xcode-build/source/Plugins/TraceExporter/ctf/TraceExporterCTFCommandOptions.inc

Hide Details

=== BUILD TARGET lldbPluginTraceExporterCTF OF PROJECT lldb WITH CONFIGURATION Release ===

Hide Details

Check dependencies

Hide Details

=== BUILD TARGET lldbPluginUnwindAssemblyInstEmulation OF PROJECT lldb WITH CONFIGURATION Release ===

Hide Details

Check dependencies

Hide Details

=== BUILD TARGET lldbPluginUnwindAssemblyX86 OF PROJECT lldb WITH CONFIGURATION Release ===

Hide Details

Check dependencies

Hide Details

=== BUILD AGGREGATE TARGET liblldb-resource-headers OF PROJECT lldb WITH CONFIGURATION Release ===

Hide Details

Check dependencies

Hide Details

PhaseScriptExecution CMake\ Rules /Users/buildslave/jenkins/workspace/lldb-cmake-standalone/lldb-xcode-build/source/API/lldb.build/Release/liblldb-resource-headers.build/Script-EB781175558A4D3CB8815D0A.sh cd /Users/buildslave/jenkins/workspace/lldb-cmake-standalone/llvm-project/lldb /bin/sh -c /Users/buildslave/jenkins/workspace/lldb-cmake-standalone/lldb-xcode-build/source/API/lldb.build/Release/liblldb-resource-headers.build/Script-EB781175558A4D3CB8815D0A.sh make: Nothing to be done for `all'.

Hide Details

=== BUILD AGGREGATE TARGET liblldb_exports OF PROJECT lldb WITH CONFIGURATION Release ===

Hide Details

Check dependencies

Hide Details

PhaseScriptExecution CMake\ Rules /Users/buildslave/jenkins/workspace/lldb-cmake-standalone/lldb-xcode-build/source/API/lldb.build/Release/liblldb_exports.build/Script-EE19D4B0BFDE4D4083BC1A8C.sh cd /Users/buildslave/jenkins/workspace/lldb-cmake-standalone/llvm-project/lldb /bin/sh -c /Users/buildslave/jenkins/workspace/lldb-cmake-standalone/lldb-xcode-build/source/API/lldb.build/Release/liblldb_exports.build/Script-EE19D4B0BFDE4D4083BC1A8C.sh make: Nothing to be done for `all'.

Hide Details

=== BUILD TARGET lldb-argdumper OF PROJECT lldb WITH CONFIGURATION Release ===

Hide Details

Check dependencies

Hide Details

PhaseScriptExecution CMake\ PostBuild\ Rules /Users/buildslave/jenkins/workspace/lldb-cmake-standalone/lldb-xcode-build/tools/argdumper/lldb.build/Release/lldb-argdumper.build/Script-E4CD2CB6315246BA8F50CCBA.sh cd /Users/buildslave/jenkins/workspace/lldb-cmake-standalone/llvm-project/lldb /bin/sh -c /Users/buildslave/jenkins/workspace/lldb-cmake-standalone/lldb-xcode-build/tools/argdumper/lldb.build/Release/lldb-argdumper.build/Script-E4CD2CB6315246BA8F50CCBA.sh echo "Copy lldb-argdumper to /Users/buildslave/jenkins/workspace/lldb-cmake-standalone/lldb-xcode-build/Release/bin/LLDB.framework/Versions/A/Resources/\$<TARGET_FILE_NAME:lldb-argdumper>" Copy lldb-argdumper to /Users/buildslave/jenkins/workspace/lldb-cmake-standalone/lldb-xcode-build/Release/bin/LLDB.framework/Versions/A/Resources/$<TARGET_FILE_NAME:lldb-argdumper> /usr/local/Cellar/cmake/3.17.2/bin/cmake -E copy /Users/buildslave/jenkins/workspace/lldb-cmake-standalone/lldb-xcode-build/Release/bin/lldb-argdumper /Users/buildslave/jenkins/workspace/lldb-cmake-standalone/lldb-xcode-build/Release/bin/LLDB.framework/Versions/A/Resources/lldb-argdumper

Hide Details

=== BUILD TARGET liblldb OF PROJECT lldb WITH CONFIGURATION Release ===

Hide Details

Check dependencies

Hide Details

PhaseScriptExecution CMake\ PostBuild\ Rules /Users/buildslave/jenkins/workspace/lldb-cmake-standalone/lldb-xcode-build/source/API/lldb.build/Release/liblldb.build/Script-EB1B55E88D4D4A35992AC1C5.sh cd /Users/buildslave/jenkins/workspace/lldb-cmake-standalone/llvm-project/lldb /bin/sh -c /Users/buildslave/jenkins/workspace/lldb-cmake-standalone/lldb-xcode-build/source/API/lldb.build/Release/liblldb.build/Script-EB1B55E88D4D4A35992AC1C5.sh echo "LLDB.framework: create Headers symlink" LLDB.framework: create Headers symlink /usr/local/Cellar/cmake/3.17.2/bin/cmake -E create_symlink Versions/Current/Headers /Users/buildslave/jenkins/workspace/lldb-cmake-standalone/lldb-xcode-build/Release/bin/LLDB.framework/Headers echo "LLDB.framework: copy framework headers" LLDB.framework: copy framework headers /usr/local/Cellar/cmake/3.17.2/bin/cmake -E copy_directory /Users/buildslave/jenkins/workspace/lldb-cmake-standalone/lldb-xcode-build/source/API/FrameworkHeaders /Users/buildslave/jenkins/workspace/lldb-cmake-standalone/lldb-xcode-build/Release/bin/LLDB.framework/Versions/A/Headers /Users/buildslave/jenkins/workspace/lldb-cmake-standalone/llvm-project/lldb/scripts/framework-header-fix.sh /Users/buildslave/jenkins/workspace/lldb-cmake-standalone/lldb-xcode-build/Release/bin/LLDB.framework/Versions/A/Headers 14.0.0git echo "LLDB.framework: copy clang vendor-specific headers" LLDB.framework: copy clang vendor-specific headers /usr/local/Cellar/cmake/3.17.2/bin/cmake -E copy_directory /Users/buildslave/jenkins/workspace/lldb-cmake-standalone/clang-build/lib/cmake/clang/../../clang/14.0.0/include /Users/buildslave/jenkins/workspace/lldb-cmake-standalone/lldb-xcode-build/Release/bin/LLDB.framework/Versions/A/Resources/Clang/include

Hide Details

=== BUILD AGGREGATE TARGET lldb-python OF PROJECT lldb WITH CONFIGURATION Release ===

Hide Details

Check dependencies

Hide Details

PhaseScriptExecution CMake\ Rules /Users/buildslave/jenkins/workspace/lldb-cmake-standalone/lldb-xcode-build/lldb.build/Release/lldb-python.build/Script-5601EAAABA454D6AB175C937.sh cd /Users/buildslave/jenkins/workspace/lldb-cmake-standalone/llvm-project/lldb /bin/sh -c /Users/buildslave/jenkins/workspace/lldb-cmake-standalone/lldb-xcode-build/lldb.build/Release/lldb-python.build/Script-5601EAAABA454D6AB175C937.sh echo "Python script sym-linking LLDB Python API" Python script sym-linking LLDB Python API /usr/local/Cellar/cmake/3.17.2/bin/cmake -E make_directory /Users/buildslave/jenkins/workspace/lldb-cmake-standalone/lldb-xcode-build/Release/bin/LLDB.framework/Resources/Python/lldb

Hide Details

PhaseScriptExecution CMake\ PostBuild\ Rules /Users/buildslave/jenkins/workspace/lldb-cmake-standalone/lldb-xcode-build/lldb.build/Release/lldb-python.build/Script-AA37BC4BB7994EA1A8CCFD0A.sh cd /Users/buildslave/jenkins/workspace/lldb-cmake-standalone/llvm-project/lldb /bin/sh -c /Users/buildslave/jenkins/workspace/lldb-cmake-standalone/lldb-xcode-build/lldb.build/Release/lldb-python.build/Script-AA37BC4BB7994EA1A8CCFD0A.sh /usr/local/Cellar/cmake/3.17.2/bin/cmake -E copy /Users/buildslave/jenkins/workspace/lldb-cmake-standalone/llvm-project/lldb/third_party/Python/module/six/six.py /Users/buildslave/jenkins/workspace/lldb-cmake-standalone/lldb-xcode-build/Release/bin/LLDB.framework/Resources/Python/lldb/../six.py /usr/local/Cellar/cmake/3.17.2/bin/cmake -E copy /Users/buildslave/jenkins/workspace/lldb-cmake-standalone/lldb-xcode-build/bindings/python/lldb.py /Users/buildslave/jenkins/workspace/lldb-cmake-standalone/lldb-xcode-build/Release/bin/LLDB.framework/Resources/Python/lldb/__init__.py /usr/local/Cellar/cmake/3.17.2/bin/cmake -E copy /Users/buildslave/jenkins/workspace/lldb-cmake-standalone/llvm-project/lldb/source/Interpreter/embedded_interpreter.py /Users/buildslave/jenkins/workspace/lldb-cmake-standalone/lldb-xcode-build/Release/bin/LLDB.framework/Resources/Python/lldb cd /Users/buildslave/jenkins/workspace/lldb-cmake-standalone/lldb-xcode-build/Release/bin/LLDB.framework/Resources/Python/lldb && /usr/local/Cellar/cmake/3.17.2/bin/cmake -E make_directory formatters/cpp cd /Users/buildslave/jenkins/workspace/lldb-cmake-standalone/lldb-xcode-build/Release/bin/LLDB.framework/Resources/Python/lldb && /usr/local/Cellar/cmake/3.17.2/bin/cmake -E copy /Users/buildslave/jenkins/workspace/lldb-cmake-standalone/llvm-project/lldb/examples/synthetic/gnu_libstdcpp.py /Users/buildslave/jenkins/workspace/lldb-cmake-standalone/llvm-project/lldb/examples/synthetic/libcxx.py formatters/cpp cd /Users/buildslave/jenkins/workspace/lldb-cmake-standalone/lldb-xcode-build/Release/bin/LLDB.framework/Resources/Python/lldb && /usr/local/Frameworks/Python.framework/Versions/3.7/bin/python3.7 /Users/buildslave/jenkins/workspace/lldb-cmake-standalone/llvm-project/lldb/bindings/python/createPythonInit.py formatters/cpp /Users/buildslave/jenkins/workspace/lldb-cmake-standalone/llvm-project/lldb/examples/synthetic/gnu_libstdcpp.py /Users/buildslave/jenkins/workspace/lldb-cmake-standalone/llvm-project/lldb/examples/synthetic/libcxx.py cd /Users/buildslave/jenkins/workspace/lldb-cmake-standalone/lldb-xcode-build/Release/bin/LLDB.framework/Resources/Python/lldb && /usr/local/Cellar/cmake/3.17.2/bin/cmake -E make_directory formatters cd /Users/buildslave/jenkins/workspace/lldb-cmake-standalone/lldb-xcode-build/Release/bin/LLDB.framework/Resources/Python/lldb && /usr/local/Cellar/cmake/3.17.2/bin/cmake -E copy /Users/buildslave/jenkins/workspace/lldb-cmake-standalone/llvm-project/lldb/examples/summaries/cocoa/cache.py /Users/buildslave/jenkins/workspace/lldb-cmake-standalone/llvm-project/lldb/examples/summaries/synth.py /Users/buildslave/jenkins/workspace/lldb-cmake-standalone/llvm-project/lldb/examples/summaries/cocoa/metrics.py /Users/buildslave/jenkins/workspace/lldb-cmake-standalone/llvm-project/lldb/examples/summaries/cocoa/attrib_fromdict.py /Users/buildslave/jenkins/workspace/lldb-cmake-standalone/llvm-project/lldb/examples/summaries/cocoa/Logger.py formatters cd /Users/buildslave/jenkins/workspace/lldb-cmake-standalone/lldb-xcode-build/Release/bin/LLDB.framework/Resources/Python/lldb && /usr/local/Frameworks/Python.framework/Versions/3.7/bin/python3.7 /Users/buildslave/jenkins/workspace/lldb-cmake-standalone/llvm-project/lldb/bindings/python/createPythonInit.py formatters /Users/buildslave/jenkins/workspace/lldb-cmake-standalone/llvm-project/lldb/examples/summaries/cocoa/cache.py /Users/buildslave/jenkins/workspace/lldb-cmake-standalone/llvm-project/lldb/examples/summaries/synth.py /Users/buildslave/jenkins/workspace/lldb-cmake-standalone/llvm-project/lldb/examples/summaries/cocoa/metrics.py /Users/buildslave/jenkins/workspace/lldb-cmake-standalone/llvm-project/lldb/examples/summaries/cocoa/attrib_fromdict.py /Users/buildslave/jenkins/workspace/lldb-cmake-standalone/llvm-project/lldb/examples/summaries/cocoa/Logger.py cd /Users/buildslave/jenkins/workspace/lldb-cmake-standalone/lldb-xcode-build/Release/bin/LLDB.framework/Resources/Python/lldb && /usr/local/Cellar/cmake/3.17.2/bin/cmake -E make_directory utils cd /Users/buildslave/jenkins/workspace/lldb-cmake-standalone/lldb-xcode-build/Release/bin/LLDB.framework/Resources/Python/lldb && /usr/local/Cellar/cmake/3.17.2/bin/cmake -E copy /Users/buildslave/jenkins/workspace/lldb-cmake-standalone/llvm-project/lldb/examples/python/in_call_stack.py /Users/buildslave/jenkins/workspace/lldb-cmake-standalone/llvm-project/lldb/examples/python/symbolication.py utils cd /Users/buildslave/jenkins/workspace/lldb-cmake-standalone/lldb-xcode-build/Release/bin/LLDB.framework/Resources/Python/lldb && /usr/local/Frameworks/Python.framework/Versions/3.7/bin/python3.7 /Users/buildslave/jenkins/workspace/lldb-cmake-standalone/llvm-project/lldb/bindings/python/createPythonInit.py utils /Users/buildslave/jenkins/workspace/lldb-cmake-standalone/llvm-project/lldb/examples/python/in_call_stack.py /Users/buildslave/jenkins/workspace/lldb-cmake-standalone/llvm-project/lldb/examples/python/symbolication.py cd /Users/buildslave/jenkins/workspace/lldb-cmake-standalone/lldb-xcode-build/Release/bin/LLDB.framework/Resources/Python/lldb && /usr/local/Cellar/cmake/3.17.2/bin/cmake -E make_directory plugins cd /Users/buildslave/jenkins/workspace/lldb-cmake-standalone/lldb-xcode-build/Release/bin/LLDB.framework/Resources/Python/lldb && /usr/local/Cellar/cmake/3.17.2/bin/cmake -E copy /Users/buildslave/jenkins/workspace/lldb-cmake-standalone/llvm-project/lldb/examples/python/scripted_process/scripted_process.py plugins cd /Users/buildslave/jenkins/workspace/lldb-cmake-standalone/lldb-xcode-build/Release/bin/LLDB.framework/Resources/Python/lldb && /usr/local/Frameworks/Python.framework/Versions/3.7/bin/python3.7 /Users/buildslave/jenkins/workspace/lldb-cmake-standalone/llvm-project/lldb/bindings/python/createPythonInit.py plugins /Users/buildslave/jenkins/workspace/lldb-cmake-standalone/llvm-project/lldb/examples/python/scripted_process/scripted_process.py cd /Users/buildslave/jenkins/workspace/lldb-cmake-standalone/lldb-xcode-build/Release/bin/LLDB.framework/Resources/Python/lldb && /usr/local/Cellar/cmake/3.17.2/bin/cmake -E make_directory macosx cd /Users/buildslave/jenkins/workspace/lldb-cmake-standalone/lldb-xcode-build/Release/bin/LLDB.framework/Resources/Python/lldb && /usr/local/Cellar/cmake/3.17.2/bin/cmake -E copy /Users/buildslave/jenkins/workspace/lldb-cmake-standalone/llvm-project/lldb/examples/python/crashlog.py /Users/buildslave/jenkins/workspace/lldb-cmake-standalone/llvm-project/lldb/examples/darwin/heap_find/heap.py macosx cd /Users/buildslave/jenkins/workspace/lldb-cmake-standalone/lldb-xcode-build/Release/bin/LLDB.framework/Resources/Python/lldb && /usr/local/Frameworks/Python.framework/Versions/3.7/bin/python3.7 /Users/buildslave/jenkins/workspace/lldb-cmake-standalone/llvm-project/lldb/bindings/python/createPythonInit.py macosx /Users/buildslave/jenkins/workspace/lldb-cmake-standalone/llvm-project/lldb/examples/python/crashlog.py /Users/buildslave/jenkins/workspace/lldb-cmake-standalone/llvm-project/lldb/examples/darwin/heap_find/heap.py cd /Users/buildslave/jenkins/workspace/lldb-cmake-standalone/lldb-xcode-build/Release/bin/LLDB.framework/Resources/Python/lldb && /usr/local/Cellar/cmake/3.17.2/bin/cmake -E make_directory macosx/heap cd /Users/buildslave/jenkins/workspace/lldb-cmake-standalone/lldb-xcode-build/Release/bin/LLDB.framework/Resources/Python/lldb && /usr/local/Cellar/cmake/3.17.2/bin/cmake -E copy /Users/buildslave/jenkins/workspace/lldb-cmake-standalone/llvm-project/lldb/examples/darwin/heap_find/heap/heap_find.cpp /Users/buildslave/jenkins/workspace/lldb-cmake-standalone/llvm-project/lldb/examples/darwin/heap_find/heap/Makefile macosx/heap cd /Users/buildslave/jenkins/workspace/lldb-cmake-standalone/lldb-xcode-build/Release/bin/LLDB.framework/Resources/Python/lldb && /usr/local/Cellar/cmake/3.17.2/bin/cmake -E make_directory diagnose cd /Users/buildslave/jenkins/workspace/lldb-cmake-standalone/lldb-xcode-build/Release/bin/LLDB.framework/Resources/Python/lldb && /usr/local/Cellar/cmake/3.17.2/bin/cmake -E copy /Users/buildslave/jenkins/workspace/lldb-cmake-standalone/llvm-project/lldb/examples/python/diagnose_unwind.py /Users/buildslave/jenkins/workspace/lldb-cmake-standalone/llvm-project/lldb/examples/python/diagnose_nsstring.py diagnose cd /Users/buildslave/jenkins/workspace/lldb-cmake-standalone/lldb-xcode-build/Release/bin/LLDB.framework/Resources/Python/lldb && /usr/local/Frameworks/Python.framework/Versions/3.7/bin/python3.7 /Users/buildslave/jenkins/workspace/lldb-cmake-standalone/llvm-project/lldb/bindings/python/createPythonInit.py diagnose /Users/buildslave/jenkins/workspace/lldb-cmake-standalone/llvm-project/lldb/examples/python/diagnose_unwind.py /Users/buildslave/jenkins/workspace/lldb-cmake-standalone/llvm-project/lldb/examples/python/diagnose_nsstring.py cd /Users/buildslave/jenkins/workspace/lldb-cmake-standalone/lldb-xcode-build/Release/bin/LLDB.framework/Resources/Python/lldb && /usr/local/Cellar/cmake/3.17.2/bin/cmake -E create_symlink ../../../LLDB _lldb.so

Hide Details

=== BUILD AGGREGATE TARGET LLDBOptionsTableGen OF PROJECT lldb WITH CONFIGURATION Release ===

Hide Details

Check dependencies

Hide Details

PhaseScriptExecution CMake\ Rules /Users/buildslave/jenkins/workspace/lldb-cmake-standalone/lldb-xcode-build/tools/driver/lldb.build/Release/LLDBOptionsTableGen.build/Script-9F17B392BD5F4740A8D28A06.sh cd /Users/buildslave/jenkins/workspace/lldb-cmake-standalone/llvm-project/lldb /bin/sh -c /Users/buildslave/jenkins/workspace/lldb-cmake-standalone/lldb-xcode-build/tools/driver/lldb.build/Release/LLDBOptionsTableGen.build/Script-9F17B392BD5F4740A8D28A06.sh echo "Building Options.inc..." Building Options.inc... /Users/buildslave/jenkins/workspace/lldb-cmake-standalone/clang-build/bin/llvm-tblgen -gen-opt-parser-defs -I /Users/buildslave/jenkins/workspace/lldb-cmake-standalone/llvm-project/lldb/tools/driver -I/Users/buildslave/jenkins/workspace/lldb-cmake-standalone/llvm-project/lldb/include -I/Users/buildslave/jenkins/workspace/lldb-cmake-standalone/lldb-xcode-build/include -I/Users/buildslave/jenkins/workspace/lldb-cmake-standalone/lldb-xcode-build/include -I/Users/buildslave/jenkins/workspace/lldb-cmake-standalone/llvm-project/llvm/include -I/Users/buildslave/jenkins/workspace/lldb-cmake-standalone/clang-build/include -I/Users/buildslave/jenkins/workspace/lldb-cmake-standalone/llvm-project/clang/include -I/Users/buildslave/jenkins/workspace/lldb-cmake-standalone/clang-build/tools/clang/include -I/usr/local/Cellar/python/3.7.0/Frameworks/Python.framework/Versions/3.7/include/python3.7m -I/Users/buildslave/jenkins/workspace/lldb-cmake-standalone/llvm-project/lldb/tools/clang/include -I/Users/buildslave/jenkins/workspace/lldb-cmake-standalone/lldb-xcode-build/../clang/include -I/usr/local/include -I/Applications/Xcode.app/Contents/Developer/Platforms/MacOSX.platform/Developer/SDKs/MacOSX10.15.sdk/usr/include/libxml2 -I/Applications/Xcode.app/Contents/Developer/Platforms/MacOSX.platform/Developer/SDKs/MacOSX10.15.sdk/usr/include/libxml2 /Users/buildslave/jenkins/workspace/lldb-cmake-standalone/llvm-project/lldb/tools/driver/Options.td --write-if-changed -o /Users/buildslave/jenkins/workspace/lldb-cmake-standalone/lldb-xcode-build/tools/driver/Options.inc

Hide Details

=== BUILD TARGET lldb OF PROJECT lldb WITH CONFIGURATION Release ===

Hide Details

Check dependencies

Hide Details

=== BUILD TARGET lldb-test OF PROJECT lldb WITH CONFIGURATION Release ===

Hide Details

Check dependencies

Hide Details

=== BUILD TARGET lldb-instr OF PROJECT lldb WITH CONFIGURATION Release ===

Hide Details

Check dependencies

Hide Details

=== BUILD AGGREGATE TARGET LLDBVSCodeOptionsTableGen OF PROJECT lldb WITH CONFIGURATION Release ===

Hide Details

Check dependencies

Hide Details

PhaseScriptExecution CMake\ Rules /Users/buildslave/jenkins/workspace/lldb-cmake-standalone/lldb-xcode-build/tools/lldb-vscode/lldb.build/Release/LLDBVSCodeOptionsTableGen.build/Script-FF184FF0681C484EA5134268.sh cd /Users/buildslave/jenkins/workspace/lldb-cmake-standalone/llvm-project/lldb /bin/sh -c /Users/buildslave/jenkins/workspace/lldb-cmake-standalone/lldb-xcode-build/tools/lldb-vscode/lldb.build/Release/LLDBVSCodeOptionsTableGen.build/Script-FF184FF0681C484EA5134268.sh echo "Building Options.inc..." Building Options.inc... /Users/buildslave/jenkins/workspace/lldb-cmake-standalone/clang-build/bin/llvm-tblgen -gen-opt-parser-defs -I /Users/buildslave/jenkins/workspace/lldb-cmake-standalone/llvm-project/lldb/tools/lldb-vscode -I/Users/buildslave/jenkins/workspace/lldb-cmake-standalone/llvm-project/lldb/include -I/Users/buildslave/jenkins/workspace/lldb-cmake-standalone/lldb-xcode-build/include -I/Users/buildslave/jenkins/workspace/lldb-cmake-standalone/lldb-xcode-build/include -I/Users/buildslave/jenkins/workspace/lldb-cmake-standalone/llvm-project/llvm/include -I/Users/buildslave/jenkins/workspace/lldb-cmake-standalone/clang-build/include -I/Users/buildslave/jenkins/workspace/lldb-cmake-standalone/llvm-project/clang/include -I/Users/buildslave/jenkins/workspace/lldb-cmake-standalone/clang-build/tools/clang/include -I/usr/local/Cellar/python/3.7.0/Frameworks/Python.framework/Versions/3.7/include/python3.7m -I/Users/buildslave/jenkins/workspace/lldb-cmake-standalone/llvm-project/lldb/tools/clang/include -I/Users/buildslave/jenkins/workspace/lldb-cmake-standalone/lldb-xcode-build/../clang/include -I/usr/local/include -I/Applications/Xcode.app/Contents/Developer/Platforms/MacOSX.platform/Developer/SDKs/MacOSX10.15.sdk/usr/include/libxml2 -I/Applications/Xcode.app/Contents/Developer/Platforms/MacOSX.platform/Developer/SDKs/MacOSX10.15.sdk/usr/include/libxml2 /Users/buildslave/jenkins/workspace/lldb-cmake-standalone/llvm-project/lldb/tools/lldb-vscode/Options.td --write-if-changed -o /Users/buildslave/jenkins/workspace/lldb-cmake-standalone/lldb-xcode-build/tools/lldb-vscode/Options.inc

Hide Details

=== BUILD TARGET lldb-vscode OF PROJECT lldb WITH CONFIGURATION Release ===

Hide Details

Check dependencies

Hide Details

=== BUILD TARGET darwin-debug OF PROJECT lldb WITH CONFIGURATION Release ===

Hide Details

Check dependencies

Hide Details

PhaseScriptExecution CMake\ PostBuild\ Rules /Users/buildslave/jenkins/workspace/lldb-cmake-standalone/lldb-xcode-build/tools/darwin-debug/lldb.build/Release/darwin-debug.build/Script-6CB12CADB8BC43A8BD0D4988.sh cd /Users/buildslave/jenkins/workspace/lldb-cmake-standalone/llvm-project/lldb /bin/sh -c /Users/buildslave/jenkins/workspace/lldb-cmake-standalone/lldb-xcode-build/tools/darwin-debug/lldb.build/Release/darwin-debug.build/Script-6CB12CADB8BC43A8BD0D4988.sh echo "Copy darwin-debug to /Users/buildslave/jenkins/workspace/lldb-cmake-standalone/lldb-xcode-build/Release/bin/LLDB.framework/Versions/A/Resources/\$<TARGET_FILE_NAME:darwin-debug>" Copy darwin-debug to /Users/buildslave/jenkins/workspace/lldb-cmake-standalone/lldb-xcode-build/Release/bin/LLDB.framework/Versions/A/Resources/$<TARGET_FILE_NAME:darwin-debug> /usr/local/Cellar/cmake/3.17.2/bin/cmake -E copy /Users/buildslave/jenkins/workspace/lldb-cmake-standalone/lldb-xcode-build/Release/bin/darwin-debug /Users/buildslave/jenkins/workspace/lldb-cmake-standalone/lldb-xcode-build/Release/bin/LLDB.framework/Versions/A/Resources/darwin-debug

Hide Details

=== BUILD TARGET lldbDebugserverCommon OF PROJECT lldb WITH CONFIGURATION Release ===

Hide Details

Check dependencies

Hide Details

PhaseScriptExecution CMake\ Rules /Users/buildslave/jenkins/workspace/lldb-cmake-standalone/lldb-xcode-build/tools/debugserver/source/lldb.build/Release/lldbDebugserverCommon.build/Script-7D7286A230C84A549AD31E11.sh cd /Users/buildslave/jenkins/workspace/lldb-cmake-standalone/llvm-project/lldb /bin/sh -c /Users/buildslave/jenkins/workspace/lldb-cmake-standalone/lldb-xcode-build/tools/debugserver/source/lldb.build/Release/lldbDebugserverCommon.build/Script-7D7286A230C84A549AD31E11.sh make: Nothing to be done for `all'.

Hide Details

=== BUILD TARGET lldbDebugserverArchSupport OF PROJECT lldb WITH CONFIGURATION Release ===

Hide Details

Check dependencies

Hide Details

=== BUILD TARGET debugserver OF PROJECT lldb WITH CONFIGURATION Release ===

Hide Details

Check dependencies

Hide Details

PhaseScriptExecution CMake\ PostBuild\ Rules /Users/buildslave/jenkins/workspace/lldb-cmake-standalone/lldb-xcode-build/tools/debugserver/source/lldb.build/Release/debugserver.build/Script-A83AC972C60641F0A2C756FB.sh cd /Users/buildslave/jenkins/workspace/lldb-cmake-standalone/llvm-project/lldb /bin/sh -c /Users/buildslave/jenkins/workspace/lldb-cmake-standalone/lldb-xcode-build/tools/debugserver/source/lldb.build/Release/debugserver.build/Script-A83AC972C60641F0A2C756FB.sh echo "Copy debugserver to /Users/buildslave/jenkins/workspace/lldb-cmake-standalone/lldb-xcode-build/Release/bin/LLDB.framework/Versions/A/Resources/\$<TARGET_FILE_NAME:debugserver>" Copy debugserver to /Users/buildslave/jenkins/workspace/lldb-cmake-standalone/lldb-xcode-build/Release/bin/LLDB.framework/Versions/A/Resources/$<TARGET_FILE_NAME:debugserver> /usr/local/Cellar/cmake/3.17.2/bin/cmake -E copy /Users/buildslave/jenkins/workspace/lldb-cmake-standalone/lldb-xcode-build/Release/bin/debugserver /Users/buildslave/jenkins/workspace/lldb-cmake-standalone/lldb-xcode-build/Release/bin/LLDB.framework/Versions/A/Resources/debugserver echo "Code-sign debugserver copy in the build-tree framework: /Users/buildslave/jenkins/workspace/lldb-cmake-standalone/lldb-xcode-build/Release/bin/LLDB.framework/Versions/A/Resources/debugserver" Code-sign debugserver copy in the build-tree framework: /Users/buildslave/jenkins/workspace/lldb-cmake-standalone/lldb-xcode-build/Release/bin/LLDB.framework/Versions/A/Resources/debugserver /usr/local/Cellar/cmake/3.17.2/bin/cmake -E env CODESIGN_ALLOCATE=/Applications/Xcode.app/Contents/Developer/Toolchains/XcodeDefault.xctoolchain/usr/bin/codesign_allocate xcrun codesign -f -s lldb_codesign --entitlements /Users/buildslave/jenkins/workspace/lldb-cmake-standalone/llvm-project/lldb/tools/debugserver/source/../resources/debugserver-macosx-entitlements.plist /Users/buildslave/jenkins/workspace/lldb-cmake-standalone/lldb-xcode-build/Release/bin/LLDB.framework/Versions/A/Resources/debugserver /Users/buildslave/jenkins/workspace/lldb-cmake-standalone/lldb-xcode-build/Release/bin/LLDB.framework/Versions/A/Resources/debugserver: replacing existing signature

Hide Details

=== BUILD AGGREGATE TARGET LLGSOptionsTableGen OF PROJECT lldb WITH CONFIGURATION Release ===

Hide Details

Check dependencies

Hide Details

PhaseScriptExecution CMake\ Rules /Users/buildslave/jenkins/workspace/lldb-cmake-standalone/lldb-xcode-build/tools/lldb-server/lldb.build/Release/LLGSOptionsTableGen.build/Script-8613C206CECD4586BA4171B5.sh cd /Users/buildslave/jenkins/workspace/lldb-cmake-standalone/llvm-project/lldb /bin/sh -c /Users/buildslave/jenkins/workspace/lldb-cmake-standalone/lldb-xcode-build/tools/lldb-server/lldb.build/Release/LLGSOptionsTableGen.build/Script-8613C206CECD4586BA4171B5.sh echo "Building LLGSOptions.inc..." Building LLGSOptions.inc... /Users/buildslave/jenkins/workspace/lldb-cmake-standalone/clang-build/bin/llvm-tblgen -gen-opt-parser-defs -I /Users/buildslave/jenkins/workspace/lldb-cmake-standalone/llvm-project/lldb/tools/lldb-server -I/Users/buildslave/jenkins/workspace/lldb-cmake-standalone/llvm-project/lldb/include -I/Users/buildslave/jenkins/workspace/lldb-cmake-standalone/lldb-xcode-build/include -I/Users/buildslave/jenkins/workspace/lldb-cmake-standalone/lldb-xcode-build/include -I/Users/buildslave/jenkins/workspace/lldb-cmake-standalone/llvm-project/llvm/include -I/Users/buildslave/jenkins/workspace/lldb-cmake-standalone/clang-build/include -I/Users/buildslave/jenkins/workspace/lldb-cmake-standalone/llvm-project/clang/include -I/Users/buildslave/jenkins/workspace/lldb-cmake-standalone/clang-build/tools/clang/include -I/usr/local/Cellar/python/3.7.0/Frameworks/Python.framework/Versions/3.7/include/python3.7m -I/Users/buildslave/jenkins/workspace/lldb-cmake-standalone/llvm-project/lldb/tools/clang/include -I/Users/buildslave/jenkins/workspace/lldb-cmake-standalone/lldb-xcode-build/../clang/include -I/usr/local/include -I/Applications/Xcode.app/Contents/Developer/Platforms/MacOSX.platform/Developer/SDKs/MacOSX10.15.sdk/usr/include/libxml2 -I/Applications/Xcode.app/Contents/Developer/Platforms/MacOSX.platform/Developer/SDKs/MacOSX10.15.sdk/usr/include/libxml2 /Users/buildslave/jenkins/workspace/lldb-cmake-standalone/llvm-project/lldb/tools/lldb-server/LLGSOptions.td --write-if-changed -o /Users/buildslave/jenkins/workspace/lldb-cmake-standalone/lldb-xcode-build/tools/lldb-server/LLGSOptions.inc

Hide Details

=== BUILD TARGET lldb-server OF PROJECT lldb WITH CONFIGURATION Release ===

Hide Details

Check dependencies

Hide Details

=== BUILD TARGET lit-cpuid OF PROJECT lldb WITH CONFIGURATION Release ===

Hide Details

Check dependencies

Hide Details

=== BUILD AGGREGATE TARGET lldb-test-depends OF PROJECT lldb WITH CONFIGURATION Release ===

Hide Details

Check dependencies

Hide Details

=== BUILD AGGREGATE TARGET lldb-api-test-deps OF PROJECT lldb WITH CONFIGURATION Release ===

Hide Details

Check dependencies

Hide Details

=== BUILD AGGREGATE TARGET lldb-shell-test-deps OF PROJECT lldb WITH CONFIGURATION Release ===

Hide Details

Check dependencies

Hide Details

=== BUILD TARGET APITests OF PROJECT lldb WITH CONFIGURATION Release ===

Hide Details

Check dependencies

Hide Details

Write auxiliary files write-file /Users/buildslave/jenkins/workspace/lldb-cmake-standalone/lldb-xcode-build/unittests/API/lldb.build/Release/APITests.build/Script-EE7ACBCA970A4954AEF447B1.sh chmod 0755 /Users/buildslave/jenkins/workspace/lldb-cmake-standalone/lldb-xcode-build/unittests/API/lldb.build/Release/APITests.build/Script-EE7ACBCA970A4954AEF447B1.sh

Hide Details

PhaseScriptExecution CMake\ PostBuild\ Rules /Users/buildslave/jenkins/workspace/lldb-cmake-standalone/lldb-xcode-build/unittests/API/lldb.build/Release/APITests.build/Script-EE7ACBCA970A4954AEF447B1.sh cd /Users/buildslave/jenkins/workspace/lldb-cmake-standalone/llvm-project/lldb /bin/sh -c /Users/buildslave/jenkins/workspace/lldb-cmake-standalone/lldb-xcode-build/unittests/API/lldb.build/Release/APITests.build/Script-EE7ACBCA970A4954AEF447B1.sh /usr/local/Cellar/cmake/3.17.2/bin/cmake -E make_directory /Users/buildslave/jenkins/workspace/lldb-cmake-standalone/lldb-xcode-build/unittests/API/Release/Inputs

Hide Details

=== BUILD TARGET LLDBBreakpointTests OF PROJECT lldb WITH CONFIGURATION Release ===

Hide Details

Check dependencies

Hide Details

Write auxiliary files write-file /Users/buildslave/jenkins/workspace/lldb-cmake-standalone/lldb-xcode-build/unittests/Breakpoint/lldb.build/Release/LLDBBreakpointTests.build/Script-1CB6648058D64C2F82CA5EEF.sh chmod 0755 /Users/buildslave/jenkins/workspace/lldb-cmake-standalone/lldb-xcode-build/unittests/Breakpoint/lldb.build/Release/LLDBBreakpointTests.build/Script-1CB6648058D64C2F82CA5EEF.sh

Hide Details

PhaseScriptExecution CMake\ PostBuild\ Rules /Users/buildslave/jenkins/workspace/lldb-cmake-standalone/lldb-xcode-build/unittests/Breakpoint/lldb.build/Release/LLDBBreakpointTests.build/Script-1CB6648058D64C2F82CA5EEF.sh cd /Users/buildslave/jenkins/workspace/lldb-cmake-standalone/llvm-project/lldb /bin/sh -c /Users/buildslave/jenkins/workspace/lldb-cmake-standalone/lldb-xcode-build/unittests/Breakpoint/lldb.build/Release/LLDBBreakpointTests.build/Script-1CB6648058D64C2F82CA5EEF.sh /usr/local/Cellar/cmake/3.17.2/bin/cmake -E make_directory /Users/buildslave/jenkins/workspace/lldb-cmake-standalone/lldb-xcode-build/unittests/Breakpoint/Release/Inputs

Hide Details

=== BUILD TARGET lldbUtilityHelpers OF PROJECT lldb WITH CONFIGURATION Release ===

Hide Details

Check dependencies

Hide Details

=== BUILD TARGET LLDBCoreTests OF PROJECT lldb WITH CONFIGURATION Release ===

Hide Details

Check dependencies

Hide Details

Write auxiliary files write-file /Users/buildslave/jenkins/workspace/lldb-cmake-standalone/lldb-xcode-build/unittests/Core/lldb.build/Release/LLDBCoreTests.build/Script-CF91FBDB11C64C1682E4CF7D.sh chmod 0755 /Users/buildslave/jenkins/workspace/lldb-cmake-standalone/lldb-xcode-build/unittests/Core/lldb.build/Release/LLDBCoreTests.build/Script-CF91FBDB11C64C1682E4CF7D.sh

Hide Details

PhaseScriptExecution CMake\ PostBuild\ Rules /Users/buildslave/jenkins/workspace/lldb-cmake-standalone/lldb-xcode-build/unittests/Core/lldb.build/Release/LLDBCoreTests.build/Script-CF91FBDB11C64C1682E4CF7D.sh cd /Users/buildslave/jenkins/workspace/lldb-cmake-standalone/llvm-project/lldb /bin/sh -c /Users/buildslave/jenkins/workspace/lldb-cmake-standalone/lldb-xcode-build/unittests/Core/lldb.build/Release/LLDBCoreTests.build/Script-CF91FBDB11C64C1682E4CF7D.sh /usr/local/Cellar/cmake/3.17.2/bin/cmake -E make_directory /Users/buildslave/jenkins/workspace/lldb-cmake-standalone/lldb-xcode-build/unittests/Core/Release/Inputs

Hide Details

=== BUILD TARGET LLDBFormatterTests OF PROJECT lldb WITH CONFIGURATION Release ===

Hide Details

Check dependencies

Hide Details

Write auxiliary files write-file /Users/buildslave/jenkins/workspace/lldb-cmake-standalone/lldb-xcode-build/unittests/DataFormatter/lldb.build/Release/LLDBFormatterTests.build/Script-0A64F197D0DD43CE8523C331.sh chmod 0755 /Users/buildslave/jenkins/workspace/lldb-cmake-standalone/lldb-xcode-build/unittests/DataFormatter/lldb.build/Release/LLDBFormatterTests.build/Script-0A64F197D0DD43CE8523C331.sh

Hide Details

PhaseScriptExecution CMake\ PostBuild\ Rules /Users/buildslave/jenkins/workspace/lldb-cmake-standalone/lldb-xcode-build/unittests/DataFormatter/lldb.build/Release/LLDBFormatterTests.build/Script-0A64F197D0DD43CE8523C331.sh cd /Users/buildslave/jenkins/workspace/lldb-cmake-standalone/llvm-project/lldb /bin/sh -c /Users/buildslave/jenkins/workspace/lldb-cmake-standalone/lldb-xcode-build/unittests/DataFormatter/lldb.build/Release/LLDBFormatterTests.build/Script-0A64F197D0DD43CE8523C331.sh /usr/local/Cellar/cmake/3.17.2/bin/cmake -E make_directory /Users/buildslave/jenkins/workspace/lldb-cmake-standalone/lldb-xcode-build/unittests/DataFormatter/Release/Inputs

Hide Details

=== BUILD TARGET EditlineTests OF PROJECT lldb WITH CONFIGURATION Release ===

Hide Details

Check dependencies

Hide Details

Write auxiliary files write-file /Users/buildslave/jenkins/workspace/lldb-cmake-standalone/lldb-xcode-build/unittests/Editline/lldb.build/Release/EditlineTests.build/Script-E26602A07D2F4D4DBFA94BE5.sh chmod 0755 /Users/buildslave/jenkins/workspace/lldb-cmake-standalone/lldb-xcode-build/unittests/Editline/lldb.build/Release/EditlineTests.build/Script-E26602A07D2F4D4DBFA94BE5.sh

Hide Details

PhaseScriptExecution CMake\ PostBuild\ Rules /Users/buildslave/jenkins/workspace/lldb-cmake-standalone/lldb-xcode-build/unittests/Editline/lldb.build/Release/EditlineTests.build/Script-E26602A07D2F4D4DBFA94BE5.sh cd /Users/buildslave/jenkins/workspace/lldb-cmake-standalone/llvm-project/lldb /bin/sh -c /Users/buildslave/jenkins/workspace/lldb-cmake-standalone/lldb-xcode-build/unittests/Editline/lldb.build/Release/EditlineTests.build/Script-E26602A07D2F4D4DBFA94BE5.sh /usr/local/Cellar/cmake/3.17.2/bin/cmake -E make_directory /Users/buildslave/jenkins/workspace/lldb-cmake-standalone/lldb-xcode-build/unittests/Editline/Release/Inputs

Hide Details

=== BUILD TARGET lldbSymbolHelpers OF PROJECT lldb WITH CONFIGURATION Release ===

Hide Details

Check dependencies

Hide Details

=== BUILD TARGET ExpressionTests OF PROJECT lldb WITH CONFIGURATION Release ===

Hide Details

Check dependencies

Hide Details

Write auxiliary files write-file /Users/buildslave/jenkins/workspace/lldb-cmake-standalone/lldb-xcode-build/unittests/Expression/lldb.build/Release/ExpressionTests.build/Script-E0456FB20C244190B5C51183.sh chmod 0755 /Users/buildslave/jenkins/workspace/lldb-cmake-standalone/lldb-xcode-build/unittests/Expression/lldb.build/Release/ExpressionTests.build/Script-E0456FB20C244190B5C51183.sh

Hide Details

PhaseScriptExecution CMake\ PostBuild\ Rules /Users/buildslave/jenkins/workspace/lldb-cmake-standalone/lldb-xcode-build/unittests/Expression/lldb.build/Release/ExpressionTests.build/Script-E0456FB20C244190B5C51183.sh cd /Users/buildslave/jenkins/workspace/lldb-cmake-standalone/llvm-project/lldb /bin/sh -c /Users/buildslave/jenkins/workspace/lldb-cmake-standalone/lldb-xcode-build/unittests/Expression/lldb.build/Release/ExpressionTests.build/Script-E0456FB20C244190B5C51183.sh /usr/local/Cellar/cmake/3.17.2/bin/cmake -E make_directory /Users/buildslave/jenkins/workspace/lldb-cmake-standalone/lldb-xcode-build/unittests/Expression/Release/Inputs

Hide Details

=== BUILD TARGET HostTests OF PROJECT lldb WITH CONFIGURATION Release ===

Hide Details

Check dependencies

Hide Details

Write auxiliary files write-file /Users/buildslave/jenkins/workspace/lldb-cmake-standalone/lldb-xcode-build/unittests/Host/lldb.build/Release/HostTests.build/Script-00F35730AFF6465591BCE533.sh chmod 0755 /Users/buildslave/jenkins/workspace/lldb-cmake-standalone/lldb-xcode-build/unittests/Host/lldb.build/Release/HostTests.build/Script-00F35730AFF6465591BCE533.sh

Hide Details

PhaseScriptExecution CMake\ PostBuild\ Rules /Users/buildslave/jenkins/workspace/lldb-cmake-standalone/lldb-xcode-build/unittests/Host/lldb.build/Release/HostTests.build/Script-00F35730AFF6465591BCE533.sh cd /Users/buildslave/jenkins/workspace/lldb-cmake-standalone/llvm-project/lldb /bin/sh -c /Users/buildslave/jenkins/workspace/lldb-cmake-standalone/lldb-xcode-build/unittests/Host/lldb.build/Release/HostTests.build/Script-00F35730AFF6465591BCE533.sh /usr/local/Cellar/cmake/3.17.2/bin/cmake -E make_directory /Users/buildslave/jenkins/workspace/lldb-cmake-standalone/lldb-xcode-build/unittests/Host/Release/Inputs

Hide Details

=== BUILD TARGET InterpreterTests OF PROJECT lldb WITH CONFIGURATION Release ===

Hide Details

Check dependencies

Hide Details

Write auxiliary files write-file /Users/buildslave/jenkins/workspace/lldb-cmake-standalone/lldb-xcode-build/unittests/Interpreter/lldb.build/Release/InterpreterTests.build/Script-3D046E0D1C2C4391ADAA6582.sh chmod 0755 /Users/buildslave/jenkins/workspace/lldb-cmake-standalone/lldb-xcode-build/unittests/Interpreter/lldb.build/Release/InterpreterTests.build/Script-3D046E0D1C2C4391ADAA6582.sh

Hide Details

PhaseScriptExecution CMake\ PostBuild\ Rules /Users/buildslave/jenkins/workspace/lldb-cmake-standalone/lldb-xcode-build/unittests/Interpreter/lldb.build/Release/InterpreterTests.build/Script-3D046E0D1C2C4391ADAA6582.sh cd /Users/buildslave/jenkins/workspace/lldb-cmake-standalone/llvm-project/lldb /bin/sh -c /Users/buildslave/jenkins/workspace/lldb-cmake-standalone/lldb-xcode-build/unittests/Interpreter/lldb.build/Release/InterpreterTests.build/Script-3D046E0D1C2C4391ADAA6582.sh /usr/local/Cellar/cmake/3.17.2/bin/cmake -E make_directory /Users/buildslave/jenkins/workspace/lldb-cmake-standalone/lldb-xcode-build/unittests/Interpreter/Release/Inputs

Hide Details

=== BUILD TARGET LanguageCPlusPlusTests OF PROJECT lldb WITH CONFIGURATION Release ===

Hide Details

Check dependencies

Hide Details

Write auxiliary files write-file /Users/buildslave/jenkins/workspace/lldb-cmake-standalone/lldb-xcode-build/unittests/Language/CPlusPlus/lldb.build/Release/LanguageCPlusPlusTests.build/Script-39CC86E4EBAE4F01BD4D2B35.sh chmod 0755 /Users/buildslave/jenkins/workspace/lldb-cmake-standalone/lldb-xcode-build/unittests/Language/CPlusPlus/lldb.build/Release/LanguageCPlusPlusTests.build/Script-39CC86E4EBAE4F01BD4D2B35.sh

Hide Details

PhaseScriptExecution CMake\ PostBuild\ Rules /Users/buildslave/jenkins/workspace/lldb-cmake-standalone/lldb-xcode-build/unittests/Language/CPlusPlus/lldb.build/Release/LanguageCPlusPlusTests.build/Script-39CC86E4EBAE4F01BD4D2B35.sh cd /Users/buildslave/jenkins/workspace/lldb-cmake-standalone/llvm-project/lldb /bin/sh -c /Users/buildslave/jenkins/workspace/lldb-cmake-standalone/lldb-xcode-build/unittests/Language/CPlusPlus/lldb.build/Release/LanguageCPlusPlusTests.build/Script-39CC86E4EBAE4F01BD4D2B35.sh /usr/local/Cellar/cmake/3.17.2/bin/cmake -E make_directory /Users/buildslave/jenkins/workspace/lldb-cmake-standalone/lldb-xcode-build/unittests/Language/CPlusPlus/Release/Inputs

Hide Details

=== BUILD TARGET LanguageCLanguagesTests OF PROJECT lldb WITH CONFIGURATION Release ===

Hide Details

Check dependencies

Hide Details

Write auxiliary files write-file /Users/buildslave/jenkins/workspace/lldb-cmake-standalone/lldb-xcode-build/unittests/Language/CLanguages/lldb.build/Release/LanguageCLanguagesTests.build/Script-967A39F002BB4DA0A8C44BF2.sh chmod 0755 /Users/buildslave/jenkins/workspace/lldb-cmake-standalone/lldb-xcode-build/unittests/Language/CLanguages/lldb.build/Release/LanguageCLanguagesTests.build/Script-967A39F002BB4DA0A8C44BF2.sh

Hide Details

PhaseScriptExecution CMake\ PostBuild\ Rules /Users/buildslave/jenkins/workspace/lldb-cmake-standalone/lldb-xcode-build/unittests/Language/CLanguages/lldb.build/Release/LanguageCLanguagesTests.build/Script-967A39F002BB4DA0A8C44BF2.sh cd /Users/buildslave/jenkins/workspace/lldb-cmake-standalone/llvm-project/lldb /bin/sh -c /Users/buildslave/jenkins/workspace/lldb-cmake-standalone/lldb-xcode-build/unittests/Language/CLanguages/lldb.build/Release/LanguageCLanguagesTests.build/Script-967A39F002BB4DA0A8C44BF2.sh /usr/local/Cellar/cmake/3.17.2/bin/cmake -E make_directory /Users/buildslave/jenkins/workspace/lldb-cmake-standalone/lldb-xcode-build/unittests/Language/CLanguages/Release/Inputs

Hide Details

=== BUILD TARGET HighlighterTests OF PROJECT lldb WITH CONFIGURATION Release ===

Hide Details

Check dependencies

Hide Details

Write auxiliary files write-file /Users/buildslave/jenkins/workspace/lldb-cmake-standalone/lldb-xcode-build/unittests/Language/Highlighting/lldb.build/Release/HighlighterTests.build/Script-0E0524C9DAB641288F4A5170.sh chmod 0755 /Users/buildslave/jenkins/workspace/lldb-cmake-standalone/lldb-xcode-build/unittests/Language/Highlighting/lldb.build/Release/HighlighterTests.build/Script-0E0524C9DAB641288F4A5170.sh

Hide Details

PhaseScriptExecution CMake\ PostBuild\ Rules /Users/buildslave/jenkins/workspace/lldb-cmake-standalone/lldb-xcode-build/unittests/Language/Highlighting/lldb.build/Release/HighlighterTests.build/Script-0E0524C9DAB641288F4A5170.sh cd /Users/buildslave/jenkins/workspace/lldb-cmake-standalone/llvm-project/lldb /bin/sh -c /Users/buildslave/jenkins/workspace/lldb-cmake-standalone/lldb-xcode-build/unittests/Language/Highlighting/lldb.build/Release/HighlighterTests.build/Script-0E0524C9DAB641288F4A5170.sh /usr/local/Cellar/cmake/3.17.2/bin/cmake -E make_directory /Users/buildslave/jenkins/workspace/lldb-cmake-standalone/lldb-xcode-build/unittests/Language/Highlighting/Release/Inputs

Hide Details

=== BUILD TARGET ObjectFileBreakpadTests OF PROJECT lldb WITH CONFIGURATION Release ===

Hide Details

Check dependencies

Hide Details

Write auxiliary files write-file /Users/buildslave/jenkins/workspace/lldb-cmake-standalone/lldb-xcode-build/unittests/ObjectFile/Breakpad/lldb.build/Release/ObjectFileBreakpadTests.build/Script-460768BDEEBF4F34883013A7.sh chmod 0755 /Users/buildslave/jenkins/workspace/lldb-cmake-standalone/lldb-xcode-build/unittests/ObjectFile/Breakpad/lldb.build/Release/ObjectFileBreakpadTests.build/Script-460768BDEEBF4F34883013A7.sh

Hide Details

PhaseScriptExecution CMake\ PostBuild\ Rules /Users/buildslave/jenkins/workspace/lldb-cmake-standalone/lldb-xcode-build/unittests/ObjectFile/Breakpad/lldb.build/Release/ObjectFileBreakpadTests.build/Script-460768BDEEBF4F34883013A7.sh cd /Users/buildslave/jenkins/workspace/lldb-cmake-standalone/llvm-project/lldb /bin/sh -c /Users/buildslave/jenkins/workspace/lldb-cmake-standalone/lldb-xcode-build/unittests/ObjectFile/Breakpad/lldb.build/Release/ObjectFileBreakpadTests.build/Script-460768BDEEBF4F34883013A7.sh /usr/local/Cellar/cmake/3.17.2/bin/cmake -E make_directory /Users/buildslave/jenkins/workspace/lldb-cmake-standalone/lldb-xcode-build/unittests/ObjectFile/Breakpad/Release/Inputs

Hide Details

=== BUILD TARGET ObjectFileELFTests OF PROJECT lldb WITH CONFIGURATION Release ===

Hide Details

Check dependencies

Hide Details

Write auxiliary files write-file /Users/buildslave/jenkins/workspace/lldb-cmake-standalone/lldb-xcode-build/unittests/ObjectFile/ELF/lldb.build/Release/ObjectFileELFTests.build/Script-795AA4F9BB8F4718BDA19D4F.sh chmod 0755 /Users/buildslave/jenkins/workspace/lldb-cmake-standalone/lldb-xcode-build/unittests/ObjectFile/ELF/lldb.build/Release/ObjectFileELFTests.build/Script-795AA4F9BB8F4718BDA19D4F.sh

Hide Details

PhaseScriptExecution CMake\ PostBuild\ Rules /Users/buildslave/jenkins/workspace/lldb-cmake-standalone/lldb-xcode-build/unittests/ObjectFile/ELF/lldb.build/Release/ObjectFileELFTests.build/Script-795AA4F9BB8F4718BDA19D4F.sh cd /Users/buildslave/jenkins/workspace/lldb-cmake-standalone/llvm-project/lldb /bin/sh -c /Users/buildslave/jenkins/workspace/lldb-cmake-standalone/lldb-xcode-build/unittests/ObjectFile/ELF/lldb.build/Release/ObjectFileELFTests.build/Script-795AA4F9BB8F4718BDA19D4F.sh /usr/local/Cellar/cmake/3.17.2/bin/cmake -E make_directory /Users/buildslave/jenkins/workspace/lldb-cmake-standalone/lldb-xcode-build/unittests/ObjectFile/ELF/Release/Inputs echo "Copying early-section-headers.so to binary directory." Copying early-section-headers.so to binary directory. /usr/local/Cellar/cmake/3.17.2/bin/cmake -E copy /Users/buildslave/jenkins/workspace/lldb-cmake-standalone/llvm-project/lldb/unittests/ObjectFile/ELF/Inputs/early-section-headers.so /Users/buildslave/jenkins/workspace/lldb-cmake-standalone/lldb-xcode-build/unittests/ObjectFile/ELF/Release/Inputs

Hide Details

=== BUILD TARGET ObjectFileMachOTests OF PROJECT lldb WITH CONFIGURATION Release ===

Hide Details

Check dependencies

Hide Details

Write auxiliary files write-file /Users/buildslave/jenkins/workspace/lldb-cmake-standalone/lldb-xcode-build/unittests/ObjectFile/MachO/lldb.build/Release/ObjectFileMachOTests.build/Script-1187BCCA87214FDBA6F45F74.sh chmod 0755 /Users/buildslave/jenkins/workspace/lldb-cmake-standalone/lldb-xcode-build/unittests/ObjectFile/MachO/lldb.build/Release/ObjectFileMachOTests.build/Script-1187BCCA87214FDBA6F45F74.sh

Hide Details

PhaseScriptExecution CMake\ PostBuild\ Rules /Users/buildslave/jenkins/workspace/lldb-cmake-standalone/lldb-xcode-build/unittests/ObjectFile/MachO/lldb.build/Release/ObjectFileMachOTests.build/Script-1187BCCA87214FDBA6F45F74.sh cd /Users/buildslave/jenkins/workspace/lldb-cmake-standalone/llvm-project/lldb /bin/sh -c /Users/buildslave/jenkins/workspace/lldb-cmake-standalone/lldb-xcode-build/unittests/ObjectFile/MachO/lldb.build/Release/ObjectFileMachOTests.build/Script-1187BCCA87214FDBA6F45F74.sh /usr/local/Cellar/cmake/3.17.2/bin/cmake -E make_directory /Users/buildslave/jenkins/workspace/lldb-cmake-standalone/lldb-xcode-build/unittests/ObjectFile/MachO/Release/Inputs

Hide Details

=== BUILD TARGET ObjectFilePECOFFTests OF PROJECT lldb WITH CONFIGURATION Release ===

Hide Details

Check dependencies

Hide Details

Write auxiliary files write-file /Users/buildslave/jenkins/workspace/lldb-cmake-standalone/lldb-xcode-build/unittests/ObjectFile/PECOFF/lldb.build/Release/ObjectFilePECOFFTests.build/Script-85FF3FB0063E46AFAD8C0E6A.sh chmod 0755 /Users/buildslave/jenkins/workspace/lldb-cmake-standalone/lldb-xcode-build/unittests/ObjectFile/PECOFF/lldb.build/Release/ObjectFilePECOFFTests.build/Script-85FF3FB0063E46AFAD8C0E6A.sh

Hide Details

PhaseScriptExecution CMake\ PostBuild\ Rules /Users/buildslave/jenkins/workspace/lldb-cmake-standalone/lldb-xcode-build/unittests/ObjectFile/PECOFF/lldb.build/Release/ObjectFilePECOFFTests.build/Script-85FF3FB0063E46AFAD8C0E6A.sh cd /Users/buildslave/jenkins/workspace/lldb-cmake-standalone/llvm-project/lldb /bin/sh -c /Users/buildslave/jenkins/workspace/lldb-cmake-standalone/lldb-xcode-build/unittests/ObjectFile/PECOFF/lldb.build/Release/ObjectFilePECOFFTests.build/Script-85FF3FB0063E46AFAD8C0E6A.sh /usr/local/Cellar/cmake/3.17.2/bin/cmake -E make_directory /Users/buildslave/jenkins/workspace/lldb-cmake-standalone/lldb-xcode-build/unittests/ObjectFile/PECOFF/Release/Inputs

Hide Details

=== BUILD TARGET LLDBPlatformTests OF PROJECT lldb WITH CONFIGURATION Release ===

Hide Details

Check dependencies

Hide Details

Write auxiliary files write-file /Users/buildslave/jenkins/workspace/lldb-cmake-standalone/lldb-xcode-build/unittests/Platform/lldb.build/Release/LLDBPlatformTests.build/Script-5F3520E8E27148568948D722.sh chmod 0755 /Users/buildslave/jenkins/workspace/lldb-cmake-standalone/lldb-xcode-build/unittests/Platform/lldb.build/Release/LLDBPlatformTests.build/Script-5F3520E8E27148568948D722.sh

Hide Details

PhaseScriptExecution CMake\ PostBuild\ Rules /Users/buildslave/jenkins/workspace/lldb-cmake-standalone/lldb-xcode-build/unittests/Platform/lldb.build/Release/LLDBPlatformTests.build/Script-5F3520E8E27148568948D722.sh cd /Users/buildslave/jenkins/workspace/lldb-cmake-standalone/llvm-project/lldb /bin/sh -c /Users/buildslave/jenkins/workspace/lldb-cmake-standalone/lldb-xcode-build/unittests/Platform/lldb.build/Release/LLDBPlatformTests.build/Script-5F3520E8E27148568948D722.sh /usr/local/Cellar/cmake/3.17.2/bin/cmake -E make_directory /Users/buildslave/jenkins/workspace/lldb-cmake-standalone/lldb-xcode-build/unittests/Platform/Release/Inputs

Hide Details

=== BUILD TARGET AdbClientTests OF PROJECT lldb WITH CONFIGURATION Release ===

Hide Details

Check dependencies

Hide Details

Write auxiliary files write-file /Users/buildslave/jenkins/workspace/lldb-cmake-standalone/lldb-xcode-build/unittests/Platform/Android/lldb.build/Release/AdbClientTests.build/Script-8C6F5555B300414980CBCC50.sh chmod 0755 /Users/buildslave/jenkins/workspace/lldb-cmake-standalone/lldb-xcode-build/unittests/Platform/Android/lldb.build/Release/AdbClientTests.build/Script-8C6F5555B300414980CBCC50.sh

Hide Details

PhaseScriptExecution CMake\ PostBuild\ Rules /Users/buildslave/jenkins/workspace/lldb-cmake-standalone/lldb-xcode-build/unittests/Platform/Android/lldb.build/Release/AdbClientTests.build/Script-8C6F5555B300414980CBCC50.sh cd /Users/buildslave/jenkins/workspace/lldb-cmake-standalone/llvm-project/lldb /bin/sh -c /Users/buildslave/jenkins/workspace/lldb-cmake-standalone/lldb-xcode-build/unittests/Platform/Android/lldb.build/Release/AdbClientTests.build/Script-8C6F5555B300414980CBCC50.sh /usr/local/Cellar/cmake/3.17.2/bin/cmake -E make_directory /Users/buildslave/jenkins/workspace/lldb-cmake-standalone/lldb-xcode-build/unittests/Platform/Android/Release/Inputs

Hide Details

=== BUILD TARGET ProcessEventDataTests OF PROJECT lldb WITH CONFIGURATION Release ===

Hide Details

Check dependencies

Hide Details

Write auxiliary files write-file /Users/buildslave/jenkins/workspace/lldb-cmake-standalone/lldb-xcode-build/unittests/Process/lldb.build/Release/ProcessEventDataTests.build/Script-937422367BB249B68771639C.sh chmod 0755 /Users/buildslave/jenkins/workspace/lldb-cmake-standalone/lldb-xcode-build/unittests/Process/lldb.build/Release/ProcessEventDataTests.build/Script-937422367BB249B68771639C.sh

Hide Details

PhaseScriptExecution CMake\ PostBuild\ Rules /Users/buildslave/jenkins/workspace/lldb-cmake-standalone/lldb-xcode-build/unittests/Process/lldb.build/Release/ProcessEventDataTests.build/Script-937422367BB249B68771639C.sh cd /Users/buildslave/jenkins/workspace/lldb-cmake-standalone/llvm-project/lldb /bin/sh -c /Users/buildslave/jenkins/workspace/lldb-cmake-standalone/lldb-xcode-build/unittests/Process/lldb.build/Release/ProcessEventDataTests.build/Script-937422367BB249B68771639C.sh /usr/local/Cellar/cmake/3.17.2/bin/cmake -E make_directory /Users/buildslave/jenkins/workspace/lldb-cmake-standalone/lldb-xcode-build/unittests/Process/Release/Inputs

Hide Details

=== BUILD TARGET ProcessGdbRemoteTests OF PROJECT lldb WITH CONFIGURATION Release ===

Hide Details

Check dependencies

Hide Details

Write auxiliary files write-file /Users/buildslave/jenkins/workspace/lldb-cmake-standalone/lldb-xcode-build/unittests/Process/gdb-remote/lldb.build/Release/ProcessGdbRemoteTests.build/Script-77584107510C4BDBAA0051AB.sh chmod 0755 /Users/buildslave/jenkins/workspace/lldb-cmake-standalone/lldb-xcode-build/unittests/Process/gdb-remote/lldb.build/Release/ProcessGdbRemoteTests.build/Script-77584107510C4BDBAA0051AB.sh

Hide Details

PhaseScriptExecution CMake\ PostBuild\ Rules /Users/buildslave/jenkins/workspace/lldb-cmake-standalone/lldb-xcode-build/unittests/Process/gdb-remote/lldb.build/Release/ProcessGdbRemoteTests.build/Script-77584107510C4BDBAA0051AB.sh cd /Users/buildslave/jenkins/workspace/lldb-cmake-standalone/llvm-project/lldb /bin/sh -c /Users/buildslave/jenkins/workspace/lldb-cmake-standalone/lldb-xcode-build/unittests/Process/gdb-remote/lldb.build/Release/ProcessGdbRemoteTests.build/Script-77584107510C4BDBAA0051AB.sh /usr/local/Cellar/cmake/3.17.2/bin/cmake -E make_directory /Users/buildslave/jenkins/workspace/lldb-cmake-standalone/lldb-xcode-build/unittests/Process/gdb-remote/Release/Inputs

Hide Details

=== BUILD TARGET ProcessUtilityTests OF PROJECT lldb WITH CONFIGURATION Release ===

Hide Details

Check dependencies

Hide Details

Write auxiliary files write-file /Users/buildslave/jenkins/workspace/lldb-cmake-standalone/lldb-xcode-build/unittests/Process/Utility/lldb.build/Release/ProcessUtilityTests.build/Script-ECC522A2EA604D799BB16928.sh chmod 0755 /Users/buildslave/jenkins/workspace/lldb-cmake-standalone/lldb-xcode-build/unittests/Process/Utility/lldb.build/Release/ProcessUtilityTests.build/Script-ECC522A2EA604D799BB16928.sh

Hide Details

PhaseScriptExecution CMake\ PostBuild\ Rules /Users/buildslave/jenkins/workspace/lldb-cmake-standalone/lldb-xcode-build/unittests/Process/Utility/lldb.build/Release/ProcessUtilityTests.build/Script-ECC522A2EA604D799BB16928.sh cd /Users/buildslave/jenkins/workspace/lldb-cmake-standalone/llvm-project/lldb /bin/sh -c /Users/buildslave/jenkins/workspace/lldb-cmake-standalone/lldb-xcode-build/unittests/Process/Utility/lldb.build/Release/ProcessUtilityTests.build/Script-ECC522A2EA604D799BB16928.sh /usr/local/Cellar/cmake/3.17.2/bin/cmake -E make_directory /Users/buildslave/jenkins/workspace/lldb-cmake-standalone/lldb-xcode-build/unittests/Process/Utility/Release/Inputs

Hide Details

=== BUILD TARGET LLDBMinidumpTests OF PROJECT lldb WITH CONFIGURATION Release ===

Hide Details

Check dependencies

Hide Details

Write auxiliary files write-file /Users/buildslave/jenkins/workspace/lldb-cmake-standalone/lldb-xcode-build/unittests/Process/minidump/lldb.build/Release/LLDBMinidumpTests.build/Script-36C503C4ADBC4DCFBF16F3C3.sh chmod 0755 /Users/buildslave/jenkins/workspace/lldb-cmake-standalone/lldb-xcode-build/unittests/Process/minidump/lldb.build/Release/LLDBMinidumpTests.build/Script-36C503C4ADBC4DCFBF16F3C3.sh

Hide Details

PhaseScriptExecution CMake\ PostBuild\ Rules /Users/buildslave/jenkins/workspace/lldb-cmake-standalone/lldb-xcode-build/unittests/Process/minidump/lldb.build/Release/LLDBMinidumpTests.build/Script-36C503C4ADBC4DCFBF16F3C3.sh cd /Users/buildslave/jenkins/workspace/lldb-cmake-standalone/llvm-project/lldb /bin/sh -c /Users/buildslave/jenkins/workspace/lldb-cmake-standalone/lldb-xcode-build/unittests/Process/minidump/lldb.build/Release/LLDBMinidumpTests.build/Script-36C503C4ADBC4DCFBF16F3C3.sh /usr/local/Cellar/cmake/3.17.2/bin/cmake -E make_directory /Users/buildslave/jenkins/workspace/lldb-cmake-standalone/lldb-xcode-build/unittests/Process/minidump/Release/Inputs echo "Copying fizzbuzz_no_heap.dmp to binary directory." Copying fizzbuzz_no_heap.dmp to binary directory. /usr/local/Cellar/cmake/3.17.2/bin/cmake -E copy /Users/buildslave/jenkins/workspace/lldb-cmake-standalone/llvm-project/lldb/unittests/Process/minidump/Inputs/fizzbuzz_no_heap.dmp /Users/buildslave/jenkins/workspace/lldb-cmake-standalone/lldb-xcode-build/unittests/Process/minidump/Release/Inputs echo "Copying fizzbuzz_wow64.dmp to binary directory." Copying fizzbuzz_wow64.dmp to binary directory. /usr/local/Cellar/cmake/3.17.2/bin/cmake -E copy /Users/buildslave/jenkins/workspace/lldb-cmake-standalone/llvm-project/lldb/unittests/Process/minidump/Inputs/fizzbuzz_wow64.dmp /Users/buildslave/jenkins/workspace/lldb-cmake-standalone/lldb-xcode-build/unittests/Process/minidump/Release/Inputs echo "Copying linux-x86_64.dmp to binary directory." Copying linux-x86_64.dmp to binary directory. /usr/local/Cellar/cmake/3.17.2/bin/cmake -E copy /Users/buildslave/jenkins/workspace/lldb-cmake-standalone/llvm-project/lldb/unittests/Process/minidump/Inputs/linux-x86_64.dmp /Users/buildslave/jenkins/workspace/lldb-cmake-standalone/lldb-xcode-build/unittests/Process/minidump/Release/Inputs echo "Copying regions-memlist64.dmp to binary directory." Copying regions-memlist64.dmp to binary directory. /usr/local/Cellar/cmake/3.17.2/bin/cmake -E copy /Users/buildslave/jenkins/workspace/lldb-cmake-standalone/llvm-project/lldb/unittests/Process/minidump/Inputs/regions-memlist64.dmp /Users/buildslave/jenkins/workspace/lldb-cmake-standalone/lldb-xcode-build/unittests/Process/minidump/Release/Inputs

Hide Details

=== BUILD TARGET ScriptInterpreterPythonTests OF PROJECT lldb WITH CONFIGURATION Release ===

Hide Details

Check dependencies

Hide Details

Write auxiliary files write-file /Users/buildslave/jenkins/workspace/lldb-cmake-standalone/lldb-xcode-build/unittests/ScriptInterpreter/Python/lldb.build/Release/ScriptInterpreterPythonTests.build/Script-4349D32675BB4BB28FC5D8E9.sh chmod 0755 /Users/buildslave/jenkins/workspace/lldb-cmake-standalone/lldb-xcode-build/unittests/ScriptInterpreter/Python/lldb.build/Release/ScriptInterpreterPythonTests.build/Script-4349D32675BB4BB28FC5D8E9.sh

Hide Details

PhaseScriptExecution CMake\ PostBuild\ Rules /Users/buildslave/jenkins/workspace/lldb-cmake-standalone/lldb-xcode-build/unittests/ScriptInterpreter/Python/lldb.build/Release/ScriptInterpreterPythonTests.build/Script-4349D32675BB4BB28FC5D8E9.sh cd /Users/buildslave/jenkins/workspace/lldb-cmake-standalone/llvm-project/lldb /bin/sh -c /Users/buildslave/jenkins/workspace/lldb-cmake-standalone/lldb-xcode-build/unittests/ScriptInterpreter/Python/lldb.build/Release/ScriptInterpreterPythonTests.build/Script-4349D32675BB4BB28FC5D8E9.sh /usr/local/Cellar/cmake/3.17.2/bin/cmake -E make_directory /Users/buildslave/jenkins/workspace/lldb-cmake-standalone/lldb-xcode-build/unittests/ScriptInterpreter/Python/Release/Inputs

Hide Details

=== BUILD TARGET SignalsTests OF PROJECT lldb WITH CONFIGURATION Release ===

Hide Details

Check dependencies

Hide Details

Write auxiliary files write-file /Users/buildslave/jenkins/workspace/lldb-cmake-standalone/lldb-xcode-build/unittests/Signals/lldb.build/Release/SignalsTests.build/Script-4E963545901D44DC82357A0B.sh chmod 0755 /Users/buildslave/jenkins/workspace/lldb-cmake-standalone/lldb-xcode-build/unittests/Signals/lldb.build/Release/SignalsTests.build/Script-4E963545901D44DC82357A0B.sh

Hide Details

PhaseScriptExecution CMake\ PostBuild\ Rules /Users/buildslave/jenkins/workspace/lldb-cmake-standalone/lldb-xcode-build/unittests/Signals/lldb.build/Release/SignalsTests.build/Script-4E963545901D44DC82357A0B.sh cd /Users/buildslave/jenkins/workspace/lldb-cmake-standalone/llvm-project/lldb /bin/sh -c /Users/buildslave/jenkins/workspace/lldb-cmake-standalone/lldb-xcode-build/unittests/Signals/lldb.build/Release/SignalsTests.build/Script-4E963545901D44DC82357A0B.sh /usr/local/Cellar/cmake/3.17.2/bin/cmake -E make_directory /Users/buildslave/jenkins/workspace/lldb-cmake-standalone/lldb-xcode-build/unittests/Signals/Release/Inputs

Hide Details

=== BUILD TARGET SymbolTests OF PROJECT lldb WITH CONFIGURATION Release ===

Hide Details

Check dependencies

Hide Details

Write auxiliary files write-file /Users/buildslave/jenkins/workspace/lldb-cmake-standalone/lldb-xcode-build/unittests/Symbol/lldb.build/Release/SymbolTests.build/Script-0D26D1D4918C4F8A9EDC6EE7.sh chmod 0755 /Users/buildslave/jenkins/workspace/lldb-cmake-standalone/lldb-xcode-build/unittests/Symbol/lldb.build/Release/SymbolTests.build/Script-0D26D1D4918C4F8A9EDC6EE7.sh

Hide Details

PhaseScriptExecution CMake\ PostBuild\ Rules /Users/buildslave/jenkins/workspace/lldb-cmake-standalone/lldb-xcode-build/unittests/Symbol/lldb.build/Release/SymbolTests.build/Script-0D26D1D4918C4F8A9EDC6EE7.sh cd /Users/buildslave/jenkins/workspace/lldb-cmake-standalone/llvm-project/lldb /bin/sh -c /Users/buildslave/jenkins/workspace/lldb-cmake-standalone/lldb-xcode-build/unittests/Symbol/lldb.build/Release/SymbolTests.build/Script-0D26D1D4918C4F8A9EDC6EE7.sh /usr/local/Cellar/cmake/3.17.2/bin/cmake -E make_directory /Users/buildslave/jenkins/workspace/lldb-cmake-standalone/lldb-xcode-build/unittests/Symbol/Release/Inputs echo "Copying inlined-functions.yaml to binary directory." Copying inlined-functions.yaml to binary directory. /usr/local/Cellar/cmake/3.17.2/bin/cmake -E copy /Users/buildslave/jenkins/workspace/lldb-cmake-standalone/llvm-project/lldb/unittests/Symbol/Inputs/inlined-functions.yaml /Users/buildslave/jenkins/workspace/lldb-cmake-standalone/lldb-xcode-build/unittests/Symbol/Release/Inputs

Hide Details

=== BUILD TARGET SymbolFileDWARFTests OF PROJECT lldb WITH CONFIGURATION Release ===

Hide Details

Check dependencies

Hide Details

Write auxiliary files write-file /Users/buildslave/jenkins/workspace/lldb-cmake-standalone/lldb-xcode-build/unittests/SymbolFile/DWARF/lldb.build/Release/SymbolFileDWARFTests.build/Script-DDD229D0289A421FBDB0769C.sh chmod 0755 /Users/buildslave/jenkins/workspace/lldb-cmake-standalone/lldb-xcode-build/unittests/SymbolFile/DWARF/lldb.build/Release/SymbolFileDWARFTests.build/Script-DDD229D0289A421FBDB0769C.sh

Hide Details

PhaseScriptExecution CMake\ PostBuild\ Rules /Users/buildslave/jenkins/workspace/lldb-cmake-standalone/lldb-xcode-build/unittests/SymbolFile/DWARF/lldb.build/Release/SymbolFileDWARFTests.build/Script-DDD229D0289A421FBDB0769C.sh cd /Users/buildslave/jenkins/workspace/lldb-cmake-standalone/llvm-project/lldb /bin/sh -c /Users/buildslave/jenkins/workspace/lldb-cmake-standalone/lldb-xcode-build/unittests/SymbolFile/DWARF/lldb.build/Release/SymbolFileDWARFTests.build/Script-DDD229D0289A421FBDB0769C.sh /usr/local/Cellar/cmake/3.17.2/bin/cmake -E make_directory /Users/buildslave/jenkins/workspace/lldb-cmake-standalone/lldb-xcode-build/unittests/SymbolFile/DWARF/Release/Inputs echo "Copying test-dwarf.exe to binary directory." Copying test-dwarf.exe to binary directory. /usr/local/Cellar/cmake/3.17.2/bin/cmake -E copy /Users/buildslave/jenkins/workspace/lldb-cmake-standalone/llvm-project/lldb/unittests/SymbolFile/DWARF/Inputs/test-dwarf.exe /Users/buildslave/jenkins/workspace/lldb-cmake-standalone/lldb-xcode-build/unittests/SymbolFile/DWARF/Release/Inputs

Hide Details

=== BUILD TARGET SymbolFileNativePDBTests OF PROJECT lldb WITH CONFIGURATION Release ===

Hide Details

Check dependencies

Hide Details

Write auxiliary files write-file /Users/buildslave/jenkins/workspace/lldb-cmake-standalone/lldb-xcode-build/unittests/SymbolFile/NativePDB/lldb.build/Release/SymbolFileNativePDBTests.build/Script-CA02E9D0D212467B88231384.sh chmod 0755 /Users/buildslave/jenkins/workspace/lldb-cmake-standalone/lldb-xcode-build/unittests/SymbolFile/NativePDB/lldb.build/Release/SymbolFileNativePDBTests.build/Script-CA02E9D0D212467B88231384.sh

Hide Details

PhaseScriptExecution CMake\ PostBuild\ Rules /Users/buildslave/jenkins/workspace/lldb-cmake-standalone/lldb-xcode-build/unittests/SymbolFile/NativePDB/lldb.build/Release/SymbolFileNativePDBTests.build/Script-CA02E9D0D212467B88231384.sh cd /Users/buildslave/jenkins/workspace/lldb-cmake-standalone/llvm-project/lldb /bin/sh -c /Users/buildslave/jenkins/workspace/lldb-cmake-standalone/lldb-xcode-build/unittests/SymbolFile/NativePDB/lldb.build/Release/SymbolFileNativePDBTests.build/Script-CA02E9D0D212467B88231384.sh /usr/local/Cellar/cmake/3.17.2/bin/cmake -E make_directory /Users/buildslave/jenkins/workspace/lldb-cmake-standalone/lldb-xcode-build/unittests/SymbolFile/NativePDB/Release/Inputs

Hide Details

=== BUILD TARGET TargetTests OF PROJECT lldb WITH CONFIGURATION Release ===

Hide Details

Check dependencies

Hide Details

Write auxiliary files write-file /Users/buildslave/jenkins/workspace/lldb-cmake-standalone/lldb-xcode-build/unittests/Target/lldb.build/Release/TargetTests.build/Script-14E5087E7550464BB11E2B88.sh chmod 0755 /Users/buildslave/jenkins/workspace/lldb-cmake-standalone/lldb-xcode-build/unittests/Target/lldb.build/Release/TargetTests.build/Script-14E5087E7550464BB11E2B88.sh

Hide Details

PhaseScriptExecution CMake\ PostBuild\ Rules /Users/buildslave/jenkins/workspace/lldb-cmake-standalone/lldb-xcode-build/unittests/Target/lldb.build/Release/TargetTests.build/Script-14E5087E7550464BB11E2B88.sh cd /Users/buildslave/jenkins/workspace/lldb-cmake-standalone/llvm-project/lldb /bin/sh -c /Users/buildslave/jenkins/workspace/lldb-cmake-standalone/lldb-xcode-build/unittests/Target/lldb.build/Release/TargetTests.build/Script-14E5087E7550464BB11E2B88.sh /usr/local/Cellar/cmake/3.17.2/bin/cmake -E make_directory /Users/buildslave/jenkins/workspace/lldb-cmake-standalone/lldb-xcode-build/unittests/Target/Release/Inputs echo "Copying TestModule.so to binary directory." Copying TestModule.so to binary directory. /usr/local/Cellar/cmake/3.17.2/bin/cmake -E copy /Users/buildslave/jenkins/workspace/lldb-cmake-standalone/llvm-project/lldb/unittests/Target/Inputs/TestModule.so /Users/buildslave/jenkins/workspace/lldb-cmake-standalone/lldb-xcode-build/unittests/Target/Release/Inputs

Hide Details

=== BUILD TARGET environment_check OF PROJECT lldb WITH CONFIGURATION Release ===

Hide Details

Check dependencies

Hide Details

=== BUILD TARGET thread_inferior OF PROJECT lldb WITH CONFIGURATION Release ===

Hide Details

Check dependencies

Hide Details

=== BUILD TARGET LLDBServerTests OF PROJECT lldb WITH CONFIGURATION Release ===

Hide Details

Check dependencies

Hide Details

Write auxiliary files write-file /Users/buildslave/jenkins/workspace/lldb-cmake-standalone/lldb-xcode-build/unittests/tools/lldb-server/tests/lldb.build/Release/LLDBServerTests.build/Script-60A59296D5034CF9AE0298E5.sh chmod 0755 /Users/buildslave/jenkins/workspace/lldb-cmake-standalone/lldb-xcode-build/unittests/tools/lldb-server/tests/lldb.build/Release/LLDBServerTests.build/Script-60A59296D5034CF9AE0298E5.sh

Hide Details

PhaseScriptExecution CMake\ PostBuild\ Rules /Users/buildslave/jenkins/workspace/lldb-cmake-standalone/lldb-xcode-build/unittests/tools/lldb-server/tests/lldb.build/Release/LLDBServerTests.build/Script-60A59296D5034CF9AE0298E5.sh cd /Users/buildslave/jenkins/workspace/lldb-cmake-standalone/llvm-project/lldb /bin/sh -c /Users/buildslave/jenkins/workspace/lldb-cmake-standalone/lldb-xcode-build/unittests/tools/lldb-server/tests/lldb.build/Release/LLDBServerTests.build/Script-60A59296D5034CF9AE0298E5.sh /usr/local/Cellar/cmake/3.17.2/bin/cmake -E make_directory /Users/buildslave/jenkins/workspace/lldb-cmake-standalone/lldb-xcode-build/unittests/tools/lldb-server/tests/Release/Inputs

Hide Details

=== BUILD TARGET UnwindAssemblyx86Tests OF PROJECT lldb WITH CONFIGURATION Release ===

Hide Details

Check dependencies

Hide Details

Write auxiliary files write-file /Users/buildslave/jenkins/workspace/lldb-cmake-standalone/lldb-xcode-build/unittests/UnwindAssembly/x86/lldb.build/Release/UnwindAssemblyx86Tests.build/Script-33D9A7A65B9F4F2FBB61824A.sh chmod 0755 /Users/buildslave/jenkins/workspace/lldb-cmake-standalone/lldb-xcode-build/unittests/UnwindAssembly/x86/lldb.build/Release/UnwindAssemblyx86Tests.build/Script-33D9A7A65B9F4F2FBB61824A.sh

Hide Details

PhaseScriptExecution CMake\ PostBuild\ Rules /Users/buildslave/jenkins/workspace/lldb-cmake-standalone/lldb-xcode-build/unittests/UnwindAssembly/x86/lldb.build/Release/UnwindAssemblyx86Tests.build/Script-33D9A7A65B9F4F2FBB61824A.sh cd /Users/buildslave/jenkins/workspace/lldb-cmake-standalone/llvm-project/lldb /bin/sh -c /Users/buildslave/jenkins/workspace/lldb-cmake-standalone/lldb-xcode-build/unittests/UnwindAssembly/x86/lldb.build/Release/UnwindAssemblyx86Tests.build/Script-33D9A7A65B9F4F2FBB61824A.sh /usr/local/Cellar/cmake/3.17.2/bin/cmake -E make_directory /Users/buildslave/jenkins/workspace/lldb-cmake-standalone/lldb-xcode-build/unittests/UnwindAssembly/x86/Release/Inputs

Hide Details

=== BUILD TARGET UtilityTests OF PROJECT lldb WITH CONFIGURATION Release ===

Hide Details

Check dependencies

Hide Details

Write auxiliary files write-file /Users/buildslave/jenkins/workspace/lldb-cmake-standalone/lldb-xcode-build/unittests/Utility/lldb.build/Release/UtilityTests.build/Script-9A925B461E15412397C82814.sh chmod 0755 /Users/buildslave/jenkins/workspace/lldb-cmake-standalone/lldb-xcode-build/unittests/Utility/lldb.build/Release/UtilityTests.build/Script-9A925B461E15412397C82814.sh

Hide Details

PhaseScriptExecution CMake\ PostBuild\ Rules /Users/buildslave/jenkins/workspace/lldb-cmake-standalone/lldb-xcode-build/unittests/Utility/lldb.build/Release/UtilityTests.build/Script-9A925B461E15412397C82814.sh cd /Users/buildslave/jenkins/workspace/lldb-cmake-standalone/llvm-project/lldb /bin/sh -c /Users/buildslave/jenkins/workspace/lldb-cmake-standalone/lldb-xcode-build/unittests/Utility/lldb.build/Release/UtilityTests.build/Script-9A925B461E15412397C82814.sh /usr/local/Cellar/cmake/3.17.2/bin/cmake -E make_directory /Users/buildslave/jenkins/workspace/lldb-cmake-standalone/lldb-xcode-build/unittests/Utility/Release/Inputs echo "Copying StructuredData-basic.json to binary directory." Copying StructuredData-basic.json to binary directory. /usr/local/Cellar/cmake/3.17.2/bin/cmake -E copy /Users/buildslave/jenkins/workspace/lldb-cmake-standalone/llvm-project/lldb/unittests/Utility/Inputs/StructuredData-basic.json /Users/buildslave/jenkins/workspace/lldb-cmake-standalone/lldb-xcode-build/unittests/Utility/Release/Inputs

Hide Details

=== BUILD TARGET ThreadTests OF PROJECT lldb WITH CONFIGURATION Release ===

Hide Details

Check dependencies

Hide Details

Write auxiliary files write-file /Users/buildslave/jenkins/workspace/lldb-cmake-standalone/lldb-xcode-build/unittests/Thread/lldb.build/Release/ThreadTests.build/Script-6052083FBBAF428FA3DE2356.sh chmod 0755 /Users/buildslave/jenkins/workspace/lldb-cmake-standalone/lldb-xcode-build/unittests/Thread/lldb.build/Release/ThreadTests.build/Script-6052083FBBAF428FA3DE2356.sh

Hide Details

PhaseScriptExecution CMake\ PostBuild\ Rules /Users/buildslave/jenkins/workspace/lldb-cmake-standalone/lldb-xcode-build/unittests/Thread/lldb.build/Release/ThreadTests.build/Script-6052083FBBAF428FA3DE2356.sh cd /Users/buildslave/jenkins/workspace/lldb-cmake-standalone/llvm-project/lldb /bin/sh -c /Users/buildslave/jenkins/workspace/lldb-cmake-standalone/lldb-xcode-build/unittests/Thread/lldb.build/Release/ThreadTests.build/Script-6052083FBBAF428FA3DE2356.sh /usr/local/Cellar/cmake/3.17.2/bin/cmake -E make_directory /Users/buildslave/jenkins/workspace/lldb-cmake-standalone/lldb-xcode-build/unittests/Thread/Release/Inputs

Hide Details

=== BUILD TARGET debugserverTests OF PROJECT lldb WITH CONFIGURATION Release ===

Hide Details

Check dependencies

Hide Details

Write auxiliary files write-file /Users/buildslave/jenkins/workspace/lldb-cmake-standalone/lldb-xcode-build/unittests/debugserver/lldb.build/Release/debugserverTests.build/Script-6587DD6D4A3941408EAA7C51.sh chmod 0755 /Users/buildslave/jenkins/workspace/lldb-cmake-standalone/lldb-xcode-build/unittests/debugserver/lldb.build/Release/debugserverTests.build/Script-6587DD6D4A3941408EAA7C51.sh

Hide Details

PhaseScriptExecution CMake\ PostBuild\ Rules /Users/buildslave/jenkins/workspace/lldb-cmake-standalone/lldb-xcode-build/unittests/debugserver/lldb.build/Release/debugserverTests.build/Script-6587DD6D4A3941408EAA7C51.sh cd /Users/buildslave/jenkins/workspace/lldb-cmake-standalone/llvm-project/lldb /bin/sh -c /Users/buildslave/jenkins/workspace/lldb-cmake-standalone/lldb-xcode-build/unittests/debugserver/lldb.build/Release/debugserverTests.build/Script-6587DD6D4A3941408EAA7C51.sh /usr/local/Cellar/cmake/3.17.2/bin/cmake -E make_directory /Users/buildslave/jenkins/workspace/lldb-cmake-standalone/lldb-xcode-build/unittests/debugserver/Release/Inputs

Hide Details

=== BUILD AGGREGATE TARGET LLDBUnitTests OF PROJECT lldb WITH CONFIGURATION Release ===

Hide Details

Check dependencies

Hide Details

=== BUILD AGGREGATE TARGET lldb-unit-test-deps OF PROJECT lldb WITH CONFIGURATION Release ===

Hide Details

Check dependencies

Hide Details

=== BUILD AGGREGATE TARGET check-lldb OF PROJECT lldb WITH CONFIGURATION Release ===

Hide Details

Check dependencies

Hide Details

Write auxiliary files write-file /Users/buildslave/jenkins/workspace/lldb-cmake-standalone/lldb-xcode-build/test/lldb.build/Release/check-lldb.build/Script-F21818BC9A684CF692D0D237.sh chmod 0755 /Users/buildslave/jenkins/workspace/lldb-cmake-standalone/lldb-xcode-build/test/lldb.build/Release/check-lldb.build/Script-F21818BC9A684CF692D0D237.sh

Hide Details

PhaseScriptExecution CMake\ Rules /Users/buildslave/jenkins/workspace/lldb-cmake-standalone/lldb-xcode-build/test/lldb.build/Release/check-lldb.build/Script-F21818BC9A684CF692D0D237.sh cd /Users/buildslave/jenkins/workspace/lldb-cmake-standalone/llvm-project/lldb /bin/sh -c /Users/buildslave/jenkins/workspace/lldb-cmake-standalone/lldb-xcode-build/test/lldb.build/Release/check-lldb.build/Script-F21818BC9A684CF692D0D237.sh echo "Running lldb lit test suite" Running lldb lit test suite /usr/local/Frameworks/Python.framework/Versions/3.7/bin/python3.7 /Users/buildslave/jenkins/workspace/lldb-cmake-standalone/lldb-xcode-build/Release/bin/llvm-lit --xunit-xml-output=testresults.xunit.xml -v -vv --timeout=600 --param build_mode=Release /Users/buildslave/jenkins/workspace/lldb-cmake-standalone/lldb-xcode-build/test Deleting module cache at /Users/buildslave/jenkins/workspace/lldb-cmake-standalone/lldb-xcode-build/lldb-test-build.noindex/module-cache-lldb/lldb-api. Deleting module cache at /Users/buildslave/jenkins/workspace/lldb-cmake-standalone/lldb-xcode-build/lldb-test-build.noindex/module-cache-clang/lldb-api. -- Testing: 2358 tests, 16 workers -- llvm-lit: /Users/buildslave/jenkins/workspace/lldb-cmake-standalone/llvm-project/lldb/test/Shell/helper/toolchain.py:126: note: using SDKROOT: '/Applications/Xcode.app/Contents/Developer/Platforms/MacOSX.platform/Developer/SDKs/MacOSX10.15.sdk' llvm-lit: /Users/buildslave/jenkins/workspace/lldb-cmake-standalone/llvm-project/llvm/utils/lit/lit/llvm/config.py:436: note: using clang: /Users/buildslave/jenkins/workspace/lldb-cmake-standalone/clang-build/bin/clang PASS: lldb-api :: functionalities/limit-debug-info/TestLimitDebugInfo.py (1 of 2358) PASS: lldb-api :: functionalities/inferior-crashing/TestInferiorCrashingStep.py (2 of 2358) PASS: lldb-api :: functionalities/completion/TestCompletion.py (3 of 2358) PASS: lldb-api :: python_api/target/TestTargetAPI.py (4 of 2358) PASS: lldb-api :: lang/objc/foundation/TestObjCMethods.py (5 of 2358) UNSUPPORTED: lldb-api :: tools/lldb-server/vCont-threads/TestGdbRemote_vContThreads.py (6 of 2358) PASS: lldb-api :: functionalities/load_unload/TestLoadUnload.py (7 of 2358) PASS: lldb-api :: types/TestLongTypes.py (8 of 2358) PASS: lldb-api :: lang/objc/objc-new-syntax/TestObjCNewSyntaxLiteral.py (9 of 2358) PASS: lldb-api :: functionalities/inferior-assert/TestInferiorAssert.py (10 of 2358) PASS: lldb-api :: lang/cpp/namespace/TestNamespaceLookup.py (11 of 2358) PASS: lldb-api :: types/TestLongTypesExpr.py (12 of 2358) PASS: lldb-api :: lang/objc/foundation/TestFoundationDisassembly.py (13 of 2358) PASS: lldb-api :: lang/objc/exceptions/TestObjCExceptions.py (14 of 2358) PASS: lldb-api :: lang/objc/hidden-ivars/TestHiddenIvars.py (15 of 2358) PASS: lldb-api :: tools/lldb-server/TestGdbRemoteThreadsInStopReply.py (16 of 2358) PASS: lldb-api :: lang/objc/objc-new-syntax/TestObjCNewSyntaxArray.py (17 of 2358) PASS: lldb-api :: lang/c/shared_lib/TestSharedLib.py (18 of 2358) PASS: lldb-api :: api/multithreaded/TestMultithreaded.py (19 of 2358) PASS: lldb-api :: types/TestCharTypeExpr.py (20 of 2358) PASS: lldb-api :: commands/target/basic/TestTargetCommand.py (21 of 2358) PASS: lldb-api :: python_api/process/TestProcessAPI.py (22 of 2358) PASS: lldb-api :: types/TestShortType.py (23 of 2358) PASS: lldb-api :: lang/objc/objc-new-syntax/TestObjCNewSyntaxDictionary.py (24 of 2358) PASS: lldb-api :: types/TestIntegerTypeExpr.py (25 of 2358) PASS: lldb-api :: functionalities/breakpoint/breakpoint_conditions/TestBreakpointConditions.py (26 of 2358) PASS: lldb-api :: types/TestCharType.py (27 of 2358) PASS: lldb-api :: types/TestShortTypeExpr.py (28 of 2358) PASS: lldb-api :: lang/objc/real-definition/TestRealDefinition.py (29 of 2358) PASS: lldb-api :: lang/c/anonymous/TestAnonymous.py (30 of 2358) PASS: lldb-api :: tools/lldb-vscode/launch/TestVSCode_launch.py (31 of 2358) PASS: lldb-api :: types/TestIntegerType.py (32 of 2358) PASS: lldb-api :: commands/expression/import-std-module/stack/TestStackFromStdModule.py (33 of 2358) PASS: lldb-api :: functionalities/breakpoint/breakpoint_ignore_count/TestBreakpointIgnoreCount.py (34 of 2358) PASS: lldb-api :: commands/register/register/register_command/TestRegisters.py (35 of 2358) PASS: lldb-api :: functionalities/inferior-crashing/recursive-inferior/TestRecursiveInferior.py (36 of 2358) PASS: lldb-api :: functionalities/inferior-crashing/TestInferiorCrashing.py (37 of 2358) UNSUPPORTED: lldb-api :: functionalities/thread/create_during_step/TestCreateDuringStep.py (38 of 2358) PASS: lldb-api :: lang/cpp/virtual-functions/TestCppVirtualFunctions.py (39 of 2358) PASS: lldb-api :: lang/c/step-target/TestStepTarget.py (40 of 2358) PASS: lldb-api :: functionalities/inline-stepping/TestInlineStepping.py (41 of 2358) PASS: lldb-api :: functionalities/stop-on-sharedlibrary-load/TestStopOnSharedlibraryEvents.py (42 of 2358) PASS: lldb-api :: lang/c/bitfields/TestBitfields.py (43 of 2358) PASS: lldb-api :: commands/expression/test/TestExprs.py (44 of 2358) PASS: lldb-api :: python_api/lldbutil/iter/TestLLDBIterator.py (45 of 2358) PASS: lldb-api :: tools/lldb-server/TestLldbGdbServer.py (46 of 2358) PASS: lldb-api :: python_api/thread/TestThreadAPI.py (47 of 2358) PASS: lldb-api :: commands/expression/import-std-module/queue/TestQueueFromStdModule.py (48 of 2358) PASS: lldb-api :: functionalities/thread/exit_during_step/TestExitDuringStep.py (49 of 2358) PASS: lldb-api :: functionalities/thread/step_until/TestStepUntil.py (50 of 2358) PASS: lldb-api :: functionalities/thread/step_out/TestThreadStepOut.py (51 of 2358) PASS: lldb-api :: lang/objc/foundation/TestObjCMethodsString.py (52 of 2358) PASS: lldb-api :: commands/expression/import-std-module/vector/TestVectorFromStdModule.py (53 of 2358) PASS: lldb-api :: lang/cpp/template/TestTemplateArgs.py (54 of 2358) PASS: lldb-api :: commands/settings/TestSettings.py (55 of 2358) PASS: lldb-api :: commands/expression/char/TestExprsChar.py (56 of 2358) PASS: lldb-api :: lang/c/shared_lib_stripped_symbols/TestSharedLibStrippedSymbols.py (57 of 2358) PASS: lldb-api :: functionalities/data-formatter/compactvectors/TestCompactVectors.py (58 of 2358) PASS: lldb-api :: commands/expression/import-std-module/deque-basic/TestDequeFromStdModule.py (59 of 2358) PASS: lldb-api :: tools/lldb-vscode/evaluate/TestVSCode_evaluate.py (60 of 2358) PASS: lldb-api :: lang/objc/foundation/TestObjCMethodsNSError.py (61 of 2358) PASS: lldb-api :: lang/cpp/namespace_definitions/TestNamespaceDefinitions.py (62 of 2358) PASS: lldb-api :: commands/expression/import-std-module/basic/TestImportStdModule.py (63 of 2358) PASS: lldb-api :: lang/cpp/unicode-literals/TestUnicodeLiterals.py (64 of 2358) PASS: lldb-api :: functionalities/data-formatter/data-formatter-stl/libcxx/vector/TestDataFormatterLibcxxVector.py (65 of 2358) PASS: lldb-api :: functionalities/gdb_remote_client/TestPlatformClient.py (66 of 2358) PASS: lldb-api :: python_api/frame/TestFrames.py (67 of 2358) PASS: lldb-api :: functionalities/data-formatter/data-formatter-stl/libcxx/set/TestDataFormatterLibcxxSet.py (68 of 2358) PASS: lldb-api :: tools/lldb-server/TestGdbRemote_vCont.py (69 of 2358) PASS: lldb-api :: tools/lldb-vscode/module/TestVSCode_module.py (70 of 2358) make: *** [/Users/buildslave/jenkins/workspace/lldb-cmake-standalone/lldb-xcode-build/test/CMakeFiles/check-lldb] Hangup: 1

Hide Details

** BUILD FAILED **

Hide Details

Hide Details

The following build commands failed: PhaseScriptExecution CMake\ Rules /Users/buildslave/jenkins/workspace/lldb-cmake-standalone/lldb-xcode-build/test/lldb.build/Release/check-lldb.build/Script-F21818BC9A684CF692D0D237.sh (1 failure) Command failed: Command '['/usr/bin/env', 'TERM=vt100', '/usr/local/bin/cmake', '--build', '.', '--config', 'Release', '--target', 'check-lldb']' returned non-zero exit status 65. Command: ['/usr/bin/env', 'TERM=vt100', '/usr/local/bin/cmake', '--build', '.', '--config', 'Release', '--target', 'check-lldb'] [Pipeline] } [Pipeline] // timeout [Pipeline] } [Pipeline] // stage [Pipeline] } [Pipeline] // withEnv [Pipeline] } [Pipeline] // node [Pipeline] End of Pipeline ERROR: script returned exit code 1 Finished: FAILURE