Console Output

Started by upstream project "relay-test-suite-verify-machineinstrs" build number 12846
originally caused by:
 Started by upstream project "clang-stage1-RA" build number 32651
 originally caused by:
  Started by an SCM change
  Started by an SCM change
  Started by an SCM change
  Started by an SCM change
  Started by an SCM change
  Started by an SCM change
  Started by an SCM change
  Started by an SCM change
  Started by an SCM change
  Started by an SCM change
  Started by an SCM change
  Started by an SCM change
  Started by an SCM change
  Started by an SCM change
  Started by an SCM change
  Started by an SCM change
  Started by an SCM change
  Started by an SCM change
  Started by an SCM change
  Started by an SCM change
  Started by an SCM change
  Started by an SCM change
  Started by an SCM change
  Started by an SCM change
  Started by an SCM change
  Started by an SCM change
  Started by an SCM change
  Started by an SCM change
  Started by an SCM change
  Started by an SCM change
  Started by an SCM change
  Started by an SCM change
  Started by an SCM change
Obtained zorg/jenkins/jobs/jobs/test-suite-verify-machineinstrs-aarch64-O3 from git https://github.com/llvm/llvm-zorg.git
Resume disabled by user, switching to high-performance, low-durability mode.
[Pipeline] Start of Pipeline
[Pipeline] readTrusted
Obtained zorg/jenkins/common.groovy from git https://github.com/llvm/llvm-zorg.git
[Pipeline] properties
[Pipeline] node
Still waiting to schedule task
Waiting for next available executor on ‘green-dragon-12’
Running on green-dragon-12 in /Users/buildslave/jenkins/workspace/test-suite-verify-machineinstrs-aarch64-O3
[Pipeline] {
[Pipeline] stage
[Pipeline] { (main)
[Pipeline] dir
Running in /Users/buildslave/jenkins/workspace/test-suite-verify-machineinstrs-aarch64-O3/config
[Pipeline] {
[Pipeline] git
The recommended git tool is: git
No credentials specified
Fetching changes from the remote Git repository
 > git rev-parse --resolve-git-dir /Users/buildslave/jenkins/workspace/test-suite-verify-machineinstrs-aarch64-O3/config/.git # timeout=10
 > git config remote.origin.url https://github.com/llvm/llvm-zorg.git # timeout=10
Fetching upstream changes from https://github.com/llvm/llvm-zorg.git
 > git --version # timeout=10
 > git --version # 'git version 2.24.3 (Apple Git-128)'
 > git fetch --tags --force --progress -- https://github.com/llvm/llvm-zorg.git +refs/heads/*:refs/remotes/origin/* # timeout=10
 > git rev-parse refs/remotes/origin/main^{commit} # timeout=10
Checking out Revision b6ec52010f7633779a4245941dce22b5a8b0a17f (refs/remotes/origin/main)
Commit message: "[BOLT] Force clean build for clang-bolt-lto-pgo"
 > git config core.sparsecheckout # timeout=10
 > git checkout -f b6ec52010f7633779a4245941dce22b5a8b0a17f # timeout=10
 > git branch -a -v --no-abbrev # timeout=10
 > git branch -D main # timeout=10
 > git checkout -b main b6ec52010f7633779a4245941dce22b5a8b0a17f # timeout=10
 > git rev-list --no-walk b6ec52010f7633779a4245941dce22b5a8b0a17f # timeout=10
[Pipeline] }
[Pipeline] // dir
[Pipeline] dir
Running in /Users/buildslave/jenkins/workspace/test-suite-verify-machineinstrs-aarch64-O3/pseudo-checkout-llvm-project
[Pipeline] {
[Pipeline] checkout
The recommended git tool is: NONE
No credentials specified
Cloning the remote Git repository
Cloning repository https://github.com/llvm/llvm-project.git
 > git init /Users/buildslave/jenkins/workspace/test-suite-verify-machineinstrs-aarch64-O3/pseudo-checkout-llvm-project # timeout=10
Using reference repository: /Users/Shared/llvm-project.git
Fetching upstream changes from https://github.com/llvm/llvm-project.git
 > git --version # timeout=10
 > git --version # 'git version 2.24.3 (Apple Git-128)'
 > git fetch --tags --force --progress -- https://github.com/llvm/llvm-project.git +refs/heads/*:refs/remotes/origin/* # timeout=10
Avoid second fetch
Checking out Revision 9ce7b40ad49f4e16c74d0a181c5cd25d21e417c8 (detached)
 > git config remote.origin.url https://github.com/llvm/llvm-project.git # timeout=10
 > git config --add remote.origin.fetch +refs/heads/*:refs/remotes/origin/* # timeout=10
 > git rev-parse 9ce7b40ad49f4e^{commit} # timeout=10
 > git config core.sparsecheckout # timeout=10
 > git checkout -f 9ce7b40ad49f4e16c74d0a181c5cd25d21e417c8 # timeout=10
Commit message: "Use the default parameters of countTrailingZeros and find{First,Last}Set (NFC)"
 > git rev-list --no-walk 83f66e2d81f733e4bf956684d761e16d1c9200a4 # timeout=10
[Pipeline] }
[Pipeline] // dir
[Pipeline] dir
Running in /Users/buildslave/jenkins/workspace/test-suite-verify-machineinstrs-aarch64-O3/lnt
[Pipeline] {
[Pipeline] git
The recommended git tool is: NONE
No credentials specified
Cloning the remote Git repository
Cloning repository https://github.com/llvm/llvm-lnt.git
 > git init /Users/buildslave/jenkins/workspace/test-suite-verify-machineinstrs-aarch64-O3/lnt # timeout=10
Fetching upstream changes from https://github.com/llvm/llvm-lnt.git
 > git --version # timeout=10
 > git --version # 'git version 2.24.3 (Apple Git-128)'
 > git fetch --tags --force --progress -- https://github.com/llvm/llvm-lnt.git +refs/heads/*:refs/remotes/origin/* # timeout=10
Avoid second fetch
Checking out Revision c600ffa76826516ec8c51bf50d2dd224745353dc (refs/remotes/origin/main)
Commit message: "Add retries to Tableau support"
 > git config remote.origin.url https://github.com/llvm/llvm-lnt.git # timeout=10
 > git config --add remote.origin.fetch +refs/heads/*:refs/remotes/origin/* # timeout=10
 > git rev-parse refs/remotes/origin/main^{commit} # timeout=10
 > git config core.sparsecheckout # timeout=10
 > git checkout -f c600ffa76826516ec8c51bf50d2dd224745353dc # timeout=10
 > git branch -a -v --no-abbrev # timeout=10
 > git checkout -b main c600ffa76826516ec8c51bf50d2dd224745353dc # timeout=10
 > git rev-list --no-walk c600ffa76826516ec8c51bf50d2dd224745353dc # timeout=10
[Pipeline] }
[Pipeline] // dir
[Pipeline] dir
Running in /Users/buildslave/jenkins/workspace/test-suite-verify-machineinstrs-aarch64-O3/test-suite
[Pipeline] {
[Pipeline] git
The recommended git tool is: NONE
No credentials specified
Fetching changes from the remote Git repository
Checking out Revision 0bf641816abea1f785603193e1ed0d939bae8516 (refs/remotes/origin/main)
 > git rev-parse --resolve-git-dir /Users/buildslave/jenkins/workspace/test-suite-verify-machineinstrs-aarch64-O3/test-suite/.git # timeout=10
 > git config remote.origin.url https://github.com/llvm/llvm-test-suite.git # timeout=10
Fetching upstream changes from https://github.com/llvm/llvm-test-suite.git
 > git --version # timeout=10
 > git --version # 'git version 2.24.3 (Apple Git-128)'
 > git fetch --tags --force --progress -- https://github.com/llvm/llvm-test-suite.git +refs/heads/*:refs/remotes/origin/* # timeout=10
 > git rev-parse refs/remotes/origin/main^{commit} # timeout=10
 > git config core.sparsecheckout # timeout=10
 > git checkout -f 0bf641816abea1f785603193e1ed0d939bae8516 # timeout=10
Commit message: "[SPEC2017] Use -fno-strict-aliasing when compiling 502.gcc_r, 505.mcf_r"
 > git branch -a -v --no-abbrev # timeout=10
 > git branch -D main # timeout=10
 > git checkout -b main 0bf641816abea1f785603193e1ed0d939bae8516 # timeout=10
 > git rev-list --no-walk 0bf641816abea1f785603193e1ed0d939bae8516 # timeout=10
[Pipeline] }
[Pipeline] // dir
[Pipeline] sh
+ CMAKE_FLAGS+=' -C ../config/tasks/cmake/caches/target-arm64-iphoneos.cmake'
+ CMAKE_FLAGS+=' -C ../config/tasks/cmake/caches/opt-O3.cmake'
+ config/tasks/task jenkinsrun config/tasks/test-suite-verify-machineinstrs.sh -a compiler=http://green-dragon-21.local/artifacts/clang-stage1-RA/clang-d448562-g9ce7b40ad49f4e-t32651-b32651.tar.gz -D 'CMAKE_FLAGS= -C ../config/tasks/cmake/caches/target-arm64-iphoneos.cmake -C ../config/tasks/cmake/caches/opt-O3.cmake'
+ export PATH=/Users/buildslave/jenkins/workspace/test-suite-verify-machineinstrs-aarch64-O3/config/tasks/bin:/usr/local/bin:/usr/local/sbin:/usr/bin:/bin:/usr/sbin:/sbin
+ PATH=/Users/buildslave/jenkins/workspace/test-suite-verify-machineinstrs-aarch64-O3/config/tasks/bin:/usr/local/bin:/usr/local/sbin:/usr/bin:/bin:/usr/sbin:/sbin
+ build clean
...removing 'test-suite-build'
...removing 'venv'
...removing 'lnt'
...removing 'pseudo-checkout-llvm-project'
...removing 'log_summary.html'
...removing 'compiler'
++ build arg --optional CMAKE_FLAGS
+ CMAKE_FLAGS=' -C ../config/tasks/cmake/caches/target-arm64-iphoneos.cmake -C ../config/tasks/cmake/caches/opt-O3.cmake'
+ build get compiler
Cannot contact green-dragon-12: java.lang.InterruptedException
./bin/bugpoint: truncated gzip input
tar: Error exit delayed from previous errors.
Error while executing: $ cd compiler ; curl -s http://green-dragon-21.local/artifacts/clang-stage1-RA/clang-d448562-g9ce7b40ad49f4e-t32651-b32651.tar.gz | tar -x
*Build failed!* (return code 1)
[Pipeline] }
[Pipeline] // stage
[Pipeline] stage
[Pipeline] { (post)
[Pipeline] sh
+ curl http://labmaster2:8080/green/job/test-suite-verify-machineinstrs-aarch64-O3/12367/consoleText -s
+ config/zorg/jenkins/inspect_log.py
[Pipeline] readFile
[Pipeline] readTrusted
Obtained zorg/jenkins/job_description.template from git https://github.com/llvm/llvm-zorg.git
[Pipeline] readTrusted
Obtained zorg/jenkins/email.template from git https://github.com/llvm/llvm-zorg.git
[Pipeline] emailext
Warning: llvm-dev@redking.me.uk is not a recognized user, but sending mail anyway
Warning: kazu@google.com is not a recognized user, but sending mail anyway
Warning: Matthew.Arsenault@amd.com is not a recognized user, but sending mail anyway
Warning: lebedev.ri@gmail.com is not a recognized user, but sending mail anyway
Warning: llvm-dev@redking.me.uk is not a recognized user, but sending mail anyway
Warning: kazu@google.com is not a recognized user, but sending mail anyway
Warning: Matthew.Arsenault@amd.com is not a recognized user, but sending mail anyway
Warning: lebedev.ri@gmail.com is not a recognized user, but sending mail anyway
org.codehaus.groovy.control.MultipleCompilationErrorsException: startup failed:
General error during semantic analysis: String index out of range: -1

Hide Details

java.lang.StringIndexOutOfBoundsException: String index out of range: -1 at java.lang.String.substring(String.java:1931) at org.codehaus.groovy.runtime.MetaClassHelper.capitalize(MetaClassHelper.java:484) at org.codehaus.groovy.control.StaticImportVisitor.getAccessorName(StaticImportVisitor.java:522) at org.codehaus.groovy.control.StaticImportVisitor.findStaticFieldOrPropAccessorImportFromModule(StaticImportVisitor.java:402) at org.codehaus.groovy.control.StaticImportVisitor.transformMethodCallExpression(StaticImportVisitor.java:278) at org.codehaus.groovy.control.StaticImportVisitor.transform(StaticImportVisitor.java:108) at org.codehaus.groovy.control.StaticImportVisitor.transformMethodCallExpression(StaticImportVisitor.java:259) at org.codehaus.groovy.control.StaticImportVisitor.transform(StaticImportVisitor.java:108) at org.codehaus.groovy.ast.expr.DeclarationExpression.transformExpression(DeclarationExpression.java:139) at org.codehaus.groovy.control.StaticImportVisitor.transform(StaticImportVisitor.java:144) at org.codehaus.groovy.ast.ClassCodeExpressionTransformer.visitExpressionStatement(ClassCodeExpressionTransformer.java:142) at org.codehaus.groovy.ast.stmt.ExpressionStatement.visit(ExpressionStatement.java:42) at org.codehaus.groovy.ast.CodeVisitorSupport.visitBlockStatement(CodeVisitorSupport.java:37) at org.codehaus.groovy.ast.ClassCodeVisitorSupport.visitBlockStatement(ClassCodeVisitorSupport.java:166) at org.codehaus.groovy.ast.stmt.BlockStatement.visit(BlockStatement.java:71) at org.codehaus.groovy.ast.ClassCodeVisitorSupport.visitClassCodeContainer(ClassCodeVisitorSupport.java:104) at org.codehaus.groovy.ast.ClassCodeVisitorSupport.visitConstructorOrMethod(ClassCodeVisitorSupport.java:115) at org.codehaus.groovy.ast.ClassCodeExpressionTransformer.visitConstructorOrMethod(ClassCodeExpressionTransformer.java:53) at org.codehaus.groovy.control.StaticImportVisitor.visitConstructorOrMethod(StaticImportVisitor.java:84) at org.codehaus.groovy.ast.ClassCodeVisitorSupport.visitMethod(ClassCodeVisitorSupport.java:126) at org.codehaus.groovy.ast.ClassNode.visitContents(ClassNode.java:1081) at org.codehaus.groovy.ast.ClassCodeVisitorSupport.visitClass(ClassCodeVisitorSupport.java:53) at org.codehaus.groovy.control.StaticImportVisitor.visitClass(StaticImportVisitor.java:78) at org.codehaus.groovy.control.CompilationUnit$13.call(CompilationUnit.java:671) at org.codehaus.groovy.control.CompilationUnit.applyToPrimaryClassNodes(CompilationUnit.java:1065) at org.codehaus.groovy.control.CompilationUnit.doPhaseOperation(CompilationUnit.java:603) at org.codehaus.groovy.control.CompilationUnit.processPhaseOperations(CompilationUnit.java:581) at org.codehaus.groovy.control.CompilationUnit.compile(CompilationUnit.java:558) at groovy.lang.GroovyClassLoader.doParseClass(GroovyClassLoader.java:298) at groovy.lang.GroovyClassLoader.parseClass(GroovyClassLoader.java:268) at groovy.lang.GroovyShell.parseClass(GroovyShell.java:688) at groovy.lang.GroovyShell.parse(GroovyShell.java:700) at groovy.lang.GroovyShell.parse(GroovyShell.java:736) at groovy.lang.GroovyShell.parse(GroovyShell.java:727) at hudson.plugins.emailext.ExtendedEmailPublisher.executeScript(ExtendedEmailPublisher.java:691) at hudson.plugins.emailext.ExtendedEmailPublisher.executePresendScript(ExtendedEmailPublisher.java:649) at hudson.plugins.emailext.ExtendedEmailPublisher.sendMail(ExtendedEmailPublisher.java:513) at hudson.plugins.emailext.EmailExtStep$EmailExtStepExecution.run(EmailExtStep.java:250) at hudson.plugins.emailext.EmailExtStep$EmailExtStepExecution.run(EmailExtStep.java:183) at org.jenkinsci.plugins.workflow.steps.SynchronousNonBlockingStepExecution.lambda$start$0(SynchronousNonBlockingStepExecution.java:47) at java.util.concurrent.Executors$RunnableAdapter.call(Executors.java:511) at java.util.concurrent.FutureTask.run(FutureTask.java:266) at java.util.concurrent.ThreadPoolExecutor.runWorker(ThreadPoolExecutor.java:1149) at java.util.concurrent.ThreadPoolExecutor$Worker.run(ThreadPoolExecutor.java:624) at java.lang.Thread.run(Thread.java:748)

Hide Details

1 error

Hide Details

at org.codehaus.groovy.control.ErrorCollector.failIfErrors(ErrorCollector.java:310) at org.codehaus.groovy.control.CompilationUnit.applyToPrimaryClassNodes(CompilationUnit.java:1085) at org.codehaus.groovy.control.CompilationUnit.doPhaseOperation(CompilationUnit.java:603) at org.codehaus.groovy.control.CompilationUnit.processPhaseOperations(CompilationUnit.java:581) at org.codehaus.groovy.control.CompilationUnit.compile(CompilationUnit.java:558) at groovy.lang.GroovyClassLoader.doParseClass(GroovyClassLoader.java:298) at groovy.lang.GroovyClassLoader.parseClass(GroovyClassLoader.java:268) at groovy.lang.GroovyShell.parseClass(GroovyShell.java:688) at groovy.lang.GroovyShell.parse(GroovyShell.java:700) at groovy.lang.GroovyShell.parse(GroovyShell.java:736) at groovy.lang.GroovyShell.parse(GroovyShell.java:727) at hudson.plugins.emailext.ExtendedEmailPublisher.executeScript(ExtendedEmailPublisher.java:691) at hudson.plugins.emailext.ExtendedEmailPublisher.executePresendScript(ExtendedEmailPublisher.java:649) at hudson.plugins.emailext.ExtendedEmailPublisher.sendMail(ExtendedEmailPublisher.java:513) at hudson.plugins.emailext.EmailExtStep$EmailExtStepExecution.run(EmailExtStep.java:250) at hudson.plugins.emailext.EmailExtStep$EmailExtStepExecution.run(EmailExtStep.java:183) at org.jenkinsci.plugins.workflow.steps.SynchronousNonBlockingStepExecution.lambda$start$0(SynchronousNonBlockingStepExecution.java:47) at java.util.concurrent.Executors$RunnableAdapter.call(Executors.java:511) at java.util.concurrent.FutureTask.run(FutureTask.java:266) at java.util.concurrent.ThreadPoolExecutor.runWorker(ThreadPoolExecutor.java:1149) at java.util.concurrent.ThreadPoolExecutor$Worker.run(ThreadPoolExecutor.java:624) at java.lang.Thread.run(Thread.java:748)

Hide Details

Sending email to: llvm-dev@redking.me.uk kazu@google.com Matthew.Arsenault@amd.com lebedev.ri@gmail.com [Pipeline] } [Pipeline] // stage [Pipeline] } [Pipeline] // node [Pipeline] End of Pipeline Finished: FAILURE