FailedConsole Output

Skipping 14,941 KB.. Full Log
PASS: LLVM-Unit :: Support/./SupportTests/AllocationTests/MappedMemoryTest.MultipleAllocAndRelease/1 (42121 of 43701)
PASS: LLVM-Unit :: Support/./SupportTests/AllocationTests/MappedMemoryTest.MultipleAllocAndRelease/2 (42122 of 43701)
PASS: LLVM-Unit :: Support/./SupportTests/AllocationTests/MappedMemoryTest.MultipleAllocAndRelease/4 (42123 of 43701)
PASS: LLVM-Unit :: Support/./SupportTests/AllocationTests/MappedMemoryTest.MultipleWrite/0 (42124 of 43701)
PASS: LLVM-Unit :: Support/./SupportTests/AllocationTests/MappedMemoryTest.MultipleAllocAndRelease/3 (42125 of 43701)
PASS: LLVM-Unit :: Support/./SupportTests/AllocationTests/MappedMemoryTest.MultipleAllocAndRelease/5 (42126 of 43701)
PASS: LLVM-Unit :: Support/./SupportTests/AllocationTests/MappedMemoryTest.MultipleWrite/1 (42127 of 43701)
PASS: LLVM-Unit :: Support/./SupportTests/AllocationTests/MappedMemoryTest.MultipleWrite/2 (42128 of 43701)
PASS: LLVM-Unit :: Support/./SupportTests/AllocationTests/MappedMemoryTest.MultipleWrite/3 (42129 of 43701)
PASS: LLVM-Unit :: Support/./SupportTests/AllocationTests/MappedMemoryTest.MultipleWrite/4 (42130 of 43701)
PASS: LLVM-Unit :: Support/./SupportTests/AllocationTests/MappedMemoryTest.SuccessiveNear/2 (42131 of 43701)
PASS: LLVM-Unit :: Support/./SupportTests/AllocationTests/MappedMemoryTest.SuccessiveNear/1 (42132 of 43701)
PASS: LLVM-Unit :: Support/./SupportTests/AllocationTests/MappedMemoryTest.MultipleWrite/5 (42133 of 43701)
PASS: LLVM-Unit :: Support/./SupportTests/AllocationTests/MappedMemoryTest.SuccessiveNear/0 (42134 of 43701)
PASS: LLVM-Unit :: Support/./SupportTests/AllocationTests/MappedMemoryTest.SuccessiveNear/3 (42135 of 43701)
PASS: LLVM-Unit :: Support/./SupportTests/AllocationTests/MappedMemoryTest.SuccessiveNear/4 (42136 of 43701)
PASS: LLVM-Unit :: Support/./SupportTests/AllocationTests/MappedMemoryTest.SuccessiveNear/5 (42137 of 43701)
PASS: LLVM-Unit :: Support/./SupportTests/AllocationTests/MappedMemoryTest.UnalignedNear/0 (42138 of 43701)
PASS: LLVM-Unit :: Support/./SupportTests/AllocationTests/MappedMemoryTest.UnalignedNear/1 (42139 of 43701)
PASS: LLVM-Unit :: Support/./SupportTests/AllocationTests/MappedMemoryTest.UnalignedNear/3 (42140 of 43701)
PASS: LLVM-Unit :: Support/./SupportTests/AllocationTests/MappedMemoryTest.UnalignedNear/2 (42141 of 43701)
PASS: LLVM-Unit :: Support/./SupportTests/AllocationTests/MappedMemoryTest.UnalignedNear/4 (42142 of 43701)
PASS: LLVM-Unit :: Support/./SupportTests/AllocationTests/MappedMemoryTest.UnalignedNear/5 (42143 of 43701)
PASS: LLVM-Unit :: Support/./SupportTests/AllocationTests/MappedMemoryTest.ZeroNear/0 (42144 of 43701)
PASS: LLVM-Unit :: Support/./SupportTests/AllocationTests/MappedMemoryTest.ZeroNear/1 (42145 of 43701)
PASS: LLVM-Unit :: Support/./SupportTests/AllocationTests/MappedMemoryTest.ZeroNear/2 (42146 of 43701)
PASS: LLVM-Unit :: Support/./SupportTests/AllocationTests/MappedMemoryTest.ZeroNear/4 (42147 of 43701)
PASS: LLVM-Unit :: Support/./SupportTests/AllocationTests/MappedMemoryTest.ZeroNear/3 (42148 of 43701)
PASS: LLVM-Unit :: Support/./SupportTests/AllocationTests/MappedMemoryTest.ZeroNear/5 (42149 of 43701)
PASS: LLVM-Unit :: Support/./SupportTests/AllocationTests/MappedMemoryTest.ZeroSizeNear/1 (42150 of 43701)
PASS: LLVM-Unit :: Support/./SupportTests/AllocationTests/MappedMemoryTest.ZeroSizeNear/0 (42151 of 43701)
PASS: LLVM-Unit :: Support/./SupportTests/AllocationTests/MappedMemoryTest.ZeroSizeNear/3 (42152 of 43701)
PASS: LLVM-Unit :: Support/./SupportTests/AllocationTests/MappedMemoryTest.ZeroSizeNear/2 (42153 of 43701)
PASS: LLVM-Unit :: Support/./SupportTests/AllocationTests/MappedMemoryTest.ZeroSizeNear/4 (42154 of 43701)
PASS: LLVM-Unit :: Support/./SupportTests/AllocationTests/MappedMemoryTest.ZeroSizeNear/5 (42155 of 43701)
PASS: LLVM-Unit :: Support/./SupportTests/AllocatorTest.TestAlignment (42156 of 43701)
PASS: LLVM-Unit :: Support/./SupportTests/AllocatorTest.Basics (42157 of 43701)
PASS: LLVM-Unit :: Support/./SupportTests/AllocatorTest.TestFasterSlabGrowthDelay (42158 of 43701)
PASS: LLVM-Unit :: Support/./SupportTests/AllocatorTest.TestBigAlignment (42159 of 43701)
PASS: LLVM-Unit :: Support/./SupportTests/AllocatorTest.TestAlignmentPastSlab (42160 of 43701)
PASS: LLVM-Unit :: Support/./SupportTests/AllocatorTest.TestOverflow (42161 of 43701)
PASS: LLVM-Unit :: Support/./SupportTests/AllocatorTest.TestReset (42162 of 43701)
PASS: LLVM-Unit :: Support/./SupportTests/AllocatorTest.TestSmallSlabSize (42163 of 43701)
PASS: LLVM-Unit :: Support/./SupportTests/AllocatorTest.TestSlowerSlabGrowthDelay (42164 of 43701)
PASS: LLVM-Unit :: Support/./SupportTests/AllocatorTest.ThreeSlabs (42165 of 43701)
PASS: LLVM-Unit :: Support/./SupportTests/AnnotationsTest.Errors (42166 of 43701)
PASS: LLVM-Unit :: Support/./SupportTests/AnnotationsTest.Nested (42167 of 43701)
PASS: LLVM-Unit :: Support/./SupportTests/AnnotationsTest.Points (42168 of 43701)
PASS: LLVM-Unit :: Support/./SupportTests/AnnotationsTest.Named (42169 of 43701)
PASS: LLVM-Unit :: Support/./SupportTests/AnnotationsTest.CleanedCode (42170 of 43701)
PASS: LLVM-Unit :: Support/./SupportTests/AnnotationsTest.Ranges (42171 of 43701)
PASS: LLVM-Unit :: Support/./SupportTests/ArrayRecyclerTest.Basics (42172 of 43701)
PASS: LLVM-Unit :: Support/./SupportTests/ArrayRecyclerTest.Capacity (42173 of 43701)
PASS: LLVM-Unit :: Support/./SupportTests/AttributeHeaderParser.InvalidAttributeSize (42174 of 43701)
PASS: LLVM-Unit :: Support/./SupportTests/AttributeHeaderParser.InvalidSectionLength (42175 of 43701)
PASS: LLVM-Unit :: Support/./SupportTests/AttributeHeaderParser.UnrecognizedTag (42176 of 43701)
PASS: LLVM-Unit :: Support/./SupportTests/AttributeHeaderParser.UnrecognizedFormatVersion (42177 of 43701)
PASS: LLVM-Unit :: Support/./SupportTests/AttributeHeaderParser.UnrecognizedVendorName (42178 of 43701)
PASS: LLVM-Unit :: Support/./SupportTests/BinaryStreamTest.AppendingStream (42179 of 43701)
PASS: LLVM-Unit :: Support/./SupportTests/BinaryStreamTest.BinaryByteStreamBounds (42180 of 43701)
PASS: LLVM-Unit :: Support/./SupportTests/Base64Test.Base64 (42181 of 43701)
PASS: LLVM-Unit :: Support/./SupportTests/BinaryStreamTest.DropOperations (42182 of 43701)
PASS: LLVM-Unit :: Support/./SupportTests/BinaryStreamTest.BinaryItemStream (42183 of 43701)
PASS: LLVM-Unit :: Support/./SupportTests/BinaryStreamTest.FixedStreamArrayIteratorArrow (42184 of 43701)
PASS: LLVM-Unit :: Support/./SupportTests/BinaryStreamTest.FixedStreamArray (42185 of 43701)
PASS: LLVM-Unit :: Support/./SupportTests/BinaryStreamTest.MutableBinaryByteStreamBounds (42186 of 43701)
PASS: LLVM-Unit :: Support/./SupportTests/BinaryStreamTest.StreamReaderBounds (42187 of 43701)
PASS: LLVM-Unit :: Support/./SupportTests/BinaryStreamTest.StreamReaderEnum (42188 of 43701)
PASS: LLVM-Unit :: Support/./SupportTests/BinaryStreamTest.StreamReaderObject (42189 of 43701)
PASS: LLVM-Unit :: Support/./SupportTests/BinaryStreamTest.StreamReaderIntegers (42190 of 43701)
PASS: LLVM-Unit :: Support/./SupportTests/BinaryStreamTest.StreamReaderSLEB128 (42191 of 43701)
PASS: LLVM-Unit :: Support/./SupportTests/BinaryStreamTest.StreamReaderIntegerArray (42192 of 43701)
PASS: LLVM-Unit :: Support/./SupportTests/BinaryStreamTest.StreamReaderULEB128 (42193 of 43701)
PASS: LLVM-Unit :: Support/./SupportTests/BinaryStreamTest.StreamReaderStrings (42194 of 43701)
PASS: LLVM-Unit :: Support/./SupportTests/BinaryStreamTest.StreamRefBounds (42195 of 43701)
PASS: LLVM-Unit :: Support/./SupportTests/BinaryStreamTest.StreamRefDynamicSize (42196 of 43701)
PASS: LLVM-Unit :: Support/./SupportTests/BinaryStreamTest.StreamWriterAppend (42197 of 43701)
PASS: LLVM-Unit :: Support/./SupportTests/BinaryStreamTest.StreamWriterBounds (42198 of 43701)
PASS: LLVM-Unit :: Support/./SupportTests/BinaryStreamTest.StringWriterStrings (42199 of 43701)
PASS: LLVM-Unit :: Support/./SupportTests/BinaryStreamTest.StreamWriterIntegerArrays (42200 of 43701)
PASS: LLVM-Unit :: Support/./SupportTests/BlockFrequency.Divide (42201 of 43701)
PASS: LLVM-Unit :: Support/./SupportTests/BinaryStreamTest.VarStreamArray (42202 of 43701)
PASS: LLVM-Unit :: Support/./SupportTests/BlockFrequencyTest.BigToBig (42203 of 43701)
PASS: LLVM-Unit :: Support/./SupportTests/BlockFrequencyTest.MaxToHalfMax (42204 of 43701)
PASS: LLVM-Unit :: Support/./SupportTests/BlockFrequencyTest.MaxToMax (42205 of 43701)
PASS: LLVM-Unit :: Support/./SupportTests/BlockFrequencyTest.OneToOne (42206 of 43701)
PASS: LLVM-Unit :: Support/./SupportTests/BlockFrequencyTest.OneToZero (42207 of 43701)
PASS: LLVM-Unit :: Support/./SupportTests/BlockFrequencyTest.Saturate (42208 of 43701)
PASS: LLVM-Unit :: Support/./SupportTests/BlockFrequencyTest.Subtract (42209 of 43701)
PASS: LLVM-Unit :: Support/./SupportTests/BlockFrequencyTest.SaturatingRightShift (42210 of 43701)
PASS: LLVM-Unit :: Support/./SupportTests/BlockFrequencyTest.ThreeToOne (42211 of 43701)
PASS: LLVM-Unit :: Support/./SupportTests/BranchProbabilityTest.Accessors (42212 of 43701)
PASS: LLVM-Unit :: Support/./SupportTests/BranchProbabilityTest.ArithmeticOperators (42213 of 43701)
PASS: LLVM-Unit :: Support/./SupportTests/BranchProbabilityTest.MoreOperators (42214 of 43701)
PASS: LLVM-Unit :: Support/./SupportTests/BranchProbabilityTest.NormalizeProbabilities (42215 of 43701)
PASS: LLVM-Unit :: Support/./SupportTests/BranchProbabilityTest.Operators (42216 of 43701)
PASS: LLVM-Unit :: Support/./SupportTests/BranchProbabilityTest.scale (42217 of 43701)
PASS: LLVM-Unit :: Support/./SupportTests/BranchProbabilityTest.getCompl (42218 of 43701)
PASS: LLVM-Unit :: Support/./SupportTests/BranchProbabilityTest.scaleBruteForce (42219 of 43701)
PASS: LLVM-Unit :: Support/./SupportTests/BranchProbabilityTest.scaleByInverse (42220 of 43701)
PASS: LLVM-Unit :: Support/./SupportTests/ByteSwap.Swap_32 (42221 of 43701)
PASS: LLVM-Unit :: Support/./SupportTests/ByteSwap.Swap_64 (42222 of 43701)
PASS: LLVM-Unit :: Support/./SupportTests/CPUAlignBuildAttr.testBuildAttr (42223 of 43701)
PASS: LLVM-Unit :: Support/./SupportTests/CPUArchBuildAttr.testBuildAttr (42224 of 43701)
PASS: LLVM-Unit :: Support/./SupportTests/CPUArchProfileBuildAttr.testBuildAttr (42225 of 43701)
PASS: LLVM-Unit :: Support/./SupportTests/CRCTest.CRC32 (42226 of 43701)
PASS: LLVM-Unit :: Support/./SupportTests/CachePruningPolicyParser.Empty (42227 of 43701)
PASS: LLVM-Unit :: Support/./SupportTests/CachePruningPolicyParser.Errors (42228 of 43701)
PASS: LLVM-Unit :: Support/./SupportTests/CachePruningPolicyParser.Interval (42229 of 43701)
PASS: LLVM-Unit :: Support/./SupportTests/CachePruningPolicyParser.Expiration (42230 of 43701)
PASS: LLVM-Unit :: Support/./SupportTests/CachePruningPolicyParser.MaxSizeBytes (42231 of 43701)
PASS: LLVM-Unit :: Support/./SupportTests/CachePruningPolicyParser.MaxSizePercentageOfAvailableSpace (42232 of 43701)
PASS: LLVM-Unit :: Support/./SupportTests/CachePruningPolicyParser.Multiple (42233 of 43701)
PASS: LLVM-Unit :: Support/./SupportTests/CastingTest.InferredUpcastTakesPrecedence (42234 of 43701)
PASS: LLVM-Unit :: Support/./SupportTests/CastingTest.UpcastIsInferred (42235 of 43701)
PASS: LLVM-Unit :: Support/./SupportTests/CastingTest.cast (42236 of 43701)
PASS: LLVM-Unit :: Support/./SupportTests/CastingTest.cast_or_null (42237 of 43701)
PASS: LLVM-Unit :: Support/./SupportTests/CastingTest.dyn_cast (42238 of 43701)
PASS: LLVM-Unit :: Support/./SupportTests/CastingTest.dyn_cast_or_null (42239 of 43701)
PASS: LLVM-Unit :: Support/./SupportTests/CastingTest.isa (42240 of 43701)
PASS: LLVM-Unit :: Support/./SupportTests/CastingTest.isa_and_nonnull (42241 of 43701)
PASS: LLVM-Unit :: Support/./SupportTests/CastingTest.smart_cast (42242 of 43701)
PASS: LLVM-Unit :: Support/./SupportTests/CastingTest.smart_cast_or_null (42243 of 43701)
PASS: LLVM-Unit :: Support/./SupportTests/CastingTest.smart_dyn_cast (42244 of 43701)
PASS: LLVM-Unit :: Support/./SupportTests/CastingTest.smart_dyn_cast_or_null (42245 of 43701)
PASS: LLVM-Unit :: Support/./SupportTests/CastingTest.unique_dyn_cast (42246 of 43701)
PASS: LLVM-Unit :: Support/./SupportTests/CastingTest.smart_isa (42247 of 43701)
PASS: LLVM-Unit :: Support/./SupportTests/CheckedArithmetic.CheckedAddUnsigned (42248 of 43701)
PASS: LLVM-Unit :: Support/./SupportTests/CheckedArithmetic.CheckedAdd (42249 of 43701)
PASS: LLVM-Unit :: Support/./SupportTests/CheckedArithmetic.CheckedAddSmall (42250 of 43701)
PASS: LLVM-Unit :: Support/./SupportTests/CheckedArithmetic.CheckedMulAdd (42251 of 43701)
PASS: LLVM-Unit :: Support/./SupportTests/CheckedArithmetic.CheckedMul (42252 of 43701)
PASS: LLVM-Unit :: Support/./SupportTests/CheckedArithmetic.CheckedMulAddSmall (42253 of 43701)
PASS: LLVM-Unit :: Support/./SupportTests/CheckedArithmetic.CheckedMulAddUnsigned (42254 of 43701)
PASS: LLVM-Unit :: Support/./SupportTests/CheckedArithmetic.CheckedMulSmall (42255 of 43701)
PASS: LLVM-Unit :: Support/./SupportTests/CheckedArithmetic.CheckedMulUnsigned (42256 of 43701)
PASS: LLVM-Unit :: Support/./SupportTests/Chrono.DurationFormat (42257 of 43701)
PASS: LLVM-Unit :: Support/./SupportTests/Chrono.ImplicitConversions (42258 of 43701)
PASS: LLVM-Unit :: Support/./SupportTests/Chrono.TimePointFormat (42259 of 43701)
PASS: LLVM-Unit :: Support/./SupportTests/Chrono.TimeTConversion (42260 of 43701)
PASS: LLVM-Unit :: Support/./SupportTests/CommandLineTest.AddToAllSubCommands (42261 of 43701)
PASS: LLVM-Unit :: Support/./SupportTests/CommandLineTest.AliasesWithArguments (42262 of 43701)
PASS: LLVM-Unit :: Support/./SupportTests/CommandLineTest.AliasRequired (42263 of 43701)
PASS: LLVM-Unit :: Support/./SupportTests/CommandLineTest.Callback (42264 of 43701)
PASS: LLVM-Unit :: Support/./SupportTests/CommandLineTest.ConsumeAfterOnePositional (42265 of 43701)
PASS: LLVM-Unit :: Support/./SupportTests/CommandLineTest.ArgumentLimit (42266 of 43701)
PASS: LLVM-Unit :: Support/./SupportTests/CommandLineTest.ConsumeAfterTwoPositionals (42267 of 43701)
PASS: LLVM-Unit :: Support/./SupportTests/CommandLineTest.DefaultOptions (42268 of 43701)
PASS: LLVM-Unit :: Support/./SupportTests/CommandLineTest.GetRegisteredSubcommands (42269 of 43701)
PASS: LLVM-Unit :: Support/./SupportTests/CommandLineTest.GroupingAndPrefix (42270 of 43701)
PASS: LLVM-Unit :: Support/./SupportTests/CommandLineTest.GroupingWithValue (42271 of 43701)
PASS: LLVM-Unit :: Support/./SupportTests/CommandLineTest.HideUnrelatedOptions (42272 of 43701)
PASS: LLVM-Unit :: Support/./SupportTests/CommandLineTest.HideUnrelatedOptionsMulti (42273 of 43701)
PASS: LLVM-Unit :: Support/./SupportTests/CommandLineTest.LongOptions (42274 of 43701)
PASS: LLVM-Unit :: Support/./SupportTests/CommandLineTest.ModifyExisitingOption (42275 of 43701)
PASS: LLVM-Unit :: Support/./SupportTests/CommandLineTest.LookupFailsInWrongSubCommand (42276 of 43701)
PASS: LLVM-Unit :: Support/./SupportTests/CommandLineTest.OptionErrorMessage (42277 of 43701)
PASS: LLVM-Unit :: Support/./SupportTests/CommandLineTest.OptionErrorMessageSuggest (42278 of 43701)
PASS: LLVM-Unit :: Support/./SupportTests/CommandLineTest.OptionErrorMessageSuggestNoHidden (42279 of 43701)
PASS: LLVM-Unit :: Support/./SupportTests/CommandLineTest.PositionalEatArgsError (42280 of 43701)
PASS: LLVM-Unit :: Support/./SupportTests/CommandLineTest.PrefixOptions (42281 of 43701)
PASS: LLVM-Unit :: Support/./SupportTests/CommandLineTest.ReadConfigFile (42282 of 43701)
PASS: LLVM-Unit :: Support/./SupportTests/CommandLineTest.RecursiveResponseFiles (42283 of 43701)
PASS: LLVM-Unit :: Support/./SupportTests/CommandLineTest.RemoveFromAllSubCommands (42284 of 43701)
PASS: LLVM-Unit :: Support/./SupportTests/CommandLineTest.RemoveFromRegularSubCommand (42285 of 43701)
PASS: LLVM-Unit :: Support/./SupportTests/CommandLineTest.RemoveFromTopLevelSubCommand (42286 of 43701)
PASS: LLVM-Unit :: Support/./SupportTests/CommandLineTest.ReparseCommandLineOptions (42287 of 43701)
PASS: LLVM-Unit :: Support/./SupportTests/CommandLineTest.ResponseFileEOLs (42288 of 43701)
PASS: LLVM-Unit :: Support/./SupportTests/CommandLineTest.ResponseFileRelativePath (42289 of 43701)
PASS: LLVM-Unit :: Support/./SupportTests/CommandLineTest.ResponseFiles (42290 of 43701)
PASS: LLVM-Unit :: Support/./SupportTests/CommandLineTest.ResponseFileWindows (42291 of 43701)
PASS: LLVM-Unit :: Support/./SupportTests/CommandLineTest.ResponseFilesAtArguments (42292 of 43701)
PASS: LLVM-Unit :: Support/./SupportTests/CommandLineTest.SetValueInSubcategories (42293 of 43701)
PASS: LLVM-Unit :: Support/./SupportTests/CommandLineTest.SetDefautValue (42294 of 43701)
PASS: LLVM-Unit :: Support/./SupportTests/CommandLineTest.TokenizeAndMarkEOLs (42295 of 43701)
PASS: LLVM-Unit :: Support/./SupportTests/CommandLineTest.TokenizeConfigFile1 (42296 of 43701)
PASS: LLVM-Unit :: Support/./SupportTests/CommandLineTest.TokenizeConfigFile10 (42297 of 43701)
PASS: LLVM-Unit :: Support/./SupportTests/CommandLineTest.TokenizeConfigFile2 (42298 of 43701)
PASS: LLVM-Unit :: Support/./SupportTests/CommandLineTest.TokenizeConfigFile11 (42299 of 43701)
PASS: LLVM-Unit :: Support/./SupportTests/CommandLineTest.TokenizeConfigFile3 (42300 of 43701)
PASS: LLVM-Unit :: Support/./SupportTests/CommandLineTest.TokenizeConfigFile5 (42301 of 43701)
PASS: LLVM-Unit :: Support/./SupportTests/CommandLineTest.TokenizeConfigFile4 (42302 of 43701)
PASS: LLVM-Unit :: Support/./SupportTests/CommandLineTest.TokenizeConfigFile6 (42303 of 43701)
PASS: LLVM-Unit :: Support/./SupportTests/CommandLineTest.TokenizeConfigFile7 (42304 of 43701)
PASS: LLVM-Unit :: Support/./SupportTests/CommandLineTest.TokenizeConfigFile8 (42305 of 43701)
PASS: LLVM-Unit :: Support/./SupportTests/CommandLineTest.TokenizeConfigFile9 (42306 of 43701)
PASS: LLVM-Unit :: Support/./SupportTests/CommandLineTest.TokenizeGNUCommandLine (42307 of 43701)
PASS: LLVM-Unit :: Support/./SupportTests/CommandLineTest.TokenizeWindowsCommandLine1 (42308 of 43701)
PASS: LLVM-Unit :: Support/./SupportTests/CommandLineTest.TokenizeWindowsCommandLine2 (42309 of 43701)
PASS: LLVM-Unit :: Support/./SupportTests/CommandLineTest.TokenizeWindowsCommandLineQuotedLastArgument (42310 of 43701)
PASS: LLVM-Unit :: Support/./SupportTests/CommandLineTest.UseMultipleCategories (42311 of 43701)
PASS: LLVM-Unit :: Support/./SupportTests/CommandLineTest.UseOptionCategory (42312 of 43701)
PASS: LLVM-Unit :: Support/./SupportTests/CompressionTest.ZlibCRC32 (42313 of 43701)
PASS: LLVM-Unit :: Support/./SupportTests/CompressionTest.Zlib (42314 of 43701)
PASS: LLVM-Unit :: Support/./SupportTests/ConvertUTFTest.ConvertUTF16BigEndianToUTF8String (42315 of 43701)
PASS: LLVM-Unit :: Support/./SupportTests/ConvertUTFTest.ConvertUTF16LittleEndianToUTF8String (42316 of 43701)
PASS: LLVM-Unit :: Support/./SupportTests/ConvertUTFTest.ConvertUTF8ToUTF16String (42317 of 43701)
PASS: LLVM-Unit :: Support/./SupportTests/ConvertUTFTest.UTF16WrappersForConvertUTF16ToUTF8String (42318 of 43701)
PASS: LLVM-Unit :: Support/./SupportTests/ConvertUTFTest.HasUTF16BOM (42319 of 43701)
PASS: LLVM-Unit :: Support/./SupportTests/ConvertUTFTest.ConvertUTF8toWide (42320 of 43701)
PASS: LLVM-Unit :: Support/./SupportTests/ConvertUTFTest.OddLengthInput (42321 of 43701)
PASS: LLVM-Unit :: Support/./SupportTests/ConvertUTFTest.Empty (42322 of 43701)
PASS: LLVM-Unit :: Support/./SupportTests/ConvertUTFTest.UTF8ToUTF32Lenient (42323 of 43701)
PASS: LLVM-Unit :: Support/./SupportTests/ConvertUTFTest.UTF8ToUTF32PartialLenient (42324 of 43701)
PASS: LLVM-Unit :: Support/./SupportTests/ConvertUTFTest.convertWideToUTF8 (42325 of 43701)
PASS: LLVM-Unit :: Support/./SupportTests/CostTest.DefaultCtor (42326 of 43701)
PASS: LLVM-Unit :: Support/./SupportTests/CostTest.Operators (42327 of 43701)
PASS: LLVM-Unit :: Support/./SupportTests/CrashRecoveryTest.Cleanup (42328 of 43701)
PASS: LLVM-Unit :: Support/./SupportTests/CrashRecoveryTest.LimitedStackTrace (42329 of 43701)
PASS: LLVM-Unit :: Support/./SupportTests/CrashRecoveryTest.DumpStackCleanup (42330 of 43701)
PASS: LLVM-Unit :: Support/./SupportTests/CrashRecoveryTest.Basic (42331 of 43701)
PASS: LLVM-Unit :: Support/./SupportTests/DJBTest.caseFolding (42332 of 43701)
PASS: LLVM-Unit :: Support/./SupportTests/CrashRecoveryTest.UnixCRCReturnCode (42333 of 43701)
PASS: LLVM-Unit :: Support/./SupportTests/DJBTest.knownValuesLowerCase (42334 of 43701)
PASS: LLVM-Unit :: Support/./SupportTests/DJBTest.knownValuesUnicode (42335 of 43701)
PASS: LLVM-Unit :: Support/./SupportTests/DataExtractorTest.Cursor_takeError (42336 of 43701)
PASS: LLVM-Unit :: Support/./SupportTests/DataExtractorTest.Cursor_chaining (42337 of 43701)
PASS: LLVM-Unit :: Support/./SupportTests/DataExtractorTest.FixedLengthString (42338 of 43701)
PASS: LLVM-Unit :: Support/./SupportTests/DataExtractorTest.Cursor_tell (42339 of 43701)
PASS: LLVM-Unit :: Support/./SupportTests/DataExtractorTest.GetBytes (42340 of 43701)
PASS: LLVM-Unit :: Support/./SupportTests/DataExtractorTest.OffsetOverflow (42341 of 43701)
PASS: LLVM-Unit :: Support/./SupportTests/DataExtractorTest.LEB128 (42342 of 43701)
PASS: LLVM-Unit :: Support/./SupportTests/DataExtractorTest.LEB128_error (42343 of 43701)
PASS: LLVM-Unit :: Support/./SupportTests/DataExtractorTest.Strings (42344 of 43701)
PASS: LLVM-Unit :: Support/./SupportTests/DataExtractorTest.UnsignedNumbers (42345 of 43701)
PASS: LLVM-Unit :: Support/./SupportTests/DataExtractorTest.SignedNumbers (42346 of 43701)
PASS: LLVM-Unit :: Support/./SupportTests/DataExtractorTest.getU24 (42347 of 43701)
PASS: LLVM-Unit :: Support/./SupportTests/DataExtractorTest.eof (42348 of 43701)
PASS: LLVM-Unit :: Support/./SupportTests/DataExtractorTest.getU8_vector (42349 of 43701)
PASS: LLVM-Unit :: Support/./SupportTests/DataExtractorTest.size (42350 of 43701)
PASS: LLVM-Unit :: Support/./SupportTests/DataExtractorTest.skip (42351 of 43701)
PASS: LLVM-Unit :: Support/./SupportTests/Endian.PackedEndianSpecificIntegral (42352 of 43701)
PASS: LLVM-Unit :: Support/./SupportTests/Endian.PacketEndianSpecificIntegralAsEnum (42353 of 43701)
PASS: LLVM-Unit :: Support/./SupportTests/DivBuildAttr.testBuildAttr (42354 of 43701)
PASS: LLVM-Unit :: Support/./SupportTests/Endian.Read (42355 of 43701)
PASS: LLVM-Unit :: Support/./SupportTests/Endian.ReadBitAligned (42356 of 43701)
PASS: LLVM-Unit :: Support/./SupportTests/Endian.Write (42357 of 43701)
PASS: LLVM-Unit :: Support/./SupportTests/Endian.WriteBitAligned (42358 of 43701)
PASS: LLVM-Unit :: Support/./SupportTests/EndianStream.WriteArrayLE (42359 of 43701)
PASS: LLVM-Unit :: Support/./SupportTests/EndianStream.WriteDoubleBE (42360 of 43701)
PASS: LLVM-Unit :: Support/./SupportTests/EndianStream.WriteFloatBE (42361 of 43701)
PASS: LLVM-Unit :: Support/./SupportTests/EndianStream.WriteFloatLE (42362 of 43701)
PASS: LLVM-Unit :: Support/./SupportTests/EndianStream.WriteDoubleLE (42363 of 43701)
PASS: LLVM-Unit :: Support/./SupportTests/EndianStream.WriteFloatArrayLE (42364 of 43701)
PASS: LLVM-Unit :: Support/./SupportTests/EndianStream.WriteInt32BE (42365 of 43701)
PASS: LLVM-Unit :: Support/./SupportTests/EndianStream.WriteInt32LE (42366 of 43701)
PASS: LLVM-Unit :: Support/./SupportTests/EndianStream.WriteInt64BE (42367 of 43701)
PASS: LLVM-Unit :: Support/./SupportTests/EndianStream.WriteInt64LE (42368 of 43701)
PASS: LLVM-Unit :: Support/./SupportTests/EndianStream.WriteVectorLE (42369 of 43701)
PASS: LLVM-Unit :: Support/./SupportTests/ErrnoTest.RetryAfterSignal (42370 of 43701)
PASS: LLVM-Unit :: Support/./SupportTests/EnumSizeBuildAttr.testBuildAttr (42371 of 43701)
PASS: LLVM-Unit :: Support/./SupportTests/Error.C_API (42372 of 43701)
PASS: LLVM-Unit :: Support/./SupportTests/Error.CantFailSuccess (42373 of 43701)
PASS: LLVM-Unit :: Support/./SupportTests/Error.CheckedExpectedInSuccessMode (42374 of 43701)
PASS: LLVM-Unit :: Support/./SupportTests/Error.CheckJoinErrors (42375 of 43701)
PASS: LLVM-Unit :: Support/./SupportTests/Error.CatchErrorFromHandler (42376 of 43701)
PASS: LLVM-Unit :: Support/./SupportTests/Error.CheckedSuccess (42377 of 43701)
PASS: LLVM-Unit :: Support/./SupportTests/Error.ConsumeError (42378 of 43701)
PASS: LLVM-Unit :: Support/./SupportTests/Error.ConsumeSuccess (42379 of 43701)
PASS: LLVM-Unit :: Support/./SupportTests/Error.ErrorCodeConversions (42380 of 43701)
PASS: LLVM-Unit :: Support/./SupportTests/Error.ErrorAsOutParameterChecked (42381 of 43701)
PASS: LLVM-Unit :: Support/./SupportTests/Error.ErrorMessage (42382 of 43701)
PASS: LLVM-Unit :: Support/./SupportTests/Error.ExpectedCovariance (42383 of 43701)
PASS: LLVM-Unit :: Support/./SupportTests/Error.ExpectedInFailureMode (42384 of 43701)
PASS: LLVM-Unit :: Support/./SupportTests/Error.ExpectedWithReferenceType (42385 of 43701)
PASS: LLVM-Unit :: Support/./SupportTests/Error.FailedMatcher (42386 of 43701)
PASS: LLVM-Unit :: Support/./SupportTests/Error.FileErrorTest (42387 of 43701)
PASS: LLVM-Unit :: Support/./SupportTests/Error.FailedWithMessageMatcher (42388 of 43701)
PASS: LLVM-Unit :: Support/./SupportTests/Error.FirstHandlerOnly (42389 of 43701)
PASS: LLVM-Unit :: Support/./SupportTests/Error.HandleCustomError (42390 of 43701)
PASS: LLVM-Unit :: Support/./SupportTests/Error.HandleCustomErrorWithCustomBaseClass (42391 of 43701)
PASS: LLVM-Unit :: Support/./SupportTests/Error.HandleExpectedHandledError (42392 of 43701)
PASS: LLVM-Unit :: Support/./SupportTests/Error.HandleExpectedSuccess (42393 of 43701)
PASS: LLVM-Unit :: Support/./SupportTests/Error.HandleExpectedUnhandledError (42394 of 43701)
PASS: LLVM-Unit :: Support/./SupportTests/Error.HandlerShadowing (42395 of 43701)
PASS: LLVM-Unit :: Support/./SupportTests/Error.ExitOnError (42396 of 43701)
PASS: LLVM-Unit :: Support/./SupportTests/Error.HandlerTypeDeduction (42397 of 43701)
PASS: LLVM-Unit :: Support/./SupportTests/Error.StringError (42398 of 43701)
PASS: LLVM-Unit :: Support/./SupportTests/Error.Stream (42399 of 43701)
PASS: LLVM-Unit :: Support/./SupportTests/Error.HasValueMatcher (42400 of 43701)
PASS: LLVM-Unit :: Support/./SupportTests/Error.IsAHandling (42401 of 43701)
PASS: LLVM-Unit :: Support/./SupportTests/Error.SucceededMatcher (42402 of 43701)
PASS: LLVM-Unit :: Support/./SupportTests/Error.SubtypeStringErrorTest (42403 of 43701)
PASS: LLVM-Unit :: Support/./SupportTests/Error.createStringError (42404 of 43701)
PASS: LLVM-Unit :: Support/./SupportTests/ErrorOr.Comparison (42405 of 43701)
PASS: LLVM-Unit :: Support/./SupportTests/ErrorOr.Covariant (42406 of 43701)
PASS: LLVM-Unit :: Support/./SupportTests/ErrorOr.ImplicitConversion (42407 of 43701)
PASS: LLVM-Unit :: Support/./SupportTests/ErrorOr.ImplicitConversionCausesMove (42408 of 43701)
PASS: LLVM-Unit :: Support/./SupportTests/ErrorOr.ImplicitConversionNoAmbiguity (42409 of 43701)
PASS: LLVM-Unit :: Support/./SupportTests/ErrorOr.Types (42410 of 43701)
PASS: LLVM-Unit :: Support/./SupportTests/ErrorOr.SimpleValue (42411 of 43701)
PASS: LLVM-Unit :: Support/./SupportTests/ExtensibleRTTI.cast (42412 of 43701)
PASS: LLVM-Unit :: Support/./SupportTests/ExtensibleRTTI.dyn_cast (42413 of 43701)
PASS: LLVM-Unit :: Support/./SupportTests/FP16BuildAttr.testBuildAttr (42414 of 43701)
PASS: LLVM-Unit :: Support/./SupportTests/FPArchBuildAttr.testBuildAttr (42415 of 43701)
PASS: LLVM-Unit :: Support/./SupportTests/ExtensibleRTTI.isa (42416 of 43701)
PASS: LLVM-Unit :: Support/./SupportTests/FPDenormalBuildAttr.testBuildAttr (42417 of 43701)
PASS: LLVM-Unit :: Support/./SupportTests/FPExceptionsBuildAttr.testBuildAttr (42418 of 43701)
PASS: LLVM-Unit :: Support/./SupportTests/FPHPBuildAttr.testBuildAttr (42419 of 43701)
PASS: LLVM-Unit :: Support/./SupportTests/FPNumberModelBuildAttr.testBuildAttr (42420 of 43701)
PASS: LLVM-Unit :: Support/./SupportTests/FPRoundingBuildAttr.testBuildAttr (42421 of 43701)
PASS: LLVM-Unit :: Support/./SupportTests/FPUserExceptionsBuildAttr.testBuildAttr (42422 of 43701)
PASS: LLVM-Unit :: Support/./SupportTests/FSUniqueIDTest.equals (42423 of 43701)
PASS: LLVM-Unit :: Support/./SupportTests/FSUniqueIDTest.construct (42424 of 43701)
PASS: LLVM-Unit :: Support/./SupportTests/FileCollectorTest.Symlinks (42425 of 43701)
PASS: LLVM-Unit :: Support/./SupportTests/FSUniqueIDTest.less (42426 of 43701)
PASS: LLVM-Unit :: Support/./SupportTests/FileCollectorTest.addFile (42427 of 43701)
PASS: LLVM-Unit :: Support/./SupportTests/FileCollectorTest.addDirectory (42428 of 43701)
PASS: LLVM-Unit :: Support/./SupportTests/FileCollectorTest.copyFiles (42429 of 43701)
PASS: LLVM-Unit :: Support/./SupportTests/FileCollectorTest.recordAndConstructDirectory (42430 of 43701)
PASS: LLVM-Unit :: Support/./SupportTests/FileCollectorTest.recordVFSAccesses (42431 of 43701)
PASS: LLVM-Unit :: Support/./SupportTests/FileCollectorTest.recordVFSSymlinkAccesses (42432 of 43701)
PASS: LLVM-Unit :: Support/./SupportTests/FileSystemTest.AppendSetsCorrectFileOffset (42433 of 43701)
PASS: LLVM-Unit :: Support/./SupportTests/FileOutputBuffer.Test (42434 of 43701)
PASS: LLVM-Unit :: Support/./SupportTests/FileSystemTest.CreateAlways (42435 of 43701)
PASS: LLVM-Unit :: Support/./SupportTests/FileSystemTest.CreateDir (42436 of 43701)
PASS: LLVM-Unit :: Support/./SupportTests/FileSystemTest.BrokenSymlinkDirectoryIteration (42437 of 43701)
PASS: LLVM-Unit :: Support/./SupportTests/FileSystemTest.CreateNew (42438 of 43701)
PASS: LLVM-Unit :: Support/./SupportTests/FileSystemTest.DirectoryNotExecutable (42439 of 43701)
PASS: LLVM-Unit :: Support/./SupportTests/FileSystemTest.DirectoryIteration (42440 of 43701)
PASS: LLVM-Unit :: Support/./SupportTests/FileSystemTest.ExpandTilde (42441 of 43701)
PASS: LLVM-Unit :: Support/./SupportTests/FileSystemTest.FileMapping (42442 of 43701)
PASS: LLVM-Unit :: Support/./SupportTests/FileSystemTest.MD5 (42443 of 43701)
PASS: LLVM-Unit :: Support/./SupportTests/FileSystemTest.OpenExisting (42444 of 43701)
PASS: LLVM-Unit :: Support/./SupportTests/FileSystemTest.OpenAlways (42445 of 43701)
PASS: LLVM-Unit :: Support/./SupportTests/FileSystemTest.OpenFileForRead (42446 of 43701)
PASS: LLVM-Unit :: Support/./SupportTests/FileSystemTest.ReadOnlyFileCantWrite (42447 of 43701)
PASS: LLVM-Unit :: Support/./SupportTests/FileSystemTest.ReadWriteFileCanReadOrWrite (42448 of 43701)
PASS: LLVM-Unit :: Support/./SupportTests/FileSystemTest.RealPath (42449 of 43701)
PASS: LLVM-Unit :: Support/./SupportTests/FileSystemTest.RealPathNoReadPerm (42450 of 43701)
PASS: LLVM-Unit :: Support/./SupportTests/FileSystemTest.Remove (42451 of 43701)
PASS: LLVM-Unit :: Support/./SupportTests/FileSystemTest.Resize (42452 of 43701)
PASS: LLVM-Unit :: Support/./SupportTests/FileSystemTest.ResizeBeforeMapping (42453 of 43701)
PASS: LLVM-Unit :: Support/./SupportTests/FileSystemTest.RespectUmask (42454 of 43701)
PASS: LLVM-Unit :: Support/./SupportTests/FileSystemTest.TempFileCollisions (42455 of 43701)
PASS: LLVM-Unit :: Support/./SupportTests/FileSystemTest.TempFileDiscardDiscard (42456 of 43701)
PASS: LLVM-Unit :: Support/./SupportTests/FileSystemTest.TempFileKeepDiscard (42457 of 43701)
PASS: LLVM-Unit :: Support/./SupportTests/FileSystemTest.Unique (42458 of 43701)
PASS: LLVM-Unit :: Support/./SupportTests/FileSystemTest.TempFiles (42459 of 43701)
PASS: LLVM-Unit :: Support/./SupportTests/FileSystemTest.WriteOnlyFileCantRead (42460 of 43701)
PASS: LLVM-Unit :: Support/./SupportTests/FileSystemTest.getUmask (42461 of 43701)
PASS: LLVM-Unit :: Support/./SupportTests/FileSystemTest.is_local (42462 of 43701)
PASS: LLVM-Unit :: Support/./SupportTests/FileSystemTest.readNativeFile (42463 of 43701)
PASS: LLVM-Unit :: Support/./SupportTests/FileSystemTest.permissions (42464 of 43701)
PASS: LLVM-Unit :: Support/./SupportTests/FileSystemTest.readNativeFileSlice (42465 of 43701)
PASS: LLVM-Unit :: Support/./SupportTests/FileSystemTest.set_current_path (42466 of 43701)
PASS: LLVM-Unit :: Support/./SupportTests/FormatVariadicTest.Adapter (42467 of 43701)
PASS: LLVM-Unit :: Support/./SupportTests/FormatVariadicTest.BoolTest (42468 of 43701)
PASS: LLVM-Unit :: Support/./SupportTests/FormatVariadicTest.BigTest (42469 of 43701)
PASS: LLVM-Unit :: Support/./SupportTests/FormatVariadicTest.CharFormatting (42470 of 43701)
PASS: LLVM-Unit :: Support/./SupportTests/FormatVariadicTest.CopiesAndMoves (42471 of 43701)
PASS: LLVM-Unit :: Support/./SupportTests/FormatVariadicTest.DefaultReplacementValues (42472 of 43701)
PASS: LLVM-Unit :: Support/./SupportTests/FormatVariadicTest.CustomPaddingCharacter (42473 of 43701)
PASS: LLVM-Unit :: Support/./SupportTests/FormatVariadicTest.EmptyFormatString (42474 of 43701)
PASS: LLVM-Unit :: Support/./SupportTests/FormatVariadicTest.DoubleFormatting (42475 of 43701)
PASS: LLVM-Unit :: Support/./SupportTests/FormatVariadicTest.EscapedBrace (42476 of 43701)
PASS: LLVM-Unit :: Support/./SupportTests/FormatVariadicTest.FormatAdapter (42477 of 43701)
PASS: LLVM-Unit :: Support/./SupportTests/FormatVariadicTest.FormatBasicTypesOneReplacement (42478 of 43701)
PASS: LLVM-Unit :: Support/./SupportTests/FormatVariadicTest.FormatError (42479 of 43701)
PASS: LLVM-Unit :: Support/./SupportTests/FormatVariadicTest.FormatFormatvObject (42480 of 43701)
PASS: LLVM-Unit :: Support/./SupportTests/FormatVariadicTest.FormatNoReplacements (42481 of 43701)
PASS: LLVM-Unit :: Support/./SupportTests/FormatVariadicTest.FormatStreamable (42482 of 43701)
PASS: LLVM-Unit :: Support/./SupportTests/FormatVariadicTest.ImplicitConversions (42483 of 43701)
PASS: LLVM-Unit :: Support/./SupportTests/FormatVariadicTest.IntegralHexFormatting (42484 of 43701)
PASS: LLVM-Unit :: Support/./SupportTests/FormatVariadicTest.IntegralNumberFormatting (42485 of 43701)
PASS: LLVM-Unit :: Support/./SupportTests/FormatVariadicTest.MoveConstructor (42486 of 43701)
PASS: LLVM-Unit :: Support/./SupportTests/FormatVariadicTest.MultipleReplacements (42487 of 43701)
PASS: LLVM-Unit :: Support/./SupportTests/FormatVariadicTest.PointerFormatting (42488 of 43701)
PASS: LLVM-Unit :: Support/./SupportTests/FormatVariadicTest.NoReplacements (42489 of 43701)
PASS: LLVM-Unit :: Support/./SupportTests/FormatVariadicTest.Range (42490 of 43701)
PASS: LLVM-Unit :: Support/./SupportTests/FormatVariadicTest.StringFormatting (42491 of 43701)
PASS: LLVM-Unit :: Support/./SupportTests/FormatVariadicTest.ValidReplacementSequence (42492 of 43701)
PASS: LLVM-Unit :: Support/./SupportTests/GetOptionWidthTest.GetOptionWidthArgNameLonger (42493 of 43701)
PASS: LLVM-Unit :: Support/./SupportTests/GetOptionWidthTest.GetOptionWidthEmptyOptionNameLonger (42494 of 43701)
PASS: LLVM-Unit :: Support/./SupportTests/GetOptionWidthTest.GetOptionWidthFirstOptionNameLonger (42495 of 43701)
PASS: LLVM-Unit :: Support/./SupportTests/GetOptionWidthTest.GetOptionWidthValueOptionalEmptyOptionWithNoDescription (42496 of 43701)
PASS: LLVM-Unit :: Support/./SupportTests/GetOptionWidthTest.GetOptionWidthSecondOptionNameLonger (42497 of 43701)
PASS: LLVM-Unit :: Support/./SupportTests/GlobPatternTest.BasicCharacterClass (42498 of 43701)
PASS: LLVM-Unit :: Support/./SupportTests/GetOptionWidthTest.GetOptionWidthValueRequiredEmptyOptionWithNoDescription (42499 of 43701)
PASS: LLVM-Unit :: Support/./SupportTests/GlobPatternTest.BracketFrontOfCharacterClass (42500 of 43701)
PASS: LLVM-Unit :: Support/./SupportTests/GlobPatternTest.Empty (42501 of 43701)
PASS: LLVM-Unit :: Support/./SupportTests/GlobPatternTest.Escape (42502 of 43701)
PASS: LLVM-Unit :: Support/./SupportTests/GlobPatternTest.ExtSym (42503 of 43701)
PASS: LLVM-Unit :: Support/./SupportTests/GlobPatternTest.Glob (42504 of 43701)
PASS: LLVM-Unit :: Support/./SupportTests/GlobPatternTest.IsTrivialMatchAll (42505 of 43701)
PASS: LLVM-Unit :: Support/./SupportTests/GlobPatternTest.Invalid (42506 of 43701)
PASS: LLVM-Unit :: Support/./SupportTests/GlobPatternTest.Wildcard (42507 of 43701)
PASS: LLVM-Unit :: Support/./SupportTests/GlobPatternTest.NegatedCharacterClass (42508 of 43701)
PASS: LLVM-Unit :: Support/./SupportTests/HardFPBuildAttr.testBuildAttr (42509 of 43701)
PASS: LLVM-Unit :: Support/./SupportTests/GlobPatternTest.SpecialCharsInCharacterClass (42510 of 43701)
PASS: LLVM-Unit :: Support/./SupportTests/HostTest.DummyRunAndGetCommandOutputUse (42511 of 43701)
PASS: LLVM-Unit :: Support/./SupportTests/HostTest.NumPhysicalCores (42512 of 43701)
PASS: LLVM-Unit :: Support/./SupportTests/HostTest.getMacOSHostVersion (42513 of 43701)
PASS: LLVM-Unit :: Support/./SupportTests/InMemoryFileSystemTest.AddDirectoryThenAddChild (42514 of 43701)
PASS: LLVM-Unit :: Support/./SupportTests/InMemoryFileSystemTest.AddFileInPlaceOfAHardLinkWithDifferentContent (42515 of 43701)
PASS: LLVM-Unit :: Support/./SupportTests/InMemoryFileSystemTest.AddFileInPlaceOfAHardLinkWithSameContent (42516 of 43701)
PASS: LLVM-Unit :: Support/./SupportTests/InMemoryFileSystemTest.AddFileWithFileType (42517 of 43701)
PASS: LLVM-Unit :: Support/./SupportTests/InMemoryFileSystemTest.AddFileWithGroup (42518 of 43701)
PASS: LLVM-Unit :: Support/./SupportTests/InMemoryFileSystemTest.AddFileWithPerms (42519 of 43701)
PASS: LLVM-Unit :: Support/./SupportTests/InMemoryFileSystemTest.AddFileWithUser (42520 of 43701)
PASS: LLVM-Unit :: Support/./SupportTests/InMemoryFileSystemTest.AddHardLinkFromADirectory (42521 of 43701)
PASS: LLVM-Unit :: Support/./SupportTests/InMemoryFileSystemTest.AddHardLinkFromAFileThatWasAddedBefore (42522 of 43701)
PASS: LLVM-Unit :: Support/./SupportTests/InMemoryFileSystemTest.AddHardLinkInChainPattern (42523 of 43701)
PASS: LLVM-Unit :: Support/./SupportTests/InMemoryFileSystemTest.AddHardLinkToADirectory (42524 of 43701)
PASS: LLVM-Unit :: Support/./SupportTests/InMemoryFileSystemTest.AddHardLinkToAFileThatWasNotAddedBefore (42525 of 43701)
PASS: LLVM-Unit :: Support/./SupportTests/InMemoryFileSystemTest.AddHardLinkToFile (42526 of 43701)
PASS: LLVM-Unit :: Support/./SupportTests/InMemoryFileSystemTest.AddHardLinkUnderAFile (42527 of 43701)
PASS: LLVM-Unit :: Support/./SupportTests/InMemoryFileSystemTest.AddSameHardLinkMoreThanOnce (42528 of 43701)
PASS: LLVM-Unit :: Support/./SupportTests/InMemoryFileSystemTest.DirectoryIteration (42529 of 43701)
PASS: LLVM-Unit :: Support/./SupportTests/InMemoryFileSystemTest.DuplicatedFile (42530 of 43701)
PASS: LLVM-Unit :: Support/./SupportTests/InMemoryFileSystemTest.GetRealPath (42531 of 43701)
PASS: LLVM-Unit :: Support/./SupportTests/InMemoryFileSystemTest.IsEmpty (42532 of 43701)
PASS: LLVM-Unit :: Support/./SupportTests/InMemoryFileSystemTest.IsLocal (42533 of 43701)
PASS: LLVM-Unit :: Support/./SupportTests/InMemoryFileSystemTest.OpenFileForRead (42534 of 43701)
PASS: LLVM-Unit :: Support/./SupportTests/InMemoryFileSystemTest.OverlayFile (42535 of 43701)
PASS: LLVM-Unit :: Support/./SupportTests/InMemoryFileSystemTest.OverlayFileNoOwn (42536 of 43701)
PASS: LLVM-Unit :: Support/./SupportTests/InMemoryFileSystemTest.RecursiveIterationWithHardLink (42537 of 43701)
PASS: LLVM-Unit :: Support/./SupportTests/InMemoryFileSystemTest.StatusName (42538 of 43701)
PASS: LLVM-Unit :: Support/./SupportTests/InMemoryFileSystemTest.WindowsPath (42539 of 43701)
PASS: LLVM-Unit :: Support/./SupportTests/InMemoryFileSystemTest.WorkingDirectory (42540 of 43701)
PASS: LLVM-Unit :: Support/./SupportTests/Initialize.MultipleThreads (42541 of 43701)
PASS: LLVM-Unit :: Support/./SupportTests/ItaniumManglingCanonicalizerTest.TestBadEquivalenceOrder (42542 of 43701)
PASS: LLVM-Unit :: Support/./SupportTests/ItaniumManglingCanonicalizerTest.TestCanonicalize (42543 of 43701)
PASS: LLVM-Unit :: Support/./SupportTests/ItaniumManglingCanonicalizerTest.TestForwardTemplateReference (42544 of 43701)
PASS: LLVM-Unit :: Support/./SupportTests/ItaniumManglingCanonicalizerTest.TestLookup (42545 of 43701)
PASS: LLVM-Unit :: Support/./SupportTests/ItaniumManglingCanonicalizerTest.TestInvalidManglings (42546 of 43701)
PASS: LLVM-Unit :: Support/./SupportTests/JSONTest.Array (42547 of 43701)
PASS: LLVM-Unit :: Support/./SupportTests/JSONTest.CanonicalOutput (42548 of 43701)
PASS: LLVM-Unit :: Support/./SupportTests/JSONTest.Constructors (42549 of 43701)
PASS: LLVM-Unit :: Support/./SupportTests/JSONTest.Escaping (42550 of 43701)
PASS: LLVM-Unit :: Support/./SupportTests/JSONTest.Inspection (42551 of 43701)
PASS: LLVM-Unit :: Support/./SupportTests/JSONTest.Deserialize (42552 of 43701)
PASS: LLVM-Unit :: Support/./SupportTests/JSONTest.Integers (42553 of 43701)
PASS: LLVM-Unit :: Support/./SupportTests/JSONTest.Object (42554 of 43701)
PASS: LLVM-Unit :: Support/./SupportTests/JSONTest.ParseDeserialize (42555 of 43701)
PASS: LLVM-Unit :: Support/./SupportTests/JSONTest.ParseErrors (42556 of 43701)
PASS: LLVM-Unit :: Support/./SupportTests/JSONTest.Parse (42557 of 43701)
PASS: LLVM-Unit :: Support/./SupportTests/JSONTest.Path (42558 of 43701)
PASS: LLVM-Unit :: Support/./SupportTests/JSONTest.PrettyPrinting (42559 of 43701)
PASS: LLVM-Unit :: Support/./SupportTests/JSONTest.Stream (42560 of 43701)
PASS: LLVM-Unit :: Support/./SupportTests/JSONTest.StringOwnership (42561 of 43701)
PASS: LLVM-Unit :: Support/./SupportTests/JSONTest.Types (42562 of 43701)
PASS: LLVM-Unit :: Support/./SupportTests/JSONTest.UTF8 (42563 of 43701)
PASS: LLVM-Unit :: Support/./SupportTests/KnownBitsTest.AddSubExhaustive (42564 of 43701)
PASS: LLVM-Unit :: Support/./SupportTests/KnownBitsTest.AddCarryExhaustive (42565 of 43701)
PASS: LLVM-Unit :: Support/./SupportTests/KnownBitsTest.CommonBitsSet (42566 of 43701)
PASS: LLVM-Unit :: Support/./SupportTests/KnownBitsTest.GetMinMaxVal (42567 of 43701)
PASS: LLVM-Unit :: Support/./SupportTests/KnownBitsTest.GetSignedMinMaxVal (42568 of 43701)
PASS: LLVM-Unit :: Support/./SupportTests/KnownBitsTest.BinaryExhaustive (42569 of 43701)
PASS: LLVM-Unit :: Support/./SupportTests/KnownBitsTest.ICmpExhaustive (42570 of 43701)
PASS: LLVM-Unit :: Support/./SupportTests/KnownBitsTest.SExtInReg (42571 of 43701)
PASS: LLVM-Unit :: Support/./SupportTests/KnownBitsTest.UnaryExhaustive (42572 of 43701)
PASS: LLVM-Unit :: Support/./SupportTests/KnownBitsTest.SExtOrTrunc (42573 of 43701)
PASS: LLVM-Unit :: Support/./SupportTests/LEB128Test.DecodeInvalidSLEB128 (42574 of 43701)
PASS: LLVM-Unit :: Support/./SupportTests/LEB128Test.DecodeSLEB128 (42575 of 43701)
PASS: LLVM-Unit :: Support/./SupportTests/LEB128Test.DecodeInvalidULEB128 (42576 of 43701)
PASS: LLVM-Unit :: Support/./SupportTests/LEB128Test.DecodeULEB128 (42577 of 43701)
PASS: LLVM-Unit :: Support/./SupportTests/LEB128Test.EncodeSLEB128 (42578 of 43701)
PASS: LLVM-Unit :: Support/./SupportTests/LEB128Test.EncodeULEB128 (42579 of 43701)
PASS: LLVM-Unit :: Support/./SupportTests/LEB128Test.SLEB128Size (42580 of 43701)
PASS: LLVM-Unit :: Support/./SupportTests/LineIteratorTest.BlankKeeping (42581 of 43701)
PASS: LLVM-Unit :: Support/./SupportTests/LineIteratorTest.Basic (42582 of 43701)
PASS: LLVM-Unit :: Support/./SupportTests/LineIteratorTest.BlankSkipping (42583 of 43701)
PASS: LLVM-Unit :: Support/./SupportTests/LineIteratorTest.CommentSkippingKeepBlanks (42584 of 43701)
PASS: LLVM-Unit :: Support/./SupportTests/LEB128Test.ULEB128Size (42585 of 43701)
PASS: LLVM-Unit :: Support/./SupportTests/LineIteratorTest.CommentAndBlankSkipping (42586 of 43701)
PASS: LLVM-Unit :: Support/./SupportTests/LineIteratorTest.EmptyBuffers (42587 of 43701)
PASS: LLVM-Unit :: Support/./SupportTests/LineIteratorTest.Ref (42588 of 43701)
PASS: LLVM-Unit :: Support/./SupportTests/LinearPolyBase.Poly3D_Equality (42589 of 43701)
PASS: LLVM-Unit :: Support/./SupportTests/LinearPolyBase.Poly3D_Invert (42590 of 43701)
PASS: LLVM-Unit :: Support/./SupportTests/LinearPolyBase.Poly3D_Add (42591 of 43701)
PASS: LLVM-Unit :: Support/./SupportTests/LinearPolyBase.Poly3D_GetValue (42592 of 43701)
PASS: LLVM-Unit :: Support/./SupportTests/LinearPolyBase.Poly3D_Scale (42593 of 43701)
PASS: LLVM-Unit :: Support/./SupportTests/LinearPolyBase.Poly3D_isZero (42594 of 43701)
PASS: LLVM-Unit :: Support/./SupportTests/LinearPolyBase.Poly3D_Sub (42595 of 43701)
PASS: LLVM-Unit :: Support/./SupportTests/LockFileManagerTest.Basic (42596 of 43701)
PASS: LLVM-Unit :: Support/./SupportTests/LockFileManagerTest.RelativePath (42597 of 43701)
PASS: LLVM-Unit :: Support/./SupportTests/MD5HashTest.MD5 (42598 of 43701)
PASS: LLVM-Unit :: Support/./SupportTests/LockFileManagerTest.LinkLockExists (42599 of 43701)
PASS: LLVM-Unit :: Support/./SupportTests/MD5Test.MD5 (42600 of 43701)
PASS: LLVM-Unit :: Support/./SupportTests/MPBuildAttr.testBuildAttr (42601 of 43701)
PASS: LLVM-Unit :: Support/./SupportTests/MVEBuildAttr.testBuildAttr (42602 of 43701)
PASS: LLVM-Unit :: Support/./SupportTests/ManagedStaticTest.CustomCreatorDeletor (42603 of 43701)
PASS: LLVM-Unit :: Support/./SupportTests/ManagedStaticTest.NestedStatics (42604 of 43701)
PASS: LLVM-Unit :: Support/./SupportTests/MatchersTest.Optional (42605 of 43701)
PASS: LLVM-Unit :: Support/./SupportTests/MathExtras.CTLog2 (42606 of 43701)
PASS: LLVM-Unit :: Support/./SupportTests/MathExtras.DoubleBits (42607 of 43701)
PASS: LLVM-Unit :: Support/./SupportTests/MathExtras.IsShiftedUInt (42608 of 43701)
PASS: LLVM-Unit :: Support/./SupportTests/MathExtras.FloatBits (42609 of 43701)
PASS: LLVM-Unit :: Support/./SupportTests/MathExtras.IsShiftedInt (42610 of 43701)
PASS: LLVM-Unit :: Support/./SupportTests/MathExtras.MinAlign (42611 of 43701)
PASS: LLVM-Unit :: Support/./SupportTests/MathExtras.NextPowerOf2 (42612 of 43701)
PASS: LLVM-Unit :: Support/./SupportTests/MathExtras.PowerOf2Ceil (42613 of 43701)
PASS: LLVM-Unit :: Support/./SupportTests/MathExtras.PowerOf2Floor (42614 of 43701)
PASS: LLVM-Unit :: Support/./SupportTests/MathExtras.SaturatingAdd (42615 of 43701)
PASS: LLVM-Unit :: Support/./SupportTests/MathExtras.SaturatingMultiplyAdd (42616 of 43701)
PASS: LLVM-Unit :: Support/./SupportTests/MathExtras.countLeadingOnes (42617 of 43701)
PASS: LLVM-Unit :: Support/./SupportTests/MathExtras.alignTo (42618 of 43701)
PASS: LLVM-Unit :: Support/./SupportTests/MathExtras.SaturatingMultiply (42619 of 43701)
PASS: LLVM-Unit :: Support/./SupportTests/MathExtras.countLeadingZeros (42620 of 43701)
PASS: LLVM-Unit :: Support/./SupportTests/MathExtras.countTrailingZeros (42621 of 43701)
PASS: LLVM-Unit :: Support/./SupportTests/MathExtras.findFirstSet (42622 of 43701)
PASS: LLVM-Unit :: Support/./SupportTests/MathExtras.isIntN (42623 of 43701)
PASS: LLVM-Unit :: Support/./SupportTests/MathExtras.isPowerOf2_32 (42624 of 43701)
PASS: LLVM-Unit :: Support/./SupportTests/MathExtras.isUIntN (42625 of 43701)
PASS: LLVM-Unit :: Support/./SupportTests/MathExtras.findLastSet (42626 of 43701)
PASS: LLVM-Unit :: Support/./SupportTests/MathExtras.maxIntN (42627 of 43701)
PASS: LLVM-Unit :: Support/./SupportTests/MathExtras.isPowerOf2_64 (42628 of 43701)
PASS: LLVM-Unit :: Support/./SupportTests/MathExtras.maxUIntN (42629 of 43701)
PASS: LLVM-Unit :: Support/./SupportTests/MathExtras.minIntN (42630 of 43701)
PASS: LLVM-Unit :: Support/./SupportTests/MathExtras.onesMask (42631 of 43701)
PASS: LLVM-Unit :: Support/./SupportTests/MathExtras.reverseBits (42632 of 43701)
PASS: LLVM-Unit :: Support/./SupportTests/MemoryBufferRefTest.compareEquals (42633 of 43701)
PASS: LLVM-Unit :: Support/./SupportTests/MemoryBufferRefTest.construct (42634 of 43701)
PASS: LLVM-Unit :: Support/./SupportTests/MemoryBufferTest.copy (42635 of 43701)
PASS: LLVM-Unit :: Support/./SupportTests/MemoryBufferTest.NullTerminator4K (42636 of 43701)
PASS: LLVM-Unit :: Support/./SupportTests/MemoryBufferTest.createFromPipe (42637 of 43701)
PASS: LLVM-Unit :: Support/./SupportTests/MemoryBufferTest.get (42638 of 43701)
PASS: LLVM-Unit :: Support/./SupportTests/MemoryBufferTest.getOpenFile (42639 of 43701)
PASS: LLVM-Unit :: Support/./SupportTests/MemoryBufferTest.getOpenFileReopened (42640 of 43701)
PASS: LLVM-Unit :: Support/./SupportTests/MemoryBufferTest.make_new (42641 of 43701)
PASS: LLVM-Unit :: Support/./SupportTests/MemoryBufferTest.mmapVolatileNoNull (42642 of 43701)
PASS: LLVM-Unit :: Support/./SupportTests/MemoryBufferTest.slice (42643 of 43701)
PASS: LLVM-Unit :: Support/./SupportTests/MemoryBufferTest.writableSlice (42644 of 43701)
PASS: LLVM-Unit :: Support/./SupportTests/MemoryBufferTest.writeThroughFile (42645 of 43701)
PASS: LLVM-Unit :: Support/./SupportTests/NativeFormatTest.BasicFloatingPointTests (42646 of 43701)
PASS: LLVM-Unit :: Support/./SupportTests/MemoryBufferTest.getOpenFileNoReopen (42647 of 43701)
PASS: LLVM-Unit :: Support/./SupportTests/NativeFormatTest.BasicIntegerTests (42648 of 43701)
PASS: LLVM-Unit :: Support/./SupportTests/NativeFormatTest.BoundaryTests (42649 of 43701)
PASS: LLVM-Unit :: Support/./SupportTests/NativeFormatTest.CommaTests (42650 of 43701)
PASS: LLVM-Unit :: Support/./SupportTests/NativeFormatTest.HexTests (42651 of 43701)
PASS: LLVM-Unit :: Support/./SupportTests/NativeFormatTest.IntegerTests (42652 of 43701)
PASS: LLVM-Unit :: Support/./SupportTests/OptimizedStructLayoutTest.Basic (42653 of 43701)
PASS: LLVM-Unit :: Support/./SupportTests/OptimizedStructLayoutTest.Gaps (42654 of 43701)
PASS: LLVM-Unit :: Support/./SupportTests/OptimizedStructLayoutTest.GardenPath (42655 of 43701)
PASS: LLVM-Unit :: Support/./SupportTests/OptimizedStructLayoutTest.Greed (42656 of 43701)
PASS: LLVM-Unit :: Support/./SupportTests/OptimizedStructLayoutTest.Jagged (42657 of 43701)
PASS: LLVM-Unit :: Support/./SupportTests/OverflowTest/0.AddNoOverflow (42658 of 43701)
PASS: LLVM-Unit :: Support/./SupportTests/OptimizedStructLayoutTest.OddSize (42659 of 43701)
PASS: LLVM-Unit :: Support/./SupportTests/OverflowTest/0.AddOverflowToMax (42660 of 43701)
PASS: LLVM-Unit :: Support/./SupportTests/OverflowTest/0.AddOverflowToMin (42661 of 43701)
PASS: LLVM-Unit :: Support/./SupportTests/OverflowTest/0.AddOverflowToZero (42662 of 43701)
PASS: LLVM-Unit :: Support/./SupportTests/OverflowTest/0.AddOverflowToNegative (42663 of 43701)
PASS: LLVM-Unit :: Support/./SupportTests/OverflowTest/0.MulNoOverflow (42664 of 43701)
PASS: LLVM-Unit :: Support/./SupportTests/OverflowTest/0.MulNoOverflowToMax (42665 of 43701)
PASS: LLVM-Unit :: Support/./SupportTests/OverflowTest/0.MulOverflowMax (42666 of 43701)
PASS: LLVM-Unit :: Support/./SupportTests/OverflowTest/0.MulResultZero (42667 of 43701)
PASS: LLVM-Unit :: Support/./SupportTests/OverflowTest/0.SubNoOverflow (42668 of 43701)
PASS: LLVM-Unit :: Support/./SupportTests/OverflowTest/0.MulOverflowToMin (42669 of 43701)
PASS: LLVM-Unit :: Support/./SupportTests/OverflowTest/0.SubOverflowToMax (42670 of 43701)
PASS: LLVM-Unit :: Support/./SupportTests/OverflowTest/0.SubOverflowToMin (42671 of 43701)
PASS: LLVM-Unit :: Support/./SupportTests/OverflowTest/0.SubOverflowToNegative (42672 of 43701)
PASS: LLVM-Unit :: Support/./SupportTests/OverflowTest/1.AddNoOverflow (42673 of 43701)
PASS: LLVM-Unit :: Support/./SupportTests/OverflowTest/0.SubOverflowToPositive (42674 of 43701)
PASS: LLVM-Unit :: Support/./SupportTests/OverflowTest/1.AddOverflowToMax (42675 of 43701)
PASS: LLVM-Unit :: Support/./SupportTests/OverflowTest/1.AddOverflowToMin (42676 of 43701)
PASS: LLVM-Unit :: Support/./SupportTests/OverflowTest/1.AddOverflowToNegative (42677 of 43701)
PASS: LLVM-Unit :: Support/./SupportTests/OverflowTest/1.AddOverflowToZero (42678 of 43701)
PASS: LLVM-Unit :: Support/./SupportTests/OverflowTest/1.MulNoOverflow (42679 of 43701)
PASS: LLVM-Unit :: Support/./SupportTests/OverflowTest/1.MulNoOverflowToMax (42680 of 43701)
PASS: LLVM-Unit :: Support/./SupportTests/OverflowTest/1.MulOverflowMax (42681 of 43701)
PASS: LLVM-Unit :: Support/./SupportTests/OverflowTest/1.MulOverflowToMin (42682 of 43701)
PASS: LLVM-Unit :: Support/./SupportTests/OverflowTest/1.SubOverflowToMax (42683 of 43701)
PASS: LLVM-Unit :: Support/./SupportTests/OverflowTest/1.MulResultZero (42684 of 43701)
PASS: LLVM-Unit :: Support/./SupportTests/OverflowTest/1.SubNoOverflow (42685 of 43701)
PASS: LLVM-Unit :: Support/./SupportTests/OverflowTest/1.SubOverflowToMin (42686 of 43701)
PASS: LLVM-Unit :: Support/./SupportTests/OverflowTest/1.SubOverflowToNegative (42687 of 43701)
PASS: LLVM-Unit :: Support/./SupportTests/OverflowTest/1.SubOverflowToPositive (42688 of 43701)
PASS: LLVM-Unit :: Support/./SupportTests/OverflowTest/2.AddNoOverflow (42689 of 43701)
PASS: LLVM-Unit :: Support/./SupportTests/OverflowTest/2.AddOverflowToMax (42690 of 43701)
PASS: LLVM-Unit :: Support/./SupportTests/OverflowTest/2.AddOverflowToMin (42691 of 43701)
PASS: LLVM-Unit :: Support/./SupportTests/OverflowTest/2.MulNoOverflow (42692 of 43701)
PASS: LLVM-Unit :: Support/./SupportTests/OverflowTest/2.AddOverflowToNegative (42693 of 43701)
PASS: LLVM-Unit :: Support/./SupportTests/OverflowTest/2.AddOverflowToZero (42694 of 43701)
PASS: LLVM-Unit :: Support/./SupportTests/OverflowTest/2.MulNoOverflowToMax (42695 of 43701)
PASS: LLVM-Unit :: Support/./SupportTests/OverflowTest/2.MulOverflowMax (42696 of 43701)
PASS: LLVM-Unit :: Support/./SupportTests/OverflowTest/2.MulOverflowToMin (42697 of 43701)
PASS: LLVM-Unit :: Support/./SupportTests/OverflowTest/2.MulResultZero (42698 of 43701)
PASS: LLVM-Unit :: Support/./SupportTests/OverflowTest/2.SubNoOverflow (42699 of 43701)
PASS: LLVM-Unit :: Support/./SupportTests/OverflowTest/2.SubOverflowToMax (42700 of 43701)
PASS: LLVM-Unit :: Support/./SupportTests/OverflowTest/2.SubOverflowToNegative (42701 of 43701)
PASS: LLVM-Unit :: Support/./SupportTests/OverflowTest/2.SubOverflowToPositive (42702 of 43701)
PASS: LLVM-Unit :: Support/./SupportTests/OverflowTest/3.AddNoOverflow (42703 of 43701)
PASS: LLVM-Unit :: Support/./SupportTests/OverflowTest/2.SubOverflowToMin (42704 of 43701)
PASS: LLVM-Unit :: Support/./SupportTests/OverflowTest/3.AddOverflowToMax (42705 of 43701)
PASS: LLVM-Unit :: Support/./SupportTests/OverflowTest/3.AddOverflowToNegative (42706 of 43701)
PASS: LLVM-Unit :: Support/./SupportTests/OverflowTest/3.AddOverflowToMin (42707 of 43701)
PASS: LLVM-Unit :: Support/./SupportTests/OverflowTest/3.AddOverflowToZero (42708 of 43701)
PASS: LLVM-Unit :: Support/./SupportTests/OverflowTest/3.MulNoOverflow (42709 of 43701)
PASS: LLVM-Unit :: Support/./SupportTests/OverflowTest/3.MulNoOverflowToMax (42710 of 43701)
PASS: LLVM-Unit :: Support/./SupportTests/OverflowTest/3.MulOverflowMax (42711 of 43701)
PASS: LLVM-Unit :: Support/./SupportTests/OverflowTest/3.MulOverflowToMin (42712 of 43701)
PASS: LLVM-Unit :: Support/./SupportTests/OverflowTest/3.MulResultZero (42713 of 43701)
PASS: LLVM-Unit :: Support/./SupportTests/OverflowTest/3.SubOverflowToMax (42714 of 43701)
PASS: LLVM-Unit :: Support/./SupportTests/OverflowTest/3.SubNoOverflow (42715 of 43701)
PASS: LLVM-Unit :: Support/./SupportTests/OverflowTest/3.SubOverflowToMin (42716 of 43701)
PASS: LLVM-Unit :: Support/./SupportTests/OverflowTest/3.SubOverflowToPositive (42717 of 43701)
PASS: LLVM-Unit :: Support/./SupportTests/OverflowTest/3.SubOverflowToNegative (42718 of 43701)
PASS: LLVM-Unit :: Support/./SupportTests/OverflowTest/4.AddNoOverflow (42719 of 43701)
PASS: LLVM-Unit :: Support/./SupportTests/OverflowTest/4.AddOverflowToMax (42720 of 43701)
PASS: LLVM-Unit :: Support/./SupportTests/OverflowTest/4.AddOverflowToMin (42721 of 43701)
PASS: LLVM-Unit :: Support/./SupportTests/OverflowTest/4.AddOverflowToNegative (42722 of 43701)
PASS: LLVM-Unit :: Support/./SupportTests/OverflowTest/4.AddOverflowToZero (42723 of 43701)
PASS: LLVM-Unit :: Support/./SupportTests/OverflowTest/4.MulNoOverflow (42724 of 43701)
PASS: LLVM-Unit :: Support/./SupportTests/OverflowTest/4.MulNoOverflowToMax (42725 of 43701)
PASS: LLVM-Unit :: Support/./SupportTests/OverflowTest/4.MulOverflowMax (42726 of 43701)
PASS: LLVM-Unit :: Support/./SupportTests/OverflowTest/4.MulOverflowToMin (42727 of 43701)
PASS: LLVM-Unit :: Support/./SupportTests/OverflowTest/4.MulResultZero (42728 of 43701)
PASS: LLVM-Unit :: Support/./SupportTests/OverflowTest/4.SubNoOverflow (42729 of 43701)
PASS: LLVM-Unit :: Support/./SupportTests/OverflowTest/4.SubOverflowToMax (42730 of 43701)
PASS: LLVM-Unit :: Support/./SupportTests/OverflowTest/4.SubOverflowToMin (42731 of 43701)
PASS: LLVM-Unit :: Support/./SupportTests/OverflowTest/4.SubOverflowToNegative (42732 of 43701)
PASS: LLVM-Unit :: Support/./SupportTests/OverflowTest/4.SubOverflowToPositive (42733 of 43701)
PASS: LLVM-Unit :: Support/./SupportTests/PCS_ConfigBuildAttr.testBuildAttr (42734 of 43701)
PASS: LLVM-Unit :: Support/./SupportTests/PCS_R9BuildAttr.testBuildAttr (42735 of 43701)
PASS: LLVM-Unit :: Support/./SupportTests/PCS_GOTBuildAttr.testBuildAttr (42736 of 43701)
PASS: LLVM-Unit :: Support/./SupportTests/PCS_RWBuildAttr.testBuildAttr (42737 of 43701)
PASS: LLVM-Unit :: Support/./SupportTests/PCS_ROBuildAttr.testBuildAttr (42738 of 43701)
PASS: LLVM-Unit :: Support/./SupportTests/PCS_WCharBuildAttr.testBuildAttr (42739 of 43701)
PASS: LLVM-Unit :: Support/./SupportTests/PageSizeTest.PageSize (42740 of 43701)
PASS: LLVM-Unit :: Support/./SupportTests/Parallel.ForEachError (42741 of 43701)
PASS: LLVM-Unit :: Support/./SupportTests/PrintOptionInfoTest.PrintOptionInfoEmptyValueDescription (42742 of 43701)
PASS: LLVM-Unit :: Support/./SupportTests/PrintOptionInfoTest.PrintOptionInfoMultilineValueDescription (42743 of 43701)
PASS: LLVM-Unit :: Support/./SupportTests/PrintOptionInfoTest.PrintOptionInfoValueOptionalWithSentinel (42744 of 43701)
PASS: LLVM-Unit :: Support/./SupportTests/Parallel.TransformReduce (42745 of 43701)
PASS: LLVM-Unit :: Support/./SupportTests/Parallel.parallel_for (42746 of 43701)
PASS: LLVM-Unit :: Support/./SupportTests/Parallel.sort (42747 of 43701)
PASS: LLVM-Unit :: Support/./SupportTests/PrintOptionInfoTest.PrintOptionInfoValueOptionalWithoutSentinel (42748 of 43701)
PASS: LLVM-Unit :: Support/./SupportTests/PrintOptionInfoTest.PrintOptionInfoValueOptionalWithSentinelWithHelp (42749 of 43701)
PASS: LLVM-Unit :: Support/./SupportTests/ProcessTest.GetProcessIdTest (42750 of 43701)
PASS: LLVM-Unit :: Support/./SupportTests/PrintOptionInfoTest.PrintOptionInfoValueRequiredWithEmptyValueName (42751 of 43701)
PASS: LLVM-Unit :: Support/./SupportTests/ProcessTest.GetRandomNumberTest (42752 of 43701)
PASS: LLVM-Unit :: Support/./SupportTests/ProgramEnvTest.CreateProcessTrailingSlash (42753 of 43701)
PASS: LLVM-Unit :: Support/./SupportTests/ProgramTest.TestWriteWithSystemEncoding (42754 of 43701)
PASS: LLVM-Unit :: Support/./SupportTests/ProxyFileSystemTest.Basic (42755 of 43701)
PASS: LLVM-Unit :: Support/./SupportTests/ProgramTest.TestExecuteNegative (42756 of 43701)
PASS: LLVM-Unit :: Support/./SupportTests/ProgramEnvTest.TestExecuteAndWaitStatistics (42757 of 43701)
PASS: LLVM-Unit :: Support/./SupportTests/ProgramEnvTest.TestLockFile (42758 of 43701)
PASS: LLVM-Unit :: Support/./SupportTests/RegexTest.Backreferences (42759 of 43701)
PASS: LLVM-Unit :: Support/./SupportTests/RegexTest.Basics (42760 of 43701)
PASS: LLVM-Unit :: Support/./SupportTests/RegexTest.Escape (42761 of 43701)
PASS: LLVM-Unit :: Support/./SupportTests/RegexTest.IsLiteralERE (42762 of 43701)
PASS: LLVM-Unit :: Support/./SupportTests/RegexTest.IsValid (42763 of 43701)
PASS: LLVM-Unit :: Support/./SupportTests/RegexTest.MatchInvalid (42764 of 43701)
PASS: LLVM-Unit :: Support/./SupportTests/RegexTest.MoveAssign (42765 of 43701)
PASS: LLVM-Unit :: Support/./SupportTests/RegexTest.MoveConstruct (42766 of 43701)
PASS: LLVM-Unit :: Support/./SupportTests/ProgramEnvTest.TestExecuteAndWaitTimeout (42767 of 43701)
PASS: LLVM-Unit :: Support/./SupportTests/RegexTest.NoArgConstructor (42768 of 43701)
PASS: LLVM-Unit :: Support/./SupportTests/RegexTest.OssFuzz3727Regression (42769 of 43701)
PASS: LLVM-Unit :: Support/./SupportTests/RegexTest.Substitution (42770 of 43701)
PASS: LLVM-Unit :: Support/./SupportTests/ReverseIterationTest.DenseMapTest1 (42771 of 43701)
PASS: LLVM-Unit :: Support/./SupportTests/ReverseIterationTest.DenseMapTest2 (42772 of 43701)
PASS: LLVM-Unit :: Support/./SupportTests/SHA256Test.SHA256 (42773 of 43701)
PASS: LLVM-Unit :: Support/./SupportTests/ScaledNumberHelpersTest.compare (42774 of 43701)
PASS: LLVM-Unit :: Support/./SupportTests/SIMDBuildAttr.testBuildAttr (42775 of 43701)
PASS: LLVM-Unit :: Support/./SupportTests/ScaledNumberHelpersTest.arithmeticOperators (42776 of 43701)
PASS: LLVM-Unit :: Support/./SupportTests/ScaledNumberHelpersTest.getAdjusted (42777 of 43701)
PASS: LLVM-Unit :: Support/./SupportTests/ScaledNumberHelpersTest.getDifference (42778 of 43701)
PASS: LLVM-Unit :: Support/./SupportTests/ScaledNumberHelpersTest.getLg (42779 of 43701)
PASS: LLVM-Unit :: Support/./SupportTests/ScaledNumberHelpersTest.getLgCeiling (42780 of 43701)
PASS: LLVM-Unit :: Support/./SupportTests/ScaledNumberHelpersTest.getProduct (42781 of 43701)
PASS: LLVM-Unit :: Support/./SupportTests/ScaledNumberHelpersTest.getRounded (42782 of 43701)
PASS: LLVM-Unit :: Support/./SupportTests/ScaledNumberHelpersTest.getSum (42783 of 43701)
PASS: LLVM-Unit :: Support/./SupportTests/ScaledNumberHelpersTest.getQuotient (42784 of 43701)
PASS: LLVM-Unit :: Support/./SupportTests/ScaledNumberHelpersTest.getLgFloor (42785 of 43701)
PASS: LLVM-Unit :: Support/./SupportTests/ScaledNumberHelpersTest.matchScales (42786 of 43701)
PASS: LLVM-Unit :: Support/./SupportTests/ScaledNumberHelpersTest.toIntBug (42787 of 43701)
PASS: LLVM-Unit :: Support/./SupportTests/SourceMgrTest.BasicError (42788 of 43701)
PASS: LLVM-Unit :: Support/./SupportTests/SourceMgrTest.BasicFixit (42789 of 43701)
PASS: LLVM-Unit :: Support/./SupportTests/SourceMgrTest.BasicNote (42790 of 43701)
PASS: LLVM-Unit :: Support/./SupportTests/SourceMgrTest.BasicRange (42791 of 43701)
PASS: LLVM-Unit :: Support/./SupportTests/SourceMgrTest.BasicRemark (42792 of 43701)
PASS: LLVM-Unit :: Support/./SupportTests/SourceMgrTest.BasicWarning (42793 of 43701)
PASS: LLVM-Unit :: Support/./SupportTests/SourceMgrTest.FixitForTab (42794 of 43701)
PASS: LLVM-Unit :: Support/./SupportTests/ProgramEnvTest.TestExecuteNoWait (42795 of 43701)
PASS: LLVM-Unit :: Support/./SupportTests/SourceMgrTest.LocationAtEmptyBuffer (42796 of 43701)
PASS: LLVM-Unit :: Support/./SupportTests/SourceMgrTest.LocationAtEndOf255ByteBuffer (42797 of 43701)
PASS: LLVM-Unit :: Support/./SupportTests/SourceMgrTest.LocationAtEndOf255ByteBufferEndingInNewline (42798 of 43701)
PASS: LLVM-Unit :: Support/./SupportTests/SourceMgrTest.LocationAtEndOf256ByteBuffer (42799 of 43701)
PASS: LLVM-Unit :: Support/./SupportTests/SourceMgrTest.LocationAtEndOf257ByteBuffer (42800 of 43701)
PASS: LLVM-Unit :: Support/./SupportTests/SourceMgrTest.LocationAtEndOf256ByteBufferEndingInNewline (42801 of 43701)
PASS: LLVM-Unit :: Support/./SupportTests/SourceMgrTest.LocationAtEndOf257ByteBufferEndingInNewline (42802 of 43701)
PASS: LLVM-Unit :: Support/./SupportTests/SourceMgrTest.LocationAtEndOfLine (42803 of 43701)
PASS: LLVM-Unit :: Support/./SupportTests/SourceMgrTest.LocationAtNewline (42804 of 43701)
PASS: LLVM-Unit :: Support/./SupportTests/SourceMgrTest.LocationBeforeEndOf255ByteBuffer (42805 of 43701)
PASS: LLVM-Unit :: Support/./SupportTests/SourceMgrTest.LocationBeforeEndOf255ByteBufferEndingInNewline (42806 of 43701)
PASS: LLVM-Unit :: Support/./SupportTests/SourceMgrTest.LocationBeforeEndOf256ByteBuffer (42807 of 43701)
PASS: LLVM-Unit :: Support/./SupportTests/SourceMgrTest.LocationBeforeEndOf256ByteBufferEndingInNewline (42808 of 43701)
PASS: LLVM-Unit :: Support/./SupportTests/SourceMgrTest.LocationBeforeEndOf257ByteBuffer (42809 of 43701)
PASS: LLVM-Unit :: Support/./SupportTests/SourceMgrTest.LocationJustAfterNonNewline (42810 of 43701)
PASS: LLVM-Unit :: Support/./SupportTests/SourceMgrTest.LocationJustAfterSoleNewline (42811 of 43701)
PASS: LLVM-Unit :: Support/./SupportTests/SourceMgrTest.LocationBeforeEndOf257ByteBufferEndingInNewline (42812 of 43701)
PASS: LLVM-Unit :: Support/./SupportTests/SourceMgrTest.LocationJustOnSoleNewline (42813 of 43701)
PASS: LLVM-Unit :: Support/./SupportTests/SourceMgrTest.LocationOnEOLOfFirstLineOfMultiline (42814 of 43701)
PASS: LLVM-Unit :: Support/./SupportTests/SourceMgrTest.LocationOnEOLOfSecondSecondLineOfMultiline (42815 of 43701)
PASS: LLVM-Unit :: Support/./SupportTests/SourceMgrTest.LocationOnFirstLineOfMultiline (42816 of 43701)
PASS: LLVM-Unit :: Support/./SupportTests/SourceMgrTest.LocationOnSecondLineOfMultiline (42817 of 43701)
PASS: LLVM-Unit :: Support/./SupportTests/SourceMgrTest.LocationPastEndOf255ByteBuffer (42818 of 43701)
PASS: LLVM-Unit :: Support/./SupportTests/SourceMgrTest.LocationOnSecondLineOfMultilineNoSecondEOL (42819 of 43701)
PASS: LLVM-Unit :: Support/./SupportTests/SourceMgrTest.LocationPastEndOf256ByteBuffer (42820 of 43701)
PASS: LLVM-Unit :: Support/./SupportTests/SourceMgrTest.LocationPastEndOf255ByteBufferEndingInNewline (42821 of 43701)
PASS: LLVM-Unit :: Support/./SupportTests/SourceMgrTest.LocationPastEndOf256ByteBufferEndingInNewline (42822 of 43701)
PASS: LLVM-Unit :: Support/./SupportTests/SourceMgrTest.LocationPastEndOf257ByteBufferEndingInNewline (42823 of 43701)
PASS: LLVM-Unit :: Support/./SupportTests/SourceMgrTest.LocationPastEndOf257ByteBuffer (42824 of 43701)
PASS: LLVM-Unit :: Support/./SupportTests/SourceMgrTest.MultiLineRange (42825 of 43701)
PASS: LLVM-Unit :: Support/./SupportTests/SourceMgrTest.MultipleRanges (42826 of 43701)
PASS: LLVM-Unit :: Support/./SupportTests/SourceMgrTest.OverlappingRanges (42827 of 43701)
PASS: LLVM-Unit :: Support/./SupportTests/SourceMgrTest.RangeWithTab (42828 of 43701)
PASS: LLVM-Unit :: Support/./SupportTests/SpecialCaseListTest.Basic (42829 of 43701)
PASS: LLVM-Unit :: Support/./SupportTests/SpecialCaseListTest.CorrectErrorLineNumberWithBlankLine (42830 of 43701)
PASS: LLVM-Unit :: Support/./SupportTests/SpecialCaseListTest.EmptySpecialCaseList (42831 of 43701)
PASS: LLVM-Unit :: Support/./SupportTests/SpecialCaseListTest.GlobalInit (42832 of 43701)
PASS: LLVM-Unit :: Support/./SupportTests/SpecialCaseListTest.EscapedSymbols (42833 of 43701)
PASS: LLVM-Unit :: Support/./SupportTests/SpecialCaseListTest.InvalidSpecialCaseList (42834 of 43701)
PASS: LLVM-Unit :: Support/./SupportTests/SpecialCaseListTest.NoTrigramsInARule (42835 of 43701)
PASS: LLVM-Unit :: Support/./SupportTests/SpecialCaseListTest.MultipleExclusions (42836 of 43701)
PASS: LLVM-Unit :: Support/./SupportTests/SpecialCaseListTest.NoTrigramsInRules (42837 of 43701)
PASS: LLVM-Unit :: Support/./SupportTests/SpecialCaseListTest.PopularTrigram (42838 of 43701)
PASS: LLVM-Unit :: Support/./SupportTests/SpecialCaseListTest.RepetitiveRule (42839 of 43701)
PASS: LLVM-Unit :: Support/./SupportTests/SpecialCaseListTest.Section (42840 of 43701)
PASS: LLVM-Unit :: Support/./SupportTests/SpecialCaseListTest.SectionRegexErrorHandling (42841 of 43701)
PASS: LLVM-Unit :: Support/./SupportTests/SpecialCaseListTest.SpecialSymbolRule (42842 of 43701)
PASS: LLVM-Unit :: Support/./SupportTests/StackAlign.testAttribute (42843 of 43701)
PASS: LLVM-Unit :: Support/./SupportTests/SuffixTreeTest.TestExclusion (42844 of 43701)
PASS: LLVM-Unit :: Support/./SupportTests/SpecialCaseListTest.Substring (42845 of 43701)
PASS: LLVM-Unit :: Support/./SupportTests/SuffixTreeTest.TestLongerRepetition (42846 of 43701)
PASS: LLVM-Unit :: Support/./SupportTests/SuffixTreeTest.TestSingleCharacterRepeat (42847 of 43701)
PASS: LLVM-Unit :: Support/./SupportTests/SuffixTreeTest.TestSingleRepetition (42848 of 43701)
PASS: LLVM-Unit :: Support/./SupportTests/SuffixTreeTest.TestTandemRepeat (42849 of 43701)
PASS: LLVM-Unit :: Support/./SupportTests/Support.AbsolutePathIteratorEnd (42850 of 43701)
PASS: LLVM-Unit :: Support/./SupportTests/Support.ConfigDirectory (42851 of 43701)
PASS: LLVM-Unit :: Support/./SupportTests/Support.HomeDirectory (42852 of 43701)
PASS: LLVM-Unit :: Support/./SupportTests/Support.FilenameParent (42853 of 43701)
PASS: LLVM-Unit :: Support/./SupportTests/Support.PathIterator (42854 of 43701)
PASS: LLVM-Unit :: Support/./SupportTests/Support.Path (42855 of 43701)
PASS: LLVM-Unit :: Support/./SupportTests/Support.PathRoot (42856 of 43701)
PASS: LLVM-Unit :: Support/./SupportTests/Support.NormalizePath (42857 of 43701)
PASS: LLVM-Unit :: Support/./SupportTests/Support.RemoveDots (42858 of 43701)
PASS: LLVM-Unit :: Support/./SupportTests/Support.RemoveLeadingDotSlash (42859 of 43701)
PASS: LLVM-Unit :: Support/./SupportTests/Support.ReplacePathPrefix (42860 of 43701)
PASS: LLVM-Unit :: Support/./SupportTests/SymbolRemappingReaderTest.DemanglingErrors (42861 of 43701)
PASS: LLVM-Unit :: Support/./SupportTests/Support.TempDirectory (42862 of 43701)
PASS: LLVM-Unit :: Support/./SupportTests/SymbolRemappingReaderTest.BadMappingOrder (42863 of 43701)
PASS: LLVM-Unit :: Support/./SupportTests/SymbolRemappingReaderTest.RemappingsAdded (42864 of 43701)
PASS: LLVM-Unit :: Support/./SupportTests/SymbolRemappingReaderTest.ParseErrors (42865 of 43701)
PASS: LLVM-Unit :: Support/./SupportTests/T2EEBuildAttr.testBuildAttr (42866 of 43701)
PASS: LLVM-Unit :: Support/./SupportTests/TarWriterTest.Basics (42867 of 43701)
PASS: LLVM-Unit :: Support/./SupportTests/TarWriterTest.Pax (42868 of 43701)
PASS: LLVM-Unit :: Support/./SupportTests/TarWriterTest.NoDuplicate (42869 of 43701)
PASS: LLVM-Unit :: Support/./SupportTests/TarWriterTest.Duplicate (42870 of 43701)
PASS: LLVM-Unit :: Support/./SupportTests/TarWriterTest.SingleFile (42871 of 43701)
PASS: LLVM-Unit :: Support/./SupportTests/TargetParserTest.AArch64ArchExtFeature (42872 of 43701)
PASS: LLVM-Unit :: Support/./SupportTests/TarWriterTest.LongFilename (42873 of 43701)
PASS: LLVM-Unit :: Support/./SupportTests/TargetParserTest.AArch64ArchFeatures (42874 of 43701)
PASS: LLVM-Unit :: Support/./SupportTests/TargetParserTest.AArch64ExtensionFeatures (42875 of 43701)
PASS: LLVM-Unit :: Support/./SupportTests/TargetParserTest.ARMArchExtFeature (42876 of 43701)
PASS: LLVM-Unit :: Support/./SupportTests/TargetParserTest.ARMExtensionFeatures (42877 of 43701)
PASS: LLVM-Unit :: Support/./SupportTests/TargetParserTest.ARMArchExtDependencies (42878 of 43701)
PASS: LLVM-Unit :: Support/./SupportTests/TargetParserTest.ARMFPUFeatures (42879 of 43701)
PASS: LLVM-Unit :: Support/./SupportTests/TargetParserTest.ARMFPURestriction (42880 of 43701)
PASS: LLVM-Unit :: Support/./SupportTests/TargetParserTest.ARMFPUVersion (42881 of 43701)
PASS: LLVM-Unit :: Support/./SupportTests/TargetParserTest.ARMFPUNeonSupportLevel (42882 of 43701)
PASS: LLVM-Unit :: Support/./SupportTests/TargetParserTest.ARMparseArchEndianAndISA (42883 of 43701)
PASS: LLVM-Unit :: Support/./SupportTests/TargetParserTest.ARMparseArchVersion (42884 of 43701)
PASS: LLVM-Unit :: Support/./SupportTests/TargetParserTest.ARMparseHWDiv (42885 of 43701)
PASS: LLVM-Unit :: Support/./SupportTests/TargetParserTest.testAArch64CPUArchList (42886 of 43701)
PASS: LLVM-Unit :: Support/./SupportTests/TargetParserTest.testAArch64Arch (42887 of 43701)
PASS: LLVM-Unit :: Support/./SupportTests/TargetParserTest.testAArch64Extension (42888 of 43701)
PASS: LLVM-Unit :: Support/./SupportTests/TargetParserTest.ARMparseArchProfile (42889 of 43701)
PASS: LLVM-Unit :: Support/./SupportTests/TargetParserTest.testARMArch (42890 of 43701)
PASS: LLVM-Unit :: Support/./SupportTests/TargetParserTest.testARMCPUArchList (42891 of 43701)
PASS: LLVM-Unit :: Support/./SupportTests/TargetParserTest.testARMExtension (42892 of 43701)
PASS: LLVM-Unit :: Support/./SupportTests/TargetParserTest.testInvalidARMArch (42893 of 43701)
PASS: LLVM-Unit :: Support/./SupportTests/TaskQueueTest.FutureWithReturnValue (42894 of 43701)
PASS: LLVM-Unit :: Support/./SupportTests/TaskQueueTest.OrderedFutures (42895 of 43701)
PASS: LLVM-Unit :: Support/./SupportTests/TaskQueueTest.UnOrderedFutures (42896 of 43701)
PASS: LLVM-Unit :: Support/./SupportTests/ThreadLocalTest.Basics (42897 of 43701)
PASS: LLVM-Unit :: Support/./SupportTests/ThreadPoolTest.Async (42898 of 43701)
PASS: LLVM-Unit :: Support/./SupportTests/ThreadPoolTest.AsyncBarrier (42899 of 43701)
PASS: LLVM-Unit :: Support/./SupportTests/ThreadPoolTest.AsyncBarrierArgs (42900 of 43701)
PASS: LLVM-Unit :: Support/./SupportTests/ThreadPoolTest.GetFuture (42901 of 43701)
PASS: LLVM-Unit :: Support/./SupportTests/Threading.PhysicalConcurrency (42902 of 43701)
PASS: LLVM-Unit :: Support/./SupportTests/ThreadPoolTest.PoolDestruction (42903 of 43701)
PASS: LLVM-Unit :: Support/./SupportTests/Threading.RunOnThreadSync (42904 of 43701)
PASS: LLVM-Unit :: Support/./SupportTests/Threading.RunOnThreadSyncAsync (42905 of 43701)
PASS: LLVM-Unit :: Support/./SupportTests/Timer.Additivity (42906 of 43701)
PASS: LLVM-Unit :: Support/./SupportTests/Timer.CheckIfTriggered (42907 of 43701)
PASS: LLVM-Unit :: Support/./SupportTests/ThumbISABuildAttr.testBuildAttr (42908 of 43701)
PASS: LLVM-Unit :: Support/./SupportTests/ToolOutputFileTest.DashOpensOuts (42909 of 43701)
PASS: LLVM-Unit :: Support/./SupportTests/TrailingObjects.OneArg (42910 of 43701)
PASS: LLVM-Unit :: Support/./SupportTests/TrailingObjects.Realignment (42911 of 43701)
PASS: LLVM-Unit :: Support/./SupportTests/TrailingObjects.ThreeArg (42912 of 43701)
PASS: LLVM-Unit :: Support/./SupportTests/TrailingObjects.TwoArg (42913 of 43701)
PASS: LLVM-Unit :: Support/./SupportTests/TrigramIndexTest.Backreference2 (42914 of 43701)
PASS: LLVM-Unit :: Support/./SupportTests/TrigramIndexTest.Basic (42915 of 43701)
PASS: LLVM-Unit :: Support/./SupportTests/TrigramIndexTest.Backreference1 (42916 of 43701)
PASS: LLVM-Unit :: Support/./SupportTests/TrigramIndexTest.Empty (42917 of 43701)
PASS: LLVM-Unit :: Support/./SupportTests/TrigramIndexTest.EscapedSymbols (42918 of 43701)
PASS: LLVM-Unit :: Support/./SupportTests/TrigramIndexTest.NoTrigramsInARule (42919 of 43701)
PASS: LLVM-Unit :: Support/./SupportTests/TrigramIndexTest.NoTrigramsInRules (42920 of 43701)
PASS: LLVM-Unit :: Support/./SupportTests/TrigramIndexTest.PopularTrigram (42921 of 43701)
PASS: LLVM-Unit :: Support/./SupportTests/TrigramIndexTest.RepetitiveRule (42922 of 43701)
PASS: LLVM-Unit :: Support/./SupportTests/TrigramIndexTest.Sequence (42923 of 43701)
PASS: LLVM-Unit :: Support/./SupportTests/TrigramIndexTest.PopularTrigram2 (42924 of 43701)
PASS: LLVM-Unit :: Support/./SupportTests/TrigramIndexTest.TooComplicatedRegex (42925 of 43701)
PASS: LLVM-Unit :: Support/./SupportTests/TrigramIndexTest.TooComplicatedRegex2 (42926 of 43701)
PASS: LLVM-Unit :: Support/./SupportTests/Triviality.ADT (42927 of 43701)
PASS: LLVM-Unit :: Support/./SupportTests/Triviality.Tester (42928 of 43701)
PASS: LLVM-Unit :: Support/./SupportTests/TypeNameTest.Names (42929 of 43701)
PASS: LLVM-Unit :: Support/./SupportTests/UnalignedAccess.testAttribute (42930 of 43701)
PASS: LLVM-Unit :: Support/./SupportTests/Unicode.columnWidthUTF8 (42931 of 43701)
PASS: LLVM-Unit :: Support/./SupportTests/UnivariateLinearPolyBase.Univariate3D_Add (42932 of 43701)
PASS: LLVM-Unit :: Support/./SupportTests/Unicode.isPrintable (42933 of 43701)
PASS: LLVM-Unit :: Support/./SupportTests/UnivariateLinearPolyBase.Univariate3D_GetValue (42934 of 43701)
PASS: LLVM-Unit :: Support/./SupportTests/UnivariateLinearPolyBase.Univariate3D_Equality (42935 of 43701)
PASS: LLVM-Unit :: Support/./SupportTests/UnivariateLinearPolyBase.Univariate3D_Scale (42936 of 43701)
PASS: LLVM-Unit :: Support/./SupportTests/UnivariateLinearPolyBase.Univariate3D_Invert (42937 of 43701)
PASS: LLVM-Unit :: Support/./SupportTests/UnivariateLinearPolyBase.Univariate3D_Sub (42938 of 43701)
PASS: LLVM-Unit :: Support/./SupportTests/UnivariateLinearPolyBase.Univariate3D_isZero (42939 of 43701)
PASS: LLVM-Unit :: Support/./SupportTests/VFPArgsBuildAttr.testBuildAttr (42940 of 43701)
PASS: LLVM-Unit :: Support/./SupportTests/VFSFromRemappedFilesTest.Basic (42941 of 43701)
PASS: LLVM-Unit :: Support/./SupportTests/VFSFromRemappedFilesTest.LastMappingWins (42942 of 43701)
PASS: LLVM-Unit :: Support/./SupportTests/VFSFromRemappedFilesTest.UseExternalNames (42943 of 43701)
PASS: LLVM-Unit :: Support/./SupportTests/VFSFromYAMLTest.CaseInsensitive (42944 of 43701)
PASS: LLVM-Unit :: Support/./SupportTests/VFSFromYAMLTest.BasicVFSFromYAML (42945 of 43701)
PASS: LLVM-Unit :: Support/./SupportTests/VFSFromYAMLTest.CaseSensitive (42946 of 43701)
PASS: LLVM-Unit :: Support/./SupportTests/VFSFromYAMLTest.DirectoryIteration (42947 of 43701)
PASS: LLVM-Unit :: Support/./SupportTests/VFSFromYAMLTest.DirectoryIterationSameDirMultipleEntries (42948 of 43701)
PASS: LLVM-Unit :: Support/./SupportTests/VFSFromYAMLTest.DirectoryIterationErrorInVFSLayer (42949 of 43701)
PASS: LLVM-Unit :: Support/./SupportTests/VFSFromYAMLTest.GetRealPath (42950 of 43701)
PASS: LLVM-Unit :: Support/./SupportTests/VFSFromYAMLTest.DirectoryIterationWithDuplicates (42951 of 43701)
PASS: LLVM-Unit :: Support/./SupportTests/VFSFromYAMLTest.IllegalVFSFile (42952 of 43701)
PASS: LLVM-Unit :: Support/./SupportTests/VFSFromYAMLTest.MappedFiles (42953 of 43701)
PASS: LLVM-Unit :: Support/./SupportTests/VFSFromYAMLTest.MappedRoot (42954 of 43701)
PASS: LLVM-Unit :: Support/./SupportTests/VFSFromYAMLTest.MultiComponentPath (42955 of 43701)
PASS: LLVM-Unit :: Support/./SupportTests/VFSFromYAMLTest.RecursiveDirectoryIterationLevel (42956 of 43701)
PASS: LLVM-Unit :: Support/./SupportTests/VFSFromYAMLTest.NonFallthroughDirectoryIteration (42957 of 43701)
PASS: LLVM-Unit :: Support/./SupportTests/VFSFromYAMLTest.RelativePaths (42958 of 43701)
PASS: LLVM-Unit :: Support/./SupportTests/VFSFromYAMLTest.RemappedDirectoryOverlay (42959 of 43701)
PASS: LLVM-Unit :: Support/./SupportTests/VFSFromYAMLTest.RemappedDirectoryOverlayNoExternalNames (42960 of 43701)
PASS: LLVM-Unit :: Support/./SupportTests/VFSFromYAMLTest.RemappedDirectoryOverlayNoFallthrough (42961 of 43701)
PASS: LLVM-Unit :: Support/./SupportTests/VFSFromYAMLTest.TrailingSlashes (42962 of 43701)
PASS: LLVM-Unit :: Support/./SupportTests/VFSFromYAMLTest.UseExternalName (42963 of 43701)
PASS: LLVM-Unit :: Support/./SupportTests/VFSFromYAMLTest.VirtualWorkingDirectory (42964 of 43701)
PASS: LLVM-Unit :: Support/./SupportTests/VFSFromYAMLTest.WorkingDirectory (42965 of 43701)
PASS: LLVM-Unit :: Support/./SupportTests/VFSFromYAMLTest.WorkingDirectoryFallthrough (42966 of 43701)
PASS: LLVM-Unit :: Support/./SupportTests/VFSFromYAMLTest.YAMLVFSWriterTest (42967 of 43701)
PASS: LLVM-Unit :: Support/./SupportTests/VFSFromYAMLTest.WorkingDirectoryFallthroughInvalid (42968 of 43701)
PASS: LLVM-Unit :: Support/./SupportTests/VFSFromYAMLTest.YAMLVFSWriterTest2 (42969 of 43701)
PASS: LLVM-Unit :: Support/./SupportTests/VFSFromYAMLTest.YAMLVFSWriterTest3 (42970 of 43701)
PASS: LLVM-Unit :: Support/./SupportTests/VFSFromYAMLTest.YAMLVFSWriterTestHandleDirs (42971 of 43701)
PASS: LLVM-Unit :: Support/./SupportTests/VersionTuple.getAsString (42972 of 43701)
PASS: LLVM-Unit :: Support/./SupportTests/VersionTuple.tryParse (42973 of 43701)
PASS: LLVM-Unit :: Support/./SupportTests/VirtualFileSystemTest.BaseOnlyOverlay (42974 of 43701)
PASS: LLVM-Unit :: Support/./SupportTests/VirtualFileSystemTest.BasicRealFSIteration (42975 of 43701)
PASS: LLVM-Unit :: Support/./SupportTests/VirtualFileSystemTest.BasicRealFSRecursiveIteration (42976 of 43701)
PASS: LLVM-Unit :: Support/./SupportTests/VirtualFileSystemTest.BasicRealFSRecursiveIterationNoPush (42977 of 43701)
PASS: LLVM-Unit :: Support/./SupportTests/VirtualFileSystemTest.BrokenSymlinkRealFSIteration (42978 of 43701)
PASS: LLVM-Unit :: Support/./SupportTests/VirtualFileSystemTest.BrokenSymlinkRealFSRecursiveIteration (42979 of 43701)
PASS: LLVM-Unit :: Support/./SupportTests/VirtualFileSystemTest.HiddenInIteration (42980 of 43701)
PASS: LLVM-Unit :: Support/./SupportTests/VirtualFileSystemTest.GetRealPathInOverlay (42981 of 43701)
PASS: LLVM-Unit :: Support/./SupportTests/VirtualFileSystemTest.MergedDirPermissions (42982 of 43701)
PASS: LLVM-Unit :: Support/./SupportTests/VirtualFileSystemTest.MultipleWorkingDirs (42983 of 43701)
PASS: LLVM-Unit :: Support/./SupportTests/VirtualFileSystemTest.OverlayFiles (42984 of 43701)
PASS: LLVM-Unit :: Support/./SupportTests/VirtualFileSystemTest.OverlayDirsNonMerged (42985 of 43701)
PASS: LLVM-Unit :: Support/./SupportTests/VirtualFileSystemTest.OverlayIteration (42986 of 43701)
PASS: LLVM-Unit :: Support/./SupportTests/VirtualFileSystemTest.OverlayIterator (42987 of 43701)
PASS: LLVM-Unit :: Support/./SupportTests/VirtualFileSystemTest.OverlayRecursiveIteration (42988 of 43701)
PASS: LLVM-Unit :: Support/./SupportTests/VirtualFileSystemTest.StatusQueries (42989 of 43701)
PASS: LLVM-Unit :: Support/./SupportTests/VirtualizationBuildAttr.testBuildAttr (42990 of 43701)
PASS: LLVM-Unit :: Support/./SupportTests/VirtualFileSystemTest.ThreeLevelIteration (42991 of 43701)
PASS: LLVM-Unit :: Support/./SupportTests/WMMXBuildAttr.testBuildAttr (42992 of 43701)
PASS: LLVM-Unit :: Support/./SupportTests/WMMXArgsBuildAttr.testBuildAttr (42993 of 43701)
PASS: LLVM-Unit :: Support/./SupportTests/WithColorTest.ColorMode (42994 of 43701)
PASS: LLVM-Unit :: Support/./SupportTests/YAMLIO.MultilineStrings (42995 of 43701)
PASS: LLVM-Unit :: Support/./SupportTests/YAMLIO.Numeric (42996 of 43701)
PASS: LLVM-Unit :: Support/./SupportTests/YAMLIO.NoQuotesForTab (42997 of 43701)
PASS: LLVM-Unit :: Support/./SupportTests/YAMLIO.SequenceElideTest (42998 of 43701)
PASS: LLVM-Unit :: Support/./SupportTests/YAMLIO.TestAnchorMapError (42999 of 43701)
PASS: LLVM-Unit :: Support/./SupportTests/YAMLIO.TestColorsReadError (43000 of 43701)
PASS: LLVM-Unit :: Support/./SupportTests/YAMLIO.TestCustomMapping (43001 of 43701)
PASS: LLVM-Unit :: Support/./SupportTests/YAMLIO.TestContainerSequenceMapRead (43002 of 43701)
PASS: LLVM-Unit :: Support/./SupportTests/YAMLIO.TestCustomMappingStruct (43003 of 43701)
PASS: LLVM-Unit :: Support/./SupportTests/YAMLIO.TestDirectiveMappingNoValue (43004 of 43701)
PASS: LLVM-Unit :: Support/./SupportTests/YAMLIO.TestDocRead (43005 of 43701)
PASS: LLVM-Unit :: Support/./SupportTests/YAMLIO.TestEmptyMapWrite (43006 of 43701)
PASS: LLVM-Unit :: Support/./SupportTests/YAMLIO.TestEmptyAnchor (43007 of 43701)
PASS: LLVM-Unit :: Support/./SupportTests/YAMLIO.TestEmptyAlias (43008 of 43701)
PASS: LLVM-Unit :: Support/./SupportTests/YAMLIO.TestEmptySequenceWrite (43009 of 43701)
PASS: LLVM-Unit :: Support/./SupportTests/YAMLIO.TestEmptyStringFailsForMapWithRequiredFields (43010 of 43701)
PASS: LLVM-Unit :: Support/./SupportTests/YAMLIO.TestEmptyStringSucceedsForMapWithOptionalFields (43011 of 43701)
PASS: LLVM-Unit :: Support/./SupportTests/YAMLIO.TestEmptyStringSucceedsForSequence (43012 of 43701)
PASS: LLVM-Unit :: Support/./SupportTests/YAMLIO.TestEnumRead (43013 of 43701)
PASS: LLVM-Unit :: Support/./SupportTests/YAMLIO.TestEscaped (43014 of 43701)
PASS: LLVM-Unit :: Support/./SupportTests/YAMLIO.TestFlagsRead (43015 of 43701)
PASS: LLVM-Unit :: Support/./SupportTests/YAMLIO.TestFlowSequenceTokenErrors (43016 of 43701)
PASS: LLVM-Unit :: Support/./SupportTests/YAMLIO.TestFlagsReadError (43017 of 43701)
PASS: LLVM-Unit :: Support/./SupportTests/YAMLIO.TestGivenFilename (43018 of 43701)
PASS: LLVM-Unit :: Support/./SupportTests/YAMLIO.TestMalformedContainerSequenceMapRead (43019 of 43701)
PASS: LLVM-Unit :: Support/./SupportTests/YAMLIO.TestMalformedMapFailsGracefully (43020 of 43701)
PASS: LLVM-Unit :: Support/./SupportTests/YAMLIO.TestMalformedMapRead (43021 of 43701)
PASS: LLVM-Unit :: Support/./SupportTests/YAMLIO.TestMapRead (43022 of 43701)
PASS: LLVM-Unit :: Support/./SupportTests/YAMLIO.TestMapWithContext (43023 of 43701)
PASS: LLVM-Unit :: Support/./SupportTests/YAMLIO.TestReadBuiltInTypes (43024 of 43701)
PASS: LLVM-Unit :: Support/./SupportTests/YAMLIO.TestReadBuiltInTypesDoubleError (43025 of 43701)
PASS: LLVM-Unit :: Support/./SupportTests/YAMLIO.TestReadBuiltInTypesFloatError (43026 of 43701)
PASS: LLVM-Unit :: Support/./SupportTests/YAMLIO.TestReadBuiltInTypesHex16Error (43027 of 43701)
PASS: LLVM-Unit :: Support/./SupportTests/YAMLIO.TestReadBuiltInTypesHex64Error (43028 of 43701)
PASS: LLVM-Unit :: Support/./SupportTests/YAMLIO.TestReadBuiltInTypesHex32Error (43029 of 43701)
PASS: LLVM-Unit :: Support/./SupportTests/YAMLIO.TestReadBuiltInTypesHex8Error (43030 of 43701)
PASS: LLVM-Unit :: Support/./SupportTests/YAMLIO.TestReadBuiltInTypesUint16Error (43031 of 43701)
PASS: LLVM-Unit :: Support/./SupportTests/YAMLIO.TestReadBuiltInTypesUint64Error (43032 of 43701)
PASS: LLVM-Unit :: Support/./SupportTests/YAMLIO.TestReadBuiltInTypesUint32Error (43033 of 43701)
PASS: LLVM-Unit :: Support/./SupportTests/YAMLIO.TestReadBuiltInTypesUint8Error (43034 of 43701)
PASS: LLVM-Unit :: Support/./SupportTests/YAMLIO.TestReadBuiltInTypesint16OverError (43035 of 43701)
PASS: LLVM-Unit :: Support/./SupportTests/YAMLIO.TestReadBuiltInTypesint16UnderError (43036 of 43701)
PASS: LLVM-Unit :: Support/./SupportTests/YAMLIO.TestReadBuiltInTypesint32UnderError (43037 of 43701)
PASS: LLVM-Unit :: Support/./SupportTests/YAMLIO.TestReadBuiltInTypesint32OverError (43038 of 43701)
PASS: LLVM-Unit :: Support/./SupportTests/YAMLIO.TestReadBuiltInTypesint64OverError (43039 of 43701)
PASS: LLVM-Unit :: Support/./SupportTests/YAMLIO.TestReadBuiltInTypesint64UnderError (43040 of 43701)
PASS: LLVM-Unit :: Support/./SupportTests/YAMLIO.TestReadBuiltInTypesint8OverError (43041 of 43701)
PASS: LLVM-Unit :: Support/./SupportTests/YAMLIO.TestReadBuiltInTypesint8UnderError (43042 of 43701)
PASS: LLVM-Unit :: Support/./SupportTests/YAMLIO.TestReadEndianEnums (43043 of 43701)
PASS: LLVM-Unit :: Support/./SupportTests/YAMLIO.TestReadEndianTypes (43044 of 43701)
PASS: LLVM-Unit :: Support/./SupportTests/YAMLIO.TestReadMySecondsSequence (43045 of 43701)
PASS: LLVM-Unit :: Support/./SupportTests/YAMLIO.TestReadWriteBlockScalarDocuments (43046 of 43701)
PASS: LLVM-Unit :: Support/./SupportTests/YAMLIO.TestReadWriteBlockScalarValue (43047 of 43701)
PASS: LLVM-Unit :: Support/./SupportTests/YAMLIO.TestReadKindAndFlagsSequence (43048 of 43701)
PASS: LLVM-Unit :: Support/./SupportTests/YAMLIO.TestReadWriteBuiltInTypes (43049 of 43701)
PASS: LLVM-Unit :: Support/./SupportTests/YAMLIO.TestReadWriteEndianEnums (43050 of 43701)
PASS: LLVM-Unit :: Support/./SupportTests/YAMLIO.TestReadWriteEndianTypes (43051 of 43701)
PASS: LLVM-Unit :: Support/./SupportTests/YAMLIO.TestReadWriteFlags (43052 of 43701)
PASS: LLVM-Unit :: Support/./SupportTests/YAMLIO.TestReadWriteKindAndFlagsSequence (43053 of 43701)
PASS: LLVM-Unit :: Support/./SupportTests/YAMLIO.TestReadWriteMyCustomType (43054 of 43701)
PASS: LLVM-Unit :: Support/./SupportTests/YAMLIO.TestReadWriteMultilineStringType (43055 of 43701)
PASS: LLVM-Unit :: Support/./SupportTests/YAMLIO.TestReadWriteMyFlowSequence (43056 of 43701)
PASS: LLVM-Unit :: Support/./SupportTests/YAMLIO.TestReadWriteMyFlowMapping (43057 of 43701)
PASS: LLVM-Unit :: Support/./SupportTests/YAMLIO.TestReadWriteMySecondsSequence (43058 of 43701)
PASS: LLVM-Unit :: Support/./SupportTests/YAMLIO.TestReadWritePolymorphicMap (43059 of 43701)
PASS: LLVM-Unit :: Support/./SupportTests/YAMLIO.TestReadWritePolymorphicScalar (43060 of 43701)
PASS: LLVM-Unit :: Support/./SupportTests/YAMLIO.TestReadWritePolymorphicSeq (43061 of 43701)
PASS: LLVM-Unit :: Support/./SupportTests/YAMLIO.TestReadWriteSequenceOfMyFlowSequence (43062 of 43701)
PASS: LLVM-Unit :: Support/./SupportTests/YAMLIO.TestScannerNoNullDecodeInvalidUTF8 (43063 of 43701)
PASS: LLVM-Unit :: Support/./SupportTests/YAMLIO.TestScannerNoNullEmpty (43064 of 43701)
PASS: LLVM-Unit :: Support/./SupportTests/YAMLIO.TestReadWriteStringTypes (43065 of 43701)
PASS: LLVM-Unit :: Support/./SupportTests/YAMLIO.TestScannerNoNullEmptyAlias (43066 of 43701)
PASS: LLVM-Unit :: Support/./SupportTests/YAMLIO.TestScannerNoNullEmptyAnchor (43067 of 43701)
PASS: LLVM-Unit :: Support/./SupportTests/YAMLIO.TestScannerNoNullEmptyMap (43068 of 43701)
PASS: LLVM-Unit :: Support/./SupportTests/YAMLIO.TestScannerNoNullEmptySequence (43069 of 43701)
PASS: LLVM-Unit :: Support/./SupportTests/YAMLIO.TestScannerNoNullScalarUnbalancedDoubleQuote (43070 of 43701)
PASS: LLVM-Unit :: Support/./SupportTests/YAMLIO.TestScannerNoNullScalarUnbalancedSingleQuote (43071 of 43701)
PASS: LLVM-Unit :: Support/./SupportTests/YAMLIO.TestScannerNoNullScanPlainScalarInFlow (43072 of 43701)
PASS: LLVM-Unit :: Support/./SupportTests/YAMLIO.TestScannerNoNullSequenceOfNull (43073 of 43701)
PASS: LLVM-Unit :: Support/./SupportTests/YAMLIO.TestScannerNoNullUnbalancedMap (43074 of 43701)
PASS: LLVM-Unit :: Support/./SupportTests/YAMLIO.TestScannerNoNullSimpleSequence (43075 of 43701)
PASS: LLVM-Unit :: Support/./SupportTests/YAMLIO.TestScannerNoNullUnbalancedSequence (43076 of 43701)
PASS: LLVM-Unit :: Support/./SupportTests/YAMLIO.TestScannerUnexpectedCharacter (43077 of 43701)
PASS: LLVM-Unit :: Support/./SupportTests/YAMLIO.TestSequenceDocListWriteAndRead (43078 of 43701)
PASS: LLVM-Unit :: Support/./SupportTests/YAMLIO.TestSequenceMapWriteAndRead (43079 of 43701)
PASS: LLVM-Unit :: Support/./SupportTests/YAMLIO.TestSequenceMapRead (43080 of 43701)
PASS: LLVM-Unit :: Support/./SupportTests/YAMLIO.TestTaggedDocuments (43081 of 43701)
PASS: LLVM-Unit :: Support/./SupportTests/YAMLIO.TestTaggedDocumentsWriteAndRead (43082 of 43701)
PASS: LLVM-Unit :: Support/./SupportTests/YAMLIO.TestUnescapeInfiniteLoop (43083 of 43701)
PASS: LLVM-Unit :: Support/./SupportTests/YAMLIO.TestUnknownDirective (43084 of 43701)
PASS: LLVM-Unit :: Support/./SupportTests/YAMLIO.TestValidatingInput (43085 of 43701)
PASS: LLVM-Unit :: Support/./SupportTests/YAMLIO.TestWrapFlow (43086 of 43701)
PASS: LLVM-Unit :: Support/./SupportTests/YAMLParser.DefaultDiagnosticFilename (43087 of 43701)
PASS: LLVM-Unit :: Support/./SupportTests/YAMLParser.DiagnosticFilenameFromBufferID (43088 of 43701)
PASS: LLVM-Unit :: Support/./SupportTests/YAMLParser.DifferentNodesIteratorOperatorEquals (43089 of 43701)
PASS: LLVM-Unit :: Support/./SupportTests/YAMLParser.FailsIfMissingColon (43090 of 43701)
PASS: LLVM-Unit :: Support/./SupportTests/YAMLParser.DifferentNodesIteratorOperatorNotEquals (43091 of 43701)
PASS: LLVM-Unit :: Support/./SupportTests/YAMLParser.FailsIfNotClosingArray (43092 of 43701)
PASS: LLVM-Unit :: Support/./SupportTests/YAMLParser.FailsIfNotClosingObject (43093 of 43701)
PASS: LLVM-Unit :: Support/./SupportTests/YAMLParser.FailsOnMissingComma (43094 of 43701)
PASS: LLVM-Unit :: Support/./SupportTests/YAMLParser.FailsOnMissingQuote (43095 of 43701)
PASS: LLVM-Unit :: Support/./SupportTests/YAMLParser.FlowSequenceTokensOutsideFlowSequence (43096 of 43701)
PASS: LLVM-Unit :: Support/./SupportTests/YAMLParser.HandlesNullValuesInKeyValueNodesGracefully (43097 of 43701)
PASS: LLVM-Unit :: Support/./SupportTests/YAMLParser.NullTerminatedBlockScalars (43098 of 43701)
PASS: LLVM-Unit :: Support/./SupportTests/YAMLParser.HandlesEndOfFileGracefully (43099 of 43701)
PASS: LLVM-Unit :: Support/./SupportTests/YAMLParser.ParsesArrayOfArrays (43100 of 43701)
PASS: LLVM-Unit :: Support/./SupportTests/YAMLParser.ParsesBlockLiteralScalars (43101 of 43701)
PASS: LLVM-Unit :: Support/./SupportTests/YAMLParser.ParsesEmptyArray (43102 of 43701)
PASS: LLVM-Unit :: Support/./SupportTests/YAMLParser.ParsesBools (43103 of 43701)
PASS: LLVM-Unit :: Support/./SupportTests/YAMLParser.ParsesEmptyArrayWithWhitespace (43104 of 43701)
PASS: LLVM-Unit :: Support/./SupportTests/YAMLParser.ParsesEmptyString (43105 of 43701)
PASS: LLVM-Unit :: Support/./SupportTests/YAMLParser.ParsesEmptyObject (43106 of 43701)
PASS: LLVM-Unit :: Support/./SupportTests/YAMLParser.ParsesMultipleObjects (43107 of 43701)
PASS: LLVM-Unit :: Support/./SupportTests/YAMLParser.ParsesMultipleKeyValuePairsInObject (43108 of 43701)
PASS: LLVM-Unit :: Support/./SupportTests/YAMLParser.ParsesEscapedQuotes (43109 of 43701)
PASS: LLVM-Unit :: Support/./SupportTests/YAMLParser.ParsesSpacesInBetweenTokens (43110 of 43701)
PASS: LLVM-Unit :: Support/./SupportTests/YAMLParser.ParsesObject (43111 of 43701)
PASS: LLVM-Unit :: Support/./SupportTests/YAMLParser.ParsesStrings (43112 of 43701)
PASS: LLVM-Unit :: Support/./SupportTests/formatted_raw_ostreamTest.Test_LineColumn (43113 of 43701)
PASS: LLVM-Unit :: Support/./SupportTests/YAMLParser.WorksWithIteratorAlgorithms (43114 of 43701)
PASS: LLVM-Unit :: Support/./SupportTests/formatted_raw_ostreamTest.Test_Flush (43115 of 43701)
PASS: LLVM-Unit :: Support/./SupportTests/YAMLParser.SameNodeIteratorOperatorNotEquals (43116 of 43701)
PASS: LLVM-Unit :: Support/./SupportTests/YAMLParser.SameNodeIteratorOperatorEquals (43117 of 43701)
PASS: LLVM-Unit :: Support/./SupportTests/formatted_raw_ostreamTest.Test_Tell (43118 of 43701)
PASS: LLVM-Unit :: Support/./SupportTests/formatted_raw_ostreamTest.Test_UTF8 (43119 of 43701)
PASS: LLVM-Unit :: Support/./SupportTests/formatted_raw_ostreamTest.Test_UTF8Buffered (43120 of 43701)
PASS: LLVM-Unit :: Support/./SupportTests/getLinuxHostCPUName.AArch64 (43121 of 43701)
PASS: LLVM-Unit :: Support/./SupportTests/getLinuxHostCPUName.ARM (43122 of 43701)
PASS: LLVM-Unit :: Support/./SupportTests/formatted_raw_ostreamTest.Test_UTF8TinyBuffer (43123 of 43701)
PASS: LLVM-Unit :: Support/./SupportTests/getSwappedBytes.SignedRoundTrip (43124 of 43701)
PASS: LLVM-Unit :: Support/./SupportTests/getSwappedBytes.UnsignedRoundTrip (43125 of 43701)
PASS: LLVM-Unit :: Support/./SupportTests/getSwappedBytes.double (43126 of 43701)
PASS: LLVM-Unit :: Support/./SupportTests/getSwappedBytes.float (43127 of 43701)
PASS: LLVM-Unit :: Support/./SupportTests/getSwappedBytes.int16_t (43128 of 43701)
PASS: LLVM-Unit :: Support/./SupportTests/getSwappedBytes.int64_t (43129 of 43701)
PASS: LLVM-Unit :: Support/./SupportTests/getSwappedBytes.int32_t (43130 of 43701)
PASS: LLVM-Unit :: Support/./SupportTests/getSwappedBytes.uint16_t (43131 of 43701)
PASS: LLVM-Unit :: Support/./SupportTests/getSwappedBytes.uint64_t (43132 of 43701)
PASS: LLVM-Unit :: Support/./SupportTests/getSwappedBytes.uint8_t (43133 of 43701)
PASS: LLVM-Unit :: Support/./SupportTests/getSwappedBytes.int8_t (43134 of 43701)
PASS: LLVM-Unit :: Support/./SupportTests/getSwappedBytes.uint32_t (43135 of 43701)
PASS: LLVM-Unit :: Support/./SupportTests/is_absolute_gnu.Works (43136 of 43701)
PASS: LLVM-Unit :: Support/./SupportTests/is_separator.Works (43137 of 43701)
PASS: LLVM-Unit :: Support/./SupportTests/raw_ostreamTest.BufferEdge (43138 of 43701)
PASS: LLVM-Unit :: Support/./SupportTests/raw_fd_ostreamTest.multiple_raw_fd_ostream_to_stdout (43139 of 43701)
PASS: LLVM-Unit :: Support/./SupportTests/raw_fd_streamTest.ReadAfterWrite (43140 of 43701)
PASS: LLVM-Unit :: Support/./SupportTests/raw_ostreamTest.Colors (43141 of 43701)
PASS: LLVM-Unit :: Support/./SupportTests/raw_fd_streamTest.DynCast (43142 of 43701)
PASS: LLVM-Unit :: Support/./SupportTests/raw_ostreamTest.FormatDecimal (43143 of 43701)
PASS: LLVM-Unit :: Support/./SupportTests/raw_ostreamTest.FormatHex (43144 of 43701)
PASS: LLVM-Unit :: Support/./SupportTests/raw_ostreamTest.FormattedHexBytes (43145 of 43701)
PASS: LLVM-Unit :: Support/./SupportTests/raw_ostreamTest.Justify (43146 of 43701)
PASS: LLVM-Unit :: Support/./SupportTests/raw_ostreamTest.Types_Unbuffered (43147 of 43701)
PASS: LLVM-Unit :: Support/./SupportTests/raw_ostreamTest.TinyBuffer (43148 of 43701)
PASS: LLVM-Unit :: Support/./SupportTests/raw_ostreamTest.flush_tied_to_stream_on_write (43149 of 43701)
PASS: LLVM-Unit :: Support/./SupportTests/raw_ostreamTest.Types_Buffered (43150 of 43701)
PASS: LLVM-Unit :: Support/./SupportTests/raw_ostreamTest.reserve_stream (43151 of 43701)
PASS: LLVM-Unit :: Support/./SupportTests/raw_ostreamTest.WriteEscaped (43152 of 43701)
PASS: LLVM-Unit :: Support/./SupportTests/raw_ostreamTest.writeToDevNull (43153 of 43701)
PASS: LLVM-Unit :: Support/./SupportTests/raw_ostreamTest.writeToNonexistingPath (43154 of 43701)
PASS: LLVM-Unit :: Support/./SupportTests/raw_ostreamTest.writeToStdOut (43155 of 43701)
PASS: LLVM-Unit :: Support/./SupportTests/raw_pwrite_ostreamTest.TestFD (43156 of 43701)
PASS: LLVM-Unit :: Support/./SupportTests/raw_ostreamTest.writeToOutputFile (43157 of 43701)
PASS: LLVM-Unit :: Support/./SupportTests/raw_pwrite_ostreamTest.TestDevNull (43158 of 43701)
PASS: LLVM-Unit :: Support/./SupportTests/raw_pwrite_ostreamTest.TestSVector (43159 of 43701)
PASS: LLVM-Unit :: Support/./SupportTests/raw_sha1_ostreamTest.Basic (43160 of 43701)
PASS: LLVM-Unit :: Support/./SupportTests/raw_sha1_ostreamTest.Intermediate (43161 of 43701)
PASS: LLVM-Unit :: Support/./SupportTests/raw_sha1_ostreamTest.Reset (43162 of 43701)
PASS: LLVM-Unit :: Support/./SupportTests/rename.ExistingTemp (43163 of 43701)
PASS: LLVM-Unit :: Support/./SupportTests/sha1_hash_test.Update (43164 of 43701)
PASS: LLVM-Unit :: Support/./SupportTests/sha1_hash_test.Basic (43165 of 43701)
PASS: LLVM-Unit :: Support/./SupportTests/rename.FileOpenedForReadingCanBeReplaced (43166 of 43701)
PASS: LLVM-Unit :: Support/./SupportTests/swapByteOrder.int16_t (43167 of 43701)
PASS: LLVM-Unit :: Support/./SupportTests/swapByteOrder.float (43168 of 43701)
PASS: LLVM-Unit :: Support/./SupportTests/swapByteOrder.double (43169 of 43701)
PASS: LLVM-Unit :: Support/./SupportTests/swapByteOrder.int32_t (43170 of 43701)
PASS: LLVM-Unit :: Support/./SupportTests/swapByteOrder.int64_t (43171 of 43701)
PASS: LLVM-Unit :: Support/./SupportTests/swapByteOrder.int8_t (43172 of 43701)
PASS: LLVM-Unit :: Support/./SupportTests/swapByteOrder.uint16_t (43173 of 43701)
PASS: LLVM-Unit :: Support/./SupportTests/swapByteOrder.uint32_t (43174 of 43701)
PASS: LLVM-Unit :: Support/./SupportTests/swapByteOrder.uint8_t (43175 of 43701)
PASS: LLVM-Unit :: Support/./SupportTests/swapByteOrder.uint64_t (43176 of 43701)
PASS: LLVM-Unit :: Support/./SupportTests/writeFileAtomicallyTest.Test (43177 of 43701)
PASS: LLVM-Unit :: Support/./SupportTests/xxhashTest.Basic (43178 of 43701)
PASS: LLVM-Unit :: Support/DynamicLibrary/./DynamicLibraryTests/DynamicLibrary.Overload (43179 of 43701)
PASS: LLVM-Unit :: TableGen/./TableGenTests/Automata.NfaAutomatonAccepts (43180 of 43701)
PASS: LLVM-Unit :: TableGen/./TableGenTests/Automata.BinPackerAutomatonExplains (43181 of 43701)
PASS: LLVM-Unit :: TableGen/./TableGenTests/Automata.BinPackerAutomatonAccepts (43182 of 43701)
PASS: LLVM-Unit :: TableGen/./TableGenTests/Automata.SimpleAutomatonAcceptsSequences (43183 of 43701)
PASS: LLVM-Unit :: Support/DynamicLibrary/./DynamicLibraryTests/DynamicLibrary.Shutdown (43184 of 43701)
PASS: LLVM-Unit :: TableGen/./TableGenTests/Automata.SimpleAutomatonAcceptsFromInitialState (43185 of 43701)
PASS: LLVM-Unit :: TableGen/./TableGenTests/Automata.TupleAutomatonAccepts (43186 of 43701)
PASS: LLVM-Unit :: TableGen/./TableGenTests/CodeExpander.Escape (43187 of 43701)
PASS: LLVM-Unit :: TableGen/./TableGenTests/CodeExpander.EscapedNotAnExpansion (43188 of 43701)
PASS: LLVM-Unit :: TableGen/./TableGenTests/CodeExpander.EscapedUnterminatedExpansion (43189 of 43701)
PASS: LLVM-Unit :: TableGen/./TableGenTests/CodeExpander.NoExpansions (43190 of 43701)
PASS: LLVM-Unit :: TableGen/./TableGenTests/CodeExpander.EscapedExpansion (43191 of 43701)
PASS: LLVM-Unit :: TableGen/./TableGenTests/CodeExpander.NotAnExpansion (43192 of 43701)
PASS: LLVM-Unit :: TableGen/./TableGenTests/CodeExpander.Indentation (43193 of 43701)
PASS: LLVM-Unit :: TableGen/./TableGenTests/CodeExpander.UndefinedExpansion (43194 of 43701)
PASS: LLVM-Unit :: TableGen/./TableGenTests/CodeExpander.UnterminatedExpansion (43195 of 43701)
PASS: LLVM-Unit :: Target/AArch64/./AArch64Tests/InstSizes.PATCHPOINT (43196 of 43701)
PASS: LLVM-Unit :: Target/AArch64/./AArch64Tests/InstSizes.Authenticated (43197 of 43701)
PASS: LLVM-Unit :: Target/AArch64/./AArch64Tests/InstSizes.TLSDESC_CALLSEQ (43198 of 43701)
PASS: LLVM-Unit :: Target/AArch64/./AArch64Tests/StackOffset.decomposeStackOffsetForFrameOffsets (43199 of 43701)
PASS: LLVM-Unit :: Target/AArch64/./AArch64Tests/InstSizes.STACKMAP (43200 of 43701)
PASS: LLVM-Unit :: Target/AMDGPU/./AMDGPUTests/AMDGPUDwarfRegMappingTests.TestWave64DwarfRegMapping (43201 of 43701)
PASS: LLVM-Unit :: Target/AMDGPU/./AMDGPUTests/AMDGPUDwarfRegMappingTests.TestWave32DwarfRegMapping (43202 of 43701)
PASS: LLVM-Unit :: Target/AMDGPU/./AMDGPUTests/AMDGPUExecMayBeModifiedBeforeAnyUse.TheTest (43203 of 43701)
PASS: LLVM-Unit :: Target/ARM/./ARMTests/MachineInstr.HasSideEffects (43204 of 43701)
PASS: LLVM-Unit :: Target/ARM/./ARMTests/MachineInstrValidTailPredication.IsCorrect (43205 of 43701)
PASS: LLVM-Unit :: Target/ARM/./ARMTests/MachineInstructionHorizontalReduction.IsCorrect (43206 of 43701)
PASS: LLVM-Unit :: Target/ARM/./ARMTests/MachineInstructionRetainsPreviousHalfElement.IsCorrect (43207 of 43701)
PASS: LLVM-Unit :: Target/ARM/./ARMTests/MachineInstructionDoubleWidthResult.IsCorrect (43208 of 43701)
PASS: LLVM-Unit :: Target/PowerPC/./PowerPCTests/AIXRelocModelTest.DefalutToPIC (43209 of 43701)
PASS: LLVM-Unit :: TextAPI/./TextAPITests/TBDv1.MalformedFile2 (43210 of 43701)
PASS: LLVM-Unit :: TextAPI/./TextAPITests/TBDv1.Platform_bridgeOS (43211 of 43701)
PASS: LLVM-Unit :: TextAPI/./TextAPITests/TBDv1.Platform_iOS (43212 of 43701)
PASS: LLVM-Unit :: TextAPI/./TextAPITests/TBDv1.MalformedFile1 (43213 of 43701)
PASS: LLVM-Unit :: Target/WebAssembly/./WebAssemblyTests/WebAssemblyExceptionInfoTest.TEST0 (43214 of 43701)
PASS: LLVM-Unit :: Target/WebAssembly/./WebAssemblyTests/WebAssemblyExceptionInfoTest.TEST1 (43215 of 43701)
PASS: LLVM-Unit :: Target/X86/./X86Tests/MachineSizeOptsTest.Test (43216 of 43701)
PASS: LLVM-Unit :: TextAPI/./TextAPITests/TBDv1.Platform_tvOS (43217 of 43701)
PASS: LLVM-Unit :: TextAPI/./TextAPITests/TBDv1.Platform_macOS (43218 of 43701)
PASS: LLVM-Unit :: TextAPI/./TextAPITests/TBDv1.ReadFile (43219 of 43701)
PASS: LLVM-Unit :: TextAPI/./TextAPITests/TBDv1.ReadFile2 (43220 of 43701)
PASS: LLVM-Unit :: TextAPI/./TextAPITests/TBDv1.Platform_watchOS (43221 of 43701)
PASS: LLVM-Unit :: TextAPI/./TextAPITests/TBDv1.Swift_2_0 (43222 of 43701)
PASS: LLVM-Unit :: TextAPI/./TextAPITests/TBDv1.Swift_1_1 (43223 of 43701)
PASS: LLVM-Unit :: TextAPI/./TextAPITests/TBDv1.Swift_1_0 (43224 of 43701)
PASS: LLVM-Unit :: TextAPI/./TextAPITests/TBDv1.Swift_4_0 (43225 of 43701)
PASS: LLVM-Unit :: TextAPI/./TextAPITests/TBDv1.Swift_3_0 (43226 of 43701)
PASS: LLVM-Unit :: TextAPI/./TextAPITests/TBDv1.UnknownArchitecture (43227 of 43701)
PASS: LLVM-Unit :: TextAPI/./TextAPITests/TBDv1.Swift_5 (43228 of 43701)
PASS: LLVM-Unit :: TextAPI/./TextAPITests/TBDv1.Swift_99 (43229 of 43701)
PASS: LLVM-Unit :: TextAPI/./TextAPITests/TBDv2.InvalidPlatform (43230 of 43701)
PASS: LLVM-Unit :: TextAPI/./TextAPITests/TBDv1.WriteFile (43231 of 43701)
PASS: LLVM-Unit :: TextAPI/./TextAPITests/TBDv1.UnknownPlatform (43232 of 43701)
PASS: LLVM-Unit :: TextAPI/./TextAPITests/TBDv2.MalformedFile1 (43233 of 43701)
PASS: LLVM-Unit :: TextAPI/./TextAPITests/TBDv2.MalformedFile2 (43234 of 43701)
PASS: LLVM-Unit :: TextAPI/./TextAPITests/TBDv2.Platform_iOS (43235 of 43701)
PASS: LLVM-Unit :: TextAPI/./TextAPITests/TBDv2.Platform_bridgeOS (43236 of 43701)
PASS: LLVM-Unit :: TextAPI/./TextAPITests/TBDv2.Platform_macOS (43237 of 43701)
PASS: LLVM-Unit :: TextAPI/./TextAPITests/TBDv2.ReadFile (43238 of 43701)
PASS: LLVM-Unit :: TextAPI/./TextAPITests/TBDv2.Platform_watchOS (43239 of 43701)
PASS: LLVM-Unit :: TextAPI/./TextAPITests/TBDv2.Platform_tvOS (43240 of 43701)
PASS: LLVM-Unit :: TextAPI/./TextAPITests/TBDv2.ReadFile2 (43241 of 43701)
PASS: LLVM-Unit :: TextAPI/./TextAPITests/TBDv2.Swift_1_0 (43242 of 43701)
PASS: LLVM-Unit :: TextAPI/./TextAPITests/TBDv2.Swift_1_1 (43243 of 43701)
PASS: LLVM-Unit :: TextAPI/./TextAPITests/TBDv2.Swift_3_0 (43244 of 43701)
PASS: LLVM-Unit :: TextAPI/./TextAPITests/TBDv2.Swift_2_0 (43245 of 43701)
PASS: LLVM-Unit :: TextAPI/./TextAPITests/TBDv2.Swift_4_0 (43246 of 43701)
PASS: LLVM-Unit :: TextAPI/./TextAPITests/TBDv2.Swift_5 (43247 of 43701)
PASS: LLVM-Unit :: TextAPI/./TextAPITests/TBDv2.Swift_99 (43248 of 43701)
PASS: LLVM-Unit :: TextAPI/./TextAPITests/TBDv2.UnknownPlatform (43249 of 43701)
PASS: LLVM-Unit :: TextAPI/./TextAPITests/TBDv2.WriteFile (43250 of 43701)
PASS: LLVM-Unit :: TextAPI/./TextAPITests/TBDv2.UnknownArchitecture (43251 of 43701)
PASS: LLVM-Unit :: TextAPI/./TextAPITests/TBDv3.Arch_arm64e (43252 of 43701)
PASS: LLVM-Unit :: TextAPI/./TextAPITests/TBDv3.InterfaceEquality (43253 of 43701)
PASS: LLVM-Unit :: TextAPI/./TextAPITests/TBDv3.InterfaceInequality (43254 of 43701)
PASS: LLVM-Unit :: TextAPI/./TextAPITests/TBDv3.MalformedFile2 (43255 of 43701)
PASS: LLVM-Unit :: TextAPI/./TextAPITests/TBDv3.MalformedFile1 (43256 of 43701)
PASS: LLVM-Unit :: TextAPI/./TextAPITests/TBDv3.Platform_bridgeOS (43257 of 43701)
PASS: LLVM-Unit :: TextAPI/./TextAPITests/TBDv3.Platform_iOS (43258 of 43701)
PASS: LLVM-Unit :: TextAPI/./TextAPITests/TBDv3.Platform_iOSSim (43259 of 43701)
PASS: LLVM-Unit :: TextAPI/./TextAPITests/TBDv3.Platform_macCatalyst (43260 of 43701)
PASS: LLVM-Unit :: TextAPI/./TextAPITests/TBDv3.Platform_macOS (43261 of 43701)
PASS: LLVM-Unit :: TextAPI/./TextAPITests/TBDv3.Platform_tvOS (43262 of 43701)
PASS: LLVM-Unit :: TextAPI/./TextAPITests/TBDv3.Platform_watchOS (43263 of 43701)
PASS: LLVM-Unit :: TextAPI/./TextAPITests/TBDv3.Platform_tvOSSim (43264 of 43701)
PASS: LLVM-Unit :: TextAPI/./TextAPITests/TBDv3.Platform_watchOSSim (43265 of 43701)
PASS: LLVM-Unit :: TextAPI/./TextAPITests/TBDv3.ReadFile (43266 of 43701)
PASS: LLVM-Unit :: TextAPI/./TextAPITests/TBDv3.Platform_zippered (43267 of 43701)
PASS: LLVM-Unit :: TextAPI/./TextAPITests/TBDv3.Swift_1_1 (43268 of 43701)
PASS: LLVM-Unit :: TextAPI/./TextAPITests/TBDv3.ReadMultipleDocuments (43269 of 43701)
PASS: LLVM-Unit :: TextAPI/./TextAPITests/TBDv3.Swift_1_0 (43270 of 43701)
PASS: LLVM-Unit :: TextAPI/./TextAPITests/TBDv3.Swift_2_0 (43271 of 43701)
PASS: LLVM-Unit :: TextAPI/./TextAPITests/TBDv3.Swift_3_0 (43272 of 43701)
PASS: LLVM-Unit :: TextAPI/./TextAPITests/TBDv3.Swift_4_0 (43273 of 43701)
PASS: LLVM-Unit :: TextAPI/./TextAPITests/TBDv3.Swift_5 (43274 of 43701)
PASS: LLVM-Unit :: TextAPI/./TextAPITests/TBDv3.Swift_99 (43275 of 43701)
PASS: LLVM-Unit :: TextAPI/./TextAPITests/TBDv3.UnknownArchitecture (43276 of 43701)
PASS: LLVM-Unit :: TextAPI/./TextAPITests/TBDv3.WriteMultipleDocuments (43277 of 43701)
PASS: LLVM-Unit :: TextAPI/./TextAPITests/TBDv4.InterfaceDiffVersionsEquality (43278 of 43701)
PASS: LLVM-Unit :: TextAPI/./TextAPITests/TBDv3.UnknownPlatform (43279 of 43701)
PASS: LLVM-Unit :: TextAPI/./TextAPITests/TBDv3.WriteFile (43280 of 43701)
PASS: LLVM-Unit :: TextAPI/./TextAPITests/TBDv4.InterfaceEquality (43281 of 43701)
PASS: LLVM-Unit :: TextAPI/./TextAPITests/TBDv4.InvalidArchitecture (43282 of 43701)
PASS: LLVM-Unit :: TextAPI/./TextAPITests/TBDv4.InterfaceInequality (43283 of 43701)
PASS: LLVM-Unit :: TextAPI/./TextAPITests/TBDv4.InvalidPlatform (43284 of 43701)
PASS: LLVM-Unit :: TextAPI/./TextAPITests/TBDv4.MultipleTargets (43285 of 43701)
PASS: LLVM-Unit :: TextAPI/./TextAPITests/TBDv4.MalformedFile1 (43286 of 43701)
PASS: LLVM-Unit :: TextAPI/./TextAPITests/TBDv4.MalformedFile2 (43287 of 43701)
PASS: LLVM-Unit :: TextAPI/./TextAPITests/TBDv4.MultipleTargetsSameArch (43288 of 43701)
PASS: LLVM-Unit :: TextAPI/./TextAPITests/TBDv4.MalformedFile3 (43289 of 43701)
PASS: LLVM-Unit :: TextAPI/./TextAPITests/TBDv4.MultipleTargetsSamePlatform (43290 of 43701)
PASS: LLVM-Unit :: TextAPI/./TextAPITests/TBDv4.ReadFile (43291 of 43701)
PASS: LLVM-Unit :: TextAPI/./TextAPITests/TBDv4.ReadMultipleDocuments (43292 of 43701)
PASS: LLVM-Unit :: TextAPI/./TextAPITests/TBDv4.Swift_2 (43293 of 43701)
PASS: LLVM-Unit :: TextAPI/./TextAPITests/TBDv4.Swift_1 (43294 of 43701)
PASS: LLVM-Unit :: TextAPI/./TextAPITests/TBDv4.Swift_5 (43295 of 43701)
PASS: LLVM-Unit :: TextAPI/./TextAPITests/TBDv4.Swift_99 (43296 of 43701)
PASS: LLVM-Unit :: TextAPI/./TextAPITests/TBDv4.Target_arm_bridgeOS (43297 of 43701)
PASS: LLVM-Unit :: TextAPI/./TextAPITests/TBDv4.Target_i386_driverkit (43298 of 43701)
PASS: LLVM-Unit :: TextAPI/./TextAPITests/TBDv4.Target_arm_iOS (43299 of 43701)
PASS: LLVM-Unit :: TextAPI/./TextAPITests/TBDv4.Target_i386_watchos_simulator (43300 of 43701)
PASS: LLVM-Unit :: TextAPI/./TextAPITests/TBDv4.Target_x86_ios (43301 of 43701)
PASS: LLVM-Unit :: TextAPI/./TextAPITests/TBDv4.Target_x86_macos (43302 of 43701)
PASS: LLVM-Unit :: TextAPI/./TextAPITests/TBDv4.Target_x86_ios_simulator (43303 of 43701)
PASS: LLVM-Unit :: TextAPI/./TextAPITests/TBDv4.Target_maccatalyst (43304 of 43701)
PASS: LLVM-Unit :: TextAPI/./TextAPITests/TBDv4.Target_x86_tvos_simulator (43305 of 43701)
PASS: LLVM-Unit :: TextAPI/./TextAPITests/TBDv4.WriteMultipleDocuments (43306 of 43701)
PASS: LLVM-Unit :: TextAPI/./TextAPITests/TBDv4.WriteFile (43307 of 43701)
PASS: LLVM-Unit :: Transforms/IPO/./IPOTests/AttributorTestBase.TestCast (43308 of 43701)
PASS: LLVM-Unit :: Transforms/IPO/./IPOTests/AttributorTestBase.IRPPositionCallBaseContext (43309 of 43701)
PASS: LLVM-Unit :: Transforms/IPO/./IPOTests/LowerTypeTests.BitSetBuilder (43310 of 43701)
PASS: LLVM-Unit :: Transforms/IPO/./IPOTests/LowerTypeTests.ByteArrayBuilder (43311 of 43701)
PASS: LLVM-Unit :: Transforms/IPO/./IPOTests/LowerTypeTests.GlobalLayoutBuilder (43312 of 43701)
PASS: LLVM-Unit :: Transforms/IPO/./IPOTests/WholeProgramDevirt.findLowestOffset (43313 of 43701)
PASS: LLVM-Unit :: Transforms/IPO/./IPOTests/WholeProgramDevirt.setReturnValues (43314 of 43701)
PASS: LLVM-Unit :: Transforms/Scalar/./ScalarTests/LoopPassManagerTest.FunctionPassInvalidationOfLoopAnalyses (43315 of 43701)
PASS: LLVM-Unit :: Transforms/Scalar/./ScalarTests/LICMTest.TestSCEVInvalidationOnHoisting (43316 of 43701)
PASS: LLVM-Unit :: Transforms/Scalar/./ScalarTests/LoopPassManagerTest.Basic (43317 of 43701)
PASS: LLVM-Unit :: Transforms/Scalar/./ScalarTests/LoopPassManagerTest.HandleLoopNestPass (43318 of 43701)
PASS: LLVM-Unit :: Transforms/Scalar/./ScalarTests/LoopPassManagerTest.IndirectInvalidation (43319 of 43701)
PASS: LLVM-Unit :: Transforms/Scalar/./ScalarTests/LoopPassManagerTest.IndirectOuterPassInvalidation (43320 of 43701)
PASS: LLVM-Unit :: Transforms/Scalar/./ScalarTests/LoopPassManagerTest.InvalidationOfBundledAnalyses (43321 of 43701)
PASS: LLVM-Unit :: Transforms/Scalar/./ScalarTests/LoopPassManagerTest.LoopChildInsertion (43322 of 43701)
PASS: LLVM-Unit :: Transforms/Scalar/./ScalarTests/LoopPassManagerTest.LoopDeletion (43323 of 43701)
PASS: LLVM-Unit :: Transforms/Scalar/./ScalarTests/LoopPassManagerTest.ModulePassInvalidationOfLoopAnalyses (43324 of 43701)
PASS: LLVM-Unit :: Transforms/Scalar/./ScalarTests/LoopPassManagerTest.LoopPeerInsertion (43325 of 43701)
PASS: LLVM-Unit :: Transforms/Utils/./UtilsTests/ASanStackFrameLayout.Test (43326 of 43701)
PASS: LLVM-Unit :: Transforms/Utils/./UtilsTests/BasicBlockUtils.NoUnreachableBlocksToEliminate (43327 of 43701)
PASS: LLVM-Unit :: Transforms/Utils/./UtilsTests/BasicBlockUtils.SplitBlockPredecessors (43328 of 43701)
PASS: LLVM-Unit :: Transforms/Utils/./UtilsTests/BasicBlockUtils.EliminateUnreachableBlocks (43329 of 43701)
PASS: LLVM-Unit :: Transforms/Utils/./UtilsTests/BasicBlockUtils.SetEdgeProbability (43330 of 43701)
PASS: LLVM-Unit :: Transforms/Utils/./UtilsTests/BasicBlockUtils.SplitCriticalEdge (43331 of 43701)
PASS: LLVM-Unit :: Transforms/Utils/./UtilsTests/BasicBlockUtils.SplitEdge_ex1 (43332 of 43701)
PASS: LLVM-Unit :: Transforms/Utils/./UtilsTests/BasicBlockUtils.SplitEdge_ex2 (43333 of 43701)
PASS: LLVM-Unit :: Transforms/Utils/./UtilsTests/BasicBlockUtils.SplitIndirectBrCriticalEdge (43334 of 43701)
PASS: LLVM-Unit :: Transforms/Utils/./UtilsTests/BasicBlockUtils.SplitEdge_ex4 (43335 of 43701)
PASS: LLVM-Unit :: Transforms/Utils/./UtilsTests/CallPromotionUtilsTest.TryPromoteCall (43336 of 43701)
PASS: LLVM-Unit :: Transforms/Utils/./UtilsTests/BasicBlockUtils.splitBasicBlockBefore_ex1 (43337 of 43701)
PASS: LLVM-Unit :: Transforms/Utils/./UtilsTests/BasicBlockUtils.SplitEdge_ex3 (43338 of 43701)
PASS: LLVM-Unit :: Transforms/Utils/./UtilsTests/CallPromotionUtilsTest.TryPromoteCall_MemberFunctionCalls (43339 of 43701)
PASS: LLVM-Unit :: Transforms/Utils/./UtilsTests/CallPromotionUtilsTest.TryPromoteCall_EmptyVTable (43340 of 43701)
PASS: LLVM-Unit :: Transforms/Utils/./UtilsTests/CallPromotionUtilsTest.TryPromoteCall_Legality (43341 of 43701)
PASS: LLVM-Unit :: Transforms/Utils/./UtilsTests/CallPromotionUtilsTest.TryPromoteCall_NoFPLoad (43342 of 43701)
PASS: LLVM-Unit :: Transforms/Utils/./UtilsTests/CallPromotionUtilsTest.TryPromoteCall_NoVTablePtrLoad (43343 of 43701)
PASS: LLVM-Unit :: Transforms/Utils/./UtilsTests/CallPromotionUtilsTest.TryPromoteCall_NoVTableInitFound (43344 of 43701)
PASS: LLVM-Unit :: Transforms/Utils/./UtilsTests/CallPromotionUtilsTest.TryPromoteCall_NullFP (43345 of 43701)
PASS: LLVM-Unit :: Transforms/Utils/./UtilsTests/CloneFunc.DebugIntrinsics (43346 of 43701)
PASS: LLVM-Unit :: Transforms/Utils/./UtilsTests/CloneFunc.InstructionOwnership (43347 of 43701)
PASS: LLVM-Unit :: Transforms/Utils/./UtilsTests/CloneFunc.Subprogram (43348 of 43701)
PASS: LLVM-Unit :: Transforms/Utils/./UtilsTests/CloneFunc.NewFunctionCreated (43349 of 43701)
PASS: LLVM-Unit :: Transforms/Utils/./UtilsTests/CloneFunction.CloneFunctionToDifferentModule (43350 of 43701)
PASS: LLVM-Unit :: Transforms/Utils/./UtilsTests/CloneFunction.CloneFunctionWithInalloca (43351 of 43701)
PASS: LLVM-Unit :: Transforms/Utils/./UtilsTests/CloneFunction.CloneFunctionWithSubprograms (43352 of 43701)
PASS: LLVM-Unit :: Transforms/Utils/./UtilsTests/CloneFunction.CloneEmptyFunction (43353 of 43701)
PASS: LLVM-Unit :: Transforms/Utils/./UtilsTests/CloneInstruction.Attributes (43354 of 43701)
PASS: LLVM-Unit :: Transforms/Utils/./UtilsTests/CloneInstruction.CallingConvention (43355 of 43701)
PASS: LLVM-Unit :: Transforms/Utils/./UtilsTests/CloneInstruction.DuplicateInstructionsToSplit (43356 of 43701)
PASS: LLVM-Unit :: Transforms/Utils/./UtilsTests/CloneInstruction.DuplicateInstructionsToSplitBlocksEq1 (43357 of 43701)
PASS: LLVM-Unit :: Transforms/Utils/./UtilsTests/CloneInstruction.DuplicateInstructionsToSplitBlocksEq2 (43358 of 43701)
PASS: LLVM-Unit :: Transforms/Utils/./UtilsTests/CloneInstruction.Exact (43359 of 43701)
PASS: LLVM-Unit :: Transforms/Utils/./UtilsTests/CloneInstruction.Inbounds (43360 of 43701)
PASS: LLVM-Unit :: Transforms/Utils/./UtilsTests/CloneInstruction.OverflowBits (43361 of 43701)
PASS: LLVM-Unit :: Transforms/Utils/./UtilsTests/CloneLoop.CloneLoopNest (43362 of 43701)
PASS: LLVM-Unit :: Transforms/Utils/./UtilsTests/CloneModule.Comdat (43363 of 43701)
PASS: LLVM-Unit :: Transforms/Utils/./UtilsTests/CloneModule.CompileUnit (43364 of 43701)
PASS: LLVM-Unit :: Transforms/Utils/./UtilsTests/CloneModule.GlobalDebugInfo (43365 of 43701)
PASS: LLVM-Unit :: Transforms/Utils/./UtilsTests/CloneModule.GlobalMetadata (43366 of 43701)
PASS: LLVM-Unit :: Transforms/Utils/./UtilsTests/CloneModule.Subprogram (43367 of 43701)
PASS: LLVM-Unit :: Transforms/Utils/./UtilsTests/CloneModule.Verify (43368 of 43701)
PASS: LLVM-Unit :: Transforms/Utils/./UtilsTests/CloneModule.OldModuleUnchanged (43369 of 43701)
PASS: LLVM-Unit :: Transforms/Utils/./UtilsTests/CodeExtractor.ExitPHIOnePredFromRegion (43370 of 43701)
PASS: LLVM-Unit :: Transforms/Utils/./UtilsTests/CodeExtractor.ExitStub (43371 of 43701)
PASS: LLVM-Unit :: Transforms/Utils/./UtilsTests/CodeExtractor.ExtractAndInvalidateAssumptionCache (43372 of 43701)
PASS: LLVM-Unit :: Transforms/Utils/./UtilsTests/CodeExtractor.StoreOutputInvokeResultAfterEHPad (43373 of 43701)
PASS: LLVM-Unit :: Transforms/Utils/./UtilsTests/CodeExtractor.RemoveBitcastUsesFromOuterLifetimeMarkers (43374 of 43701)
PASS: LLVM-Unit :: Transforms/Utils/./UtilsTests/CodeMoverUtils.IsControlFlowEquivalentCondNestTest (43375 of 43701)
PASS: LLVM-Unit :: Transforms/Utils/./UtilsTests/CodeMoverUtils.IsControlFlowEquivalentImbalanceTest (43376 of 43701)
PASS: LLVM-Unit :: Transforms/Utils/./UtilsTests/CodeExtractor.StoreOutputInvokeResultInExitStub (43377 of 43701)
PASS: LLVM-Unit :: Transforms/Utils/./UtilsTests/CodeMoverUtils.IsControlFlowEquivalentNotPostdomTest (43378 of 43701)
PASS: LLVM-Unit :: Transforms/Utils/./UtilsTests/CodeMoverUtils.IsControlFlowEquivalentOppositeCondTest (43379 of 43701)
PASS: LLVM-Unit :: Transforms/Utils/./UtilsTests/CodeMoverUtils.IsControlFlowEquivalentPointerTest (43380 of 43701)
PASS: LLVM-Unit :: Transforms/Utils/./UtilsTests/CodeMoverUtils.IsSafeToMoveTest1 (43381 of 43701)
PASS: LLVM-Unit :: Transforms/Utils/./UtilsTests/CodeMoverUtils.IsControlFlowEquivalentSimpleTest (43382 of 43701)
PASS: LLVM-Unit :: Transforms/Utils/./UtilsTests/CodeMoverUtils.IsSafeToMoveTest3 (43383 of 43701)
PASS: LLVM-Unit :: Transforms/Utils/./UtilsTests/CodeMoverUtils.IsSafeToMoveTest4 (43384 of 43701)
PASS: LLVM-Unit :: Transforms/Utils/./UtilsTests/CodeMoverUtils.IsSafeToMoveTest5 (43385 of 43701)
PASS: LLVM-Unit :: Transforms/Utils/./UtilsTests/CodeMoverUtils.IsSafeToMoveTest2 (43386 of 43701)
PASS: LLVM-Unit :: Transforms/Utils/./UtilsTests/CodeMoverUtils.IsSafeToMoveTest6 (43387 of 43701)
PASS: LLVM-Unit :: Transforms/Utils/./UtilsTests/DebugInfoDrop.DropOriginalDebugInfo (43388 of 43701)
PASS: LLVM-Unit :: Transforms/Utils/./UtilsTests/DebugInfoDummyAnalysis.PreserveOriginalDebugInfo (43389 of 43701)
PASS: LLVM-Unit :: Transforms/Utils/./UtilsTests/FunctionComparatorTest.TestAPI (43390 of 43701)
PASS: LLVM-Unit :: Transforms/Utils/./UtilsTests/IntegerDivision.SDiv (43391 of 43701)
PASS: LLVM-Unit :: Transforms/Utils/./UtilsTests/IntegerDivision.SDiv64 (43392 of 43701)
PASS: LLVM-Unit :: Transforms/Utils/./UtilsTests/IntegerDivision.SRem (43393 of 43701)
PASS: LLVM-Unit :: Transforms/Utils/./UtilsTests/IntegerDivision.SRem64 (43394 of 43701)
PASS: LLVM-Unit :: Transforms/Utils/./UtilsTests/IntegerDivision.UDiv (43395 of 43701)
PASS: LLVM-Unit :: Transforms/Utils/./UtilsTests/IntegerDivision.UDiv64 (43396 of 43701)
PASS: LLVM-Unit :: Transforms/Utils/./UtilsTests/IntegerDivision.URem (43397 of 43701)
PASS: LLVM-Unit :: Transforms/Utils/./UtilsTests/IntegerDivision.URem64 (43398 of 43701)
PASS: LLVM-Unit :: Transforms/Utils/./UtilsTests/Local.CanReplaceOperandWithVariable (43399 of 43701)
PASS: LLVM-Unit :: Transforms/Utils/./UtilsTests/Local.ChangeToUnreachable (43400 of 43701)
PASS: LLVM-Unit :: Transforms/Utils/./UtilsTests/Local.ConstantFoldTerminator (43401 of 43701)
PASS: LLVM-Unit :: Transforms/Utils/./UtilsTests/Local.RecursivelyDeleteDeadPHINodes (43402 of 43701)
PASS: LLVM-Unit :: Transforms/Utils/./UtilsTests/Local.MergeBasicBlockIntoOnlyPred (43403 of 43701)
PASS: LLVM-Unit :: Transforms/Utils/./UtilsTests/Local.RemoveDuplicatePHINodes (43404 of 43701)
PASS: LLVM-Unit :: Transforms/Utils/./UtilsTests/Local.ReplaceAllDbgUsesWith (43405 of 43701)
PASS: LLVM-Unit :: Transforms/Utils/./UtilsTests/Local.RemoveUnreachableBlocks (43406 of 43701)
PASS: LLVM-Unit :: Transforms/Utils/./UtilsTests/Local.SimplifyCFGWithNullAC (43407 of 43701)
PASS: LLVM-Unit :: Transforms/Utils/./UtilsTests/Local.ReplaceDbgDeclare (43408 of 43701)
PASS: LLVM-Unit :: Transforms/Utils/./UtilsTests/LoopRotate.MultiDeoptExit (43409 of 43701)
PASS: LLVM-Unit :: Transforms/Utils/./UtilsTests/LoopUnrollRuntime.Latch (43410 of 43701)
PASS: LLVM-Unit :: Transforms/Utils/./UtilsTests/LoopRotate.MultiDeoptExit_Nondup (43411 of 43701)
PASS: LLVM-Unit :: Transforms/Utils/./UtilsTests/LoopUtils.DeleteDeadLoopNest (43412 of 43701)
PASS: LLVM-Unit :: Transforms/Utils/./UtilsTests/ModuleUtils.AppendToUsedList1 (43413 of 43701)
PASS: LLVM-Unit :: Transforms/Utils/./UtilsTests/ModuleUtils.AppendToUsedList2 (43414 of 43701)
PASS: LLVM-Unit :: Transforms/Utils/./UtilsTests/SSAUpdaterBulk.Irreducible (43415 of 43701)
PASS: LLVM-Unit :: Transforms/Utils/./UtilsTests/SalvageDebugInfoTest.RecursiveBlockSimplification (43416 of 43701)
PASS: LLVM-Unit :: Transforms/Utils/./UtilsTests/SSAUpdaterBulk.SimpleMerge (43417 of 43701)
PASS: LLVM-Unit :: Transforms/Utils/./UtilsTests/SalvageDebugInfoTest.RecursiveInstDeletion (43418 of 43701)
PASS: LLVM-Unit :: Transforms/Utils/./UtilsTests/ScalarEvolutionExpanderTest.ExpandPtrTypeSCEV (43419 of 43701)
PASS: LLVM-Unit :: Transforms/Utils/./UtilsTests/ScalarEvolutionExpanderTest.ExpandNonIntegralPtrWithNullBase (43420 of 43701)
PASS: LLVM-Unit :: Transforms/Utils/./UtilsTests/ScalarEvolutionExpanderTest.SCEVCacheNSW (43421 of 43701)
PASS: LLVM-Unit :: Transforms/Utils/./UtilsTests/ScalarEvolutionExpanderTest.SCEVCacheNUW (43422 of 43701)
PASS: LLVM-Unit :: Transforms/Utils/./UtilsTests/ScalarEvolutionExpanderTest.SCEVExpandInsertCanonicalIV (43423 of 43701)
PASS: LLVM-Unit :: Transforms/Utils/./UtilsTests/ScalarEvolutionExpanderTest.SCEVExpandNonAffineAddRec (43424 of 43701)
PASS: LLVM-Unit :: Transforms/Utils/./UtilsTests/ScalarEvolutionExpanderTest.SCEVExpanderIsSafeToExpandAt (43425 of 43701)
PASS: LLVM-Unit :: Transforms/Utils/./UtilsTests/ScalarEvolutionExpanderTest.SCEVExpanderNSW (43426 of 43701)
PASS: LLVM-Unit :: Transforms/Utils/./UtilsTests/ScalarEvolutionExpanderTest.SCEVExpanderShlNSW (43427 of 43701)
PASS: LLVM-Unit :: Transforms/Utils/./UtilsTests/ScalarEvolutionExpanderTest.SCEVExpanderNUW (43428 of 43701)
PASS: LLVM-Unit :: Transforms/Utils/./UtilsTests/ScalarEvolutionExpanderTest.SCEVZeroExtendExprNonIntegral (43429 of 43701)
PASS: LLVM-Unit :: Transforms/Utils/./UtilsTests/SizeOptsTest.Test (43430 of 43701)
PASS: LLVM-Unit :: Transforms/Utils/./UtilsTests/VFABIAttrTest.Write (43431 of 43701)
PASS: LLVM-Unit :: Transforms/Utils/./UtilsTests/ValueMapperTest.mapMDNode (43432 of 43701)
PASS: LLVM-Unit :: Transforms/Utils/./UtilsTests/ValueMapperTest.mapMDNodeCycle (43433 of 43701)
PASS: LLVM-Unit :: Transforms/Utils/./UtilsTests/ValueMapperTest.mapMDNodeDistinct (43434 of 43701)
PASS: LLVM-Unit :: Transforms/Utils/./UtilsTests/ValueMapperTest.mapMDNodeDuplicatedCycle (43435 of 43701)
PASS: LLVM-Unit :: Transforms/Utils/./UtilsTests/ValueMapperTest.mapMDNodeDistinctOperands (43436 of 43701)
PASS: LLVM-Unit :: Transforms/Utils/./UtilsTests/ValueMapperTest.mapMDNodeSeededWithNull (43437 of 43701)
PASS: LLVM-Unit :: Transforms/Utils/./UtilsTests/ValueMapperTest.mapMDNodeSeeded (43438 of 43701)
PASS: LLVM-Unit :: Transforms/Utils/./UtilsTests/ValueMapperTest.mapMetadataConstantAsMetadata (43439 of 43701)
PASS: LLVM-Unit :: Transforms/Utils/./UtilsTests/ValueMapperTest.mapMDNodeUnresolved (43440 of 43701)
PASS: LLVM-Unit :: Transforms/Utils/./UtilsTests/ValueMapperTest.mapMetadataGetMappedMD (43441 of 43701)
PASS: LLVM-Unit :: Transforms/Utils/./UtilsTests/ValueMapperTest.mapMetadataMDString (43442 of 43701)
PASS: LLVM-Unit :: Transforms/Utils/./UtilsTests/ValueMapperTest.mapMetadataNullMapGlobalWithIgnoreMissingLocals (43443 of 43701)
PASS: LLVM-Unit :: Transforms/Utils/./UtilsTests/ValueMapperTest.mapMetadataNoModuleLevelChanges (43444 of 43701)
PASS: LLVM-Unit :: Transforms/Utils/./UtilsTests/ValueMapperTest.mapValueLocalAsMetadata (43445 of 43701)
PASS: LLVM-Unit :: Transforms/Utils/./UtilsTests/ValueMapperTest.mapValueLocalAsMetadataToConstant (43446 of 43701)
PASS: LLVM-Unit :: Transforms/Vectorize/./VectorizeTests/VPBasicBlockTest.getPlan (43447 of 43701)
PASS: LLVM-Unit :: Transforms/Vectorize/./VectorizeTests/VPBasicBlockTest.TraversingIteratorTest (43448 of 43701)
PASS: LLVM-Unit :: Transforms/Vectorize/./VectorizeTests/VPDoubleValueDefTest.traverseUseLists (43449 of 43701)
PASS: LLVM-Unit :: Transforms/Vectorize/./VectorizeTests/VPInstructionTest.eraseFromParent (43450 of 43701)
PASS: LLVM-Unit :: Transforms/Vectorize/./VectorizeTests/VPInstructionTest.insertBefore (43451 of 43701)
PASS: LLVM-Unit :: Transforms/Vectorize/./VectorizeTests/VPInstructionTest.moveAfter (43452 of 43701)
PASS: LLVM-Unit :: Transforms/Vectorize/./VectorizeTests/VPInstructionTest.moveBefore (43453 of 43701)
PASS: LLVM-Unit :: Transforms/Vectorize/./VectorizeTests/VPInstructionTest.releaseOperandsAtDeletion (43454 of 43701)
PASS: LLVM-Unit :: Transforms/Vectorize/./VectorizeTests/VPInstructionTest.replaceAllUsesWith (43455 of 43701)
PASS: LLVM-Unit :: Transforms/Vectorize/./VectorizeTests/VPInstructionTest.setOperand (43456 of 43701)
PASS: LLVM-Unit :: Transforms/Vectorize/./VectorizeTests/VPRecipeTest.CastVPBlendRecipeToVPUser (43457 of 43701)
PASS: LLVM-Unit :: Transforms/Vectorize/./VectorizeTests/VPRecipeTest.CastVPBranchOnMaskRecipeToVPUser (43458 of 43701)
PASS: LLVM-Unit :: Transforms/Vectorize/./VectorizeTests/VPRecipeTest.CastVPInterleaveRecipeToVPUser (43459 of 43701)
PASS: LLVM-Unit :: Transforms/Vectorize/./VectorizeTests/VPRecipeTest.CastVPInstructionToVPUser (43460 of 43701)
PASS: LLVM-Unit :: Transforms/Vectorize/./VectorizeTests/VPRecipeTest.CastVPReductionRecipeToVPUser (43461 of 43701)
PASS: LLVM-Unit :: Transforms/Vectorize/./VectorizeTests/VPRecipeTest.CastVPReplicateRecipeToVPUser (43462 of 43701)
PASS: LLVM-Unit :: Transforms/Vectorize/./VectorizeTests/VPRecipeTest.CastVPWidenCallRecipeToVPUserAndVPDef (43463 of 43701)
PASS: LLVM-Unit :: Transforms/Vectorize/./VectorizeTests/VPRecipeTest.CastVPWidenGEPRecipeToVPUserAndVPDef (43464 of 43701)
PASS: LLVM-Unit :: Transforms/Vectorize/./VectorizeTests/VPRecipeTest.CastVPWidenMemoryInstructionRecipeToVPUserAndVPDef (43465 of 43701)
PASS: LLVM-Unit :: Transforms/Vectorize/./VectorizeTests/VPRecipeTest.CastVPWidenRecipeToVPUser (43466 of 43701)
PASS: LLVM-Unit :: Transforms/Vectorize/./VectorizeTests/VPRecipeTest.CastVPWidenSelectRecipeToVPUserAndVPDef (43467 of 43701)
PASS: LLVM-Unit :: Transforms/Vectorize/./VectorizeTests/VPRecipeTest.MayHaveSideEffects (43468 of 43701)
PASS: LLVM-Unit :: Transforms/Vectorize/./VectorizeTests/VPlanDominatorTreeTest.BasicVPBBDomination (43469 of 43701)
PASS: LLVM-Unit :: Transforms/Vectorize/./VectorizeTests/VPlanHCFGTest.testVPInstructionToVPRecipesInner (43470 of 43701)
PASS: LLVM-Unit :: Transforms/Vectorize/./VectorizeTests/VPlanHCFGTest.testBuildHCFGInnerLoop (43471 of 43701)
PASS: LLVM-Unit :: Transforms/Vectorize/./VectorizeTests/VPlanLoopInfo.BasicLoopInfoTest (43472 of 43701)
PASS: LLVM-Unit :: Transforms/Vectorize/./VectorizeTests/VPlanPredicatorTest.BasicPredicatorTest (43473 of 43701)
PASS: LLVM-Unit :: Transforms/Vectorize/./VectorizeTests/VPlanPredicatorTest.PredicatorNegOrTest (43474 of 43701)
PASS: LLVM-Unit :: Transforms/Vectorize/./VectorizeTests/VPlanSlpTest.testInstrsInDifferentBBs2 (43475 of 43701)
PASS: LLVM-Unit :: Transforms/Vectorize/./VectorizeTests/VPlanSlpTest.testInstrsInDifferentBBs (43476 of 43701)
PASS: LLVM-Unit :: Transforms/Vectorize/./VectorizeTests/VPlanSlpTest.testSlpAtomicLoad (43477 of 43701)
PASS: LLVM-Unit :: Transforms/Vectorize/./VectorizeTests/VPlanSlpTest.testSlpReorder_1 (43478 of 43701)
PASS: LLVM-Unit :: Transforms/Vectorize/./VectorizeTests/VPlanSlpTest.testSlpAtomicStore (43479 of 43701)
PASS: LLVM-Unit :: Transforms/Vectorize/./VectorizeTests/VPlanSlpTest.testSlpReorder_2 (43480 of 43701)
PASS: LLVM-Unit :: Transforms/Vectorize/./VectorizeTests/VPlanSlpTest.testSlpReorder_3 (43481 of 43701)
PASS: LLVM-Unit :: Transforms/Vectorize/./VectorizeTests/VPlanSlpTest.testSlpReorder_4 (43482 of 43701)
PASS: LLVM-Unit :: Transforms/Vectorize/./VectorizeTests/VPlanSlpTest.testSlpReuse_1 (43483 of 43701)
PASS: LLVM-Unit :: Transforms/Vectorize/./VectorizeTests/VPlanSlpTest.testSlpSimple_2 (43484 of 43701)
PASS: LLVM-Unit :: Transforms/Vectorize/./VectorizeTests/VPlanSlpTest.testSlpReuse_2 (43485 of 43701)
PASS: LLVM-Unit :: Transforms/Vectorize/./VectorizeTests/VPlanSlpTest.testSlpSimple_3 (43486 of 43701)
PASS: LLVM-Unit :: XRay/./XRayTests/FDRBlockIndexerTest.IndexBlocksV3 (43487 of 43701)
PASS: LLVM-Unit :: XRay/./XRayTests/FDRBlockVerifierTest.IgnoreRecordsAfterEOB (43488 of 43701)
PASS: LLVM-Unit :: XRay/./XRayTests/FDRBlockVerifierTest.MalformedV2 (43489 of 43701)
PASS: LLVM-Unit :: XRay/./XRayTests/FDRBlockVerifierTest.MissingBufferExtents (43490 of 43701)
PASS: LLVM-Unit :: XRay/./XRayTests/FDRBlockVerifierTest.MissingPIDRecord (43491 of 43701)
PASS: LLVM-Unit :: XRay/./XRayTests/FDRRecordPrinterTest.WriteFunctionRecordEnter (43492 of 43701)
PASS: LLVM-Unit :: XRay/./XRayTests/FDRBlockVerifierTest.ValidBlocksV3 (43493 of 43701)
PASS: LLVM-Unit :: XRay/./XRayTests/FDRRecordPrinterTest.WriteFunctionRecordEnterArg (43494 of 43701)
PASS: LLVM-Unit :: XRay/./XRayTests/FDRRecordPrinterTest.WriteFunctionRecordTailExit (43495 of 43701)
PASS: LLVM-Unit :: XRay/./XRayTests/FDRRecordPrinterTest.WriteFunctionRecordExit (43496 of 43701)
PASS: LLVM-Unit :: XRay/./XRayTests/FDRTraceWriterTest.WriteToStringBufferVersion1 (43497 of 43701)
PASS: LLVM-Unit :: XRay/./XRayTests/FDRTraceWriterTest.WriteToStringBufferVersion2 (43498 of 43701)
PASS: LLVM-Unit :: XRay/./XRayTests/GraphTest.TestConstruction (43499 of 43701)
PASS: LLVM-Unit :: XRay/./XRayTests/GraphTest.TestEdgeAccessOperator (43500 of 43701)
PASS: LLVM-Unit :: XRay/./XRayTests/FDRTraceWriterTest.WriteToStringBufferVersion3 (43501 of 43701)
PASS: LLVM-Unit :: XRay/./XRayTests/GraphTest.TestiVertexAccessOperator (43502 of 43701)
PASS: LLVM-Unit :: XRay/./XRayTests/GraphTest/0.TestCopyAssign (43503 of 43701)
PASS: LLVM-Unit :: XRay/./XRayTests/GraphTest/0.TestGraphEdge (43504 of 43701)
PASS: LLVM-Unit :: XRay/./XRayTests/GraphTest/0.TestCopyConstructor (43505 of 43701)
PASS: LLVM-Unit :: XRay/./XRayTests/GraphTest/0.TestGraphVertex (43506 of 43701)
PASS: LLVM-Unit :: XRay/./XRayTests/GraphTest/1.TestGraphEdge (43507 of 43701)
PASS: LLVM-Unit :: XRay/./XRayTests/GraphTest/1.TestCopyAssign (43508 of 43701)
PASS: LLVM-Unit :: XRay/./XRayTests/GraphTest/1.TestCopyConstructor (43509 of 43701)
PASS: LLVM-Unit :: XRay/./XRayTests/GraphTest/0.TestMoveConstructor (43510 of 43701)
PASS: LLVM-Unit :: XRay/./XRayTests/GraphTest/1.TestMoveConstructor (43511 of 43701)
PASS: LLVM-Unit :: XRay/./XRayTests/GraphTest/1.TestGraphVertex (43512 of 43701)
PASS: LLVM-Unit :: XRay/./XRayTests/ProfileTest.CopyProfile (43513 of 43701)
PASS: LLVM-Unit :: XRay/./XRayTests/ProfileTest.AddBlocks (43514 of 43701)
PASS: LLVM-Unit :: XRay/./XRayTests/ProfileTest.CreateProfile (43515 of 43701)
PASS: LLVM-Unit :: XRay/./XRayTests/ProfileTest.ExpandPath (43516 of 43701)
PASS: LLVM-Unit :: XRay/./XRayTests/ProfileTest.MergeProfilesByStack (43517 of 43701)
PASS: LLVM-Unit :: XRay/./XRayTests/ProfileTest.InternPath (43518 of 43701)
PASS: LLVM-Unit :: XRay/./XRayTests/ProfileTest.MergeProfilesByThreadAccumulate (43519 of 43701)
PASS: LLVM-Unit :: XRay/./XRayTests/ProfileTest.MergeProfilesByStackAccumulate (43520 of 43701)
PASS: LLVM-Unit :: XRay/./XRayTests/ProfileTest.MergeProfilesByThread (43521 of 43701)
PASS: LLVM-Unit :: XRay/./XRayTests/ProfileTest.MoveProfile (43522 of 43701)
PASS: LLVM-Unit :: XRay/./XRayTests/Records/PrinterTest/0.PrintsRecord (43523 of 43701)
PASS: LLVM-Unit :: XRay/./XRayTests/Records/PrinterTest/1.PrintsRecord (43524 of 43701)
PASS: LLVM-Unit :: XRay/./XRayTests/Records/PrinterTest/2.PrintsRecord (43525 of 43701)
PASS: LLVM-Unit :: XRay/./XRayTests/Records/PrinterTest/3.PrintsRecord (43526 of 43701)
PASS: LLVM-Unit :: XRay/./XRayTests/Records/PrinterTest/4.PrintsRecord (43527 of 43701)
PASS: LLVM-Unit :: XRay/./XRayTests/Records/PrinterTest/5.PrintsRecord (43528 of 43701)
PASS: LLVM-Unit :: XRay/./XRayTests/Records/PrinterTest/7.PrintsRecord (43529 of 43701)
PASS: LLVM-Unit :: XRay/./XRayTests/Records/PrinterTest/6.PrintsRecord (43530 of 43701)
PASS: LLVM-Unit :: XRay/./XRayTests/Records/PrinterTest/8.PrintsRecord (43531 of 43701)
PASS: LLVM-Unit :: XRay/./XRayTests/Records/RoundTripTest/0.RoundTripsSingleValue (43532 of 43701)
PASS: LLVM-Unit :: XRay/./XRayTests/Records/PrinterTest/9.PrintsRecord (43533 of 43701)
PASS: LLVM-Unit :: XRay/./XRayTests/Records/RoundTripTest/1.RoundTripsSingleValue (43534 of 43701)
PASS: LLVM-Unit :: XRay/./XRayTests/Records/RoundTripTest/2.RoundTripsSingleValue (43535 of 43701)
PASS: LLVM-Unit :: XRay/./XRayTests/Records/RoundTripTest/3.RoundTripsSingleValue (43536 of 43701)
PASS: LLVM-Unit :: XRay/./XRayTests/Records/RoundTripTest/4.RoundTripsSingleValue (43537 of 43701)
PASS: LLVM-Unit :: XRay/./XRayTests/Records/RoundTripTest/5.RoundTripsSingleValue (43538 of 43701)
PASS: LLVM-Unit :: XRay/./XRayTests/Records/RoundTripTest/6.RoundTripsSingleValue (43539 of 43701)
PASS: LLVM-Unit :: XRay/./XRayTests/Records/RoundTripTest/7.RoundTripsSingleValue (43540 of 43701)
PASS: LLVM-Unit :: XRay/./XRayTests/Records/RoundTripTestV5/0.RoundTripsSingleValue (43541 of 43701)
PASS: LLVM-Unit :: XRay/./XRayTests/Records/RoundTripTestV5/1.RoundTripsSingleValue (43542 of 43701)
PASS: LLVM-Unit :: XRay/./XRayTests/Records/RoundTripTestV5/2.RoundTripsSingleValue (43543 of 43701)
PASS: LLVM-Unit :: XRay/./XRayTests/Records/RoundTripTestV5/3.RoundTripsSingleValue (43544 of 43701)
PASS: LLVM-Unit :: XRay/./XRayTests/Records/RoundTripTestV5/4.RoundTripsSingleValue (43545 of 43701)
PASS: LLVM-Unit :: XRay/./XRayTests/Records/RoundTripTestV5/6.RoundTripsSingleValue (43546 of 43701)
PASS: LLVM-Unit :: XRay/./XRayTests/Records/RoundTripTestV5/5.RoundTripsSingleValue (43547 of 43701)
PASS: LLVM-Unit :: XRay/./XRayTests/Records/RoundTripTestV5/7.RoundTripsSingleValue (43548 of 43701)
PASS: LLVM-Unit :: XRay/./XRayTests/XRayFDRTest.BuilderAndBlockIndexer (43549 of 43701)
PASS: LLVM-Unit :: XRay/./XRayTests/Records/RoundTripTestV5/8.RoundTripsSingleValue (43550 of 43701)
PASS: LLVM-Unit :: XRay/./XRayTests/XRayFDRTest.BuilderAndBlockVerifier (43551 of 43701)
PASS: LLVM-Unit :: XRay/./XRayTests/XRayFDRTest.IndexAndVerifyBlocks (43552 of 43701)
PASS: LLVM-Unit :: tools/llvm-cfi-verify/./CFIVerifyTests/BasicAArch64FileAnalysisTest.AArch64BasicProtected (43553 of 43701)
PASS: LLVM-Unit :: tools/llvm-cfi-verify/./CFIVerifyTests/BasicAArch64FileAnalysisTest.AArch64BasicUnprotected (43554 of 43701)
PASS: LLVM-Unit :: tools/llvm-cfi-verify/./CFIVerifyTests/BasicAArch64FileAnalysisTest.AArch64ClobberBasic (43555 of 43701)
PASS: LLVM-Unit :: tools/llvm-cfi-verify/./CFIVerifyTests/BasicAArch64FileAnalysisTest.AArch64ClobberLoadAddBad (43556 of 43701)
PASS: LLVM-Unit :: tools/llvm-cfi-verify/./CFIVerifyTests/BasicAArch64FileAnalysisTest.AArch64ClobberLoadAddBad2 (43557 of 43701)
PASS: LLVM-Unit :: tools/llvm-cfi-verify/./CFIVerifyTests/BasicAArch64FileAnalysisTest.AArch64ClobberLoadAddGood (43558 of 43701)
PASS: LLVM-Unit :: tools/llvm-cfi-verify/./CFIVerifyTests/BasicAArch64FileAnalysisTest.AArch64ClobberOneLoad (43559 of 43701)
PASS: LLVM-Unit :: tools/llvm-cfi-verify/./CFIVerifyTests/BasicAArch64FileAnalysisTest.AArch64ClobberUnrelatedLoads (43560 of 43701)
PASS: LLVM-Unit :: tools/llvm-cfi-verify/./CFIVerifyTests/BasicAArch64FileAnalysisTest.AArch64ClobberUnrelatedSecondLoad (43561 of 43701)
PASS: LLVM-Unit :: tools/llvm-cfi-verify/./CFIVerifyTests/BasicAArch64FileAnalysisTest.AArch64ClobberTwoLoads (43562 of 43701)
PASS: LLVM-Unit :: tools/llvm-cfi-verify/./CFIVerifyTests/BasicAArch64FileAnalysisTest.AArch64GoodAndBadPaths (43563 of 43701)
PASS: LLVM-Unit :: tools/llvm-cfi-verify/./CFIVerifyTests/BasicAArch64FileAnalysisTest.AArch64TwoPaths (43564 of 43701)
PASS: LLVM-Unit :: tools/llvm-cfi-verify/./CFIVerifyTests/BasicAArch64FileAnalysisTest.AArch64TwoPathsBadLoad1 (43565 of 43701)
PASS: LLVM-Unit :: tools/llvm-cfi-verify/./CFIVerifyTests/BasicGraphBuilderTest.BuildFlowGraphComplexExample (43566 of 43701)
PASS: LLVM-Unit :: tools/llvm-cfi-verify/./CFIVerifyTests/BasicAArch64FileAnalysisTest.AArch64TwoPathsBadLoad2 (43567 of 43701)
PASS: LLVM-Unit :: tools/llvm-cfi-verify/./CFIVerifyTests/BasicGraphBuilderTest.BuildFlowGraphFailures (43568 of 43701)
PASS: LLVM-Unit :: tools/llvm-cfi-verify/./CFIVerifyTests/BasicGraphBuilderTest.BuildFlowGraphConditionalInfiniteLoop (43569 of 43701)
PASS: LLVM-Unit :: tools/llvm-cfi-verify/./CFIVerifyTests/BasicGraphBuilderTest.BuildFlowGraphLengthExceededDownwards (43570 of 43701)
PASS: LLVM-Unit :: tools/llvm-cfi-verify/./CFIVerifyTests/BasicGraphBuilderTest.BuildFlowGraphNoFlowsToIndirection (43571 of 43701)
PASS: LLVM-Unit :: tools/llvm-cfi-verify/./CFIVerifyTests/BasicGraphBuilderTest.BuildFlowGraphLengthExceededUpwards (43572 of 43701)
PASS: LLVM-Unit :: tools/llvm-cfi-verify/./CFIVerifyTests/BasicGraphBuilderTest.BuildFlowGraphNoXrefs (43573 of 43701)
PASS: LLVM-Unit :: tools/llvm-cfi-verify/./CFIVerifyTests/BasicGraphBuilderTest.BuildFlowGraphTestDualPathDualUd2 (43574 of 43701)
PASS: LLVM-Unit :: tools/llvm-cfi-verify/./CFIVerifyTests/BasicGraphBuilderTest.BuildFlowGraphTestDualPathSingleUd2 (43575 of 43701)
PASS: LLVM-Unit :: tools/llvm-cfi-verify/./CFIVerifyTests/BasicGraphBuilderTest.BuildFlowGraphTestSinglePathFallthroughUd2 (43576 of 43701)
PASS: LLVM-Unit :: tools/llvm-cfi-verify/./CFIVerifyTests/BasicGraphBuilderTest.BuildFlowGraphUnconditionalInfiniteLoop (43577 of 43701)
PASS: LLVM-Unit :: tools/llvm-cfi-verify/./CFIVerifyTests/BasicX86FileAnalysisTest.CFIProtectionBasicFallthroughToUd2 (43578 of 43701)
PASS: LLVM-Unit :: tools/llvm-cfi-verify/./CFIVerifyTests/BasicGraphBuilderTest.BuildFlowGraphTestSinglePathJumpUd2 (43579 of 43701)
PASS: LLVM-Unit :: tools/llvm-cfi-verify/./CFIVerifyTests/BasicGraphBuilderTest.BuildFlowGraphWithRepeatedWork (43580 of 43701)
PASS: LLVM-Unit :: tools/llvm-cfi-verify/./CFIVerifyTests/BasicX86FileAnalysisTest.BasicDisassemblyTraversalTest (43581 of 43701)
PASS: LLVM-Unit :: tools/llvm-cfi-verify/./CFIVerifyTests/BasicX86FileAnalysisTest.CFIProtectionBasicJumpToUd2 (43582 of 43701)
PASS: LLVM-Unit :: tools/llvm-cfi-verify/./CFIVerifyTests/BasicX86FileAnalysisTest.CFIProtectionClobberDualPathImplicit (43583 of 43701)
PASS: LLVM-Unit :: tools/llvm-cfi-verify/./CFIVerifyTests/BasicX86FileAnalysisTest.CFIProtectionClobberSinglePathExplicit (43584 of 43701)
PASS: LLVM-Unit :: tools/llvm-cfi-verify/./CFIVerifyTests/BasicX86FileAnalysisTest.CFIProtectionClobberSinglePathExplicit2 (43585 of 43701)
PASS: LLVM-Unit :: tools/llvm-cfi-verify/./CFIVerifyTests/BasicX86FileAnalysisTest.CFIProtectionClobberSinglePathImplicit (43586 of 43701)
PASS: LLVM-Unit :: tools/llvm-cfi-verify/./CFIVerifyTests/BasicX86FileAnalysisTest.CFIProtectionComplexExample (43587 of 43701)
PASS: LLVM-Unit :: tools/llvm-cfi-verify/./CFIVerifyTests/BasicX86FileAnalysisTest.CFIProtectionDualFailLimitDownwards (43588 of 43701)
PASS: LLVM-Unit :: tools/llvm-cfi-verify/./CFIVerifyTests/BasicX86FileAnalysisTest.CFIProtectionDualFailLimitUpwards (43589 of 43701)
PASS: LLVM-Unit :: tools/llvm-cfi-verify/./CFIVerifyTests/BasicX86FileAnalysisTest.CFIProtectionDualPathSingleUd2 (43590 of 43701)
PASS: LLVM-Unit :: tools/llvm-cfi-verify/./CFIVerifyTests/BasicX86FileAnalysisTest.CFIProtectionDualPathUd2 (43591 of 43701)
PASS: LLVM-Unit :: tools/llvm-cfi-verify/./CFIVerifyTests/BasicX86FileAnalysisTest.CFIProtectionGoodAndBadPaths (43592 of 43701)
PASS: LLVM-Unit :: tools/llvm-cfi-verify/./CFIVerifyTests/BasicX86FileAnalysisTest.CFIProtectionInvalidTargets (43593 of 43701)
PASS: LLVM-Unit :: tools/llvm-cfi-verify/./CFIVerifyTests/BasicX86FileAnalysisTest.CFIProtectionWithUnconditionalJumpInFallthrough (43594 of 43701)
PASS: LLVM-Unit :: tools/llvm-cfi-verify/./CFIVerifyTests/BasicX86FileAnalysisTest.CFITrapTest (43595 of 43701)
PASS: LLVM-Unit :: tools/llvm-cfi-verify/./CFIVerifyTests/BasicX86FileAnalysisTest.FallThroughTest (43596 of 43701)
PASS: LLVM-Unit :: tools/llvm-cfi-verify/./CFIVerifyTests/BasicX86FileAnalysisTest.ControlFlowXRefsTest (43597 of 43701)
PASS: LLVM-Unit :: tools/llvm-cfi-verify/./CFIVerifyTests/BasicX86FileAnalysisTest.PrevAndNextFromBadInst (43598 of 43701)
PASS: LLVM-Unit :: tools/llvm-cfi-verify/./CFIVerifyTests/BasicX86FileAnalysisTest.DefiniteNextInstructionTest (43599 of 43701)
PASS: LLVM-Unit :: tools/llvm-cfi-verify/./CFIVerifyTests/BasicX86FileAnalysisTest.UndefSearchLengthOneTest (43600 of 43701)
PASS: LLVM-Unit :: tools/llvm-cfi-verify/./CFIVerifyTests/BasicX86FileAnalysisTest.UndefSearchLengthOneTestFarAway (43601 of 43701)
PASS: LLVM-Unit :: tools/llvm-exegesis/./LLVMExegesisTests/ClusteringTest.Clusters3D_InvalidOrder (43602 of 43701)
PASS: LLVM-Unit :: tools/llvm-exegesis/./LLVMExegesisTests/ClusteringTest.Clusters3D_InvalidSize (43603 of 43701)
PASS: LLVM-Unit :: tools/llvm-exegesis/./LLVMExegesisTests/ClusteringTest.Clusters3D (43604 of 43701)
PASS: LLVM-Unit :: tools/llvm-exegesis/./LLVMExegesisTests/ClusteringTest.Ordering1 (43605 of 43701)
PASS: LLVM-Unit :: tools/llvm-exegesis/./LLVMExegesisTests/CombinationGenerator.Column (43606 of 43701)
PASS: LLVM-Unit :: tools/llvm-exegesis/./LLVMExegesisTests/ClusteringTest.Ordering2 (43607 of 43701)
PASS: LLVM-Unit :: tools/llvm-exegesis/./LLVMExegesisTests/ClusteringTest.Ordering (43608 of 43701)
PASS: LLVM-Unit :: tools/llvm-exegesis/./LLVMExegesisTests/CombinationGenerator.LeftColumn (43609 of 43701)
PASS: LLVM-Unit :: tools/llvm-exegesis/./LLVMExegesisTests/CombinationGenerator.MiddleColumn (43610 of 43701)
PASS: LLVM-Unit :: tools/llvm-exegesis/./LLVMExegesisTests/CombinationGenerator.RightColumn (43611 of 43701)
PASS: LLVM-Unit :: tools/llvm-exegesis/./LLVMExegesisTests/CombinationGenerator.Square (43612 of 43701)
PASS: LLVM-Unit :: tools/llvm-exegesis/./LLVMExegesisTests/CombinationGenerator.Row (43613 of 43701)
PASS: LLVM-Unit :: tools/llvm-exegesis/./LLVMExegesisTests/CombinationGenerator.SideColumns (43614 of 43701)
PASS: LLVM-Unit :: tools/llvm-exegesis/./LLVMExegesisTests/CombinationGenerator.Singleton (43615 of 43701)
PASS: LLVM-Unit :: tools/llvm-exegesis/./LLVMExegesisTests/PerfHelperTest.FunctionalTest (43616 of 43701)
PASS: LLVM-Unit :: tools/llvm-exegesis/./LLVMExegesisTests/RegisterValueTest.Double (43617 of 43701)
PASS: LLVM-Unit :: tools/llvm-exegesis/./LLVMExegesisTests/RegisterValueTest.Half (43618 of 43701)
PASS: LLVM-Unit :: tools/llvm-exegesis/./LLVMExegesisTests/RegisterValueTest.Single (43619 of 43701)
PASS: LLVM-Unit :: tools/llvm-exegesis/./LLVMExegesisTests/ScratchSpaceTest.Works (43620 of 43701)
PASS: LLVM-Unit :: tools/llvm-exegesis/AArch64/./LLVMExegesisAArch64Tests/AArch64TargetTest.SetRegToConstant (43621 of 43701)
PASS: LLVM-Unit :: tools/llvm-exegesis/AArch64/./LLVMExegesisAArch64Tests/AArch64TargetTest.DefaultPfmCounters (43622 of 43701)
PASS: LLVM-Unit :: tools/llvm-exegesis/Mips/./LLVMExegesisMipsTests/MipsTargetTest.SetGPR64RegTo16BitValue (43623 of 43701)
PASS: LLVM-Unit :: tools/llvm-exegesis/Mips/./LLVMExegesisMipsTests/MipsTargetTest.DefaultPfmCounters (43624 of 43701)
PASS: LLVM-Unit :: tools/llvm-exegesis/Mips/./LLVMExegesisMipsTests/BenchmarkResultTest.WriteToAndReadFromDisk (43625 of 43701)
PASS: LLVM-Unit :: tools/llvm-exegesis/Mips/./LLVMExegesisMipsTests/BenchmarkResultTest.PerInstructionStats (43626 of 43701)
PASS: LLVM-Unit :: tools/llvm-exegesis/Mips/./LLVMExegesisMipsTests/MipsTargetTest.SetGPR32RegTo16BitValue (43627 of 43701)
PASS: LLVM-Unit :: tools/llvm-exegesis/Mips/./LLVMExegesisMipsTests/MipsTargetTest.SetGPR32RegTo32BitValue (43628 of 43701)
PASS: LLVM-Unit :: tools/llvm-exegesis/Mips/./LLVMExegesisMipsTests/MipsTargetTest.SetGPR64RegTo32BitValue (43629 of 43701)
PASS: LLVM-Unit :: tools/llvm-exegesis/Mips/./LLVMExegesisMipsTests/ParallelSnippetGeneratorTest.MemoryUse (43630 of 43701)
PASS: LLVM-Unit :: tools/llvm-exegesis/Mips/./LLVMExegesisMipsTests/RegisterAliasingTest.TrackRegisterClass (43631 of 43701)
PASS: LLVM-Unit :: tools/llvm-exegesis/Mips/./LLVMExegesisMipsTests/RegisterAliasingTest.TrackRegisterClassCache (43632 of 43701)
PASS: LLVM-Unit :: tools/llvm-exegesis/Mips/./LLVMExegesisMipsTests/RegisterAliasingTest.TrackSimpleRegister (43633 of 43701)
PASS: LLVM-Unit :: tools/llvm-exegesis/Mips/./LLVMExegesisMipsTests/SerialSnippetGeneratorTest.ImplicitSelfDependencyThroughExplicitRegsForbidAll (43634 of 43701)
PASS: LLVM-Unit :: tools/llvm-exegesis/Mips/./LLVMExegesisMipsTests/SerialSnippetGeneratorTest.ImplicitSelfDependencyThroughExplicitRegs (43635 of 43701)
PASS: LLVM-Unit :: tools/llvm-exegesis/PowerPC/./LLVMExegesisPowerPCTests/AnalysisTest.ComputeIdealizedProcResPressure_1ALU1IPAGEN (43636 of 43701)
PASS: LLVM-Unit :: tools/llvm-exegesis/PowerPC/./LLVMExegesisPowerPCTests/AnalysisTest.ComputeIdealizedProcResPressure_1ALUE (43637 of 43701)
PASS: LLVM-Unit :: tools/llvm-exegesis/PowerPC/./LLVMExegesisPowerPCTests/AnalysisTest.ComputeIdealizedProcResPressure_2ALU (43638 of 43701)
PASS: LLVM-Unit :: tools/llvm-exegesis/PowerPC/./LLVMExegesisPowerPCTests/ParallelSnippetGeneratorTest.MemoryUse (43639 of 43701)
PASS: LLVM-Unit :: tools/llvm-exegesis/PowerPC/./LLVMExegesisPowerPCTests/PowerPCTargetTest.SetRegToConstant (43640 of 43701)
PASS: LLVM-Unit :: tools/llvm-exegesis/PowerPC/./LLVMExegesisPowerPCTests/PowerPCTargetTest.DefaultPfmCounters (43641 of 43701)
PASS: LLVM-Unit :: tools/llvm-exegesis/PowerPC/./LLVMExegesisPowerPCTests/SerialSnippetGeneratorTest.ImplicitSelfDependencyThroughTiedRegs (43642 of 43701)
PASS: LLVM-Unit :: tools/llvm-exegesis/PowerPC/./LLVMExegesisPowerPCTests/SerialSnippetGeneratorTest.ImplicitSelfDependencyThroughExplicitRegs (43643 of 43701)
PASS: LLVM-Unit :: tools/llvm-exegesis/X86/./LLVMExegesisX86Tests/BenchmarkResultTest.PerInstructionStats (43644 of 43701)
PASS: LLVM-Unit :: tools/llvm-exegesis/X86/./LLVMExegesisX86Tests/Core2Avx512TargetTest.FillMemoryOperands_VGATHERDPSZ128rm (43645 of 43701)
PASS: LLVM-Unit :: tools/llvm-exegesis/X86/./LLVMExegesisX86Tests/Core2Avx512TargetTest.SetRegToVR128Value_Use_VMOVDQU32Z128rm (43646 of 43701)
PASS: LLVM-Unit :: tools/llvm-exegesis/X86/./LLVMExegesisX86Tests/Core2Avx512TargetTest.FillMemoryOperands_ADD64rm (43647 of 43701)
PASS: LLVM-Unit :: tools/llvm-exegesis/X86/./LLVMExegesisX86Tests/Core2Avx512TargetTest.SetRegToVR512Value (43648 of 43701)
PASS: LLVM-Unit :: tools/llvm-exegesis/X86/./LLVMExegesisX86Tests/Core2AvxTargetTest.SetRegToVR128Value_Use_VMOVDQUrm (43649 of 43701)
PASS: LLVM-Unit :: tools/llvm-exegesis/X86/./LLVMExegesisX86Tests/Core2Avx512TargetTest.SetRegToVR256Value_Use_VMOVDQU32Z256rm (43650 of 43701)
PASS: LLVM-Unit :: tools/llvm-exegesis/X86/./LLVMExegesisX86Tests/BenchmarkResultTest.WriteToAndReadFromDisk (43651 of 43701)
PASS: LLVM-Unit :: tools/llvm-exegesis/X86/./LLVMExegesisX86Tests/Core2AvxTargetTest.SetRegToVR256Value_Use_VMOVDQUYrm (43652 of 43701)
PASS: LLVM-Unit :: tools/llvm-exegesis/X86/./LLVMExegesisX86Tests/Core2TargetTest.AllowAsBackToBack (43653 of 43701)
PASS: LLVM-Unit :: tools/llvm-exegesis/X86/./LLVMExegesisX86Tests/Core2TargetTest.SetFlags (43654 of 43701)
PASS: LLVM-Unit :: tools/llvm-exegesis/X86/./LLVMExegesisX86Tests/Core2TargetTest.SetRegToGR16Value (43655 of 43701)
PASS: LLVM-Unit :: tools/llvm-exegesis/X86/./LLVMExegesisX86Tests/Core2TargetTest.SetRegToFP1_32Bits (43656 of 43701)
PASS: LLVM-Unit :: tools/llvm-exegesis/X86/./LLVMExegesisX86Tests/Core2TargetTest.NoHighByteRegs (43657 of 43701)
PASS: LLVM-Unit :: tools/llvm-exegesis/X86/./LLVMExegesisX86Tests/Core2TargetTest.SetRegToFP0_80Bits (43658 of 43701)
PASS: LLVM-Unit :: tools/llvm-exegesis/X86/./LLVMExegesisX86Tests/Core2TargetTest.SetRegToFP1_4Bits (43659 of 43701)
PASS: LLVM-Unit :: tools/llvm-exegesis/X86/./LLVMExegesisX86Tests/Core2TargetTest.SetRegToGR32Value (43660 of 43701)
PASS: LLVM-Unit :: tools/llvm-exegesis/X86/./LLVMExegesisX86Tests/Core2TargetTest.SetRegToGR64Value (43661 of 43701)
PASS: LLVM-Unit :: tools/llvm-exegesis/X86/./LLVMExegesisX86Tests/Core2TargetTest.SetRegToGR8Value (43662 of 43701)
PASS: LLVM-Unit :: tools/llvm-exegesis/X86/./LLVMExegesisX86Tests/Core2TargetTest.SetRegToST0_32Bits (43663 of 43701)
PASS: LLVM-Unit :: tools/llvm-exegesis/X86/./LLVMExegesisX86Tests/Core2TargetTest.SetRegToST0_64Bits (43664 of 43701)
PASS: LLVM-Unit :: tools/llvm-exegesis/X86/./LLVMExegesisX86Tests/Core2TargetTest.SetRegToST0_80Bits (43665 of 43701)
PASS: LLVM-Unit :: tools/llvm-exegesis/X86/./LLVMExegesisX86Tests/Core2TargetTest.SetRegToVR128Value_Use_MOVDQUrm (43666 of 43701)
PASS: LLVM-Unit :: tools/llvm-exegesis/X86/./LLVMExegesisX86Tests/Core2TargetTest.SetRegToST1_32Bits (43667 of 43701)
PASS: LLVM-Unit :: tools/llvm-exegesis/X86/./LLVMExegesisX86Tests/Core2TargetTest.SetRegToVR64Value (43668 of 43701)
PASS: LLVM-Unit :: tools/llvm-exegesis/X86/./LLVMExegesisX86Tests/FakeSnippetGeneratorTest.ComputeRegisterInitialValuesAdd16ri (43669 of 43701)
PASS: LLVM-Unit :: tools/llvm-exegesis/X86/./LLVMExegesisX86Tests/FakeSnippetGeneratorTest.MemoryUse_Movsb (43670 of 43701)
PASS: LLVM-Unit :: tools/llvm-exegesis/X86/./LLVMExegesisX86Tests/FakeSnippetGeneratorTest.ComputeRegisterInitialValuesAdd64rr (43671 of 43701)
PASS: LLVM-Unit :: tools/llvm-exegesis/X86/./LLVMExegesisX86Tests/ParallelSnippetGeneratorTest.MOV16ms (43672 of 43701)
PASS: LLVM-Unit :: tools/llvm-exegesis/X86/./LLVMExegesisX86Tests/ParallelSnippetGeneratorTest.MemoryUse (43673 of 43701)
PASS: LLVM-Unit :: tools/llvm-exegesis/X86/./LLVMExegesisX86Tests/ParallelSnippetGeneratorTest.NoTiedVariables (43674 of 43701)
PASS: LLVM-Unit :: tools/llvm-exegesis/X86/./LLVMExegesisX86Tests/ParallelSnippetGeneratorTest.ParallelInstruction (43675 of 43701)
PASS: LLVM-Unit :: tools/llvm-exegesis/X86/./LLVMExegesisX86Tests/ParallelSnippetGeneratorTest.SerialInstruction (43676 of 43701)
PASS: LLVM-Unit :: tools/llvm-exegesis/X86/./LLVMExegesisX86Tests/ParallelSnippetGeneratorTest.StaticRenaming (43677 of 43701)
PASS: LLVM-Unit :: tools/llvm-exegesis/X86/./LLVMExegesisX86Tests/RegisterAliasingTest.TrackRegisterClass (43678 of 43701)
PASS: LLVM-Unit :: tools/llvm-exegesis/X86/./LLVMExegesisX86Tests/RegisterAliasingTest.TrackRegisterClassCache (43679 of 43701)
PASS: LLVM-Unit :: tools/llvm-exegesis/X86/./LLVMExegesisX86Tests/SchedClassResolutionTest.ComputeIdealizedProcResPressure_1P1_1P05_2P0156 (43680 of 43701)
PASS: LLVM-Unit :: tools/llvm-exegesis/X86/./LLVMExegesisX86Tests/SchedClassResolutionTest.ComputeIdealizedProcResPressure_2P0 (43681 of 43701)
PASS: LLVM-Unit :: tools/llvm-exegesis/X86/./LLVMExegesisX86Tests/RegisterAliasingTest.TrackSimpleRegister (43682 of 43701)
PASS: LLVM-Unit :: tools/llvm-exegesis/X86/./LLVMExegesisX86Tests/SchedClassResolutionTest.ComputeIdealizedProcResPressure_2P05 (43683 of 43701)
PASS: LLVM-Unit :: tools/llvm-exegesis/X86/./LLVMExegesisX86Tests/SchedClassResolutionTest.ComputeIdealizedProcResPressure_2P05_2P0156 (43684 of 43701)
PASS: LLVM-Unit :: tools/llvm-exegesis/X86/./LLVMExegesisX86Tests/SerialSnippetGeneratorTest.DependencyThroughOtherOpcode (43685 of 43701)
PASS: LLVM-Unit :: tools/llvm-exegesis/X86/./LLVMExegesisX86Tests/SerialSnippetGeneratorTest.ImplicitSelfDependencyThroughExplicitRegs (43686 of 43701)
PASS: LLVM-Unit :: tools/llvm-exegesis/X86/./LLVMExegesisX86Tests/SerialSnippetGeneratorTest.VCVTUSI642SDZrrb_Int (43687 of 43701)
PASS: LLVM-Unit :: tools/llvm-exegesis/X86/./LLVMExegesisX86Tests/SerialSnippetGeneratorTest.ImplicitSelfDependencyThroughImplicitReg (43688 of 43701)
PASS: LLVM-Unit :: tools/llvm-exegesis/X86/./LLVMExegesisX86Tests/SerialSnippetGeneratorTest.ImplicitSelfDependencyThroughTiedRegs (43689 of 43701)
PASS: LLVM-Unit :: tools/llvm-exegesis/X86/./LLVMExegesisX86Tests/SerialSnippetGeneratorTest.ImplicitSelfDependencyThroughExplicitRegsForbidAll (43690 of 43701)
PASS: LLVM-Unit :: tools/llvm-exegesis/X86/./LLVMExegesisX86Tests/X86SnippetFileTest.BadDefregParam (43691 of 43701)
PASS: LLVM-Unit :: tools/llvm-exegesis/X86/./LLVMExegesisX86Tests/SerialSnippetGeneratorTest.LAHF (43692 of 43701)
PASS: LLVM-Unit :: tools/llvm-exegesis/X86/./LLVMExegesisX86Tests/X86SnippetFileTest.MissingParam (43693 of 43701)
PASS: LLVM-Unit :: tools/llvm-exegesis/X86/./LLVMExegesisX86Tests/X86SnippetFileTest.NoAsmStreamer (43694 of 43701)
PASS: LLVM-Unit :: tools/llvm-exegesis/X86/./LLVMExegesisX86Tests/X86SnippetFileTest.NoDefregValue (43695 of 43701)
PASS: LLVM-Unit :: tools/llvm-exegesis/X86/./LLVMExegesisX86Tests/X86SnippetFileTest.Works (43696 of 43701)
PASS: LLVM-Unit :: tools/llvm-exegesis/X86/./LLVMExegesisX86Tests/X86SnippetRepetitorTest.Duplicate (43697 of 43701)
PASS: LLVM-Unit :: tools/llvm-profgen/./LLVMProfgenTests/TestCompression.TestNoSizeLimit1 (43698 of 43701)
PASS: LLVM-Unit :: tools/llvm-profgen/./LLVMProfgenTests/TestCompression.TestMaxDedupSize (43699 of 43701)
PASS: LLVM-Unit :: tools/llvm-profgen/./LLVMProfgenTests/TestCompression.TestNoSizeLimit2 (43700 of 43701)
PASS: LLVM-Unit :: tools/llvm-exegesis/X86/./LLVMExegesisX86Tests/X86SnippetRepetitorTest.Loop (43701 of 43701)
********************
Failed Tests (3):
  LLVM :: tools/llvm-symbolizer/output-style-json-code.test
  LLVM :: tools/llvm-symbolizer/output-style-json-data.test
  LLVM :: tools/llvm-symbolizer/output-style-json-frame.ll

Hide Details

Hide Details

Testing Time: 12447.15s Unsupported : 1549 Passed : 41996 Expectedly Failed: 153 Failed : 3 FAILED: test/CMakeFiles/check-llvm cd /Users/buildslave/jenkins/workspace/clang-stage2-cmake-RgSan/clang-build/test && /Users/buildslave/jenkins/workspace/clang-stage2-cmake-RgSan/venv/bin/python3 /Users/buildslave/jenkins/workspace/clang-stage2-cmake-RgSan/clang-build/./bin/llvm-lit --xunit-xml-output=testresults.xunit.xml -v -vv --timeout=1800 /Users/buildslave/jenkins/workspace/clang-stage2-cmake-RgSan/clang-build/test ninja: build stopped: cannot make progress due to previous errors. Command failed: Command '['/usr/local/bin/ninja', '-v', '-k', '0', 'check-llvm', 'check-clang']' returned non-zero exit status 1 Command: ['/usr/local/bin/ninja', '-v', '-k', '0', 'check-llvm', 'check-clang'] Build step 'Execute shell' marked build as failure [WARNINGS] Skipping publisher since build result is FAILURE Recording test results [Checks API] No suitable checks publisher found. Extended Email Publisher is currently disabled in project settings Finished: FAILURE