UnstableConsole Output

Skipping 108,197 KB.. Full Log
PASS: lldb-api :: python_api/breakpoint/TestBreakpointAPI.py (23 of 1362)
PASS: lldb-api :: macosx/add-dsym/TestAddDsymMidExecutionCommand.py (24 of 1362)
PASS: lldb-shell :: SymbolFile/DWARF/x86/debug_ranges-missing-section.s (25 of 1362)
UNSUPPORTED: lldb-shell :: SymbolFile/DWARF/x86/inline-function-address-shared.test (26 of 1362)
UNSUPPORTED: lldb-api :: commands/watchpoints/hello_watchpoint/TestMyFirstWatchpoint.py (27 of 1362)
UNSUPPORTED: lldb-shell :: SymbolFile/PDB/variables.test (28 of 1362)
PASS: lldb-shell :: Settings/TestFrameFormatMangling.test (29 of 1362)
UNSUPPORTED: lldb-api :: commands/expression/import_builtin_fileid/TestImportBuiltinFileID.py (30 of 1362)
PASS: lldb-api :: python_api/function_symbol/TestSymbolAPI.py (31 of 1362)
PASS: lldb-api :: lang/cpp/gmodules-templates/TestGModules.py (32 of 1362)
UNSUPPORTED: lldb-api :: commands/platform/connect/TestPlatformConnect.py (33 of 1362)
PASS: lldb-shell :: Process/UnsupportedLanguage.test (34 of 1362)
PASS: lldb-api :: functionalities/breakpoint/breakpoint_command/TestBreakpointCommand.py (35 of 1362)
UNSUPPORTED: lldb-api :: functionalities/darwin_log/source/debug/TestDarwinLogSourceDebug.py (36 of 1362)
PASS: lldb-api :: functionalities/target_var/no_vars/TestTargetVarNoVars.py (37 of 1362)
UNSUPPORTED: lldb-api :: commands/watchpoints/multiple_threads/TestWatchpointMultipleThreads.py (38 of 1362)
PASS: lldb-api :: python_api/lldbutil/process/TestPrintStackTraces.py (39 of 1362)
UNSUPPORTED: lldb-api :: functionalities/thread/concurrent_events/TestConcurrentWatchBreak.py (40 of 1362)
UNSUPPORTED: lldb-api :: python_api/watchpoint/watchlocation/TestSetWatchlocation.py (41 of 1362)
PASS: lldb-api :: commands/platform/sdk/TestPlatformSDK.py (42 of 1362)
PASS: lldb-api :: lang/cpp/frame-var-anon-unions/TestFrameVariableAnonymousUnions.py (43 of 1362)
PASS: lldb-api :: lang/cpp/overloaded-functions/TestOverloadedFunctions.py (44 of 1362)
PASS: lldb-api :: lang/c/local_types/TestUseClosestType.py (45 of 1362)
UNSUPPORTED: lldb-api :: functionalities/darwin_log/filter/regex/subsystem/TestDarwinLogFilterRegexSubsystem.py (46 of 1362)
UNSUPPORTED: lldb-shell :: ScriptInterpreter/Lua/breakpoint_function_callback.test (47 of 1362)
UNSUPPORTED: lldb-api :: functionalities/thread/state/TestThreadStates.py (48 of 1362)
PASS: lldb-api :: lang/c/enum_types/TestEnumTypes.py (49 of 1362)
PASS: lldb-api :: lang/c/cpp_keyword_identifiers/TestCppKeywordsAsCIdentifiers.py (50 of 1362)
PASS: lldb-shell :: SymbolFile/Breakpad/unwind-via-stack-win.test (51 of 1362)
PASS: lldb-api :: lang/cpp/wchar_t/TestCxxWCharT.py (52 of 1362)
UNSUPPORTED: lldb-shell :: ScriptInterpreter/Python/Crashlog/parser_text.test (53 of 1362)
PASS: lldb-api :: functionalities/memory/read/TestMemoryRead.py (54 of 1362)
UNSUPPORTED: lldb-shell :: SymbolFile/DWARF/x86/dwarf5_locations.s (55 of 1362)
PASS: lldb-api :: functionalities/unwind/noreturn/module-end/TestNoReturnModuleEnd.py (56 of 1362)
UNSUPPORTED: lldb-api :: commands/expression/import-std-module/unique_ptr/TestUniquePtrFromStdModule.py (57 of 1362)
PASS: lldb-shell :: Quit/TestQuitExitCodeTooManyArgs.test (58 of 1362)
UNSUPPORTED: lldb-shell :: ScriptInterpreter/Lua/fail_breakpoint_oneline.test (59 of 1362)
PASS: lldb-api :: python_api/get-value-32bit-int/TestGetValue32BitInt.py (60 of 1362)
PASS: lldb-api :: lang/cpp/unique-types/TestUniqueTypes.py (61 of 1362)
PASS: lldb-api :: lang/c/strings/TestCStrings.py (62 of 1362)
UNSUPPORTED: lldb-api :: functionalities/gdb_remote_client/TestRestartBug.py (63 of 1362)
PASS: lldb-api :: functionalities/memory/cache/TestMemoryCache.py (64 of 1362)
PASS: lldb-api :: lang/cpp/dynamic-value/TestCppValueCast.py (65 of 1362)
PASS: lldb-api :: functionalities/breakpoint/dummy_target_breakpoints/TestBreakpointsWithNoTargets.py (66 of 1362)
PASS: lldb-shell :: ScriptInterpreter/Python/command_import.test (67 of 1362)
UNSUPPORTED: lldb-shell :: SymbolFile/DWARF/x86/dwarf5-index-is-used.cpp (68 of 1362)
PASS: lldb-shell :: SymbolFile/DWARF/x86/debug_rnglists-dwo.s (69 of 1362)
PASS: lldb-api :: functionalities/unwind/zeroth_frame/TestZerothFrame.py (70 of 1362)
PASS: lldb-shell :: ObjectFile/ELF/riscv-arch.yaml (71 of 1362)
UNSUPPORTED: lldb-api :: functionalities/tsan/global_location/TestTsanGlobalLocation.py (72 of 1362)
PASS: lldb-api :: commands/expression/inline-namespace/TestInlineNamespace.py (73 of 1362)
UNSUPPORTED: lldb-shell :: SymbolFile/NativePDB/tag-types.cpp (74 of 1362)
UNSUPPORTED: lldb-api :: functionalities/thread/concurrent_events/TestConcurrentWatchBreakDelay.py (75 of 1362)
UNSUPPORTED: lldb-api :: lang/objc/foundation/TestRuntimeTypes.py (76 of 1362)
PASS: lldb-api :: lang/objc/objc-ivar-protocols/TestIvarProtocols.py (77 of 1362)
UNSUPPORTED: lldb-shell :: SymbolFile/DWARF/x86/inline-function-address.ll (78 of 1362)
PASS: lldb-api :: functionalities/thread/thread_exit/TestThreadExit.py (79 of 1362)
PASS: lldb-api :: commands/gui/viewlarge/TestGuiViewLarge.py (80 of 1362)
PASS: lldb-api :: lang/objc/warnings-in-expr-parser/TestObjCWarningsInExprParser.py (81 of 1362)
PASS: lldb-shell :: Breakpoint/debug_addrx.test (82 of 1362)
PASS: lldb-api :: tools/lldb-server/inferior-crash/TestGdbRemoteSegFault.py (83 of 1362)
PASS: lldb-api :: lang/cpp/limit-debug-info/TestWithLimitDebugInfo.py (84 of 1362)
PASS: lldb-shell :: Driver/TestProcessAttach.test (85 of 1362)
UNSUPPORTED: lldb-shell :: SymbolFile/DWARF/x86/limit-debug-info.s (86 of 1362)
UNSUPPORTED: lldb-api :: commands/register/register/aarch64_sve_registers/rw_access_static_config/TestSVERegisters.py (87 of 1362)
PASS: lldb-api :: macosx/skinny-corefile/TestSkinnyCorefile.py (88 of 1362)
UNSUPPORTED: lldb-api :: benchmarks/expression/TestExpressionCmd.py (89 of 1362)
UNSUPPORTED: lldb-shell :: SymbolFile/DWARF/x86/find-variable-dwo.cpp (90 of 1362)
UNSUPPORTED: lldb-shell :: ObjectFile/PECOFF/disassemble-thumb.yaml (91 of 1362)
PASS: lldb-api :: functionalities/data-formatter/data-formatter-stl/libcxx/shared_ptr/TestDataFormatterLibcxxSharedPtr.py (92 of 1362)
PASS: lldb-api :: lang/cpp/call-function/TestCallCPPFunction.py (93 of 1362)
PASS: lldb-shell :: SymbolFile/DWARF/x86/find-method-local-struct.cpp (94 of 1362)
UNSUPPORTED: lldb-api :: tools/lldb-server/TestGdbRemoteModuleInfo.py (95 of 1362)
UNSUPPORTED: lldb-api :: functionalities/process_group/TestChangeProcessGroup.py (96 of 1362)
UNSUPPORTED: lldb-shell :: Quit/TestQuitExitCode-30.test (97 of 1362)
PASS: lldb-api :: commands/expression/persist_objc_pointeetype/TestPersistObjCPointeeType.py (98 of 1362)
UNSUPPORTED: lldb-api :: commands/watchpoints/step_over_watchpoint/TestStepOverWatchpoint.py (99 of 1362)
PASS: lldb-api :: functionalities/data-formatter/data-formatter-ptr-to-array/TestPtrToArrayFormatting.py (100 of 1362)
UNSUPPORTED: lldb-api :: commands/expression/namespace_local_var_same_name_obj_c/TestNamespaceLocalVarSameNameObjC.py (101 of 1362)
PASS: lldb-api :: tools/lldb-server/TestGdbRemoteKill.py (102 of 1362)
PASS: lldb-api :: lang/c/find_struct_type/TestFindStructTypes.py (103 of 1362)
PASS: lldb-shell :: ObjectFile/ELF/section-overlap.yaml (104 of 1362)
UNSUPPORTED: lldb-api :: benchmarks/expression/TestRepeatedExprs.py (105 of 1362)
UNSUPPORTED: lldb-api :: functionalities/longjmp/TestLongjmp.py (106 of 1362)
PASS: lldb-api :: functionalities/data-formatter/ostypeformatting/TestFormattersOsType.py (107 of 1362)
PASS: lldb-api :: functionalities/breakpoint/move_nearest/TestMoveNearest.py (108 of 1362)
PASS: lldb-api :: functionalities/plugins/command_plugin/TestPluginCommands.py (109 of 1362)
UNSUPPORTED: lldb-api :: commands/expression/import-std-module/stack/TestStackFromStdModule.py (110 of 1362)
PASS: lldb-api :: lang/objcxx/objcxx-ivar-vector/TestIvarVector.py (111 of 1362)
PASS: lldb-api :: commands/expression/cast_int_to_anonymous_enum/TestCastIntToAnonymousEnum.py (112 of 1362)
PASS: lldb-shell :: Commands/command-regex-delete.test (113 of 1362)
UNSUPPORTED: lldb-api :: commands/process/attach-resume/TestAttachResume.py (114 of 1362)
UNSUPPORTED: lldb-api :: commands/expression/macros/TestMacros.py (115 of 1362)
UNSUPPORTED: lldb-api :: python_api/watchpoint/TestWatchpointIgnoreCount.py (116 of 1362)
PASS: lldb-api :: functionalities/data-formatter/builtin-formats/TestBuiltinFormats.py (117 of 1362)
PASS: lldb-api :: functionalities/data-formatter/typedef_array/TestTypedefArray.py (118 of 1362)
PASS: lldb-api :: lang/objc/objc-runtime-ivars/TestRuntimeIvars.py (119 of 1362)
UNSUPPORTED: lldb-api :: lang/objc/modules-update/TestClangModulesUpdate.py (120 of 1362)
PASS: lldb-shell :: Driver/TestCommands.test (121 of 1362)
UNSUPPORTED: lldb-shell :: Register/x86-fp-read.test (122 of 1362)
UNSUPPORTED: lldb-shell :: ScriptInterpreter/Lua/nested_sessions.test (123 of 1362)
PASS: lldb-api :: lang/cpp/dereferencing_references/TestCPPDereferencingReferences.py (124 of 1362)
UNSUPPORTED: lldb-shell :: ScriptInterpreter/Python/fail_breakpoint_oneline.test (125 of 1362)
PASS: lldb-shell :: SymbolFile/symbol-binding.test (126 of 1362)
UNSUPPORTED: lldb-api :: tools/lldb-server/registers-target-xml-reading/TestGdbRemoteTargetXmlPacket.py (127 of 1362)
PASS: lldb-api :: functionalities/data-formatter/boolreference/TestFormattersBoolRefPtr.py (128 of 1362)
PASS: lldb-shell :: SymbolFile/DWARF/dwo-relative-path.s (129 of 1362)
PASS: lldb-api :: commands/frame/diagnose/array/TestArray.py (130 of 1362)
PASS: lldb-api :: functionalities/thread/state_after_expression/TestStateAfterExpression.py (131 of 1362)
UNSUPPORTED: lldb-shell :: SymbolFile/NativePDB/disassembly.cpp (132 of 1362)
PASS: lldb-shell :: ObjectFile/wasm/basic.yaml (133 of 1362)
UNSUPPORTED: lldb-shell :: Reproducer/TestRelativePath.test (134 of 1362)
PASS: lldb-api :: python_api/formatters/TestFormattersSBAPI.py (135 of 1362)
UNSUPPORTED: lldb-shell :: Register/x86-zmm-read.test (136 of 1362)
UNSUPPORTED: lldb-api :: functionalities/thread/concurrent_events/TestConcurrentNWatchNBreak.py (137 of 1362)
PASS: lldb-shell :: ObjectFile/ELF/section-types-edgecases.yaml (138 of 1362)
PASS: lldb-api :: commands/expression/test/TestExprs.py (139 of 1362)
PASS: lldb-api :: commands/expression/completion-in-lambda-and-unnamed-class/TestCompletionInLambdaAndUnnamedClass.py (140 of 1362)
PASS: lldb-api :: tools/lldb-server/thread-name/TestGdbRemoteThreadName.py (141 of 1362)
UNSUPPORTED: lldb-api :: python_api/process/io/TestProcessIO.py (142 of 1362)
PASS: lldb-shell :: Commands/command-thread-select.test (143 of 1362)
PASS: lldb-shell :: Breakpoint/breakpoint-command.test (144 of 1362)
PASS: lldb-api :: functionalities/data-formatter/data-formatter-stl/libcxx/string/TestDataFormatterLibcxxString.py (145 of 1362)
PASS: lldb-api :: commands/gui/basicdebug/TestGuiBasicDebug.py (146 of 1362)
PASS: lldb-api :: lang/cpp/template/TestTemplateArgs.py (147 of 1362)
PASS: lldb-api :: commands/reproducer/invalid-args/TestInvalidArgsReproducer.py (148 of 1362)
PASS: lldb-api :: functionalities/breakpoint/serialize/TestBreakpointSerialization.py (149 of 1362)
PASS: lldb-api :: commands/platform/file/close/TestPlatformFileClose.py (150 of 1362)
UNSUPPORTED: lldb-api :: tools/lldb-vscode/runInTerminal/TestVSCode_runInTerminal.py (151 of 1362)
PASS: lldb-api :: tools/lldb-server/memory-allocation/TestGdbRemoteMemoryAllocation.py (152 of 1362)
PASS: lldb-api :: commands/command/script/import/rdar-12586188/TestRdar12586188.py (153 of 1362)
UNSUPPORTED: lldb-shell :: SymbolFile/DWARF/find-type-in-function.cpp (154 of 1362)
UNSUPPORTED: lldb-api :: functionalities/thread/concurrent_events/TestConcurrentTwoWatchpointsOneBreakpoint.py (155 of 1362)
UNSUPPORTED: lldb-api :: commands/expression/import-std-module/no-std-module/TestMissingStdModule.py (156 of 1362)
UNSUPPORTED: lldb-api :: tools/lldb-vscode/console/TestVSCode_console.py (157 of 1362)
PASS: lldb-api :: types/TestDoubleTypes.py (158 of 1362)
UNSUPPORTED: lldb-shell :: SymbolFile/PDB/class-layout.test (159 of 1362)
UNSUPPORTED: lldb-api :: commands/session/save/TestSessionSave.py (160 of 1362)
PASS: lldb-api :: lang/objc/rdar-11355592/TestRdar11355592.py (161 of 1362)
PASS: lldb-api :: functionalities/gdb_remote_client/TestWasm.py (162 of 1362)
UNSUPPORTED: lldb-shell :: Reproducer/TestCrash.test (163 of 1362)
PASS: lldb-shell :: SymbolFile/Breakpad/unwind-via-stack-win-no-memory-info.yaml (164 of 1362)
UNSUPPORTED: lldb-shell :: SymbolFile/PDB/udt-layout.test (165 of 1362)
UNSUPPORTED: lldb-shell :: SymbolFile/NativePDB/ast-functions.cpp (166 of 1362)
PASS: lldb-shell :: Commands/command-disassemble-process.yaml (167 of 1362)
PASS: lldb-api :: macosx/queues/TestQueues.py (168 of 1362)
UNSUPPORTED: lldb-api :: functionalities/thread/concurrent_events/TestConcurrentDelaySignalWatch.py (169 of 1362)
PASS: lldb-api :: commands/expression/radar_8638051/Test8638051.py (170 of 1362)
PASS: lldb-shell :: ObjectFile/ELF/PT_LOAD-overlap-PT_TLS.yaml (171 of 1362)
PASS: lldb-api :: macosx/DBGSourcePathRemapping/TestDSYMSourcePathRemapping.py (172 of 1362)
UNSUPPORTED: lldb-api :: commands/watchpoints/watchpoint_set_command/TestWatchLocationWithWatchSet.py (173 of 1362)
PASS: lldb-api :: functionalities/breakpoint/global_constructor/TestBreakpointInGlobalConstructor.py (174 of 1362)
PASS: lldb-api :: api/listeners/TestListener.py (175 of 1362)
PASS: lldb-api :: commands/expression/invalid-args/TestInvalidArgsExpression.py (176 of 1362)
UNSUPPORTED: lldb-shell :: SymbolFile/DWARF/x86/dir-separator-no-comp-dir.s (177 of 1362)
UNSUPPORTED: lldb-shell :: ObjectFile/PECOFF/export-dllfunc.yaml (178 of 1362)
UNSUPPORTED: lldb-api :: functionalities/data-formatter/data-formatter-stl/libstdcpp/string/TestDataFormatterStdString.py (179 of 1362)
UNSUPPORTED: lldb-shell :: SymbolFile/PDB/compilands.test (180 of 1362)
PASS: lldb-api :: functionalities/data-formatter/data-formatter-synthval/TestDataFormatterSynthVal.py (181 of 1362)
PASS: lldb-api :: functionalities/postmortem/mach-core/TestMachCore.py (182 of 1362)
PASS: lldb-shell :: SymbolFile/DWARF/x86/debug_aranges-empty-section.s (183 of 1362)
PASS: lldb-api :: commands/frame/diagnose/inheritance/TestDiagnoseInheritance.py (184 of 1362)
UNSUPPORTED: lldb-api :: arm/breakpoint-thumb-codesection/TestBreakpointThumbCodesection.py (185 of 1362)
PASS: lldb-api :: functionalities/data-formatter/data-formatter-synthtype/TestDataFormatterSynthType.py (186 of 1362)
PASS: lldb-api :: commands/target/select/TestTargetSelect.py (187 of 1362)
PASS: lldb-api :: python_api/findvalue_duplist/TestSBFrameFindValue.py (188 of 1362)
UNSUPPORTED: lldb-api :: functionalities/darwin_log/filter/exact_match/activity-chain/TestDarwinLogFilterMatchActivityChain.py (189 of 1362)
PASS: lldb-shell :: Breakpoint/debug_rnglist_offset_pair.test (190 of 1362)
PASS: lldb-shell :: ScriptInterpreter/Python/command_relative_import.test (191 of 1362)
PASS: lldb-api :: commands/expression/xvalue/TestXValuePrinting.py (192 of 1362)
UNSUPPORTED: lldb-api :: functionalities/gdb_remote_client/TestAArch64XMLRegOffsets.py (193 of 1362)
UNSUPPORTED: lldb-api :: functionalities/tail_call_frames/cross_object/TestCrossObjectTailCalls.py (194 of 1362)
PASS: lldb-shell :: Register/Core/x86-64-linux-fp.test (195 of 1362)
PASS: lldb-api :: functionalities/set-data/TestSetData.py (196 of 1362)
PASS: lldb-api :: commands/expression/completion/TestExprCompletion.py (197 of 1362)
PASS: lldb-api :: functionalities/thread/exit_during_break/TestExitDuringBreak.py (198 of 1362)
UNSUPPORTED: lldb-api :: commands/trace/TestTraceSchema.py (199 of 1362)
PASS: lldb-api :: functionalities/gdb_remote_client/TestRegDefinitionInParts.py (200 of 1362)
UNSUPPORTED: lldb-shell :: ScriptInterpreter/Lua/bindings.test (201 of 1362)
PASS: lldb-api :: iohandler/completion/TestIOHandlerCompletion.py (202 of 1362)
UNSUPPORTED: lldb-shell :: Reproducer/TestVerify.test (203 of 1362)
PASS: lldb-shell :: SymbolFile/DWARF/x86/debug_loc_and_loclists.s (204 of 1362)
PASS: lldb-api :: functionalities/postmortem/elf-core/thread_crash/TestLinuxCoreThreads.py (205 of 1362)
PASS: lldb-api :: python_api/class_members/TestSBTypeClassMembers.py (206 of 1362)
PASS: lldb-shell :: SymbolFile/DWARF/x86/dwarf5_tu_index_abbrev_offset.s (207 of 1362)
PASS: lldb-shell :: SymbolFile/DWARF/x86/split-dwarf-multiple-cu.ll (208 of 1362)
PASS: lldb-shell :: Quit/TestQuitExitCodeHex0.test (209 of 1362)
PASS: lldb-api :: commands/statistics/basic/TestStats.py (210 of 1362)
PASS: lldb-shell :: SymbolFile/DWARF/x86/DW_AT_const_value.s (211 of 1362)
PASS: lldb-api :: lang/cpp/unicode-literals/TestUnicodeLiterals.py (212 of 1362)
PASS: lldb-shell :: ObjectFile/wasm/embedded-debug-sections.yaml (213 of 1362)
PASS: lldb-shell :: SymbolFile/DWARF/x86/childless-compile-unit.s (214 of 1362)
UNSUPPORTED: lldb-api :: commands/expression/import-std-module/non-module-type-separation/TestNonModuleTypeSeparation.py (215 of 1362)
XFAIL: lldb-shell :: Register/x86-64-fp-write.test (216 of 1362)
PASS: lldb-api :: functionalities/breakpoint/comp_dir_symlink/TestCompDirSymLink.py (217 of 1362)
PASS: lldb-api :: lang/cpp/default-template-args/TestDefaultTemplateArgs.py (218 of 1362)
PASS: lldb-shell :: ObjectFile/wasm/unified-debug-sections.yaml (219 of 1362)
UNSUPPORTED: lldb-shell :: SymbolFile/DWARF/split-dwarf-expression-eval-bug.cpp (220 of 1362)
PASS: lldb-api :: functionalities/lazy-loading/TestLazyLoading.py (221 of 1362)
PASS: lldb-api :: functionalities/data-formatter/data-formatter-objc/TestDataFormatterObjCNSDate.py (222 of 1362)
UNSUPPORTED: lldb-api :: commands/expression/import-std-module/empty-module/TestEmptyStdModule.py (223 of 1362)
UNSUPPORTED: lldb-api :: functionalities/reproducers/attach/TestReproducerAttach.py (224 of 1362)
UNSUPPORTED: lldb-shell :: SymbolFile/PDB/expressions.test (225 of 1362)
UNSUPPORTED: lldb-api :: functionalities/breakpoint/breakpoint_set_restart/TestBreakpointSetRestart.py (226 of 1362)
UNSUPPORTED: lldb-api :: commands/expression/unwind_expression/TestUnwindExpression.py (227 of 1362)
PASS: lldb-api :: commands/expression/ignore-artificial-constructors/TestIgnoreArtificialConstructors.py (228 of 1362)
PASS: lldb-api :: commands/expression/unicode-in-variable/TestUnicodeInVariable.py (229 of 1362)
PASS: lldb-api :: functionalities/data-formatter/varscript_formatting/TestDataFormatterVarScriptFormatting.py (230 of 1362)
PASS: lldb-shell :: Process/Optimization.test (231 of 1362)
PASS: lldb-api :: tools/lldb-server/TestGdbRemoteAttach.py (232 of 1362)
PASS: lldb-api :: lang/objc/objc-optimized/TestObjcOptimized.py (233 of 1362)
UNSUPPORTED: lldb-api :: benchmarks/frame_variable/TestFrameVariableResponse.py (234 of 1362)
PASS: lldb-api :: functionalities/data-formatter/data-formatter-stl/libcxx/unordered/TestDataFormatterUnordered.py (235 of 1362)
UNSUPPORTED: lldb-api :: lang/objc/modules-hash-mismatch/TestClangModulesHashMismatch.py (236 of 1362)
PASS: lldb-api :: lang/objc/modules-objc-property/TestModulesObjCProperty.py (237 of 1362)
UNSUPPORTED: lldb-api :: tools/lldb-vscode/breakpoint-events/TestVSCode_breakpointEvents.py (238 of 1362)
UNSUPPORTED: lldb-api :: commands/register/register/aarch64_sve_registers/rw_access_dynamic_resize/TestSVEThreadedDynamic.py (239 of 1362)
PASS: lldb-api :: commands/command/script/import/TestImport.py (240 of 1362)
PASS: lldb-api :: functionalities/data-formatter/data-formatter-objc/TestDataFormatterObjCNSBundle.py (241 of 1362)
PASS: lldb-shell :: Register/Core/x86-64-linux-gp.test (242 of 1362)
PASS: lldb-api :: lang/cpp/global_operators/TestCppGlobalOperators.py (243 of 1362)
PASS: lldb-shell :: Breakpoint/split-dwarf-5-addrbase.test (244 of 1362)
PASS: lldb-api :: macosx/indirect_symbol/TestIndirectSymbols.py (245 of 1362)
PASS: lldb-api :: functionalities/testid/TestTestId.py (246 of 1362)
PASS: lldb-shell :: Commands/command-image-lookup.yaml (247 of 1362)
UNSUPPORTED: lldb-api :: python_api/file_handle/TestFileHandle.py (248 of 1362)
PASS: lldb-api :: functionalities/data-formatter/data-formatter-stl/libcxx/forward_list/TestDataFormatterLibcxxForwardList.py (249 of 1362)
PASS: lldb-api :: functionalities/data-formatter/language_category_updates/TestDataFormatterLanguageCategoryUpdates.py (250 of 1362)
PASS: lldb-api :: functionalities/backticks/TestBackticksWithoutATarget.py (251 of 1362)
UNSUPPORTED: lldb-api :: python_api/disassemble-raw-data/TestDisassemble_VST1_64.py (252 of 1362)
UNSUPPORTED: lldb-shell :: SymbolFile/DWARF/x86/debug-types-basic.test (253 of 1362)
PASS: lldb-shell :: ExecControl/StopHook/stop-hook.test (254 of 1362)
UNSUPPORTED: lldb-shell :: SymbolFile/PDB/pointers.test (255 of 1362)
PASS: lldb-api :: functionalities/breakpoint/breakpoint_by_line_and_column/TestBreakpointByLineAndColumn.py (256 of 1362)
PASS: lldb-api :: functionalities/data-formatter/data-formatter-objc/TestDataFormatterObjNSException.py (257 of 1362)
PASS: lldb-api :: python_api/sbvalue_persist/TestSBValuePersist.py (258 of 1362)
PASS: lldb-api :: functionalities/process_crash_info/TestProcessCrashInfo.py (259 of 1362)
UNSUPPORTED: lldb-shell :: SymbolFile/NativePDB/function-types-calling-conv.cpp (260 of 1362)
PASS: lldb-shell :: Settings/TestFrameFormatNoColor.test (261 of 1362)
UNSUPPORTED: lldb-api :: functionalities/data-formatter/data-formatter-stl/libstdcpp/smart_ptr/TestDataFormatterStdSmartPtr.py (262 of 1362)
UNSUPPORTED: lldb-api :: functionalities/thread/concurrent_events/TestConcurrentCrashWithWatchpoint.py (263 of 1362)
UNSUPPORTED: lldb-api :: commands/watchpoints/multiple_hits/TestMultipleHits.py (264 of 1362)
PASS: lldb-api :: commands/expression/persistent_types/TestPersistentTypes.py (265 of 1362)
PASS: lldb-api :: functionalities/archives/TestBSDArchives.py (266 of 1362)
PASS: lldb-shell :: ObjectFile/MachO/symtab.yaml (267 of 1362)
UNSUPPORTED: lldb-api :: linux/aarch64/mte_memory_region/TestAArch64LinuxMTEMemoryRegion.py (268 of 1362)
UNSUPPORTED: lldb-shell :: SymbolFile/NativePDB/nested-types.cpp (269 of 1362)
UNSUPPORTED: lldb-shell :: ScriptInterpreter/Lua/partial_statements.test (270 of 1362)
PASS: lldb-api :: lang/cpp/namespace/TestNamespace.py (271 of 1362)
PASS: lldb-api :: functionalities/recursion/TestValueObjectRecursion.py (272 of 1362)
PASS: lldb-api :: lang/c/complex/TestComplexC99.py (273 of 1362)
PASS: lldb-api :: commands/target/stop-hooks/TestStopHooks.py (274 of 1362)
PASS: lldb-api :: functionalities/breakpoint/breakpoint_ids/TestBreakpointIDs.py (275 of 1362)
UNSUPPORTED: lldb-shell :: Register/x86-multithread-write.test (276 of 1362)
PASS: lldb-api :: lang/c/conflicting-symbol/TestConflictingSymbol.py (277 of 1362)
PASS: lldb-shell :: ObjectFile/MachO/subsections.yaml (278 of 1362)
UNSUPPORTED: lldb-shell :: Register/x86-ymm-read.test (279 of 1362)
UNSUPPORTED: lldb-api :: benchmarks/stepping/TestSteppingSpeed.py (280 of 1362)
PASS: lldb-api :: types/TestShortTypeExpr.py (281 of 1362)
PASS: lldb-api :: commands/expression/multiline-completion/TestMultilineCompletion.py (282 of 1362)
PASS: lldb-api :: functionalities/data-formatter/data-formatter-advanced/TestDataFormatterAdv.py (283 of 1362)
PASS: lldb-shell :: ObjectFile/ELF/PT_LOAD.yaml (284 of 1362)
PASS: lldb-api :: lang/c/const_variables/TestConstVariables.py (285 of 1362)
PASS: lldb-api :: lang/objc/foundation/TestObjCMethods.py (286 of 1362)
UNSUPPORTED: lldb-api :: functionalities/gdb_remote_client/TestIOSSimulator.py (287 of 1362)
UNSUPPORTED: lldb-shell :: SymbolFile/DWARF/x86/debug-types-signature-loop.s (288 of 1362)
PASS: lldb-shell :: ObjectFile/MachO/lc_build_version_notools.yaml (289 of 1362)
PASS: lldb-shell :: SymbolFile/DWARF/x86/split-dwarf-inlining.cpp (290 of 1362)
PASS: lldb-api :: tools/lldb-server/TestGdbRemoteRegisterState.py (291 of 1362)
PASS: lldb-shell :: Register/Core/x86-32-netbsd-addr.test (292 of 1362)
XFAIL: lldb-shell :: Register/x86-64-ymm-write.test (293 of 1362)
PASS: lldb-shell :: ObjectFile/ELF/short-build-id.yaml (294 of 1362)
PASS: lldb-api :: commands/log/basic/TestLogging.py (295 of 1362)
PASS: lldb-api :: functionalities/data-formatter/synthcapping/TestSyntheticCapping.py (296 of 1362)
PASS: lldb-api :: functionalities/tail_call_frames/thread_step_out_or_return/TestSteppingOutWithArtificialFrames.py (297 of 1362)
UNSUPPORTED: lldb-api :: python_api/watchpoint/TestWatchpointIter.py (298 of 1362)
PASS: lldb-api :: functionalities/thread/thread_specific_break/TestThreadSpecificBreakpoint.py (299 of 1362)
PASS: lldb-api :: lang/cpp/namespace_definitions/TestNamespaceDefinitions.py (300 of 1362)
PASS: lldb-api :: lang/cpp/class-template-parameter-pack/TestClassTemplateParameterPack.py (301 of 1362)
PASS: lldb-api :: lang/cpp/char8_t/TestCxxChar8_t.py (302 of 1362)
PASS: lldb-api :: python_api/interpreter/TestCommandInterpreterAPI.py (303 of 1362)
PASS: lldb-api :: functionalities/postmortem/elf-core/TestLinuxCore.py (304 of 1362)
PASS: lldb-api :: lang/objc/unicode-string/TestUnicodeString.py (305 of 1362)
UNSUPPORTED: lldb-shell :: ScriptInterpreter/Lua/breakpoint_callback.test (306 of 1362)
UNSUPPORTED: lldb-api :: linux/thread/create_during_instruction_step/TestCreateDuringInstructionStep.py (307 of 1362)
UNSUPPORTED: lldb-shell :: Process/Windows/exception_access_violation.cpp (308 of 1362)
PASS: lldb-shell :: SymbolFile/DWARF/x86/debug_rnglists.s (309 of 1362)
UNSUPPORTED: lldb-api :: functionalities/data-formatter/data-formatter-stl/libstdcpp/list/TestDataFormatterStdList.py (310 of 1362)
UNSUPPORTED: lldb-shell :: ScriptInterpreter/Python/sb_address_exception.test (311 of 1362)
UNSUPPORTED: lldb-shell :: ObjectFile/PECOFF/dep-modules.yaml (312 of 1362)
PASS: lldb-api :: functionalities/gdb_remote_client/TestThreadSelectionBug.py (313 of 1362)
UNSUPPORTED: lldb-api :: tools/lldb-server/TestGdbRemoteFork.py (314 of 1362)
UNSUPPORTED: lldb-api :: tools/lldb-vscode/attach/TestVSCode_attach.py (315 of 1362)
PASS: lldb-api :: commands/expression/call-function/TestCallStopAndContinue.py (316 of 1362)
PASS: lldb-api :: commands/gui/basic/TestGuiBasic.py (317 of 1362)
UNSUPPORTED: lldb-api :: functionalities/signal/TestSendSignal.py (318 of 1362)
PASS: lldb-api :: commands/target/create-deps/TestTargetCreateDeps.py (319 of 1362)
PASS: lldb-shell :: Register/Core/x86-64-freebsd-fp.test (320 of 1362)
UNSUPPORTED: lldb-api :: functionalities/gdb_remote_client/TestHaltFails.py (321 of 1362)
PASS: lldb-shell :: Quit/TestQuitExitCode0.test (322 of 1362)
PASS: lldb-api :: assert_messages_test/TestAssertMessages.py (323 of 1362)
PASS: lldb-shell :: Unwind/trap_frame_sym_ctx.test (324 of 1362)
UNSUPPORTED: lldb-api :: functionalities/darwin_log/filter/exact_match/subsystem/TestDarwinLogFilterMatchSubsystem.py (325 of 1362)
PASS: lldb-api :: commands/frame/diagnose/complicated-expression/TestComplicatedExpression.py (326 of 1362)
PASS: lldb-api :: commands/expression/static-initializers/TestStaticInitializers.py (327 of 1362)
PASS: lldb-api :: functionalities/breakpoint/breakpoint_options/TestBreakpointOptions.py (328 of 1362)
PASS: lldb-api :: functionalities/breakpoint/step_over_breakpoint/TestStepOverBreakpoint.py (329 of 1362)
PASS: lldb-api :: source-manager/TestSourceManager.py (330 of 1362)
PASS: lldb-api :: commands/command/nested_alias/TestNestedAlias.py (331 of 1362)
UNSUPPORTED: lldb-api :: functionalities/unwind/ehframe/TestEhFrameUnwind.py (332 of 1362)
PASS: lldb-api :: tools/lldb-server/TestGdbRemoteSingleStep.py (333 of 1362)
FAIL: lldb-api :: lang/objc/modules-compile-error/TestModulesCompileError.py (334 of 1362)
******************** TEST 'lldb-api :: lang/objc/modules-compile-error/TestModulesCompileError.py' FAILED ********************
Script:
--
/usr/local/Frameworks/Python.framework/Versions/3.7/bin/python3.7 /Users/buildslave/jenkins/workspace/lldb-cmake-matrix/llvm-project/lldb/test/API/dotest.py -u CXXFLAGS -u CFLAGS --codesign-identity lldb_codesign --arch x86_64 --build-dir /Users/buildslave/jenkins/workspace/lldb-cmake-matrix/lldb-build/lldb-test-build.noindex -t --env TERM=vt100 --skip-category gmodules --skip-category watchpoint --arch=x86_64 --env LLVM_LIBS_DIR=/Users/buildslave/jenkins/workspace/lldb-cmake-matrix/lldb-build/./lib --arch x86_64 --build-dir /Users/buildslave/jenkins/workspace/lldb-cmake-matrix/lldb-build/lldb-test-build.noindex --lldb-module-cache-dir /Users/buildslave/jenkins/workspace/lldb-cmake-matrix/lldb-build/lldb-test-build.noindex/module-cache-lldb/lldb-api --clang-module-cache-dir /Users/buildslave/jenkins/workspace/lldb-cmake-matrix/lldb-build/lldb-test-build.noindex/module-cache-clang/lldb-api --executable /Users/buildslave/jenkins/workspace/lldb-cmake-matrix/lldb-build/./bin/lldb --compiler /Users/buildslave/jenkins/workspace/lldb-cmake-matrix/clang_900_build/bin/clang --dsymutil /Users/buildslave/jenkins/workspace/lldb-cmake-matrix/lldb-build/./bin/dsymutil --llvm-tools-dir /Users/buildslave/jenkins/workspace/lldb-cmake-matrix/lldb-build/./bin --lldb-libs-dir /Users/buildslave/jenkins/workspace/lldb-cmake-matrix/lldb-build/./lib --skip-category=lldb-vscode --skip-category=std-module /Users/buildslave/jenkins/workspace/lldb-cmake-matrix/llvm-project/lldb/test/API/lang/objc/modules-compile-error -p TestModulesCompileError.py --capture-path /Users/buildslave/jenkins/workspace/lldb-cmake-matrix/lldb-build/lldb-test-build.noindex/reproducers/TestModulesCompileError.py
--
Exit Code: 1

Hide Details

Command Output (stdout): -- lldb version 13.0.99 (http://labmaster3.local/git/llvm-project.git revision a0d96fdd3a4cda4d882076eff436301e1ec19055) clang revision a0d96fdd3a4cda4d882076eff436301e1ec19055 llvm revision a0d96fdd3a4cda4d882076eff436301e1ec19055 Skipping the following test categories: ['darwin-log', 'gmodules', 'watchpoint', 'lldb-vscode', 'std-module', 'libstdcxx', 'dwo', 'llgs', 'fork']

Hide Details

-- Command Output (stderr): -- Change dir to: /Users/buildslave/jenkins/workspace/lldb-cmake-matrix/llvm-project/lldb/test/API/lang/objc/modules-compile-error runCmd: settings clear -all output:

Hide Details

runCmd: settings set symbols.enable-external-lookup false output:

Hide Details

runCmd: settings set target.inherit-tcc true output:

Hide Details

runCmd: settings set target.detach-on-error false output:

Hide Details

runCmd: settings set target.auto-apply-fixits false output:

Hide Details

runCmd: settings set plugin.process.gdb-remote.packet-timeout 60 output:

Hide Details

runCmd: settings set symbols.clang-modules-cache-path "/Users/buildslave/jenkins/workspace/lldb-cmake-matrix/lldb-build/lldb-test-build.noindex/module-cache-lldb/lldb-api" output:

Hide Details

runCmd: settings set use-color false output:

Hide Details

runCmd: setting set target.prefer-dynamic-value no-dynamic-values output:

Hide Details

runCmd: expr @import LLDBTestModule check of return status not required runCmd failed! error: expression failed to parse: error: Header search couldn't locate module LLDBTestModule

Hide Details

error: while importing modules: error: Header search couldn't locate module LLDBTestModule

Hide Details

Hide Details

Hide Details

Ran command: "expr @import LLDBTestModule"

Hide Details

Got output: error: expression failed to parse: error: Header search couldn't locate module LLDBTestModule

Hide Details

error: while importing modules: error: Header search couldn't locate module LLDBTestModule

Hide Details

Hide Details

Expecting sub string: "module.h:4:1: error: unknown type name 'syntax_error_for_lldb_to_find'" (was not found)

Hide Details

FAIL: LLDB (/Users/buildslave/jenkins/workspace/lldb-cmake-matrix/clang_900_build/bin/clang-x86_64) :: test_dsym (TestModulesCompileError.TestCase) <bound method SBProcess.Kill of <lldb.SBProcess; proxy of <Swig Object of type 'lldb::SBProcess *' at 0x1077a4630> >>: success

Hide Details

runCmd: settings clear -all output:

Hide Details

runCmd: settings set symbols.enable-external-lookup false output:

Hide Details

runCmd: settings set target.inherit-tcc true output:

Hide Details

runCmd: settings set target.detach-on-error false output:

Hide Details

runCmd: settings set target.auto-apply-fixits false output:

Hide Details

runCmd: settings set plugin.process.gdb-remote.packet-timeout 60 output:

Hide Details

runCmd: settings set symbols.clang-modules-cache-path "/Users/buildslave/jenkins/workspace/lldb-cmake-matrix/lldb-build/lldb-test-build.noindex/module-cache-lldb/lldb-api" output:

Hide Details

runCmd: settings set use-color false output:

Hide Details

runCmd: setting set target.prefer-dynamic-value no-dynamic-values output:

Hide Details

runCmd: expr @import LLDBTestModule check of return status not required runCmd failed! error: expression failed to parse: error: Header search couldn't locate module LLDBTestModule

Hide Details

error: while importing modules: error: Header search couldn't locate module LLDBTestModule

Hide Details

Hide Details

Hide Details

Ran command: "expr @import LLDBTestModule"

Hide Details

Got output: error: expression failed to parse: error: Header search couldn't locate module LLDBTestModule

Hide Details

error: while importing modules: error: Header search couldn't locate module LLDBTestModule

Hide Details

Hide Details

Expecting sub string: "module.h:4:1: error: unknown type name 'syntax_error_for_lldb_to_find'" (was not found)

Hide Details

FAIL: LLDB (/Users/buildslave/jenkins/workspace/lldb-cmake-matrix/clang_900_build/bin/clang-x86_64) :: test_dwarf (TestModulesCompileError.TestCase) <bound method SBProcess.Kill of <lldb.SBProcess; proxy of <Swig Object of type 'lldb::SBProcess *' at 0x102334ab0> >>: success

Hide Details

UNSUPPORTED: LLDB (/Users/buildslave/jenkins/workspace/lldb-cmake-matrix/clang_900_build/bin/clang-x86_64) :: test_dwo (TestModulesCompileError.TestCase) (test case does not fall in any category of interest for this run) UNSUPPORTED: LLDB (/Users/buildslave/jenkins/workspace/lldb-cmake-matrix/clang_900_build/bin/clang-x86_64) :: test_gmodules (TestModulesCompileError.TestCase) (test case does not fall in any category of interest for this run) Restore dir to: /Users/buildslave/jenkins/workspace/lldb-cmake-matrix/lldb-build/tools/lldb/test ====================================================================== FAIL: test_dsym (TestModulesCompileError.TestCase) ---------------------------------------------------------------------- Traceback (most recent call last): File "/Users/buildslave/jenkins/workspace/lldb-cmake-matrix/llvm-project/lldb/packages/Python/lldbsuite/test/lldbtest.py", line 1830, in test_method return attrvalue(self) File "/Users/buildslave/jenkins/workspace/lldb-cmake-matrix/llvm-project/lldb/test/API/lang/objc/modules-compile-error/TestModulesCompileError.py", line 22, in test "could not build module 'LLDBTestModule'"]) File "/Users/buildslave/jenkins/workspace/lldb-cmake-matrix/llvm-project/lldb/packages/Python/lldbsuite/test/lldbtest.py", line 2550, in expect self.fail(log_msg) AssertionError: Ran command: "expr @import LLDBTestModule"

Hide Details

Got output: error: expression failed to parse: error: Header search couldn't locate module LLDBTestModule

Hide Details

error: while importing modules: error: Header search couldn't locate module LLDBTestModule

Hide Details

Hide Details

Expecting sub string: "module.h:4:1: error: unknown type name 'syntax_error_for_lldb_to_find'" (was not found) Config=x86_64-/Users/buildslave/jenkins/workspace/lldb-cmake-matrix/clang_900_build/bin/clang ====================================================================== FAIL: test_dwarf (TestModulesCompileError.TestCase) ---------------------------------------------------------------------- Traceback (most recent call last): File "/Users/buildslave/jenkins/workspace/lldb-cmake-matrix/llvm-project/lldb/packages/Python/lldbsuite/test/lldbtest.py", line 1830, in test_method return attrvalue(self) File "/Users/buildslave/jenkins/workspace/lldb-cmake-matrix/llvm-project/lldb/test/API/lang/objc/modules-compile-error/TestModulesCompileError.py", line 22, in test "could not build module 'LLDBTestModule'"]) File "/Users/buildslave/jenkins/workspace/lldb-cmake-matrix/llvm-project/lldb/packages/Python/lldbsuite/test/lldbtest.py", line 2550, in expect self.fail(log_msg) AssertionError: Ran command: "expr @import LLDBTestModule"

Hide Details

Got output: error: expression failed to parse: error: Header search couldn't locate module LLDBTestModule

Hide Details

error: while importing modules: error: Header search couldn't locate module LLDBTestModule

Hide Details

Hide Details

Expecting sub string: "module.h:4:1: error: unknown type name 'syntax_error_for_lldb_to_find'" (was not found) Config=x86_64-/Users/buildslave/jenkins/workspace/lldb-cmake-matrix/clang_900_build/bin/clang ---------------------------------------------------------------------- Ran 4 tests in 1.796s

Hide Details

RESULT: FAILED (0 passes, 2 failures, 0 errors, 2 skipped, 0 expected failures, 0 unexpected successes)

Hide Details

--

Hide Details

******************** PASS: lldb-shell :: Settings/TestModuleCacheSanity.test (335 of 1362) UNSUPPORTED: lldb-api :: functionalities/darwin_log/filter/exact_match/message/TestDarwinLogFilterMatchMessage.py (336 of 1362) PASS: lldb-api :: functionalities/data-formatter/data-formatter-objc/cmtime/TestDataFormatterCMTime.py (337 of 1362) PASS: lldb-api :: functionalities/thread/backtrace_limit/TestBacktraceLimit.py (338 of 1362) PASS: lldb-api :: functionalities/data-formatter/data-formatter-stl/libcxx/atomic/TestLibCxxAtomic.py (339 of 1362) PASS: lldb-shell :: Host/TestCustomShell.test (340 of 1362) PASS: lldb-api :: lang/objc/foundation/TestObjCMethodsString.py (341 of 1362) PASS: lldb-shell :: SymbolFile/DWARF/x86/module-ownership.mm (342 of 1362) PASS: lldb-api :: python_api/sberror/TestSBError.py (343 of 1362) PASS: lldb-api :: functionalities/avoids-fd-leak/TestFdLeak.py (344 of 1362) PASS: lldb-api :: functionalities/data-formatter/data-formatter-objc/TestDataFormatterObjCExpr.py (345 of 1362) PASS: lldb-api :: commands/target/auto-install-main-executable/TestAutoInstallMainExecutable.py (346 of 1362) UNSUPPORTED: lldb-api :: functionalities/param_entry_vals/basic_entry_values/TestBasicEntryValues.py (347 of 1362) PASS: lldb-api :: lang/cpp/class_static/TestStaticVariables.py (348 of 1362) PASS: lldb-api :: commands/disassemble/basic/TestDisassembleBreakpoint.py (349 of 1362) PASS: lldb-api :: lang/mixed/TestMixedLanguages.py (350 of 1362) PASS: lldb-shell :: SymbolFile/DWARF/x86/debug_ranges.s (351 of 1362) PASS: lldb-shell :: Register/Core/x86-64-freebsd-gp.test (352 of 1362) PASS: lldb-shell :: lldb-server/TestGdbserverPort.test (353 of 1362) PASS: lldb-shell :: Commands/command-source.test (354 of 1362) UNSUPPORTED: lldb-api :: tools/lldb-vscode/evaluate/TestVSCode_evaluate.py (355 of 1362) UNSUPPORTED: lldb-api :: commands/frame/language/TestGuessLanguage.py (356 of 1362) UNSUPPORTED: lldb-shell :: SymbolFile/DWARF/x86/debug-names-compressed.cpp (357 of 1362) UNSUPPORTED: lldb-api :: benchmarks/turnaround/TestCompileRunToBreakpointTurnaround.py (358 of 1362) UNSUPPORTED: lldb-shell :: Reproducer/TestDump.test (359 of 1362) PASS: lldb-api :: functionalities/data-formatter/data-formatter-stl/libcxx/vbool/TestDataFormatterLibcxxVBool.py (360 of 1362) UNSUPPORTED: lldb-api :: commands/expression/import-std-module/list-dbg-info-content/TestDbgInfoContentListFromStdModule.py (361 of 1362) PASS: lldb-api :: commands/expression/call-function/TestCallBuiltinFunction.py (362 of 1362) UNSUPPORTED: lldb-shell :: Reproducer/TestFileRepro.test (363 of 1362) UNSUPPORTED: lldb-shell :: Register/x86-64-zmm-write.test (364 of 1362) UNSUPPORTED: lldb-shell :: SymbolFile/DWARF/x86/find-function-regex.cpp (365 of 1362) PASS: lldb-api :: macosx/lc-note/kern-ver-str/TestKernVerStrLCNOTE.py (366 of 1362) PASS: lldb-api :: lang/objcxx/objc-builtin-types/TestObjCBuiltinTypes.py (367 of 1362) PASS: lldb-api :: lang/c/anonymous/TestAnonymous.py (368 of 1362) PASS: lldb-api :: lang/objc/objc-static-method-stripped/TestObjCStaticMethodStripped.py (369 of 1362) UNSUPPORTED: lldb-api :: functionalities/ubsan/basic/TestUbsanBasic.py (370 of 1362) UNSUPPORTED: lldb-api :: commands/expression/import-std-module/pair/TestPairFromStdModule.py (371 of 1362) UNSUPPORTED: lldb-api :: functionalities/gdb_remote_client/TestQemuAArch64TargetXml.py (372 of 1362) PASS: lldb-api :: commands/breakpoint/command/list/TestBreakpointCommandList.py (373 of 1362) UNSUPPORTED: lldb-api :: functionalities/darwin_log/filter/exact_match/category/TestDarwinLogFilterMatchCategory.py (374 of 1362) PASS: lldb-shell :: SymbolFile/Breakpad/line-table.test (375 of 1362) PASS: lldb-api :: functionalities/breakpoint/address_breakpoints/TestBadAddressBreakpoints.py (376 of 1362) PASS: lldb-api :: lang/c/shared_lib_stripped_symbols/TestSharedLibStrippedSymbols.py (377 of 1362) UNSUPPORTED: lldb-api :: python_api/watchpoint/watchlocation/TestTargetWatchAddress.py (378 of 1362) UNSUPPORTED: lldb-api :: commands/watchpoints/multi_watchpoint_slots/TestWatchpointMultipleSlots.py (379 of 1362) PASS: lldb-shell :: Commands/command-stop-hook-output.test (380 of 1362) PASS: lldb-shell :: SymbolFile/Breakpad/symtab.test (381 of 1362) PASS: lldb-shell :: Expr/TestMultilineExpr.test (382 of 1362) PASS: lldb-api :: functionalities/plugins/python_os_plugin/stepping_plugin_threads/TestOSPluginStepping.py (383 of 1362) UNSUPPORTED: lldb-shell :: SymbolFile/Breakpad/stack-cfi-arm.yaml (384 of 1362) PASS: lldb-shell :: Commands/CommandScriptImmediateOutput/CommandScriptImmediateOutputFile.test (385 of 1362) PASS: lldb-api :: lang/objc/objc-checker/TestObjCCheckers.py (386 of 1362) UNSUPPORTED: lldb-api :: android/platform/TestDefaultCacheLineSize.py (387 of 1362) PASS: lldb-api :: macosx/universal/TestUniversal.py (388 of 1362) UNSUPPORTED: lldb-api :: commands/watchpoints/watchpoint_commands/command/TestWatchpointCommandPython.py (389 of 1362) UNSUPPORTED: lldb-api :: commands/expression/import-std-module/conflicts/TestStdModuleWithConflicts.py (390 of 1362) PASS: lldb-api :: lang/cpp/dynamic-value-same-basename/TestDynamicValueSameBase.py (391 of 1362) PASS: lldb-api :: functionalities/ptr_refs/TestPtrRefs.py (392 of 1362) PASS: lldb-api :: python_api/sbstructureddata/TestStructuredDataAPI.py (393 of 1362) PASS: lldb-shell :: Recognizer/assert.test (394 of 1362) PASS: lldb-api :: python_api/value/empty_class/TestValueAPIEmptyClass.py (395 of 1362) PASS: lldb-api :: commands/thread/select/TestThreadSelect.py (396 of 1362) UNSUPPORTED: lldb-api :: commands/expression/import-std-module/weak_ptr/TestWeakPtrFromStdModule.py (397 of 1362) PASS: lldb-api :: lang/c/global_variables/TestGlobalVariables.py (398 of 1362) PASS: lldb-api :: lang/cpp/incomplete-types/TestCppIncompleteTypes.py (399 of 1362) PASS: lldb-api :: commands/expression/fixits/TestFixIts.py (400 of 1362) PASS: lldb-api :: commands/expression/function_template_specialization_temp_args/TestFunctionTemplateSpecializationTempArgs.py (401 of 1362) UNSUPPORTED: lldb-api :: functionalities/data-formatter/data-formatter-stl/libstdcpp/vector/TestDataFormatterStdVector.py (402 of 1362) UNSUPPORTED: lldb-api :: commands/expression/import-std-module/array/TestArrayFromStdModule.py (403 of 1362) PASS: lldb-api :: sample_test/TestSampleTest.py (404 of 1362) PASS: lldb-api :: commands/platform/basic/TestPlatformCommand.py (405 of 1362) PASS: lldb-api :: macosx/lc-note/firmware-corefile/TestFirmwareCorefiles.py (406 of 1362) PASS: lldb-api :: lang/c/offsetof/TestOffsetof.py (407 of 1362) UNSUPPORTED: lldb-api :: macosx/simulator/TestSimulatorPlatform.py (408 of 1362) UNSUPPORTED: lldb-api :: functionalities/thread/concurrent_events/TestConcurrentManySignals.py (409 of 1362) PASS: lldb-api :: commands/expression/context-object/TestContextObject.py (410 of 1362) PASS: lldb-api :: lang/objcxx/class-name-clash/TestNameClash.py (411 of 1362) PASS: lldb-api :: types/TestShortType.py (412 of 1362) PASS: lldb-api :: lang/cpp/accelerator-table/TestCPPAccelerator.py (413 of 1362) PASS: lldb-api :: functionalities/data-formatter/data-formatter-objc/TestDataFormatterObjCPlain.py (414 of 1362) PASS: lldb-api :: lang/c/stepping/TestThreadStepInAvoidRegexp.py (415 of 1362) UNSUPPORTED: lldb-api :: iohandler/resize/TestIOHandlerResizeNoEditline.py (416 of 1362) UNSUPPORTED: lldb-shell :: ScriptInterpreter/Lua/convenience_variables.test (417 of 1362) UNSUPPORTED: lldb-shell :: Unwind/unwind-plan-dwarf-dump.test (418 of 1362) UNSUPPORTED: lldb-api :: functionalities/tsan/multiple/TestTsanMultiple.py (419 of 1362) PASS: lldb-api :: functionalities/unwind/sigtramp/TestSigtrampUnwind.py (420 of 1362) PASS: lldb-shell :: ObjectFile/PECOFF/basic-info-arm.yaml (421 of 1362) PASS: lldb-api :: lang/objc/objc-static-method/TestObjCStaticMethod.py (422 of 1362) PASS: lldb-api :: functionalities/gdb_remote_client/TestTargetXMLArch.py (423 of 1362) PASS: lldb-api :: functionalities/breakpoint/breakpoint_ignore_count/TestBreakpointIgnoreCount.py (424 of 1362) PASS: lldb-shell :: ObjectFile/PECOFF/sections-names.yaml (425 of 1362) PASS: lldb-api :: tools/lldb-server/TestGdbRemote_vCont.py (426 of 1362) PASS: lldb-api :: lang/objc/objc-super/TestObjCSuper.py (427 of 1362) PASS: lldb-api :: lang/objc/single-entry-dictionary/TestObjCSingleEntryDictionary.py (428 of 1362) XFAIL: lldb-shell :: Register/x86-64-fp-read.test (429 of 1362) UNSUPPORTED: lldb-shell :: Reproducer/TestVersionCheck.test (430 of 1362) UNSUPPORTED: lldb-api :: functionalities/breakpoint/breakpoint_in_delayslot/TestAvoidBreakpointInDelaySlot.py (431 of 1362) PASS: lldb-shell :: SymbolFile/Breakpad/symtab-macho.test (432 of 1362) PASS: lldb-api :: functionalities/breakpoint/hardware_breakpoints/require_hw_breakpoints/TestRequireHWBreakpoints.py (433 of 1362) PASS: lldb-api :: functionalities/data-formatter/type_summary_list_script/TestTypeSummaryListScript.py (434 of 1362) PASS: lldb-api :: lang/objc/objc-ivar-offsets/TestObjCIvarOffsets.py (435 of 1362) PASS: lldb-shell :: ObjectFile/Breakpad/breakpad-identification.test (436 of 1362) PASS: lldb-api :: functionalities/signal/handle-abrt/TestHandleAbort.py (437 of 1362) PASS: lldb-api :: functionalities/stats_api/TestStatisticsAPI.py (438 of 1362) PASS: lldb-api :: lang/c/unicode/TestUnicodeSymbols.py (439 of 1362) PASS: lldb-shell :: Breakpoint/jit-loader_rtdyld_elf.test (440 of 1362) PASS: lldb-api :: commands/expression/vector_of_enums/TestVectorOfEnums.py (441 of 1362) PASS: lldb-api :: tools/lldb-server/TestGdbRemoteExpeditedRegisters.py (442 of 1362) UNSUPPORTED: lldb-api :: functionalities/tail_call_frames/unambiguous_sequence/TestUnambiguousTailCalls.py (443 of 1362) PASS: lldb-shell :: SymbolFile/DWARF/x86/debug_line-tombstone.s (444 of 1362) PASS: lldb-api :: lang/objc/ivar-IMP/TestObjCiVarIMP.py (445 of 1362) PASS: lldb-api :: macosx/builtin-debugtrap/TestBuiltinDebugTrap.py (446 of 1362) PASS: lldb-shell :: ObjectFile/Breakpad/uuid-matching-mac.test (447 of 1362) UNSUPPORTED: lldb-api :: functionalities/thread/concurrent_events/TestConcurrentWatchpointWithDelayWatchpointThreads.py (448 of 1362) PASS: lldb-api :: lang/objc/exceptions/TestObjCExceptions.py (449 of 1362) PASS: lldb-api :: functionalities/thread/concurrent_events/TestConcurrentTwoBreakpointsOneSignal.py (450 of 1362) PASS: lldb-shell :: SymbolFile/Breakpad/stack-cfi-parsing.test (451 of 1362) UNSUPPORTED: lldb-api :: macosx/find-dsym/bundle-with-dot-in-filename/TestBundleWithDotInFilename.py (452 of 1362) PASS: lldb-api :: lang/cpp/llvm-style/TestLLVMStyle.py (453 of 1362) UNSUPPORTED: lldb-api :: functionalities/breakpoint/breakpoint_command/TestBreakpointCommandsFromPython.py (454 of 1362) PASS: lldb-api :: functionalities/inline-stepping/TestInlineStepping.py (455 of 1362) UNSUPPORTED: lldb-shell :: SymbolFile/NativePDB/function-types-builtins.cpp (456 of 1362) PASS: lldb-api :: functionalities/find-line-entry/TestFindLineEntry.py (457 of 1362) UNSUPPORTED: lldb-shell :: SymbolFile/DWARF/x86/find-basic-variable.cpp (458 of 1362) PASS: lldb-api :: functionalities/data-formatter/data-formatter-objc/nsindexpath/TestDataFormatterNSIndexPath.py (459 of 1362) PASS: lldb-shell :: SymbolFile/Breakpad/line-table-missing-file.test (460 of 1362) UNSUPPORTED: lldb-shell :: SymbolFile/NativePDB/s_constant.cpp (461 of 1362) PASS: lldb-api :: functionalities/return-value/TestReturnValue.py (462 of 1362) PASS: lldb-shell :: Breakpoint/debug_rnglist_rlestartend.test (463 of 1362) UNSUPPORTED: lldb-api :: functionalities/tail_call_frames/disambiguate_paths_to_common_sink/TestDisambiguatePathsToCommonSink.py (464 of 1362) PASS: lldb-api :: lang/cpp/thread_local/TestThreadLocal.py (465 of 1362) PASS: lldb-api :: commands/frame/diagnose/dereference-function-return/TestDiagnoseDereferenceFunctionReturn.py (466 of 1362) UNSUPPORTED: lldb-api :: functionalities/thread/concurrent_events/TestConcurrentDelayedCrashWithBreakpointWatchpoint.py (467 of 1362) XFAIL: lldb-shell :: Register/x86-mm-xmm-write.test (468 of 1362) PASS: lldb-shell :: Breakpoint/dummy-target.test (469 of 1362) PASS: lldb-api :: functionalities/inferior-crashing/TestInferiorCrashing.py (470 of 1362) PASS: lldb-shell :: Watchpoint/SetErrorCases.test (471 of 1362) PASS: lldb-shell :: ObjectFile/ELF/eh_frame-symbols.yaml (472 of 1362) UNSUPPORTED: lldb-shell :: ObjectFile/ELF/minidebuginfo-set-and-hit-breakpoint.test (473 of 1362) PASS: lldb-shell :: SymbolFile/DWARF/x86/gnu-style-compression.cpp (474 of 1362) PASS: lldb-api :: lang/cpp/constructors/TestCppConstructors.py (475 of 1362) UNSUPPORTED: lldb-api :: commands/process/attach/attach_denied/TestAttachDenied.py (476 of 1362) PASS: lldb-api :: functionalities/data-formatter/data-formatter-skip-summary/TestDataFormatterSkipSummary.py (477 of 1362) PASS: lldb-api :: functionalities/thread/concurrent_events/TestConcurrentCrashWithSignal.py (478 of 1362) PASS: lldb-api :: lang/cpp/this/TestCPPThis.py (479 of 1362) UNSUPPORTED: lldb-api :: commands/watchpoints/watchpoint_disable/TestWatchpointDisable.py (480 of 1362) PASS: lldb-api :: functionalities/postmortem/wow64_minidump/TestWow64MiniDump.py (481 of 1362) UNSUPPORTED: lldb-shell :: ScriptInterpreter/Lua/lua-python.test (482 of 1362) PASS: lldb-api :: functionalities/data-formatter/data-formatter-python-synth/TestDataFormatterPythonSynth.py (483 of 1362) PASS: lldb-shell :: ObjectFile/ELF/netbsd-core-amd64.test (484 of 1362) PASS: lldb-api :: lang/cpp/break-on-initializers/TestBreakOnCPP11Initializers.py (485 of 1362) UNSUPPORTED: lldb-api :: commands/watchpoints/watchpoint_size/TestWatchpointSizes.py (486 of 1362) PASS: lldb-api :: functionalities/tail_call_frames/ambiguous_tail_call_seq2/TestAmbiguousTailCallSeq2.py (487 of 1362) PASS: lldb-api :: functionalities/history/TestHistoryRecall.py (488 of 1362) UNSUPPORTED: lldb-api :: commands/register/register/intel_xtended_registers/mpx_offset_intersection/TestMPXOffsetIntersection.py (489 of 1362) PASS: lldb-api :: macosx/save_crashlog/TestSaveCrashlog.py (490 of 1362) UNSUPPORTED: lldb-shell :: Reproducer/TestMultipleTargets.test (491 of 1362) PASS: lldb-api :: functionalities/wrong_commands/TestWrongCommands.py (492 of 1362) PASS: lldb-api :: commands/breakpoint/set/func-regex/TestBreakpointRegexError.py (493 of 1362) UNSUPPORTED: lldb-api :: functionalities/thread/concurrent_events/TestConcurrentCrashWithWatchpointBreakpointSignal.py (494 of 1362) PASS: lldb-api :: lang/objc/objc-struct-argument/TestObjCStructArgument.py (495 of 1362) PASS: lldb-api :: functionalities/thread_plan/TestThreadPlanCommands.py (496 of 1362) PASS: lldb-shell :: BuildScript/compiler-full-path.test (497 of 1362) UNSUPPORTED: lldb-api :: functionalities/data-formatter/data-formatter-stl/libstdcpp/iterator/TestDataFormatterStdIterator.py (498 of 1362) PASS: lldb-api :: lang/objc/objc-new-syntax/TestObjCNewSyntaxArray.py (499 of 1362) PASS: lldb-shell :: ObjectFile/ELF/PT_TLS-overlap-PT_LOAD.yaml (500 of 1362) UNSUPPORTED: lldb-shell :: Reproducer/Modules/TestModuleCXX.test (501 of 1362) PASS: lldb-api :: lang/c/bitfields/TestBitfields.py (502 of 1362) PASS: lldb-api :: lang/objc/bitfield_ivars/TestBitfieldIvars.py (503 of 1362) UNSUPPORTED: lldb-api :: functionalities/tail_call_frames/disambiguate_tail_call_seq/TestDisambiguateTailCallSeq.py (504 of 1362) PASS: lldb-api :: functionalities/data-formatter/poarray/TestPrintObjectArray.py (505 of 1362) PASS: lldb-api :: functionalities/breakpoint/cpp/TestCPPBreakpointLocations.py (506 of 1362) UNSUPPORTED: lldb-api :: benchmarks/continue/TestBenchmarkContinue.py (507 of 1362) UNSUPPORTED: lldb-api :: macosx/function-starts/TestFunctionStarts.py (508 of 1362) PASS: lldb-shell :: SymbolFile/DWARF/x86/dwarf5-debug_line-file-index.s (509 of 1362) UNSUPPORTED: lldb-api :: commands/expression/no-deadlock/TestExprDoesntBlock.py (510 of 1362) UNSUPPORTED: lldb-shell :: Expr/TestIRMemoryMapWindows.test (511 of 1362) PASS: lldb-api :: commands/expression/dont_allow_jit/TestAllowJIT.py (512 of 1362) PASS: lldb-shell :: Breakpoint/debug_rnglistx_rlex.test (513 of 1362) PASS: lldb-api :: lang/objc/modules-non-objc-target/TestObjCModulesNonObjCTarget.py (514 of 1362) UNSUPPORTED: lldb-api :: commands/expression/import-std-module/forward_list-dbg-info-content/TestDbgInfoContentForwardListFromStdModule.py (515 of 1362) PASS: lldb-api :: commands/expression/result_numbering/TestResultNumbering.py (516 of 1362) UNSUPPORTED: lldb-shell :: Subprocess/vfork-follow-parent-wp.test (517 of 1362) PASS: lldb-api :: lang/objc/objc-new-syntax/TestObjCNewSyntaxLiteral.py (518 of 1362) UNSUPPORTED: lldb-shell :: SymbolFile/DWARF/x86/dir-separator-windows.s (519 of 1362) PASS: lldb-api :: macosx/nslog/TestDarwinNSLogOutput.py (520 of 1362) PASS: lldb-api :: python_api/sbplatform/TestSBPlatform.py (521 of 1362) PASS: lldb-api :: lang/cpp/elaborated-types/TestElaboratedTypes.py (522 of 1362) PASS: lldb-shell :: SymbolFile/DWARF/x86/DW_OP_piece-struct.s (523 of 1362) UNSUPPORTED: lldb-shell :: Register/arm-fp-read.test (524 of 1362) PASS: lldb-shell :: Register/Core/x86-32-freebsd-addr.test (525 of 1362) UNSUPPORTED: lldb-api :: benchmarks/libcxxlist/TestBenchmarkLibcxxList.py (526 of 1362) UNSUPPORTED: lldb-shell :: Reproducer/Functionalities/TestImageList.test (527 of 1362) PASS: lldb-shell :: Register/Core/x86-32-linux-addr.test (528 of 1362) PASS: lldb-api :: functionalities/data-formatter/data-formatter-enum-format/TestDataFormatterEnumFormat.py (529 of 1362) UNSUPPORTED: lldb-api :: functionalities/breakpoint/hardware_breakpoints/hardware_breakpoint_on_multiple_threads/TestHWBreakMultiThread.py (530 of 1362) UNSUPPORTED: lldb-shell :: Register/x86-db-read.test (531 of 1362) PASS: lldb-shell :: SymbolFile/DWARF/x86/DW_OP_piece-smaller-than-struct.s (532 of 1362) PASS: lldb-api :: lang/cpp/extern_c/TestExternCSymbols.py (533 of 1362) PASS: lldb-api :: lang/objc/foundation/TestSymbolTable.py (534 of 1362) PASS: lldb-api :: lang/cpp/covariant-return-types/TestCovariantReturnTypes.py (535 of 1362) PASS: lldb-api :: commands/frame/select/TestFrameSelect.py (536 of 1362) PASS: lldb-api :: functionalities/data-formatter/stringprinter/TestStringPrinter.py (537 of 1362) PASS: lldb-api :: python_api/frame/get-variables/TestGetVariables.py (538 of 1362) UNSUPPORTED: lldb-shell :: SymbolFile/NativePDB/load-pdb.cpp (539 of 1362) UNSUPPORTED: lldb-shell :: ScriptInterpreter/Python/Crashlog/json.test (540 of 1362) UNSUPPORTED: lldb-api :: commands/expression/import-std-module/forward_decl_from_module/TestForwardDeclFromStdModule.py (541 of 1362) UNSUPPORTED: lldb-shell :: Register/x86-64-read.test (542 of 1362) PASS: lldb-api :: lang/cpp/trivial_abi/TestTrivialABI.py (543 of 1362) PASS: lldb-api :: functionalities/signal/raise/TestRaise.py (544 of 1362) PASS: lldb-shell :: SymbolFile/DWARF/x86/DW_AT_low_pc-addrx.s (545 of 1362) PASS: lldb-api :: functionalities/data-formatter/data-formatter-stl/libcxx/initializerlist/TestInitializerList.py (546 of 1362) PASS: lldb-api :: lang/cpp/pointer_to_member_type_depending_on_parent_size/TestPointerToMemberTypeDependingOnParentSize.py (547 of 1362) UNSUPPORTED: lldb-shell :: SymbolFile/PDB/typedefs.test (548 of 1362) PASS: lldb-api :: functionalities/breakpoint/objc/TestObjCBreakpoints.py (549 of 1362) PASS: lldb-api :: lang/cpp/function_refs/TestFunctionRefs.py (550 of 1362) UNSUPPORTED: lldb-shell :: Subprocess/fork-follow-parent-wp.test (551 of 1362) PASS: lldb-api :: functionalities/breakpoint/breakpoint_names/TestBreakpointNames.py (552 of 1362) PASS: lldb-api :: functionalities/value_md5_crash/TestValueMD5Crash.py (553 of 1362) PASS: lldb-api :: commands/disassemble/basic/TestFrameDisassemble.py (554 of 1362) UNSUPPORTED: lldb-api :: commands/expression/import-std-module/iterator/TestIteratorFromStdModule.py (555 of 1362) PASS: lldb-api :: driver/batch_mode/TestBatchMode.py (556 of 1362) PASS: lldb-shell :: Minidump/dump-all.test (557 of 1362) PASS: lldb-shell :: SymbolFile/DWARF/x86/DW_TAG_variable-DW_AT_const_value.s (558 of 1362) PASS: lldb-api :: lang/cpp/chained-calls/TestCppChainedCalls.py (559 of 1362) PASS: lldb-api :: tools/lldb-server/inferior-crash/TestGdbRemoteAbort.py (560 of 1362) PASS: lldb-shell :: ObjectFile/ELF/PT_LOAD-overlap-PT_INTERP.yaml (561 of 1362) PASS: lldb-api :: lang/cpp/class-template-non-type-parameter-pack/TestClassTemplateNonTypeParameterPack.py (562 of 1362) PASS: lldb-api :: types/TestCharTypeExpr.py (563 of 1362) UNSUPPORTED: lldb-shell :: ScriptInterpreter/Lua/independent_state.test (564 of 1362) PASS: lldb-api :: lang/cpp/incompatible-class-templates/TestCppIncompatibleClassTemplates.py (565 of 1362) PASS: lldb-api :: lang/c/set_values/TestSetValues.py (566 of 1362) PASS: lldb-api :: functionalities/gdb_remote_client/TestqOffsets.py (567 of 1362) PASS: lldb-api :: lang/objc/real-definition/TestRealDefinition.py (568 of 1362) PASS: lldb-api :: commands/expression/dollar-in-variable/TestDollarInVariable.py (569 of 1362) UNSUPPORTED: lldb-shell :: SymbolFile/DWARF/x86/find-inline-method.s (570 of 1362) PASS: lldb-api :: python_api/sbtype_typeclass/TestSBTypeTypeClass.py (571 of 1362) PASS: lldb-api :: functionalities/data-formatter/data-formatter-script/TestDataFormatterScript.py (572 of 1362) PASS: lldb-api :: commands/target/create-no-such-arch/TestNoSuchArch.py (573 of 1362) PASS: lldb-api :: functionalities/data-formatter/data-formatter-stl/libcxx/deque/TestDataFormatterLibcxxDeque.py (574 of 1362) PASS: lldb-api :: commands/expression/regression-access-function-template-in-record/TestRegressionAccessFunctionTemplateInRecord.py (575 of 1362) PASS: lldb-shell :: Settings/TestDefaultModuleCachePath.test (576 of 1362) UNSUPPORTED: lldb-shell :: ScriptInterpreter/Lua/breakpoint_oneline_callback.test (577 of 1362) UNSUPPORTED: lldb-api :: functionalities/tty/TestTerminal.py (578 of 1362) PASS: lldb-api :: functionalities/optimized_code/TestNoASanExceptionAfterEvalOP_piece.py (579 of 1362) PASS: lldb-api :: functionalities/data-formatter/data-formatter-stl/libcxx/set/TestDataFormatterLibcxxSet.py (580 of 1362) PASS: lldb-api :: python_api/lldbutil/iter/TestLLDBIterator.py (581 of 1362) UNSUPPORTED: lldb-api :: functionalities/darwin_log/source/info/TestDarwinLogSourceInfo.py (582 of 1362) PASS: lldb-api :: commands/target/basic/TestTargetCommand.py (583 of 1362) UNSUPPORTED: lldb-shell :: SymbolFile/DWARF/debug-types-expressions.test (584 of 1362) UNSUPPORTED: lldb-shell :: Register/x86-gp-read.test (585 of 1362) UNSUPPORTED: lldb-api :: commands/register/register/intel_xtended_registers/mpx_bound_violation/TestBoundViolation.py (586 of 1362) PASS: lldb-shell :: ObjectFile/ELF/section-addresses.yaml (587 of 1362) UNSUPPORTED: lldb-api :: functionalities/deleted-executable/TestDeletedExecutable.py (588 of 1362) PASS: lldb-api :: tools/lldb-server/commandline/TestGdbRemoteConnection.py (589 of 1362) PASS: lldb-shell :: ObjectFile/ELF/minidebuginfo-find-symbols.yaml (590 of 1362) PASS: lldb-api :: commands/platform/file/read/TestPlatformFileRead.py (591 of 1362) PASS: lldb-api :: lang/c/function_types/TestFunctionTypes.py (592 of 1362) UNSUPPORTED: lldb-shell :: SymbolFile/DWARF/x86/find-basic-namespace.cpp (593 of 1362) UNSUPPORTED: lldb-api :: commands/expression/import-std-module/vector/TestVectorFromStdModule.py (594 of 1362) PASS: lldb-api :: python_api/exprpath_synthetic/TestExprPathSynthetic.py (595 of 1362) UNSUPPORTED: lldb-api :: functionalities/darwin_log/filter/regex/message/TestDarwinLogFilterRegexMessage.py (596 of 1362) UNSUPPORTED: lldb-api :: functionalities/reproducers/fs-case-sensitivity/TestReproducerFSCaseSensitivity.py (597 of 1362) PASS: lldb-api :: functionalities/dynamic_value_child_count/TestDynamicValueChildCount.py (598 of 1362) PASS: lldb-api :: functionalities/gdb_remote_client/TestRecognizeBreakpoint.py (599 of 1362) PASS: lldb-api :: python_api/hello_world/TestHelloWorld.py (600 of 1362) UNSUPPORTED: lldb-api :: functionalities/tail_call_frames/thread_step_out_message/TestArtificialFrameStepOutMessage.py (601 of 1362) PASS: lldb-api :: lang/cpp/typedef/TestCppTypedef.py (602 of 1362) PASS: lldb-api :: functionalities/thread/concurrent_events/TestConcurrentSignalBreak.py (603 of 1362) PASS: lldb-api :: sanity/TestSettingSkipping.py (604 of 1362) PASS: lldb-api :: lang/objc/objc-stepping/TestObjCStepping.py (605 of 1362) PASS: lldb-api :: lang/cpp/enum_types/TestCPP11EnumTypes.py (606 of 1362) PASS: lldb-api :: python_api/sblaunchinfo/TestSBLaunchInfo.py (607 of 1362) PASS: lldb-shell :: SymbolFile/DWARF/x86/debug-types-line-tables.s (608 of 1362) PASS: lldb-api :: types/TestIntegerTypeExpr.py (609 of 1362) PASS: lldb-api :: functionalities/data-formatter/dump_dynamic/TestDumpDynamic.py (610 of 1362) UNSUPPORTED: lldb-shell :: Register/x86-64-ymm16-write.test (611 of 1362) PASS: lldb-api :: commands/expression/deleting-implicit-copy-constructor/TestDeletingImplicitCopyConstructor.py (612 of 1362) PASS: lldb-api :: lang/objc/rdar-10967107/TestRdar10967107.py (613 of 1362) PASS: lldb-shell :: Register/x86-64-gp-read.test (614 of 1362) PASS: lldb-api :: functionalities/inferior-crashing/recursive-inferior/TestRecursiveInferior.py (615 of 1362) UNSUPPORTED: lldb-api :: tools/lldb-vscode/disconnect/TestVSCode_disconnect.py (616 of 1362) PASS: lldb-api :: tools/lldb-server/signal-filtering/TestGdbRemote_QPassSignals.py (617 of 1362) PASS: lldb-api :: commands/target/modules/search-paths/insert/TestTargetModulesSearchpathsInsert.py (618 of 1362) PASS: lldb-api :: lang/objc/foundation/TestObjCMethods2.py (619 of 1362) PASS: lldb-api :: lang/cpp/auto/TestCPPAuto.py (620 of 1362) UNSUPPORTED: lldb-shell :: Register/x86-zmm-write.test (621 of 1362) UNSUPPORTED: lldb-api :: tools/lldb-vscode/coreFile/TestVSCode_coreFile.py (622 of 1362) PASS: lldb-api :: functionalities/data-formatter/data-formatter-stl/libcxx/list/TestDataFormatterLibcxxList.py (623 of 1362) PASS: lldb-api :: iohandler/resize/TestIOHandlerResize.py (624 of 1362) UNSUPPORTED: lldb-shell :: Reproducer/TestWorkingDir.test (625 of 1362) PASS: lldb-api :: functionalities/unwind/noreturn/TestNoreturnUnwind.py (626 of 1362) PASS: lldb-api :: functionalities/gdb_remote_client/TestStopPCs.py (627 of 1362) PASS: lldb-api :: commands/expression/call-throws/TestCallThatThrows.py (628 of 1362) UNSUPPORTED: lldb-api :: commands/expression/completion-crash-invalid-iterator/TestInvalidIteratorCompletionCrash.py (629 of 1362) UNSUPPORTED: lldb-shell :: SymbolFile/NativePDB/global-classes.cpp (630 of 1362) UNSUPPORTED: lldb-api :: functionalities/process_save_core/TestProcessSaveCore.py (631 of 1362) UNSUPPORTED: lldb-shell :: SymbolFile/NativePDB/bitfields.cpp (632 of 1362) UNSUPPORTED: lldb-shell :: Driver/TestHelp.test (633 of 1362) UNSUPPORTED: lldb-api :: macosx/macCatalyst/TestMacCatalyst.py (634 of 1362) PASS: lldb-api :: functionalities/type_lookup/TestTypeLookup.py (635 of 1362) PASS: lldb-api :: lang/cpp/bool/TestCPPBool.py (636 of 1362) PASS: lldb-shell :: SymbolFile/DWARF/deterministic-build.cpp (637 of 1362) PASS: lldb-shell :: ObjectFile/MachO/lc_version_min.yaml (638 of 1362) PASS: lldb-shell :: SymbolFile/DWARF/x86/DW_AT_data_bit_offset-DW_OP_stack_value.s (639 of 1362) UNSUPPORTED: lldb-api :: functionalities/thread/concurrent_events/TestConcurrentTwoWatchpointThreads.py (640 of 1362) UNSUPPORTED: lldb-api :: tools/lldb-vscode/breakpoint/TestVSCode_setFunctionBreakpoints.py (641 of 1362) PASS: lldb-api :: functionalities/data-formatter/pyobjsynthprovider/TestPyObjSynthProvider.py (642 of 1362) UNSUPPORTED: lldb-shell :: Register/x86-64-gp-write.test (643 of 1362) PASS: lldb-api :: functionalities/thread/concurrent_events/TestConcurrentCrashWithBreak.py (644 of 1362) PASS: lldb-api :: lang/cpp/virtual-functions/TestCppVirtualFunctions.py (645 of 1362) PASS: lldb-api :: lang/cpp/namespace/TestNamespaceLookup.py (646 of 1362) PASS: lldb-shell :: SymbolFile/DWARF/x86/DW_AT_decl_file-DW_AT_specification-crosscu.s (647 of 1362) PASS: lldb-shell :: Register/Core/x86-64-linux-addr.test (648 of 1362) PASS: lldb-api :: commands/expression/context-object-objc/TestContextObjectObjc.py (649 of 1362) PASS: lldb-api :: functionalities/gdb_remote_client/TestGDBRemoteLoad.py (650 of 1362) PASS: lldb-api :: commands/frame/recognizer/TestFrameRecognizer.py (651 of 1362) UNSUPPORTED: lldb-shell :: Register/x86-64-xmm16-read.test (652 of 1362) PASS: lldb-api :: lang/c/step-target/TestStepTarget.py (653 of 1362) PASS: lldb-api :: lang/objc/objc-ivar-stripped/TestObjCIvarStripped.py (654 of 1362) PASS: lldb-api :: lang/cpp/offsetof/TestOffsetofCpp.py (655 of 1362) UNSUPPORTED: lldb-shell :: SymbolFile/PDB/enums-layout.test (656 of 1362) UNSUPPORTED: lldb-api :: functionalities/data-formatter/data-formatter-stl/libstdcpp/vbool/TestDataFormatterStdVBool.py (657 of 1362) PASS: lldb-api :: commands/target/stop-hook/disable/TestTargetStopHookDisable.py (658 of 1362) PASS: lldb-shell :: SymbolFile/DWARF/x86/dwo-type-in-main-file.s (659 of 1362) PASS: lldb-shell :: SymbolFile/DWARF/x86/DW_TAG_variable-invalid_location.s (660 of 1362) UNSUPPORTED: lldb-api :: commands/expression/import-std-module/weak_ptr-dbg-info-content/TestDbgInfoContentWeakPtrFromStdModule.py (661 of 1362) PASS: lldb-api :: lang/cpp/subst_template_type_param/TestSubstTemplateTypeParam.py (662 of 1362) UNSUPPORTED: lldb-shell :: Register/x86-64-zmm-read.test (663 of 1362) PASS: lldb-api :: lang/objc/objc-baseclass-sbtype/TestObjCBaseClassSBType.py (664 of 1362) PASS: lldb-api :: commands/expression/call-function/TestCallUserDefinedFunction.py (665 of 1362) PASS: lldb-api :: terminal/TestEditline.py (666 of 1362) PASS: lldb-api :: functionalities/breakpoint/address_breakpoints/TestAddressBreakpoints.py (667 of 1362) PASS: lldb-api :: tools/lldb-server/commandline/TestStubSetSID.py (668 of 1362) UNSUPPORTED: lldb-api :: functionalities/data-formatter/data-formatter-stl/libstdcpp/tuple/TestDataFormatterStdTuple.py (669 of 1362) PASS: lldb-shell :: SymbolFile/DWARF/DW_AT_range-DW_FORM_sec_offset.s (670 of 1362) PASS: lldb-api :: types/TestRecursiveTypes.py (671 of 1362) PASS: lldb-shell :: Settings/TestSettingsSet.test (672 of 1362) PASS: lldb-api :: functionalities/thread/backtrace_all/TestBacktraceAll.py (673 of 1362) UNSUPPORTED: lldb-api :: functionalities/darwin_log/filter/exact_match/activity/TestDarwinLogFilterMatchActivity.py (674 of 1362) UNSUPPORTED: lldb-api :: tools/lldb-server/TestAppleSimulatorOSType.py (675 of 1362) PASS: lldb-shell :: SymbolFile/DWARF/clang-ast-from-dwarf-unamed-and-anon-structs.cpp (676 of 1362) UNSUPPORTED: lldb-api :: commands/settings/quoting/TestQuoting.py (677 of 1362) PASS: lldb-api :: functionalities/data-formatter/data-formatter-stl/libcxx/list/loop/TestDataFormatterLibcxxListLoop.py (678 of 1362) PASS: lldb-api :: python_api/section/TestSectionAPI.py (679 of 1362) PASS: lldb-api :: functionalities/data-formatter/data-formatter-cpp/TestDataFormatterCpp.py (680 of 1362) PASS: lldb-api :: types/TestLongTypesExpr.py (681 of 1362) PASS: lldb-api :: api/log/TestAPILog.py (682 of 1362) PASS: lldb-api :: commands/expression/rdar44436068/Test128BitsInteger.py (683 of 1362) UNSUPPORTED: lldb-shell :: Subprocess/vfork-follow-parent.test (684 of 1362) PASS: lldb-shell :: SymbolFile/DWARF/x86/dwarf5-split.s (685 of 1362) UNSUPPORTED: lldb-api :: python_api/sbdata/TestSBData.py (686 of 1362) UNSUPPORTED: lldb-api :: lang/c/typedef/Testtypedef.py (687 of 1362) PASS: lldb-api :: functionalities/data-formatter/nsdictionarysynth/TestNSDictionarySynthetic.py (688 of 1362) UNSUPPORTED: lldb-api :: functionalities/darwin_log/filter/regex/category/TestDarwinLogFilterRegexCategory.py (689 of 1362) PASS: lldb-api :: types/TestFloatTypesExpr.py (690 of 1362) PASS: lldb-api :: functionalities/gdb_remote_client/TestJLink6Armv7RegisterDefinition.py (691 of 1362) PASS: lldb-api :: functionalities/thread/ignore_suspended/TestIgnoreSuspendedThread.py (692 of 1362) UNSUPPORTED: lldb-api :: commands/expression/namespace_local_var_same_name_cpp_and_c/TestNamespaceLocalVarSameNameCppAndC.py (693 of 1362) PASS: lldb-shell :: BuildScript/modes.test (694 of 1362) PASS: lldb-api :: commands/expression/radar_9673664/TestExprHelpExamples.py (695 of 1362) PASS: lldb-api :: tools/lldb-server/TestGdbRemote_qThreadStopInfo.py (696 of 1362) PASS: lldb-api :: lang/c/modules/TestCModules.py (697 of 1362) PASS: lldb-shell :: SymbolFile/DWARF/x86/debug_loc-aslr.s (698 of 1362) XFAIL: lldb-shell :: Register/x86-64-write.test (699 of 1362) PASS: lldb-api :: tools/lldb-server/TestGdbRemoteAttachOrWait.py (700 of 1362) PASS: lldb-api :: types/TestIntegerType.py (701 of 1362) PASS: lldb-api :: python_api/value/change_values/TestChangeValueAPI.py (702 of 1362) PASS: lldb-api :: functionalities/plugins/python_os_plugin/TestPythonOSPlugin.py (703 of 1362) PASS: lldb-shell :: SymbolFile/DWARF/x86/find-qualified-variable.cpp (704 of 1362) PASS: lldb-api :: commands/expression/entry-bp/TestExprEntryBP.py (705 of 1362) PASS: lldb-api :: commands/log/invalid-args/TestInvalidArgsLog.py (706 of 1362) PASS: lldb-api :: commands/register/register/register_command/TestRegisters.py (707 of 1362) PASS: lldb-api :: commands/expression/pr35310/TestExprsBug35310.py (708 of 1362) PASS: lldb-api :: lang/c/array_types/TestArrayTypes.py (709 of 1362) UNSUPPORTED: lldb-api :: tools/lldb-server/TestGdbRemoteAuxvSupport.py (710 of 1362) UNSUPPORTED: lldb-shell :: ObjectFile/ELF/basic-info.yaml (711 of 1362) UNSUPPORTED: lldb-api :: macosx/profile_vrs_detach/TestDetachVrsProfile.py (712 of 1362) PASS: lldb-api :: lang/objc/objc-foundation-dictionary-empty/TestNSDictionary0.py (713 of 1362) PASS: lldb-api :: tools/lldb-server/TestGdbRemoteProcessInfo.py (714 of 1362) PASS: lldb-api :: lang/objc/objc-struct-return/TestObjCStructReturn.py (715 of 1362) PASS: lldb-shell :: BuildScript/toolchain-clang.test (716 of 1362) PASS: lldb-api :: commands/expression/argument_passing_restrictions/TestArgumentPassingRestrictions.py (717 of 1362) PASS: lldb-shell :: ObjectFile/ELF/many-sections.s (718 of 1362) PASS: lldb-shell :: ObjectFile/Breakpad/sections-trailing-func.test (719 of 1362) UNSUPPORTED: lldb-api :: tools/lldb-vscode/completions/TestVSCode_completions.py (720 of 1362) UNSUPPORTED: lldb-api :: lang/cpp/function-template-parameter-pack/TestFunctionTemplateParameterPack.py (721 of 1362) UNSUPPORTED: lldb-api :: commands/expression/call-restarts/TestCallThatRestarts.py (722 of 1362) PASS: lldb-shell :: BuildScript/script-args.test (723 of 1362) PASS: lldb-api :: commands/expression/ir-interpreter/TestIRInterpreter.py (724 of 1362) PASS: lldb-shell :: SymbolFile/DWARF/x86/debug_loclists-dwo.s (725 of 1362) PASS: lldb-shell :: ObjectFile/ELF/section-types.yaml (726 of 1362) PASS: lldb-shell :: Commands/command-backtrace-parser-1.test (727 of 1362) PASS: lldb-api :: api/multiple-debuggers/TestMultipleDebuggers.py (728 of 1362) PASS: lldb-api :: functionalities/data-formatter/nsarraysynth/TestNSArraySynthetic.py (729 of 1362) PASS: lldb-api :: commands/expression/options/TestExprOptions.py (730 of 1362) PASS: lldb-shell :: SymbolFile/DWARF/x86/debug-types-missing-signature.test (731 of 1362) XFAIL: lldb-shell :: Register/x86-mm-xmm-read.test (732 of 1362) UNSUPPORTED: lldb-shell :: SymbolFile/DWARF/x86/debug-types-address-ranges.s (733 of 1362) PASS: lldb-api :: functionalities/data-formatter/data-formatter-stl/libcxx/multiset/TestDataFormatterLibcxxMultiSet.py (734 of 1362) PASS: lldb-shell :: ScriptInterpreter/Python/python.test (735 of 1362) PASS: lldb-api :: functionalities/gdb_remote_client/TestGDBRemoteDiskFileCompletion.py (736 of 1362) PASS: lldb-shell :: Commands/command-backtrace-parser-2.test (737 of 1362) PASS: lldb-api :: lang/c/complex_int/TestComplexInt.py (738 of 1362) UNSUPPORTED: lldb-shell :: SymbolFile/DWARF/x86/dir-separator-posix.s (739 of 1362) PASS: lldb-api :: functionalities/postmortem/elf-core/gcore/TestGCore.py (740 of 1362) UNSUPPORTED: lldb-api :: commands/watchpoints/watchpoint_events/TestWatchpointEvents.py (741 of 1362) PASS: lldb-shell :: SymbolFile/DWARF/x86/dwp.s (742 of 1362) UNSUPPORTED: lldb-shell :: ExecControl/StopHook/stop-hook-threads.test (743 of 1362) UNSUPPORTED: lldb-api :: arm/breakpoint-it/TestBreakpointIt.py (744 of 1362) PASS: lldb-api :: commands/process/signal/TestProcessSignal.py (745 of 1362) PASS: lldb-shell :: ObjectFile/ELF/gnu-debuglink.yaml (746 of 1362) PASS: lldb-api :: lang/cpp/member-and-local-vars-with-same-name/TestMembersAndLocalsWithSameName.py (747 of 1362) UNSUPPORTED: lldb-api :: tools/lldb-vscode/breakpoint/TestVSCode_setBreakpoints.py (748 of 1362) UNSUPPORTED: lldb-shell :: Driver/TestError.test (749 of 1362) PASS: lldb-api :: lang/cpp/keywords_enabled/TestCppKeywordsEnabled.py (750 of 1362) PASS: lldb-api :: lang/objc/foundation/TestObjCMethodsNSError.py (751 of 1362) UNSUPPORTED: lldb-api :: functionalities/asan/TestReportData.py (752 of 1362) PASS: lldb-shell :: ObjectFile/ELF/build-id-case.yaml (753 of 1362) PASS: lldb-shell :: ObjectFile/ELF/PT_LOAD-overlap.yaml (754 of 1362) PASS: lldb-api :: functionalities/breakpoint/breakpoint_callback_command_source/TestBreakpointCallbackCommandSource.py (755 of 1362) PASS: lldb-api :: functionalities/thread/concurrent_events/TestConcurrentTwoBreakpointsOneDelaySignal.py (756 of 1362) PASS: lldb-shell :: ObjectFile/ELF/aarch64-relocations.yaml (757 of 1362) PASS: lldb-api :: functionalities/breakpoint/consecutive_breakpoints/TestConsecutiveBreakpoints.py (758 of 1362) UNSUPPORTED: lldb-shell :: Quit/TestQuitExitCodeHexA.test (759 of 1362) PASS: lldb-api :: iohandler/autosuggestion/TestAutosuggestion.py (760 of 1362) PASS: lldb-api :: python_api/debugger/TestDebuggerAPI.py (761 of 1362) PASS: lldb-api :: commands/expression/top-level/TestTopLevelExprs.py (762 of 1362) PASS: lldb-api :: functionalities/breakpoint/scripted_bkpt/TestScriptedResolver.py (763 of 1362) UNSUPPORTED: lldb-shell :: Driver/TestCore.test (764 of 1362) XFAIL: lldb-shell :: Register/x86-fp-write.test (765 of 1362) PASS: lldb-api :: functionalities/data-formatter/data-formatter-stl/libcxx/map/TestDataFormatterLibccMap.py (766 of 1362) PASS: lldb-api :: functionalities/exec/TestExec.py (767 of 1362) PASS: lldb-api :: lang/cpp/template-arguments/TestCppTemplateArguments.py (768 of 1362) UNSUPPORTED: lldb-api :: lang/cpp/breakpoint_in_member_func_w_non_primitive_params/TestBreakpointInMemberFuncWNonPrimitiveParams.py (769 of 1362) PASS: lldb-api :: commands/expression/formatters/TestFormatters.py (770 of 1362) PASS: lldb-api :: commands/expression/test/TestExprs2.py (771 of 1362) UNSUPPORTED: lldb-api :: functionalities/postmortem/netbsd-core/TestNetBSDCore.py (772 of 1362) UNSUPPORTED: lldb-api :: commands/expression/import-std-module/basic/TestImportStdModule.py (773 of 1362) UNSUPPORTED: lldb-shell :: Reproducer/TestDSYM.test (774 of 1362) PASS: lldb-api :: functionalities/source-map/TestTargetSourceMap.py (775 of 1362) PASS: lldb-api :: functionalities/data-formatter/data-formatter-stl/libcxx/multimap/TestDataFormatterLibccMultiMap.py (776 of 1362) UNSUPPORTED: lldb-shell :: Reproducer/TestPythonImport.test (777 of 1362) PASS: lldb-api :: functionalities/thread/step_until/TestStepUntil.py (778 of 1362) PASS: lldb-shell :: Commands/command-regex-unalias.test (779 of 1362) UNSUPPORTED: lldb-shell :: SymbolFile/DWARF/x86/find-basic-function.cpp (780 of 1362) PASS: lldb-api :: functionalities/target-new-solib-notifications/TestModuleLoadedNotifys.py (781 of 1362) PASS: lldb-api :: functionalities/data-formatter/user-format-vs-summary/TestUserFormatVsSummary.py (782 of 1362) UNSUPPORTED: lldb-shell :: SymbolFile/DWARF/x86/debug-line-basic.s (783 of 1362) PASS: lldb-api :: lang/objc/forward-decl/TestForwardDecl.py (784 of 1362) PASS: lldb-api :: lang/cpp/struct_with_keyword_name/TestStructWithKeywordName.py (785 of 1362) PASS: lldb-api :: commands/apropos/with-process/TestAproposWithProcess.py (786 of 1362) PASS: lldb-api :: functionalities/object-file/TestImageListMultiArchitecture.py (787 of 1362) UNSUPPORTED: lldb-api :: commands/watchpoints/watchpoint_commands/TestWatchpointCommands.py (788 of 1362) PASS: lldb-api :: commands/frame/diagnose/virtual-method-call/TestDiagnoseDereferenceVirtualMethodCall.py (789 of 1362) PASS: lldb-api :: lang/cpp/template-function/TestTemplateFunctions.py (790 of 1362) PASS: lldb-api :: functionalities/paths/TestPaths.py (791 of 1362) PASS: lldb-api :: commands/expression/ir-interpreter-phi-nodes/TestIRInterpreterPHINodes.py (792 of 1362) UNSUPPORTED: lldb-shell :: Reproducer/TestProcessList.test (793 of 1362) PASS: lldb-api :: lang/objc/radar-9691614/TestObjCMethodReturningBOOL.py (794 of 1362) UNSUPPORTED: lldb-api :: functionalities/data-formatter/data-formatter-stl/libstdcpp/map/TestDataFormatterStdMap.py (795 of 1362) PASS: lldb-shell :: ObjectFile/ELF/PT_LOAD-overlap-section.yaml (796 of 1362) PASS: lldb-api :: lang/cpp/multiple-inheritance/TestCppMultipleInheritance.py (797 of 1362) PASS: lldb-api :: commands/expression/radar_9531204/TestPrintfAfterUp.py (798 of 1362) PASS: lldb-api :: lang/objc/self/TestObjCSelf.py (799 of 1362) PASS: lldb-api :: functionalities/postmortem/minidump-new/TestMiniDumpNew.py (800 of 1362) PASS: lldb-api :: python_api/frame/TestFrames.py (801 of 1362) UNSUPPORTED: lldb-api :: functionalities/unwind/standard/TestStandardUnwind.py (802 of 1362) PASS: lldb-api :: commands/process/launch-with-shellexpand/TestLaunchWithShellExpand.py (803 of 1362) UNSUPPORTED: lldb-shell :: SymbolFile/DWARF/x86/DW_TAG_variable-DW_AT_decl_file-DW_AT_abstract_origin-crosscu1.s (804 of 1362) PASS: lldb-api :: functionalities/step-avoids-no-debug/TestStepNoDebug.py (805 of 1362) UNSUPPORTED: lldb-shell :: ScriptInterpreter/Lua/watchpoint_callback.test (806 of 1362) UNSUPPORTED: lldb-shell :: Reproducer/TestDiscard.test (807 of 1362) PASS: lldb-api :: python_api/function_symbol/TestDisasmAPI.py (808 of 1362) PASS: lldb-api :: macosx/find-app-in-bundle/TestFindAppInBundle.py (809 of 1362) PASS: lldb-api :: tools/lldb-server/TestGdbRemoteExitCode.py (810 of 1362) UNSUPPORTED: lldb-shell :: SymbolFile/PDB/type-quals.test (811 of 1362) PASS: lldb-shell :: Register/Core/x86-64-freebsd-addr.test (812 of 1362) PASS: lldb-api :: macosx/debugserver-exit-code/TestDebugServerExitCode.py (813 of 1362) PASS: lldb-shell :: VSCode/TestOptions.test (814 of 1362) PASS: lldb-api :: functionalities/breakpoint/debugbreak/TestDebugBreak.py (815 of 1362) PASS: lldb-api :: python_api/lldbutil/TestSwigVersion.py (816 of 1362) PASS: lldb-api :: python_api/type/TestTypeList.py (817 of 1362) PASS: lldb-api :: types/TestCharType.py (818 of 1362) UNSUPPORTED: lldb-api :: commands/watchpoints/hello_watchlocation/TestWatchLocation.py (819 of 1362) PASS: lldb-api :: lang/cpp/static_members/TestCPPStaticMembers.py (820 of 1362) UNSUPPORTED: lldb-api :: linux/mix-dwo-and-regular-objects/TestMixedDwarfBinary.py (821 of 1362) UNSUPPORTED: lldb-api :: lang/objc/modules/TestObjCModules.py (822 of 1362) PASS: lldb-api :: commands/expression/calculator_mode/TestCalculatorMode.py (823 of 1362) PASS: lldb-api :: functionalities/data-formatter/data-formatter-objc/nsstring/TestDataFormatterNSString.py (824 of 1362) PASS: lldb-api :: functionalities/pointer_num_children/TestPointerNumChildren.py (825 of 1362) UNSUPPORTED: lldb-api :: commands/expression/import-std-module/vector-of-vectors/TestVectorOfVectorsFromStdModule.py (826 of 1362) PASS: lldb-api :: terminal/TestSTTYBeforeAndAfter.py (827 of 1362) UNSUPPORTED: lldb-shell :: Register/x86-64-ymm-read.test (828 of 1362) PASS: lldb-api :: functionalities/data-formatter/data-formatter-stl/libcxx/unique_ptr/TestDataFormatterLibcxxUniquePtr.py (829 of 1362) PASS: lldb-api :: lang/cpp/nested-class-other-compilation-unit/TestNestedClassWithParentInAnotherCU.py (830 of 1362) UNSUPPORTED: lldb-shell :: SymbolFile/PDB/vbases.test (831 of 1362) PASS: lldb-api :: lang/cpp/stl/TestSTL.py (832 of 1362) PASS: lldb-api :: functionalities/data-formatter/format-propagation/TestFormatPropagation.py (833 of 1362) PASS: lldb-shell :: Register/Core/x86-64-netbsd-fp.test (834 of 1362) UNSUPPORTED: lldb-api :: tools/lldb-server/TestGdbRemoteCompletion.py (835 of 1362) PASS: lldb-api :: functionalities/memory/find/TestMemoryFind.py (836 of 1362) UNSUPPORTED: lldb-shell :: Unwind/eh-frame-augment-noop.test (837 of 1362) PASS: lldb-api :: commands/target/dump-symtab-demangle/TestDumpSymtabDemangle.py (838 of 1362) UNSUPPORTED: lldb-shell :: SymbolFile/NativePDB/globals-fundamental.cpp (839 of 1362) PASS: lldb-api :: commands/expression/persistent_types/TestNestedPersistentTypes.py (840 of 1362) PASS: lldb-api :: commands/expression/rdar42038760/TestScalarURem.py (841 of 1362) UNSUPPORTED: lldb-api :: commands/expression/import-std-module/unique_ptr-dbg-info-content/TestUniquePtrDbgInfoContent.py (842 of 1362) UNSUPPORTED: lldb-shell :: Register/aarch64-fp-read.test (843 of 1362) PASS: lldb-api :: lang/cpp/inlines/TestInlines.py (844 of 1362) UNSUPPORTED: lldb-shell :: SymbolFile/PDB/func-symbols.test (845 of 1362) PASS: lldb-api :: macosx/safe-to-func-call/TestSafeFuncCalls.py (846 of 1362) UNSUPPORTED: lldb-api :: commands/command/script/TestCommandScript.py (847 of 1362) PASS: lldb-api :: functionalities/breakpoint/breakpoint_locations/TestBreakpointLocations.py (848 of 1362) PASS: lldb-api :: functionalities/data-formatter/data-formatter-objc/TestDataFormatterObjCNSContainer.py (849 of 1362) UNSUPPORTED: lldb-shell :: SymbolFile/DWARF/x86/dwp-separate-debug-file.cpp (850 of 1362) PASS: lldb-api :: commands/expression/persistent_ptr_update/TestPersistentPtrUpdate.py (851 of 1362) PASS: lldb-api :: python_api/symbol-context/two-files/TestSymbolContextTwoFiles.py (852 of 1362) PASS: lldb-shell :: SymbolFile/DWARF/x86/static_scope.s (853 of 1362) PASS: lldb-api :: functionalities/dead-strip/TestDeadStrip.py (854 of 1362) PASS: lldb-api :: commands/expression/import_base_class_when_class_has_derived_member/TestImportBaseClassWhenClassHasDerivedMember.py (855 of 1362) PASS: lldb-api :: functionalities/gdb_remote_client/TestPlatformClient.py (856 of 1362) PASS: lldb-shell :: ObjectFile/ELF/avr-basic-info.yaml (857 of 1362) UNSUPPORTED: lldb-api :: lang/cpp/printf/TestPrintf.py (858 of 1362) PASS: lldb-shell :: ScriptInterpreter/Python/eof.test (859 of 1362) PASS: lldb-api :: commands/expression/save_jit_objects/TestSaveJITObjects.py (860 of 1362) PASS: lldb-api :: functionalities/data-formatter/data-formatter-objc/TestDataFormatterObjCNSURL.py (861 of 1362) PASS: lldb-api :: lang/c/step_over_no_deadlock/TestStepOverDoesntBlock.py (862 of 1362) UNSUPPORTED: lldb-api :: functionalities/thread/concurrent_events/TestConcurrentTwoBreakpointsOneWatchpoint.py (863 of 1362) PASS: lldb-api :: lang/cpp/stl/TestStdCXXDisassembly.py (864 of 1362) PASS: lldb-api :: functionalities/data-formatter/data-formatter-stl/libcxx/optional/TestDataFormatterLibcxxOptional.py (865 of 1362) PASS: lldb-api :: lang/cpp/signed_types/TestSignedTypes.py (866 of 1362) PASS: lldb-api :: commands/frame/diagnose/local-variable/TestLocalVariable.py (867 of 1362) UNSUPPORTED: lldb-api :: linux/sepdebugsymlink/TestTargetSymbolsSepDebugSymlink.py (868 of 1362) UNSUPPORTED: lldb-shell :: SymbolFile/NativePDB/globals-bss.cpp (869 of 1362) PASS: lldb-api :: functionalities/mtc/simple/TestMTCSimple.py (870 of 1362) UNSUPPORTED: lldb-api :: tools/intel-features/intel-pt/test/TestIntelPTSimpleBinary.py (871 of 1362) UNSUPPORTED: lldb-shell :: Register/arm-gp-read.test (872 of 1362) PASS: lldb-shell :: Minidump/disassemble-no-module.yaml (873 of 1362) PASS: lldb-api :: functionalities/multiword-commands/TestMultiWordCommands.py (874 of 1362) PASS: lldb-api :: functionalities/data-formatter/data-formatter-disabling/TestDataFormatterDisabling.py (875 of 1362) PASS: lldb-shell :: ObjectFile/ELF/base-address.yaml (876 of 1362) UNSUPPORTED: lldb-api :: functionalities/signal/handle-segv/TestHandleSegv.py (877 of 1362) PASS: lldb-api :: functionalities/breakpoint/breakpoint_command/TestRegexpBreakCommand.py (878 of 1362) UNSUPPORTED: lldb-shell :: ScriptInterpreter/Python/Crashlog/parser_json.test (879 of 1362) PASS: lldb-api :: lang/cpp/namespace_conflicts/TestNamespaceConflicts.py (880 of 1362) PASS: lldb-shell :: ScriptInterpreter/None/import_module.test (881 of 1362) PASS: lldb-shell :: SymbolFile/DWARF/x86/DW_AT_loclists_base.s (882 of 1362) PASS: lldb-api :: functionalities/gdb_remote_client/TestNestedRegDefinitions.py (883 of 1362) PASS: lldb-api :: lang/cpp/class_types/TestClassTypesDisassembly.py (884 of 1362) PASS: lldb-api :: python_api/sbenvironment/TestSBEnvironment.py (885 of 1362) UNSUPPORTED: lldb-shell :: Driver/TestRepl.test (886 of 1362) UNSUPPORTED: lldb-shell :: ScriptInterpreter/Lua/persistent_state.test (887 of 1362) UNSUPPORTED: lldb-shell :: ScriptInterpreter/Lua/quit.test (888 of 1362) PASS: lldb-api :: lang/cpp/nsimport/TestCppNsImport.py (889 of 1362) PASS: lldb-api :: functionalities/gdb_remote_client/TestNoWatchpointSupportInfo.py (890 of 1362) UNSUPPORTED: lldb-shell :: SymbolFile/target-symbols-add-unwind.test (891 of 1362) PASS: lldb-api :: python_api/name_lookup/TestNameLookup.py (892 of 1362) PASS: lldb-api :: functionalities/thread/concurrent_events/TestConcurrentBreakpointDelayBreakpointOneSignal.py (893 of 1362) UNSUPPORTED: lldb-shell :: Reproducer/TestDriverOptions.test (894 of 1362) PASS: lldb-api :: lang/cpp/breakpoint-commands/TestCPPBreakpointCommands.py (895 of 1362) UNSUPPORTED: lldb-api :: commands/register/register/aarch64_dynamic_regset/TestArm64DynamicRegsets.py (896 of 1362) PASS: lldb-api :: functionalities/conditional_break/TestConditionalBreak.py (897 of 1362) PASS: lldb-api :: commands/command/script_alias/TestCommandScriptAlias.py (898 of 1362) UNSUPPORTED: lldb-api :: functionalities/darwin_log/basic/TestDarwinLogBasic.py (899 of 1362) UNSUPPORTED: lldb-shell :: SymbolFile/NativePDB/break-by-line.cpp (900 of 1362) PASS: lldb-api :: lang/objc/objc-dyn-sbtype/TestObjCDynamicSBType.py (901 of 1362) FAIL: lldb-api :: lang/cpp/modules-import/TestCXXModulesImport.py (902 of 1362) ******************** TEST 'lldb-api :: lang/cpp/modules-import/TestCXXModulesImport.py' FAILED ******************** Script: -- /usr/local/Frameworks/Python.framework/Versions/3.7/bin/python3.7 /Users/buildslave/jenkins/workspace/lldb-cmake-matrix/llvm-project/lldb/test/API/dotest.py -u CXXFLAGS -u CFLAGS --codesign-identity lldb_codesign --arch x86_64 --build-dir /Users/buildslave/jenkins/workspace/lldb-cmake-matrix/lldb-build/lldb-test-build.noindex -t --env TERM=vt100 --skip-category gmodules --skip-category watchpoint --arch=x86_64 --env LLVM_LIBS_DIR=/Users/buildslave/jenkins/workspace/lldb-cmake-matrix/lldb-build/./lib --arch x86_64 --build-dir /Users/buildslave/jenkins/workspace/lldb-cmake-matrix/lldb-build/lldb-test-build.noindex --lldb-module-cache-dir /Users/buildslave/jenkins/workspace/lldb-cmake-matrix/lldb-build/lldb-test-build.noindex/module-cache-lldb/lldb-api --clang-module-cache-dir /Users/buildslave/jenkins/workspace/lldb-cmake-matrix/lldb-build/lldb-test-build.noindex/module-cache-clang/lldb-api --executable /Users/buildslave/jenkins/workspace/lldb-cmake-matrix/lldb-build/./bin/lldb --compiler /Users/buildslave/jenkins/workspace/lldb-cmake-matrix/clang_900_build/bin/clang --dsymutil /Users/buildslave/jenkins/workspace/lldb-cmake-matrix/lldb-build/./bin/dsymutil --llvm-tools-dir /Users/buildslave/jenkins/workspace/lldb-cmake-matrix/lldb-build/./bin --lldb-libs-dir /Users/buildslave/jenkins/workspace/lldb-cmake-matrix/lldb-build/./lib --skip-category=lldb-vscode --skip-category=std-module /Users/buildslave/jenkins/workspace/lldb-cmake-matrix/llvm-project/lldb/test/API/lang/cpp/modules-import -p TestCXXModulesImport.py --capture-path /Users/buildslave/jenkins/workspace/lldb-cmake-matrix/lldb-build/lldb-test-build.noindex/reproducers/TestCXXModulesImport.py -- Exit Code: 1

Hide Details

Command Output (stdout): -- lldb version 13.0.99 (http://labmaster3.local/git/llvm-project.git revision a0d96fdd3a4cda4d882076eff436301e1ec19055) clang revision a0d96fdd3a4cda4d882076eff436301e1ec19055 llvm revision a0d96fdd3a4cda4d882076eff436301e1ec19055 Skipping the following test categories: ['darwin-log', 'gmodules', 'watchpoint', 'lldb-vscode', 'std-module', 'libstdcxx', 'dwo', 'llgs', 'fork']

Hide Details

-- Command Output (stderr): -- Change dir to: /Users/buildslave/jenkins/workspace/lldb-cmake-matrix/llvm-project/lldb/test/API/lang/cpp/modules-import runCmd: settings clear -all output:

Hide Details

runCmd: settings set symbols.enable-external-lookup false output:

Hide Details

runCmd: settings set target.inherit-tcc true output:

Hide Details

runCmd: settings set target.detach-on-error false output:

Hide Details

runCmd: settings set target.auto-apply-fixits false output:

Hide Details

runCmd: settings set plugin.process.gdb-remote.packet-timeout 60 output:

Hide Details

runCmd: settings set symbols.clang-modules-cache-path "/Users/buildslave/jenkins/workspace/lldb-cmake-matrix/lldb-build/lldb-test-build.noindex/module-cache-lldb/lldb-api" output:

Hide Details

runCmd: settings set use-color false output:

Hide Details

runCmd: setting set target.prefer-dynamic-value no-dynamic-values output:

Hide Details

runCmd: expr -l Objective-C++ -- @import Bar runCmd failed! error: expression failed to parse: error: Header search couldn't locate module Foo

Hide Details

error: while importing modules: error: Header search couldn't locate module Bar

Hide Details

Hide Details

Hide Details

FAIL: LLDB (/Users/buildslave/jenkins/workspace/lldb-cmake-matrix/clang_900_build/bin/clang-x86_64) :: test_expr_dsym (TestCXXModulesImport.CXXModulesImportTestCase) <bound method SBProcess.Kill of <lldb.SBProcess; proxy of <Swig Object of type 'lldb::SBProcess *' at 0x111f25e10> >>: success

Hide Details

runCmd: settings clear -all output:

Hide Details

runCmd: settings set symbols.enable-external-lookup false output:

Hide Details

runCmd: settings set target.inherit-tcc true output:

Hide Details

runCmd: settings set target.detach-on-error false output:

Hide Details

runCmd: settings set target.auto-apply-fixits false output:

Hide Details

runCmd: settings set plugin.process.gdb-remote.packet-timeout 60 output:

Hide Details

runCmd: settings set symbols.clang-modules-cache-path "/Users/buildslave/jenkins/workspace/lldb-cmake-matrix/lldb-build/lldb-test-build.noindex/module-cache-lldb/lldb-api" output:

Hide Details

runCmd: settings set use-color false output:

Hide Details

runCmd: setting set target.prefer-dynamic-value no-dynamic-values output:

Hide Details

runCmd: expr -l Objective-C++ -- @import Bar runCmd failed! error: expression failed to parse: error: Header search couldn't locate module Foo

Hide Details

error: while importing modules: error: Header search couldn't locate module Bar

Hide Details

Hide Details

Hide Details

FAIL: LLDB (/Users/buildslave/jenkins/workspace/lldb-cmake-matrix/clang_900_build/bin/clang-x86_64) :: test_expr_dwarf (TestCXXModulesImport.CXXModulesImportTestCase) <bound method SBProcess.Kill of <lldb.SBProcess; proxy of <Swig Object of type 'lldb::SBProcess *' at 0x10c587ab0> >>: success

Hide Details

UNSUPPORTED: LLDB (/Users/buildslave/jenkins/workspace/lldb-cmake-matrix/clang_900_build/bin/clang-x86_64) :: test_expr_dwo (TestCXXModulesImport.CXXModulesImportTestCase) (test case does not fall in any category of interest for this run) runCmd: settings clear -all output:

Hide Details

runCmd: settings set symbols.enable-external-lookup false output:

Hide Details

runCmd: settings set target.inherit-tcc true output:

Hide Details

runCmd: settings set target.detach-on-error false output:

Hide Details

runCmd: settings set target.auto-apply-fixits false output:

Hide Details

runCmd: settings set plugin.process.gdb-remote.packet-timeout 60 output:

Hide Details

runCmd: settings set symbols.clang-modules-cache-path "/Users/buildslave/jenkins/workspace/lldb-cmake-matrix/lldb-build/lldb-test-build.noindex/module-cache-lldb/lldb-api" output:

Hide Details

runCmd: settings set use-color false output:

Hide Details

runCmd: setting set target.prefer-dynamic-value no-dynamic-values output:

Hide Details

runCmd: expr -l Objective-C++ -- @import Bar check of return status not required runCmd failed! error: expression failed to parse: error: Header search couldn't locate module Foo

Hide Details

error: while importing modules: error: Header search couldn't locate module Bar

Hide Details

Hide Details

Hide Details

Ran command: "expr -l Objective-C++ -- @import Bar"

Hide Details

Got output: error: expression failed to parse: error: Header search couldn't locate module Foo

Hide Details

error: while importing modules: error: Header search couldn't locate module Bar

Hide Details

Hide Details

Hide Details

<bound method SBProcess.Kill of <lldb.SBProcess; proxy of <Swig Object of type 'lldb::SBProcess *' at 0x111f25f00> >>: success

Hide Details

PASS: LLDB (/Users/buildslave/jenkins/workspace/lldb-cmake-matrix/clang_900_build/bin/clang-x86_64) :: test_expr_failing_import_dsym (TestCXXModulesImport.CXXModulesImportTestCase) runCmd: settings clear -all output:

Hide Details

runCmd: settings set symbols.enable-external-lookup false output:

Hide Details

runCmd: settings set target.inherit-tcc true output:

Hide Details

runCmd: settings set target.detach-on-error false output:

Hide Details

runCmd: settings set target.auto-apply-fixits false output:

Hide Details

runCmd: settings set plugin.process.gdb-remote.packet-timeout 60 output:

Hide Details

runCmd: settings set symbols.clang-modules-cache-path "/Users/buildslave/jenkins/workspace/lldb-cmake-matrix/lldb-build/lldb-test-build.noindex/module-cache-lldb/lldb-api" output:

Hide Details

runCmd: settings set use-color false output:

Hide Details

runCmd: setting set target.prefer-dynamic-value no-dynamic-values output:

Hide Details

runCmd: expr -l Objective-C++ -- @import Bar check of return status not required runCmd failed! error: expression failed to parse: error: Header search couldn't locate module Foo

Hide Details

error: while importing modules: error: Header search couldn't locate module Bar

Hide Details

Hide Details

Hide Details

Ran command: "expr -l Objective-C++ -- @import Bar"

Hide Details

Got output: error: expression failed to parse: error: Header search couldn't locate module Foo

Hide Details

error: while importing modules: error: Header search couldn't locate module Bar

Hide Details

Hide Details

Hide Details

<bound method SBProcess.Kill of <lldb.SBProcess; proxy of <Swig Object of type 'lldb::SBProcess *' at 0x10c5879c0> >>: success

Hide Details

PASS: LLDB (/Users/buildslave/jenkins/workspace/lldb-cmake-matrix/clang_900_build/bin/clang-x86_64) :: test_expr_failing_import_dwarf (TestCXXModulesImport.CXXModulesImportTestCase) UNSUPPORTED: LLDB (/Users/buildslave/jenkins/workspace/lldb-cmake-matrix/clang_900_build/bin/clang-x86_64) :: test_expr_failing_import_dwo (TestCXXModulesImport.CXXModulesImportTestCase) (test case does not fall in any category of interest for this run) UNSUPPORTED: LLDB (/Users/buildslave/jenkins/workspace/lldb-cmake-matrix/clang_900_build/bin/clang-x86_64) :: test_expr_failing_import_gmodules (TestCXXModulesImport.CXXModulesImportTestCase) (test case does not fall in any category of interest for this run) UNSUPPORTED: LLDB (/Users/buildslave/jenkins/workspace/lldb-cmake-matrix/clang_900_build/bin/clang-x86_64) :: test_expr_gmodules (TestCXXModulesImport.CXXModulesImportTestCase) (test case does not fall in any category of interest for this run) Restore dir to: /Users/buildslave/jenkins/workspace/lldb-cmake-matrix/lldb-build/tools/lldb/test ====================================================================== FAIL: test_expr_dsym (TestCXXModulesImport.CXXModulesImportTestCase) ---------------------------------------------------------------------- Traceback (most recent call last): File "/Users/buildslave/jenkins/workspace/lldb-cmake-matrix/llvm-project/lldb/packages/Python/lldbsuite/test/lldbtest.py", line 1830, in test_method return attrvalue(self) File "/Users/buildslave/jenkins/workspace/lldb-cmake-matrix/llvm-project/lldb/packages/Python/lldbsuite/test/decorators.py", line 149, in wrapper return func(*args, **kwargs) File "/Users/buildslave/jenkins/workspace/lldb-cmake-matrix/llvm-project/lldb/test/API/lang/cpp/modules-import/TestCXXModulesImport.py", line 32, in test_expr self.expect("expr -l Objective-C++ -- @import Bar") File "/Users/buildslave/jenkins/workspace/lldb-cmake-matrix/llvm-project/lldb/packages/Python/lldbsuite/test/lldbtest.py", line 2463, in expect inHistory=inHistory) File "/Users/buildslave/jenkins/workspace/lldb-cmake-matrix/llvm-project/lldb/packages/Python/lldbsuite/test/lldbtest.py", line 2161, in runCmd msg if (msg) else CMD_MSG(cmd)) AssertionError: False is not True : Command 'expr -l Objective-C++ -- @import Bar Error output: error: expression failed to parse: error: Header search couldn't locate module Foo

Hide Details

error: while importing modules: error: Header search couldn't locate module Bar

Hide Details

' did not return successfully Config=x86_64-/Users/buildslave/jenkins/workspace/lldb-cmake-matrix/clang_900_build/bin/clang ====================================================================== FAIL: test_expr_dwarf (TestCXXModulesImport.CXXModulesImportTestCase) ---------------------------------------------------------------------- Traceback (most recent call last): File "/Users/buildslave/jenkins/workspace/lldb-cmake-matrix/llvm-project/lldb/packages/Python/lldbsuite/test/lldbtest.py", line 1830, in test_method return attrvalue(self) File "/Users/buildslave/jenkins/workspace/lldb-cmake-matrix/llvm-project/lldb/packages/Python/lldbsuite/test/decorators.py", line 149, in wrapper return func(*args, **kwargs) File "/Users/buildslave/jenkins/workspace/lldb-cmake-matrix/llvm-project/lldb/test/API/lang/cpp/modules-import/TestCXXModulesImport.py", line 32, in test_expr self.expect("expr -l Objective-C++ -- @import Bar") File "/Users/buildslave/jenkins/workspace/lldb-cmake-matrix/llvm-project/lldb/packages/Python/lldbsuite/test/lldbtest.py", line 2463, in expect inHistory=inHistory) File "/Users/buildslave/jenkins/workspace/lldb-cmake-matrix/llvm-project/lldb/packages/Python/lldbsuite/test/lldbtest.py", line 2161, in runCmd msg if (msg) else CMD_MSG(cmd)) AssertionError: False is not True : Command 'expr -l Objective-C++ -- @import Bar Error output: error: expression failed to parse: error: Header search couldn't locate module Foo

Hide Details

error: while importing modules: error: Header search couldn't locate module Bar

Hide Details

' did not return successfully Config=x86_64-/Users/buildslave/jenkins/workspace/lldb-cmake-matrix/clang_900_build/bin/clang ---------------------------------------------------------------------- Ran 8 tests in 3.248s

Hide Details

RESULT: FAILED (2 passes, 2 failures, 0 errors, 4 skipped, 0 expected failures, 0 unexpected successes)

Hide Details

--

Hide Details

******************** PASS: lldb-shell :: Settings/TestFrameFormatColor.test (903 of 1362) PASS: lldb-api :: lang/c/local_variables/TestLocalVariables.py (904 of 1362) PASS: lldb-shell :: Register/Core/x86-32-linux-gp.test (905 of 1362) UNSUPPORTED: lldb-api :: tools/lldb-vscode/variables/TestVSCode_variables.py (906 of 1362) PASS: lldb-api :: commands/apropos/basic/TestApropos.py (907 of 1362) UNSUPPORTED: lldb-api :: commands/trace/TestTraceStartStop.py (908 of 1362) PASS: lldb-api :: functionalities/dlopen_other_executable/TestDlopenOtherExecutable.py (909 of 1362) UNSUPPORTED: lldb-api :: functionalities/data-formatter/data-formatter-stl/libstdcpp/unique_ptr/TestDataFormatterStdUniquePtr.py (910 of 1362) PASS: lldb-api :: functionalities/data-formatter/data-formatter-named-summaries/TestDataFormatterNamedSummaries.py (911 of 1362) PASS: lldb-shell :: Minidump/memory-region.yaml (912 of 1362) PASS: lldb-api :: functionalities/data-formatter/parray/TestPrintArray.py (913 of 1362) PASS: lldb-api :: functionalities/thread/create_after_attach/TestCreateAfterAttach.py (914 of 1362) PASS: lldb-api :: commands/help/TestHelp.py (915 of 1362) PASS: lldb-api :: functionalities/data-formatter/array_typedef/TestArrayTypedef.py (916 of 1362) UNSUPPORTED: lldb-api :: lang/objc/rdar-12408181/TestRdar12408181.py (917 of 1362) PASS: lldb-api :: functionalities/thread/jump/TestThreadJump.py (918 of 1362) PASS: lldb-api :: api/multithreaded/TestMultithreaded.py (919 of 1362) PASS: lldb-api :: python_api/interpreter/TestRunCommandInterpreterAPI.py (920 of 1362) UNSUPPORTED: lldb-shell :: SymbolFile/NativePDB/function-types-classes.cpp (921 of 1362) PASS: lldb-api :: lang/objcxx/cpp_keywords_enabled/TestObjCppKeywordsEnabled.py (922 of 1362) PASS: lldb-api :: lang/c/blocks/TestBlocks.py (923 of 1362) PASS: lldb-shell :: Error/assert.test (924 of 1362) PASS: lldb-api :: functionalities/data-formatter/synthupdate/TestSyntheticFilterRecompute.py (925 of 1362) PASS: lldb-api :: lang/objc/objc-class-method/TestObjCClassMethod.py (926 of 1362) PASS: lldb-api :: commands/command/delete/TestCommandDelete.py (927 of 1362) PASS: lldb-api :: lang/cpp/template-specialization-type/TestTemplateSpecializationType.py (928 of 1362) UNSUPPORTED: lldb-shell :: Reproducer/TestHomeDir.test (929 of 1362) PASS: lldb-api :: commands/target/stop-hooks/TestStopHookScripted.py (930 of 1362) PASS: lldb-api :: functionalities/data-formatter/data-formatter-caching/TestDataFormatterCaching.py (931 of 1362) UNSUPPORTED: lldb-shell :: Driver/TestPositionalArgs.test (932 of 1362) UNSUPPORTED: lldb-shell :: Register/x86-64-xmm16-write.test (933 of 1362) UNSUPPORTED: lldb-shell :: SymbolFile/PDB/calling-conventions.test (934 of 1362) PASS: lldb-api :: commands/expression/codegen-crash-import-def-arraytype-element/TestImportDefinitionArrayType.py (935 of 1362) UNSUPPORTED: lldb-api :: python_api/watchpoint/TestSetWatchpoint.py (936 of 1362) PASS: lldb-api :: lang/cpp/class_types/TestClassTypes.py (937 of 1362) UNSUPPORTED: lldb-api :: macosx/posix_spawn/TestLaunchProcessPosixSpawn.py (938 of 1362) PASS: lldb-api :: lang/cpp/operators/TestCppOperators.py (939 of 1362) PASS: lldb-api :: functionalities/float-display/TestFloatDisplay.py (940 of 1362) UNSUPPORTED: lldb-api :: functionalities/ubsan/user-expression/TestUbsanUserExpression.py (941 of 1362) PASS: lldb-api :: lang/c/unions/TestUnionMembers.py (942 of 1362) PASS: lldb-api :: lang/cpp/rvalue-references/TestRvalueReferences.py (943 of 1362) PASS: lldb-api :: sanity/TestModuleCacheSanity.py (944 of 1362) PASS: lldb-api :: commands/expression/multiline-navigation/TestMultilineNavigation.py (945 of 1362) PASS: lldb-api :: functionalities/data-formatter/data-formatter-stl/libcxx/iterator/TestDataFormatterLibccIterator.py (946 of 1362) UNSUPPORTED: lldb-shell :: ObjectFile/PECOFF/uuid.yaml (947 of 1362) UNSUPPORTED: lldb-shell :: Process/TestEnvironment.test (948 of 1362) PASS: lldb-api :: lang/objc/ptr_refs/TestPtrRefsObjC.py (949 of 1362) UNSUPPORTED: lldb-api :: functionalities/thread/concurrent_events/TestConcurrentDelayWatchBreak.py (950 of 1362) PASS: lldb-shell :: Register/Core/x86-32-netbsd-gp.test (951 of 1362) UNSUPPORTED: lldb-api :: commands/watchpoints/watchpoint_on_vectors/TestValueOfVectorVariable.py (952 of 1362) UNSUPPORTED: lldb-api :: commands/watchpoints/variable_out_of_scope/TestWatchedVarHitWhenInScope.py (953 of 1362) PASS: lldb-shell :: SymbolFile/DWARF/x86/dwarf5-atomic.s (954 of 1362) PASS: lldb-api :: functionalities/data-formatter/data-formatter-synth/TestDataFormatterSynth.py (955 of 1362) PASS: lldb-api :: python_api/target/TestTargetAPI.py (956 of 1362) PASS: lldb-api :: lang/c/struct_types/TestStructTypes.py (957 of 1362) PASS: lldb-api :: lang/objc/foundation/TestConstStrings.py (958 of 1362) PASS: lldb-shell :: Driver/TestUseColor.test (959 of 1362) PASS: lldb-api :: functionalities/load_unload/TestLoadUnload.py (960 of 1362) PASS: lldb-api :: functionalities/type_completion/TestTypeCompletion.py (961 of 1362) XFAIL: lldb-shell :: Unwind/prefer-debug-over-eh-frame.test (962 of 1362) PASS: lldb-api :: functionalities/gdb_remote_client/TestRemoteRegNums.py (963 of 1362) PASS: lldb-api :: functionalities/jitloader_gdb/TestJITLoaderGDB.py (964 of 1362) UNSUPPORTED: lldb-api :: commands/expression/timeout/TestCallWithTimeout.py (965 of 1362) UNSUPPORTED: lldb-api :: functionalities/asan/TestMemoryHistory.py (966 of 1362) PASS: lldb-shell :: Driver/TestNoUseColor.test (967 of 1362) PASS: lldb-api :: functionalities/thread/exit_during_step/TestExitDuringStep.py (968 of 1362) PASS: lldb-api :: lang/cpp/class-template-type-parameter-pack/TestClassTemplateTypeParameterPack.py (969 of 1362) PASS: lldb-api :: lang/cpp/char1632_t/TestChar1632T.py (970 of 1362) UNSUPPORTED: lldb-shell :: SymbolFile/DWARF/x86/array-sizes.s (971 of 1362) UNSUPPORTED: lldb-api :: functionalities/thread/exit_during_expression/TestExitDuringExpression.py (972 of 1362) PASS: lldb-api :: lang/objc/objc_direct-methods/TestObjCDirectMethods.py (973 of 1362) UNSUPPORTED: lldb-api :: functionalities/load_using_paths/TestLoadUsingPaths.py (974 of 1362) PASS: lldb-shell :: Minidump/Windows/Sigsegv/sigsegv.test (975 of 1362) PASS: lldb-api :: lang/cpp/typeof/TestTypeOfDeclTypeExpr.py (976 of 1362) UNSUPPORTED: lldb-api :: tools/lldb-server/vCont-threads/TestGdbRemote_vContThreads.py (977 of 1362) PASS: lldb-api :: lang/objc/conflicting-definition/TestConflictingDefinition.py (978 of 1362) PASS: lldb-api :: functionalities/gdb_remote_client/TestGDBRemoteClient.py (979 of 1362) PASS: lldb-api :: functionalities/gdb_remote_client/TestNoGPacketSupported.py (980 of 1362) PASS: lldb-api :: test_utils/TestPExpectTest.py (981 of 1362) PASS: lldb-api :: commands/frame/diagnose/bad-reference/TestBadReference.py (982 of 1362) PASS: lldb-api :: lang/c/register_variables/TestRegisterVariables.py (983 of 1362) PASS: lldb-api :: lang/objc/modules-inline-functions/TestModulesInlineFunctions.py (984 of 1362) PASS: lldb-api :: arm/emulation/TestEmulations.py (985 of 1362) PASS: lldb-shell :: SymbolFile/DWARF/x86/parallel-indexing-stress.s (986 of 1362) PASS: lldb-shell :: SymbolFile/DWARF/x86/dwp-debug-types.s (987 of 1362) PASS: lldb-api :: commands/settings/TestSettings.py (988 of 1362) PASS: lldb-api :: python_api/lldbutil/frame/TestFrameUtils.py (989 of 1362) PASS: lldb-api :: lang/c/inlines/TestRedefinitionsInInlines.py (990 of 1362) PASS: lldb-api :: functionalities/data-formatter/vector-types/TestVectorTypesFormatting.py (991 of 1362) PASS: lldb-api :: functionalities/completion/TestCompletion.py (992 of 1362) PASS: lldb-api :: commands/expression/call-function/TestCallStdStringFunction.py (993 of 1362) PASS: lldb-shell :: Quit/TestQuitExitCodeImplicit0.test (994 of 1362) UNSUPPORTED: lldb-shell :: SymbolFile/DWARF/x86/debug-types-dwo-cross-reference.cpp (995 of 1362) PASS: lldb-shell :: Register/x86-multithread-read.test (996 of 1362) PASS: lldb-api :: functionalities/data-formatter/data-formatter-smart-array/TestDataFormatterSmartArray.py (997 of 1362) UNSUPPORTED: lldb-api :: python_api/process/read-mem-cstring/TestReadMemCString.py (998 of 1362) PASS: lldb-api :: functionalities/thread/concurrent_events/TestConcurrentSignalDelayBreak.py (999 of 1362) UNSUPPORTED: lldb-api :: functionalities/thread/concurrent_events/TestConcurrentWatchpointDelayWatchpointOneBreakpoint.py (1000 of 1362) PASS: lldb-api :: lang/cpp/type_lookup/TestCppTypeLookup.py (1001 of 1362) UNSUPPORTED: lldb-api :: commands/watchpoints/watchpoint_commands/condition/TestWatchpointConditionCmd.py (1002 of 1362) PASS: lldb-api :: lang/c/forward/TestForwardDeclaration.py (1003 of 1362) UNSUPPORTED: lldb-api :: functionalities/tsan/cpp_global_location/TestTsanCPPGlobalLocation.py (1004 of 1362) PASS: lldb-shell :: ScriptInterpreter/None/none.test (1005 of 1362) PASS: lldb-api :: functionalities/fat_archives/TestFatArchives.py (1006 of 1362) PASS: lldb-api :: functionalities/breakpoint/breakpoint_language/TestBreakpointLanguage.py (1007 of 1362) UNSUPPORTED: lldb-api :: commands/expression/import-std-module/queue/TestQueueFromStdModule.py (1008 of 1362) UNSUPPORTED: lldb-api :: functionalities/darwin_log/filter/regex/activity-chain/TestDarwinLogFilterRegexActivityChain.py (1009 of 1362) PASS: lldb-shell :: Breakpoint/single-file-split-dwarf.test (1010 of 1362) PASS: lldb-api :: python_api/value/TestValueAPI.py (1011 of 1362) PASS: lldb-api :: functionalities/data-formatter/cstring-utf8-summary/TestCstringUnicode.py (1012 of 1362) PASS: lldb-api :: functionalities/pre_run_dylibs/TestPreRunDylibs.py (1013 of 1362) UNSUPPORTED: lldb-api :: tools/lldb-server/libraries-svr4/TestGdbRemoteLibrariesSvr4Support.py (1014 of 1362) PASS: lldb-api :: commands/expression/diagnostics/TestExprDiagnostics.py (1015 of 1362) PASS: lldb-shell :: Register/Core/x86-64-netbsd-gp.test (1016 of 1362) PASS: lldb-shell :: Quit/TestQuitExitCodeNonInt.test (1017 of 1362) PASS: lldb-shell :: Breakpoint/case-sensitive.test (1018 of 1362) UNSUPPORTED: lldb-api :: python_api/symbol-context/TestSymbolContext.py (1019 of 1362) PASS: lldb-shell :: Driver/TestConvenienceVariables.test (1020 of 1362) PASS: lldb-api :: commands/expression/po_verbosity/TestPoVerbosity.py (1021 of 1362) PASS: lldb-api :: lang/cpp/virtual-overload/TestVirtualOverload.py (1022 of 1362) PASS: lldb-api :: functionalities/var_path/TestVarPath.py (1023 of 1362) PASS: lldb-api :: commands/expression/codegen-crash-typedefdecl-not-in_declcontext/TestCodegenCrashTypedefDeclNotInDeclContext.py (1024 of 1362) UNSUPPORTED: lldb-api :: commands/expression/import-std-module/sysroot/TestStdModuleSysroot.py (1025 of 1362) PASS: lldb-api :: macosx/dyld-trie-symbols/TestDyldTrieSymbols.py (1026 of 1362) PASS: lldb-api :: functionalities/breakpoint/inlined_breakpoints/TestInlinedBreakpoints.py (1027 of 1362) PASS: lldb-shell :: SymbolFile/DWARF/x86/DW_AT_declaration-with-children.s (1028 of 1362) UNSUPPORTED: lldb-api :: functionalities/unwind/aarch64_unwind_pac/TestAArch64UnwindPAC.py (1029 of 1362) UNSUPPORTED: lldb-api :: lang/objc/modules-incomplete/TestIncompleteModules.py (1030 of 1362) UNSUPPORTED: lldb-api :: benchmarks/libcxxmap/TestBenchmarkLibcxxMap.py (1031 of 1362) UNSUPPORTED: lldb-api :: functionalities/tail_call_frames/inlining_and_tail_calls/TestInliningAndTailCalls.py (1032 of 1362) UNSUPPORTED: lldb-shell :: SymbolFile/PDB/ast-restore.test (1033 of 1362) PASS: lldb-api :: lang/objc/global_ptrs/TestGlobalObjects.py (1034 of 1362) UNSUPPORTED: lldb-shell :: Reproducer/TestSynchronous.test (1035 of 1362) UNSUPPORTED: lldb-shell :: SymbolFile/DWARF/x86/debug_ranges_and_rnglists.test (1036 of 1362) UNSUPPORTED: lldb-shell :: Breakpoint/case-insensitive.test (1037 of 1362) PASS: lldb-api :: functionalities/inferior-crashing/recursive-inferior/TestRecursiveInferiorStep.py (1038 of 1362) UNSUPPORTED: lldb-shell :: Reproducer/TestLuaImport.test (1039 of 1362) PASS: lldb-api :: commands/expression/two-files/TestObjCTypeQueryFromOtherCompileUnit.py (1040 of 1362) PASS: lldb-api :: lang/c/tls_globals/TestTlsGlobals.py (1041 of 1362) UNSUPPORTED: lldb-api :: functionalities/thread/concurrent_events/TestConcurrentTwoWatchpointsOneDelayBreakpoint.py (1042 of 1362) UNSUPPORTED: lldb-shell :: SymbolFile/NativePDB/stack_unwinding01.cpp (1043 of 1362) PASS: lldb-api :: functionalities/data-formatter/data-formatter-categories/TestDataFormatterCategories.py (1044 of 1362) PASS: lldb-api :: python_api/value/linked_list/TestValueAPILinkedList.py (1045 of 1362) PASS: lldb-shell :: SymbolFile/DWARF/x86/dwarf5-implicit-const.s (1046 of 1362) PASS: lldb-api :: commands/session/history/TestSessionHistory.py (1047 of 1362) PASS: lldb-api :: functionalities/thread/concurrent_events/TestConcurrentManyCrash.py (1048 of 1362) PASS: lldb-api :: python_api/default-constructor/TestDefaultConstructorForAPIObjects.py (1049 of 1362) PASS: lldb-api :: python_api/signals/TestSignalsAPI.py (1050 of 1362) PASS: lldb-shell :: ObjectFile/PDB/object.test (1051 of 1362) PASS: lldb-api :: commands/expression/scoped_enums/TestScopedEnumType.py (1052 of 1362) PASS: lldb-api :: python_api/module_section/TestModuleAndSection.py (1053 of 1362) PASS: lldb-shell :: Expr/TestIRMemoryMap.test (1054 of 1362) PASS: lldb-api :: commands/expression/char/TestExprsChar.py (1055 of 1362) PASS: lldb-api :: functionalities/abbreviation/TestAbbreviations.py (1056 of 1362) PASS: lldb-api :: functionalities/data-formatter/compactvectors/TestCompactVectors.py (1057 of 1362) PASS: lldb-api :: lang/objc/hidden-ivars/TestHiddenIvars.py (1058 of 1362) UNSUPPORTED: lldb-api :: macosx/version_zero/TestGetVersionZeroVersion.py (1059 of 1362) UNSUPPORTED: lldb-shell :: SymbolFile/PDB/variables-locations.test (1060 of 1362) PASS: lldb-shell :: Register/Core/x86-32-linux-fp.test (1061 of 1362) PASS: lldb-api :: functionalities/load_lazy/TestLoadUsingLazyBind.py (1062 of 1362) PASS: lldb-api :: lang/cpp/symbols/TestSymbols.py (1063 of 1362) PASS: lldb-api :: functionalities/data-formatter/hexcaps/TestDataFormatterHexCaps.py (1064 of 1362) PASS: lldb-api :: lang/cpp/diamond/TestDiamond.py (1065 of 1362) PASS: lldb-api :: functionalities/data-formatter/var-in-aggregate-misuse/TestVarInAggregateMisuse.py (1066 of 1362) PASS: lldb-api :: functionalities/inferior-assert/TestInferiorAssert.py (1067 of 1362) PASS: lldb-api :: lang/objc/foundation/TestObjCMethodsNSArray.py (1068 of 1362) PASS: lldb-api :: lang/objc/modules-cache/TestClangModulesCache.py (1069 of 1362) PASS: lldb-api :: lang/c/vla/TestVLA.py (1070 of 1362) UNSUPPORTED: lldb-api :: functionalities/thread/concurrent_events/TestConcurrentSignalWatch.py (1071 of 1362) UNSUPPORTED: lldb-api :: tools/lldb-vscode/stackTrace/TestVSCode_stackTrace.py (1072 of 1362) UNSUPPORTED: lldb-shell :: SymbolFile/NativePDB/ast-types.cpp (1073 of 1362) PASS: lldb-api :: lang/cpp/reference-to-outer-type/TestCppReferenceToOuterClass.py (1074 of 1362) UNSUPPORTED: lldb-api :: functionalities/thread/thread_specific_break_plus_condition/TestThreadSpecificBpPlusCondition.py (1075 of 1362) UNSUPPORTED: lldb-shell :: ScriptInterpreter/Python/Crashlog/text.test (1076 of 1362) PASS: lldb-shell :: Unwind/eh-frame-dwarf-unwind.test (1077 of 1362) PASS: lldb-api :: commands/gui/breakpoints/TestGuiBreakpoints.py (1078 of 1362) PASS: lldb-api :: lang/cpp/std-function-step-into-callable/TestStdFunctionStepIntoCallable.py (1079 of 1362) PASS: lldb-api :: commands/command/source/TestCommandSource.py (1080 of 1362) PASS: lldb-api :: types/TestDoubleTypesExpr.py (1081 of 1362) UNSUPPORTED: lldb-shell :: SymbolFile/NativePDB/typedefs.cpp (1082 of 1362) UNSUPPORTED: lldb-api :: macosx/thread-names/TestInterruptThreadNames.py (1083 of 1362) UNSUPPORTED: lldb-shell :: Reproducer/TestDebugSymbols.test (1084 of 1362) PASS: lldb-shell :: Settings/TestDisableColor.test (1085 of 1362) PASS: lldb-api :: functionalities/target_var/TestTargetVar.py (1086 of 1362) PASS: lldb-api :: lang/cpp/static_methods/TestCPPStaticMethods.py (1087 of 1362) UNSUPPORTED: lldb-shell :: Quit/TestQuitExitCode30.test (1088 of 1362) UNSUPPORTED: lldb-shell :: Register/x86-gp-write.test (1089 of 1362) UNSUPPORTED: lldb-shell :: Driver/LocalLLDBInit.test (1090 of 1362) PASS: lldb-api :: types/TestFloatTypes.py (1091 of 1362) PASS: lldb-api :: macosx/load-kext/TestLoadKext.py (1092 of 1362) UNSUPPORTED: lldb-api :: functionalities/tsan/thread_numbers/TestTsanThreadNumbers.py (1093 of 1362) PASS: lldb-shell :: ObjectFile/wasm/stripped-debug-sections.yaml (1094 of 1362) PASS: lldb-api :: tools/lldb-server/TestGdbRemoteHostInfo.py (1095 of 1362) PASS: lldb-api :: functionalities/data-formatter/type_summary_list_arg/TestTypeSummaryListArg.py (1096 of 1362) PASS: lldb-shell :: Commands/command-breakpoint-col.test (1097 of 1362) PASS: lldb-api :: lang/objc/direct-dispatch-step/TestObjCDirectDispatchStepping.py (1098 of 1362) UNSUPPORTED: lldb-api :: commands/expression/issue_11588/Test11588.py (1099 of 1362) PASS: lldb-api :: functionalities/gdb_remote_client/TestProcessConnect.py (1100 of 1362) UNSUPPORTED: lldb-shell :: ScriptInterpreter/Lua/print.test (1101 of 1362) PASS: lldb-api :: macosx/duplicate-archive-members/TestDuplicateMembers.py (1102 of 1362) PASS: lldb-shell :: Minidump/no-process-id.yaml (1103 of 1362) PASS: lldb-api :: functionalities/data-formatter/data-formatter-stl/libcxx/tuple/TestDataFormatterLibcxxTuple.py (1104 of 1362) PASS: lldb-api :: lang/objc/foundation/TestFoundationDisassembly.py (1105 of 1362) UNSUPPORTED: lldb-shell :: SymbolFile/DWARF/x86/dwarf5-line-strp.s (1106 of 1362) PASS: lldb-api :: macosx/order/TestOrderFile.py (1107 of 1362) UNSUPPORTED: lldb-api :: commands/expression/import-std-module/vector-bool/TestVectorBoolFromStdModule.py (1108 of 1362) PASS: lldb-api :: functionalities/data-formatter/data-formatter-stl/libstdcpp/unique_ptr/invalid/TestDataFormatterInvalidStdUniquePtr.py (1109 of 1362) PASS: lldb-api :: commands/expression/persistent_variables/TestPersistentVariables.py (1110 of 1362) UNSUPPORTED: lldb-api :: tools/lldb-vscode/breakpoint/TestVSCode_setExceptionBreakpoints.py (1111 of 1362) UNSUPPORTED: lldb-shell :: SymbolFile/NativePDB/local-variables.cpp (1112 of 1362) PASS: lldb-shell :: ObjectFile/PECOFF/symbol.yaml (1113 of 1362) PASS: lldb-shell :: SymbolFile/Breakpad/line-table-edgecases.test (1114 of 1362) PASS: lldb-shell :: Breakpoint/split-dwarf5-debug-stroffsets.test (1115 of 1362) UNSUPPORTED: lldb-shell :: SymbolFile/DWARF/x86/debug_loc.s (1116 of 1362) PASS: lldb-api :: functionalities/rerun/TestRerun.py (1117 of 1362) PASS: lldb-api :: types/TestLongTypes.py (1118 of 1362) UNSUPPORTED: lldb-api :: commands/expression/expr-in-syscall/TestExpressionInSyscall.py (1119 of 1362) UNSUPPORTED: lldb-shell :: SymbolFile/NativePDB/source-list.cpp (1120 of 1362) UNSUPPORTED: lldb-api :: commands/trace/multiple-threads/TestTraceStartStopMultipleThreads.py (1121 of 1362) UNSUPPORTED: lldb-shell :: BuildScript/toolchain-clang-cl.test (1122 of 1362) UNSUPPORTED: lldb-api :: functionalities/thread/concurrent_events/TestConcurrentSignalNWatchNBreak.py (1123 of 1362) UNSUPPORTED: lldb-shell :: Register/x86-64-ymm16-read.test (1124 of 1362) PASS: lldb-shell :: SymbolFile/Breakpad/unwind-via-stack-cfi.test (1125 of 1362) UNSUPPORTED: lldb-api :: commands/process/launch/TestProcessLaunch.py (1126 of 1362) PASS: lldb-shell :: Minidump/Windows/find-module.test (1127 of 1362) PASS: lldb-shell :: SymbolFile/DWARF/clang-ast-from-dwarf-objc-property.m (1128 of 1362) UNSUPPORTED: lldb-shell :: Subprocess/fork-follow-parent.test (1129 of 1362) PASS: lldb-api :: functionalities/thread/num_threads/TestNumThreads.py (1130 of 1362) PASS: lldb-api :: lang/cpp/non-type-template-param/TestCppNonTypeTemplateParam.py (1131 of 1362) UNSUPPORTED: lldb-api :: tools/lldb-vscode/launch/TestVSCode_launch.py (1132 of 1362) PASS: lldb-api :: lang/cpp/alignas_base_class/TestAlignAsBaseClass.py (1133 of 1362) UNSUPPORTED: lldb-api :: functionalities/thread/concurrent_events/TestConcurrentSignalDelayWatch.py (1134 of 1362) UNSUPPORTED: lldb-shell :: Subprocess/clone-follow-parent.test (1135 of 1362) UNSUPPORTED: lldb-shell :: SymbolFile/NativePDB/break-by-function.cpp (1136 of 1362) UNSUPPORTED: lldb-api :: functionalities/thread/concurrent_events/TestConcurrentSignalWatchBreak.py (1137 of 1362) PASS: lldb-api :: commands/frame/diagnose/dereference-this/TestDiagnoseDereferenceThis.py (1138 of 1362) PASS: lldb-api :: lang/objc/cpp_keyword_identifiers/TestCppKeywordsAsObjCIdentifiers.py (1139 of 1362) PASS: lldb-api :: lang/cpp/this_class_type_mixing/TestThisClassTypeMixing.py (1140 of 1362) PASS: lldb-api :: lang/cpp/forward-declared-template-specialization/TestCppForwardDeclaredTemplateSpecialization.py (1141 of 1362) PASS: lldb-api :: commands/expression/completion-crash-incomplete-record/TestCompletionCrashIncompleteRecord.py (1142 of 1362) PASS: lldb-shell :: SymbolFile/DWARF/anon_class_w_and_wo_export_symbols.ll (1143 of 1362) PASS: lldb-api :: functionalities/breakpoint/breakpoint_conditions/TestBreakpointConditions.py (1144 of 1362) PASS: lldb-api :: commands/target/stop-hook/enable/TestTargetStopHookEnable.py (1145 of 1362) PASS: lldb-api :: functionalities/stop-on-sharedlibrary-load/TestStopOnSharedlibraryEvents.py (1146 of 1362) PASS: lldb-api :: lang/c/stepping/TestStepAndBreakpoints.py (1147 of 1362) PASS: lldb-api :: lang/cpp/bitfields/TestCppBitfields.py (1148 of 1362) PASS: lldb-shell :: ObjectFile/MachO/lc_build_version.yaml (1149 of 1362) PASS: lldb-api :: macosx/thread_suspend/TestInternalThreadSuspension.py (1150 of 1362) PASS: lldb-api :: functionalities/thread/concurrent_events/TestConcurrentTwoBreakpointThreads.py (1151 of 1362) PASS: lldb-shell :: Breakpoint/debug_rnglist_basic.test (1152 of 1362) UNSUPPORTED: lldb-api :: functionalities/darwin_log/format/TestDarwinLogMessageFormat.py (1153 of 1362) PASS: lldb-shell :: Commands/CommandScriptImmediateOutput/CommandScriptImmediateOutputConsole.test (1154 of 1362) PASS: lldb-shell :: ObjectFile/ELF/null-jmprel.yaml (1155 of 1362) PASS: lldb-api :: lang/objc/variadic_methods/TestVariadicMethods.py (1156 of 1362) PASS: lldb-api :: functionalities/multidebugger_commands/TestMultipleDebuggersCommands.py (1157 of 1362) PASS: lldb-shell :: Settings/TestEchoCommands.test (1158 of 1362) PASS: lldb-shell :: Minidump/breakpad-symbols.test (1159 of 1362) UNSUPPORTED: lldb-api :: functionalities/thread/break_after_join/TestBreakAfterJoin.py (1160 of 1362) PASS: lldb-shell :: ObjectFile/ELF/PT_LOAD-empty.yaml (1161 of 1362) PASS: lldb-api :: python_api/sbvalue_const_addrof/TestSBValueConstAddrOf.py (1162 of 1362) UNSUPPORTED: lldb-api :: benchmarks/startup/TestStartupDelays.py (1163 of 1362) PASS: lldb-shell :: ObjectFile/ELF/compressed-sections.yaml (1164 of 1362) PASS: lldb-api :: lang/objcxx/hide-runtime-values/TestObjCXXHideRuntimeValues.py (1165 of 1362) UNSUPPORTED: lldb-api :: functionalities/tail_call_frames/disambiguate_call_site/TestDisambiguateCallSite.py (1166 of 1362) PASS: lldb-api :: functionalities/breakpoint/auto_continue/TestBreakpointAutoContinue.py (1167 of 1362) PASS: lldb-shell :: ObjectFile/PECOFF/sections.yaml (1168 of 1362) UNSUPPORTED: lldb-shell :: ScriptInterpreter/Python/scripted_breakpoint.test (1169 of 1362) PASS: lldb-api :: functionalities/data-formatter/data-formatter-stl/libcxx/variant/TestDataFormatterLibcxxVariant.py (1170 of 1362) PASS: lldb-api :: commands/settings/use_source_cache/TestUseSourceCache.py (1171 of 1362) UNSUPPORTED: lldb-api :: macosx/macCatalystAppMacOSFramework/TestMacCatalystAppWithMacOSFramework.py (1172 of 1362) UNSUPPORTED: lldb-shell :: Reproducer/TestGDBRemoteRepro.test (1173 of 1362) UNSUPPORTED: lldb-api :: commands/register/register/intel_xtended_registers/TestMPXRegisters.py (1174 of 1362) PASS: lldb-api :: lang/cpp/operator-overload/TestOperatorOverload.py (1175 of 1362) PASS: lldb-api :: lang/objcxx/cxx-bridged-po/TestObjCXXBridgedPO.py (1176 of 1362) UNSUPPORTED: lldb-api :: functionalities/thread/multi_break/TestMultipleBreakpoints.py (1177 of 1362) UNSUPPORTED: lldb-shell :: Unwind/basic-block-sections.test (1178 of 1362) UNSUPPORTED: lldb-api :: commands/expression/import-std-module/forward_list/TestForwardListFromStdModule.py (1179 of 1362) PASS: lldb-api :: python_api/lldbutil/iter/TestRegistersIterator.py (1180 of 1362) UNSUPPORTED: lldb-shell :: SymbolFile/PDB/function-level-linking.test (1181 of 1362) PASS: lldb-shell :: SymbolFile/Breakpad/unwind-via-raSearch.test (1182 of 1362) PASS: lldb-api :: python_api/thread/TestThreadAPI.py (1183 of 1362) UNSUPPORTED: lldb-api :: functionalities/thread/concurrent_events/TestConcurrentBreakpointsDelayedBreakpointOneWatchpoint.py (1184 of 1362) UNSUPPORTED: lldb-shell :: SymbolFile/DWARF/x86/find-method.cpp (1185 of 1362) PASS: lldb-api :: functionalities/postmortem/minidump/TestMiniDump.py (1186 of 1362) UNSUPPORTED: lldb-shell :: Reproducer/TestFinalize.test (1187 of 1362) PASS: lldb-shell :: ObjectFile/PECOFF/basic-info.yaml (1188 of 1362) UNSUPPORTED: lldb-api :: functionalities/tsan/thread_leak/TestTsanThreadLeak.py (1189 of 1362) UNSUPPORTED: lldb-shell :: SymbolFile/DWARF/x86/find-basic-type.cpp (1190 of 1362) PASS: lldb-api :: linux/builtin_trap/TestBuiltinTrap.py (1191 of 1362) PASS: lldb-api :: commands/frame/var/TestFrameVar.py (1192 of 1362) PASS: lldb-api :: commands/quit/TestQuit.py (1193 of 1362) UNSUPPORTED: lldb-shell :: SymbolFile/dissassemble-entry-point.s (1194 of 1362) PASS: lldb-api :: tools/lldb-server/TestGdbRemoteAttachWait.py (1195 of 1362) UNSUPPORTED: lldb-shell :: Breakpoint/ppc64-localentry.test (1196 of 1362) PASS: lldb-shell :: SymbolFile/DWARF/x86/compilercontext.ll (1197 of 1362) UNSUPPORTED: lldb-shell :: Watchpoint/netbsd-nouserdbregs.test (1198 of 1362) PASS: lldb-api :: functionalities/data-formatter/data-formatter-stl/libcxx/vector/TestDataFormatterLibcxxVector.py (1199 of 1362) UNSUPPORTED: lldb-shell :: SymbolFile/DWARF/x86/dwarf5-partial-index.cpp (1200 of 1362) PASS: lldb-api :: functionalities/thread/crash_during_step/TestCrashDuringStep.py (1201 of 1362) UNSUPPORTED: lldb-shell :: SymbolFile/NativePDB/ast-functions-msvc.cpp (1202 of 1362) PASS: lldb-shell :: ObjectFile/Breakpad/discontiguous-sections.test (1203 of 1362) UNSUPPORTED: lldb-api :: functionalities/breakpoint/hardware_breakpoints/write_memory_with_hw_breakpoint/TestWriteMemoryWithHWBreakpoint.py (1204 of 1362) UNSUPPORTED: lldb-shell :: Unwind/split-machine-functions.test (1205 of 1362) PASS: lldb-shell :: Commands/command-target-modules-dump-sections.yaml (1206 of 1362) UNSUPPORTED: lldb-api :: lang/objc/objc-dynamic-value/TestObjCDynamicValue.py (1207 of 1362) PASS: lldb-shell :: ObjectFile/ELF/section-permissions.yaml (1208 of 1362) UNSUPPORTED: lldb-shell :: ScriptInterpreter/Python/scripted_breakpoint_lua.test (1209 of 1362) PASS: lldb-api :: lang/c/record_decl_in_expr/TestRecordDeclInExpr.py (1210 of 1362) UNSUPPORTED: lldb-api :: commands/watchpoints/watchpoint_commands/command/TestWatchpointCommandLLDB.py (1211 of 1362) PASS: lldb-api :: functionalities/data-formatter/data-formatter-stl/libcxx/queue/TestDataFormatterLibcxxQueue.py (1212 of 1362) PASS: lldb-api :: functionalities/breakpoint/breakpoint_by_file_colon_line/TestBreakpointByFileColonLine.py (1213 of 1362) UNSUPPORTED: lldb-shell :: SymbolFile/NativePDB/locate-pdb.cpp (1214 of 1362) PASS: lldb-api :: functionalities/data-formatter/summary-string-onfail/Test-rdar-9974002.py (1215 of 1362) PASS: lldb-shell :: ObjectFile/PECOFF/section-types.yaml (1216 of 1362) PASS: lldb-api :: commands/version/TestVersion.py (1217 of 1362) PASS: lldb-shell :: SymbolFile/Breakpad/line-table-discontinuous-file-ids.test (1218 of 1362) PASS: lldb-api :: functionalities/non-overlapping-index-variable-i/TestIndexVariable.py (1219 of 1362) UNSUPPORTED: lldb-shell :: ScriptInterpreter/Lua/io.test (1220 of 1362) PASS: lldb-api :: tools/lldb-server/register-reading/TestGdbRemoteGPacket.py (1221 of 1362) UNSUPPORTED: lldb-api :: functionalities/gdb_remote_client/TestWriteMemory.py (1222 of 1362) PASS: lldb-shell :: Settings/TestDisassemblyFormat.test (1223 of 1362) UNSUPPORTED: lldb-shell :: Reproducer/Functionalities/TestDataFormatter.test (1224 of 1362) PASS: lldb-shell :: SymbolFile/DWARF/x86/DW_AT_location-DW_AT_const_value.s (1225 of 1362) UNSUPPORTED: lldb-api :: functionalities/darwin_log/filter/regex/activity/TestDarwinLogFilterRegexActivity.py (1226 of 1362) PASS: lldb-shell :: SymbolFile/DWARF/x86/DW_AT_const_value-bitfields.s (1227 of 1362) PASS: lldb-api :: functionalities/gdb_remote_client/TestPartialGPacket.py (1228 of 1362) PASS: lldb-api :: commands/platform/process/list/TestProcessList.py (1229 of 1362) PASS: lldb-api :: lang/cpp/dynamic-value/TestDynamicValue.py (1230 of 1362) PASS: lldb-api :: lang/objc/objc-new-syntax/TestObjCNewSyntaxDictionary.py (1231 of 1362) PASS: lldb-api :: functionalities/memory-region/TestMemoryRegion.py (1232 of 1362) UNSUPPORTED: lldb-shell :: Subprocess/clone-follow-parent-wp.test (1233 of 1362) UNSUPPORTED: lldb-shell :: Register/aarch64-gp-read.test (1234 of 1362) PASS: lldb-shell :: ObjectFile/PECOFF/basic-info-arm64.yaml (1235 of 1362) PASS: lldb-api :: commands/frame/diagnose/dereference-argument/TestDiagnoseDereferenceArgument.py (1236 of 1362) UNSUPPORTED: lldb-shell :: ObjectFile/ELF/minidebuginfo-no-lzma.yaml (1237 of 1362) PASS: lldb-api :: commands/process/attach/TestProcessAttach.py (1238 of 1362) PASS: lldb-shell :: SymbolFile/DWARF/x86/debug-types-dwarf5.s (1239 of 1362) PASS: lldb-api :: functionalities/limit-debug-info/TestLimitDebugInfo.py (1240 of 1362) PASS: lldb-api :: functionalities/data-formatter/data-formatter-objc/TestDataFormatterObjCCF.py (1241 of 1362) PASS: lldb-api :: lang/cpp/global_variables/TestCPPGlobalVariables.py (1242 of 1362) UNSUPPORTED: lldb-api :: commands/expression/import-std-module/missing-module-sources/TestStdModuleSourcesMissing.py (1243 of 1362) PASS: lldb-api :: lang/objc/modules-auto-import/TestModulesAutoImport.py (1244 of 1362) UNSUPPORTED: lldb-shell :: Reproducer/Functionalities/TestStepping.test (1245 of 1362) UNSUPPORTED: lldb-api :: commands/expression/import-std-module/shared_ptr-dbg-info-content/TestSharedPtrDbgInfoContentFromStdModule.py (1246 of 1362) PASS: lldb-api :: functionalities/gdb_remote_client/TestArmRegisterDefinition.py (1247 of 1362) PASS: lldb-api :: commands/expression/class_template_specialization_empty_pack/TestClassTemplateSpecializationParametersHandling.py (1248 of 1362) PASS: lldb-api :: functionalities/data-formatter/data-formatter-objc/TestDataFormatterObjCNSData.py (1249 of 1362) UNSUPPORTED: lldb-api :: functionalities/step_scripted/TestStepScripted.py (1250 of 1362) UNSUPPORTED: lldb-shell :: Unwind/eh-frame-small-fde.test (1251 of 1362) PASS: lldb-api :: commands/expression/anonymous-struct/TestCallUserAnonTypedef.py (1252 of 1362) PASS: lldb-api :: sample_test/TestSampleInlineTest.py (1253 of 1362) PASS: lldb-api :: functionalities/data-formatter/frameformat_smallstruct/TestFrameFormatSmallStruct.py (1254 of 1362) PASS: lldb-api :: lang/objc/blocks/TestObjCIvarsInBlocks.py (1255 of 1362) PASS: lldb-shell :: Driver/TestSingleQuote.test (1256 of 1362) PASS: lldb-shell :: ObjectFile/ELF/minidebuginfo-corrupt-xz.yaml (1257 of 1362) PASS: lldb-api :: lang/cpp/unsigned_types/TestUnsignedTypes.py (1258 of 1362) PASS: lldb-api :: python_api/value_var_update/TestValueVarUpdate.py (1259 of 1362) UNSUPPORTED: lldb-api :: functionalities/thread/concurrent_events/TestConcurrentTwoWatchpointsOneSignal.py (1260 of 1362) PASS: lldb-api :: commands/frame/var-scope/TestFrameVariableScope.py (1261 of 1362) PASS: lldb-shell :: ObjectFile/ELF/netbsd-exec-8.99.30-amd64.yaml (1262 of 1362) UNSUPPORTED: lldb-api :: functionalities/tsan/basic/TestTsanBasic.py (1263 of 1362) UNSUPPORTED: lldb-api :: tools/lldb-vscode/step/TestVSCode_step.py (1264 of 1362) PASS: lldb-api :: api/multiple-targets/TestMultipleTargets.py (1265 of 1362) PASS: lldb-api :: commands/command/invalid-args/TestInvalidArgsCommand.py (1266 of 1362) PASS: lldb-shell :: Unwind/thread-step-out-ret-addr-check.test (1267 of 1362) PASS: lldb-api :: functionalities/breakpoint/source_regexp/TestSourceRegexBreakpoints.py (1268 of 1362) UNSUPPORTED: lldb-api :: functionalities/inferior-changed/TestInferiorChanged.py (1269 of 1362) UNSUPPORTED: lldb-api :: functionalities/thread/concurrent_events/TestConcurrentManyWatchpoints.py (1270 of 1362) PASS: lldb-api :: commands/platform/basic/TestPlatformPython.py (1271 of 1362) UNSUPPORTED: lldb-shell :: SymbolFile/DWARF/x86/find-variable-file.cpp (1272 of 1362) PASS: lldb-api :: functionalities/tail_call_frames/ambiguous_tail_call_seq1/TestAmbiguousTailCallSeq1.py (1273 of 1362) PASS: lldb-api :: commands/add-dsym/uuid/TestAddDsymCommand.py (1274 of 1362) PASS: lldb-api :: functionalities/data-formatter/data-formatter-stl/libcxx/function/TestLibCxxFunction.py (1275 of 1362) PASS: lldb-shell :: Minidump/memory-region-from-module.yaml (1276 of 1362) PASS: lldb-api :: functionalities/data-formatter/data-formatter-objc/TestDataFormatterObjCKVO.py (1277 of 1362) PASS: lldb-api :: functionalities/show_location/TestShowLocationDwarf5.py (1278 of 1362) PASS: lldb-api :: commands/target/stop-hook/delete/TestTargetStopHookDelete.py (1279 of 1362) UNSUPPORTED: lldb-shell :: SymbolFile/DWARF/x86/subprogram_ranges.test (1280 of 1362) PASS: lldb-shell :: Minidump/fb-dump.test (1281 of 1362) PASS: lldb-api :: functionalities/data-formatter/data-formatter-stl/libcxx/bitset/TestDataFormatterLibcxxBitset.py (1282 of 1362) UNSUPPORTED: lldb-shell :: SymbolFile/PDB/function-nested-block.test (1283 of 1362) UNSUPPORTED: lldb-api :: macosx/find-dsym/deep-bundle/TestDeepBundle.py (1284 of 1362) PASS: lldb-api :: functionalities/gdb_remote_client/TestMultiprocess.py (1285 of 1362) UNSUPPORTED: lldb-shell :: SymbolFile/NativePDB/ast-methods.cpp (1286 of 1362) UNSUPPORTED: lldb-api :: commands/expression/import-std-module/deque-dbg-info-content/TestDbgInfoContentDequeFromStdModule.py (1287 of 1362) PASS: lldb-api :: functionalities/abbreviation/TestCommonShortSpellings.py (1288 of 1362) UNSUPPORTED: lldb-api :: commands/expression/import-std-module/retry-with-std-module/TestRetryWithStdModule.py (1289 of 1362) PASS: lldb-api :: commands/gui/invalid-args/TestInvalidArgsGui.py (1290 of 1362) UNSUPPORTED: lldb-shell :: Minidump/Windows/arm-fp-unwind.test (1291 of 1362) FAIL: lldb-api :: functionalities/gdb_remote_client/TestMemoryRegionDirtyPages.py (1292 of 1362) ******************** TEST 'lldb-api :: functionalities/gdb_remote_client/TestMemoryRegionDirtyPages.py' FAILED ******************** Script: -- /usr/local/Frameworks/Python.framework/Versions/3.7/bin/python3.7 /Users/buildslave/jenkins/workspace/lldb-cmake-matrix/llvm-project/lldb/test/API/dotest.py -u CXXFLAGS -u CFLAGS --codesign-identity lldb_codesign --arch x86_64 --build-dir /Users/buildslave/jenkins/workspace/lldb-cmake-matrix/lldb-build/lldb-test-build.noindex -t --env TERM=vt100 --skip-category gmodules --skip-category watchpoint --arch=x86_64 --env LLVM_LIBS_DIR=/Users/buildslave/jenkins/workspace/lldb-cmake-matrix/lldb-build/./lib --arch x86_64 --build-dir /Users/buildslave/jenkins/workspace/lldb-cmake-matrix/lldb-build/lldb-test-build.noindex --lldb-module-cache-dir /Users/buildslave/jenkins/workspace/lldb-cmake-matrix/lldb-build/lldb-test-build.noindex/module-cache-lldb/lldb-api --clang-module-cache-dir /Users/buildslave/jenkins/workspace/lldb-cmake-matrix/lldb-build/lldb-test-build.noindex/module-cache-clang/lldb-api --executable /Users/buildslave/jenkins/workspace/lldb-cmake-matrix/lldb-build/./bin/lldb --compiler /Users/buildslave/jenkins/workspace/lldb-cmake-matrix/clang_900_build/bin/clang --dsymutil /Users/buildslave/jenkins/workspace/lldb-cmake-matrix/lldb-build/./bin/dsymutil --llvm-tools-dir /Users/buildslave/jenkins/workspace/lldb-cmake-matrix/lldb-build/./bin --lldb-libs-dir /Users/buildslave/jenkins/workspace/lldb-cmake-matrix/lldb-build/./lib --skip-category=lldb-vscode --skip-category=std-module /Users/buildslave/jenkins/workspace/lldb-cmake-matrix/llvm-project/lldb/test/API/functionalities/gdb_remote_client -p TestMemoryRegionDirtyPages.py --capture-path /Users/buildslave/jenkins/workspace/lldb-cmake-matrix/lldb-build/lldb-test-build.noindex/reproducers/TestMemoryRegionDirtyPages.py -- Exit Code: -6

Hide Details

Command Output (stdout): -- lldb version 13.0.99 (http://labmaster3.local/git/llvm-project.git revision a0d96fdd3a4cda4d882076eff436301e1ec19055) clang revision a0d96fdd3a4cda4d882076eff436301e1ec19055 llvm revision a0d96fdd3a4cda4d882076eff436301e1ec19055 < 1> send packet: + history[1] tid=0x0307 < 1> send packet: + < 19> send packet: $QStartNoAckMode#b0 < 1> read packet: + < 6> read packet: $OK#9a < 1> send packet: + < 59> send packet: $qSupported:xmlRegisters=i386,arm,mips,arc;multiprocess+#04 < 57> read packet: $qXfer:features:read+;PacketSize=3fff;QStartNoAckMode+#86 < 26> send packet: $QThreadSuffixSupported#e4 < 4> read packet: $#00 < 27> send packet: $QListThreadsInStopReply#21 < 4> read packet: $#00 < 13> send packet: $qHostInfo#9b < 46> read packet: $ptrsize:8;endian:little;vm-page-size:4096;#0d < 10> send packet: $vCont?#49 < 4> read packet: $#00 < 27> send packet: $qVAttachOrWaitSupported#38 < 4> read packet: $#00 < 23> send packet: $QEnableErrorStrings#8c < 6> read packet: $OK#9a < 16> send packet: $qProcessInfo#dc < 4> read packet: $#00 < 6> send packet: $qC#b4 < 7> read packet: $QC0#c4 < 16> send packet: $qfThreadInfo#bb < 5> read packet: $l#6c < 5> send packet: $?#3f < 7> read packet: $S02#b5 < 16> send packet: $qProcessInfo#dc < 4> read packet: $#00 < 16> send packet: $qProcessInfo#dc < 4> read packet: $#00 < 41> send packet: $qXfer:features:read:target.xml:0,3ffe#af < 4> read packet: $#00 < 18> send packet: $qRegisterInfo0#72 < 4> read packet: $#00 < 16> send packet: $qfThreadInfo#bb < 5> read packet: $l#6c < 7> send packet: $Hg1#e0 < 6> read packet: $OK#9a < 6> send packet: $p0#a0 < 12> read packet: $00000000#80 < 16> send packet: $qProcessInfo#dc < 4> read packet: $#00 < 26> send packet: $qStructuredDataPlugins#02 < 4> read packet: $#00 < 18> send packet: $qShlibInfoAddr#6a < 4> read packet: $#00 < 16> send packet: $qfThreadInfo#bb < 5> read packet: $l#6c < 16> send packet: $qfThreadInfo#bb < 5> read packet: $l#6c < 23> send packet: $qMemoryRegionInfo:0#44 < 27> read packet: $start:0;size:100000000;#b4

Hide Details

-- Command Output (stderr): -- Assertion failed: (id != 0 && "Forgot to add function to registry?"), function GetID, file /Users/buildslave/jenkins/workspace/lldb-cmake-matrix/llvm-project/lldb/source/Utility/ReproducerInstrumentation.cpp, line 152. Fatal Python error: Aborted

Hide Details

Thread 0x000070000fbcd000 (most recent call first): File "/Users/buildslave/jenkins/workspace/lldb-cmake-matrix/llvm-project/lldb/test/API/functionalities/gdb_remote_client/gdbclientutils.py", line 361 in _run File "/usr/local/Cellar/python/3.7.0/Frameworks/Python.framework/Versions/3.7/lib/python3.7/threading.py", line 865 in run File "/usr/local/Cellar/python/3.7.0/Frameworks/Python.framework/Versions/3.7/lib/python3.7/threading.py", line 917 in _bootstrap_inner File "/usr/local/Cellar/python/3.7.0/Frameworks/Python.framework/Versions/3.7/lib/python3.7/threading.py", line 885 in _bootstrap

Hide Details

Current thread 0x0000000110830dc0 (most recent call first): File "/Users/buildslave/jenkins/workspace/lldb-cmake-matrix/lldb-build/lib/python3.7/site-packages/lldb/__init__.py", line 7079 in HasDirtyMemoryPageList File "/Users/buildslave/jenkins/workspace/lldb-cmake-matrix/llvm-project/lldb/test/API/functionalities/gdb_remote_client/TestMemoryRegionDirtyPages.py", line 38 in test File "/Users/buildslave/jenkins/workspace/lldb-cmake-matrix/llvm-project/lldb/third_party/Python/module/unittest2/unittest2/case.py", line 413 in runMethod File "/Users/buildslave/jenkins/workspace/lldb-cmake-matrix/llvm-project/lldb/third_party/Python/module/unittest2/unittest2/case.py", line 383 in run File "/Users/buildslave/jenkins/workspace/lldb-cmake-matrix/llvm-project/lldb/third_party/Python/module/unittest2/unittest2/case.py", line 458 in __call__ File "/Users/buildslave/jenkins/workspace/lldb-cmake-matrix/llvm-project/lldb/third_party/Python/module/unittest2/unittest2/suite.py", line 117 in _wrapped_run File "/Users/buildslave/jenkins/workspace/lldb-cmake-matrix/llvm-project/lldb/third_party/Python/module/unittest2/unittest2/suite.py", line 115 in _wrapped_run File "/Users/buildslave/jenkins/workspace/lldb-cmake-matrix/llvm-project/lldb/third_party/Python/module/unittest2/unittest2/suite.py", line 85 in run File "/Users/buildslave/jenkins/workspace/lldb-cmake-matrix/llvm-project/lldb/third_party/Python/module/unittest2/unittest2/suite.py", line 66 in __call__ File "/Users/buildslave/jenkins/workspace/lldb-cmake-matrix/llvm-project/lldb/third_party/Python/module/unittest2/unittest2/runner.py", line 165 in run File "/Users/buildslave/jenkins/workspace/lldb-cmake-matrix/llvm-project/lldb/packages/Python/lldbsuite/test/dotest.py", line 1019 in run_suite File "/Users/buildslave/jenkins/workspace/lldb-cmake-matrix/llvm-project/lldb/test/API/dotest.py", line 7 in <module>

Hide Details

--

Hide Details

******************** PASS: lldb-api :: functionalities/thread/concurrent_events/TestConcurrentManyBreakpoints.py (1293 of 1362) UNSUPPORTED: lldb-api :: commands/expression/import-std-module/deque-basic/TestDequeFromStdModule.py (1294 of 1362) PASS: lldb-api :: commands/expression/weak_symbols/TestWeakSymbols.py (1295 of 1362) PASS: lldb-api :: functionalities/thread/concurrent_events/TestConcurrentDelaySignalBreak.py (1296 of 1362) PASS: lldb-shell :: SymbolFile/Breakpad/line-table-mixed-path-styles.test (1297 of 1362) PASS: lldb-api :: commands/expression/error-limit/TestExprErrorLimit.py (1298 of 1362) PASS: lldb-api :: functionalities/data-formatter/refpointer-recursion/TestDataFormatterRefPtrRecursion.py (1299 of 1362) PASS: lldb-api :: functionalities/thread/concurrent_events/TestConcurrentBreakpointOneDelayBreakpointThreads.py (1300 of 1362) UNSUPPORTED: lldb-api :: python_api/watchpoint/condition/TestWatchpointConditionAPI.py (1301 of 1362) UNSUPPORTED: lldb-api :: python_api/disassemble-raw-data/TestDisassembleRawData.py (1302 of 1362) UNSUPPORTED: lldb-api :: functionalities/tail_call_frames/cross_dso/TestCrossDSOTailCalls.py (1303 of 1362) PASS: lldb-shell :: Register/Core/x86-32-freebsd-gp.test (1304 of 1362) PASS: lldb-shell :: Commands/command-disassemble.s (1305 of 1362) PASS: lldb-api :: python_api/frame/inlines/TestInlinedFrame.py (1306 of 1362) PASS: lldb-shell :: Minidump/Windows/broken-unwind.test (1307 of 1362) PASS: lldb-shell :: lldb-server/TestErrorMessages.test (1308 of 1362) PASS: lldb-api :: lang/c/shared_lib/TestSharedLib.py (1309 of 1362) PASS: lldb-api :: functionalities/data-formatter/nssetsynth/TestNSSetSynthetic.py (1310 of 1362) UNSUPPORTED: lldb-shell :: Reproducer/Functionalities/TestExpressionEvaluation.test (1311 of 1362) PASS: lldb-api :: functionalities/scripted_process/TestScriptedProcess.py (1312 of 1362) PASS: lldb-shell :: Settings/TestSettingsWrite.test (1313 of 1362) PASS: lldb-api :: functionalities/breakpoint/cpp_exception/TestCPPExceptionBreakpoint.py (1314 of 1362) PASS: lldb-api :: functionalities/data-formatter/ptr_ref_typedef/TestPtrRef2Typedef.py (1315 of 1362) PASS: lldb-api :: lang/cpp/lambdas/TestLambdas.py (1316 of 1362) PASS: lldb-api :: functionalities/data-formatter/data-formatter-proper-plurals/TestFormattersOneIsSingular.py (1317 of 1362) UNSUPPORTED: lldb-api :: commands/expression/import-std-module/vector-dbg-info-content/TestDbgInfoContentVectorFromStdModule.py (1318 of 1362) UNSUPPORTED: lldb-shell :: Driver/TestFile.test (1319 of 1362) PASS: lldb-api :: api/command-return-object/TestSBCommandReturnObject.py (1320 of 1362) PASS: lldb-api :: lang/cpp/const_this/TestConstThis.py (1321 of 1362) PASS: lldb-api :: python_api/process/TestProcessAPI.py (1322 of 1362) UNSUPPORTED: lldb-api :: commands/trace/TestTraceLoad.py (1323 of 1362) PASS: lldb-shell :: Register/Core/x86-32-freebsd-fp.test (1324 of 1362) PASS: lldb-shell :: ObjectFile/Breakpad/sections.test (1325 of 1362) UNSUPPORTED: lldb-api :: functionalities/tail_call_frames/sbapi_support/TestTailCallFrameSBAPI.py (1326 of 1362) UNSUPPORTED: lldb-api :: lang/objc/print-obj/TestPrintObj.py (1327 of 1362) PASS: lldb-api :: lang/objc/foundation/TestObjectDescriptionAPI.py (1328 of 1362) UNSUPPORTED: lldb-api :: lang/objc/modules-app-update/TestClangModulesAppUpdate.py (1329 of 1362) PASS: lldb-shell :: Commands/command-script-import.test (1330 of 1362) PASS: lldb-shell :: Settings/TestStopCommandSourceOnError.test (1331 of 1362) PASS: lldb-api :: python_api/objc_type/TestObjCType.py (1332 of 1362) PASS: lldb-api :: commands/source/info/TestSourceInfo.py (1333 of 1362) PASS: lldb-shell :: SymbolFile/DWARF/x86/DW_TAG_basic_type_DW_ATE_UTF_nonC.ll (1334 of 1362) PASS: lldb-shell :: Heap/heap-cstr.test (1335 of 1362) PASS: lldb-shell :: SymbolFile/DWARF/x86/debug_line-relative_path.s (1336 of 1362) UNSUPPORTED: lldb-api :: commands/trace/TestTraceDumpInstructions.py (1337 of 1362) UNSUPPORTED: lldb-api :: linux/add-symbols/TestTargetSymbolsAddCommand.py (1338 of 1362) PASS: lldb-api :: functionalities/data-formatter/setvaluefromcstring/TestSetValueFromCString.py (1339 of 1362) PASS: lldb-api :: lang/c/stepping/TestThreadStepping.py (1340 of 1362) UNSUPPORTED: lldb-shell :: ScriptInterpreter/Lua/lua.test (1341 of 1362) PASS: lldb-api :: lang/objc/objc++/TestObjCXX.py (1342 of 1362) PASS: lldb-api :: lang/cpp/function-qualifiers/TestCppFunctionQualifiers.py (1343 of 1362) PASS: lldb-shell :: Settings/TestLineMarkerColor.test (1344 of 1362) PASS: lldb-api :: api/check_public_api_headers/TestPublicAPIHeaders.py (1345 of 1362) UNSUPPORTED: lldb-api :: commands/watchpoints/watchpoint_count/TestWatchpointCount.py (1346 of 1362) XFAIL: lldb-shell :: Expr/nodefaultlib.cpp (1347 of 1362) PASS: lldb-api :: functionalities/data-formatter/data-formatter-objc/TestDataFormatterObjCNSError.py (1348 of 1362) UNSUPPORTED: lldb-api :: lang/cpp/gmodules/TestWithModuleDebugging.py (1349 of 1362) PASS: lldb-api :: functionalities/data-formatter/data-formatter-globals/TestDataFormatterGlobals.py (1350 of 1362) PASS: lldb-api :: functionalities/type_get_module/TestTypeGetModule.py (1351 of 1362) PASS: lldb-api :: lang/cpp/scope/TestCppScope.py (1352 of 1362) PASS: lldb-api :: functionalities/thread/step_out/TestThreadStepOut.py (1353 of 1362) PASS: lldb-api :: lang/objc/objc-property/TestObjCProperty.py (1354 of 1362) PASS: lldb-api :: functionalities/breakpoint/breakpoint_hit_count/TestBreakpointHitCount.py (1355 of 1362) PASS: lldb-api :: lang/cpp/exceptions/TestCPPExceptionBreakpoints.py (1356 of 1362) PASS: lldb-api :: functionalities/thread/concurrent_events/TestConcurrentDelayedCrashWithBreakpointSignal.py (1357 of 1362) PASS: lldb-api :: lang/objc/orderedset/TestOrderedSet.py (1358 of 1362) UNSUPPORTED: lldb-api :: functionalities/thread/create_during_step/TestCreateDuringStep.py (1359 of 1362) PASS: lldb-api :: functionalities/inferior-crashing/TestInferiorCrashingStep.py (1360 of 1362) PASS: lldb-api :: tools/lldb-server/TestGdbRemoteThreadsInStopReply.py (1361 of 1362) PASS: lldb-api :: tools/lldb-server/TestLldbGdbServer.py (1362 of 1362) Slowest Tests: -------------------------------------------------------------------------- 96.56s: lldb-api :: lang/objc/foundation/TestFoundationDisassembly.py 87.71s: lldb-api :: tools/lldb-server/TestLldbGdbServer.py 76.69s: lldb-api :: api/multithreaded/TestMultithreaded.py 40.81s: lldb-api :: lang/objc/exceptions/TestObjCExceptions.py 36.48s: lldb-api :: functionalities/completion/TestCompletion.py 36.00s: lldb-api :: types/TestLongTypesExpr.py 31.29s: lldb-api :: lang/cpp/namespace/TestNamespaceLookup.py 30.86s: lldb-api :: tools/lldb-server/TestGdbRemoteThreadsInStopReply.py 29.71s: lldb-api :: lang/objc/objc-new-syntax/TestObjCNewSyntaxLiteral.py 28.49s: lldb-api :: lang/objc/foundation/TestObjCMethods.py 28.22s: lldb-api :: lang/objc/real-definition/TestRealDefinition.py 22.22s: lldb-api :: types/TestLongTypes.py 22.05s: lldb-api :: lang/objc/objc-new-syntax/TestObjCNewSyntaxDictionary.py 21.94s: lldb-api :: lang/objc/objc-new-syntax/TestObjCNewSyntaxArray.py 21.91s: lldb-api :: lang/objc/hidden-ivars/TestHiddenIvars.py 21.65s: lldb-api :: types/TestIntegerTypeExpr.py 21.45s: lldb-api :: functionalities/load_unload/TestLoadUnload.py 20.66s: lldb-api :: functionalities/gdb_remote_client/TestPlatformClient.py 19.37s: lldb-api :: commands/target/basic/TestTargetCommand.py 19.00s: lldb-api :: commands/register/register/register_command/TestRegisters.py

Hide Details

Tests Times: -------------------------------------------------------------------------- [ Range ] :: [ Percentage ] :: [ Count ] -------------------------------------------------------------------------- [95.0s,100.0s) :: [ ] :: [ 1/1362] [90.0s,95.0s) :: [ ] :: [ 1/1362] [85.0s,90.0s) :: [ ] :: [ 0/1362] [80.0s,85.0s) :: [ ] :: [ 0/1362] [75.0s,80.0s) :: [ ] :: [ 1/1362] [70.0s,75.0s) :: [ ] :: [ 0/1362] [65.0s,70.0s) :: [ ] :: [ 0/1362] [60.0s,65.0s) :: [ ] :: [ 0/1362] [55.0s,60.0s) :: [ ] :: [ 0/1362] [50.0s,55.0s) :: [ ] :: [ 0/1362] [45.0s,50.0s) :: [ ] :: [ 0/1362] [40.0s,45.0s) :: [ ] :: [ 1/1362] [35.0s,40.0s) :: [ ] :: [ 2/1362] [30.0s,35.0s) :: [ ] :: [ 3/1362] [25.0s,30.0s) :: [ ] :: [ 2/1362] [20.0s,25.0s) :: [ ] :: [ 8/1362] [15.0s,20.0s) :: [ ] :: [ 11/1362] [10.0s,15.0s) :: [ ] :: [ 31/1362] [ 5.0s,10.0s) :: [**** ] :: [ 151/1362] [ 0.0s, 5.0s) :: [********************************* ] :: [1150/1362] -------------------------------------------------------------------------- ******************** Failed Tests (3): lldb-api :: functionalities/gdb_remote_client/TestMemoryRegionDirtyPages.py lldb-api :: lang/cpp/modules-import/TestCXXModulesImport.py lldb-api :: lang/objc/modules-compile-error/TestModulesCompileError.py

Hide Details

Hide Details

Testing Time: 244.46s Unsupported : 447 Passed : 903 Expectedly Failed: 9 Failed : 3 FAILED: tools/lldb/test/CMakeFiles/check-lldb-reproducers-capture cd /Users/buildslave/jenkins/workspace/lldb-cmake-matrix/lldb-build/tools/lldb/test && /usr/local/Frameworks/Python.framework/Versions/3.7/bin/python3.7 /Users/buildslave/jenkins/workspace/lldb-cmake-matrix/lldb-build/./bin/llvm-lit -v --time-tests --shuffle --xunit-xml-output=/Users/buildslave/jenkins/workspace/lldb-cmake-matrix/test/results.xml -v --param lldb-run-with-repro=capture /Users/buildslave/jenkins/workspace/lldb-cmake-matrix/lldb-build/tools/lldb/test/API /Users/buildslave/jenkins/workspace/lldb-cmake-matrix/lldb-build/tools/lldb/test/Shell ninja: build stopped: cannot make progress due to previous errors. Command failed: Command '['/usr/local/bin/ninja', '-k', '0', '-v', 'check-lldb-reproducers']' returned non-zero exit status 1. Command: ['/usr/local/bin/ninja', '-k', '0', '-v', 'check-lldb-reproducers'] + set -e [Pipeline] } [Pipeline] // timeout [Pipeline] } [Pipeline] // stage [Pipeline] } [Pipeline] // withEnv [Pipeline] } [Pipeline] // node [Pipeline] End of Pipeline Finished: UNSTABLE