Console Output

Skipping 11,038 KB.. Full Log
UNSUPPORTED: lldb-api :: linux/aarch64/mte_memory_region/TestAArch64LinuxMTEMemoryRegion.py (251 of 1914)
PASS: lldb-api :: commands/frame/diagnose/dereference-this/TestDiagnoseDereferenceThis.py (252 of 1914)
PASS: lldb-api :: commands/expression/import-std-module/deque-dbg-info-content/TestDbgInfoContentDequeFromStdModule.py (253 of 1914)
PASS: lldb-api :: commands/expression/expr_inside_lambda/TestExprInsideLambdas.py (254 of 1914)
PASS: lldb-unit :: Host/./HostTests/17/19 (255 of 1914)
UNSUPPORTED: lldb-api :: functionalities/ptrauth_diagnostics/brkC47x_code/TestPtrauthBRKc47xDiagnostic.py (256 of 1914)
PASS: lldb-unit :: Core/./LLDBCoreTests/5/23 (257 of 1914)
PASS: lldb-api :: functionalities/gdb_remote_client/TestPlatformMacOSX.py (258 of 1914)
PASS: lldb-shell :: BuildScript/modes.test (259 of 1914)
PASS: lldb-api :: commands/frame/diagnose/inheritance/TestDiagnoseInheritance.py (260 of 1914)
PASS: lldb-shell :: Driver/TestSingleQuote.test (261 of 1914)
PASS: lldb-api :: python_api/watchpoint/condition/TestWatchpointConditionAPI.py (262 of 1914)
PASS: lldb-api :: commands/expression/import-std-module/weak_ptr/TestWeakPtrFromStdModule.py (263 of 1914)
PASS: lldb-api :: commands/command/regex/TestRegexCommand.py (264 of 1914)
PASS: lldb-api :: tools/lldb-server/inferior-crash/TestGdbRemoteSegFault.py (265 of 1914)
PASS: lldb-unit :: Core/./LLDBCoreTests/9/23 (266 of 1914)
PASS: lldb-unit :: SymbolFile/NativePDB/./SymbolFileNativePDBTests/5/15 (267 of 1914)
UNSUPPORTED: lldb-api :: functionalities/data-formatter/data-formatter-stl/libstdcpp/smart_ptr/TestDataFormatterStdSmartPtr.py (268 of 1914)
PASS: lldb-api :: tools/lldb-vscode/stackTrace/TestVSCode_stackTrace.py (269 of 1914)
UNSUPPORTED: lldb-api :: lang/objc/rdar-12408181/TestRdar12408181.py (270 of 1914)
PASS: lldb-api :: functionalities/float-display/TestFloatDisplay.py (271 of 1914)
PASS: lldb-unit :: SymbolFile/NativePDB/./SymbolFileNativePDBTests/1/15 (272 of 1914)
PASS: lldb-unit :: SymbolFile/DWARF/./SymbolFileDWARFTests/19/29 (273 of 1914)
PASS: lldb-unit :: Core/./LLDBCoreTests/14/23 (274 of 1914)
PASS: lldb-api :: lang/cpp/unicode-literals/TestUnicodeLiterals.py (275 of 1914)
PASS: lldb-unit :: ObjectFile/Breakpad/./ObjectFileBreakpadTests/8/11 (276 of 1914)
PASS: lldb-api :: functionalities/find-line-entry/TestFindLineEntry.py (277 of 1914)
PASS: lldb-api :: functionalities/data-formatter/data-formatter-stl/generic/multiset/TestDataFormatterGenericMultiSet.py (278 of 1914)
PASS: lldb-api :: commands/watchpoints/step_over_watchpoint/TestStepOverWatchpoint.py (279 of 1914)
PASS: lldb-api :: macosx/add-dsym/TestAddDsymDownload.py (280 of 1914)
PASS: lldb-api :: functionalities/breakpoint/breakpoint_by_line_and_column/TestBreakpointByLineAndColumn.py (281 of 1914)
UNSUPPORTED: lldb-api :: functionalities/tsan/basic/TestTsanBasic.py (282 of 1914)
PASS: lldb-api :: lang/objc/objc-struct-argument/TestObjCStructArgument.py (283 of 1914)
PASS: lldb-api :: assert_messages_test/TestAssertMessages.py (284 of 1914)
PASS: lldb-shell :: SymbolFile/DWARF/x86/debug-types-address-ranges.s (285 of 1914)
PASS: lldb-api :: functionalities/data-formatter/data-formatter-stl/libcxx/initializerlist/TestInitializerList.py (286 of 1914)
PASS: lldb-api :: python_api/lldbutil/TestSwigVersion.py (287 of 1914)
PASS: lldb-api :: api/listeners/TestListener.py (288 of 1914)
PASS: lldb-api :: functionalities/data-formatter/varscript_formatting/TestDataFormatterVarScriptFormatting.py (289 of 1914)
PASS: lldb-api :: commands/expression/po_verbosity/TestPoVerbosity.py (290 of 1914)
PASS: lldb-unit :: SymbolFile/DWARF/./SymbolFileDWARFTests/11/29 (291 of 1914)
PASS: lldb-unit :: Process/./ProcessEventDataTests/1/2 (292 of 1914)
PASS: lldb-api :: python_api/lldbutil/frame/TestFrameUtils.py (293 of 1914)
PASS: lldb-shell :: Commands/command-script-import.test (294 of 1914)
PASS: lldb-api :: commands/expression/diagnostics/TestExprDiagnostics.py (295 of 1914)
PASS: lldb-api :: commands/expression/dont_allow_jit/TestAllowJIT.py (296 of 1914)
PASS: lldb-api :: lang/c/bitfields/TestBitfields.py (297 of 1914)
UNSUPPORTED: lldb-shell :: Unwind/windows-unaligned-x86_64.test (298 of 1914)
PASS: lldb-shell :: Breakpoint/breakpoint-command.test (299 of 1914)
PASS: lldb-shell :: Breakpoint/jit-loader_jitlink_elf.test (300 of 1914)
PASS: lldb-api :: lang/objc/modules-cache/TestClangModulesCache.py (301 of 1914)
PASS: lldb-api :: functionalities/target_var/no_vars/TestTargetVarNoVars.py (302 of 1914)
PASS: lldb-shell :: ObjectFile/PECOFF/dwarf-gnu-debuglink.yaml (303 of 1914)
PASS: lldb-api :: lang/cpp/default-template-args/TestDefaultTemplateArgs.py (304 of 1914)
PASS: lldb-api :: lang/objc/modules-inline-functions/TestModulesInlineFunctions.py (305 of 1914)
PASS: lldb-api :: lang/cpp/step-through-trampoline/TestStepThroughTrampoline.py (306 of 1914)
PASS: lldb-api :: commands/expression/import-std-module/conflicts/TestStdModuleWithConflicts.py (307 of 1914)
PASS: lldb-unit :: ObjectFile/Breakpad/./ObjectFileBreakpadTests/10/11 (308 of 1914)
PASS: lldb-api :: api/check_public_api_headers/TestPublicAPIHeaders.py (309 of 1914)
PASS: lldb-api :: types/TestDoubleTypesExpr.py (310 of 1914)
PASS: lldb-api :: lang/objc/modules-auto-import/TestModulesAutoImport.py (311 of 1914)
PASS: lldb-unit :: SymbolFile/DWARF/./SymbolFileDWARFTests/18/29 (312 of 1914)
PASS: lldb-api :: lang/cpp/scope/TestCppScope.py (313 of 1914)
PASS: lldb-unit :: Expression/./ExpressionTests/7/22 (314 of 1914)
PASS: lldb-shell :: Error/assert.test (315 of 1914)
PASS: lldb-api :: functionalities/inferior-crashing/recursive-inferior/TestRecursiveInferior.py (316 of 1914)
UNSUPPORTED: lldb-api :: functionalities/ubsan/user-expression/TestUbsanUserExpression.py (317 of 1914)
PASS: lldb-api :: commands/expression/import-std-module/queue/TestQueueFromStdModule.py (318 of 1914)
PASS: lldb-unit :: Process/gdb-remote/./ProcessGdbRemoteTests/4/19 (319 of 1914)
PASS: lldb-unit :: debugserver/./debugserverTests/3/6 (320 of 1914)
PASS: lldb-unit :: SymbolFile/DWARF/./SymbolFileDWARFTests/8/29 (321 of 1914)
PASS: lldb-shell :: ObjectFile/PECOFF/symbol.yaml (322 of 1914)
PASS: lldb-unit :: Host/./HostTests/6/19 (323 of 1914)
PASS: lldb-shell :: Register/Core/aarch64-freebsd-multithread.test (324 of 1914)
UNSUPPORTED: lldb-api :: tools/lldb-server/TestGdbRemoteFork.py (325 of 1914)
PASS: lldb-api :: functionalities/tail_call_frames/inlining_and_tail_calls/TestInliningAndTailCalls.py (326 of 1914)
PASS: lldb-api :: tools/lldb-vscode/runInTerminal/TestVSCode_runInTerminal.py (327 of 1914)
PASS: lldb-shell :: Commands/command-stop-hook-output.test (328 of 1914)
PASS: lldb-unit :: Utility/./UtilityTests/23/30 (329 of 1914)
PASS: lldb-api :: macosx/universal/TestUniversal.py (330 of 1914)
UNSUPPORTED: lldb-api :: functionalities/ptrauth_diagnostics/LDRAA_error/TestPtrauthLDRAADiagnostic.py (331 of 1914)
PASS: lldb-api :: tools/lldb-server/attach-wait/TestGdbRemoteAttachWait.py (332 of 1914)
UNSUPPORTED: lldb-api :: linux/aarch64/mte_tag_faults/TestAArch64LinuxMTEMemoryTagFaults.py (333 of 1914)
PASS: lldb-api :: commands/command/script/import/rdar-12586188/TestRdar12586188.py (334 of 1914)
PASS: lldb-unit :: Language/Highlighting/./HighlighterTests/5/29 (335 of 1914)
PASS: lldb-unit :: Symbol/./SymbolTests/13/16 (336 of 1914)
PASS: lldb-unit :: Process/gdb-remote/./ProcessGdbRemoteTests/1/19 (337 of 1914)
PASS: lldb-api :: macosx/order/TestOrderFile.py (338 of 1914)
PASS: lldb-api :: functionalities/data-formatter/data-formatter-stl/libcxx/vbool/TestDataFormatterLibcxxVBool.py (339 of 1914)
PASS: lldb-unit :: Core/./LLDBCoreTests/0/23 (340 of 1914)
PASS: lldb-shell :: Breakpoint/debug_addrx.test (341 of 1914)
PASS: lldb-api :: lang/c/builtin-types/TestCBuiltinTypes.py (342 of 1914)
PASS: lldb-api :: lang/cpp/class-loading-via-member-typedef/TestClassLoadingViaMemberTypedef.py (343 of 1914)
UNSUPPORTED: lldb-shell :: SymbolFile/PDB/vbases.test (344 of 1914)
PASS: lldb-unit :: Process/gdb-remote/./ProcessGdbRemoteTests/18/19 (345 of 1914)
PASS: lldb-api :: functionalities/lazy-loading/TestLazyLoading.py (346 of 1914)
PASS: lldb-api :: functionalities/recursion/TestValueObjectRecursion.py (347 of 1914)
PASS: lldb-unit :: Host/./HostTests/4/19 (348 of 1914)
PASS: lldb-api :: commands/expression/unicode-in-variable/TestUnicodeInVariable.py (349 of 1914)
PASS: lldb-api :: lang/cpp/member-and-local-vars-with-same-name/TestMembersAndLocalsWithSameName.py (350 of 1914)
UNSUPPORTED: lldb-shell :: Breakpoint/case-insensitive.test (351 of 1914)
PASS: lldb-api :: macosx/load-kext/TestLoadKext.py (352 of 1914)
PASS: lldb-api :: functionalities/breakpoint/breakpoint_on_lambda_capture/TestBreakOnLambdaCapture.py (353 of 1914)
PASS: lldb-shell :: Commands/command-disassemble-process.yaml (354 of 1914)
PASS: lldb-shell :: ScriptInterpreter/Python/Crashlog/no_threadState.test (355 of 1914)
UNSUPPORTED: lldb-api :: functionalities/postmortem/FreeBSDKernel/TestFreeBSDKernelVMCore.py (356 of 1914)
PASS: lldb-api :: functionalities/breakpoint/inlined_breakpoints/TestInlinedBreakpoints.py (357 of 1914)
PASS: lldb-api :: macosx/indirect_symbol/TestIndirectSymbols.py (358 of 1914)
PASS: lldb-api :: functionalities/data-formatter/data-formatter-stl/libcxx/string_view/TestDataFormatterLibcxxStringView.py (359 of 1914)
PASS: lldb-api :: functionalities/data-formatter/data-formatter-proper-plurals/TestFormattersOneIsSingular.py (360 of 1914)
PASS: lldb-shell :: SymbolFile/Breakpad/symtab.test (361 of 1914)
UNSUPPORTED: lldb-api :: python_api/disassemble-raw-data/TestDisassemble_VST1_64.py (362 of 1914)
UNSUPPORTED: lldb-shell :: Register/arm-gp-read.test (363 of 1914)
PASS: lldb-api :: lang/cpp/elaborated-types/TestElaboratedTypes.py (364 of 1914)
PASS: lldb-api :: functionalities/breakpoint/breakpoint_ignore_count/TestBreakpointIgnoreCount.py (365 of 1914)
PASS: lldb-unit :: SymbolFile/DWARF/./SymbolFileDWARFTests/12/29 (366 of 1914)
UNSUPPORTED: lldb-shell :: Commands/command-target-create-resolve-exe.test (367 of 1914)
PASS: lldb-unit :: UnwindAssembly/x86/./UnwindAssemblyx86Tests/20/27 (368 of 1914)
PASS: lldb-shell :: Minidump/Windows/broken-unwind.test (369 of 1914)
PASS: lldb-api :: lang/objc/single-entry-dictionary/TestObjCSingleEntryDictionary.py (370 of 1914)
PASS: lldb-shell :: ObjectFile/wasm/embedded-debug-sections.yaml (371 of 1914)
PASS: lldb-api :: functionalities/load_after_attach/TestLoadAfterAttach.py (372 of 1914)
PASS: lldb-api :: tools/lldb-server/commandline/TestGdbRemoteConnection.py (373 of 1914)
PASS: lldb-api :: functionalities/data-formatter/refpointer-recursion/TestDataFormatterRefPtrRecursion.py (374 of 1914)
PASS: lldb-api :: lang/cpp/class-template-non-type-parameter-pack/TestClassTemplateNonTypeParameterPack.py (375 of 1914)
PASS: lldb-unit :: Utility/./UtilityTests/27/30 (376 of 1914)
PASS: lldb-unit :: Process/gdb-remote/./ProcessGdbRemoteTests/10/19 (377 of 1914)
PASS: lldb-unit :: DataFormatter/./LLDBFormatterTests/1/11 (378 of 1914)
PASS: lldb-shell :: SymbolFile/DWARF/x86/dwarf5-atomic.s (379 of 1914)
PASS: lldb-unit :: Platform/./LLDBPlatformTests/0/16 (380 of 1914)
PASS: lldb-api :: tools/lldb-vscode/breakpoint-events/TestVSCode_breakpointEvents.py (381 of 1914)
PASS: lldb-shell :: BuildScript/toolchain-clang.test (382 of 1914)
PASS: lldb-api :: python_api/frame/TestFrames.py (383 of 1914)
PASS: lldb-unit :: Platform/./LLDBPlatformTests/4/16 (384 of 1914)
PASS: lldb-api :: functionalities/data-formatter/data-formatter-objc/TestDataFormatterObjCNSNumber.py (385 of 1914)
PASS: lldb-shell :: Driver/TestProcessAttach.test (386 of 1914)
PASS: lldb-shell :: Reproducer/TestDSYM.test (387 of 1914)
PASS: lldb-unit :: Process/Utility/./ProcessUtilityTests/3/16 (388 of 1914)
PASS: lldb-api :: functionalities/gdb_remote_client/TestNoGPacketSupported.py (389 of 1914)
PASS: lldb-shell :: ObjectFile/ELF/PT_LOAD-empty.yaml (390 of 1914)
UNSUPPORTED: lldb-api :: iohandler/autosuggestion/TestAutosuggestion.py (391 of 1914)
PASS: lldb-api :: functionalities/source-map/TestTargetSourceMap.py (392 of 1914)
PASS: lldb-unit :: Interpreter/./InterpreterTests/0/14 (393 of 1914)
PASS: lldb-unit :: SymbolFile/DWARF/./SymbolFileDWARFTests/16/29 (394 of 1914)
PASS: lldb-unit :: ObjectFile/ELF/./ObjectFileELFTests/3/4 (395 of 1914)
PASS: lldb-unit :: SymbolFile/DWARF/./SymbolFileDWARFTests/5/29 (396 of 1914)
PASS: lldb-api :: functionalities/gdb_remote_client/TestGDBRemoteDiskFileCompletion.py (397 of 1914)
UNSUPPORTED: lldb-api :: commands/expression/multiline-navigation/TestMultilineNavigation.py (398 of 1914)
UNSUPPORTED: lldb-api :: functionalities/tsan/thread_numbers/TestTsanThreadNumbers.py (399 of 1914)
UNSUPPORTED: lldb-shell :: Subprocess/clone-follow-child-wp.test (400 of 1914)
PASS: lldb-unit :: Process/minidump/./LLDBMinidumpTests/16/17 (401 of 1914)
UNSUPPORTED: lldb-api :: functionalities/tsan/global_location/TestTsanGlobalLocation.py (402 of 1914)
PASS: lldb-api :: sample_test/TestSampleInlineTest.py (403 of 1914)
PASS: lldb-shell :: SymbolFile/DWARF/x86/dwo-type-in-main-file.s (404 of 1914)
PASS: lldb-shell :: ObjectFile/PECOFF/sections.yaml (405 of 1914)
PASS: lldb-api :: python_api/signals/TestSignalsAPI.py (406 of 1914)
PASS: lldb-unit :: Core/./LLDBCoreTests/3/23 (407 of 1914)
PASS: lldb-api :: lang/cpp/breakpoint_in_member_func_w_non_primitive_params/TestBreakpointInMemberFuncWNonPrimitiveParams.py (408 of 1914)
PASS: lldb-unit :: Process/gdb-remote/./ProcessGdbRemoteTests/5/19 (409 of 1914)
PASS: lldb-api :: commands/target/select/TestTargetSelect.py (410 of 1914)
UNSUPPORTED: lldb-api :: functionalities/exec/TestExec.py (411 of 1914)
PASS: lldb-unit :: Interpreter/./InterpreterTests/9/14 (412 of 1914)
PASS: lldb-api :: python_api/thread/TestThreadAPI.py (413 of 1914)
PASS: lldb-api :: functionalities/multidebugger_commands/TestMultipleDebuggersCommands.py (414 of 1914)
PASS: lldb-api :: types/TestIntegerType.py (415 of 1914)
PASS: lldb-api :: functionalities/paths/TestPaths.py (416 of 1914)
PASS: lldb-unit :: Core/./LLDBCoreTests/20/23 (417 of 1914)
PASS: lldb-api :: commands/expression/radar_8638051/Test8638051.py (418 of 1914)
PASS: lldb-unit :: Core/./LLDBCoreTests/17/23 (419 of 1914)
PASS: lldb-shell :: Register/x86-multithread-write.test (420 of 1914)
PASS: lldb-api :: functionalities/data-formatter/cstring-utf8-summary/TestCstringUnicode.py (421 of 1914)
PASS: lldb-api :: functionalities/data-formatter/synthupdate/TestSyntheticFilterRecompute.py (422 of 1914)
UNSUPPORTED: lldb-api :: functionalities/signal/handle-segv/TestHandleSegv.py (423 of 1914)
UNSUPPORTED: lldb-api :: functionalities/data-formatter/data-formatter-stl/libstdcpp/unique_ptr/TestDataFormatterStdUniquePtr.py (424 of 1914)
UNSUPPORTED: lldb-api :: iohandler/completion/TestIOHandlerCompletion.py (425 of 1914)
PASS: lldb-shell :: ObjectFile/PECOFF/basic-info.yaml (426 of 1914)
PASS: lldb-api :: lang/cpp/incompatible-class-templates/TestCppIncompatibleClassTemplates.py (427 of 1914)
UNSUPPORTED: lldb-shell :: ObjectFile/PECOFF/disassemble-thumb.yaml (428 of 1914)
PASS: lldb-unit :: Platform/./LLDBPlatformTests/2/16 (429 of 1914)
PASS: lldb-unit :: DataFormatter/./LLDBFormatterTests/4/11 (430 of 1914)
PASS: lldb-api :: functionalities/data-formatter/data-formatter-disabling/TestDataFormatterDisabling.py (431 of 1914)
UNSUPPORTED: lldb-api :: functionalities/tsan/cpp_global_location/TestTsanCPPGlobalLocation.py (432 of 1914)
PASS: lldb-api :: functionalities/progress_reporting/TestProgressReporting.py (433 of 1914)
PASS: lldb-api :: python_api/function_symbol/TestDisasmAPI.py (434 of 1914)
PASS: lldb-api :: functionalities/data-formatter/data-formatter-stl/libstdcpp/unique_ptr/invalid/TestDataFormatterInvalidStdUniquePtr.py (435 of 1914)
PASS: lldb-shell :: ObjectFile/ELF/section-types-edgecases.yaml (436 of 1914)
PASS: lldb-shell :: SymbolFile/DWARF/x86/dwarf5-debug_line-file-index.s (437 of 1914)
PASS: lldb-shell :: SymbolFile/DWARF/x86/debug-types-missing-signature.test (438 of 1914)
PASS: lldb-api :: functionalities/breakpoint/breakpoint_command/TestBreakpointCommandsFromPython.py (439 of 1914)
PASS: lldb-shell :: Settings/TestFrameFormatNoColor.test (440 of 1914)
UNSUPPORTED: lldb-shell :: Subprocess/clone-follow-child-softbp.test (441 of 1914)
PASS: lldb-unit :: Symbol/./SymbolTests/14/16 (442 of 1914)
PASS: lldb-api :: commands/process/attach/attach_denied/TestAttachDenied.py (443 of 1914)
PASS: lldb-shell :: SymbolFile/DWARF/x86/dwp.s (444 of 1914)
PASS: lldb-api :: symbol_ondemand/shared_library/TestSharedLibOnDemand.py (445 of 1914)
PASS: lldb-api :: functionalities/target_var/TestTargetVar.py (446 of 1914)
PASS: lldb-shell :: Settings/TestModuleCacheSanity.test (447 of 1914)
PASS: lldb-api :: commands/register/register/register_command/TestRegisters.py (448 of 1914)
PASS: lldb-api :: functionalities/breakpoint/cpp_exception/TestCPPExceptionBreakpoint.py (449 of 1914)
UNSUPPORTED: lldb-api :: commands/watchpoints/watch_tagged_addr/TestWatchTaggedAddress.py (450 of 1914)
UNSUPPORTED: lldb-shell :: Register/aarch64-gp-read.test (451 of 1914)
UNSUPPORTED: lldb-api :: functionalities/asan/TestMemoryHistory.py (452 of 1914)
PASS: lldb-unit :: SymbolFile/NativePDB/./SymbolFileNativePDBTests/6/15 (453 of 1914)
PASS: lldb-api :: lang/objcxx/cpp_keywords_enabled/TestObjCppKeywordsEnabled.py (454 of 1914)
PASS: lldb-shell :: SymbolFile/DWARF/x86/compilercontext.ll (455 of 1914)
PASS: lldb-api :: commands/expression/call-throws/TestCallThatThrows.py (456 of 1914)
PASS: lldb-unit :: UnwindAssembly/x86/./UnwindAssemblyx86Tests/0/27 (457 of 1914)
PASS: lldb-api :: tools/lldb-vscode/attach/TestVSCode_attach.py (458 of 1914)
PASS: lldb-api :: commands/expression/import-std-module/basic/TestImportStdModule.py (459 of 1914)
PASS: lldb-shell :: SymbolFile/DWARF/x86/find-basic-type.cpp (460 of 1914)
UNSUPPORTED: lldb-shell :: Process/Windows/exception_access_violation.cpp (461 of 1914)
PASS: lldb-unit :: Process/Utility/./ProcessUtilityTests/5/16 (462 of 1914)
UNSUPPORTED: lldb-shell :: Unwind/basic-block-sections.test (463 of 1914)
PASS: lldb-unit :: Platform/./LLDBPlatformTests/14/16 (464 of 1914)
PASS: lldb-api :: functionalities/data-formatter/data-formatter-smart-array/TestDataFormatterSmartArray.py (465 of 1914)
PASS: lldb-unit :: Target/./TargetTests/18/19 (466 of 1914)
PASS: lldb-api :: iohandler/sigint/TestProcessIOHandlerInterrupt.py (467 of 1914)
PASS: lldb-api :: lang/cpp/namespace/TestNamespaceLookup.py (468 of 1914)
PASS: lldb-unit :: Interpreter/./InterpreterTests/4/14 (469 of 1914)
PASS: lldb-api :: python_api/class_members/TestSBTypeClassMembers.py (470 of 1914)
PASS: lldb-api :: functionalities/conditional_break/TestConditionalBreak.py (471 of 1914)
PASS: lldb-shell :: Driver/TestNoUseColor.test (472 of 1914)
PASS: lldb-api :: functionalities/thread/state_after_expression/TestStateAfterExpression.py (473 of 1914)
PASS: lldb-api :: functionalities/gdb_remote_client/TestThreadInfoTrailingComma.py (474 of 1914)
PASS: lldb-shell :: SymbolFile/DWARF/x86/dwarf5_locations.s (475 of 1914)
UNSUPPORTED: lldb-api :: lang/objc/foundation/TestFoundationDisassembly.py (476 of 1914)
PASS: lldb-shell :: ObjectFile/ELF/PT_TLS-overlap-PT_LOAD.yaml (477 of 1914)
PASS: lldb-api :: functionalities/thread/concurrent_events/TestConcurrentTwoBreakpointsOneSignal.py (478 of 1914)
PASS: lldb-shell :: SymbolFile/DWARF/x86/DW_OP_piece-smaller-than-struct.s (479 of 1914)
PASS: lldb-shell :: ObjectFile/ELF/netbsd-exec-8.99.30-amd64.yaml (480 of 1914)
PASS: lldb-api :: functionalities/load_using_paths/TestLoadUsingPaths.py (481 of 1914)
PASS: lldb-api :: lang/objc/warnings-in-expr-parser/TestObjCWarningsInExprParser.py (482 of 1914)
PASS: lldb-unit :: Language/CPlusPlus/./LanguageCPlusPlusTests/4/5 (483 of 1914)
PASS: lldb-unit :: Core/./LLDBCoreTests/18/23 (484 of 1914)
PASS: lldb-api :: macosx/find-app-in-bundle/TestFindAppInBundle.py (485 of 1914)
PASS: lldb-shell :: Register/Core/x86-64-netbsd-multithread.test (486 of 1914)
PASS: lldb-api :: python_api/module_section/TestModuleAndSection.py (487 of 1914)
PASS: lldb-unit :: Symbol/./SymbolTests/15/16 (488 of 1914)
PASS: lldb-api :: functionalities/limit-debug-info/TestLimitDebugInfo.py (489 of 1914)
PASS: lldb-api :: python_api/process/TestProcessAPI.py (490 of 1914)
UNSUPPORTED: lldb-api :: functionalities/breakpoint/breakpoint_in_delayslot/TestAvoidBreakpointInDelaySlot.py (491 of 1914)
PASS: lldb-api :: commands/watchpoints/multiple_hits/TestMultipleHits.py (492 of 1914)
PASS: lldb-api :: lang/cpp/incomplete-types/members/TestCppIncompleteTypeMembers.py (493 of 1914)
PASS: lldb-unit :: UnwindAssembly/x86/./UnwindAssemblyx86Tests/5/27 (494 of 1914)
UNSUPPORTED: lldb-shell :: ExecControl/StopHook/stop-hook-threads.test (495 of 1914)
PASS: lldb-unit :: SymbolFile/NativePDB/./SymbolFileNativePDBTests/11/15 (496 of 1914)
PASS: lldb-unit :: Symbol/./SymbolTests/5/16 (497 of 1914)
PASS: lldb-api :: lang/cpp/typeof/TestTypeOfDeclTypeExpr.py (498 of 1914)
PASS: lldb-shell :: lldb-server/TestGdbserverPort.test (499 of 1914)
PASS: lldb-api :: functionalities/thread/concurrent_events/TestConcurrentWatchpointWithDelayWatchpointThreads.py (500 of 1914)
PASS: lldb-unit :: Core/./LLDBCoreTests/21/23 (501 of 1914)
PASS: lldb-shell :: ScriptInterpreter/Python/command_import.test (502 of 1914)
PASS: lldb-api :: functionalities/thread/concurrent_events/TestConcurrentManyWatchpoints.py (503 of 1914)
PASS: lldb-api :: functionalities/gdb_remote_client/TestPlatformKill.py (504 of 1914)
PASS: lldb-api :: commands/expression/char/TestExprsChar.py (505 of 1914)
PASS: lldb-api :: functionalities/thread/concurrent_events/TestConcurrentWatchBreak.py (506 of 1914)
PASS: lldb-shell :: SymbolFile/DWARF/x86/debug_loc.s (507 of 1914)
PASS: lldb-api :: commands/expression/inline-namespace/TestInlineNamespace.py (508 of 1914)
PASS: lldb-unit :: Target/./TargetTests/15/19 (509 of 1914)
PASS: lldb-shell :: SymbolFile/DWARF/x86/DW_OP_deref_size_static_var.s (510 of 1914)
PASS: lldb-unit :: Utility/./UtilityTests/5/30 (511 of 1914)
UNSUPPORTED: lldb-shell :: BuildScript/toolchain-msvc.test (512 of 1914)
PASS: lldb-shell :: ScriptInterpreter/Python/Crashlog/no-args.test (513 of 1914)
PASS: lldb-api :: functionalities/process_crash_info/TestProcessCrashInfo.py (514 of 1914)
PASS: lldb-unit :: Signals/./SignalsTests/4/5 (515 of 1914)
PASS: lldb-api :: commands/target/basic/TestTargetCommand.py (516 of 1914)
PASS: lldb-api :: test_utils/TestDecorators.py (517 of 1914)
PASS: lldb-api :: python_api/watchpoint/watchlocation/TestSetWatchlocation.py (518 of 1914)
PASS: lldb-api :: lang/cpp/forward-declared-template-specialization/TestCppForwardDeclaredTemplateSpecialization.py (519 of 1914)
PASS: lldb-api :: functionalities/postmortem/minidump-new/TestMiniDumpUUID.py (520 of 1914)
PASS: lldb-shell :: Commands/command-breakpoint-col.test (521 of 1914)
PASS: lldb-api :: python_api/symbol-context/two-files/TestSymbolContextTwoFiles.py (522 of 1914)
PASS: lldb-api :: commands/expression/weak_symbols/TestWeakSymbols.py (523 of 1914)
PASS: lldb-unit :: ObjectFile/ELF/./ObjectFileELFTests/1/4 (524 of 1914)
PASS: lldb-unit :: SymbolFile/NativePDB/./SymbolFileNativePDBTests/7/15 (525 of 1914)
PASS: lldb-shell :: Settings/TestDisassemblyFormat.test (526 of 1914)
PASS: lldb-api :: functionalities/signal/raise/TestRaise.py (527 of 1914)
PASS: lldb-api :: python_api/sbtype_typeclass/TestSBTypeTypeClass.py (528 of 1914)
PASS: lldb-shell :: SymbolFile/Breakpad/unwind-via-raSearch.test (529 of 1914)
PASS: lldb-api :: commands/expression/test/TestExprs.py (530 of 1914)
PASS: lldb-shell :: Register/x86-64-write.test (531 of 1914)
PASS: lldb-api :: commands/expression/namespace_local_var_same_name_obj_c/TestNamespaceLocalVarSameNameObjC.py (532 of 1914)
PASS: lldb-unit :: Language/Highlighting/./HighlighterTests/11/29 (533 of 1914)
PASS: lldb-api :: functionalities/mtc/simple/TestMTCSimple.py (534 of 1914)
PASS: lldb-unit :: ScriptInterpreter/Python/./ScriptInterpreterPythonTests/7/19 (535 of 1914)
PASS: lldb-api :: functionalities/postmortem/elf-core/TestLinuxCore.py (536 of 1914)
PASS: lldb-api :: commands/expression/ignore-artificial-constructors/TestIgnoreArtificialConstructors.py (537 of 1914)
UNSUPPORTED: lldb-api :: functionalities/asan/TestReportData.py (538 of 1914)
UNSUPPORTED: lldb-api :: functionalities/ptrauth_diagnostics/brkC47x_x16_invalid/TestPtrauthBRKc47xX16Invalid.py (539 of 1914)
PASS: lldb-api :: tools/lldb-vscode/stop-hooks/TestVSCode_stop_hooks.py (540 of 1914)
PASS: lldb-unit :: ScriptInterpreter/Python/./ScriptInterpreterPythonTests/10/19 (541 of 1914)
UNSUPPORTED: lldb-shell :: ScriptInterpreter/Lua/fail_breakpoint_oneline.test (542 of 1914)
UNSUPPORTED: lldb-shell :: SymbolFile/DWARF/split-optimized.c (543 of 1914)
UNSUPPORTED: lldb-api :: tools/lldb-server/registers-target-xml-reading/TestGdbRemoteTargetXmlPacket.py (544 of 1914)
PASS: lldb-api :: python_api/sblaunchinfo/TestSBLaunchInfo.py (545 of 1914)
PASS: lldb-unit :: Language/Highlighting/./HighlighterTests/19/29 (546 of 1914)
PASS: lldb-api :: lang/cpp/dynamic-value/TestDynamicValue.py (547 of 1914)
PASS: lldb-unit :: DataFormatter/./LLDBFormatterTests/0/11 (548 of 1914)
PASS: lldb-unit :: debugserver/./debugserverTests/5/6 (549 of 1914)
UNSUPPORTED: lldb-api :: commands/trace/TestTraceDumpInstructions.py (550 of 1914)
PASS: lldb-shell :: Register/Core/x86-32-netbsd-addr.test (551 of 1914)
PASS: lldb-unit :: ScriptInterpreter/Python/./ScriptInterpreterPythonTests/6/19 (552 of 1914)
PASS: lldb-api :: commands/gui/invalid-args/TestInvalidArgsGui.py (553 of 1914)
UNSUPPORTED: lldb-shell :: Expr/TestIRMemoryMapWindows.test (554 of 1914)
PASS: lldb-api :: functionalities/gdb_remote_client/TestPartialGPacket.py (555 of 1914)
PASS: lldb-shell :: ObjectFile/ELF/null-jmprel.yaml (556 of 1914)
PASS: lldb-api :: lang/cpp/nsimport/TestCppNsImport.py (557 of 1914)
PASS: lldb-unit :: Expression/./ExpressionTests/0/22 (558 of 1914)
PASS: lldb-unit :: UnwindAssembly/x86/./UnwindAssemblyx86Tests/15/27 (559 of 1914)
PASS: lldb-api :: functionalities/multiword-commands/TestMultiWordCommands.py (560 of 1914)
UNSUPPORTED: lldb-api :: commands/trace/TestTraceSchema.py (561 of 1914)
PASS: lldb-api :: lang/cpp/char8_t/TestCxxChar8_t.py (562 of 1914)
PASS: lldb-api :: functionalities/data-formatter/compactvectors/TestCompactVectors.py (563 of 1914)
PASS: lldb-api :: functionalities/data-formatter/data-formatter-stl/generic/forward_list/TestDataFormatterGenericForwardList.py (564 of 1914)
PASS: lldb-api :: lang/objc/foundation/TestConstStrings.py (565 of 1914)
PASS: lldb-unit :: Process/gdb-remote/./ProcessGdbRemoteTests/0/19 (566 of 1914)
PASS: lldb-unit :: UnwindAssembly/x86/./UnwindAssemblyx86Tests/13/27 (567 of 1914)
PASS: lldb-unit :: UnwindAssembly/x86/./UnwindAssemblyx86Tests/9/27 (568 of 1914)
PASS: lldb-api :: functionalities/data-formatter/data-formatter-objc/cmtime/TestDataFormatterCMTime.py (569 of 1914)
PASS: lldb-unit :: SymbolFile/DWARF/./SymbolFileDWARFTests/28/29 (570 of 1914)
PASS: lldb-unit :: Expression/./ExpressionTests/10/22 (571 of 1914)
PASS: lldb-api :: functionalities/breakpoint/auto_continue/TestBreakpointAutoContinue.py (572 of 1914)
PASS: lldb-unit :: Symbol/./SymbolTests/11/16 (573 of 1914)
PASS: lldb-api :: functionalities/breakpoint/global_constructor/TestBreakpointInGlobalConstructor.py (574 of 1914)
PASS: lldb-api :: commands/disassemble/basic/TestFrameDisassemble.py (575 of 1914)
PASS: lldb-api :: lang/objc/objc-dyn-sbtype/TestObjCDynamicSBType.py (576 of 1914)
PASS: lldb-api :: python_api/findvalue_duplist/TestSBFrameFindValue.py (577 of 1914)
PASS: lldb-api :: functionalities/data-formatter/user-format-vs-summary/TestUserFormatVsSummary.py (578 of 1914)
PASS: lldb-shell :: ScriptInterpreter/Python/exit.test (579 of 1914)
PASS: lldb-api :: functionalities/data-formatter/data-formatter-stl/generic/unordered/TestDataFormatterGenericUnordered.py (580 of 1914)
PASS: lldb-shell :: ObjectFile/MachO/subsections.yaml (581 of 1914)
PASS: lldb-api :: functionalities/gdb_remote_client/TestGDBServerTargetXML.py (582 of 1914)
PASS: lldb-unit :: Core/./LLDBCoreTests/10/23 (583 of 1914)
PASS: lldb-unit :: UnwindAssembly/x86/./UnwindAssemblyx86Tests/18/27 (584 of 1914)
PASS: lldb-unit :: Utility/./UtilityTests/17/30 (585 of 1914)
PASS: lldb-shell :: Commands/CommandScriptImmediateOutput/CommandScriptImmediateOutputFile.test (586 of 1914)
PASS: lldb-api :: functionalities/avoids-fd-leak/TestFdLeak.py (587 of 1914)
PASS: lldb-unit :: Utility/./UtilityTests/28/30 (588 of 1914)
PASS: lldb-api :: types/TestLongTypes.py (589 of 1914)
PASS: lldb-api :: functionalities/load_lazy/TestLoadUsingLazyBind.py (590 of 1914)
PASS: lldb-api :: functionalities/unwind/zeroth_frame/TestZerothFrame.py (591 of 1914)
PASS: lldb-shell :: SymbolFile/DWARF/x86/dwarf5-implicit-const.s (592 of 1914)
PASS: lldb-api :: functionalities/data-formatter/data-formatter-stl/generic/list/loop/TestDataFormatterGenericListLoop.py (593 of 1914)
XFAIL: lldb-api :: macosx/macCatalystAppMacOSFramework/TestMacCatalystAppWithMacOSFramework.py (594 of 1914)
PASS: lldb-unit :: Utility/./UtilityTests/24/30 (595 of 1914)
PASS: lldb-api :: lang/cpp/structured-binding/TestStructuredBinding.py (596 of 1914)
PASS: lldb-api :: lang/cpp/static_member_type_depending_on_parent_size/TestStaticMemberTypeDependingOnParentSize.py (597 of 1914)
PASS: lldb-api :: types/TestCharTypeExpr.py (598 of 1914)
UNSUPPORTED: lldb-api :: functionalities/postmortem/FreeBSDKernel/TestFreeBSDKernelLive.py (599 of 1914)
PASS: lldb-api :: functionalities/thread/concurrent_events/TestConcurrentTwoWatchpointsOneSignal.py (600 of 1914)
PASS: lldb-unit :: ScriptInterpreter/Python/./ScriptInterpreterPythonTests/14/19 (601 of 1914)
PASS: lldb-shell :: Process/TestEnvironment.test (602 of 1914)
PASS: lldb-api :: commands/expression/import-std-module/unique_ptr/TestUniquePtrFromStdModule.py (603 of 1914)
PASS: lldb-shell :: ObjectFile/Breakpad/sections.test (604 of 1914)
PASS: lldb-api :: functionalities/thread/concurrent_events/TestConcurrentDelayedCrashWithBreakpointSignal.py (605 of 1914)
PASS: lldb-api :: lang/c/shared_lib_stripped_symbols/TestSharedLibStrippedSymbols.py (606 of 1914)
PASS: lldb-api :: commands/expression/import-std-module/forward_decl_from_module/TestForwardDeclFromStdModule.py (607 of 1914)
PASS: lldb-shell :: SymbolFile/DWARF/x86/debug-types-dwo-cross-reference.cpp (608 of 1914)
PASS: lldb-shell :: SymbolFile/Breakpad/line-table-edgecases.test (609 of 1914)
PASS: lldb-api :: functionalities/data-formatter/pyobjsynthprovider/TestPyObjSynthProvider.py (610 of 1914)
PASS: lldb-unit :: SymbolFile/DWARF/./SymbolFileDWARFTests/6/29 (611 of 1914)
PASS: lldb-api :: commands/expression/import-std-module/vector-of-vectors/TestVectorOfVectorsFromStdModule.py (612 of 1914)
PASS: lldb-shell :: SymbolFile/DWARF/x86/dwp-debug-types.s (613 of 1914)
UNSUPPORTED: lldb-api :: tools/lldb-server/TestNonStop.py (614 of 1914)
PASS: lldb-shell :: Register/x86-64-ymm-read.test (615 of 1914)
PASS: lldb-shell :: Register/Core/x86-32-freebsd-fp.test (616 of 1914)
PASS: lldb-api :: commands/process/attach-resume/TestAttachResume.py (617 of 1914)
UNSUPPORTED: lldb-shell :: SymbolFile/dissassemble-entry-point.s (618 of 1914)
PASS: lldb-shell :: SymbolFile/DWARF/x86/find-qualified-variable.cpp (619 of 1914)
UNSUPPORTED: lldb-shell :: SymbolFile/PDB/variables-locations.test (620 of 1914)
PASS: lldb-shell :: SymbolFile/DWARF/x86/find-function-regex.cpp (621 of 1914)
PASS: lldb-unit :: SymbolFile/NativePDB/./SymbolFileNativePDBTests/3/15 (622 of 1914)
XFAIL: lldb-shell :: Register/x86-fp-write.test (623 of 1914)
PASS: lldb-unit :: ObjectFile/Breakpad/./ObjectFileBreakpadTests/0/11 (624 of 1914)
PASS: lldb-api :: lang/objc/objc-new-syntax/TestObjCNewSyntaxLiteral.py (625 of 1914)
PASS: lldb-shell :: ObjectFile/ELF/compressed-sections.yaml (626 of 1914)
UNSUPPORTED: lldb-shell :: SymbolFile/PDB/function-level-linking.test (627 of 1914)
PASS: lldb-api :: commands/breakpoint/command/list/TestBreakpointCommandList.py (628 of 1914)
PASS: lldb-shell :: SymbolFile/NativePDB/inline_sites.test (629 of 1914)
PASS: lldb-shell :: Breakpoint/debug_rnglist_rlestartend.test (630 of 1914)
PASS: lldb-api :: lang/objc/objc-runtime-ivars/TestRuntimeIvars.py (631 of 1914)
PASS: lldb-api :: lang/objc/objc-new-syntax/TestObjCNewSyntaxArray.py (632 of 1914)
PASS: lldb-api :: functionalities/thread/concurrent_events/TestConcurrentDelayedCrashWithBreakpointWatchpoint.py (633 of 1914)
PASS: lldb-api :: functionalities/data-formatter/data-formatter-objc/TestDataFormatterObjCKVO.py (634 of 1914)
PASS: lldb-shell :: Recognizer/assert.test (635 of 1914)
PASS: lldb-api :: lang/c/strings/TestCStrings.py (636 of 1914)
PASS: lldb-api :: commands/frame/diagnose/bad-reference/TestBadReference.py (637 of 1914)
PASS: lldb-unit :: Host/./HostTests/14/19 (638 of 1914)
PASS: lldb-api :: functionalities/pointer_num_children/TestPointerNumChildren.py (639 of 1914)
PASS: lldb-api :: functionalities/module_cache/universal/TestModuleCacheUniversal.py (640 of 1914)
PASS: lldb-api :: lang/cpp/wchar_t/TestCxxWCharT.py (641 of 1914)
PASS: lldb-api :: lang/cpp/operators/TestCppOperators.py (642 of 1914)
PASS: lldb-shell :: Breakpoint/dummy-target.test (643 of 1914)
PASS: lldb-api :: python_api/sbvalue_const_addrof/TestSBValueConstAddrOf.py (644 of 1914)
PASS: lldb-shell :: SymbolFile/DWARF/x86/debug_loclists-dwo.s (645 of 1914)
PASS: lldb-unit :: Language/Highlighting/./HighlighterTests/1/29 (646 of 1914)
UNSUPPORTED: lldb-shell :: Register/x86-64-ymm16-read.test (647 of 1914)
UNSUPPORTED: lldb-shell :: Subprocess/clone-follow-parent-softbp.test (648 of 1914)
PASS: lldb-unit :: Utility/./UtilityTests/10/30 (649 of 1914)
PASS: lldb-unit :: Platform/Android/./AdbClientTests/1/2 (650 of 1914)
PASS: lldb-shell :: SymbolFile/NativePDB/missing-type.s (651 of 1914)
PASS: lldb-unit :: ObjectFile/Breakpad/./ObjectFileBreakpadTests/9/11 (652 of 1914)
PASS: lldb-api :: functionalities/postmortem/mach-core/TestMachCore.py (653 of 1914)
PASS: lldb-api :: functionalities/data-formatter/data-formatter-stl/libcxx/unordered_map/TestDataFormatterLibccUnorderedMap.py (654 of 1914)
UNSUPPORTED: lldb-shell :: SymbolFile/PDB/pointers.test (655 of 1914)
UNSUPPORTED: lldb-shell :: BuildScript/toolchain-clang-cl.test (656 of 1914)
PASS: lldb-api :: lang/cpp/complete-type-check/TestCppIsTypeComplete.py (657 of 1914)
PASS: lldb-api :: python_api/lldbutil/iter/TestLLDBIterator.py (658 of 1914)
XFAIL: lldb-shell :: Register/x86-64-fp-write.test (659 of 1914)
PASS: lldb-api :: python_api/watchpoint/watchlocation/TestTargetWatchAddress.py (660 of 1914)
PASS: lldb-unit :: Signals/./SignalsTests/2/5 (661 of 1914)
UNSUPPORTED: lldb-shell :: SymbolFile/DWARF/x86/DW_TAG_variable-DW_AT_decl_file-DW_AT_abstract_origin-crosscu1.s (662 of 1914)
PASS: lldb-api :: functionalities/breakpoint/breakpoint_locations/TestBreakpointLocations.py (663 of 1914)
PASS: lldb-api :: lang/cpp/keywords_enabled/TestCppKeywordsEnabled.py (664 of 1914)
PASS: lldb-shell :: SymbolFile/NativePDB/break-by-function.cpp (665 of 1914)
PASS: lldb-unit :: Expression/./ExpressionTests/3/22 (666 of 1914)
PASS: lldb-api :: functionalities/breakpoint/move_nearest/TestMoveNearest.py (667 of 1914)
UNSUPPORTED: lldb-api :: tools/lldb-server/vCont-threads/TestSignal.py (668 of 1914)
PASS: lldb-api :: functionalities/thread/concurrent_events/TestConcurrentCrashWithSignal.py (669 of 1914)
PASS: lldb-shell :: Minidump/no-process-id.yaml (670 of 1914)
PASS: lldb-api :: lang/cpp/lambdas/TestLambdas.py (671 of 1914)
PASS: lldb-api :: functionalities/data-formatter/data-formatter-synthval/TestDataFormatterSynthVal.py (672 of 1914)
PASS: lldb-shell :: Subprocess/fork-follow-parent.test (673 of 1914)
PASS: lldb-api :: types/TestFloatTypesExpr.py (674 of 1914)
UNSUPPORTED: lldb-api :: lang/cpp/limit-debug-info/TestWithLimitDebugInfo.py (675 of 1914)
UNSUPPORTED: lldb-api :: macosx/posix_spawn/TestLaunchProcessPosixSpawn.py (676 of 1914)
PASS: lldb-shell :: lldb-server/TestErrorMessages.test (677 of 1914)
PASS: lldb-api :: commands/help/TestHelp.py (678 of 1914)
PASS: lldb-shell :: Symtab/symtab-regex-mangled.test (679 of 1914)
PASS: lldb-shell :: SymbolFile/DWARF/x86/debug-types-basic.test (680 of 1914)
PASS: lldb-api :: functionalities/gdb_remote_client/TestGdbClientModuleLoad.py (681 of 1914)
PASS: lldb-shell :: SymbolFile/DWARF/x86/dwarf5-split.s (682 of 1914)
XFAIL: lldb-shell :: ObjectFile/PECOFF/default-triple-windows-gnu.yaml (683 of 1914)
PASS: lldb-api :: lang/cpp/exceptions/TestCPPExceptionBreakpoints.py (684 of 1914)
UNSUPPORTED: lldb-shell :: Register/x86-gp-write.test (685 of 1914)
PASS: lldb-unit :: Core/./LLDBCoreTests/12/23 (686 of 1914)
PASS: lldb-api :: commands/expression/invalid-args/TestInvalidArgsExpression.py (687 of 1914)
PASS: lldb-unit :: Process/Utility/./ProcessUtilityTests/9/16 (688 of 1914)
PASS: lldb-shell :: Breakpoint/split-dwarf5-debug-stroffsets.test (689 of 1914)
PASS: lldb-shell :: SymbolFile/DWARF/x86/module-ownership.mm (690 of 1914)
PASS: lldb-unit :: Signals/./SignalsTests/0/5 (691 of 1914)
PASS: lldb-api :: lang/c/enum_types/TestEnumTypes.py (692 of 1914)
PASS: lldb-api :: tools/lldb-server/TestGdbRemoteHostInfo.py (693 of 1914)
UNSUPPORTED: lldb-api :: benchmarks/frame_variable/TestFrameVariableResponse.py (694 of 1914)
PASS: lldb-api :: api/command-return-object/TestSBCommandReturnObject.py (695 of 1914)
PASS: lldb-shell :: SymbolFile/DWARF/x86/find-basic-variable.cpp (696 of 1914)
UNSUPPORTED: lldb-shell :: ScriptInterpreter/Lua/print.test (697 of 1914)
PASS: lldb-unit :: Expression/./ExpressionTests/2/22 (698 of 1914)
PASS: lldb-api :: functionalities/gdb_remote_client/TestRecognizeBreakpoint.py (699 of 1914)
PASS: lldb-api :: python_api/sbenvironment/TestSBEnvironment.py (700 of 1914)
PASS: lldb-shell :: ScriptInterpreter/None/import_module.test (701 of 1914)
PASS: lldb-shell :: Breakpoint/split-dwarf-5-addrbase.test (702 of 1914)
PASS: lldb-shell :: Register/x86-64-ymm-write.test (703 of 1914)
PASS: lldb-api :: lang/cpp/extern_c/TestExternCSymbols.py (704 of 1914)
PASS: lldb-shell :: SymbolFile/NativePDB/ast-functions.cpp (705 of 1914)
PASS: lldb-unit :: Utility/./UtilityTests/4/30 (706 of 1914)
PASS: lldb-api :: types/TestShortTypeExpr.py (707 of 1914)
PASS: lldb-api :: functionalities/signal/handle-abrt/TestHandleAbort.py (708 of 1914)
PASS: lldb-api :: functionalities/scripted_process/TestScriptedProcess.py (709 of 1914)
PASS: lldb-unit :: Utility/./UtilityTests/13/30 (710 of 1914)
PASS: lldb-api :: commands/frame/select/TestFrameSelect.py (711 of 1914)
PASS: lldb-unit :: Interpreter/./InterpreterTests/1/14 (712 of 1914)
PASS: lldb-unit :: Utility/./UtilityTests/7/30 (713 of 1914)
PASS: lldb-api :: tools/lldb-vscode/console/TestVSCode_console.py (714 of 1914)
PASS: lldb-api :: lang/objc/unicode-string/TestUnicodeString.py (715 of 1914)
UNSUPPORTED: lldb-api :: commands/expression/import-std-module/stack/TestStackFromStdModule.py (716 of 1914)
PASS: lldb-unit :: Host/./HostTests/16/19 (717 of 1914)
PASS: lldb-shell :: SymbolFile/symbol-binding.test (718 of 1914)
PASS: lldb-api :: lang/objc/foundation/TestObjCMethods.py (719 of 1914)
PASS: lldb-shell :: SymbolFile/DWARF/x86/parallel-indexing-stress.s (720 of 1914)
PASS: lldb-api :: commands/disassemble/basic/TestDisassembleBreakpoint.py (721 of 1914)
UNSUPPORTED: lldb-shell :: ScriptInterpreter/Lua/breakpoint_function_callback.test (722 of 1914)
PASS: lldb-api :: terminal/TestSTTYBeforeAndAfter.py (723 of 1914)
PASS: lldb-api :: functionalities/tail_call_frames/disambiguate_paths_to_common_sink/TestDisambiguatePathsToCommonSink.py (724 of 1914)
PASS: lldb-api :: lang/c/stepping/TestThreadStepInAvoidRegexp.py (725 of 1914)
PASS: lldb-shell :: Breakpoint/debug_rnglist_offset_pair.test (726 of 1914)
PASS: lldb-api :: functionalities/thread/step_out/TestThreadStepOut.py (727 of 1914)
PASS: lldb-api :: python_api/interpreter/TestCommandInterpreterAPI.py (728 of 1914)
PASS: lldb-api :: functionalities/postmortem/minidump/TestMiniDump.py (729 of 1914)
PASS: lldb-unit :: UnwindAssembly/x86/./UnwindAssemblyx86Tests/17/27 (730 of 1914)
PASS: lldb-api :: commands/expression/fixits/TestFixIts.py (731 of 1914)
PASS: lldb-api :: commands/watchpoints/watchpoint_commands/condition/TestWatchpointConditionCmd.py (732 of 1914)
PASS: lldb-unit :: SymbolFile/DWARF/./SymbolFileDWARFTests/17/29 (733 of 1914)
PASS: lldb-api :: lang/objc/objc-ivar-stripped/TestObjCIvarStripped.py (734 of 1914)
PASS: lldb-api :: lang/cpp/gmodules-templates/TestGModules.py (735 of 1914)
PASS: lldb-api :: lang/objc/objc-class-method/TestObjCClassMethod.py (736 of 1914)
PASS: lldb-unit :: ScriptInterpreter/Python/./ScriptInterpreterPythonTests/17/19 (737 of 1914)
UNSUPPORTED: lldb-api :: lang/objcxx/cxx-bridged-po/TestObjCXXBridgedPO.py (738 of 1914)
UNSUPPORTED: lldb-shell :: ScriptInterpreter/Lua/breakpoint_oneline_callback.test (739 of 1914)
PASS: lldb-api :: python_api/default-constructor/TestDefaultConstructorForAPIObjects.py (740 of 1914)
PASS: lldb-api :: functionalities/data-formatter/data-formatter-objc/TestDataFormatterObjCCF.py (741 of 1914)
PASS: lldb-api :: functionalities/breakpoint/breakpoint_conditions/TestBreakpointConditions.py (742 of 1914)
PASS: lldb-api :: functionalities/thread/concurrent_events/TestConcurrentTwoBreakpointThreads.py (743 of 1914)
PASS: lldb-unit :: Process/Utility/./ProcessUtilityTests/4/16 (744 of 1914)
PASS: lldb-shell :: SymbolFile/DWARF/x86/inline-function-address-shared.test (745 of 1914)
PASS: lldb-shell :: SymbolFile/DWARF/x86/DW_TAG_variable-invalid_location.s (746 of 1914)
PASS: lldb-shell :: SymbolFile/DWARF/x86/DW_AT_location-DW_AT_const_value.s (747 of 1914)
PASS: lldb-api :: lang/cpp/this_class_type_mixing/TestThisClassTypeMixing.py (748 of 1914)
PASS: lldb-api :: lang/cpp/class_static/TestStaticVariables.py (749 of 1914)
PASS: lldb-api :: commands/target/auto-install-main-executable/TestAutoInstallMainExecutable.py (750 of 1914)
PASS: lldb-unit :: ObjectFile/Breakpad/./ObjectFileBreakpadTests/2/11 (751 of 1914)
PASS: lldb-api :: commands/platform/sdk/TestPlatformSDK.py (752 of 1914)
PASS: lldb-unit :: Language/Highlighting/./HighlighterTests/0/29 (753 of 1914)
PASS: lldb-api :: commands/statistics/basic/TestStats.py (754 of 1914)
PASS: lldb-api :: lang/c/inlines/TestRedefinitionsInInlines.py (755 of 1914)
UNSUPPORTED: lldb-api :: functionalities/breakpoint/hardware_breakpoints/hardware_breakpoint_on_multiple_threads/TestHWBreakMultiThread.py (756 of 1914)
PASS: lldb-shell :: Breakpoint/jit-loader_rtdyld_elf.test (757 of 1914)
PASS: lldb-api :: functionalities/data-formatter/vector-types/TestVectorTypesFormatting.py (758 of 1914)
PASS: lldb-shell :: Quit/TestQuitExitCodeNonInt.test (759 of 1914)
PASS: lldb-shell :: Register/x86-64-gp-read.test (760 of 1914)
UNSUPPORTED: lldb-api :: commands/platform/connect/TestPlatformConnect.py (761 of 1914)
PASS: lldb-shell :: ScriptInterpreter/Python/scripted_breakpoint_lua.test (762 of 1914)
PASS: lldb-shell :: Driver/TestHelp.test (763 of 1914)
PASS: lldb-api :: functionalities/step_scripted/TestStepScripted.py (764 of 1914)
PASS: lldb-api :: functionalities/data-formatter/nssetsynth/TestNSSetSynthetic.py (765 of 1914)
PASS: lldb-unit :: SymbolFile/NativePDB/./SymbolFileNativePDBTests/12/15 (766 of 1914)
PASS: lldb-api :: commands/settings/use_source_cache/TestUseSourceCache.py (767 of 1914)
PASS: lldb-unit :: Target/./TargetTests/2/19 (768 of 1914)
UNSUPPORTED: lldb-shell :: SymbolFile/target-symbols-add-unwind.test (769 of 1914)
PASS: lldb-shell :: Settings/TestLineMarkerColor.test (770 of 1914)
PASS: lldb-api :: test_utils/TestInlineTest.py (771 of 1914)
PASS: lldb-api :: functionalities/thread/concurrent_events/TestConcurrentSignalDelayBreak.py (772 of 1914)
UNSUPPORTED: lldb-api :: linux/thread/create_during_instruction_step/TestCreateDuringInstructionStep.py (773 of 1914)
UNSUPPORTED: lldb-api :: functionalities/progress_reporting/TestTrimmedProgressReporting.py (774 of 1914)
PASS: lldb-shell :: SymbolFile/NativePDB/s_constant.cpp (775 of 1914)
PASS: lldb-api :: lang/cpp/global_operators/TestCppGlobalOperators.py (776 of 1914)
UNSUPPORTED: lldb-shell :: SymbolFile/PDB/compilands.test (777 of 1914)
PASS: lldb-api :: lang/cpp/enum_types/TestCPP11EnumTypes.py (778 of 1914)
PASS: lldb-shell :: Reproducer/Modules/TestModuleCXX.test (779 of 1914)
UNSUPPORTED: lldb-shell :: SymbolFile/PDB/typedefs.test (780 of 1914)
PASS: lldb-api :: lang/cpp/thread_local/TestThreadLocal.py (781 of 1914)
PASS: lldb-api :: functionalities/breakpoint/break_in_loaded_dylib/TestBreakInLoadedDylib.py (782 of 1914)
PASS: lldb-shell :: ObjectFile/PECOFF/basic-info-arm64.yaml (783 of 1914)
PASS: lldb-unit :: Utility/./UtilityTests/26/30 (784 of 1914)
PASS: lldb-unit :: ObjectFile/Breakpad/./ObjectFileBreakpadTests/6/11 (785 of 1914)
PASS: lldb-api :: lang/c/modules/TestCModules.py (786 of 1914)
PASS: lldb-api :: python_api/value/change_values/TestChangeValueAPI.py (787 of 1914)
PASS: lldb-api :: functionalities/backticks/TestBackticksWithoutATarget.py (788 of 1914)
PASS: lldb-shell :: Process/UnsupportedLanguage.test (789 of 1914)
PASS: lldb-unit :: ObjectFile/Breakpad/./ObjectFileBreakpadTests/3/11 (790 of 1914)
PASS: lldb-api :: tools/lldb-server/TestGdbRemoteExpeditedRegisters.py (791 of 1914)
PASS: lldb-api :: functionalities/breakpoint/two_hits_one_actual/TestTwoHitsOneActual.py (792 of 1914)
PASS: lldb-api :: lang/cpp/template-specialization-type/TestTemplateSpecializationType.py (793 of 1914)
PASS: lldb-api :: lang/cpp/template-arguments/TestCppTemplateArguments.py (794 of 1914)
PASS: lldb-api :: commands/expression/import-std-module/list/TestListFromStdModule.py (795 of 1914)
PASS: lldb-shell :: Reproducer/TestWorkingDir.test (796 of 1914)
PASS: lldb-shell :: Commands/command-image-lookup.yaml (797 of 1914)
PASS: lldb-api :: lang/objc/objc-new-syntax/TestObjCNewSyntaxDictionary.py (798 of 1914)
UNSUPPORTED: lldb-api :: functionalities/thread/concurrent_events/exit/TestConcurrentThreadExit.py (799 of 1914)
UNSUPPORTED: lldb-api :: linux/mix-dwo-and-regular-objects/TestMixedDwarfBinary.py (800 of 1914)
PASS: lldb-unit :: UnwindAssembly/x86/./UnwindAssemblyx86Tests/2/27 (801 of 1914)
PASS: lldb-api :: lang/cpp/const_static_integral_member/TestConstStaticIntegralMember.py (802 of 1914)
PASS: lldb-shell :: ScriptInterpreter/Python/Crashlog/json.test (803 of 1914)
PASS: lldb-shell :: Register/Core/x86-32-linux-multithread.test (804 of 1914)
UNSUPPORTED: lldb-api :: functionalities/disassemble/aarch64-adrp-add/TestAArch64AdrpAdd.py (805 of 1914)
PASS: lldb-api :: functionalities/data-formatter/data-formatter-objc/nsindexpath/TestDataFormatterNSIndexPath.py (806 of 1914)
PASS: lldb-api :: lang/cpp/char1632_t/TestChar1632T.py (807 of 1914)
PASS: lldb-unit :: Expression/./ExpressionTests/4/22 (808 of 1914)
PASS: lldb-shell :: SymbolFile/DWARF/clang-ast-from-dwarf-objc-property.m (809 of 1914)
PASS: lldb-api :: test_utils/TestPExpectTest.py (810 of 1914)
PASS: lldb-unit :: ScriptInterpreter/Python/./ScriptInterpreterPythonTests/11/19 (811 of 1914)
PASS: lldb-shell :: Quit/TestQuitExitCodeHex0.test (812 of 1914)
PASS: lldb-api :: functionalities/gdb_remote_client/TestGDBServerNoTargetXML.py (813 of 1914)
PASS: lldb-shell :: Expr/TestMultilineExpr.test (814 of 1914)
PASS: lldb-shell :: SymbolFile/DWARF/x86/subprogram_ranges.test (815 of 1914)
PASS: lldb-shell :: Register/Core/x86-32-freebsd-addr.test (816 of 1914)
PASS: lldb-api :: lang/cpp/incomplete-types/TestCppIncompleteTypes.py (817 of 1914)
PASS: lldb-api :: commands/apropos/basic/TestApropos.py (818 of 1914)
UNSUPPORTED: lldb-shell :: Subprocess/fork-follow-child.test (819 of 1914)
UNSUPPORTED: lldb-shell :: ScriptInterpreter/Lua/independent_state.test (820 of 1914)
PASS: lldb-shell :: Register/Core/x86-64-freebsd-fp.test (821 of 1914)
PASS: lldb-api :: functionalities/data-formatter/data-formatter-stl/libcxx/unique_ptr/TestDataFormatterLibcxxUniquePtr.py (822 of 1914)
PASS: lldb-shell :: SymbolFile/NativePDB/lookup-by-address.cpp (823 of 1914)
UNSUPPORTED: lldb-shell :: Unwind/eh-frame-augment-noop.test (824 of 1914)
UNSUPPORTED: lldb-shell :: Reproducer/TestLuaImport.test (825 of 1914)
PASS: lldb-api :: lang/objcxx/hide-runtime-values/TestObjCXXHideRuntimeValues.py (826 of 1914)
UNSUPPORTED: lldb-api :: macosx/corefile-default-ptrauth/TestCorefileDefaultPtrauth.py (827 of 1914)
PASS: lldb-shell :: Commands/command-thread-select.test (828 of 1914)
PASS: lldb-api :: tools/lldb-server/TestGdbRemoteKill.py (829 of 1914)
PASS: lldb-api :: macosx/safe-to-func-call/TestSafeFuncCalls.py (830 of 1914)
PASS: lldb-api :: commands/expression/import-std-module/iterator/TestIteratorFromStdModule.py (831 of 1914)
PASS: lldb-api :: lang/objcxx/class-name-clash/TestNameClash.py (832 of 1914)
PASS: lldb-api :: commands/frame/language/TestGuessLanguage.py (833 of 1914)
PASS: lldb-api :: source-manager/TestSourceManager.py (834 of 1914)
PASS: lldb-unit :: Expression/./ExpressionTests/1/22 (835 of 1914)
PASS: lldb-api :: lang/cpp/namespace/TestNamespace.py (836 of 1914)
UNSUPPORTED: lldb-api :: linux/sepdebugsymlink/TestTargetSymbolsSepDebugSymlink.py (837 of 1914)
UNSUPPORTED: lldb-api :: functionalities/unwind/aarch64_unwind_pac/TestAArch64UnwindPAC.py (838 of 1914)
PASS: lldb-unit :: Expression/./ExpressionTests/16/22 (839 of 1914)
PASS: lldb-unit :: Expression/./ExpressionTests/18/22 (840 of 1914)
PASS: lldb-api :: functionalities/gdb_remote_client/TestWriteMemory.py (841 of 1914)
PASS: lldb-unit :: UnwindAssembly/x86/./UnwindAssemblyx86Tests/25/27 (842 of 1914)
PASS: lldb-shell :: Subprocess/fork-follow-parent-wp.test (843 of 1914)
PASS: lldb-unit :: SymbolFile/DWARF/./SymbolFileDWARFTests/22/29 (844 of 1914)
PASS: lldb-shell :: ObjectFile/PECOFF/section-types.yaml (845 of 1914)
PASS: lldb-api :: python_api/sbstructureddata/TestStructuredDataAPI.py (846 of 1914)
PASS: lldb-shell :: ObjectFile/ELF/minidebuginfo-corrupt-xz.yaml (847 of 1914)
PASS: lldb-api :: functionalities/gdb_remote_client/TestProcessConnect.py (848 of 1914)
PASS: lldb-api :: functionalities/gdb_remote_client/TestRemoteRegNums.py (849 of 1914)
UNSUPPORTED: lldb-shell :: Subprocess/vfork-follow-child-wp.test (850 of 1914)
PASS: lldb-api :: functionalities/thread/step_until/TestStepUntil.py (851 of 1914)
PASS: lldb-api :: functionalities/breakpoint/breakpoint_names/TestBreakpointNames.py (852 of 1914)
UNSUPPORTED: lldb-api :: benchmarks/libcxxmap/TestBenchmarkLibcxxMap.py (853 of 1914)
PASS: lldb-shell :: Minidump/breakpad-symbols.test (854 of 1914)
PASS: lldb-api :: lang/objc/exceptions/TestObjCExceptions.py (855 of 1914)
PASS: lldb-shell :: SymbolFile/DWARF/x86/debug_rnglists-dwo.s (856 of 1914)
PASS: lldb-api :: commands/command/script/TestCommandScript.py (857 of 1914)
PASS: lldb-api :: python_api/exprpath_synthetic/TestExprPathSynthetic.py (858 of 1914)
PASS: lldb-shell :: SymbolFile/OnDemand/source-breakpoint.test (859 of 1914)
PASS: lldb-shell :: SymbolFile/DWARF/x86/find-method.cpp (860 of 1914)
UNSUPPORTED: lldb-shell :: SymbolFile/NativePDB/local-variables.cpp (861 of 1914)
UNSUPPORTED: lldb-shell :: Subprocess/clone-follow-parent-wp.test (862 of 1914)
PASS: lldb-api :: functionalities/gdb_remote_client/TestJLink6Armv7RegisterDefinition.py (863 of 1914)
PASS: lldb-unit :: Core/./LLDBCoreTests/4/23 (864 of 1914)
UNSUPPORTED: lldb-api :: benchmarks/expression/TestRepeatedExprs.py (865 of 1914)
PASS: lldb-shell :: Reproducer/TestPythonImport.test (866 of 1914)
PASS: lldb-unit :: Process/gdb-remote/./ProcessGdbRemoteTests/12/19 (867 of 1914)
PASS: lldb-unit :: Utility/./UtilityTests/29/30 (868 of 1914)
PASS: lldb-unit :: Platform/./LLDBPlatformTests/6/16 (869 of 1914)
PASS: lldb-shell :: ObjectFile/MachO/symtab.yaml (870 of 1914)
PASS: lldb-api :: macosx/skinny-corefile/TestSkinnyCorefile.py (871 of 1914)
PASS: lldb-api :: functionalities/plugins/python_os_plugin/stepping_plugin_threads/TestOSPluginStepping.py (872 of 1914)
PASS: lldb-api :: commands/target/stop-hook/disable/TestTargetStopHookDisable.py (873 of 1914)
PASS: lldb-api :: functionalities/data-formatter/ostypeformatting/TestFormattersOsType.py (874 of 1914)
UNSUPPORTED: lldb-api :: functionalities/unwind/ehframe/TestEhFrameUnwind.py (875 of 1914)
PASS: lldb-shell :: Subprocess/vfork-follow-parent.test (876 of 1914)
PASS: lldb-api :: functionalities/postmortem/minidump-new/TestMiniDumpNew.py (877 of 1914)
UNSUPPORTED: lldb-api :: commands/trace/TestTraceEvents.py (878 of 1914)
UNSUPPORTED: lldb-api :: benchmarks/stepping/TestSteppingSpeed.py (879 of 1914)
PASS: lldb-unit :: Language/Highlighting/./HighlighterTests/13/29 (880 of 1914)
PASS: lldb-unit :: ScriptInterpreter/Python/./ScriptInterpreterPythonTests/18/19 (881 of 1914)
PASS: lldb-api :: commands/expression/options/TestExprOptions.py (882 of 1914)
PASS: lldb-api :: tools/lldb-server/TestAppleSimulatorOSType.py (883 of 1914)
PASS: lldb-unit :: debugserver/./debugserverTests/2/6 (884 of 1914)
PASS: lldb-api :: driver/job_control/TestJobControl.py (885 of 1914)
PASS: lldb-api :: lang/cpp/subst_template_type_param/TestSubstTemplateTypeParam.py (886 of 1914)
PASS: lldb-api :: lang/c/function_types/TestFunctionTypes.py (887 of 1914)
PASS: lldb-api :: functionalities/unwind/noreturn/module-end/TestNoReturnModuleEnd.py (888 of 1914)
PASS: lldb-api :: functionalities/data-formatter/data-formatter-stl/libcxx/tuple/TestDataFormatterLibcxxTuple.py (889 of 1914)
PASS: lldb-shell :: SymbolFile/Breakpad/unwind-via-stack-win-no-memory-info.yaml (890 of 1914)
PASS: lldb-api :: commands/expression/formatters/TestFormatters.py (891 of 1914)
PASS: lldb-unit :: Target/./TargetTests/0/19 (892 of 1914)
PASS: lldb-api :: lang/objc/objc-ivar-protocols/TestIvarProtocols.py (893 of 1914)
PASS: lldb-api :: types/TestRecursiveTypes.py (894 of 1914)
PASS: lldb-shell :: Register/Core/x86-64-linux-addr.test (895 of 1914)
PASS: lldb-shell :: ObjectFile/wasm/stripped-debug-sections.yaml (896 of 1914)
PASS: lldb-shell :: Settings/TestFrameFormatColor.test (897 of 1914)
PASS: lldb-unit :: Editline/./EditlineTests/0/2 (898 of 1914)
PASS: lldb-unit :: debugserver/./debugserverTests/0/6 (899 of 1914)
PASS: lldb-api :: functionalities/load_unload/TestLoadUnload.py (900 of 1914)
PASS: lldb-api :: macosx/function-starts/TestFunctionStarts.py (901 of 1914)
PASS: lldb-unit :: Utility/./UtilityTests/0/30 (902 of 1914)
UNSUPPORTED: lldb-api :: functionalities/data-formatter/data-formatter-stl/libstdcpp/iterator/TestDataFormatterStdIterator.py (903 of 1914)
PASS: lldb-unit :: Utility/./UtilityTests/8/30 (904 of 1914)
PASS: lldb-unit :: Process/./ProcessEventDataTests/0/2 (905 of 1914)
PASS: lldb-api :: lang/c/global_variables/TestGlobalVariables.py (906 of 1914)
UNSUPPORTED: lldb-api :: iohandler/sigint/TestIOHandlerPythonREPLSigint.py (907 of 1914)
PASS: lldb-shell :: Settings/TestStopCommandSourceOnError.test (908 of 1914)
PASS: lldb-unit :: Symbol/./SymbolTests/4/16 (909 of 1914)
XFAIL: lldb-api :: functionalities/gdb_remote_client/TestRestartBug.py (910 of 1914)
PASS: lldb-unit :: Target/./TargetTests/16/19 (911 of 1914)
PASS: lldb-unit :: Language/Highlighting/./HighlighterTests/21/29 (912 of 1914)
PASS: lldb-api :: functionalities/inferior-assert/TestInferiorAssert.py (913 of 1914)
PASS: lldb-api :: functionalities/data-formatter/var-in-aggregate-misuse/TestVarInAggregateMisuse.py (914 of 1914)
PASS: lldb-api :: python_api/hello_world/TestHelloWorld.py (915 of 1914)
PASS: lldb-api :: python_api/type/TestTypeList.py (916 of 1914)
PASS: lldb-api :: functionalities/breakpoint/scripted_bkpt/TestScriptedResolver.py (917 of 1914)
PASS: lldb-api :: commands/expression/import-std-module/list-dbg-info-content/TestDbgInfoContentListFromStdModule.py (918 of 1914)
PASS: lldb-shell :: SymbolFile/DWARF/x86/find-basic-namespace.cpp (919 of 1914)
PASS: lldb-unit :: Host/./HostTests/13/19 (920 of 1914)
PASS: lldb-shell :: SymbolFile/DWARF/x86/unused-inlined-params.test (921 of 1914)
PASS: lldb-api :: lang/cpp/function-qualifiers/TestCppFunctionQualifiers.py (922 of 1914)
PASS: lldb-api :: lang/cpp/auto/TestCPPAuto.py (923 of 1914)
PASS: lldb-api :: commands/watchpoints/watchpoint_on_vectors/TestValueOfVectorVariable.py (924 of 1914)
PASS: lldb-shell :: SymbolFile/DWARF/x86/dwp-separate-debug-file.cpp (925 of 1914)
PASS: lldb-api :: commands/expression/import-std-module/deque-basic/TestDequeFromStdModule.py (926 of 1914)
PASS: lldb-api :: lang/cpp/virtual-overload/TestVirtualOverload.py (927 of 1914)
PASS: lldb-api :: python_api/file_handle/TestFileHandle.py (928 of 1914)
PASS: lldb-shell :: ObjectFile/ELF/PT_LOAD-overlap-section.yaml (929 of 1914)
PASS: lldb-shell :: SymbolFile/NativePDB/load-pdb.cpp (930 of 1914)
PASS: lldb-api :: functionalities/breakpoint/comp_dir_symlink/TestCompDirSymLink.py (931 of 1914)
PASS: lldb-shell :: ObjectFile/ELF/section-overlap.yaml (932 of 1914)
PASS: lldb-shell :: Settings/TestDefaultModuleCachePath.test (933 of 1914)
PASS: lldb-api :: commands/expression/persistent_types/TestPersistentTypes.py (934 of 1914)
PASS: lldb-api :: lang/objc/hidden-ivars/TestHiddenIvars.py (935 of 1914)
PASS: lldb-api :: functionalities/completion/TestCompletion.py (936 of 1914)
PASS: lldb-api :: lldbutil-tests/failed-to-hit-breakpoint/TestLLDBUtilFailedToHitBreakpoint.py (937 of 1914)
PASS: lldb-shell :: SymbolFile/DWARF/x86/DW_OP_piece-struct.s (938 of 1914)
PASS: lldb-api :: functionalities/show_location/TestShowLocationDwarf5.py (939 of 1914)
PASS: lldb-api :: lang/objc/modules-incomplete/TestIncompleteModules.py (940 of 1914)
PASS: lldb-unit :: Platform/./LLDBPlatformTests/7/16 (941 of 1914)
PASS: lldb-api :: commands/expression/import-std-module/sysroot/TestStdModuleSysroot.py (942 of 1914)
PASS: lldb-api :: commands/expression/timeout/TestCallWithTimeout.py (943 of 1914)
PASS: lldb-shell :: ObjectFile/ELF/eh_frame-symbols.yaml (944 of 1914)
PASS: lldb-api :: lang/cpp/unsigned_types/TestUnsignedTypes.py (945 of 1914)
PASS: lldb-api :: lang/cpp/non-type-template-param/TestCppNonTypeTemplateParam.py (946 of 1914)
PASS: lldb-unit :: Symbol/./SymbolTests/8/16 (947 of 1914)
PASS: lldb-api :: functionalities/data-formatter/data-formatter-stl/generic/deque/TestDataFormatterGenericDeque.py (948 of 1914)
PASS: lldb-api :: lang/c/const_variables/TestConstVariables.py (949 of 1914)
UNSUPPORTED: lldb-api :: commands/expression/import-std-module/pair/TestPairFromStdModule.py (950 of 1914)
PASS: lldb-shell :: ObjectFile/ELF/PT_LOAD-overlap.yaml (951 of 1914)
PASS: lldb-shell :: SymbolFile/NativePDB/function-types-classes.cpp (952 of 1914)
PASS: lldb-api :: commands/expression/scoped_enums/TestScopedEnumType.py (953 of 1914)
PASS: lldb-unit :: Symbol/./SymbolTests/10/16 (954 of 1914)
PASS: lldb-unit :: ScriptInterpreter/Python/./ScriptInterpreterPythonTests/3/19 (955 of 1914)
PASS: lldb-api :: commands/breakpoint/set/func-regex/TestBreakpointRegexError.py (956 of 1914)
PASS: lldb-shell :: SymbolFile/Breakpad/line-table-mixed-path-styles.test (957 of 1914)
UNSUPPORTED: lldb-api :: functionalities/data-formatter/data-formatter-stl/libstdcpp/tuple/TestDataFormatterStdTuple.py (958 of 1914)
UNSUPPORTED: lldb-api :: linux/aarch64/tagged_memory_access/TestAArch64LinuxTaggedMemoryAccess.py (959 of 1914)
PASS: lldb-api :: functionalities/breakpoint/breakpoint_by_file_colon_line/TestBreakpointByFileColonLine.py (960 of 1914)
PASS: lldb-api :: lang/c/struct_types/TestStructTypes.py (961 of 1914)
UNSUPPORTED: lldb-shell :: SymbolFile/PDB/udt-layout.test (962 of 1914)
PASS: lldb-shell :: SymbolFile/NativePDB/ast-types.cpp (963 of 1914)
UNSUPPORTED: lldb-shell :: ScriptInterpreter/Lua/watchpoint_callback.test (964 of 1914)
PASS: lldb-api :: functionalities/unused-inlined-parameters/TestUnusedInlinedParameters.py (965 of 1914)
PASS: lldb-api :: functionalities/inferior-crashing/TestInferiorCrashingStep.py (966 of 1914)
PASS: lldb-unit :: Core/./LLDBCoreTests/2/23 (967 of 1914)
PASS: lldb-unit :: UnwindAssembly/x86/./UnwindAssemblyx86Tests/21/27 (968 of 1914)
UNSUPPORTED: lldb-shell :: ObjectFile/ELF/minidebuginfo-set-and-hit-breakpoint.test (969 of 1914)
PASS: lldb-api :: commands/expression/import-std-module/forward_list-dbg-info-content/TestDbgInfoContentForwardListFromStdModule.py (970 of 1914)
PASS: lldb-api :: functionalities/tail_call_frames/ambiguous_tail_call_seq2/TestAmbiguousTailCallSeq2.py (971 of 1914)
PASS: lldb-api :: functionalities/fat_archives/TestFatArchives.py (972 of 1914)
PASS: lldb-api :: functionalities/data-formatter/data-formatter-stl/generic/multimap/TestDataFormatterGenericMultiMap.py (973 of 1914)
PASS: lldb-shell :: SymbolFile/DWARF/x86/dir-separator-windows.s (974 of 1914)
PASS: lldb-api :: commands/quit/TestQuit.py (975 of 1914)
PASS: lldb-api :: tools/lldb-server/TestGdbRemoteAttach.py (976 of 1914)
PASS: lldb-api :: commands/expression/context-object/TestContextObject.py (977 of 1914)
PASS: lldb-shell :: SymbolFile/DWARF/x86/debug_line-relative_path.s (978 of 1914)
PASS: lldb-shell :: Register/Core/x86-64-netbsd-fp.test (979 of 1914)
PASS: lldb-api :: commands/expression/save_jit_objects/TestSaveJITObjects.py (980 of 1914)
PASS: lldb-unit :: Process/gdb-remote/./ProcessGdbRemoteTests/14/19 (981 of 1914)
PASS: lldb-api :: lang/cpp/type_lookup/TestCppTypeLookup.py (982 of 1914)
PASS: lldb-unit :: Process/Utility/./ProcessUtilityTests/7/16 (983 of 1914)
PASS: lldb-unit :: ObjectFile/ELF/./ObjectFileELFTests/2/4 (984 of 1914)
PASS: lldb-api :: commands/target/create-no-such-arch/TestNoSuchArch.py (985 of 1914)
PASS: lldb-api :: tools/lldb-vscode/breakpoint/TestVSCode_setFunctionBreakpoints.py (986 of 1914)
PASS: lldb-unit :: SymbolFile/DWARF/./SymbolFileDWARFTests/9/29 (987 of 1914)
PASS: lldb-api :: functionalities/breakpoint/breakpoint_ids/TestBreakpointIDs.py (988 of 1914)
PASS: lldb-unit :: Host/./HostTests/11/19 (989 of 1914)
UNSUPPORTED: lldb-shell :: SymbolFile/NativePDB/typedefs.cpp (990 of 1914)
PASS: lldb-api :: functionalities/data-formatter/data-formatter-stl/generic/list/TestDataFormatterGenericList.py (991 of 1914)
PASS: lldb-api :: python_api/lldbutil/iter/TestRegistersIterator.py (992 of 1914)
PASS: lldb-api :: functionalities/gdb_remote_client/TestNoWatchpointSupportInfo.py (993 of 1914)
PASS: lldb-api :: functionalities/thread/concurrent_events/TestConcurrentWatchBreakDelay.py (994 of 1914)
UNSUPPORTED: lldb-api :: functionalities/gdb_remote_client/TestAArch64XMLRegOffsets.py (995 of 1914)
PASS: lldb-api :: functionalities/breakpoint/source_regexp/TestSourceRegexBreakpoints.py (996 of 1914)
PASS: lldb-api :: functionalities/dead-strip/TestDeadStrip.py (997 of 1914)
PASS: lldb-unit :: Target/./TargetTests/6/19 (998 of 1914)
PASS: lldb-api :: commands/target/dump-symtab-demangle/TestDumpSymtabDemangle.py (999 of 1914)
PASS: lldb-api :: python_api/watchpoint/TestWatchpointIter.py (1000 of 1914)
PASS: lldb-shell :: SymbolFile/DWARF/x86/dwarf5-partial-index.cpp (1001 of 1914)
PASS: lldb-unit :: UnwindAssembly/x86/./UnwindAssemblyx86Tests/10/27 (1002 of 1914)
PASS: lldb-unit :: UnwindAssembly/x86/./UnwindAssemblyx86Tests/16/27 (1003 of 1914)
PASS: lldb-api :: commands/target/stop-hooks/TestStopHooks.py (1004 of 1914)
PASS: lldb-api :: commands/expression/issue_11588/Test11588.py (1005 of 1914)
PASS: lldb-shell :: SymbolFile/Breakpad/line-table-missing-file.test (1006 of 1914)
PASS: lldb-api :: commands/thread/backtrace/TestThreadBacktraceRepeat.py (1007 of 1914)
PASS: lldb-api :: tools/lldb-vscode/coreFile/TestVSCode_coreFile.py (1008 of 1914)
PASS: lldb-unit :: Core/./LLDBCoreTests/7/23 (1009 of 1914)
PASS: lldb-unit :: Core/./LLDBCoreTests/13/23 (1010 of 1914)
PASS: lldb-api :: functionalities/archives/TestBSDArchives.py (1011 of 1914)
PASS: lldb-api :: lang/objc/rdar-11355592/TestRdar11355592.py (1012 of 1914)
PASS: lldb-api :: functionalities/abbreviation/TestAbbreviations.py (1013 of 1914)
UNSUPPORTED: lldb-shell :: Register/x86-64-gp-write.test (1014 of 1914)
PASS: lldb-shell :: SymbolFile/DWARF/x86/DW_AT_decl_file-DW_AT_specification-crosscu.s (1015 of 1914)
PASS: lldb-unit :: SymbolFile/NativePDB/./SymbolFileNativePDBTests/8/15 (1016 of 1914)
PASS: lldb-api :: lang/objc/foundation/TestSymbolTable.py (1017 of 1914)
PASS: lldb-api :: functionalities/stats_api/TestStatisticsAPI.py (1018 of 1914)
PASS: lldb-api :: lang/c/flexible-array-members/TestCFlexibleArrayMembers.py (1019 of 1914)
PASS: lldb-unit :: Platform/./LLDBPlatformTests/1/16 (1020 of 1914)
PASS: lldb-shell :: ObjectFile/PECOFF/dwarf-gnu-debuglink-i686.yaml (1021 of 1914)
PASS: lldb-api :: commands/expression/call-function/TestCallStopAndContinue.py (1022 of 1914)
XFAIL: lldb-shell :: Register/x86-mm-xmm-write.test (1023 of 1914)
PASS: lldb-shell :: ObjectFile/PECOFF/uuid.yaml (1024 of 1914)
UNSUPPORTED: lldb-shell :: SymbolFile/DWARF/x86/dwarf5-line-strp.s (1025 of 1914)
PASS: lldb-unit :: SymbolFile/DWARF/./SymbolFileDWARFTests/2/29 (1026 of 1914)
PASS: lldb-api :: functionalities/postmortem/wow64_minidump/TestWow64MiniDump.py (1027 of 1914)
PASS: lldb-shell :: SymbolFile/DWARF/x86/debug-types-dwarf5.s (1028 of 1914)
PASS: lldb-unit :: DataFormatter/./LLDBFormatterTests/9/11 (1029 of 1914)
PASS: lldb-api :: functionalities/wrong_commands/TestWrongCommands.py (1030 of 1914)
PASS: lldb-api :: lang/c/calling-conventions/TestCCallingConventions.py (1031 of 1914)
PASS: lldb-api :: tools/lldb-vscode/launch/TestVSCode_launch.py (1032 of 1914)
PASS: lldb-api :: commands/watchpoints/watchpoint_commands/TestWatchpointCommands.py (1033 of 1914)
PASS: lldb-unit :: Process/Utility/./ProcessUtilityTests/1/16 (1034 of 1914)
PASS: lldb-api :: functionalities/thread/concurrent_events/TestConcurrentTwoWatchpointThreads.py (1035 of 1914)
PASS: lldb-unit :: Platform/./LLDBPlatformTests/5/16 (1036 of 1914)
PASS: lldb-api :: commands/expression/pr35310/TestExprsBug35310.py (1037 of 1914)
PASS: lldb-api :: functionalities/thread/concurrent_events/TestConcurrentSignalBreak.py (1038 of 1914)
PASS: lldb-api :: lang/objc/rdar-10967107/TestRdar10967107.py (1039 of 1914)
PASS: lldb-api :: functionalities/thread/thread_specific_break/TestThreadSpecificBreakpoint.py (1040 of 1914)
PASS: lldb-api :: functionalities/tail_call_frames/disambiguate_call_site/TestDisambiguateCallSite.py (1041 of 1914)
UNSUPPORTED: lldb-shell :: SymbolFile/DWARF/debug-types-expressions.test (1042 of 1914)
PASS: lldb-api :: tools/lldb-server/TestGdbRemoteThreadsInStopReply.py (1043 of 1914)
PASS: lldb-api :: functionalities/data-formatter/stringprinter/TestStringPrinter.py (1044 of 1914)
UNSUPPORTED: lldb-api :: tools/lldb-server/TestGdbRemotePlatformFile.py (1045 of 1914)
PASS: lldb-api :: lang/c/unicode/TestUnicodeSymbols.py (1046 of 1914)
PASS: lldb-shell :: SymbolFile/DWARF/x86/debug_ranges_and_rnglists.test (1047 of 1914)
PASS: lldb-unit :: Process/minidump/./LLDBMinidumpTests/12/17 (1048 of 1914)
PASS: lldb-api :: macosx/thread_suspend/TestInternalThreadSuspension.py (1049 of 1914)
PASS: lldb-unit :: Language/CPlusPlus/./LanguageCPlusPlusTests/3/5 (1050 of 1914)
PASS: lldb-shell :: ScriptInterpreter/Python/command_relative_import.test (1051 of 1914)
UNSUPPORTED: lldb-shell :: Register/x86-64-zmm-write.test (1052 of 1914)
PASS: lldb-unit :: Host/./HostTests/2/19 (1053 of 1914)
PASS: lldb-api :: functionalities/data-formatter/data-formatter-python-synth/TestDataFormatterPythonSynth.py (1054 of 1914)
PASS: lldb-api :: lang/objc/conflicting-definition/TestConflictingDefinition.py (1055 of 1914)
PASS: lldb-api :: functionalities/data-formatter/data-formatter-stl/libcxx/function/TestLibCxxFunction.py (1056 of 1914)
PASS: lldb-api :: commands/expression/call-function/TestCallStdStringFunction.py (1057 of 1914)
PASS: lldb-api :: lang/objc/modules-app-update/TestClangModulesAppUpdate.py (1058 of 1914)
PASS: lldb-api :: functionalities/data-formatter/data-formatter-objc/nsstring/TestDataFormatterNSString.py (1059 of 1914)
PASS: lldb-api :: functionalities/data-formatter/synthcapping/TestSyntheticCapping.py (1060 of 1914)
PASS: lldb-shell :: SymbolFile/NativePDB/source-list.cpp (1061 of 1914)
PASS: lldb-api :: lang/objc/foundation/TestRuntimeTypes.py (1062 of 1914)
PASS: lldb-api :: tools/lldb-server/TestGdbRemoteRegisterState.py (1063 of 1914)
PASS: lldb-api :: functionalities/data-formatter/data-formatter-script/TestDataFormatterScript.py (1064 of 1914)
PASS: lldb-api :: functionalities/breakpoint/debugbreak/TestDebugBreak.py (1065 of 1914)
PASS: lldb-shell :: SymbolFile/DWARF/clang-ast-from-dwarf-unamed-and-anon-structs.cpp (1066 of 1914)
PASS: lldb-api :: sanity/TestModuleCacheSanity.py (1067 of 1914)
PASS: lldb-api :: lang/cpp/static_members/TestCPPStaticMembers.py (1068 of 1914)
PASS: lldb-api :: lang/cpp/offsetof/TestOffsetofCpp.py (1069 of 1914)
PASS: lldb-unit :: Platform/./LLDBPlatformTests/12/16 (1070 of 1914)
PASS: lldb-unit :: Language/CPlusPlus/./LanguageCPlusPlusTests/0/5 (1071 of 1914)
PASS: lldb-api :: functionalities/data-formatter/data-formatter-categories/TestDataFormatterCategories.py (1072 of 1914)
PASS: lldb-api :: commands/expression/import-std-module/vector/TestVectorFromStdModule.py (1073 of 1914)
PASS: lldb-api :: commands/platform/file/read/TestPlatformFileRead.py (1074 of 1914)
PASS: lldb-api :: lang/cpp/struct_with_keyword_name/TestStructWithKeywordName.py (1075 of 1914)
PASS: lldb-api :: commands/expression/error-limit/TestExprErrorLimit.py (1076 of 1914)
PASS: lldb-unit :: Language/Highlighting/./HighlighterTests/18/29 (1077 of 1914)
PASS: lldb-api :: functionalities/data-formatter/data-formatter-enum-format/TestDataFormatterEnumFormat.py (1078 of 1914)
PASS: lldb-api :: commands/expression/rdar42038760/TestScalarURem.py (1079 of 1914)
PASS: lldb-unit :: Process/minidump/./LLDBMinidumpTests/2/17 (1080 of 1914)
UNSUPPORTED: lldb-shell :: Process/Windows/process_load.cpp (1081 of 1914)
PASS: lldb-unit :: Process/minidump/./LLDBMinidumpTests/0/17 (1082 of 1914)
PASS: lldb-unit :: DataFormatter/./LLDBFormatterTests/6/11 (1083 of 1914)
PASS: lldb-api :: commands/expression/import-std-module/retry-with-std-module/TestRetryWithStdModule.py (1084 of 1914)
PASS: lldb-unit :: Interpreter/./InterpreterTests/12/14 (1085 of 1914)
PASS: lldb-api :: lang/c/conflicting-symbol/TestConflictingSymbol.py (1086 of 1914)
PASS: lldb-shell :: Register/Core/x86-32-linux-addr.test (1087 of 1914)
PASS: lldb-unit :: SymbolFile/DWARF/./SymbolFileDWARFTests/0/29 (1088 of 1914)
PASS: lldb-api :: commands/frame/var/TestFrameVar.py (1089 of 1914)
PASS: lldb-shell :: Process/Optimization.test (1090 of 1914)
PASS: lldb-api :: commands/expression/top-level/TestTopLevelExprs.py (1091 of 1914)
UNSUPPORTED: lldb-shell :: Register/x86-64-ymm16-write.test (1092 of 1914)
PASS: lldb-unit :: Interpreter/./InterpreterTests/13/14 (1093 of 1914)
PASS: lldb-api :: functionalities/thread_plan/TestThreadPlanCommands.py (1094 of 1914)
PASS: lldb-api :: lang/cpp/namespace_conflicts/TestNamespaceConflicts.py (1095 of 1914)
PASS: lldb-shell :: Breakpoint/debug_rnglistx_rlex.test (1096 of 1914)
PASS: lldb-unit :: Symbol/./SymbolTests/7/16 (1097 of 1914)
PASS: lldb-shell :: Reproducer/TestDriverOptions.test (1098 of 1914)
PASS: lldb-api :: lang/cpp/printf/TestPrintf.py (1099 of 1914)
PASS: lldb-unit :: Platform/./LLDBPlatformTests/10/16 (1100 of 1914)
PASS: lldb-api :: lang/cpp/class_types/TestClassTypesDisassembly.py (1101 of 1914)
PASS: lldb-api :: macosx/builtin-debugtrap/TestBuiltinDebugTrap.py (1102 of 1914)
PASS: lldb-api :: commands/expression/rdar44436068/Test128BitsInteger.py (1103 of 1914)
PASS: lldb-api :: functionalities/gdb_remote_client/TestGDBRemotePlatformFile.py (1104 of 1914)
PASS: lldb-api :: functionalities/thread/concurrent_events/TestConcurrentSignalDelayWatch.py (1105 of 1914)
UNSUPPORTED: lldb-api :: functionalities/gdb_remote_client/TestWasm.py (1106 of 1914)
PASS: lldb-api :: lang/cpp/static_methods/TestCPPStaticMethods.py (1107 of 1914)
PASS: lldb-api :: lang/c/step-target/TestStepTarget.py (1108 of 1914)
PASS: lldb-unit :: Expression/./ExpressionTests/15/22 (1109 of 1914)
PASS: lldb-api :: functionalities/param_entry_vals/basic_entry_values/TestBasicEntryValues.py (1110 of 1914)
PASS: lldb-api :: lang/cpp/dynamic-value/TestCppValueCast.py (1111 of 1914)
UNSUPPORTED: lldb-api :: tools/lldb-server/TestGdbRemoteSaveCore.py (1112 of 1914)
PASS: lldb-shell :: SymbolFile/DWARF/DW_AT_range-DW_FORM_sec_offset.s (1113 of 1914)
PASS: lldb-shell :: SymbolFile/DWARF/x86/apple-index-is-used.cpp (1114 of 1914)
PASS: lldb-unit :: Utility/./UtilityTests/9/30 (1115 of 1914)
PASS: lldb-shell :: ObjectFile/ELF/PT_LOAD-overlap-PT_INTERP.yaml (1116 of 1914)
PASS: lldb-api :: commands/expression/two-files/TestObjCTypeQueryFromOtherCompileUnit.py (1117 of 1914)
UNSUPPORTED: lldb-shell :: Register/x86-64-xmm16-read.test (1118 of 1914)
UNSUPPORTED: lldb-shell :: Register/x86-64-zmm-read.test (1119 of 1914)
PASS: lldb-api :: macosx/queues/TestQueues.py (1120 of 1914)
PASS: lldb-shell :: Register/Core/x86-64-freebsd-multithread.test (1121 of 1914)
PASS: lldb-unit :: Process/minidump/./LLDBMinidumpTests/13/17 (1122 of 1914)
PASS: lldb-unit :: UnwindAssembly/x86/./UnwindAssemblyx86Tests/24/27 (1123 of 1914)
PASS: lldb-shell :: ObjectFile/ELF/section-addresses.yaml (1124 of 1914)
PASS: lldb-unit :: UnwindAssembly/x86/./UnwindAssemblyx86Tests/14/27 (1125 of 1914)
PASS: lldb-api :: lang/objc/variadic_methods/TestVariadicMethods.py (1126 of 1914)
PASS: lldb-shell :: SymbolFile/DWARF/x86/debug_ranges.s (1127 of 1914)
PASS: lldb-api :: functionalities/thread/exit_during_step/TestExitDuringStep.py (1128 of 1914)
UNSUPPORTED: lldb-api :: commands/trace/TestTraceDumpInfo.py (1129 of 1914)
PASS: lldb-api :: commands/expression/deleting-implicit-copy-constructor/TestDeletingImplicitCopyConstructor.py (1130 of 1914)
UNSUPPORTED: lldb-api :: lang/cpp/function-template-parameter-pack/TestFunctionTemplateParameterPack.py (1131 of 1914)
PASS: lldb-api :: functionalities/unwind/noreturn/TestNoreturnUnwind.py (1132 of 1914)
PASS: lldb-api :: python_api/interpreter/TestRunCommandInterpreterAPI.py (1133 of 1914)
PASS: lldb-api :: functionalities/breakpoint/breakpoint_on_overload/TestBreakOnOverload.py (1134 of 1914)
PASS: lldb-api :: lang/cpp/break-on-initializers/TestBreakOnCPP11Initializers.py (1135 of 1914)
PASS: lldb-api :: functionalities/signal/TestSendSignal.py (1136 of 1914)
PASS: lldb-shell :: ObjectFile/PECOFF/dwarf-gnu-debuglink-mismatched-crc.yaml (1137 of 1914)
PASS: lldb-api :: lang/c/cpp_keyword_identifiers/TestCppKeywordsAsCIdentifiers.py (1138 of 1914)
PASS: lldb-api :: commands/frame/recognizer/TestFrameRecognizer.py (1139 of 1914)
PASS: lldb-shell :: Expr/TestIRMemoryMap.test (1140 of 1914)
PASS: lldb-api :: tools/lldb-server/TestGdbRemoteProcessInfo.py (1141 of 1914)
PASS: lldb-api :: symbol_ondemand/breakpoint_source_regex/TestSourceTextRegexBreakpoint.py (1142 of 1914)
UNSUPPORTED: lldb-shell :: SymbolFile/PDB/type-quals.test (1143 of 1914)
PASS: lldb-api :: tools/lldb-vscode/evaluate/TestVSCode_evaluate.py (1144 of 1914)
PASS: lldb-api :: linux/builtin_trap/TestBuiltinTrap.py (1145 of 1914)
PASS: lldb-unit :: UnwindAssembly/x86/./UnwindAssemblyx86Tests/8/27 (1146 of 1914)
PASS: lldb-api :: lang/cpp/virtual-functions/TestCppVirtualFunctions.py (1147 of 1914)
PASS: lldb-unit :: Symbol/./SymbolTests/1/16 (1148 of 1914)
PASS: lldb-shell :: Driver/TestError.test (1149 of 1914)
PASS: lldb-api :: functionalities/gdb_remote_client/TestFork.py (1150 of 1914)
PASS: lldb-api :: lang/cpp/constructors/TestCppConstructors.py (1151 of 1914)
PASS: lldb-shell :: Driver/TestPositionalArgs.test (1152 of 1914)
PASS: lldb-api :: commands/expression/pr52257/TestExprCrash.py (1153 of 1914)
PASS: lldb-shell :: Driver/TestUseColor.test (1154 of 1914)
PASS: lldb-unit :: DataFormatter/./LLDBFormatterTests/2/11 (1155 of 1914)
PASS: lldb-unit :: Target/./TargetTests/8/19 (1156 of 1914)
PASS: lldb-api :: functionalities/thread/ignore_suspended/TestIgnoreSuspendedThread.py (1157 of 1914)
PASS: lldb-api :: functionalities/data-formatter/type_summary_list_arg/TestTypeSummaryListArg.py (1158 of 1914)
UNSUPPORTED: lldb-shell :: ScriptInterpreter/Lua/bindings.test (1159 of 1914)
UNSUPPORTED: lldb-shell :: Unwind/eh-frame-small-fde.test (1160 of 1914)
PASS: lldb-unit :: Language/Highlighting/./HighlighterTests/25/29 (1161 of 1914)
UNSUPPORTED: lldb-shell :: Subprocess/clone-follow-child.test (1162 of 1914)
UNSUPPORTED: lldb-shell :: Register/arm-fp-read.test (1163 of 1914)
PASS: lldb-api :: lang/cpp/function-local-class/TestCppFunctionLocalClass.py (1164 of 1914)
PASS: lldb-shell :: Reproducer/TestVersionCheck.test (1165 of 1914)
PASS: lldb-api :: commands/frame/diagnose/array/TestArray.py (1166 of 1914)
PASS: lldb-api :: functionalities/tail_call_frames/cross_object/TestCrossObjectTailCalls.py (1167 of 1914)
PASS: lldb-api :: functionalities/thread/concurrent_events/TestConcurrentTwoBreakpointsOneDelaySignal.py (1168 of 1914)
PASS: lldb-api :: lang/c/find_struct_type/TestFindStructTypes.py (1169 of 1914)
PASS: lldb-unit :: Target/./TargetTests/10/19 (1170 of 1914)
PASS: lldb-shell :: Reproducer/TestDump.test (1171 of 1914)
PASS: lldb-api :: functionalities/data-formatter/data-formatter-stl/libcxx/atomic/TestLibCxxAtomic.py (1172 of 1914)
XFAIL: lldb-shell :: Unwind/prefer-debug-over-eh-frame.test (1173 of 1914)
PASS: lldb-api :: functionalities/gdb_remote_client/TestArmRegisterDefinition.py (1174 of 1914)
PASS: lldb-unit :: Platform/./LLDBPlatformTests/15/16 (1175 of 1914)
UNSUPPORTED: lldb-api :: functionalities/breakpoint/hardware_breakpoints/write_memory_with_hw_breakpoint/TestWriteMemoryWithHWBreakpoint.py (1176 of 1914)
PASS: lldb-unit :: ObjectFile/ELF/./ObjectFileELFTests/0/4 (1177 of 1914)
PASS: lldb-api :: lang/cpp/nested-class-other-compilation-unit/TestNestedClassWithParentInAnotherCU.py (1178 of 1914)
PASS: lldb-api :: functionalities/thread/concurrent_events/TestConcurrentDelayWatchBreak.py (1179 of 1914)
UNSUPPORTED: lldb-api :: functionalities/data-formatter/data-formatter-stl/libstdcpp/vector/TestDataFormatterStdVector.py (1180 of 1914)
PASS: lldb-api :: functionalities/breakpoint/breakpoint_set_restart/TestBreakpointSetRestart.py (1181 of 1914)
PASS: lldb-api :: functionalities/value_md5_crash/TestValueMD5Crash.py (1182 of 1914)
PASS: lldb-unit :: Interpreter/./InterpreterTests/7/14 (1183 of 1914)
UNSUPPORTED: lldb-api :: functionalities/tsan/thread_leak/TestTsanThreadLeak.py (1184 of 1914)
PASS: lldb-unit :: Process/Utility/./ProcessUtilityTests/15/16 (1185 of 1914)
PASS: lldb-unit :: Symbol/./SymbolTests/12/16 (1186 of 1914)
PASS: lldb-api :: functionalities/thread/backtrace_limit/TestBacktraceLimit.py (1187 of 1914)
PASS: lldb-unit :: UnwindAssembly/x86/./UnwindAssemblyx86Tests/1/27 (1188 of 1914)
UNSUPPORTED: lldb-shell :: Commands/command-disassemble-aarch64-extensions.s (1189 of 1914)
UNSUPPORTED: lldb-shell :: Subprocess/fork-follow-child-softbp.test (1190 of 1914)
PASS: lldb-api :: functionalities/data-formatter/format-propagation/TestFormatPropagation.py (1191 of 1914)
PASS: lldb-api :: functionalities/thread/concurrent_events/TestConcurrentCrashWithWatchpointBreakpointSignal.py (1192 of 1914)
PASS: lldb-api :: lang/objc/foundation/TestObjCMethodsString.py (1193 of 1914)
PASS: lldb-unit :: Target/./TargetTests/17/19 (1194 of 1914)
UNSUPPORTED: lldb-shell :: ObjectFile/ELF/minidebuginfo-no-lzma.yaml (1195 of 1914)
PASS: lldb-unit :: debugserver/./debugserverTests/1/6 (1196 of 1914)
PASS: lldb-unit :: ScriptInterpreter/Python/./ScriptInterpreterPythonTests/5/19 (1197 of 1914)
UNSUPPORTED: lldb-api :: commands/trace/TestTraceExport.py (1198 of 1914)
PASS: lldb-shell :: Settings/TestFrameFormatMangling.test (1199 of 1914)
PASS: lldb-api :: functionalities/thread/thread_exit/TestThreadExit.py (1200 of 1914)
PASS: lldb-shell :: SymbolFile/DWARF/x86/childless-compile-unit.s (1201 of 1914)
PASS: lldb-api :: python_api/frame/inlines/TestInlinedFrame.py (1202 of 1914)
PASS: lldb-shell :: Driver/TestConvenienceVariables.test (1203 of 1914)
PASS: lldb-unit :: SymbolFile/DWARF/./SymbolFileDWARFTests/3/29 (1204 of 1914)
PASS: lldb-unit :: ScriptInterpreter/Python/./ScriptInterpreterPythonTests/0/19 (1205 of 1914)
PASS: lldb-api :: functionalities/breakpoint/address_breakpoints/TestAddressBreakpoints.py (1206 of 1914)
PASS: lldb-api :: functionalities/data-formatter/data-formatter-caching/TestDataFormatterCaching.py (1207 of 1914)
PASS: lldb-unit :: ScriptInterpreter/Python/./ScriptInterpreterPythonTests/2/19 (1208 of 1914)
PASS: lldb-api :: functionalities/data-formatter/data-formatter-objc/TestDataFormatterObjCNSError.py (1209 of 1914)
PASS: lldb-shell :: SymbolFile/DWARF/x86/DW_AT_declaration-with-children.s (1210 of 1914)
PASS: lldb-api :: commands/expression/namespace_local_var_same_name_cpp_and_c/TestNamespaceLocalVarSameNameCppAndC.py (1211 of 1914)
PASS: lldb-unit :: Core/./LLDBCoreTests/16/23 (1212 of 1914)
PASS: lldb-api :: commands/expression/completion-in-lambda-and-unnamed-class/TestCompletionInLambdaAndUnnamedClass.py (1213 of 1914)
PASS: lldb-api :: commands/target/stop-hooks/TestStopHookScripted.py (1214 of 1914)
PASS: lldb-unit :: UnwindAssembly/x86/./UnwindAssemblyx86Tests/19/27 (1215 of 1914)
PASS: lldb-api :: api/multithreaded/TestMultithreaded.py (1216 of 1914)
PASS: lldb-shell :: SymbolFile/DWARF/x86/debug-types-line-tables.s (1217 of 1914)
PASS: lldb-api :: commands/expression/call-function/TestCallBuiltinFunction.py (1218 of 1914)
PASS: lldb-unit :: Target/./TargetTests/12/19 (1219 of 1914)
PASS: lldb-unit :: Host/./HostTests/0/19 (1220 of 1914)
PASS: lldb-unit :: Core/./LLDBCoreTests/6/23 (1221 of 1914)
PASS: lldb-shell :: Commands/command-backtrace-parser-2.test (1222 of 1914)
PASS: lldb-shell :: SymbolFile/Breakpad/line-table-discontinuous-file-ids.test (1223 of 1914)
PASS: lldb-api :: functionalities/data-formatter/data-formatter-stl/libcxx/iterator/TestDataFormatterLibccIterator.py (1224 of 1914)
PASS: lldb-api :: commands/platform/file/close/TestPlatformFileClose.py (1225 of 1914)
PASS: lldb-shell :: Commands/command-regex-delete.test (1226 of 1914)
UNSUPPORTED: lldb-api :: arm/breakpoint-it/TestBreakpointIt.py (1227 of 1914)
PASS: lldb-shell :: ObjectFile/Breakpad/discontiguous-sections.test (1228 of 1914)
PASS: lldb-shell :: SymbolFile/NativePDB/subfield_register_simple_type.s (1229 of 1914)
PASS: lldb-api :: functionalities/thread/concurrent_events/TestConcurrentNWatchNBreak.py (1230 of 1914)
PASS: lldb-shell :: SymbolFile/Breakpad/line-table.test (1231 of 1914)
PASS: lldb-api :: commands/watchpoints/watchpoint_commands/command/TestWatchpointCommandPython.py (1232 of 1914)
PASS: lldb-unit :: Process/minidump/./LLDBMinidumpTests/7/17 (1233 of 1914)
PASS: lldb-shell :: Minidump/fb-dump.test (1234 of 1914)
UNSUPPORTED: lldb-shell :: Register/x86-ymm-read.test (1235 of 1914)
PASS: lldb-api :: types/TestDoubleTypes.py (1236 of 1914)
PASS: lldb-api :: lang/cpp/sizeof/TestCPPSizeof.py (1237 of 1914)
PASS: lldb-api :: commands/command/script/import/TestImport.py (1238 of 1914)
PASS: lldb-shell :: Register/Core/x86-64-freebsd-addr.test (1239 of 1914)
PASS: lldb-api :: lang/cpp/diamond/TestCppDiamond.py (1240 of 1914)
PASS: lldb-api :: commands/expression/persistent_ptr_update/TestPersistentPtrUpdate.py (1241 of 1914)
PASS: lldb-api :: functionalities/breakpoint/breakpoint_hit_count/TestBreakpointHitCount.py (1242 of 1914)
PASS: lldb-api :: macosx/unregistered-macho/TestUnregisteredMacho.py (1243 of 1914)
UNSUPPORTED: lldb-shell :: SymbolFile/Breakpad/stack-cfi-arm.yaml (1244 of 1914)
PASS: lldb-shell :: Register/Core/x86-32-freebsd-gp.test (1245 of 1914)
PASS: lldb-unit :: Target/./TargetTests/14/19 (1246 of 1914)
PASS: lldb-unit :: Process/gdb-remote/./ProcessGdbRemoteTests/15/19 (1247 of 1914)
PASS: lldb-shell :: SymbolFile/NativePDB/lookup-by-types.cpp (1248 of 1914)
PASS: lldb-api :: tools/lldb-vscode/optimized/TestVSCode_optimized.py (1249 of 1914)
UNSUPPORTED: lldb-shell :: ScriptInterpreter/Lua/command_script_import.test (1250 of 1914)
PASS: lldb-api :: commands/expression/unwind_expression/TestUnwindExpression.py (1251 of 1914)
PASS: lldb-unit :: Core/./LLDBCoreTests/11/23 (1252 of 1914)
PASS: lldb-api :: tools/lldb-server/inferior-crash/TestGdbRemoteAbort.py (1253 of 1914)
PASS: lldb-shell :: ObjectFile/PECOFF/settings-abi.yaml (1254 of 1914)
UNSUPPORTED: lldb-api :: tools/lldb-server/TestGdbRemoteAuxvSupport.py (1255 of 1914)
PASS: lldb-shell :: ObjectFile/ELF/PT_LOAD-overlap-PT_TLS.yaml (1256 of 1914)
PASS: lldb-shell :: Register/Core/x86-64-linux-fp.test (1257 of 1914)
PASS: lldb-api :: functionalities/data-formatter/data-formatter-objc/TestDataFormatterObjNSException.py (1258 of 1914)
PASS: lldb-api :: commands/apropos/with-process/TestAproposWithProcess.py (1259 of 1914)
PASS: lldb-api :: functionalities/data-formatter/data-formatter-objc/TestDataFormatterObjCExpr.py (1260 of 1914)
PASS: lldb-api :: lang/c/unions/TestUnionMembers.py (1261 of 1914)
PASS: lldb-unit :: ScriptInterpreter/Python/./ScriptInterpreterPythonTests/8/19 (1262 of 1914)
UNSUPPORTED: lldb-api :: commands/register/register/aarch64_dynamic_regset/TestArm64DynamicRegsets.py (1263 of 1914)
PASS: lldb-api :: functionalities/data-formatter/poarray/TestPrintObjectArray.py (1264 of 1914)
PASS: lldb-shell :: ScriptInterpreter/Python/Crashlog/parser_json.test (1265 of 1914)
PASS: lldb-api :: tools/lldb-vscode/breakpoint/TestVSCode_setExceptionBreakpoints.py (1266 of 1914)
PASS: lldb-shell :: ObjectFile/ELF/section-permissions.yaml (1267 of 1914)
PASS: lldb-api :: functionalities/abbreviation/TestCommonShortSpellings.py (1268 of 1914)
PASS: lldb-api :: functionalities/thread/concurrent_events/TestConcurrentSignalWatch.py (1269 of 1914)
PASS: lldb-api :: commands/command/invalid-args/TestInvalidArgsCommand.py (1270 of 1914)
UNSUPPORTED: lldb-api :: functionalities/breakpoint/breakpoint_callback_command_source/TestBreakpointCallbackCommandSource.py (1271 of 1914)
PASS: lldb-api :: functionalities/thread/concurrent_events/TestConcurrentManyBreakpoints.py (1272 of 1914)
PASS: lldb-api :: commands/expression/no-deadlock/TestExprDoesntBlock.py (1273 of 1914)
PASS: lldb-api :: lang/objc/objc-checker/TestObjCCheckers.py (1274 of 1914)
PASS: lldb-shell :: ObjectFile/ELF/short-build-id.yaml (1275 of 1914)
PASS: lldb-api :: api/log/TestAPILog.py (1276 of 1914)
UNSUPPORTED: lldb-shell :: SymbolFile/NativePDB/ast-functions-msvc.cpp (1277 of 1914)
PASS: lldb-shell :: SymbolFile/absolute-symbol.test (1278 of 1914)
PASS: lldb-api :: functionalities/type_get_module/TestTypeGetModule.py (1279 of 1914)
UNSUPPORTED: lldb-shell :: Register/x86-db-read.test (1280 of 1914)
PASS: lldb-unit :: Interpreter/./InterpreterTests/3/14 (1281 of 1914)
PASS: lldb-api :: functionalities/thread/concurrent_events/TestConcurrentManyCrash.py (1282 of 1914)
PASS: lldb-shell :: ObjectFile/MachO/lc_build_version.yaml (1283 of 1914)
PASS: lldb-api :: sanity/TestSettingSkipping.py (1284 of 1914)
PASS: lldb-unit :: Process/minidump/./LLDBMinidumpTests/9/17 (1285 of 1914)
PASS: lldb-api :: functionalities/gdb_remote_client/TestRegDefinitionInParts.py (1286 of 1914)
PASS: lldb-unit :: Interpreter/./InterpreterTests/8/14 (1287 of 1914)
PASS: lldb-api :: lang/objc/foundation/TestObjCMethods2.py (1288 of 1914)
PASS: lldb-api :: commands/expression/cast_int_to_anonymous_enum/TestCastIntToAnonymousEnum.py (1289 of 1914)
PASS: lldb-api :: functionalities/data-formatter/data-formatter-stl/libcxx/span/TestDataFormatterLibcxxSpan.py (1290 of 1914)
PASS: lldb-api :: macosx/find-dsym/deep-bundle/TestDeepBundle.py (1291 of 1914)
PASS: lldb-api :: functionalities/deleted-executable/TestDeletedExecutable.py (1292 of 1914)
PASS: lldb-shell :: Register/Core/x86-32-linux-gp.test (1293 of 1914)
PASS: lldb-shell :: Breakpoint/debug_rnglist_basic.test (1294 of 1914)
PASS: lldb-unit :: Expression/./ExpressionTests/5/22 (1295 of 1914)
PASS: lldb-shell :: SymbolFile/Breakpad/stack-cfi-parsing.test (1296 of 1914)
PASS: lldb-api :: commands/expression/import_base_class_when_class_has_derived_member/TestImportBaseClassWhenClassHasDerivedMember.py (1297 of 1914)
PASS: lldb-api :: functionalities/plugins/python_os_plugin/TestPythonOSPlugin.py (1298 of 1914)
PASS: lldb-api :: functionalities/dlopen_other_executable/TestDlopenOtherExecutable.py (1299 of 1914)
PASS: lldb-unit :: SymbolFile/DWARF/./SymbolFileDWARFTests/1/29 (1300 of 1914)
UNSUPPORTED: lldb-shell :: Unwind/split-machine-functions.test (1301 of 1914)
PASS: lldb-unit :: UnwindAssembly/x86/./UnwindAssemblyx86Tests/6/27 (1302 of 1914)
PASS: lldb-api :: lang/cpp/dereferencing_references/TestCPPDereferencingReferences.py (1303 of 1914)
PASS: lldb-shell :: Reproducer/TestHomeDir.test (1304 of 1914)
PASS: lldb-api :: lang/c/complex/TestComplexC99.py (1305 of 1914)
UNSUPPORTED: lldb-shell :: Subprocess/vfork-follow-child.test (1306 of 1914)
UNSUPPORTED: lldb-api :: benchmarks/continue/TestBenchmarkContinue.py (1307 of 1914)
PASS: lldb-api :: commands/command/delete/TestCommandDelete.py (1308 of 1914)
PASS: lldb-api :: lang/objc/objc-stepping/TestObjCStepping.py (1309 of 1914)
PASS: lldb-shell :: Commands/CommandScriptImmediateOutput/CommandScriptImmediateOutputConsole.test (1310 of 1914)
XFAIL: lldb-api :: functionalities/thread/create_during_step/TestCreateDuringStep.py (1311 of 1914)
PASS: lldb-api :: functionalities/location-list-lookup/TestLocationListLookup.py (1312 of 1914)
UNSUPPORTED: lldb-api :: commands/gui/viewlarge/TestGuiViewLarge.py (1313 of 1914)
PASS: lldb-unit :: Process/minidump/./LLDBMinidumpTests/6/17 (1314 of 1914)
PASS: lldb-shell :: SymbolFile/DWARF/x86/debug-line-basic.s (1315 of 1914)
PASS: lldb-api :: lang/cpp/scratch-context-merging/structs/TestCppScratchContextMergingStructs.py (1316 of 1914)
PASS: lldb-shell :: ScriptInterpreter/Python/scripted_breakpoint.test (1317 of 1914)
PASS: lldb-unit :: Host/./HostTests/1/19 (1318 of 1914)
PASS: lldb-api :: lang/cpp/pointer_to_member_type_depending_on_parent_size/TestPointerToMemberTypeDependingOnParentSize.py (1319 of 1914)
PASS: lldb-shell :: ObjectFile/ELF/base-address.yaml (1320 of 1914)
XFAIL: lldb-shell :: Register/x86-mm-xmm-read.test (1321 of 1914)
UNSUPPORTED: lldb-api :: functionalities/ptrauth_diagnostics/BRAA_error/TestPtrauthBRAADiagnostic.py (1322 of 1914)
PASS: lldb-unit :: Language/Highlighting/./HighlighterTests/3/29 (1323 of 1914)
PASS: lldb-api :: functionalities/breakpoint/breakpoint_command/TestRegexpBreakCommand.py (1324 of 1914)
PASS: lldb-unit :: SymbolFile/NativePDB/./SymbolFileNativePDBTests/10/15 (1325 of 1914)
PASS: lldb-unit :: SymbolFile/DWARF/./SymbolFileDWARFTests/15/29 (1326 of 1914)
PASS: lldb-api :: lang/c/shared_lib/TestSharedLib.py (1327 of 1914)
PASS: lldb-api :: python_api/value_var_update/TestValueVarUpdate.py (1328 of 1914)
PASS: lldb-shell :: REPL/Basic.test (1329 of 1914)
PASS: lldb-api :: commands/expression/xvalue/TestXValuePrinting.py (1330 of 1914)
UNSUPPORTED: lldb-api :: tools/lldb-server/TestGdbRemoteModuleInfo.py (1331 of 1914)
PASS: lldb-api :: lang/cpp/const_this/TestConstThis.py (1332 of 1914)
UNSUPPORTED: lldb-api :: lang/objc/conflicting-class-list-function-from-user/TestObjCClassListFunctionFromUser.py (1333 of 1914)
XFAIL: lldb-api :: commands/expression/macros/TestMacros.py (1334 of 1914)
PASS: lldb-api :: functionalities/thread/concurrent_events/TestConcurrentDelaySignalWatch.py (1335 of 1914)
PASS: lldb-api :: functionalities/data-formatter/array_typedef/TestArrayTypedef.py (1336 of 1914)
PASS: lldb-unit :: SymbolFile/DWARF/./SymbolFileDWARFTests/7/29 (1337 of 1914)
PASS: lldb-api :: functionalities/object-file/TestImageListMultiArchitecture.py (1338 of 1914)
PASS: lldb-api :: tools/lldb-server/TestGdbRemote_vCont.py (1339 of 1914)
PASS: lldb-api :: python_api/frame/get-variables/TestGetVariables.py (1340 of 1914)
PASS: lldb-api :: functionalities/data-formatter/type_summary_list_script/TestTypeSummaryListScript.py (1341 of 1914)
UNSUPPORTED: lldb-api :: functionalities/ptr_refs/TestPtrRefs.py (1342 of 1914)
PASS: lldb-api :: functionalities/optimized_code/TestNoASanExceptionAfterEvalOP_piece.py (1343 of 1914)
UNSUPPORTED: lldb-shell :: SymbolFile/PDB/calling-conventions-x86.test (1344 of 1914)
PASS: lldb-api :: commands/expression/import-std-module/vector-dbg-info-content/TestDbgInfoContentVectorFromStdModule.py (1345 of 1914)
PASS: lldb-shell :: SymbolFile/DWARF/x86/find-inline-method.s (1346 of 1914)
PASS: lldb-api :: commands/settings/TestSettings.py (1347 of 1914)
PASS: lldb-unit :: Utility/./UtilityTests/14/30 (1348 of 1914)
UNSUPPORTED: lldb-api :: android/platform/TestDefaultCacheLineSize.py (1349 of 1914)
PASS: lldb-api :: functionalities/breakpoint/consecutive_breakpoints/TestConsecutiveBreakpoints.py (1350 of 1914)
PASS: lldb-shell :: ObjectFile/PECOFF/export-dllfunc.yaml (1351 of 1914)
PASS: lldb-shell :: SymbolFile/DWARF/x86/debug_rnglists.s (1352 of 1914)
PASS: lldb-api :: qemu/TestQemuLaunch.py (1353 of 1914)
PASS: lldb-api :: functionalities/thread/concurrent_events/TestConcurrentTwoWatchpointsOneBreakpoint.py (1354 of 1914)
PASS: lldb-shell :: ScriptInterpreter/Python/Crashlog/parser_text.test (1355 of 1914)
PASS: lldb-unit :: Process/minidump/./LLDBMinidumpTests/3/17 (1356 of 1914)
PASS: lldb-api :: functionalities/inferior-changed/TestInferiorChanged.py (1357 of 1914)
PASS: lldb-api :: python_api/sbdata/TestSBData.py (1358 of 1914)
UNSUPPORTED: lldb-api :: functionalities/thread/state/TestThreadStates.py (1359 of 1914)
PASS: lldb-api :: functionalities/type_lookup/TestTypeLookup.py (1360 of 1914)
UNSUPPORTED: lldb-api :: api/multiple-targets/TestMultipleTargets.py (1361 of 1914)
PASS: lldb-unit :: Utility/./UtilityTests/1/30 (1362 of 1914)
PASS: lldb-api :: functionalities/data-formatter/data-formatter-stl/generic/set/TestDataFormatterGenericSet.py (1363 of 1914)
UNSUPPORTED: lldb-shell :: Subprocess/vfork-follow-parent-wp.test (1364 of 1914)
PASS: lldb-unit :: Language/Highlighting/./HighlighterTests/20/29 (1365 of 1914)
PASS: lldb-api :: functionalities/tail_call_frames/thread_step_out_or_return/TestSteppingOutWithArtificialFrames.py (1366 of 1914)
PASS: lldb-api :: functionalities/thread/concurrent_events/TestConcurrentSignalNWatchNBreak.py (1367 of 1914)
UNSUPPORTED: lldb-api :: functionalities/thread/thread_specific_break_plus_condition/TestThreadSpecificBpPlusCondition.py (1368 of 1914)
PASS: lldb-shell :: Minidump/memory-region-from-module.yaml (1369 of 1914)
PASS: lldb-unit :: Language/Highlighting/./HighlighterTests/14/29 (1370 of 1914)
PASS: lldb-unit :: Expression/./ExpressionTests/6/22 (1371 of 1914)
PASS: lldb-api :: functionalities/plugins/command_plugin/TestPluginCommands.py (1372 of 1914)
PASS: lldb-unit :: Language/Highlighting/./HighlighterTests/6/29 (1373 of 1914)
UNSUPPORTED: lldb-shell :: Subprocess/vfork-follow-child-softbp.test (1374 of 1914)
PASS: lldb-unit :: Target/./TargetTests/7/19 (1375 of 1914)
PASS: lldb-api :: functionalities/breakpoint/hardware_breakpoints/require_hw_breakpoints/TestRequireHWBreakpoints.py (1376 of 1914)
PASS: lldb-unit :: Process/Utility/./ProcessUtilityTests/6/16 (1377 of 1914)
PASS: lldb-shell :: Unwind/eh-frame-dwarf-unwind.test (1378 of 1914)
PASS: lldb-shell :: Quit/TestQuitExitCode-30.test (1379 of 1914)
PASS: lldb-api :: lang/cpp/symbols/TestSymbols.py (1380 of 1914)
UNSUPPORTED: lldb-api :: tools/lldb-vscode/disconnect/TestVSCode_disconnect.py (1381 of 1914)
PASS: lldb-api :: functionalities/data-formatter/data-formatter-stl/libcxx/string/TestDataFormatterLibcxxString.py (1382 of 1914)
UNSUPPORTED: lldb-api :: commands/trace/TestTraceSave.py (1383 of 1914)
PASS: lldb-api :: macosx/stack-corefile/TestStackCorefile.py (1384 of 1914)
PASS: lldb-api :: lang/cpp/class_types/TestClassTypes.py (1385 of 1914)
PASS: lldb-shell :: ObjectFile/PECOFF/dwarf-gnu-debuglink-pdb-buildid.yaml (1386 of 1914)
PASS: lldb-unit :: Process/Utility/./ProcessUtilityTests/12/16 (1387 of 1914)
UNSUPPORTED: lldb-api :: commands/register/register/aarch64_sve_registers/rw_access_dynamic_resize/TestSVEThreadedDynamic.py (1388 of 1914)
PASS: lldb-api :: macosx/duplicate-archive-members/TestDuplicateMembers.py (1389 of 1914)
UNSUPPORTED: lldb-api :: functionalities/data-formatter/data-formatter-stl/libstdcpp/string/TestDataFormatterStdString.py (1390 of 1914)
PASS: lldb-api :: lang/objc/radar-9691614/TestObjCMethodReturningBOOL.py (1391 of 1914)
PASS: lldb-api :: functionalities/dynamic_value_child_count/TestDynamicValueChildCount.py (1392 of 1914)
PASS: lldb-unit :: tools/lldb-server/tests/./LLDBServerTests/0/2 (1393 of 1914)
PASS: lldb-api :: commands/expression/function_template_specialization_temp_args/TestFunctionTemplateSpecializationTempArgs.py (1394 of 1914)
PASS: lldb-api :: functionalities/scripted_process/TestStackCoreScriptedProcess.py (1395 of 1914)
PASS: lldb-unit :: Language/Highlighting/./HighlighterTests/4/29 (1396 of 1914)
PASS: lldb-api :: lang/c/local_variables/TestLocalVariables.py (1397 of 1914)
PASS: lldb-unit :: ObjectFile/MachO/./ObjectFileMachOTests/0/2 (1398 of 1914)
PASS: lldb-api :: tools/lldb-server/memory-allocation/TestGdbRemoteMemoryAllocation.py (1399 of 1914)
UNSUPPORTED: lldb-api :: commands/gui/basicdebug/TestGuiBasicDebug.py (1400 of 1914)
PASS: lldb-api :: commands/expression/import-std-module/unique_ptr-dbg-info-content/TestUniquePtrDbgInfoContent.py (1401 of 1914)
PASS: lldb-api :: lang/objc/objc-foundation-dictionary-empty/TestNSDictionary0.py (1402 of 1914)
PASS: lldb-api :: functionalities/data-formatter/summary-string-onfail/Test-rdar-9974002.py (1403 of 1914)
PASS: lldb-unit :: Disassembler/x86/./GetControlFlowKindx86Tests/0/1 (1404 of 1914)
PASS: lldb-unit :: Process/gdb-remote/./ProcessGdbRemoteTests/17/19 (1405 of 1914)
PASS: lldb-shell :: SymbolFile/DWARF/x86/dir-separator-no-comp-dir.s (1406 of 1914)
PASS: lldb-api :: functionalities/data-formatter/data-formatter-objc/TestDataFormatterObjCNSData.py (1407 of 1914)
PASS: lldb-shell :: SymbolFile/DWARF/x86/dwarf5_tu_index_abbrev_offset.s (1408 of 1914)
PASS: lldb-api :: commands/session/save/TestSessionSave.py (1409 of 1914)
PASS: lldb-unit :: SymbolFile/DWARF/./SymbolFileDWARFTests/25/29 (1410 of 1914)
PASS: lldb-api :: macosx/macCatalyst/TestMacCatalyst.py (1411 of 1914)
PASS: lldb-api :: functionalities/data-formatter/data-formatter-skip-summary/TestDataFormatterSkipSummary.py (1412 of 1914)
UNSUPPORTED: lldb-api :: linux/aarch64/unwind_signal/TestUnwindSignal.py (1413 of 1914)
XFAIL: lldb-shell :: Expr/nodefaultlib.cpp (1414 of 1914)
PASS: lldb-shell :: ObjectFile/PDB/object.test (1415 of 1914)
UNSUPPORTED: lldb-api :: tools/lldb-server/TestGdbRemoteCompletion.py (1416 of 1914)
PASS: lldb-unit :: Target/./TargetTests/3/19 (1417 of 1914)
PASS: lldb-api :: test_utils/base/TestBaseTest.py (1418 of 1914)
PASS: lldb-shell :: Driver/TestFile.test (1419 of 1914)
PASS: lldb-api :: commands/source/info/TestSourceInfo.py (1420 of 1914)
UNSUPPORTED: lldb-api :: functionalities/data-formatter/data-formatter-stl/libstdcpp/vbool/TestDataFormatterStdVBool.py (1421 of 1914)
PASS: lldb-unit :: Process/gdb-remote/./ProcessGdbRemoteTests/13/19 (1422 of 1914)
PASS: lldb-api :: lang/c/offsetof/TestOffsetof.py (1423 of 1914)
PASS: lldb-api :: lang/c/blocks/TestBlocks.py (1424 of 1914)
PASS: lldb-unit :: Core/./LLDBCoreTests/19/23 (1425 of 1914)
PASS: lldb-unit :: Editline/./EditlineTests/1/2 (1426 of 1914)
PASS: lldb-api :: qemu/TestQemuAPI.py (1427 of 1914)
PASS: lldb-shell :: Commands/command-target-modules-dump-sections.yaml (1428 of 1914)
UNSUPPORTED: lldb-shell :: Register/aarch64-fp-read.test (1429 of 1914)
PASS: lldb-api :: lang/cpp/operator-overload/TestOperatorOverload.py (1430 of 1914)
PASS: lldb-api :: commands/expression/import_builtin_fileid/TestImportBuiltinFileID.py (1431 of 1914)
UNSUPPORTED: lldb-api :: functionalities/process_save_core_minidump/TestProcessSaveCoreMinidump.py (1432 of 1914)
PASS: lldb-api :: tools/lldb-server/register-reading/TestGdbRemoteGPacket.py (1433 of 1914)
PASS: lldb-api :: functionalities/breakpoint/step_over_breakpoint/TestStepOverBreakpoint.py (1434 of 1914)
PASS: lldb-unit :: Process/Utility/./ProcessUtilityTests/14/16 (1435 of 1914)
UNSUPPORTED: lldb-shell :: ScriptInterpreter/Lua/convenience_variables.test (1436 of 1914)
PASS: lldb-unit :: Process/Utility/./ProcessUtilityTests/0/16 (1437 of 1914)
XFAIL: lldb-api :: lang/objc/objc-dynamic-value/TestObjCDynamicValue.py (1438 of 1914)
PASS: lldb-unit :: Symbol/./SymbolTests/9/16 (1439 of 1914)
PASS: lldb-api :: functionalities/data-formatter/builtin-formats/TestBuiltinFormats.py (1440 of 1914)
PASS: lldb-api :: functionalities/gdb_remote_client/TestStopPCs.py (1441 of 1914)
PASS: lldb-api :: functionalities/history/TestHistoryRecall.py (1442 of 1914)
PASS: lldb-unit :: Utility/./UtilityTests/25/30 (1443 of 1914)
PASS: lldb-api :: functionalities/rerun/TestRerun.py (1444 of 1914)
PASS: lldb-api :: tools/lldb-server/commandline/TestStubSetSID.py (1445 of 1914)
PASS: lldb-unit :: Expression/./ExpressionTests/19/22 (1446 of 1914)
PASS: lldb-shell :: Commands/command-regex-unalias.test (1447 of 1914)
PASS: lldb-api :: functionalities/gdb_remote_client/TestqOffsets.py (1448 of 1914)
PASS: lldb-api :: lang/cpp/typedef/TestCppTypedef.py (1449 of 1914)
PASS: lldb-unit :: ScriptInterpreter/Python/./ScriptInterpreterPythonTests/1/19 (1450 of 1914)
PASS: lldb-api :: functionalities/data-formatter/nsdictionarysynth/TestNSDictionarySynthetic.py (1451 of 1914)
PASS: lldb-api :: functionalities/data-formatter/hexcaps/TestDataFormatterHexCaps.py (1452 of 1914)
PASS: lldb-shell :: ObjectFile/ELF/minidebuginfo-find-symbols.yaml (1453 of 1914)
PASS: lldb-api :: functionalities/gdb_remote_client/TestGDBRemoteLoad.py (1454 of 1914)
PASS: lldb-api :: macosx/dyld-trie-symbols/TestDyldTrieSymbols.py (1455 of 1914)
PASS: lldb-api :: lang/c/set_values/TestSetValues.py (1456 of 1914)
UNSUPPORTED: lldb-api :: functionalities/thread/concurrent_events/TestConcurrentManySignals.py (1457 of 1914)
PASS: lldb-shell :: SymbolFile/NativePDB/globals-bss.cpp (1458 of 1914)
PASS: lldb-api :: functionalities/module_cache/debug_index/TestDebugIndexCache.py (1459 of 1914)
PASS: lldb-unit :: API/./APITests/2/3 (1460 of 1914)
PASS: lldb-shell :: ObjectFile/ELF/build-id-case.yaml (1461 of 1914)
PASS: lldb-api :: python_api/sbplatform/TestSBPlatform.py (1462 of 1914)
PASS: lldb-unit :: Process/minidump/./LLDBMinidumpTests/8/17 (1463 of 1914)
XFAIL: lldb-shell :: Register/x86-64-fp-read.test (1464 of 1914)
PASS: lldb-api :: functionalities/data-formatter/setvaluefromcstring/TestSetValueFromCString.py (1465 of 1914)
PASS: lldb-shell :: SymbolFile/NativePDB/break-by-line.cpp (1466 of 1914)
PASS: lldb-api :: commands/expression/context-object-objc/TestContextObjectObjc.py (1467 of 1914)
PASS: lldb-unit :: Expression/./ExpressionTests/11/22 (1468 of 1914)
UNSUPPORTED: lldb-shell :: SymbolFile/NativePDB/stack_unwinding01.cpp (1469 of 1914)
PASS: lldb-unit :: Utility/./UtilityTests/12/30 (1470 of 1914)
PASS: lldb-api :: functionalities/gdb_remote_client/TestThreadSelectionBug.py (1471 of 1914)
PASS: lldb-api :: commands/expression/call-function/TestCallUserDefinedFunction.py (1472 of 1914)
PASS: lldb-api :: lang/cpp/stl/TestStdCXXDisassembly.py (1473 of 1914)
PASS: lldb-api :: commands/expression/argument_passing_restrictions/TestArgumentPassingRestrictions.py (1474 of 1914)
PASS: lldb-unit :: Process/gdb-remote/./ProcessGdbRemoteTests/7/19 (1475 of 1914)
PASS: lldb-api :: lang/objc/cpp_keyword_identifiers/TestCppKeywordsAsObjCIdentifiers.py (1476 of 1914)
PASS: lldb-shell :: SymbolFile/DWARF/x86/inline-function-address.ll (1477 of 1914)
PASS: lldb-shell :: Breakpoint/case-sensitive.test (1478 of 1914)
PASS: lldb-api :: commands/expression/persist_objc_pointeetype/TestPersistObjCPointeeType.py (1479 of 1914)
UNSUPPORTED: lldb-api :: commands/gui/expand-threads-tree/TestGuiExpandThreadsTree.py (1480 of 1914)
PASS: lldb-shell :: Reproducer/TestFileRepro.test (1481 of 1914)
PASS: lldb-api :: types/TestFloatTypes.py (1482 of 1914)
PASS: lldb-api :: types/TestShortType.py (1483 of 1914)
UNSUPPORTED: lldb-api :: linux/aarch64/mte_core_file/TestAArch64LinuxMTEMemoryTagCoreFile.py (1484 of 1914)
UNSUPPORTED: lldb-api :: commands/gui/breakpoints/TestGuiBreakpoints.py (1485 of 1914)
PASS: lldb-api :: lang/c/register_variables/TestRegisterVariables.py (1486 of 1914)
PASS: lldb-unit :: SymbolFile/DWARF/./SymbolFileDWARFTests/23/29 (1487 of 1914)
PASS: lldb-shell :: Commands/command-disassemble.s (1488 of 1914)
PASS: lldb-unit :: Target/./TargetTests/9/19 (1489 of 1914)
PASS: lldb-shell :: SymbolFile/Breakpad/inline-record.test (1490 of 1914)
PASS: lldb-unit :: DataFormatter/./LLDBFormatterTests/10/11 (1491 of 1914)
UNSUPPORTED: lldb-shell :: Register/x86-zmm-write.test (1492 of 1914)
PASS: lldb-shell :: SymbolFile/NativePDB/globals-fundamental.cpp (1493 of 1914)
PASS: lldb-api :: lang/objc/objc-super/TestObjCSuper.py (1494 of 1914)
UNSUPPORTED: lldb-shell :: SymbolFile/DWARF/dwo-relative-path.s (1495 of 1914)
PASS: lldb-unit :: UnwindAssembly/x86/./UnwindAssemblyx86Tests/4/27 (1496 of 1914)
PASS: lldb-unit :: Process/gdb-remote/./ProcessGdbRemoteTests/6/19 (1497 of 1914)
PASS: lldb-shell :: Commands/command-stop-hook-no-target.test (1498 of 1914)
PASS: lldb-api :: macosx/lc-note/firmware-corefile/TestFirmwareCorefiles.py (1499 of 1914)
PASS: lldb-shell :: Settings/TestSettingsSet.test (1500 of 1914)
PASS: lldb-api :: commands/watchpoints/watchpoint_events/TestWatchpointEvents.py (1501 of 1914)
PASS: lldb-shell :: Register/Core/x86-64-netbsd-addr.test (1502 of 1914)
PASS: lldb-api :: functionalities/tail_call_frames/ambiguous_tail_call_seq1/TestAmbiguousTailCallSeq1.py (1503 of 1914)
PASS: lldb-api :: tools/lldb-vscode/breakpoint/TestVSCode_setBreakpoints.py (1504 of 1914)
UNSUPPORTED: lldb-shell :: Register/x86-zmm-read.test (1505 of 1914)
PASS: lldb-api :: functionalities/breakpoint/serialize/TestBreakpointSerialization.py (1506 of 1914)
PASS: lldb-api :: lang/c/forward/TestForwardDeclaration.py (1507 of 1914)
UNSUPPORTED: lldb-api :: benchmarks/startup/TestStartupDelays.py (1508 of 1914)
PASS: lldb-unit :: Interpreter/./InterpreterTests/11/14 (1509 of 1914)
PASS: lldb-shell :: SymbolFile/NativePDB/disassembly.cpp (1510 of 1914)
UNSUPPORTED: lldb-api :: functionalities/longjmp/TestLongjmp.py (1511 of 1914)
PASS: lldb-api :: commands/platform/basic/TestPlatformCommand.py (1512 of 1914)
PASS: lldb-unit :: SymbolFile/NativePDB/./SymbolFileNativePDBTests/9/15 (1513 of 1914)
PASS: lldb-api :: commands/expression/import-std-module/empty-module/TestEmptyStdModule.py (1514 of 1914)
PASS: lldb-shell :: SymbolFile/DWARF/x86/split-dwarf-multiple-cu.ll (1515 of 1914)
UNSUPPORTED: lldb-api :: iohandler/stdio/TestIOHandlerProcessSTDIO.py (1516 of 1914)
PASS: lldb-api :: commands/frame/var-scope/TestFrameVariableScope.py (1517 of 1914)
PASS: lldb-unit :: UnwindAssembly/x86/./UnwindAssemblyx86Tests/7/27 (1518 of 1914)
PASS: lldb-api :: lang/objc/objc-static-method-stripped/TestObjCStaticMethodStripped.py (1519 of 1914)
UNSUPPORTED: lldb-api :: iohandler/unicode/TestUnicode.py (1520 of 1914)
PASS: lldb-api :: python_api/process/io/TestProcessIO.py (1521 of 1914)
PASS: lldb-shell :: SymbolFile/DWARF/x86/DW_TAG_variable-DW_AT_const_value.s (1522 of 1914)
PASS: lldb-api :: functionalities/data-formatter/data-formatter-advanced/TestDataFormatterAdv.py (1523 of 1914)
UNSUPPORTED: lldb-api :: functionalities/ptrauth_diagnostics/BLRAA_error/TestPtrauthBLRAADiagnostic.py (1524 of 1914)
PASS: lldb-api :: tools/lldb-server/TestGdbRemoteSingleStep.py (1525 of 1914)
PASS: lldb-unit :: Language/Highlighting/./HighlighterTests/24/29 (1526 of 1914)
PASS: lldb-shell :: Register/Core/x86-32-netbsd-gp.test (1527 of 1914)
PASS: lldb-unit :: ObjectFile/MachO/./ObjectFileMachOTests/1/2 (1528 of 1914)
PASS: lldb-api :: commands/expression/import-std-module/forward_list/TestForwardListFromStdModule.py (1529 of 1914)
PASS: lldb-shell :: Settings/TestEchoCommands.test (1530 of 1914)
PASS: lldb-api :: lang/objc/print-obj/TestPrintObj.py (1531 of 1914)
PASS: lldb-api :: python_api/function_symbol/TestSymbolAPI.py (1532 of 1914)
PASS: lldb-api :: commands/expression/expr-in-syscall/TestExpressionInSyscall.py (1533 of 1914)
UNSUPPORTED: lldb-api :: commands/trace/TestTraceTSC.py (1534 of 1914)
PASS: lldb-unit :: Breakpoint/./LLDBBreakpointTests/0/1 (1535 of 1914)
PASS: lldb-api :: functionalities/process_group/TestChangeProcessGroup.py (1536 of 1914)
PASS: lldb-api :: lang/cpp/llvm-style/TestLLVMStyle.py (1537 of 1914)
PASS: lldb-unit :: ScriptInterpreter/Python/./ScriptInterpreterPythonTests/15/19 (1538 of 1914)
PASS: lldb-unit :: Language/CLanguages/./LanguageCLanguagesTests/0/1 (1539 of 1914)
PASS: lldb-api :: functionalities/breakpoint/address_breakpoints/TestBadAddressBreakpoints.py (1540 of 1914)
PASS: lldb-api :: functionalities/gdb_remote_client/TestPty.py (1541 of 1914)
PASS: lldb-unit :: ObjectFile/Breakpad/./ObjectFileBreakpadTests/5/11 (1542 of 1914)
PASS: lldb-shell :: Unwind/thread-step-out-ret-addr-check.test (1543 of 1914)
PASS: lldb-shell :: Register/Core/x86-32-netbsd-multithread.test (1544 of 1914)
PASS: lldb-shell :: Driver/TestQuiet.test (1545 of 1914)
PASS: lldb-api :: commands/platform/basic/TestPlatformPython.py (1546 of 1914)
PASS: lldb-api :: commands/version/TestVersion.py (1547 of 1914)
PASS: lldb-unit :: debugserver/./debugserverTests/4/6 (1548 of 1914)
PASS: lldb-shell :: SymbolFile/NativePDB/locate-pdb.cpp (1549 of 1914)
PASS: lldb-unit :: Process/Utility/./ProcessUtilityTests/8/16 (1550 of 1914)
PASS: lldb-unit :: Utility/./UtilityTests/6/30 (1551 of 1914)
PASS: lldb-api :: functionalities/data-formatter/data-formatter-stl/libcxx/shared_ptr/TestDataFormatterLibcxxSharedPtr.py (1552 of 1914)
PASS: lldb-api :: functionalities/thread/concurrent_events/TestConcurrentWatchpointDelayWatchpointOneBreakpoint.py (1553 of 1914)
PASS: lldb-unit :: Utility/./UtilityTests/22/30 (1554 of 1914)
PASS: lldb-shell :: SymbolFile/add-dsym.test (1555 of 1914)
PASS: lldb-unit :: SymbolFile/NativePDB/./SymbolFileNativePDBTests/0/15 (1556 of 1914)
PASS: lldb-shell :: SymbolFile/DWARF/x86/dir-separator-posix.s (1557 of 1914)
PASS: lldb-shell :: Heap/heap-cstr.test (1558 of 1914)
PASS: lldb-unit :: ObjectFile/PECOFF/./ObjectFilePECOFFTests/2/3 (1559 of 1914)
PASS: lldb-unit :: UnwindAssembly/x86/./UnwindAssemblyx86Tests/12/27 (1560 of 1914)
PASS: lldb-api :: functionalities/stop-on-sharedlibrary-load/TestStopOnSharedlibraryEvents.py (1561 of 1914)
PASS: lldb-api :: functionalities/data-formatter/data-formatter-stl/libcxx/queue/TestDataFormatterLibcxxQueue.py (1562 of 1914)
PASS: lldb-shell :: ObjectFile/wasm/unified-debug-sections.yaml (1563 of 1914)
UNSUPPORTED: lldb-api :: functionalities/process_save_core/TestProcessSaveCore.py (1564 of 1914)
PASS: lldb-api :: lang/cpp/dynamic-value-same-basename/TestDynamicValueSameBase.py (1565 of 1914)
PASS: lldb-api :: commands/process/handle/TestProcessHandle.py (1566 of 1914)
UNSUPPORTED: lldb-api :: commands/expression/multiline-completion/TestMultilineCompletion.py (1567 of 1914)
PASS: lldb-api :: functionalities/gdb_remote_client/TestIOSSimulator.py (1568 of 1914)
PASS: lldb-unit :: Host/./HostTests/8/19 (1569 of 1914)
PASS: lldb-api :: lang/cpp/crtp/TestCppCRTP.py (1570 of 1914)
PASS: lldb-api :: lang/cpp/accelerator-table/TestCPPAccelerator.py (1571 of 1914)
PASS: lldb-unit :: ObjectFile/Breakpad/./ObjectFileBreakpadTests/7/11 (1572 of 1914)
PASS: lldb-api :: python_api/lldbutil/process/TestPrintStackTraces.py (1573 of 1914)
PASS: lldb-api :: commands/expression/test/TestExprs2.py (1574 of 1914)
PASS: lldb-api :: lang/objcxx/objcxx-ivar-vector/TestIvarVector.py (1575 of 1914)
PASS: lldb-api :: python_api/watchpoint/TestSetWatchpoint.py (1576 of 1914)
PASS: lldb-api :: driver/batch_mode/TestBatchMode.py (1577 of 1914)
PASS: lldb-shell :: Register/Core/x86-64-linux-gp.test (1578 of 1914)
PASS: lldb-api :: lang/objc/objc_direct-methods/TestObjCDirectMethods.py (1579 of 1914)
PASS: lldb-api :: lang/objc/objc-baseclass-sbtype/TestObjCBaseClassSBType.py (1580 of 1914)
PASS: lldb-api :: lang/objc/modules-non-objc-target/TestObjCModulesNonObjCTarget.py (1581 of 1914)
PASS: lldb-unit :: UnwindAssembly/x86/./UnwindAssemblyx86Tests/26/27 (1582 of 1914)
PASS: lldb-shell :: SymbolFile/DWARF/x86/win-i386-line-table.s (1583 of 1914)
PASS: lldb-shell :: ObjectFile/ELF/aarch64-relocations.yaml (1584 of 1914)
PASS: lldb-unit :: Core/./LLDBCoreTests/1/23 (1585 of 1914)
PASS: lldb-api :: arm/emulation/TestEmulations.py (1586 of 1914)
UNSUPPORTED: lldb-api :: benchmarks/expression/TestExpressionCmd.py (1587 of 1914)
PASS: lldb-api :: commands/command/source/TestCommandSource.py (1588 of 1914)
PASS: lldb-api :: functionalities/breakpoint/dummy_target_breakpoints/TestBreakpointsWithNoTargets.py (1589 of 1914)
UNSUPPORTED: lldb-shell :: ScriptInterpreter/Lua/persistent_state.test (1590 of 1914)
UNSUPPORTED: lldb-api :: repl/clang/TestClangREPL.py (1591 of 1914)
PASS: lldb-unit :: SymbolFile/DWARF/./SymbolFileDWARFTests/27/29 (1592 of 1914)
UNSUPPORTED: lldb-shell :: Register/x86-ymm-write.test (1593 of 1914)
PASS: lldb-unit :: SymbolFile/DWARF/./SymbolFileDWARFTests/4/29 (1594 of 1914)
PASS: lldb-shell :: SymbolFile/DWARF/x86/debug_loclists-dwp.s (1595 of 1914)
PASS: lldb-api :: functionalities/inline-stepping/TestInlineStepping.py (1596 of 1914)
UNSUPPORTED: lldb-shell :: Minidump/Windows/arm-fp-unwind.test (1597 of 1914)
UNSUPPORTED: lldb-api :: macosx/simulator/TestSimulatorPlatform.py (1598 of 1914)
PASS: lldb-api :: functionalities/gdb_remote_client/TestMemoryRegionDirtyPages.py (1599 of 1914)
PASS: lldb-api :: lang/cpp/alignas_base_class/TestAlignAsBaseClass.py (1600 of 1914)
PASS: lldb-unit :: Expression/./ExpressionTests/20/22 (1601 of 1914)
PASS: lldb-api :: lang/objc/modules-hash-mismatch/TestClangModulesHashMismatch.py (1602 of 1914)
PASS: lldb-unit :: Expression/./ExpressionTests/12/22 (1603 of 1914)
UNSUPPORTED: lldb-shell :: SymbolFile/PDB/expressions.test (1604 of 1914)
PASS: lldb-shell :: Minidump/Windows/find-module.test (1605 of 1914)
PASS: lldb-shell :: Register/Core/x86-64-netbsd-gp.test (1606 of 1914)
PASS: lldb-api :: lang/objc/orderedset/TestOrderedSet.py (1607 of 1914)
PASS: lldb-api :: functionalities/data-formatter/dump_dynamic/TestDumpDynamic.py (1608 of 1914)
PASS: lldb-unit :: Platform/./LLDBPlatformTests/11/16 (1609 of 1914)
PASS: lldb-unit :: Process/gdb-remote/./ProcessGdbRemoteTests/8/19 (1610 of 1914)
PASS: lldb-api :: functionalities/data-formatter/data-formatter-ptr-to-array/TestPtrToArrayFormatting.py (1611 of 1914)
UNSUPPORTED: lldb-shell :: SymbolFile/PDB/ast-restore.test (1612 of 1914)
PASS: lldb-unit :: Expression/./ExpressionTests/9/22 (1613 of 1914)
PASS: lldb-unit :: Utility/./UtilityTests/3/30 (1614 of 1914)
PASS: lldb-shell :: Quit/TestQuitExitCodeImplicit0.test (1615 of 1914)
PASS: lldb-api :: functionalities/tail_call_frames/disambiguate_tail_call_seq/TestDisambiguateTailCallSeq.py (1616 of 1914)
PASS: lldb-unit :: Language/Highlighting/./HighlighterTests/26/29 (1617 of 1914)
PASS: lldb-api :: lang/objc/objc++/TestObjCXX.py (1618 of 1914)
PASS: lldb-unit :: Thread/./ThreadTests/0/2 (1619 of 1914)
PASS: lldb-api :: lang/objc/real-definition/TestRealDefinition.py (1620 of 1914)
PASS: lldb-api :: python_api/section/TestSectionAPI.py (1621 of 1914)
PASS: lldb-api :: tools/lldb-vscode/correct-thread/TestVSCode_correct_thread.py (1622 of 1914)
PASS: lldb-api :: api/multiple-debuggers/TestMultipleDebuggers.py (1623 of 1914)
PASS: lldb-api :: commands/watchpoints/multiple_threads/TestWatchpointMultipleThreads.py (1624 of 1914)
PASS: lldb-api :: commands/target/stop-hook/enable/TestTargetStopHookEnable.py (1625 of 1914)
PASS: lldb-api :: lang/cpp/covariant-return-types/TestCovariantReturnTypes.py (1626 of 1914)
PASS: lldb-api :: lang/cpp/call-function/TestCallCPPFunction.py (1627 of 1914)
PASS: lldb-unit :: SymbolFile/NativePDB/./SymbolFileNativePDBTests/4/15 (1628 of 1914)
PASS: lldb-api :: lang/cpp/bool/TestCPPBool.py (1629 of 1914)
PASS: lldb-api :: functionalities/data-formatter/data-formatter-synth/TestDataFormatterSynth.py (1630 of 1914)
PASS: lldb-api :: tools/lldb-vscode/module/TestVSCode_module.py (1631 of 1914)
PASS: lldb-api :: functionalities/data-formatter/data-formatter-objc/TestDataFormatterObjCNSURL.py (1632 of 1914)
UNSUPPORTED: lldb-api :: tools/lldb-server/libraries-svr4/TestGdbRemoteLibrariesSvr4Support.py (1633 of 1914)
PASS: lldb-unit :: Expression/./ExpressionTests/21/22 (1634 of 1914)
UNSUPPORTED: lldb-shell :: ScriptInterpreter/Lua/partial_statements.test (1635 of 1914)
PASS: lldb-api :: functionalities/thread/concurrent_events/TestConcurrentBreakpointsDelayedBreakpointOneWatchpoint.py (1636 of 1914)
PASS: lldb-unit :: SymbolFile/DWARF/./SymbolFileDWARFTests/10/29 (1637 of 1914)
PASS: lldb-api :: commands/expression/result_numbering/TestResultNumbering.py (1638 of 1914)
PASS: lldb-unit :: Symbol/./SymbolTests/2/16 (1639 of 1914)
PASS: lldb-api :: iohandler/resize/TestIOHandlerResizeNoEditline.py (1640 of 1914)
PASS: lldb-unit :: Target/./TargetTests/11/19 (1641 of 1914)
PASS: lldb-unit :: Expression/./ExpressionTests/17/22 (1642 of 1914)
PASS: lldb-api :: functionalities/thread/concurrent_events/TestConcurrentBreakpointOneDelayBreakpointThreads.py (1643 of 1914)
TIMEOUT: lldb-api :: functionalities/memory-region/TestMemoryRegion.py (1644 of 1914)
******************** TEST 'lldb-api :: functionalities/memory-region/TestMemoryRegion.py' FAILED ********************
Script:
--
/Applications/Xcode.app/Contents/Developer/Library/Frameworks/Python3.framework/Versions/3.8/Resources/Python.app/Contents/MacOS/Python /Users/buildslave/jenkins/workspace/lldb-cmake-sanitized/llvm-project/lldb/test/API/dotest.py -u CXXFLAGS -u CFLAGS --codesign-identity lldb_codesign --arch x86_64 --build-dir /Users/buildslave/jenkins/workspace/lldb-cmake-sanitized/lldb-build/lldb-test-build.noindex -t --env TERM=vt100 --env LLVM_LIBS_DIR=/Users/buildslave/jenkins/workspace/lldb-cmake-sanitized/lldb-build/./lib --env LLVM_INCLUDE_DIR=/Users/buildslave/jenkins/workspace/lldb-cmake-sanitized/lldb-build/include --env LLVM_TOOLS_DIR=/Users/buildslave/jenkins/workspace/lldb-cmake-sanitized/lldb-build/./bin --hermetic-libcxx --inferior-env ASAN_OPTIONS=detect_stack_use_after_return=1 --inferior-env DYLD_INSERT_LIBRARIES=/Users/buildslave/jenkins/workspace/lldb-cmake-sanitized/host-compiler/lib/clang/15.0.99/lib/darwin/libclang_rt.asan_osx_dynamic.dylib --arch x86_64 --build-dir /Users/buildslave/jenkins/workspace/lldb-cmake-sanitized/lldb-build/lldb-test-build.noindex --lldb-module-cache-dir /Users/buildslave/jenkins/workspace/lldb-cmake-sanitized/lldb-build/lldb-test-build.noindex/module-cache-lldb/lldb-api --clang-module-cache-dir /Users/buildslave/jenkins/workspace/lldb-cmake-sanitized/lldb-build/lldb-test-build.noindex/module-cache-clang/lldb-api --executable /Users/buildslave/jenkins/workspace/lldb-cmake-sanitized/lldb-build/./bin/lldb --compiler /Users/buildslave/jenkins/workspace/lldb-cmake-sanitized/host-compiler/bin/clang --dsymutil /Users/buildslave/jenkins/workspace/lldb-cmake-sanitized/lldb-build/./bin/dsymutil --llvm-tools-dir /Users/buildslave/jenkins/workspace/lldb-cmake-sanitized/lldb-build/./bin --lldb-libs-dir /Users/buildslave/jenkins/workspace/lldb-cmake-sanitized/lldb-build/./lib /Users/buildslave/jenkins/workspace/lldb-cmake-sanitized/llvm-project/lldb/test/API/functionalities/memory-region -p TestMemoryRegion.py
--
Exit Code: -9
Timeout: Reached timeout of 1200 seconds

Hide Details

Command Output (stdout): -- lldb version 16.0.99git (http://labmaster3.local/git/llvm-project.git revision d3580c2eb6ec95256a65ce7f66346351e9852eab) clang revision d3580c2eb6ec95256a65ce7f66346351e9852eab llvm revision d3580c2eb6ec95256a65ce7f66346351e9852eab

Hide Details

--

Hide Details

******************** PASS: lldb-api :: lang/cpp/inlines/TestInlines.py (1645 of 1914) PASS: lldb-api :: functionalities/data-formatter/language_category_updates/TestDataFormatterLanguageCategoryUpdates.py (1646 of 1914) PASS: lldb-api :: commands/expression/import-std-module/shared_ptr-dbg-info-content/TestSharedPtrDbgInfoContentFromStdModule.py (1647 of 1914) PASS: lldb-api :: commands/target/modules/search-paths/insert/TestTargetModulesSearchpathsInsert.py (1648 of 1914) PASS: lldb-unit :: Platform/./LLDBPlatformTests/13/16 (1649 of 1914) PASS: lldb-shell :: ObjectFile/PECOFF/invalid-export-table.yaml (1650 of 1914) PASS: lldb-unit :: ScriptInterpreter/Python/./ScriptInterpreterPythonTests/4/19 (1651 of 1914) PASS: lldb-api :: commands/reproducer/invalid-args/TestInvalidArgsReproducer.py (1652 of 1914) UNSUPPORTED: lldb-shell :: SymbolFile/PDB/variables.test (1653 of 1914) PASS: lldb-api :: python_api/get-value-32bit-int/TestGetValue32BitInt.py (1654 of 1914) PASS: lldb-api :: functionalities/thread/concurrent_events/TestConcurrentTwoBreakpointsOneWatchpoint.py (1655 of 1914) PASS: lldb-api :: python_api/value/linked_list/TestValueAPILinkedList.py (1656 of 1914) PASS: lldb-api :: python_api/name_lookup/TestNameLookup.py (1657 of 1914) PASS: lldb-shell :: SymbolFile/DWARF/x86/DW_TAG_basic_type_DW_ATE_UTF_nonC.ll (1658 of 1914) PASS: lldb-shell :: Minidump/memory-region.yaml (1659 of 1914) PASS: lldb-shell :: Expr/TestStringLiteralExpr.test (1660 of 1914) PASS: lldb-api :: functionalities/memory/tag/TestMemoryTag.py (1661 of 1914) PASS: lldb-api :: functionalities/set-data/TestSetData.py (1662 of 1914) XFAIL: lldb-api :: functionalities/thread/break_after_join/TestBreakAfterJoin.py (1663 of 1914) UNSUPPORTED: lldb-api :: benchmarks/libcxxlist/TestBenchmarkLibcxxList.py (1664 of 1914) UNSUPPORTED: lldb-api :: functionalities/ubsan/basic/TestUbsanBasic.py (1665 of 1914) PASS: lldb-api :: commands/expression/import-std-module/vector-bool/TestVectorBoolFromStdModule.py (1666 of 1914) PASS: lldb-api :: macosx/find-dsym/bundle-with-dot-in-filename/TestBundleWithDotInFilename.py (1667 of 1914) PASS: lldb-api :: commands/process/launch/TestProcessLaunch.py (1668 of 1914) PASS: lldb-api :: commands/expression/import-std-module/missing-module-sources/TestStdModuleSourcesMissing.py (1669 of 1914) PASS: lldb-api :: lang/objc/blocks/TestObjCIvarsInBlocks.py (1670 of 1914) UNSUPPORTED: lldb-shell :: ScriptInterpreter/Lua/nested_sessions.test (1671 of 1914) PASS: lldb-shell :: SymbolFile/DWARF/x86/find-variable-dwo.cpp (1672 of 1914) PASS: lldb-unit :: Symbol/./SymbolTests/0/16 (1673 of 1914) PASS: lldb-api :: commands/expression/import-std-module/weak_ptr-dbg-info-content/TestDbgInfoContentWeakPtrFromStdModule.py (1674 of 1914) UNSUPPORTED: lldb-shell :: Subprocess/vfork-follow-parent-softbp.test (1675 of 1914) PASS: lldb-api :: functionalities/gdb_remote_client/TestNestedRegDefinitions.py (1676 of 1914) PASS: lldb-unit :: Process/Utility/./ProcessUtilityTests/11/16 (1677 of 1914) PASS: lldb-unit :: Language/Highlighting/./HighlighterTests/17/29 (1678 of 1914) UNSUPPORTED: lldb-api :: functionalities/thread/main_thread_exit/TestMainThreadExit.py (1679 of 1914) PASS: lldb-api :: functionalities/breakpoint/breakpoint_options/TestBreakpointOptions.py (1680 of 1914) PASS: lldb-api :: functionalities/data-formatter/data-formatter-stl/generic/bitset/TestDataFormatterGenericBitset.py (1681 of 1914) PASS: lldb-api :: functionalities/data-formatter/data-formatter-named-summaries/TestDataFormatterNamedSummaries.py (1682 of 1914) PASS: lldb-api :: functionalities/data-formatter/data-formatter-cpp/TestDataFormatterCpp.py (1683 of 1914) UNSUPPORTED: lldb-shell :: SymbolFile/DWARF/split-dwarf-expression-eval-bug.cpp (1684 of 1914) PASS: lldb-unit :: Utility/./UtilityTests/15/30 (1685 of 1914) PASS: lldb-api :: functionalities/thread/concurrent_events/TestConcurrentCrashWithWatchpoint.py (1686 of 1914) PASS: lldb-api :: python_api/sbvalue_persist/TestSBValuePersist.py (1687 of 1914) UNSUPPORTED: lldb-api :: iohandler/resize/TestIOHandlerResize.py (1688 of 1914) PASS: lldb-shell :: SymbolFile/DWARF/x86/debug_line-tombstone.s (1689 of 1914) PASS: lldb-api :: functionalities/reproducers/fs-case-sensitivity/TestReproducerFSCaseSensitivity.py (1690 of 1914) PASS: lldb-api :: commands/expression/import-std-module/no-std-module/TestMissingStdModule.py (1691 of 1914) PASS: lldb-api :: functionalities/unwind/sigtramp/TestSigtrampUnwind.py (1692 of 1914) PASS: lldb-api :: tools/lldb-vscode/variables/TestVSCode_variables.py (1693 of 1914) PASS: lldb-unit :: Thread/./ThreadTests/1/2 (1694 of 1914) PASS: lldb-api :: lang/cpp/modules-import/TestCXXModulesImport.py (1695 of 1914) PASS: lldb-api :: functionalities/data-formatter/data-formatter-stl/libcxx/map/TestDataFormatterLibccMap.py (1696 of 1914) PASS: lldb-api :: commands/expression/import-std-module/non-module-type-separation/TestNonModuleTypeSeparation.py (1697 of 1914) UNSUPPORTED: lldb-shell :: ScriptInterpreter/Lua/quit.test (1698 of 1914) PASS: lldb-api :: commands/expression/static-initializers/TestStaticInitializers.py (1699 of 1914) PASS: lldb-api :: lang/objc/modules/TestObjCModules.py (1700 of 1914) UNSUPPORTED: lldb-api :: commands/register/register/aarch64_sve_registers/rw_access_static_config/TestSVERegisters.py (1701 of 1914) PASS: lldb-api :: functionalities/breakpoint/breakpoint_language/TestBreakpointLanguage.py (1702 of 1914) PASS: lldb-api :: commands/expression/completion/TestExprCompletion.py (1703 of 1914) PASS: lldb-api :: python_api/breakpoint/TestBreakpointAPI.py (1704 of 1914) UNSUPPORTED: lldb-api :: tools/lldb-server/vCont-threads/TestPartialResume.py (1705 of 1914) PASS: lldb-shell :: ExecControl/StopHook/stop-hook.test (1706 of 1914) PASS: lldb-api :: functionalities/step-avoids-no-debug/TestStepNoDebug.py (1707 of 1914) UNSUPPORTED: lldb-api :: linux/add-symbols/TestTargetSymbolsAddCommand.py (1708 of 1914) PASS: lldb-api :: commands/expression/class_template_specialization_empty_pack/TestClassTemplateSpecializationParametersHandling.py (1709 of 1914) PASS: lldb-shell :: SymbolFile/DWARF/x86/find-method-local-struct.cpp (1710 of 1914) PASS: lldb-api :: functionalities/diagnostic_reporting/TestDiagnosticReporting.py (1711 of 1914) PASS: lldb-unit :: Process/gdb-remote/./ProcessGdbRemoteTests/2/19 (1712 of 1914) PASS: lldb-api :: commands/expression/vector_of_enums/TestVectorOfEnums.py (1713 of 1914) UNSUPPORTED: lldb-shell :: SymbolFile/NativePDB/inline_sites_live.cpp (1714 of 1914) PASS: lldb-api :: commands/watchpoints/watchpoint_count/TestWatchpointCount.py (1715 of 1914) PASS: lldb-shell :: Driver/TestTarget.test (1716 of 1914) PASS: lldb-shell :: Unwind/trap_frame_sym_ctx.test (1717 of 1914) PASS: lldb-api :: commands/expression/radar_9673664/TestExprHelpExamples.py (1718 of 1914) PASS: lldb-unit :: UnwindAssembly/x86/./UnwindAssemblyx86Tests/22/27 (1719 of 1914) PASS: lldb-shell :: ScriptInterpreter/Python/sb_address_exception.test (1720 of 1914) PASS: lldb-api :: commands/frame/diagnose/virtual-method-call/TestDiagnoseDereferenceVirtualMethodCall.py (1721 of 1914) PASS: lldb-shell :: SymbolFile/DWARF/x86/dead-code-filtering.yaml (1722 of 1914) PASS: lldb-shell :: SymbolFile/NativePDB/find-functions.cpp (1723 of 1914) PASS: lldb-shell :: ObjectFile/MachO/lc_build_version_notools.yaml (1724 of 1914) PASS: lldb-api :: python_api/sberror/TestSBError.py (1725 of 1914) PASS: lldb-shell :: ObjectFile/ELF/many-sections.s (1726 of 1914) PASS: lldb-unit :: ObjectFile/PECOFF/./ObjectFilePECOFFTests/1/3 (1727 of 1914) PASS: lldb-unit :: Host/./HostTests/12/19 (1728 of 1914) PASS: lldb-unit :: UnwindAssembly/x86/./UnwindAssemblyx86Tests/11/27 (1729 of 1914) PASS: lldb-api :: lang/c/complex_int/TestComplexInt.py (1730 of 1914) UNSUPPORTED: lldb-shell :: Subprocess/clone-follow-parent.test (1731 of 1914) PASS: lldb-api :: commands/watchpoints/hello_watchlocation/TestWatchLocation.py (1732 of 1914) UNSUPPORTED: lldb-shell :: Register/x86-64-xmm16-write.test (1733 of 1914) PASS: lldb-unit :: Language/CPlusPlus/./LanguageCPlusPlusTests/1/5 (1734 of 1914) PASS: lldb-api :: sample_test/TestSampleTest.py (1735 of 1914) PASS: lldb-api :: commands/settings/quoting/TestQuoting.py (1736 of 1914) PASS: lldb-shell :: ObjectFile/ELF/riscv-arch.yaml (1737 of 1914) PASS: lldb-api :: tools/lldb-server/thread-name/TestGdbRemoteThreadName.py (1738 of 1914) PASS: lldb-unit :: Language/Highlighting/./HighlighterTests/22/29 (1739 of 1914) PASS: lldb-unit :: Utility/./UtilityTests/20/30 (1740 of 1914) PASS: lldb-api :: lang/cpp/class-template-type-parameter-pack/TestClassTemplateTypeParameterPack.py (1741 of 1914) PASS: lldb-shell :: SymbolFile/DWARF/x86/debug-types-signature-loop.s (1742 of 1914) PASS: lldb-shell :: SymbolFile/OnDemand/symbolic-breakpoint.test (1743 of 1914) PASS: lldb-api :: commands/expression/ir-interpreter/TestIRInterpreter.py (1744 of 1914) PASS: lldb-unit :: Expression/./ExpressionTests/8/22 (1745 of 1914) PASS: lldb-shell :: SymbolFile/DWARF/x86/DW_AT_data_bit_offset-DW_OP_stack_value.s (1746 of 1914) PASS: lldb-unit :: Host/./HostTests/18/19 (1747 of 1914) PASS: lldb-api :: functionalities/data-formatter/frameformat_smallstruct/TestFrameFormatSmallStruct.py (1748 of 1914) PASS: lldb-unit :: SymbolFile/DWARF/./SymbolFileDWARFTests/14/29 (1749 of 1914) PASS: lldb-api :: commands/expression/calculator_mode/TestCalculatorMode.py (1750 of 1914) PASS: lldb-unit :: Process/minidump/./LLDBMinidumpTests/15/17 (1751 of 1914) PASS: lldb-api :: python_api/sbmodule/TestSBModule.py (1752 of 1914) PASS: lldb-unit :: Language/Highlighting/./HighlighterTests/27/29 (1753 of 1914) PASS: lldb-unit :: Process/minidump/./LLDBMinidumpTests/1/17 (1754 of 1914) PASS: lldb-api :: lang/cpp/rvalue-references/TestRvalueReferences.py (1755 of 1914) PASS: lldb-api :: types/TestIntegerTypeExpr.py (1756 of 1914) PASS: lldb-api :: commands/process/attach/TestProcessAttach.py (1757 of 1914) PASS: lldb-api :: lang/objc/objc-static-method/TestObjCStaticMethod.py (1758 of 1914) PASS: lldb-shell :: ObjectFile/ELF/PT_LOAD.yaml (1759 of 1914) PASS: lldb-api :: commands/expression/persistent_variables/TestPersistentVariables.py (1760 of 1914) UNSUPPORTED: lldb-api :: commands/watchpoints/multi_watchpoint_slots/TestWatchpointMultipleSlots.py (1761 of 1914) PASS: lldb-api :: functionalities/breakpoint/cpp/TestCPPBreakpointLocations.py (1762 of 1914) PASS: lldb-api :: functionalities/thread/concurrent_events/TestConcurrentDelaySignalBreak.py (1763 of 1914) PASS: lldb-shell :: SymbolFile/DWARF/x86/limit-debug-info.s (1764 of 1914) UNSUPPORTED: lldb-shell :: SymbolFile/PDB/enums-layout.test (1765 of 1914) PASS: lldb-api :: functionalities/thread/jump/TestThreadJump.py (1766 of 1914) PASS: lldb-unit :: UnwindAssembly/x86/./UnwindAssemblyx86Tests/3/27 (1767 of 1914) PASS: lldb-api :: functionalities/data-formatter/data-formatter-stl/libcxx/string/simulator/TestDataFormatterLibcxxStringSimulator.py (1768 of 1914) PASS: lldb-api :: macosx/add-dsym/TestAddDsymMidExecutionCommand.py (1769 of 1914) PASS: lldb-api :: lang/c/stepping/TestStepAndBreakpoints.py (1770 of 1914) PASS: lldb-unit :: API/./APITests/1/3 (1771 of 1914) PASS: lldb-api :: functionalities/data-formatter/data-formatter-objc/TestDataFormatterObjCNSBundle.py (1772 of 1914) PASS: lldb-unit :: Process/gdb-remote/./ProcessGdbRemoteTests/3/19 (1773 of 1914) PASS: lldb-shell :: ObjectFile/PECOFF/settings-abi-i686.yaml (1774 of 1914) PASS: lldb-api :: functionalities/breakpoint/breakpoint_command/TestBreakpointCommand.py (1775 of 1914) UNSUPPORTED: lldb-api :: lua_api/TestLuaAPI.py (1776 of 1914) UNSUPPORTED: lldb-api :: tools/lldb-server/TestGdbRemoteForkNonStop.py (1777 of 1914) PASS: lldb-shell :: ObjectFile/Breakpad/uuid-matching-mac.test (1778 of 1914) PASS: lldb-shell :: ObjectFile/ELF/netbsd-core-amd64.test (1779 of 1914) PASS: lldb-shell :: Driver/TestCommands.test (1780 of 1914) PASS: lldb-shell :: SymbolFile/NativePDB/local-variables-registers.s (1781 of 1914) PASS: lldb-shell :: SymbolFile/NativePDB/global-classes.cpp (1782 of 1914) PASS: lldb-shell :: Quit/TestQuitExitCodeTooManyArgs.test (1783 of 1914) PASS: lldb-unit :: Language/Highlighting/./HighlighterTests/2/29 (1784 of 1914) PASS: lldb-unit :: tools/lldb-server/tests/./LLDBServerTests/1/2 (1785 of 1914) PASS: lldb-unit :: Host/./HostTests/15/19 (1786 of 1914) PASS: lldb-api :: tools/lldb-server/TestGdbRemote_qThreadStopInfo.py (1787 of 1914) PASS: lldb-api :: sanity/TestReprStrEquality.py (1788 of 1914) PASS: lldb-api :: functionalities/data-formatter/data-formatter-objc/TestDataFormatterObjCNSDate.py (1789 of 1914) PASS: lldb-api :: commands/target/dump-pcm-info/TestDumpPCMInfo.py (1790 of 1914) PASS: lldb-shell :: SymbolFile/NativePDB/nested-types.cpp (1791 of 1914) UNSUPPORTED: lldb-api :: tools/lldb-vscode/completions/TestVSCode_completions.py (1792 of 1914) UNSUPPORTED: lldb-shell :: Watchpoint/netbsd-nouserdbregs.test (1793 of 1914) PASS: lldb-api :: functionalities/postmortem/elf-core/thread_crash/TestLinuxCoreThreads.py (1794 of 1914) PASS: lldb-api :: lang/objc/ivar-IMP/TestObjCiVarIMP.py (1795 of 1914) PASS: lldb-shell :: Register/Core/x86-32-linux-fp.test (1796 of 1914) PASS: lldb-shell :: SymbolFile/DWARF/x86/dwo-not-found-warning.cpp (1797 of 1914) PASS: lldb-api :: lang/cpp/bitfields/TestCppBitfields.py (1798 of 1914) PASS: lldb-api :: lang/objc/objc-optimized/TestObjcOptimized.py (1799 of 1914) UNSUPPORTED: lldb-shell :: Commands/command-thread-siginfo.test (1800 of 1914) PASS: lldb-api :: commands/watchpoints/watchpoint_disable/TestWatchpointDisable.py (1801 of 1914) PASS: lldb-unit :: Host/./HostTests/3/19 (1802 of 1914) PASS: lldb-api :: functionalities/target-new-solib-notifications/TestModuleLoadedNotifys.py (1803 of 1914) PASS: lldb-shell :: ObjectFile/wasm/basic.yaml (1804 of 1914) PASS: lldb-unit :: Platform/./LLDBPlatformTests/3/16 (1805 of 1914) UNSUPPORTED: lldb-shell :: Register/x86-fp-read.test (1806 of 1914) PASS: lldb-shell :: BuildScript/script-args.test (1807 of 1914) PASS: lldb-api :: functionalities/data-formatter/boolreference/TestFormattersBoolRefPtr.py (1808 of 1914) PASS: lldb-shell :: Breakpoint/single-file-split-dwarf.test (1809 of 1914) PASS: lldb-api :: lang/cpp/namespace_definitions/TestNamespaceDefinitions.py (1810 of 1914) PASS: lldb-api :: functionalities/postmortem/elf-core/gcore/TestGCore.py (1811 of 1914) PASS: lldb-unit :: Language/Highlighting/./HighlighterTests/10/29 (1812 of 1914) UNSUPPORTED: lldb-api :: linux/aarch64/non_address_bit_memory_access/TestAArch64LinuxNonAddressBitMemoryAccess.py (1813 of 1914) PASS: lldb-unit :: Target/./TargetTests/13/19 (1814 of 1914) PASS: lldb-shell :: VSCode/TestOptions.test (1815 of 1914) PASS: lldb-unit :: Language/Highlighting/./HighlighterTests/28/29 (1816 of 1914) PASS: lldb-api :: commands/log/basic/TestLogHandlers.py (1817 of 1914) UNSUPPORTED: lldb-shell :: ScriptInterpreter/Lua/breakpoint_callback.test (1818 of 1914) PASS: lldb-shell :: ScriptInterpreter/Python/eof.test (1819 of 1914) PASS: lldb-api :: commands/expression/dollar-in-variable/TestDollarInVariable.py (1820 of 1914) PASS: lldb-shell :: ObjectFile/MachO/lc_version_min.yaml (1821 of 1914) PASS: lldb-unit :: Utility/./UtilityTests/2/30 (1822 of 1914) PASS: lldb-api :: commands/expression/radar_9531204/TestPrintfAfterUp.py (1823 of 1914) PASS: lldb-api :: commands/memory/write/TestMemoryWrite.py (1824 of 1914) PASS: lldb-unit :: Interpreter/./InterpreterTests/2/14 (1825 of 1914) PASS: lldb-shell :: Quit/TestQuitExitCode0.test (1826 of 1914) PASS: lldb-api :: lang/c/step_over_no_deadlock/TestStepOverDoesntBlock.py (1827 of 1914) PASS: lldb-unit :: Process/gdb-remote/./ProcessGdbRemoteTests/16/19 (1828 of 1914) PASS: lldb-shell :: Commands/command-backtrace-parser-1.test (1829 of 1914) PASS: lldb-api :: commands/frame/diagnose/dereference-function-return/TestDiagnoseDereferenceFunctionReturn.py (1830 of 1914) PASS: lldb-unit :: Utility/./UtilityTests/19/30 (1831 of 1914) PASS: lldb-api :: lang/cpp/signed_types/TestSignedTypes.py (1832 of 1914) PASS: lldb-api :: functionalities/testid/TestTestId.py (1833 of 1914) PASS: lldb-api :: functionalities/thread/concurrent_events/TestConcurrentBreakpointDelayBreakpointOneSignal.py (1834 of 1914) UNSUPPORTED: lldb-api :: macosx/lc-note/addrable-bits/TestAddrableBitsCorefile.py (1835 of 1914) PASS: lldb-api :: functionalities/data-formatter/data-formatter-stl/libcxx/vector/TestDataFormatterLibcxxVector.py (1836 of 1914) PASS: lldb-api :: functionalities/data-formatter/data-formatter-globals/TestDataFormatterGlobals.py (1837 of 1914) PASS: lldb-api :: functionalities/breakpoint/objc/TestObjCBreakpoints.py (1838 of 1914) PASS: lldb-api :: commands/log/invalid-args/TestInvalidArgsLog.py (1839 of 1914) PASS: lldb-shell :: SymbolFile/Breakpad/symtab-macho.test (1840 of 1914) UNSUPPORTED: lldb-api :: lang/objc/modules-update/TestClangModulesUpdate.py (1841 of 1914) PASS: lldb-api :: lang/objc/foundation/TestObjCMethodsNSArray.py (1842 of 1914) PASS: lldb-unit :: ScriptInterpreter/Python/./ScriptInterpreterPythonTests/16/19 (1843 of 1914) PASS: lldb-api :: functionalities/thread/concurrent_events/TestConcurrentTwoWatchpointsOneDelayBreakpoint.py (1844 of 1914) PASS: lldb-unit :: Signals/./SignalsTests/3/5 (1845 of 1914) PASS: lldb-unit :: Language/Highlighting/./HighlighterTests/12/29 (1846 of 1914) PASS: lldb-unit :: Platform/./LLDBPlatformTests/9/16 (1847 of 1914) PASS: lldb-shell :: ScriptInterpreter/Python/fail_breakpoint_oneline.test (1848 of 1914) PASS: lldb-shell :: Register/Core/x86-64-linux-multithread.test (1849 of 1914) UNSUPPORTED: lldb-shell :: SymbolFile/PDB/calling-conventions-arm.test (1850 of 1914) PASS: lldb-api :: lang/cpp/frame-var-anon-unions/TestFrameVariableAnonymousUnions.py (1851 of 1914) PASS: lldb-api :: functionalities/data-formatter/typedef_array/TestTypedefArray.py (1852 of 1914) PASS: lldb-unit :: Language/Highlighting/./HighlighterTests/8/29 (1853 of 1914) PASS: lldb-api :: commands/target/dump/TestTargetDumpTypeSystem.py (1854 of 1914) PASS: lldb-unit :: Platform/Android/./AdbClientTests/0/2 (1855 of 1914) XFAIL: lldb-api :: lang/c/local_types/TestUseClosestType.py (1856 of 1914) PASS: lldb-api :: functionalities/thread/crash_during_step/TestCrashDuringStep.py (1857 of 1914) PASS: lldb-shell :: Minidump/dump-all.test (1858 of 1914) PASS: lldb-api :: commands/frame/diagnose/complicated-expression/TestComplicatedExpression.py (1859 of 1914) PASS: lldb-shell :: SymbolFile/DWARF/x86/find-basic-function.cpp (1860 of 1914) PASS: lldb-shell :: ScriptInterpreter/Python/python.test (1861 of 1914) PASS: lldb-shell :: ObjectFile/ELF/basic-info.yaml (1862 of 1914) PASS: lldb-shell :: Watchpoint/SetErrorCases.test (1863 of 1914) PASS: lldb-api :: commands/command/script_alias/TestCommandScriptAlias.py (1864 of 1914) PASS: lldb-unit :: Process/Utility/./ProcessUtilityTests/13/16 (1865 of 1914) PASS: lldb-unit :: Process/Utility/./ProcessUtilityTests/10/16 (1866 of 1914) PASS: lldb-shell :: SymbolFile/NativePDB/function-types-calling-conv.cpp (1867 of 1914) UNSUPPORTED: lldb-shell :: SymbolFile/PDB/class-layout.test (1868 of 1914) PASS: lldb-shell :: SymbolFile/DWARF/x86/debug_rnglists-dwp.s (1869 of 1914) PASS: lldb-shell :: ObjectFile/Breakpad/breakpad-identification.test (1870 of 1914) PASS: lldb-unit :: Process/Utility/./ProcessUtilityTests/2/16 (1871 of 1914) PASS: lldb-api :: commands/command/nested_alias/TestNestedAlias.py (1872 of 1914) PASS: lldb-api :: functionalities/pre_run_dylibs/TestPreRunDylibs.py (1873 of 1914) PASS: lldb-shell :: SymbolFile/DWARF/x86/debug_aranges-empty-section.s (1874 of 1914) PASS: lldb-shell :: SymbolFile/NativePDB/tag-types.cpp (1875 of 1914) UNSUPPORTED: lldb-api :: commands/trace/multiple-threads/TestTraceStartStopMultipleThreads.py (1876 of 1914) PASS: lldb-api :: lang/cpp/template-function/TestTemplateFunctions.py (1877 of 1914) PASS: lldb-unit :: Signals/./SignalsTests/1/5 (1878 of 1914) PASS: lldb-api :: tools/lldb-vscode/console/TestVSCode_redirection_to_console.py (1879 of 1914) UNSUPPORTED: lldb-shell :: SymbolFile/DWARF/x86/DW_TAG_GNU_call_site-DW_AT_low_pc.s (1880 of 1914) PASS: lldb-unit :: Host/./HostTests/7/19 (1881 of 1914) PASS: lldb-unit :: Process/minidump/./LLDBMinidumpTests/10/17 (1882 of 1914) PASS: lldb-shell :: Driver/TestPageZeroRead.test (1883 of 1914) PASS: lldb-api :: macosx/debugserver-exit-code/TestDebugServerExitCode.py (1884 of 1914) PASS: lldb-api :: functionalities/inferior-crashing/TestInferiorCrashing.py (1885 of 1914) PASS: lldb-api :: python_api/watchpoint/TestWatchpointIgnoreCount.py (1886 of 1914) PASS: lldb-shell :: ObjectFile/ELF/duplicate-section.yaml (1887 of 1914) PASS: lldb-api :: lang/c/anonymous/TestAnonymous.py (1888 of 1914) PASS: lldb-api :: lang/cpp/class-template-parameter-pack/TestClassTemplateParameterPack.py (1889 of 1914) PASS: lldb-api :: lang/c/vla/TestVLA.py (1890 of 1914) PASS: lldb-shell :: Quit/TestQuitExitCodeHexA.test (1891 of 1914) PASS: lldb-unit :: DataFormatter/./LLDBFormatterTests/7/11 (1892 of 1914) PASS: lldb-api :: lang/c/tls_globals/TestTlsGlobals.py (1893 of 1914) PASS: lldb-api :: python_api/value/empty_class/TestValueAPIEmptyClass.py (1894 of 1914) PASS: lldb-unit :: Utility/./UtilityTests/21/30 (1895 of 1914) PASS: lldb-shell :: SymbolFile/DWARF/x86/split-dwarf-inlining.cpp (1896 of 1914) PASS: lldb-unit :: Utility/./UtilityTests/11/30 (1897 of 1914) PASS: lldb-unit :: ScriptInterpreter/Python/./ScriptInterpreterPythonTests/12/19 (1898 of 1914) UNSUPPORTED: lldb-api :: commands/trace/TestTraceLoad.py (1899 of 1914) PASS: lldb-api :: python_api/value/TestValueAPI.py (1900 of 1914) PASS: lldb-unit :: SymbolFile/DWARF/./SymbolFileDWARFTests/20/29 (1901 of 1914) UNSUPPORTED: lldb-api :: macosx/corefile-exception-reason/TestCorefileExceptionReason.py (1902 of 1914) PASS: lldb-shell :: Driver/TestCore.test (1903 of 1914) PASS: lldb-shell :: ScriptInterpreter/Python/Crashlog/text.test (1904 of 1914) UNSUPPORTED: lldb-shell :: Subprocess/fork-follow-child-wp.test (1905 of 1914) PASS: lldb-unit :: Interpreter/./InterpreterTests/6/14 (1906 of 1914) UNSUPPORTED: lldb-api :: commands/expression/call-restarts/TestCallThatRestarts.py (1907 of 1914) PASS: lldb-unit :: Process/gdb-remote/./ProcessGdbRemoteTests/11/19 (1908 of 1914) PASS: lldb-api :: macosx/nslog/TestDarwinNSLogOutput.py (1909 of 1914) PASS: lldb-api :: commands/frame/diagnose/dereference-argument/TestDiagnoseDereferenceArgument.py (1910 of 1914) PASS: lldb-api :: functionalities/data-formatter/parray/TestPrintArray.py (1911 of 1914) PASS: lldb-api :: lang/cpp/overloaded-functions/TestOverloadedFunctions.py (1912 of 1914) PASS: lldb-api :: lang/objc/foundation/TestObjCMethodsNSError.py (1913 of 1914) PASS: lldb-api :: python_api/target/TestTargetAPI.py (1914 of 1914) Slowest Tests: -------------------------------------------------------------------------- 1200.16s: lldb-api :: functionalities/memory-region/TestMemoryRegion.py 273.84s: lldb-api :: tools/lldb-server/TestLldbGdbServer.py 206.11s: lldb-api :: functionalities/scripted_process/TestStackCoreScriptedProcess.py 203.49s: lldb-api :: macosx/stack-corefile/TestStackCorefile.py 167.71s: lldb-api :: functionalities/breakpoint/address_breakpoints/TestBadAddressBreakpoints.py 154.89s: lldb-api :: macosx/skinny-corefile/TestSkinnyCorefile.py 150.94s: lldb-api :: api/multithreaded/TestMultithreaded.py 96.74s: lldb-api :: commands/expression/import-std-module/queue/TestQueueFromStdModule.py 92.96s: lldb-api :: functionalities/gdb_remote_client/TestWasm.py 92.60s: lldb-api :: commands/expression/import-std-module/vector/TestVectorFromStdModule.py 89.35s: lldb-api :: types/TestLongTypesExpr.py 79.50s: lldb-api :: commands/expression/import-std-module/deque-basic/TestDequeFromStdModule.py 76.46s: lldb-api :: lang/objc/exceptions/TestObjCExceptions.py 73.50s: lldb-api :: commands/process/attach/TestProcessAttach.py 71.76s: lldb-api :: lang/cpp/namespace/TestNamespaceLookup.py 71.22s: lldb-api :: commands/expression/import-std-module/array/TestArrayFromStdModule.py 69.51s: lldb-api :: commands/expression/import-std-module/vector-dbg-info-content/TestDbgInfoContentVectorFromStdModule.py 68.43s: lldb-api :: lang/objc/hidden-ivars/TestHiddenIvars.py 67.65s: lldb-api :: commands/expression/import-std-module/deque-dbg-info-content/TestDbgInfoContentDequeFromStdModule.py 64.82s: lldb-api :: functionalities/data-formatter/data-formatter-objc/TestDataFormatterObjCNSContainer.py

Hide Details

Tests Times: -------------------------------------------------------------------------- [ Range ] :: [ Percentage ] :: [ Count ] -------------------------------------------------------------------------- [1200s,1300s) :: [ ] :: [ 1/1891] [1100s,1200s) :: [ ] :: [ 0/1891] [1000s,1100s) :: [ ] :: [ 0/1891] [ 900s,1000s) :: [ ] :: [ 0/1891] [ 800s, 900s) :: [ ] :: [ 0/1891] [ 700s, 800s) :: [ ] :: [ 0/1891] [ 600s, 700s) :: [ ] :: [ 0/1891] [ 500s, 600s) :: [ ] :: [ 0/1891] [ 400s, 500s) :: [ ] :: [ 0/1891] [ 300s, 400s) :: [ ] :: [ 0/1891] [ 200s, 300s) :: [ ] :: [ 3/1891] [ 100s, 200s) :: [ ] :: [ 6/1891] [ 0s, 100s) :: [*************************************** ] :: [1881/1891] -------------------------------------------------------------------------- ******************** Timed Out Tests (1): lldb-api :: functionalities/memory-region/TestMemoryRegion.py

Hide Details

Hide Details

Testing Time: 3614.74s Unsupported : 252 Passed : 2332 Expectedly Failed: 19 Timed Out : 1 FAILED: tools/lldb/test/CMakeFiles/check-lldb /Users/buildslave/jenkins/workspace/lldb-cmake-sanitized/lldb-build/tools/lldb/test/CMakeFiles/check-lldb cd /Users/buildslave/jenkins/workspace/lldb-cmake-sanitized/lldb-build/tools/lldb/test && /Applications/Xcode.app/Contents/Developer/Library/Frameworks/Python3.framework/Versions/3.8/bin/python3.8 /Users/buildslave/jenkins/workspace/lldb-cmake-sanitized/lldb-build/./bin/llvm-lit -v --time-tests --shuffle --xunit-xml-output=/Users/buildslave/jenkins/workspace/lldb-cmake-sanitized/test/results.xml -v -j 4 --timeout 1200 /Users/buildslave/jenkins/workspace/lldb-cmake-sanitized/lldb-build/tools/lldb/test ninja: build stopped: subcommand failed. Command failed: Command '['/usr/bin/env', 'TERM=vt100', '/usr/local/bin/ninja', '-v', 'check-lldb']' returned non-zero exit status 1. Command: ['/usr/bin/env', 'TERM=vt100', '/usr/local/bin/ninja', '-v', 'check-lldb'] [Pipeline] } [Pipeline] // timeout [Pipeline] } [Pipeline] // stage [Pipeline] stage [Pipeline] { (Declarative: Post Actions) [Pipeline] scanForIssues [Clang] Sleeping for 5 seconds due to JENKINS-32191... [Clang] Parsing console log (workspace: '/Users/buildslave/jenkins/workspace/lldb-cmake-sanitized') [Clang] -> found 1 issue (skipped 0 duplicates) [Clang] Parsing console log (workspace: '/Users/buildslave/jenkins/workspace/lldb-cmake-sanitized') [Clang] -> found 1 issue (skipped 0 duplicates) [Clang] Successfully parsed console log [Clang] -> found 1 issue (skipped 0 duplicates) [Clang] Parsing console log (workspace: '/Users/buildslave/jenkins/workspace/lldb-cmake-sanitized') [Clang] Post processing issues on 'green-dragon-23' with source code encoding 'UTF-8' [Clang] Creating SCM blamer to obtain author and commit information for affected files [Clang] -> No blamer installed yet. You need to install the 'git-forensics' plugin to enable blaming for Git. [Clang] Resolving file names for all issues in source directory '/Users/buildslave/jenkins/workspace/lldb-cmake-sanitized' [Clang] -> resolved paths in source directory (1 found, 0 not found) [Clang] Resolving module names from module definitions (build.xml, pom.xml, or Manifest.mf files) [Clang] -> resolved module names for 1 issues [Clang] Resolving package names (or namespaces) by parsing the affected files [Clang] -> resolved package names of 1 affected files [Clang] No filter has been set, publishing all 1 issues [Clang] Creating fingerprints for all affected code blocks to track issues over different builds [Clang] -> created fingerprints for 1 issues (skipped 0 issues) [Clang] Copying affected files to Jenkins' build folder '/Users/Shared/Jenkins/Home/jobs/lldb-cmake-sanitized/builds/2707/files-with-issues' [Clang] -> 1 copied, 0 not in workspace, 0 not-found, 0 with I/O error [Clang] Repository miner is not configured, skipping repository mining [Pipeline] junit Recording test results [Checks API] No suitable checks publisher found. [Pipeline] } [Pipeline] // stage [Pipeline] } [Pipeline] // withEnv [Pipeline] } [Pipeline] // node [Pipeline] End of Pipeline ERROR: script returned exit code 1 Finished: FAILURE