Console Output

Skipping 61,043 KB.. Full Log
output: 

Hide Details

make VPATH=/Users/buildslave/jenkins/workspace/lldb-cmake-sanitized/llvm-project/lldb/test/API/python_api/target -C /Users/buildslave/jenkins/workspace/lldb-cmake-sanitized/lldb-build/lldb-test-build.noindex/python_api/target/TestTargetAPI.test_resolve_symbol_context_with_address_dsym -I /Users/buildslave/jenkins/workspace/lldb-cmake-sanitized/llvm-project/lldb/test/API/python_api/target -I /Users/buildslave/jenkins/workspace/lldb-cmake-sanitized/llvm-project/lldb/packages/Python/lldbsuite/test/make -f /Users/buildslave/jenkins/workspace/lldb-cmake-sanitized/llvm-project/lldb/test/API/python_api/target/Makefile MAKE_DSYM=YES all ARCH=x86_64 'CC="/Users/buildslave/jenkins/workspace/lldb-cmake-sanitized/host-compiler/bin/clang"' DSYMUTIL=/Users/buildslave/jenkins/workspace/lldb-cmake-sanitized/lldb-build/./bin/dsymutil CODESIGN=codesign CLANG_MODULE_CACHE_DIR=/Users/buildslave/jenkins/workspace/lldb-cmake-sanitized/lldb-build/lldb-test-build.noindex/module-cache-clang/lldb-api USE_HERMETIC_LIBCPP=1

Hide Details

"/Users/buildslave/jenkins/workspace/lldb-cmake-sanitized/host-compiler/bin/clang" -g -O0 -isysroot "/Applications/Xcode.app/Contents/Developer/Platforms/MacOSX.platform/Developer/SDKs/MacOSX11.1.sdk" -arch x86_64 -I/Users/buildslave/jenkins/workspace/lldb-cmake-sanitized/llvm-project/lldb/packages/Python/lldbsuite/test/make/../../../../../include -I/Users/buildslave/jenkins/workspace/lldb-cmake-sanitized/llvm-project/lldb/test/API/python_api/target -I/Users/buildslave/jenkins/workspace/lldb-cmake-sanitized/llvm-project/lldb/packages/Python/lldbsuite/test/make -include /Users/buildslave/jenkins/workspace/lldb-cmake-sanitized/llvm-project/lldb/packages/Python/lldbsuite/test/make/test_common.h -fno-limit-debug-info -MT main.o -MD -MP -MF main.d -c -o main.o /Users/buildslave/jenkins/workspace/lldb-cmake-sanitized/llvm-project/lldb/test/API/python_api/target/main.c "/Users/buildslave/jenkins/workspace/lldb-cmake-sanitized/host-compiler/bin/clang" main.o -g -O0 -isysroot "/Applications/Xcode.app/Contents/Developer/Platforms/MacOSX.platform/Developer/SDKs/MacOSX11.1.sdk" -arch x86_64 -I/Users/buildslave/jenkins/workspace/lldb-cmake-sanitized/llvm-project/lldb/packages/Python/lldbsuite/test/make/../../../../../include -I/Users/buildslave/jenkins/workspace/lldb-cmake-sanitized/llvm-project/lldb/test/API/python_api/target -I/Users/buildslave/jenkins/workspace/lldb-cmake-sanitized/llvm-project/lldb/packages/Python/lldbsuite/test/make -include /Users/buildslave/jenkins/workspace/lldb-cmake-sanitized/llvm-project/lldb/packages/Python/lldbsuite/test/make/test_common.h -fno-limit-debug-info --driver-mode=g++ -o "a.out" codesign -s - "a.out" "/Users/buildslave/jenkins/workspace/lldb-cmake-sanitized/lldb-build/./bin/dsymutil" -o "a.out.dSYM" "a.out"

Hide Details

Hide Details

breakpoint1: SBBreakpoint: id = 1, file = 'main.c', line = 21, exact_match = 0, locations = 1

Hide Details

breakpoint2: SBBreakpoint: id = 2, file = 'main.c', line = 26, exact_match = 0, locations = 1

Hide Details

address1: a.out`a + 11 at main.c:21:13

Hide Details

address2: a.out`a + 63 at main.c:26:12

Hide Details

context1: Module: file = "/Users/buildslave/jenkins/workspace/lldb-cmake-sanitized/lldb-build/lldb-test-build.noindex/python_api/target/TestTargetAPI.test_resolve_symbol_context_with_address_dsym/a.out", arch = "x86_64" CompileUnit: id = {0x00000000}, file = "/Users/buildslave/jenkins/workspace/lldb-cmake-sanitized/llvm-project/lldb/test/API/python_api/target/main.c", language = "c99" Function: id = {0x00000055}, name = "a", range = [0x0000000100003de0-0x0000000100003e28) FuncType: id = {0x00000055}, byte-size = 0, decl = main.c:19, compiler_type = "int (int)" Blocks: id = {0x00000055}, range = [0x100003de0-0x100003e28) LineEntry: [0x0000000100003deb-0x0000000100003def): /Users/buildslave/jenkins/workspace/lldb-cmake-sanitized/llvm-project/lldb/test/API/python_api/target/main.c:21:13, is_start_of_statement = TRUE, is_prologue_end = TRUE Symbol: id = {0x00000005}, range = [0x0000000100003de0-0x0000000100003e30), name="a"

Hide Details

context2: Module: file = "/Users/buildslave/jenkins/workspace/lldb-cmake-sanitized/lldb-build/lldb-test-build.noindex/python_api/target/TestTargetAPI.test_resolve_symbol_context_with_address_dsym/a.out", arch = "x86_64" CompileUnit: id = {0x00000000}, file = "/Users/buildslave/jenkins/workspace/lldb-cmake-sanitized/llvm-project/lldb/test/API/python_api/target/main.c", language = "c99" Function: id = {0x00000055}, name = "a", range = [0x0000000100003de0-0x0000000100003e28) FuncType: id = {0x00000055}, byte-size = 0, decl = main.c:19, compiler_type = "int (int)" Blocks: id = {0x00000055}, range = [0x100003de0-0x100003e28) LineEntry: [0x0000000100003e1f-0x0000000100003e22): /Users/buildslave/jenkins/workspace/lldb-cmake-sanitized/llvm-project/lldb/test/API/python_api/target/main.c:26:12, is_start_of_statement = TRUE Symbol: id = {0x00000005}, range = [0x0000000100003de0-0x0000000100003e30), name="a"

Hide Details

symbol1: id = {0x00000005}, range = [0x0000000100003de0-0x0000000100003e30), name="a"

Hide Details

symbol2: id = {0x00000005}, range = [0x0000000100003de0-0x0000000100003e30), name="a"

Hide Details

<bound method SBProcess.Kill of SBProcess: pid = 58613, state = stopped, threads = 1, executable = a.out>: success

Hide Details

PASS: LLDB (/Users/buildslave/jenkins/workspace/lldb-cmake-sanitized/host-compiler/bin/clang-x86_64) :: test_resolve_symbol_context_with_address_dsym (TestTargetAPI.TargetAPITestCase) runCmd: settings clear -all output:

Hide Details

runCmd: settings set symbols.enable-external-lookup false output:

Hide Details

runCmd: settings set target.inherit-tcc true output:

Hide Details

runCmd: settings set target.detach-on-error false output:

Hide Details

runCmd: settings set target.auto-apply-fixits false output:

Hide Details

runCmd: settings set plugin.process.gdb-remote.packet-timeout 60 output:

Hide Details

runCmd: settings set symbols.clang-modules-cache-path "/Users/buildslave/jenkins/workspace/lldb-cmake-sanitized/lldb-build/lldb-test-build.noindex/module-cache-lldb/lldb-api" output:

Hide Details

runCmd: settings set use-color false output:

Hide Details

runCmd: setting set target.prefer-dynamic-value no-dynamic-values output:

Hide Details

runCmd: settings set target.env-vars ASAN_OPTIONS=detect_stack_use_after_return=1 DYLD_INSERT_LIBRARIES=/Users/buildslave/jenkins/workspace/lldb-cmake-sanitized/host-compiler/lib/clang/15.0.99/lib/darwin/libclang_rt.asan_osx_dynamic.dylib output:

Hide Details

make VPATH=/Users/buildslave/jenkins/workspace/lldb-cmake-sanitized/llvm-project/lldb/test/API/python_api/target -C /Users/buildslave/jenkins/workspace/lldb-cmake-sanitized/lldb-build/lldb-test-build.noindex/python_api/target/TestTargetAPI.test_resolve_symbol_context_with_address_dwarf -I /Users/buildslave/jenkins/workspace/lldb-cmake-sanitized/llvm-project/lldb/test/API/python_api/target -I /Users/buildslave/jenkins/workspace/lldb-cmake-sanitized/llvm-project/lldb/packages/Python/lldbsuite/test/make -f /Users/buildslave/jenkins/workspace/lldb-cmake-sanitized/llvm-project/lldb/test/API/python_api/target/Makefile MAKE_DSYM=NO all ARCH=x86_64 'CC="/Users/buildslave/jenkins/workspace/lldb-cmake-sanitized/host-compiler/bin/clang"' DSYMUTIL=/Users/buildslave/jenkins/workspace/lldb-cmake-sanitized/lldb-build/./bin/dsymutil CODESIGN=codesign CLANG_MODULE_CACHE_DIR=/Users/buildslave/jenkins/workspace/lldb-cmake-sanitized/lldb-build/lldb-test-build.noindex/module-cache-clang/lldb-api USE_HERMETIC_LIBCPP=1

Hide Details

"/Users/buildslave/jenkins/workspace/lldb-cmake-sanitized/host-compiler/bin/clang" -g -O0 -isysroot "/Applications/Xcode.app/Contents/Developer/Platforms/MacOSX.platform/Developer/SDKs/MacOSX11.1.sdk" -arch x86_64 -I/Users/buildslave/jenkins/workspace/lldb-cmake-sanitized/llvm-project/lldb/packages/Python/lldbsuite/test/make/../../../../../include -I/Users/buildslave/jenkins/workspace/lldb-cmake-sanitized/llvm-project/lldb/test/API/python_api/target -I/Users/buildslave/jenkins/workspace/lldb-cmake-sanitized/llvm-project/lldb/packages/Python/lldbsuite/test/make -include /Users/buildslave/jenkins/workspace/lldb-cmake-sanitized/llvm-project/lldb/packages/Python/lldbsuite/test/make/test_common.h -fno-limit-debug-info -MT main.o -MD -MP -MF main.d -c -o main.o /Users/buildslave/jenkins/workspace/lldb-cmake-sanitized/llvm-project/lldb/test/API/python_api/target/main.c "/Users/buildslave/jenkins/workspace/lldb-cmake-sanitized/host-compiler/bin/clang" main.o -g -O0 -isysroot "/Applications/Xcode.app/Contents/Developer/Platforms/MacOSX.platform/Developer/SDKs/MacOSX11.1.sdk" -arch x86_64 -I/Users/buildslave/jenkins/workspace/lldb-cmake-sanitized/llvm-project/lldb/packages/Python/lldbsuite/test/make/../../../../../include -I/Users/buildslave/jenkins/workspace/lldb-cmake-sanitized/llvm-project/lldb/test/API/python_api/target -I/Users/buildslave/jenkins/workspace/lldb-cmake-sanitized/llvm-project/lldb/packages/Python/lldbsuite/test/make -include /Users/buildslave/jenkins/workspace/lldb-cmake-sanitized/llvm-project/lldb/packages/Python/lldbsuite/test/make/test_common.h -fno-limit-debug-info --driver-mode=g++ -o "a.out" codesign -s - "a.out"

Hide Details

Hide Details

breakpoint1: SBBreakpoint: id = 1, file = 'main.c', line = 21, exact_match = 0, locations = 1

Hide Details

breakpoint2: SBBreakpoint: id = 2, file = 'main.c', line = 26, exact_match = 0, locations = 1

Hide Details

address1: a.out`a + 11 at main.c:21:13

Hide Details

address2: a.out`a + 63 at main.c:26:12

Hide Details

context1: Module: file = "/Users/buildslave/jenkins/workspace/lldb-cmake-sanitized/lldb-build/lldb-test-build.noindex/python_api/target/TestTargetAPI.test_resolve_symbol_context_with_address_dwarf/a.out", arch = "x86_64" CompileUnit: id = {0x00000000}, file = "/Users/buildslave/jenkins/workspace/lldb-cmake-sanitized/llvm-project/lldb/test/API/python_api/target/main.c", language = "<not loaded>" Function: id = {0x1000000c2}, name = "a", range = [0x0000000100003de0-0x0000000100003e28) FuncType: id = {0x1000000c2}, byte-size = 0, decl = main.c:19, compiler_type = "int (int)" Blocks: id = {0x1000000c2}, range = [0x100003de0-0x100003e28) LineEntry: [0x0000000100003deb-0x0000000100003def): /Users/buildslave/jenkins/workspace/lldb-cmake-sanitized/llvm-project/lldb/test/API/python_api/target/main.c:21:13, is_start_of_statement = TRUE, is_prologue_end = TRUE Symbol: id = {0x00000005}, range = [0x0000000100003de0-0x0000000100003e30), name="a"

Hide Details

context2: Module: file = "/Users/buildslave/jenkins/workspace/lldb-cmake-sanitized/lldb-build/lldb-test-build.noindex/python_api/target/TestTargetAPI.test_resolve_symbol_context_with_address_dwarf/a.out", arch = "x86_64" CompileUnit: id = {0x00000000}, file = "/Users/buildslave/jenkins/workspace/lldb-cmake-sanitized/llvm-project/lldb/test/API/python_api/target/main.c", language = "<not loaded>" Function: id = {0x1000000c2}, name = "a", range = [0x0000000100003de0-0x0000000100003e28) FuncType: id = {0x1000000c2}, byte-size = 0, decl = main.c:19, compiler_type = "int (int)" Blocks: id = {0x1000000c2}, range = [0x100003de0-0x100003e28) LineEntry: [0x0000000100003e1f-0x0000000100003e22): /Users/buildslave/jenkins/workspace/lldb-cmake-sanitized/llvm-project/lldb/test/API/python_api/target/main.c:26:12, is_start_of_statement = TRUE Symbol: id = {0x00000005}, range = [0x0000000100003de0-0x0000000100003e30), name="a"

Hide Details

symbol1: id = {0x00000005}, range = [0x0000000100003de0-0x0000000100003e30), name="a"

Hide Details

symbol2: id = {0x00000005}, range = [0x0000000100003de0-0x0000000100003e30), name="a"

Hide Details

<bound method SBProcess.Kill of SBProcess: pid = 58649, state = stopped, threads = 1, executable = a.out>: success

Hide Details

PASS: LLDB (/Users/buildslave/jenkins/workspace/lldb-cmake-sanitized/host-compiler/bin/clang-x86_64) :: test_resolve_symbol_context_with_address_dwarf (TestTargetAPI.TargetAPITestCase) UNSUPPORTED: LLDB (/Users/buildslave/jenkins/workspace/lldb-cmake-sanitized/host-compiler/bin/clang-x86_64) :: test_resolve_symbol_context_with_address_dwo (TestTargetAPI.TargetAPITestCase) (test case does not fall in any category of interest for this run) runCmd: settings clear -all output:

Hide Details

runCmd: settings set symbols.enable-external-lookup false output:

Hide Details

runCmd: settings set target.inherit-tcc true output:

Hide Details

runCmd: settings set target.detach-on-error false output:

Hide Details

runCmd: settings set target.auto-apply-fixits false output:

Hide Details

runCmd: settings set plugin.process.gdb-remote.packet-timeout 60 output:

Hide Details

runCmd: settings set symbols.clang-modules-cache-path "/Users/buildslave/jenkins/workspace/lldb-cmake-sanitized/lldb-build/lldb-test-build.noindex/module-cache-lldb/lldb-api" output:

Hide Details

runCmd: settings set use-color false output:

Hide Details

runCmd: setting set target.prefer-dynamic-value no-dynamic-values output:

Hide Details

runCmd: settings set target.env-vars ASAN_OPTIONS=detect_stack_use_after_return=1 DYLD_INSERT_LIBRARIES=/Users/buildslave/jenkins/workspace/lldb-cmake-sanitized/host-compiler/lib/clang/15.0.99/lib/darwin/libclang_rt.asan_osx_dynamic.dylib output:

Hide Details

make VPATH=/Users/buildslave/jenkins/workspace/lldb-cmake-sanitized/llvm-project/lldb/test/API/python_api/target -C /Users/buildslave/jenkins/workspace/lldb-cmake-sanitized/lldb-build/lldb-test-build.noindex/python_api/target/TestTargetAPI.test_resolve_symbol_context_with_address_gmodules -I /Users/buildslave/jenkins/workspace/lldb-cmake-sanitized/llvm-project/lldb/test/API/python_api/target -I /Users/buildslave/jenkins/workspace/lldb-cmake-sanitized/llvm-project/lldb/packages/Python/lldbsuite/test/make -f /Users/buildslave/jenkins/workspace/lldb-cmake-sanitized/llvm-project/lldb/test/API/python_api/target/Makefile MAKE_DSYM=NO MAKE_GMODULES=YES all ARCH=x86_64 'CC="/Users/buildslave/jenkins/workspace/lldb-cmake-sanitized/host-compiler/bin/clang"' DSYMUTIL=/Users/buildslave/jenkins/workspace/lldb-cmake-sanitized/lldb-build/./bin/dsymutil CODESIGN=codesign CLANG_MODULE_CACHE_DIR=/Users/buildslave/jenkins/workspace/lldb-cmake-sanitized/lldb-build/lldb-test-build.noindex/module-cache-clang/lldb-api USE_HERMETIC_LIBCPP=1

Hide Details

"/Users/buildslave/jenkins/workspace/lldb-cmake-sanitized/host-compiler/bin/clang" -g -O0 -isysroot "/Applications/Xcode.app/Contents/Developer/Platforms/MacOSX.platform/Developer/SDKs/MacOSX11.1.sdk" -arch x86_64 -I/Users/buildslave/jenkins/workspace/lldb-cmake-sanitized/llvm-project/lldb/packages/Python/lldbsuite/test/make/../../../../../include -I/Users/buildslave/jenkins/workspace/lldb-cmake-sanitized/llvm-project/lldb/test/API/python_api/target -I/Users/buildslave/jenkins/workspace/lldb-cmake-sanitized/llvm-project/lldb/packages/Python/lldbsuite/test/make -include /Users/buildslave/jenkins/workspace/lldb-cmake-sanitized/llvm-project/lldb/packages/Python/lldbsuite/test/make/test_common.h -fno-limit-debug-info -fmodules -gmodules -fmodules-cache-path=/Users/buildslave/jenkins/workspace/lldb-cmake-sanitized/lldb-build/lldb-test-build.noindex/module-cache-clang/lldb-api -gmodules -fcxx-modules -MT main.o -MD -MP -MF main.d -c -o main.o /Users/buildslave/jenkins/workspace/lldb-cmake-sanitized/llvm-project/lldb/test/API/python_api/target/main.c "/Users/buildslave/jenkins/workspace/lldb-cmake-sanitized/host-compiler/bin/clang" main.o -g -O0 -isysroot "/Applications/Xcode.app/Contents/Developer/Platforms/MacOSX.platform/Developer/SDKs/MacOSX11.1.sdk" -arch x86_64 -I/Users/buildslave/jenkins/workspace/lldb-cmake-sanitized/llvm-project/lldb/packages/Python/lldbsuite/test/make/../../../../../include -I/Users/buildslave/jenkins/workspace/lldb-cmake-sanitized/llvm-project/lldb/test/API/python_api/target -I/Users/buildslave/jenkins/workspace/lldb-cmake-sanitized/llvm-project/lldb/packages/Python/lldbsuite/test/make -include /Users/buildslave/jenkins/workspace/lldb-cmake-sanitized/llvm-project/lldb/packages/Python/lldbsuite/test/make/test_common.h -fno-limit-debug-info -fmodules -gmodules -fmodules-cache-path=/Users/buildslave/jenkins/workspace/lldb-cmake-sanitized/lldb-build/lldb-test-build.noindex/module-cache-clang/lldb-api -gmodules -fcxx-modules --driver-mode=g++ -o "a.out" codesign -s - "a.out"

Hide Details

Hide Details

breakpoint1: SBBreakpoint: id = 1, file = 'main.c', line = 21, exact_match = 0, locations = 1

Hide Details

breakpoint2: SBBreakpoint: id = 2, file = 'main.c', line = 26, exact_match = 0, locations = 1

Hide Details

address1: a.out`a + 11 at main.c:21:13

Hide Details

address2: a.out`a + 63 at main.c:26:12

Hide Details

context1: Module: file = "/Users/buildslave/jenkins/workspace/lldb-cmake-sanitized/lldb-build/lldb-test-build.noindex/python_api/target/TestTargetAPI.test_resolve_symbol_context_with_address_gmodules/a.out", arch = "x86_64" CompileUnit: id = {0x00000000}, file = "/Users/buildslave/jenkins/workspace/lldb-cmake-sanitized/llvm-project/lldb/test/API/python_api/target/main.c", language = "<not loaded>" Function: id = {0x1000000f2}, name = "a", range = [0x0000000100003de0-0x0000000100003e28) FuncType: id = {0x1000000f2}, byte-size = 0, decl = main.c:19, compiler_type = "int (int)" Blocks: id = {0x1000000f2}, range = [0x100003de0-0x100003e28) LineEntry: [0x0000000100003deb-0x0000000100003def): /Users/buildslave/jenkins/workspace/lldb-cmake-sanitized/llvm-project/lldb/test/API/python_api/target/main.c:21:13, is_start_of_statement = TRUE, is_prologue_end = TRUE Symbol: id = {0x00000005}, range = [0x0000000100003de0-0x0000000100003e30), name="a"

Hide Details

context2: Module: file = "/Users/buildslave/jenkins/workspace/lldb-cmake-sanitized/lldb-build/lldb-test-build.noindex/python_api/target/TestTargetAPI.test_resolve_symbol_context_with_address_gmodules/a.out", arch = "x86_64" CompileUnit: id = {0x00000000}, file = "/Users/buildslave/jenkins/workspace/lldb-cmake-sanitized/llvm-project/lldb/test/API/python_api/target/main.c", language = "<not loaded>" Function: id = {0x1000000f2}, name = "a", range = [0x0000000100003de0-0x0000000100003e28) FuncType: id = {0x1000000f2}, byte-size = 0, decl = main.c:19, compiler_type = "int (int)" Blocks: id = {0x1000000f2}, range = [0x100003de0-0x100003e28) LineEntry: [0x0000000100003e1f-0x0000000100003e22): /Users/buildslave/jenkins/workspace/lldb-cmake-sanitized/llvm-project/lldb/test/API/python_api/target/main.c:26:12, is_start_of_statement = TRUE Symbol: id = {0x00000005}, range = [0x0000000100003de0-0x0000000100003e30), name="a"

Hide Details

symbol1: id = {0x00000005}, range = [0x0000000100003de0-0x0000000100003e30), name="a"

Hide Details

symbol2: id = {0x00000005}, range = [0x0000000100003de0-0x0000000100003e30), name="a"

Hide Details

<bound method SBProcess.Kill of SBProcess: pid = 58682, state = stopped, threads = 1, executable = a.out>: success

Hide Details

PASS: LLDB (/Users/buildslave/jenkins/workspace/lldb-cmake-sanitized/host-compiler/bin/clang-x86_64) :: test_resolve_symbol_context_with_address_gmodules (TestTargetAPI.TargetAPITestCase) Restore dir to: /Users/buildslave/jenkins/workspace/lldb-cmake-sanitized/lldb-build/tools/lldb/test ====================================================================== FAIL: test_find_global_variables_dsym (TestTargetAPI.TargetAPITestCase) Exercise SBTarget.FindGlobalVariables() API. ---------------------------------------------------------------------- Traceback (most recent call last): File "/Users/buildslave/jenkins/workspace/lldb-cmake-sanitized/llvm-project/lldb/packages/Python/lldbsuite/test/lldbtest.py", line 1669, in test_method return attrvalue(self) File "/Users/buildslave/jenkins/workspace/lldb-cmake-sanitized/llvm-project/lldb/test/API/python_api/target/TestTargetAPI.py", line 41, in test_find_global_variables self.find_global_variables('b.out') File "/Users/buildslave/jenkins/workspace/lldb-cmake-sanitized/llvm-project/lldb/test/API/python_api/target/TestTargetAPI.py", line 255, in find_global_variables self.assertEqual(len(thread_list), 1) AssertionError: 0 != 1 Config=x86_64-/Users/buildslave/jenkins/workspace/lldb-cmake-sanitized/host-compiler/bin/clang ====================================================================== FAIL: test_find_global_variables_dwarf (TestTargetAPI.TargetAPITestCase) Exercise SBTarget.FindGlobalVariables() API. ---------------------------------------------------------------------- Traceback (most recent call last): File "/Users/buildslave/jenkins/workspace/lldb-cmake-sanitized/llvm-project/lldb/packages/Python/lldbsuite/test/lldbtest.py", line 1669, in test_method return attrvalue(self) File "/Users/buildslave/jenkins/workspace/lldb-cmake-sanitized/llvm-project/lldb/test/API/python_api/target/TestTargetAPI.py", line 41, in test_find_global_variables self.find_global_variables('b.out') File "/Users/buildslave/jenkins/workspace/lldb-cmake-sanitized/llvm-project/lldb/test/API/python_api/target/TestTargetAPI.py", line 255, in find_global_variables self.assertEqual(len(thread_list), 1) AssertionError: 0 != 1 Config=x86_64-/Users/buildslave/jenkins/workspace/lldb-cmake-sanitized/host-compiler/bin/clang ====================================================================== FAIL: test_find_global_variables_gmodules (TestTargetAPI.TargetAPITestCase) Exercise SBTarget.FindGlobalVariables() API. ---------------------------------------------------------------------- Traceback (most recent call last): File "/Users/buildslave/jenkins/workspace/lldb-cmake-sanitized/llvm-project/lldb/packages/Python/lldbsuite/test/lldbtest.py", line 1669, in test_method return attrvalue(self) File "/Users/buildslave/jenkins/workspace/lldb-cmake-sanitized/llvm-project/lldb/test/API/python_api/target/TestTargetAPI.py", line 41, in test_find_global_variables self.find_global_variables('b.out') File "/Users/buildslave/jenkins/workspace/lldb-cmake-sanitized/llvm-project/lldb/test/API/python_api/target/TestTargetAPI.py", line 255, in find_global_variables self.assertEqual(len(thread_list), 1) AssertionError: 0 != 1 Config=x86_64-/Users/buildslave/jenkins/workspace/lldb-cmake-sanitized/host-compiler/bin/clang ====================================================================== FAIL: test_is_loaded_dsym (TestTargetAPI.TargetAPITestCase) Exercise SBTarget.IsLoaded(SBModule&) API. ---------------------------------------------------------------------- Traceback (most recent call last): File "/Users/buildslave/jenkins/workspace/lldb-cmake-sanitized/llvm-project/lldb/packages/Python/lldbsuite/test/lldbtest.py", line 1669, in test_method return attrvalue(self) File "/Users/buildslave/jenkins/workspace/lldb-cmake-sanitized/llvm-project/lldb/test/API/python_api/target/TestTargetAPI.py", line 520, in test_is_loaded self.assertTrue(target.IsLoaded(module), "Running the target should " AssertionError: False is not True : Running the target should have loaded its modules. Config=x86_64-/Users/buildslave/jenkins/workspace/lldb-cmake-sanitized/host-compiler/bin/clang ====================================================================== FAIL: test_is_loaded_dwarf (TestTargetAPI.TargetAPITestCase) Exercise SBTarget.IsLoaded(SBModule&) API. ---------------------------------------------------------------------- Traceback (most recent call last): File "/Users/buildslave/jenkins/workspace/lldb-cmake-sanitized/llvm-project/lldb/packages/Python/lldbsuite/test/lldbtest.py", line 1669, in test_method return attrvalue(self) File "/Users/buildslave/jenkins/workspace/lldb-cmake-sanitized/llvm-project/lldb/test/API/python_api/target/TestTargetAPI.py", line 520, in test_is_loaded self.assertTrue(target.IsLoaded(module), "Running the target should " AssertionError: False is not True : Running the target should have loaded its modules. Config=x86_64-/Users/buildslave/jenkins/workspace/lldb-cmake-sanitized/host-compiler/bin/clang ---------------------------------------------------------------------- Ran 54 tests in 291.067s

Hide Details

RESULT: FAILED (36 passes, 5 failures, 0 errors, 13 skipped, 0 expected failures, 0 unexpected successes)

Hide Details

--

Hide Details

******************** PASS: lldb-shell :: SymbolFile/NativePDB/break-by-line.cpp (170 of 1524) PASS: lldb-api :: lang/objc/variadic_methods/TestVariadicMethods.py (171 of 1524) PASS: lldb-api :: functionalities/thread/concurrent_events/TestConcurrentCrashWithWatchpointBreakpointSignal.py (172 of 1524) PASS: lldb-shell :: ObjectFile/ELF/build-id-case.yaml (173 of 1524) UNSUPPORTED: lldb-api :: commands/trace/TestTraceSchema.py (174 of 1524) UNSUPPORTED: lldb-shell :: Subprocess/vfork-follow-parent-softbp.test (175 of 1524) PASS: lldb-shell :: Quit/TestQuitExitCode-30.test (176 of 1524) PASS: lldb-api :: python_api/process/TestProcessAPI.py (177 of 1524) PASS: lldb-shell :: SymbolFile/DWARF/x86/debug_loc.s (178 of 1524) PASS: lldb-shell :: Register/Core/x86-64-netbsd-fp.test (179 of 1524) PASS: lldb-shell :: SymbolFile/DWARF/x86/debug_ranges-missing-section.s (180 of 1524) PASS: lldb-api :: functionalities/load_after_attach/TestLoadAfterAttach.py (181 of 1524) PASS: lldb-shell :: SymbolFile/DWARF/x86/debug_rnglists-dwp.s (182 of 1524) PASS: lldb-api :: functionalities/testid/TestTestId.py (183 of 1524) PASS: lldb-shell :: SymbolFile/DWARF/x86/dwarf5-debug_line-file-index.s (184 of 1524) UNSUPPORTED: lldb-shell :: ScriptInterpreter/Lua/fail_breakpoint_oneline.test (185 of 1524) PASS: lldb-api :: types/TestFloatTypes.py (186 of 1524) PASS: lldb-api :: lang/cpp/default-template-args/TestDefaultTemplateArgs.py (187 of 1524) UNSUPPORTED: lldb-api :: tools/lldb-server/registers-target-xml-reading/TestGdbRemoteTargetXmlPacket.py (188 of 1524) PASS: lldb-api :: functionalities/data-formatter/nsarraysynth/TestNSArraySynthetic.py (189 of 1524) PASS: lldb-api :: functionalities/data-formatter/synthcapping/TestSyntheticCapping.py (190 of 1524) UNSUPPORTED: lldb-api :: python_api/disassemble-raw-data/TestDisassemble_VST1_64.py (191 of 1524) PASS: lldb-shell :: Heap/heap-cstr.test (192 of 1524) PASS: lldb-api :: functionalities/breakpoint/inlined_breakpoints/TestInlinedBreakpoints.py (193 of 1524) PASS: lldb-api :: python_api/sbvalue_const_addrof/TestSBValueConstAddrOf.py (194 of 1524) PASS: lldb-api :: python_api/watchpoint/condition/TestWatchpointConditionAPI.py (195 of 1524) PASS: lldb-api :: python_api/sbstructureddata/TestStructuredDataAPI.py (196 of 1524) UNSUPPORTED: lldb-shell :: Register/x86-gp-read.test (197 of 1524) PASS: lldb-api :: tools/lldb-server/TestGdbRemoteExitCode.py (198 of 1524) PASS: lldb-shell :: SymbolFile/NativePDB/function-types-classes.cpp (199 of 1524) XFAIL: lldb-api :: commands/expression/macros/TestMacros.py (200 of 1524) PASS: lldb-api :: lang/cpp/char8_t/TestCxxChar8_t.py (201 of 1524) PASS: lldb-api :: tools/lldb-vscode/runInTerminal/TestVSCode_runInTerminal.py (202 of 1524) UNSUPPORTED: lldb-api :: commands/gui/viewlarge/TestGuiViewLarge.py (203 of 1524) PASS: lldb-api :: functionalities/breakpoint/breakpoint_ids/TestBreakpointIDs.py (204 of 1524) PASS: lldb-shell :: Driver/TestPositionalArgs.test (205 of 1524) UNSUPPORTED: lldb-api :: functionalities/unwind/aarch64_unwind_pac/TestAArch64UnwindPAC.py (206 of 1524) PASS: lldb-api :: commands/expression/import-std-module/queue/TestQueueFromStdModule.py (207 of 1524) PASS: lldb-api :: python_api/section/TestSectionAPI.py (208 of 1524) PASS: lldb-api :: lang/cpp/template-specialization-type/TestTemplateSpecializationType.py (209 of 1524) PASS: lldb-api :: lang/c/array_types/TestArrayTypes.py (210 of 1524) PASS: lldb-shell :: Driver/TestRepl.test (211 of 1524) UNSUPPORTED: lldb-shell :: Subprocess/clone-follow-child-wp.test (212 of 1524) PASS: lldb-shell :: ObjectFile/PECOFF/basic-info-arm64.yaml (213 of 1524) PASS: lldb-api :: lang/c/cpp_keyword_identifiers/TestCppKeywordsAsCIdentifiers.py (214 of 1524) PASS: lldb-api :: functionalities/data-formatter/data-formatter-ptr-to-array/TestPtrToArrayFormatting.py (215 of 1524) PASS: lldb-api :: commands/reproducer/invalid-args/TestInvalidArgsReproducer.py (216 of 1524) UNSUPPORTED: lldb-api :: functionalities/longjmp/TestLongjmp.py (217 of 1524) PASS: lldb-api :: python_api/watchpoint/watchlocation/TestSetWatchlocation.py (218 of 1524) PASS: lldb-api :: functionalities/data-formatter/data-formatter-stl/libcxx/vector/TestDataFormatterLibcxxVector.py (219 of 1524) PASS: lldb-api :: lang/cpp/char1632_t/TestChar1632T.py (220 of 1524) PASS: lldb-api :: commands/watchpoints/watchpoint_size/TestWatchpointSizes.py (221 of 1524) PASS: lldb-api :: commands/expression/completion-crash-incomplete-record/TestCompletionCrashIncompleteRecord.py (222 of 1524) PASS: lldb-shell :: ObjectFile/ELF/compressed-sections.yaml (223 of 1524) PASS: lldb-shell :: Minidump/disassemble-no-module.yaml (224 of 1524) PASS: lldb-shell :: Register/Core/x86-32-freebsd-gp.test (225 of 1524) UNSUPPORTED: lldb-shell :: SymbolFile/PDB/typedefs.test (226 of 1524) UNSUPPORTED: lldb-api :: functionalities/breakpoint/hardware_breakpoints/hardware_breakpoint_on_multiple_threads/TestHWBreakMultiThread.py (227 of 1524) PASS: lldb-api :: functionalities/data-formatter/data-formatter-objc/TestDataFormatterObjCNSDate.py (228 of 1524) UNSUPPORTED: lldb-shell :: ScriptInterpreter/Python/Crashlog/scripted_crashlog_json.test (229 of 1524) PASS: lldb-api :: commands/expression/test/TestExprs.py (230 of 1524) PASS: lldb-api :: commands/expression/import-std-module/basic/TestImportStdModule.py (231 of 1524) PASS: lldb-api :: functionalities/dead-strip/TestDeadStrip.py (232 of 1524) PASS: lldb-api :: functionalities/data-formatter/data-formatter-stl/libcxx/initializerlist/TestInitializerList.py (233 of 1524) PASS: lldb-api :: functionalities/data-formatter/nssetsynth/TestNSSetSynthetic.py (234 of 1524) PASS: lldb-api :: functionalities/archives/TestBSDArchives.py (235 of 1524) PASS: lldb-api :: lang/cpp/class-template-non-type-parameter-pack/TestClassTemplateNonTypeParameterPack.py (236 of 1524) PASS: lldb-shell :: BuildScript/compiler-full-path.test (237 of 1524) PASS: lldb-api :: functionalities/data-formatter/data-formatter-synth/TestDataFormatterSynth.py (238 of 1524) PASS: lldb-shell :: SymbolFile/Breakpad/unwind-via-stack-cfi.test (239 of 1524) PASS: lldb-api :: lang/c/unions/TestUnionMembers.py (240 of 1524) PASS: lldb-api :: functionalities/data-formatter/data-formatter-stl/libcxx/string/simulator/TestDataFormatterLibcxxStringSimulator.py (241 of 1524) PASS: lldb-api :: python_api/frame/TestFrames.py (242 of 1524) PASS: lldb-api :: commands/expression/expr-in-syscall/TestExpressionInSyscall.py (243 of 1524) PASS: lldb-api :: commands/expression/call-function/TestCallStopAndContinue.py (244 of 1524) UNSUPPORTED: lldb-shell :: SymbolFile/PDB/ast-restore.test (245 of 1524) PASS: lldb-api :: functionalities/data-formatter/data-formatter-stl/generic/list/loop/TestDataFormatterGenericListLoop.py (246 of 1524) UNSUPPORTED: lldb-shell :: ScriptInterpreter/Lua/print.test (247 of 1524) PASS: lldb-api :: python_api/class_members/TestSBTypeClassMembers.py (248 of 1524) PASS: lldb-api :: functionalities/show_location/TestShowLocationDwarf5.py (249 of 1524) PASS: lldb-api :: functionalities/thread/crash_during_step/TestCrashDuringStep.py (250 of 1524) UNSUPPORTED: lldb-api :: functionalities/data-formatter/data-formatter-stl/libstdcpp/iterator/TestDataFormatterStdIterator.py (251 of 1524) PASS: lldb-api :: commands/platform/file/read/TestPlatformFileRead.py (252 of 1524) PASS: lldb-api :: functionalities/thread/exit_during_step/TestExitDuringStep.py (253 of 1524) PASS: lldb-api :: functionalities/breakpoint/breakpoint_command/TestBreakpointCommandsFromPython.py (254 of 1524) PASS: lldb-api :: functionalities/diagnostic_reporting/TestDiagnosticReporting.py (255 of 1524) PASS: lldb-api :: functionalities/breakpoint/serialize/TestBreakpointSerialization.py (256 of 1524) UNSUPPORTED: lldb-shell :: Breakpoint/case-insensitive.test (257 of 1524) PASS: lldb-shell :: Register/Core/x86-64-linux-fp.test (258 of 1524) PASS: lldb-shell :: Symtab/symtab-regex-demangled.test (259 of 1524) PASS: lldb-api :: commands/expression/expr_inside_lambda/TestExprInsideLambdas.py (260 of 1524) PASS: lldb-api :: lang/cpp/frame-var-anon-unions/TestFrameVariableAnonymousUnions.py (261 of 1524) PASS: lldb-api :: commands/expression/invalid-args/TestInvalidArgsExpression.py (262 of 1524) PASS: lldb-api :: functionalities/inferior-crashing/recursive-inferior/TestRecursiveInferiorStep.py (263 of 1524) UNSUPPORTED: lldb-api :: functionalities/breakpoint/hardware_breakpoints/write_memory_with_hw_breakpoint/TestWriteMemoryWithHWBreakpoint.py (264 of 1524) PASS: lldb-shell :: Register/Core/x86-64-linux-gp.test (265 of 1524) PASS: lldb-api :: functionalities/breakpoint/breakpoint_ignore_count/TestBreakpointIgnoreCount.py (266 of 1524) PASS: lldb-shell :: SymbolFile/NativePDB/nested-types.cpp (267 of 1524) PASS: lldb-api :: lang/cpp/dynamic-value-same-basename/TestDynamicValueSameBase.py (268 of 1524) PASS: lldb-api :: commands/expression/import-std-module/vector-dbg-info-content/TestDbgInfoContentVectorFromStdModule.py (269 of 1524) UNSUPPORTED: lldb-api :: functionalities/data-formatter/data-formatter-stl/libstdcpp/string/TestDataFormatterStdString.py (270 of 1524) PASS: lldb-api :: functionalities/tail_call_frames/thread_step_out_or_return/TestSteppingOutWithArtificialFrames.py (271 of 1524) PASS: lldb-api :: functionalities/return-value/TestReturnValue.py (272 of 1524) PASS: lldb-api :: macosx/builtin-debugtrap/TestBuiltinDebugTrap.py (273 of 1524) PASS: lldb-shell :: ObjectFile/ELF/riscv-arch.yaml (274 of 1524) PASS: lldb-api :: commands/settings/use_source_cache/TestUseSourceCache.py (275 of 1524) PASS: lldb-shell :: SymbolFile/DWARF/x86/split-dwarf-inlining.cpp (276 of 1524) PASS: lldb-api :: commands/expression/unwind_expression/TestUnwindExpression.py (277 of 1524) UNSUPPORTED: lldb-shell :: ScriptInterpreter/Lua/io.test (278 of 1524) PASS: lldb-shell :: Register/x86-64-ymm-read.test (279 of 1524) PASS: lldb-shell :: Register/Core/x86-64-linux-multithread.test (280 of 1524) UNSUPPORTED: lldb-api :: iohandler/resize/TestIOHandlerResize.py (281 of 1524) UNSUPPORTED: lldb-api :: tools/lldb-server/TestGdbRemoteCompletion.py (282 of 1524) UNSUPPORTED: lldb-api :: functionalities/breakpoint/breakpoint_in_delayslot/TestAvoidBreakpointInDelaySlot.py (283 of 1524) PASS: lldb-shell :: ScriptInterpreter/Python/Crashlog/parser_json.test (284 of 1524) PASS: lldb-api :: python_api/watchpoint/TestWatchpointIgnoreCount.py (285 of 1524) PASS: lldb-api :: macosx/duplicate-archive-members/TestDuplicateMembers.py (286 of 1524) PASS: lldb-shell :: SymbolFile/NativePDB/subfield_register_simple_type.s (287 of 1524) PASS: lldb-api :: lang/cpp/class-template-type-parameter-pack/TestClassTemplateTypeParameterPack.py (288 of 1524) PASS: lldb-api :: functionalities/stop-on-sharedlibrary-load/TestStopOnSharedlibraryEvents.py (289 of 1524) PASS: lldb-api :: lang/cpp/step-through-trampoline/TestStepThroughTrampoline.py (290 of 1524) UNSUPPORTED: lldb-api :: lang/objc/ptr_refs/TestPtrRefsObjC.py (291 of 1524) PASS: lldb-shell :: ObjectFile/MachO/lc_build_version_notools.yaml (292 of 1524) PASS: lldb-api :: commands/frame/diagnose/dereference-this/TestDiagnoseDereferenceThis.py (293 of 1524) UNSUPPORTED: lldb-api :: functionalities/tsan/basic/TestTsanBasic.py (294 of 1524) PASS: lldb-api :: functionalities/jitloader_gdb/TestJITLoaderGDB.py (295 of 1524) PASS: lldb-api :: lang/cpp/scratch-context-merging/structs/TestCppScratchContextMergingStructs.py (296 of 1524) UNSUPPORTED: lldb-api :: commands/expression/multiline-completion/TestMultilineCompletion.py (297 of 1524) UNSUPPORTED: lldb-shell :: Unwind/basic-block-sections.test (298 of 1524) PASS: lldb-api :: lang/objc/print-obj/TestPrintObj.py (299 of 1524) PASS: lldb-shell :: SymbolFile/DWARF/anon_class_w_and_wo_export_symbols.ll (300 of 1524) PASS: lldb-api :: macosx/add-dsym/TestAddDsymDownload.py (301 of 1524) PASS: lldb-api :: functionalities/data-formatter/data-formatter-stl/libcxx/unique_ptr/TestDataFormatterLibcxxUniquePtr.py (302 of 1524) UNSUPPORTED: lldb-shell :: Register/x86-gp-write.test (303 of 1524) UNSUPPORTED: lldb-api :: functionalities/data-formatter/data-formatter-stl/libstdcpp/tuple/TestDataFormatterStdTuple.py (304 of 1524) PASS: lldb-api :: functionalities/thread/concurrent_events/TestConcurrentSignalNWatchNBreak.py (305 of 1524) PASS: lldb-shell :: Settings/TestSettingsWrite.test (306 of 1524) PASS: lldb-api :: functionalities/wrong_commands/TestWrongCommands.py (307 of 1524) PASS: lldb-api :: commands/expression/dont_allow_jit/TestAllowJIT.py (308 of 1524) PASS: lldb-shell :: ObjectFile/ELF/null-jmprel.yaml (309 of 1524) PASS: lldb-shell :: Reproducer/TestPythonImport.test (310 of 1524) PASS: lldb-shell :: SymbolFile/DWARF/x86/dwarf5-atomic.s (311 of 1524) PASS: lldb-api :: lang/objc/objc-static-method/TestObjCStaticMethod.py (312 of 1524) PASS: lldb-api :: sanity/TestModuleCacheSanity.py (313 of 1524) UNSUPPORTED: lldb-shell :: Register/x86-zmm-read.test (314 of 1524) PASS: lldb-api :: functionalities/step-avoids-no-debug/TestStepNoDebug.py (315 of 1524) XFAIL: lldb-shell :: Register/x86-mm-xmm-write.test (316 of 1524) PASS: lldb-api :: macosx/function-starts/TestFunctionStarts.py (317 of 1524) PASS: lldb-api :: lang/c/conflicting-symbol/TestConflictingSymbol.py (318 of 1524) PASS: lldb-api :: qemu/TestQemuLaunch.py (319 of 1524) PASS: lldb-shell :: Register/Core/x86-32-linux-fp.test (320 of 1524) PASS: lldb-api :: macosx/version_zero/TestGetVersionZeroVersion.py (321 of 1524) PASS: lldb-api :: tools/lldb-server/inferior-crash/TestGdbRemoteAbort.py (322 of 1524) PASS: lldb-api :: functionalities/step-vrs-interrupt/TestStepVrsInterruptTimeout.py (323 of 1524) PASS: lldb-api :: lang/objc/orderedset/TestOrderedSet.py (324 of 1524) PASS: lldb-api :: functionalities/thread/concurrent_events/TestConcurrentTwoBreakpointThreads.py (325 of 1524) PASS: lldb-api :: functionalities/thread/concurrent_events/TestConcurrentWatchBreakDelay.py (326 of 1524) PASS: lldb-api :: python_api/type/TestTypeList.py (327 of 1524) PASS: lldb-api :: types/TestIntegerTypeExpr.py (328 of 1524) PASS: lldb-api :: commands/frame/recognizer/TestFrameRecognizer.py (329 of 1524) PASS: lldb-api :: commands/log/invalid-args/TestInvalidArgsLog.py (330 of 1524) PASS: lldb-shell :: ObjectFile/ELF/PT_LOAD-overlap-section.yaml (331 of 1524) PASS: lldb-shell :: SymbolFile/DWARF/x86/dwarf5-index-is-used.cpp (332 of 1524) PASS: lldb-api :: commands/frame/diagnose/virtual-method-call/TestDiagnoseDereferenceVirtualMethodCall.py (333 of 1524) UNSUPPORTED: lldb-api :: tools/lldb-server/vCont-threads/TestPartialResume.py (334 of 1524) PASS: lldb-api :: lang/cpp/keywords_enabled/TestCppKeywordsEnabled.py (335 of 1524) UNSUPPORTED: lldb-shell :: SymbolFile/DWARF/x86/dwarf5-line-strp.s (336 of 1524) PASS: lldb-shell :: Settings/TestStopCommandSourceOnError.test (337 of 1524) UNSUPPORTED: lldb-api :: functionalities/ptr_refs/TestPtrRefs.py (338 of 1524) PASS: lldb-api :: types/TestDoubleTypesExpr.py (339 of 1524) UNSUPPORTED: lldb-api :: commands/expression/import-std-module/stack/TestStackFromStdModule.py (340 of 1524) UNSUPPORTED: lldb-api :: functionalities/gdb_remote_client/TestAArch64XMLRegOffsets.py (341 of 1524) PASS: lldb-shell :: SymbolFile/NativePDB/source-list.cpp (342 of 1524) PASS: lldb-api :: functionalities/breakpoint/cpp_exception/TestCPPExceptionBreakpoint.py (343 of 1524) PASS: lldb-api :: lang/objc/unicode-string/TestUnicodeString.py (344 of 1524) PASS: lldb-api :: functionalities/data-formatter/data-formatter-objc/TestDataFormatterObjCNSURL.py (345 of 1524) UNSUPPORTED: lldb-api :: functionalities/ubsan/user-expression/TestUbsanUserExpression.py (346 of 1524) UNSUPPORTED: lldb-api :: functionalities/tsan/multiple/TestTsanMultiple.py (347 of 1524) PASS: lldb-api :: lang/objc/objc-ivar-stripped/TestObjCIvarStripped.py (348 of 1524) PASS: lldb-api :: functionalities/thread/state_after_expression/TestStateAfterExpression.py (349 of 1524) PASS: lldb-api :: python_api/value_var_update/TestValueVarUpdate.py (350 of 1524) PASS: lldb-api :: tools/lldb-vscode/console/TestVSCode_console.py (351 of 1524) UNSUPPORTED: lldb-api :: benchmarks/libcxxmap/TestBenchmarkLibcxxMap.py (352 of 1524) PASS: lldb-api :: functionalities/stats_api/TestStatisticsAPI.py (353 of 1524) PASS: lldb-api :: lang/c/stepping/TestThreadStepInAvoidRegexp.py (354 of 1524) UNSUPPORTED: lldb-shell :: SymbolFile/PDB/function-level-linking.test (355 of 1524) PASS: lldb-api :: functionalities/dlopen_other_executable/TestDlopenOtherExecutable.py (356 of 1524) PASS: lldb-api :: lang/c/record_decl_in_expr/TestRecordDeclInExpr.py (357 of 1524) PASS: lldb-api :: functionalities/data-formatter/data-formatter-cpp/TestDataFormatterCpp.py (358 of 1524) PASS: lldb-shell :: SymbolFile/NativePDB/ast-types.cpp (359 of 1524) UNSUPPORTED: lldb-shell :: ScriptInterpreter/Lua/breakpoint_oneline_callback.test (360 of 1524) PASS: lldb-api :: lang/cpp/namespace_definitions/TestNamespaceDefinitions.py (361 of 1524) PASS: lldb-api :: commands/expression/top-level/TestTopLevelExprs.py (362 of 1524) PASS: lldb-api :: commands/expression/radar_9531204/TestPrintfAfterUp.py (363 of 1524) PASS: lldb-api :: python_api/value/change_values/TestChangeValueAPI.py (364 of 1524) UNSUPPORTED: lldb-api :: lang/cpp/function-template-parameter-pack/TestFunctionTemplateParameterPack.py (365 of 1524) PASS: lldb-api :: types/TestShortTypeExpr.py (366 of 1524) PASS: lldb-shell :: SymbolFile/DWARF/x86/win-i386-line-table.s (367 of 1524) PASS: lldb-api :: tools/lldb-server/TestAppleSimulatorOSType.py (368 of 1524) PASS: lldb-shell :: ObjectFile/PECOFF/dwarf-gnu-debuglink-mismatched-crc.yaml (369 of 1524) PASS: lldb-api :: lang/objc/modules-inline-functions/TestModulesInlineFunctions.py (370 of 1524) PASS: lldb-api :: commands/disassemble/basic/TestDisassembleBreakpoint.py (371 of 1524) PASS: lldb-api :: lang/cpp/typeof/TestTypeOfDeclTypeExpr.py (372 of 1524) PASS: lldb-shell :: ObjectFile/ELF/avr-basic-info.yaml (373 of 1524) PASS: lldb-api :: functionalities/breakpoint/comp_dir_symlink/TestCompDirSymLink.py (374 of 1524) PASS: lldb-api :: commands/apropos/with-process/TestAproposWithProcess.py (375 of 1524) PASS: lldb-shell :: ObjectFile/wasm/stripped-debug-sections.yaml (376 of 1524) UNSUPPORTED: lldb-api :: functionalities/progress_reporting/TestTrimmedProgressReporting.py (377 of 1524) PASS: lldb-shell :: ObjectFile/ELF/short-build-id.yaml (378 of 1524) PASS: lldb-api :: tools/lldb-server/inferior-crash/TestGdbRemoteSegFault.py (379 of 1524) PASS: lldb-api :: functionalities/thread/step_until/TestStepUntil.py (380 of 1524) PASS: lldb-api :: lang/cpp/elaborated-types/TestElaboratedTypes.py (381 of 1524) PASS: lldb-api :: lang/objc/objc-dyn-sbtype/TestObjCDynamicSBType.py (382 of 1524) UNSUPPORTED: lldb-api :: linux/aarch64/mte_memory_region/TestAArch64LinuxMTEMemoryRegion.py (383 of 1524) PASS: lldb-api :: commands/expression/codegen-crash-typedefdecl-not-in_declcontext/TestCodegenCrashTypedefDeclNotInDeclContext.py (384 of 1524) UNSUPPORTED: lldb-shell :: Subprocess/clone-follow-parent-softbp.test (385 of 1524) PASS: lldb-shell :: ObjectFile/ELF/duplicate-section.yaml (386 of 1524) PASS: lldb-api :: types/TestLongTypes.py (387 of 1524) PASS: lldb-api :: functionalities/module_cache/bsd/TestModuleCacheBSD.py (388 of 1524) PASS: lldb-api :: lang/c/stepping/TestStepAndBreakpoints.py (389 of 1524) PASS: lldb-api :: python_api/sbtype_typeclass/TestSBTypeTypeClass.py (390 of 1524) PASS: lldb-shell :: ObjectFile/PECOFF/symbol.yaml (391 of 1524) PASS: lldb-api :: python_api/lldbutil/iter/TestRegistersIterator.py (392 of 1524) PASS: lldb-shell :: ExecControl/StopHook/stop-hook.test (393 of 1524) PASS: lldb-api :: macosx/find-app-in-bundle/TestFindAppInBundle.py (394 of 1524) UNSUPPORTED: lldb-api :: lang/objc/modules-update/TestClangModulesUpdate.py (395 of 1524) PASS: lldb-api :: lang/objc/objc-stepping/TestObjCStepping.py (396 of 1524) PASS: lldb-api :: functionalities/step_scripted/TestStepScripted.py (397 of 1524) PASS: lldb-shell :: Subprocess/vfork-follow-parent.test (398 of 1524) PASS: lldb-api :: types/TestDoubleTypes.py (399 of 1524) PASS: lldb-shell :: Breakpoint/dummy-target.test (400 of 1524) PASS: lldb-shell :: SymbolFile/Breakpad/line-table-edgecases.test (401 of 1524) PASS: lldb-api :: functionalities/data-formatter/data-formatter-objc/TestDataFormatterObjCNSBundle.py (402 of 1524) UNSUPPORTED: lldb-api :: benchmarks/continue/TestBenchmarkContinue.py (403 of 1524) PASS: lldb-api :: lang/cpp/stl/TestStdCXXDisassembly.py (404 of 1524) PASS: lldb-shell :: SymbolFile/DWARF/x86/DW_AT_loclists_base.s (405 of 1524) PASS: lldb-api :: driver/batch_mode/TestBatchMode.py (406 of 1524) PASS: lldb-shell :: Reproducer/TestDump.test (407 of 1524) PASS: lldb-api :: lang/c/complex/TestComplexC99.py (408 of 1524) PASS: lldb-shell :: ObjectFile/MachO/symtab.yaml (409 of 1524) UNSUPPORTED: lldb-shell :: SymbolFile/DWARF/dwo-relative-path.s (410 of 1524) PASS: lldb-api :: lang/cpp/struct_with_keyword_name/TestStructWithKeywordName.py (411 of 1524) PASS: lldb-api :: functionalities/avoids-fd-leak/TestFdLeak.py (412 of 1524) PASS: lldb-api :: lang/c/vla/TestVLA.py (413 of 1524) PASS: lldb-api :: functionalities/data-formatter/setvaluefromcstring/TestSetValueFromCString.py (414 of 1524) PASS: lldb-api :: functionalities/postmortem/minidump/TestMiniDump.py (415 of 1524) PASS: lldb-shell :: lldb-server/TestErrorMessages.test (416 of 1524) PASS: lldb-shell :: SymbolFile/DWARF/x86/subprogram_ranges.test (417 of 1524) UNSUPPORTED: lldb-api :: benchmarks/turnaround/TestCompileRunToBreakpointTurnaround.py (418 of 1524) PASS: lldb-api :: lang/objc/objc-new-syntax/TestObjCNewSyntaxLiteral.py (419 of 1524) PASS: lldb-api :: functionalities/thread/concurrent_events/TestConcurrentDelayedCrashWithBreakpointSignal.py (420 of 1524) PASS: lldb-api :: commands/expression/context-object-objc/TestContextObjectObjc.py (421 of 1524) PASS: lldb-api :: commands/frame/diagnose/complicated-expression/TestComplicatedExpression.py (422 of 1524) PASS: lldb-api :: lang/objc/foundation/TestObjCMethods2.py (423 of 1524) XFAIL: lldb-api :: lang/c/typedef/Testtypedef.py (424 of 1524) PASS: lldb-api :: lang/c/register_variables/TestRegisterVariables.py (425 of 1524) PASS: lldb-api :: functionalities/thread/concurrent_events/TestConcurrentDelaySignalWatch.py (426 of 1524) PASS: lldb-api :: python_api/process/read-mem-cstring/TestReadMemCString.py (427 of 1524) PASS: lldb-api :: lang/cpp/dynamic-value/TestDynamicValue.py (428 of 1524) PASS: lldb-api :: functionalities/gdb_remote_client/TestThreadInfoTrailingComma.py (429 of 1524) PASS: lldb-shell :: SymbolFile/DWARF/x86/DW_OP_deref_size_static_var.s (430 of 1524) PASS: lldb-api :: tools/lldb-vscode/breakpoint/TestVSCode_setBreakpoints.py (431 of 1524) PASS: lldb-api :: commands/log/basic/TestLogging.py (432 of 1524) PASS: lldb-api :: api/listeners/TestListener.py (433 of 1524) PASS: lldb-shell :: ScriptInterpreter/Python/Crashlog/no-args.test (434 of 1524) PASS: lldb-api :: lang/objc/objc-struct-return/TestObjCStructReturn.py (435 of 1524) PASS: lldb-shell :: SymbolFile/NativePDB/global-classes.cpp (436 of 1524) PASS: lldb-shell :: BuildScript/toolchain-clang.test (437 of 1524) PASS: lldb-shell :: ScriptInterpreter/Python/python.test (438 of 1524) PASS: lldb-api :: api/multithreaded/TestMultithreaded.py (439 of 1524) PASS: lldb-shell :: VSCode/TestOptions.test (440 of 1524) PASS: lldb-api :: commands/process/launch-with-shellexpand/TestLaunchWithShellExpand.py (441 of 1524) PASS: lldb-api :: functionalities/gdb_remote_client/TestArmRegisterDefinition.py (442 of 1524) PASS: lldb-shell :: ObjectFile/PECOFF/dep-modules.yaml (443 of 1524) PASS: lldb-api :: functionalities/gdb_remote_client/TestRegDefinitionInParts.py (444 of 1524) PASS: lldb-api :: functionalities/gdb_remote_client/TestNestedRegDefinitions.py (445 of 1524) PASS: lldb-shell :: SymbolFile/DWARF/x86/compilercontext.ll (446 of 1524) PASS: lldb-api :: commands/frame/diagnose/local-variable/TestLocalVariable.py (447 of 1524) PASS: lldb-api :: commands/frame/language/TestGuessLanguage.py (448 of 1524) PASS: lldb-api :: lang/objc/modules/TestObjCModules.py (449 of 1524) PASS: lldb-shell :: Commands/command-backtrace-parser-2.test (450 of 1524) PASS: lldb-shell :: Register/Core/x86-64-netbsd-addr.test (451 of 1524) UNSUPPORTED: lldb-shell :: SymbolFile/NativePDB/inline_sites_live.cpp (452 of 1524) PASS: lldb-api :: commands/memory/read/TestMemoryRead.py (453 of 1524) PASS: lldb-api :: python_api/name_lookup/TestNameLookup.py (454 of 1524) UNSUPPORTED: lldb-api :: tools/lldb-server/libraries-svr4/TestGdbRemoteLibrariesSvr4Support.py (455 of 1524) PASS: lldb-api :: lang/cpp/namespace/TestNamespace.py (456 of 1524) PASS: lldb-shell :: Breakpoint/breakpoint-command.test (457 of 1524) PASS: lldb-api :: commands/platform/file/close/TestPlatformFileClose.py (458 of 1524) PASS: lldb-shell :: SymbolFile/NativePDB/missing-type.s (459 of 1524) PASS: lldb-api :: functionalities/object-file/TestImageListMultiArchitecture.py (460 of 1524) UNSUPPORTED: lldb-shell :: ScriptInterpreter/Lua/lua.test (461 of 1524) PASS: lldb-api :: python_api/findvalue_duplist/TestSBFrameFindValue.py (462 of 1524) PASS: lldb-api :: linux/builtin_trap/TestBuiltinTrap.py (463 of 1524) PASS: lldb-api :: lang/c/stepping/TestThreadStepping.py (464 of 1524) PASS: lldb-api :: commands/frame/diagnose/dereference-argument/TestDiagnoseDereferenceArgument.py (465 of 1524) PASS: lldb-api :: commands/apropos/basic/TestApropos.py (466 of 1524) PASS: lldb-shell :: SymbolFile/NativePDB/ast-functions.cpp (467 of 1524) PASS: lldb-api :: lang/objc/direct-dispatch-step/TestObjCDirectDispatchStepping.py (468 of 1524) PASS: lldb-api :: commands/expression/ir-interpreter-phi-nodes/TestIRInterpreterPHINodes.py (469 of 1524) PASS: lldb-api :: functionalities/data-formatter/data-formatter-enum-format/TestDataFormatterEnumFormat.py (470 of 1524) PASS: lldb-shell :: ObjectFile/MachO/lc_build_version.yaml (471 of 1524) PASS: lldb-shell :: ObjectFile/wasm/basic.yaml (472 of 1524) UNSUPPORTED: lldb-api :: macosx/posix_spawn/TestLaunchProcessPosixSpawn.py (473 of 1524) PASS: lldb-api :: commands/source/info/TestSourceInfo.py (474 of 1524) PASS: lldb-shell :: SymbolFile/DWARF/x86/DW_AT_location-DW_AT_const_value.s (475 of 1524) PASS: lldb-api :: python_api/sbvalue_persist/TestSBValuePersist.py (476 of 1524) PASS: lldb-api :: tools/lldb-vscode/variables/TestVSCode_variables.py (477 of 1524) UNSUPPORTED: lldb-api :: functionalities/thread/concurrent_events/TestConcurrentManySignals.py (478 of 1524) PASS: lldb-shell :: SymbolFile/NativePDB/function-types-calling-conv.cpp (479 of 1524) PASS: lldb-shell :: Settings/TestSettingsSet.test (480 of 1524) PASS: lldb-shell :: SymbolFile/DWARF/x86/dir-separator-windows.s (481 of 1524) UNSUPPORTED: lldb-api :: functionalities/exec/TestExec.py (482 of 1524) PASS: lldb-api :: lang/c/set_values/TestSetValues.py (483 of 1524) UNSUPPORTED: lldb-api :: linux/add-symbols/TestTargetSymbolsAddCommand.py (484 of 1524) PASS: lldb-api :: functionalities/thread/backtrace_limit/TestBacktraceLimit.py (485 of 1524) PASS: lldb-shell :: Driver/TestQuiet.test (486 of 1524) PASS: lldb-api :: functionalities/thread/exit_during_expression/TestExitDuringExpression.py (487 of 1524) PASS: lldb-shell :: SymbolFile/DWARF/x86/DW_OP_piece-smaller-than-struct.s (488 of 1524) PASS: lldb-api :: functionalities/data-formatter/type_summary_list_arg/TestTypeSummaryListArg.py (489 of 1524) PASS: lldb-shell :: Process/UnsupportedLanguage.test (490 of 1524) PASS: lldb-api :: commands/expression/formatters/TestFormatters.py (491 of 1524) PASS: lldb-api :: python_api/module_section/TestModuleAndSection.py (492 of 1524) PASS: lldb-api :: functionalities/data-formatter/data-formatter-globals/TestDataFormatterGlobals.py (493 of 1524) PASS: lldb-api :: functionalities/gdb_remote_client/TestPty.py (494 of 1524) PASS: lldb-shell :: SymbolFile/DWARF/x86/dwp.s (495 of 1524) XFAIL: lldb-shell :: Unwind/prefer-debug-over-eh-frame.test (496 of 1524) PASS: lldb-api :: functionalities/thread/concurrent_events/TestConcurrentManyWatchpoints.py (497 of 1524) PASS: lldb-api :: symbol_ondemand/shared_library/TestSharedLibOnDemand.py (498 of 1524) PASS: lldb-api :: functionalities/thread/jump/TestThreadJump.py (499 of 1524) PASS: lldb-api :: functionalities/plugins/command_plugin/TestPluginCommands.py (500 of 1524) PASS: lldb-shell :: Process/Optimization.test (501 of 1524) PASS: lldb-api :: commands/expression/cast_int_to_anonymous_enum/TestCastIntToAnonymousEnum.py (502 of 1524) PASS: lldb-api :: lang/objc/foundation/TestObjectDescriptionAPI.py (503 of 1524) PASS: lldb-shell :: SymbolFile/DWARF/x86/debug-types-dwarf5.s (504 of 1524) UNSUPPORTED: lldb-shell :: SymbolFile/DWARF/dwarf5-lazy-dwo.c (505 of 1524) PASS: lldb-shell :: Register/x86-multithread-read.test (506 of 1524) PASS: lldb-api :: commands/thread/backtrace/TestThreadBacktraceRepeat.py (507 of 1524) PASS: lldb-api :: functionalities/plugins/python_os_plugin/stepping_plugin_threads/TestOSPluginStepping.py (508 of 1524) PASS: lldb-api :: functionalities/reproducers/attach/TestReproducerAttach.py (509 of 1524) PASS: lldb-shell :: SymbolFile/DWARF/x86/debug_line-relative_path.s (510 of 1524) PASS: lldb-api :: commands/expression/import-std-module/forward_list-dbg-info-content/TestDbgInfoContentForwardListFromStdModule.py (511 of 1524) PASS: lldb-api :: commands/expression/completion/TestExprCompletion.py (512 of 1524) PASS: lldb-api :: functionalities/data-formatter/data-formatter-stl/libcxx/string_view/TestDataFormatterLibcxxStringView.py (513 of 1524) PASS: lldb-api :: functionalities/scripted_process/TestStackCoreScriptedProcess.py (514 of 1524) PASS: lldb-api :: python_api/process/io/TestProcessIO.py (515 of 1524) PASS: lldb-api :: functionalities/thread/concurrent_events/TestConcurrentDelaySignalBreak.py (516 of 1524) PASS: lldb-api :: lang/cpp/overloaded-functions/TestOverloadedFunctions.py (517 of 1524) PASS: lldb-api :: functionalities/process_group/TestChangeProcessGroup.py (518 of 1524) PASS: lldb-shell :: SymbolFile/DWARF/x86/DW_AT_decl_file-DW_AT_specification-crosscu.s (519 of 1524) PASS: lldb-api :: lang/objc/tagged-pointer/TestTaggedPointerCmd.py (520 of 1524) PASS: lldb-api :: lang/c/inlines/TestRedefinitionsInInlines.py (521 of 1524) PASS: lldb-api :: functionalities/gdb_remote_client/TestMultiprocess.py (522 of 1524) UNSUPPORTED: lldb-api :: functionalities/ptrauth_diagnostics/BLRAA_error/TestPtrauthBLRAADiagnostic.py (523 of 1524) PASS: lldb-api :: commands/expression/timeout/TestCallWithTimeout.py (524 of 1524) PASS: lldb-shell :: ObjectFile/ELF/eh_frame-symbols.yaml (525 of 1524) PASS: lldb-api :: functionalities/breakpoint/address_breakpoints/TestAddressBreakpoints.py (526 of 1524) PASS: lldb-shell :: SymbolFile/NativePDB/tag-types.cpp (527 of 1524) PASS: lldb-api :: python_api/file_handle/TestFileHandle.py (528 of 1524) PASS: lldb-api :: functionalities/data-formatter/vector-types/TestVectorTypesFormatting.py (529 of 1524) PASS: lldb-api :: commands/statistics/basic/TestStats.py (530 of 1524) PASS: lldb-api :: lang/c/shared_lib/TestSharedLib.py (531 of 1524) PASS: lldb-api :: functionalities/data-formatter/data-formatter-stl/libcxx/iterator/TestDataFormatterLibccIterator.py (532 of 1524) PASS: lldb-api :: functionalities/postmortem/minidump-new/TestMiniDumpUUID.py (533 of 1524) PASS: lldb-api :: functionalities/data-formatter/builtin-formats/TestBuiltinFormats.py (534 of 1524) PASS: lldb-shell :: Breakpoint/jit-loader_jitlink_elf.test (535 of 1524) PASS: lldb-api :: lang/cpp/chained-calls/TestCppChainedCalls.py (536 of 1524) PASS: lldb-api :: tools/lldb-server/TestGdbRemote_qThreadStopInfo.py (537 of 1524) PASS: lldb-shell :: SymbolFile/DWARF/x86/debug-types-dwo-cross-reference.cpp (538 of 1524) PASS: lldb-api :: commands/watchpoints/multiple_threads/TestWatchpointMultipleThreads.py (539 of 1524) UNSUPPORTED: lldb-shell :: Breakpoint/ppc64le-localentry.test (540 of 1524) PASS: lldb-shell :: Register/x86-64-write.test (541 of 1524) PASS: lldb-api :: lang/mixed/TestMixedLanguages.py (542 of 1524) UNSUPPORTED: lldb-shell :: Register/x86-64-gp-write.test (543 of 1524) PASS: lldb-api :: functionalities/dynamic_value_child_count/TestDynamicValueChildCount.py (544 of 1524) PASS: lldb-shell :: Minidump/Windows/Sigsegv/sigsegv.test (545 of 1524) PASS: lldb-shell :: ObjectFile/Breakpad/breakpad-identification.test (546 of 1524) PASS: lldb-api :: macosx/ignore_exceptions/TestIgnoredExceptions.py (547 of 1524) PASS: lldb-shell :: ObjectFile/ELF/PT_LOAD-overlap-PT_INTERP.yaml (548 of 1524) PASS: lldb-shell :: SymbolFile/DWARF/x86/inline-function-address.ll (549 of 1524) PASS: lldb-api :: tools/lldb-server/TestGdbRemoteKill.py (550 of 1524) PASS: lldb-api :: types/TestIntegerType.py (551 of 1524) PASS: lldb-shell :: SymbolFile/DWARF/x86/dwarf5-implicit-const.s (552 of 1524) PASS: lldb-api :: lang/cpp/printf/TestPrintf.py (553 of 1524) PASS: lldb-api :: commands/expression/context-object/TestContextObject.py (554 of 1524) PASS: lldb-shell :: Register/Core/x86-32-netbsd-addr.test (555 of 1524) PASS: lldb-api :: lang/c/enum_types/TestEnumTypes.py (556 of 1524) PASS: lldb-api :: lang/cpp/type_lookup/TestCppTypeLookup.py (557 of 1524) UNSUPPORTED: lldb-shell :: Subprocess/vfork-follow-child.test (558 of 1524) PASS: lldb-shell :: Commands/command-disassemble-process.yaml (559 of 1524) UNSUPPORTED: lldb-api :: tools/lldb-vscode/completions/TestVSCode_completions.py (560 of 1524) PASS: lldb-api :: functionalities/data-formatter/data-formatter-smart-array/TestDataFormatterSmartArray.py (561 of 1524) PASS: lldb-api :: functionalities/gdb_remote_client/TestTargetXMLArch.py (562 of 1524) UNSUPPORTED: lldb-shell :: SymbolFile/Breakpad/stack-cfi-arm.yaml (563 of 1524) UNSUPPORTED: lldb-api :: iohandler/stdio/TestIOHandlerProcessSTDIO.py (564 of 1524) PASS: lldb-api :: functionalities/data-formatter/synthupdate/TestSyntheticFilterRecompute.py (565 of 1524) UNSUPPORTED: lldb-shell :: Breakpoint/ppc64-localentry.test (566 of 1524) PASS: lldb-api :: functionalities/tail_call_frames/ambiguous_tail_call_seq1/TestAmbiguousTailCallSeq1.py (567 of 1524) PASS: lldb-api :: functionalities/gdb_remote_client/TestPlatformMacOSX.py (568 of 1524) PASS: lldb-shell :: ObjectFile/ELF/PT_LOAD-overlap.yaml (569 of 1524) UNSUPPORTED: lldb-shell :: ScriptInterpreter/Python/Crashlog/interactive_crashlog_invalid_target.test (570 of 1524) PASS: lldb-shell :: Settings/TestFrameFormatColor.test (571 of 1524) UNSUPPORTED: lldb-api :: functionalities/thread/concurrent_events/exit/TestConcurrentThreadExit.py (572 of 1524) PASS: lldb-shell :: ScriptInterpreter/Python/Crashlog/parser_text.test (573 of 1524) UNSUPPORTED: lldb-shell :: ScriptInterpreter/Lua/bindings.test (574 of 1524) PASS: lldb-api :: tools/lldb-vscode/breakpoint/TestVSCode_setExceptionBreakpoints.py (575 of 1524) UNSUPPORTED: lldb-api :: functionalities/gdb_remote_client/TestWasm.py (576 of 1524) PASS: lldb-api :: macosx/universal/TestUniversal.py (577 of 1524) PASS: lldb-api :: tools/lldb-vscode/coreFile/TestVSCode_coreFile.py (578 of 1524) UNSUPPORTED: lldb-shell :: ExecControl/StopHook/stop-hook-threads.test (579 of 1524) UNSUPPORTED: lldb-api :: functionalities/disassemble/aarch64-adrp-add/TestAArch64AdrpAdd.py (580 of 1524) PASS: lldb-api :: lang/objc/rdar-11355592/TestRdar11355592.py (581 of 1524) PASS: lldb-shell :: SymbolFile/DWARF/x86/inline-function-address-shared.test (582 of 1524) PASS: lldb-api :: commands/expression/argument_passing_restrictions/TestArgumentPassingRestrictions.py (583 of 1524) PASS: lldb-shell :: ScriptInterpreter/Python/sb_address_exception.test (584 of 1524) PASS: lldb-shell :: Quit/TestQuitExitCodeHexA.test (585 of 1524) PASS: lldb-shell :: SymbolFile/DWARF/x86/debug_rnglists-dwo.s (586 of 1524) PASS: lldb-api :: commands/expression/persistent_types/TestPersistentTypes.py (587 of 1524) PASS: lldb-shell :: SymbolFile/DWARF/x86/debug_loc_and_loclists.s (588 of 1524) PASS: lldb-shell :: Quit/TestQuitExitCodeImplicit0.test (589 of 1524) PASS: lldb-api :: python_api/symbol-context/TestSymbolContext.py (590 of 1524) PASS: lldb-api :: functionalities/multidebugger_commands/TestMultipleDebuggersCommands.py (591 of 1524) PASS: lldb-api :: symbol_ondemand/breakpoint_language/TestBreakpointLanguageOnDemand.py (592 of 1524) PASS: lldb-api :: functionalities/breakpoint/auto_continue/TestBreakpointAutoContinue.py (593 of 1524) PASS: lldb-api :: python_api/objc_type/TestObjCType.py (594 of 1524) PASS: lldb-shell :: SymbolFile/Breakpad/symtab-macho.test (595 of 1524) PASS: lldb-api :: commands/expression/import-std-module/iterator/TestIteratorFromStdModule.py (596 of 1524) PASS: lldb-api :: functionalities/gdb_remote_client/TestThreadSelectionBug.py (597 of 1524) PASS: lldb-api :: functionalities/process_crash_info/TestProcessCrashInfo.py (598 of 1524) PASS: lldb-api :: lang/cpp/incomplete-types/TestCppIncompleteTypes.py (599 of 1524) PASS: lldb-shell :: ObjectFile/PECOFF/dwarf-gnu-debuglink-pdb-buildid.yaml (600 of 1524) PASS: lldb-shell :: Commands/command-disassemble.s (601 of 1524) PASS: lldb-api :: lang/cpp/multiple-inheritance/TestCppMultipleInheritance.py (602 of 1524) PASS: lldb-api :: lang/cpp/nested-class-other-compilation-unit/TestNestedClassWithParentInAnotherCU.py (603 of 1524) PASS: lldb-api :: functionalities/gdb_remote_client/TestGDBRemoteClient.py (604 of 1524) UNSUPPORTED: lldb-shell :: SymbolFile/DWARF/split-optimized.c (605 of 1524) PASS: lldb-api :: python_api/lldbutil/TestSwigVersion.py (606 of 1524) PASS: lldb-api :: functionalities/abbreviation/TestAbbreviations.py (607 of 1524) PASS: lldb-api :: tools/lldb-server/signal-filtering/TestGdbRemote_QPassSignals.py (608 of 1524) PASS: lldb-api :: commands/frame/diagnose/dereference-function-return/TestDiagnoseDereferenceFunctionReturn.py (609 of 1524) PASS: lldb-api :: macosx/indirect_symbol/TestIndirectSymbols.py (610 of 1524) PASS: lldb-api :: functionalities/breakpoint/break_in_loaded_dylib/TestBreakInLoadedDylib.py (611 of 1524) PASS: lldb-api :: commands/expression/import-std-module/weak_ptr-dbg-info-content/TestDbgInfoContentWeakPtrFromStdModule.py (612 of 1524) PASS: lldb-api :: functionalities/breakpoint/debugbreak/TestDebugBreak.py (613 of 1524) PASS: lldb-api :: functionalities/data-formatter/data-formatter-stl/libcxx/string/TestDataFormatterLibcxxString.py (614 of 1524) PASS: lldb-api :: functionalities/gdb_remote_client/TestRecognizeBreakpoint.py (615 of 1524) PASS: lldb-shell :: Reproducer/TestDSYM.test (616 of 1524) PASS: lldb-api :: functionalities/data-formatter/data-formatter-stl/generic/bitset/TestDataFormatterGenericBitset.py (617 of 1524) PASS: lldb-shell :: ObjectFile/PECOFF/sections.yaml (618 of 1524) PASS: lldb-api :: lang/cpp/class_types/TestClassTypes.py (619 of 1524) PASS: lldb-shell :: Register/Core/x86-64-freebsd-addr.test (620 of 1524) PASS: lldb-api :: commands/command/nested_alias/TestNestedAlias.py (621 of 1524) PASS: lldb-api :: api/log/TestAPILog.py (622 of 1524) PASS: lldb-api :: lang/cpp/signed_types/TestSignedTypes.py (623 of 1524) PASS: lldb-api :: commands/expression/call-function/TestCallBuiltinFunction.py (624 of 1524) PASS: lldb-api :: functionalities/data-formatter/data-formatter-objc/TestDataFormatterObjCExpr.py (625 of 1524) PASS: lldb-api :: tools/lldb-vscode/stackTrace/TestVSCode_stackTrace.py (626 of 1524) PASS: lldb-api :: functionalities/postmortem/elf-core/gcore/TestGCore.py (627 of 1524) PASS: lldb-api :: commands/expression/import-std-module/forward_decl_from_module/TestForwardDeclFromStdModule.py (628 of 1524) PASS: lldb-api :: commands/expression/import-std-module/unique_ptr/TestUniquePtrFromStdModule.py (629 of 1524) PASS: lldb-api :: functionalities/completion/TestCompletion.py (630 of 1524) PASS: lldb-api :: functionalities/data-formatter/data-formatter-skip-summary/TestDataFormatterSkipSummary.py (631 of 1524) PASS: lldb-api :: functionalities/data-formatter/data-formatter-stl/libcxx/queue/TestDataFormatterLibcxxQueue.py (632 of 1524) PASS: lldb-shell :: ObjectFile/ELF/PT_LOAD.yaml (633 of 1524) PASS: lldb-api :: functionalities/gdb_remote_client/TestGDBServerNoTargetXML.py (634 of 1524) PASS: lldb-api :: functionalities/inferior-changed/TestInferiorChanged.py (635 of 1524) PASS: lldb-shell :: ObjectFile/ELF/basic-info.yaml (636 of 1524) UNSUPPORTED: lldb-shell :: SymbolFile/PDB/pointers.test (637 of 1524) UNSUPPORTED: lldb-api :: functionalities/ptrauth_diagnostics/BRAA_error/TestPtrauthBRAADiagnostic.py (638 of 1524) PASS: lldb-api :: lang/c/sizeof/TestCSizeof.py (639 of 1524) PASS: lldb-api :: lang/cpp/offsetof/TestOffsetofCpp.py (640 of 1524) PASS: lldb-api :: commands/expression/inline-namespace/TestInlineNamespace.py (641 of 1524) PASS: lldb-shell :: Commands/command-script-import.test (642 of 1524) PASS: lldb-shell :: SymbolFile/DWARF/x86/find-basic-variable.cpp (643 of 1524) PASS: lldb-api :: python_api/function_symbol/TestSymbolAPI.py (644 of 1524) PASS: lldb-api :: functionalities/breakpoint/breakpoint_conditions/TestBreakpointConditions.py (645 of 1524) PASS: lldb-api :: commands/expression/options/TestExprOptions.py (646 of 1524) PASS: lldb-api :: functionalities/thread/concurrent_events/TestConcurrentTwoWatchpointThreads.py (647 of 1524) PASS: lldb-api :: functionalities/thread/concurrent_events/TestConcurrentManyBreakpoints.py (648 of 1524) PASS: lldb-shell :: SymbolFile/DWARF/x86/debug_loc-aslr.s (649 of 1524) PASS: lldb-api :: functionalities/data-formatter/data-formatter-stl/generic/set/TestDataFormatterGenericSet.py (650 of 1524) XFAIL: lldb-shell :: ObjectFile/PECOFF/default-triple-windows-gnu.yaml (651 of 1524) UNSUPPORTED: lldb-api :: functionalities/dyld-launch-linux/TestDyldLaunchLinux.py (652 of 1524) PASS: lldb-shell :: SymbolFile/DWARF/x86/debug-types-missing-signature.test (653 of 1524) PASS: lldb-api :: functionalities/breakpoint/cpp/TestCPPBreakpointLocations.py (654 of 1524) PASS: lldb-shell :: SymbolFile/DWARF/x86/dwarf5_locations.s (655 of 1524) PASS: lldb-api :: lang/cpp/global_variables/TestCPPGlobalVariables.py (656 of 1524) PASS: lldb-shell :: Unwind/eh-frame-dwarf-unwind.test (657 of 1524) PASS: lldb-api :: lang/objc/bitfield_ivars/TestBitfieldIvars.py (658 of 1524) UNSUPPORTED: lldb-shell :: ScriptInterpreter/Lua/lua-python.test (659 of 1524) UNSUPPORTED: lldb-api :: benchmarks/frame_variable/TestFrameVariableResponse.py (660 of 1524) UNSUPPORTED: lldb-shell :: ScriptInterpreter/Python/Crashlog/skipped_status_interactive_crashlog.test (661 of 1524) PASS: lldb-shell :: SymbolFile/DWARF/x86/childless-compile-unit.s (662 of 1524) PASS: lldb-api :: lang/cpp/this_class_type_mixing/TestThisClassTypeMixing.py (663 of 1524) PASS: lldb-api :: lang/c/const_variables/TestConstVariables.py (664 of 1524) PASS: lldb-api :: commands/command/delete/TestCommandDelete.py (665 of 1524) PASS: lldb-api :: tools/lldb-vscode/optimized/TestVSCode_optimized.py (666 of 1524) PASS: lldb-api :: commands/frame/var-scope/TestFrameVariableScope.py (667 of 1524) PASS: lldb-api :: functionalities/thread/concurrent_events/TestConcurrentCrashWithSignal.py (668 of 1524) PASS: lldb-shell :: ScriptInterpreter/None/import_module.test (669 of 1524) UNSUPPORTED: lldb-shell :: ObjectFile/ELF/minidebuginfo-set-and-hit-breakpoint.test (670 of 1524) PASS: lldb-shell :: ObjectFile/PECOFF/dwarf-gnu-debuglink-i686.yaml (671 of 1524) PASS: lldb-api :: functionalities/tail_call_frames/ambiguous_tail_call_seq2/TestAmbiguousTailCallSeq2.py (672 of 1524) PASS: lldb-api :: lang/cpp/template-arguments/TestCppTemplateArguments.py (673 of 1524) PASS: lldb-shell :: ObjectFile/ELF/section-types-edgecases.yaml (674 of 1524) PASS: lldb-api :: functionalities/gdb_remote_client/TestGDBRemotePlatformFile.py (675 of 1524) PASS: lldb-api :: test_utils/base/TestBaseTest.py (676 of 1524) PASS: lldb-api :: lang/objc/global_ptrs/TestGlobalObjects.py (677 of 1524) PASS: lldb-api :: commands/expression/ignore-artificial-constructors/TestIgnoreArtificialConstructors.py (678 of 1524) PASS: lldb-shell :: Driver/TestUseColor.test (679 of 1524) UNSUPPORTED: lldb-shell :: ScriptInterpreter/Lua/independent_state.test (680 of 1524) PASS: lldb-api :: commands/expression/import-std-module/forward_list/TestForwardListFromStdModule.py (681 of 1524) PASS: lldb-api :: functionalities/data-formatter/data-formatter-objc/nsstring/TestDataFormatterNSString.py (682 of 1524) UNSUPPORTED: lldb-shell :: ScriptInterpreter/Lua/quit.test (683 of 1524) PASS: lldb-shell :: SymbolFile/NativePDB/s_constant.cpp (684 of 1524) UNSUPPORTED: lldb-api :: functionalities/asan/TestReportData.py (685 of 1524) PASS: lldb-api :: commands/watchpoints/watchpoint_on_vectors/TestValueOfVectorVariable.py (686 of 1524) UNSUPPORTED: lldb-api :: tools/lldb-server/TestGdbRemoteAuxvSupport.py (687 of 1524) UNSUPPORTED: lldb-shell :: Subprocess/fork-follow-child-softbp.test (688 of 1524) PASS: lldb-api :: lang/cpp/subst_template_type_param/TestSubstTemplateTypeParam.py (689 of 1524) PASS: lldb-shell :: ScriptInterpreter/Python/command_import.test (690 of 1524) UNSUPPORTED: lldb-api :: lang/objcxx/cxx-bridged-po/TestObjCXXBridgedPO.py (691 of 1524) PASS: lldb-api :: functionalities/progress_reporting/TestProgressReporting.py (692 of 1524) PASS: lldb-api :: commands/target/stop-hook/delete/TestTargetStopHookDelete.py (693 of 1524) PASS: lldb-shell :: SymbolFile/DWARF/x86/DW_TAG_basic_type_DW_ATE_UTF_nonC.ll (694 of 1524) PASS: lldb-shell :: Expr/TestMultilineExpr.test (695 of 1524) PASS: lldb-api :: functionalities/data-formatter/compactvectors/TestCompactVectors.py (696 of 1524) PASS: lldb-api :: commands/expression/import-std-module/unique_ptr-dbg-info-content/TestUniquePtrDbgInfoContent.py (697 of 1524) PASS: lldb-api :: commands/expression/entry-bp/TestExprEntryBP.py (698 of 1524) PASS: lldb-shell :: SymbolFile/Breakpad/line-table-missing-file.test (699 of 1524) PASS: lldb-shell :: SymbolFile/OnDemand/symbolic-breakpoint.test (700 of 1524) PASS: lldb-shell :: SymbolFile/NativePDB/globals-fundamental.cpp (701 of 1524) UNSUPPORTED: lldb-api :: tools/lldb-server/TestGdbRemoteForkNonStop.py (702 of 1524) PASS: lldb-api :: lang/c/struct_types/TestStructTypes.py (703 of 1524) PASS: lldb-api :: functionalities/thread/create_after_attach/TestCreateAfterAttach.py (704 of 1524) PASS: lldb-shell :: ScriptInterpreter/Python/silent_command_script_import.test (705 of 1524) XFAIL: lldb-api :: functionalities/gdb_remote_client/TestRestartBug.py (706 of 1524) PASS: lldb-shell :: SymbolFile/symbol-binding.test (707 of 1524) PASS: lldb-api :: functionalities/breakpoint/move_nearest/TestMoveNearest.py (708 of 1524) PASS: lldb-api :: lang/objc/foundation/TestObjCMethods.py (709 of 1524) PASS: lldb-shell :: Commands/command-thread-select.test (710 of 1524) PASS: lldb-api :: functionalities/data-formatter/varscript_formatting/TestDataFormatterVarScriptFormatting.py (711 of 1524) PASS: lldb-api :: functionalities/type_lookup/TestTypeLookup.py (712 of 1524) PASS: lldb-api :: lang/objc/cpp_keyword_identifiers/TestCppKeywordsAsObjCIdentifiers.py (713 of 1524) PASS: lldb-api :: commands/help/TestHelp.py (714 of 1524) PASS: lldb-shell :: SymbolFile/DWARF/clang-ast-from-dwarf-objc-property.m (715 of 1524) PASS: lldb-api :: functionalities/gdb_remote_client/TestNoGPacketSupported.py (716 of 1524) PASS: lldb-api :: lang/objc/objc-foundation-dictionary-empty/TestNSDictionary0.py (717 of 1524) PASS: lldb-api :: qemu/TestQemuAPI.py (718 of 1524) UNSUPPORTED: lldb-shell :: SymbolFile/NativePDB/typedefs.cpp (719 of 1524) PASS: lldb-api :: functionalities/postmortem/wow64_minidump/TestWow64MiniDump.py (720 of 1524) PASS: lldb-api :: functionalities/data-formatter/data-formatter-stl/libcxx/function/TestLibCxxFunction.py (721 of 1524) PASS: lldb-shell :: ObjectFile/ELF/minidebuginfo-corrupt-xz.yaml (722 of 1524) PASS: lldb-shell :: Register/Core/x86-32-freebsd-multithread.test (723 of 1524) PASS: lldb-api :: sample_test/TestSampleInlineTest.py (724 of 1524) PASS: lldb-shell :: Watchpoint/SetErrorCases.test (725 of 1524) PASS: lldb-api :: functionalities/memory/tag/TestMemoryTag.py (726 of 1524) PASS: lldb-api :: functionalities/data-formatter/data-formatter-stl/libcxx/unordered_map/TestDataFormatterLibccUnorderedMap.py (727 of 1524) PASS: lldb-api :: lang/objc/modules-cache/TestClangModulesCache.py (728 of 1524) PASS: lldb-api :: commands/command/regex/TestRegexCommand.py (729 of 1524) PASS: lldb-shell :: SymbolFile/Breakpad/line-table-discontinuous-file-ids.test (730 of 1524) PASS: lldb-api :: functionalities/data-formatter/var-in-aggregate-misuse/TestVarInAggregateMisuse.py (731 of 1524) PASS: lldb-api :: commands/expression/pr35310/TestExprsBug35310.py (732 of 1524) PASS: lldb-api :: lang/cpp/breakpoint-commands/TestCPPBreakpointCommands.py (733 of 1524) PASS: lldb-api :: functionalities/unwind/sigtramp/TestSigtrampUnwind.py (734 of 1524) PASS: lldb-api :: functionalities/gdb_remote_client/TestFork.py (735 of 1524) UNSUPPORTED: lldb-shell :: Register/x86-zmm-write.test (736 of 1524) PASS: lldb-api :: lang/objc/hidden-ivars/TestHiddenIvars.py (737 of 1524) UNSUPPORTED: lldb-api :: commands/gui/basic/TestGuiBasic.py (738 of 1524) PASS: lldb-api :: functionalities/breakpoint/address_breakpoints/TestBadAddressBreakpoints.py (739 of 1524) PASS: lldb-api :: lang/c/offsetof/TestOffsetof.py (740 of 1524) PASS: lldb-shell :: Quit/TestQuitExitCodeTooManyArgs.test (741 of 1524) PASS: lldb-api :: functionalities/thread/concurrent_events/TestConcurrentTwoWatchpointsOneBreakpoint.py (742 of 1524) UNSUPPORTED: lldb-api :: linux/mix-dwo-and-regular-objects/TestMixedDwarfBinary.py (743 of 1524) PASS: lldb-api :: commands/expression/import-std-module/retry-with-std-module/TestRetryWithStdModule.py (744 of 1524) PASS: lldb-shell :: Register/x86-64-read.test (745 of 1524) PASS: lldb-shell :: Recognizer/assert.test (746 of 1524) UNSUPPORTED: lldb-shell :: Register/x86-fp-read.test (747 of 1524) UNSUPPORTED: lldb-shell :: Register/x86-db-read.test (748 of 1524) PASS: lldb-api :: commands/command/container/TestContainerCommands.py (749 of 1524) UNSUPPORTED: lldb-api :: benchmarks/expression/TestExpressionCmd.py (750 of 1524) PASS: lldb-api :: commands/expression/import-std-module/array/TestArrayFromStdModule.py (751 of 1524) PASS: lldb-shell :: ScriptInterpreter/Python/fail_breakpoint_oneline.test (752 of 1524) UNSUPPORTED: lldb-shell :: Commands/command-thread-siginfo.test (753 of 1524) PASS: lldb-shell :: ObjectFile/ELF/minidebuginfo-find-symbols.yaml (754 of 1524) PASS: lldb-shell :: ScriptInterpreter/Python/Crashlog/no_threadState.test (755 of 1524) UNSUPPORTED: lldb-api :: functionalities/tty/TestTerminal.py (756 of 1524) PASS: lldb-api :: commands/frame/diagnose/bad-reference/TestBadReference.py (757 of 1524) PASS: lldb-shell :: Driver/TestFile.test (758 of 1524) UNSUPPORTED: lldb-shell :: SymbolFile/PDB/expressions.test (759 of 1524) PASS: lldb-shell :: Expr/TestStringLiteralExpr.test (760 of 1524) PASS: lldb-api :: lang/objc/foundation/TestConstStrings.py (761 of 1524) PASS: lldb-shell :: SymbolFile/DWARF/x86/DW_AT_low_pc-addrx.s (762 of 1524) PASS: lldb-api :: lang/objc/objc-ivar-protocols/TestIvarProtocols.py (763 of 1524) PASS: lldb-api :: functionalities/launch_stop_at_entry/TestStopAtEntry.py (764 of 1524) PASS: lldb-shell :: Breakpoint/debug_rnglist_basic.test (765 of 1524) PASS: lldb-api :: functionalities/find-line-entry/TestFindLineEntry.py (766 of 1524) PASS: lldb-api :: commands/expression/pr52257/TestExprCrash.py (767 of 1524) PASS: lldb-api :: functionalities/thread/concurrent_events/TestConcurrentWatchBreak.py (768 of 1524) PASS: lldb-api :: functionalities/tail_call_frames/thread_step_out_message/TestArtificialFrameStepOutMessage.py (769 of 1524) PASS: lldb-api :: commands/watchpoints/multiple_hits/TestMultipleHits.py (770 of 1524) PASS: lldb-api :: functionalities/breakpoint/breakpoint_options/TestBreakpointOptions.py (771 of 1524) PASS: lldb-shell :: Register/Core/x86-32-linux-addr.test (772 of 1524) PASS: lldb-api :: lang/cpp/diamond/TestCppDiamond.py (773 of 1524) PASS: lldb-api :: lang/c/strings/TestCStrings.py (774 of 1524) PASS: lldb-shell :: Register/x86-multithread-write.test (775 of 1524) PASS: lldb-api :: commands/watchpoints/hello_watchpoint/TestMyFirstWatchpoint.py (776 of 1524) PASS: lldb-api :: lang/objc/modules-hash-mismatch/TestClangModulesHashMismatch.py (777 of 1524) PASS: lldb-api :: python_api/sbdata/TestSBData.py (778 of 1524) PASS: lldb-api :: functionalities/mtc/simple/TestMTCSimple.py (779 of 1524) UNSUPPORTED: lldb-api :: functionalities/asan/TestMemoryHistory.py (780 of 1524) XFAIL: lldb-shell :: Expr/nodefaultlib.cpp (781 of 1524) PASS: lldb-shell :: Driver/TestHelp.test (782 of 1524) PASS: lldb-api :: commands/expression/diagnostics/TestExprDiagnostics.py (783 of 1524) UNSUPPORTED: lldb-api :: linux/aarch64/mte_tag_faults/TestAArch64LinuxMTEMemoryTagFaults.py (784 of 1524) PASS: lldb-api :: functionalities/pointer_num_children/TestPointerNumChildren.py (785 of 1524) UNSUPPORTED: lldb-shell :: Subprocess/vfork-follow-parent-wp.test (786 of 1524) PASS: lldb-api :: commands/expression/persistent_types/TestNestedPersistentTypes.py (787 of 1524) PASS: lldb-shell :: ObjectFile/ELF/PT_TLS-overlap-PT_LOAD.yaml (788 of 1524) PASS: lldb-shell :: Reproducer/TestHomeDir.test (789 of 1524) PASS: lldb-shell :: SymbolFile/DWARF/x86/parallel-indexing-stress.s (790 of 1524) PASS: lldb-api :: tools/lldb-server/memory-allocation/TestGdbRemoteMemoryAllocation.py (791 of 1524) PASS: lldb-api :: lang/cpp/operators/TestCppOperators.py (792 of 1524) PASS: lldb-api :: functionalities/gdb_remote_client/TestNoLocalFile.py (793 of 1524) PASS: lldb-api :: commands/expression/radar_8638051/Test8638051.py (794 of 1524) PASS: lldb-shell :: Commands/command-breakpoint-col.test (795 of 1524) PASS: lldb-api :: commands/command/source/TestCommandSource.py (796 of 1524) PASS: lldb-api :: functionalities/multiword-commands/TestMultiWordCommands.py (797 of 1524) PASS: lldb-shell :: ObjectFile/Breakpad/sections.test (798 of 1524) PASS: lldb-api :: functionalities/gdb_remote_client/TestIOSSimulator.py (799 of 1524) PASS: lldb-shell :: SymbolFile/absolute-symbol.test (800 of 1524) PASS: lldb-api :: commands/expression/static-initializers/TestStaticInitializers.py (801 of 1524) PASS: lldb-api :: commands/target/stop-hooks/TestStopHooks.py (802 of 1524) PASS: lldb-api :: commands/expression/xvalue/TestXValuePrinting.py (803 of 1524) PASS: lldb-shell :: ScriptInterpreter/Python/exit.test (804 of 1524) PASS: lldb-api :: lang/c/forward/TestForwardDeclaration.py (805 of 1524) PASS: lldb-api :: lang/cpp/lambdas/TestLambdas.py (806 of 1524) PASS: lldb-api :: lang/cpp/call-function/TestCallCPPFunction.py (807 of 1524) UNSUPPORTED: lldb-api :: functionalities/data-formatter/data-formatter-stl/libstdcpp/map/TestDataFormatterStdMap.py (808 of 1524) PASS: lldb-api :: lang/cpp/enum_types/TestCPP11EnumTypes.py (809 of 1524) PASS: lldb-shell :: SymbolFile/DWARF/x86/find-method-local-struct.cpp (810 of 1524) PASS: lldb-api :: commands/expression/no-deadlock/TestExprDoesntBlock.py (811 of 1524) PASS: lldb-api :: lang/c/fpeval/TestFPEval.py (812 of 1524) UNSUPPORTED: lldb-api :: tools/lldb-server/TestGdbRemoteModuleInfo.py (813 of 1524) PASS: lldb-api :: functionalities/data-formatter/data-formatter-objc/TestDataFormatterObjNSException.py (814 of 1524) PASS: lldb-shell :: Driver/TestPageZeroRead.test (815 of 1524) PASS: lldb-shell :: Driver/TestTarget.test (816 of 1524) UNSUPPORTED: lldb-api :: functionalities/data-formatter/data-formatter-stl/libstdcpp/unique_ptr/TestDataFormatterStdUniquePtr.py (817 of 1524) PASS: lldb-shell :: Register/Core/x86-32-netbsd-gp.test (818 of 1524) PASS: lldb-api :: commands/frame/var/TestFrameVar.py (819 of 1524) PASS: lldb-api :: functionalities/breakpoint/breakpoint_by_file_colon_line/TestBreakpointByFileColonLine.py (820 of 1524) UNSUPPORTED: lldb-api :: linux/thread/create_during_instruction_step/TestCreateDuringInstructionStep.py (821 of 1524) UNSUPPORTED: lldb-api :: tools/lldb-server/TestGdbRemoteSaveCore.py (822 of 1524) PASS: lldb-shell :: SymbolFile/NativePDB/lookup-by-address.cpp (823 of 1524) PASS: lldb-api :: lang/objcxx/objcxx-ivar-vector/TestIvarVector.py (824 of 1524) UNSUPPORTED: lldb-shell :: Register/x86-64-xmm16-read.test (825 of 1524) PASS: lldb-shell :: SymbolFile/DWARF/x86/find-inline-method.s (826 of 1524) PASS: lldb-shell :: Minidump/breakpad-symbols.test (827 of 1524) PASS: lldb-api :: functionalities/data-formatter/data-formatter-objc/TestDataFormatterObjCNSContainer.py (828 of 1524) PASS: lldb-api :: lang/cpp/unsigned_types/TestUnsignedTypes.py (829 of 1524) UNSUPPORTED: lldb-api :: commands/expression/multiline-navigation/TestMultilineNavigation.py (830 of 1524) PASS: lldb-api :: functionalities/tail_call_frames/inlining_and_tail_calls/TestInliningAndTailCalls.py (831 of 1524) PASS: lldb-api :: python_api/compile_unit/TestCompileUnitAPI.py (832 of 1524) PASS: lldb-api :: commands/memory/write/TestMemoryWrite.py (833 of 1524) PASS: lldb-api :: commands/expression/completion-in-lambda-and-unnamed-class/TestCompletionInLambdaAndUnnamedClass.py (834 of 1524) PASS: lldb-api :: functionalities/unwind/zeroth_frame/TestZerothFrame.py (835 of 1524) PASS: lldb-api :: functionalities/breakpoint/global_constructor/TestBreakpointInGlobalConstructor.py (836 of 1524) PASS: lldb-api :: lang/c/local_variables/TestLocalVariables.py (837 of 1524) PASS: lldb-api :: functionalities/data-formatter/nsdictionarysynth/TestNSDictionarySynthetic.py (838 of 1524) UNSUPPORTED: lldb-shell :: Commands/command-disassemble-aarch64-extensions.s (839 of 1524) UNSUPPORTED: lldb-shell :: SymbolFile/NativePDB/stack_unwinding01.cpp (840 of 1524) PASS: lldb-api :: functionalities/float-display/TestFloatDisplay.py (841 of 1524) PASS: lldb-shell :: SymbolFile/DWARF/x86/find-basic-type.cpp (842 of 1524) XFAIL: lldb-shell :: SymbolFile/DWARF/find-type-in-function.cpp (843 of 1524) PASS: lldb-shell :: ObjectFile/PECOFF/basic-info.yaml (844 of 1524) PASS: lldb-shell :: Register/Core/x86-32-linux-multithread.test (845 of 1524) PASS: lldb-api :: commands/session/save/TestSessionSave.py (846 of 1524) PASS: lldb-api :: functionalities/breakpoint/breakpoint_language/TestBreakpointLanguage.py (847 of 1524) UNSUPPORTED: lldb-shell :: SymbolFile/PDB/type-quals.test (848 of 1524) PASS: lldb-shell :: Driver/TestNoUseColor.test (849 of 1524) PASS: lldb-api :: tools/lldb-vscode/breakpoint/TestVSCode_logpoints.py (850 of 1524) PASS: lldb-shell :: ScriptInterpreter/Python/command_relative_import.test (851 of 1524) UNSUPPORTED: lldb-shell :: Subprocess/vfork-follow-child-softbp.test (852 of 1524) PASS: lldb-shell :: SymbolFile/OnDemand/source-breakpoint.test (853 of 1524) PASS: lldb-api :: functionalities/memory-region/TestMemoryRegion.py (854 of 1524) UNSUPPORTED: lldb-shell :: Register/x86-64-zmm-write.test (855 of 1524) PASS: lldb-api :: functionalities/lazy-loading/TestLazyLoading.py (856 of 1524) UNSUPPORTED: lldb-api :: tools/lldb-server/TestGdbRemoteFork.py (857 of 1524) PASS: lldb-api :: python_api/watchpoint/TestWatchpointIter.py (858 of 1524) PASS: lldb-api :: functionalities/inferior-assert/TestInferiorAssert.py (859 of 1524) PASS: lldb-api :: functionalities/value_md5_crash/TestValueMD5Crash.py (860 of 1524) PASS: lldb-shell :: SymbolFile/NativePDB/break-by-function.cpp (861 of 1524) PASS: lldb-api :: commands/breakpoint/command/list/TestBreakpointCommandList.py (862 of 1524) PASS: lldb-api :: functionalities/data-formatter/data-formatter-stl/generic/deque/TestDataFormatterGenericDeque.py (863 of 1524) UNSUPPORTED: lldb-shell :: SymbolFile/PDB/class-layout.test (864 of 1524) UNSUPPORTED: lldb-api :: commands/expression/call-restarts/TestCallThatRestarts.py (865 of 1524) PASS: lldb-shell :: SymbolFile/DWARF/x86/dead-code-filtering.yaml (866 of 1524) PASS: lldb-api :: commands/target/stop-hook/enable/TestTargetStopHookEnable.py (867 of 1524) PASS: lldb-api :: functionalities/breakpoint/breakpoint_on_lambda_capture/TestBreakOnLambdaCapture.py (868 of 1524) PASS: lldb-api :: functionalities/thread/thread_specific_break/TestThreadSpecificBreakpoint.py (869 of 1524) PASS: lldb-api :: functionalities/module_cache/universal/TestModuleCacheUniversal.py (870 of 1524) PASS: lldb-api :: functionalities/data-formatter/data-formatter-proper-plurals/TestFormattersOneIsSingular.py (871 of 1524) PASS: lldb-shell :: SymbolFile/DWARF/x86/split-dwarf-multiple-cu.ll (872 of 1524) PASS: lldb-shell :: Minidump/dump-all.test (873 of 1524) PASS: lldb-api :: commands/session/history/TestSessionHistory.py (874 of 1524) PASS: lldb-api :: lang/cpp/static_member_type_depending_on_parent_size/TestStaticMemberTypeDependingOnParentSize.py (875 of 1524) PASS: lldb-api :: lang/objc/objc-new-syntax/TestObjCNewSyntaxDictionary.py (876 of 1524) PASS: lldb-api :: functionalities/data-formatter/data-formatter-objc/nsindexpath/TestDataFormatterNSIndexPath.py (877 of 1524) XFAIL: lldb-api :: macosx/macCatalystAppMacOSFramework/TestMacCatalystAppWithMacOSFramework.py (878 of 1524) PASS: lldb-api :: source-manager/TestSourceManager.py (879 of 1524) UNSUPPORTED: lldb-shell :: Subprocess/clone-follow-parent.test (880 of 1524) UNSUPPORTED: lldb-shell :: ScriptInterpreter/Lua/convenience_variables.test (881 of 1524) PASS: lldb-api :: commands/expression/rdar42038760/TestScalarURem.py (882 of 1524) PASS: lldb-shell :: Breakpoint/jit-loader_rtdyld_elf.test (883 of 1524) PASS: lldb-api :: lang/objc/modules-non-objc-target/TestObjCModulesNonObjCTarget.py (884 of 1524) PASS: lldb-api :: commands/expression/import-std-module/vector-of-vectors/TestVectorOfVectorsFromStdModule.py (885 of 1524) UNSUPPORTED: lldb-api :: lang/objc/conflicting-class-list-function-from-user/TestObjCClassListFunctionFromUser.py (886 of 1524) UNSUPPORTED: lldb-shell :: Register/x86-64-zmm-read.test (887 of 1524) PASS: lldb-api :: functionalities/thread/concurrent_events/TestConcurrentTwoBreakpointsOneDelaySignal.py (888 of 1524) PASS: lldb-api :: macosx/load-kext/TestLoadKext.py (889 of 1524) PASS: lldb-api :: macosx/find-dsym/deep-bundle/TestDeepBundle.py (890 of 1524) PASS: lldb-shell :: SymbolFile/NativePDB/bitfields.cpp (891 of 1524) PASS: lldb-api :: lang/c/complex_int/TestComplexInt.py (892 of 1524) PASS: lldb-api :: lang/cpp/namespace_conflicts/TestNamespaceConflicts.py (893 of 1524) PASS: lldb-api :: lang/cpp/global_operators/TestCppGlobalOperators.py (894 of 1524) PASS: lldb-api :: sample_test/TestSampleTest.py (895 of 1524) PASS: lldb-api :: lang/cpp/breakpoint_in_member_func_w_non_primitive_params/TestBreakpointInMemberFuncWNonPrimitiveParams.py (896 of 1524) UNSUPPORTED: lldb-api :: benchmarks/libcxxlist/TestBenchmarkLibcxxList.py (897 of 1524) PASS: lldb-api :: functionalities/data-formatter/data-formatter-objc/TestDataFormatterObjCNSData.py (898 of 1524) PASS: lldb-api :: functionalities/breakpoint/breakpoint_command/TestBreakpointCommand.py (899 of 1524) PASS: lldb-api :: commands/expression/import-std-module/non-module-type-separation/TestNonModuleTypeSeparation.py (900 of 1524) PASS: lldb-shell :: Quit/TestQuitExitCode0.test (901 of 1524) UNSUPPORTED: lldb-api :: macosx/corefile-exception-reason/TestCorefileExceptionReason.py (902 of 1524) PASS: lldb-api :: functionalities/inline-stepping/TestInlineStepping.py (903 of 1524) PASS: lldb-api :: functionalities/non-overlapping-index-variable-i/TestIndexVariable.py (904 of 1524) PASS: lldb-api :: functionalities/thread/ignore_suspended/TestIgnoreSuspendedThread.py (905 of 1524) PASS: lldb-api :: functionalities/location-list-lookup/TestLocationListLookup.py (906 of 1524) PASS: lldb-api :: python_api/event/TestEvents.py (907 of 1524) PASS: lldb-api :: commands/target/stop-hooks/TestStopHookScripted.py (908 of 1524) PASS: lldb-api :: functionalities/data-formatter/ostypeformatting/TestFormattersOsType.py (909 of 1524) PASS: lldb-api :: commands/process/signal/TestProcessSignal.py (910 of 1524) PASS: lldb-api :: functionalities/gdb_remote_client/TestGDBServerTargetXML.py (911 of 1524) PASS: lldb-shell :: SymbolFile/DWARF/x86/DW_AT_const_value.s (912 of 1524) PASS: lldb-api :: types/TestLongTypesExpr.py (913 of 1524) PASS: lldb-shell :: Register/Core/x86-32-freebsd-fp.test (914 of 1524) PASS: lldb-api :: commands/expression/ir-interpreter/TestIRInterpreter.py (915 of 1524) PASS: lldb-api :: functionalities/pre_run_dylibs/TestPreRunDylibs.py (916 of 1524) PASS: lldb-api :: sanity/TestSettingSkipping.py (917 of 1524) PASS: lldb-shell :: SymbolFile/DWARF/x86/find-variable-file.cpp (918 of 1524) PASS: lldb-api :: lang/objc/single-entry-dictionary/TestObjCSingleEntryDictionary.py (919 of 1524) PASS: lldb-shell :: ObjectFile/PECOFF/invalid-export-table.yaml (920 of 1524) PASS: lldb-api :: functionalities/fat_archives/TestFatArchives.py (921 of 1524) PASS: lldb-shell :: Breakpoint/split-dwarf5-debug-stroffsets.test (922 of 1524) PASS: lldb-shell :: SymbolFile/DWARF/x86/dwo-type-in-main-file.s (923 of 1524) PASS: lldb-api :: functionalities/data-formatter/data-formatter-stl/generic/multimap/TestDataFormatterGenericMultiMap.py (924 of 1524) UNSUPPORTED: lldb-shell :: Register/aarch64-fp-read.test (925 of 1524) PASS: lldb-api :: lang/c/step-target/TestStepTarget.py (926 of 1524) PASS: lldb-shell :: SymbolFile/DWARF/x86/debug_line-tombstone.s (927 of 1524) PASS: lldb-api :: functionalities/postmortem/minidump-new/TestMiniDumpNew.py (928 of 1524) UNSUPPORTED: lldb-api :: functionalities/thread/thread_specific_break_plus_condition/TestThreadSpecificBpPlusCondition.py (929 of 1524) PASS: lldb-shell :: SymbolFile/NativePDB/local-variables-registers.s (930 of 1524) PASS: lldb-shell :: Breakpoint/single-file-split-dwarf.test (931 of 1524) PASS: lldb-api :: lang/cpp/template/TestTemplateArgs.py (932 of 1524) PASS: lldb-shell :: ObjectFile/PECOFF/settings-abi-i686.yaml (933 of 1524) PASS: lldb-shell :: ObjectFile/Breakpad/uuid-matching-mac.test (934 of 1524) PASS: lldb-api :: tools/lldb-server/TestGdbRemoteSingleStep.py (935 of 1524) PASS: lldb-api :: commands/expression/weak_symbols/TestWeakSymbols.py (936 of 1524) PASS: lldb-shell :: SymbolFile/DWARF/x86/limit-debug-info.s (937 of 1524) PASS: lldb-shell :: ObjectFile/wasm/unified-debug-sections.yaml (938 of 1524) PASS: lldb-api :: terminal/TestSTTYBeforeAndAfter.py (939 of 1524) PASS: lldb-api :: commands/expression/import-std-module/shared_ptr-dbg-info-content/TestSharedPtrDbgInfoContentFromStdModule.py (940 of 1524) PASS: lldb-api :: functionalities/recursion/TestValueObjectRecursion.py (941 of 1524) PASS: lldb-api :: functionalities/inferior-crashing/TestInferiorCrashing.py (942 of 1524) PASS: lldb-shell :: ObjectFile/wasm/embedded-debug-sections.yaml (943 of 1524) PASS: lldb-api :: lang/objc/foundation/TestSymbolTable.py (944 of 1524) PASS: lldb-api :: lang/cpp/bitfields/TestCppBitfields.py (945 of 1524) UNSUPPORTED: lldb-api :: functionalities/data-formatter/data-formatter-stl/libstdcpp/smart_ptr/TestDataFormatterStdSmartPtr.py (946 of 1524) UNSUPPORTED: lldb-api :: tools/lldb-server/TestPtyServer.py (947 of 1524) PASS: lldb-shell :: ObjectFile/ELF/base-address.yaml (948 of 1524) UNSUPPORTED: lldb-api :: linux/sepdebugsymlink/TestTargetSymbolsSepDebugSymlink.py (949 of 1524) PASS: lldb-api :: commands/expression/import-std-module/no-std-module/TestMissingStdModule.py (950 of 1524) UNSUPPORTED: lldb-shell :: SymbolFile/NativePDB/ast-functions-msvc.cpp (951 of 1524) PASS: lldb-api :: functionalities/data-formatter/data-formatter-objc/TestDataFormatterObjCNSError.py (952 of 1524) PASS: lldb-api :: lang/objc/foundation/TestObjCMethodsNSArray.py (953 of 1524) PASS: lldb-shell :: ObjectFile/ELF/netbsd-core-amd64.test (954 of 1524) PASS: lldb-shell :: Minidump/Windows/find-module.test (955 of 1524) PASS: lldb-api :: lang/objc/modules-compile-error/TestModulesCompileError.py (956 of 1524) PASS: lldb-api :: functionalities/data-formatter/language_category_updates/TestDataFormatterLanguageCategoryUpdates.py (957 of 1524) UNSUPPORTED: lldb-shell :: Expr/TestIRMemoryMapWindows.test (958 of 1524) PASS: lldb-api :: functionalities/load_lazy/TestLoadUsingLazyBind.py (959 of 1524) PASS: lldb-api :: commands/watchpoints/watchpoint_commands/command/TestWatchpointCommandPython.py (960 of 1524) PASS: lldb-api :: functionalities/thread/concurrent_events/TestConcurrentWatchpointDelayWatchpointOneBreakpoint.py (961 of 1524) PASS: lldb-shell :: Driver/TestProcessAttach.test (962 of 1524) PASS: lldb-api :: functionalities/gdb_remote_client/TestPartialGPacket.py (963 of 1524) UNSUPPORTED: lldb-shell :: Register/arm-fp-read.test (964 of 1524) PASS: lldb-api :: python_api/debugger/TestDebuggerAPI.py (965 of 1524) PASS: lldb-shell :: Quit/TestQuitExitCode30.test (966 of 1524) PASS: lldb-api :: api/multiple-debuggers/TestMultipleDebuggers.py (967 of 1524) PASS: lldb-api :: functionalities/target_var/no_vars/TestTargetVarNoVars.py (968 of 1524) PASS: lldb-api :: commands/process/attach/TestProcessAttach.py (969 of 1524) PASS: lldb-api :: lang/cpp/template-function/TestTemplateFunctions.py (970 of 1524) PASS: lldb-shell :: ObjectFile/ELF/PT_LOAD-empty.yaml (971 of 1524) PASS: lldb-shell :: lldb-server/TestGdbserverPort.test (972 of 1524) PASS: lldb-api :: commands/target/dump-pcm-info/TestDumpPCMInfo.py (973 of 1524) PASS: lldb-api :: python_api/breakpoint/TestBreakpointAPI.py (974 of 1524) PASS: lldb-shell :: Register/Core/x86-32-netbsd-multithread.test (975 of 1524) PASS: lldb-shell :: ObjectFile/MachO/lc_version_min.yaml (976 of 1524) PASS: lldb-api :: functionalities/thread/concurrent_events/TestConcurrentBreakpointOneDelayBreakpointThreads.py (977 of 1524) PASS: lldb-shell :: Settings/TestDisableColor.test (978 of 1524) UNSUPPORTED: lldb-api :: lua_api/TestLuaAPI.py (979 of 1524) PASS: lldb-api :: commands/expression/result_numbering/TestResultNumbering.py (980 of 1524) PASS: lldb-shell :: Register/x86-64-gp-read.test (981 of 1524) PASS: lldb-api :: tools/lldb-server/register-reading/TestGdbRemoteGPacket.py (982 of 1524) PASS: lldb-shell :: SymbolFile/Breakpad/symtab.test (983 of 1524) PASS: lldb-api :: functionalities/tail_call_frames/disambiguate_paths_to_common_sink/TestDisambiguatePathsToCommonSink.py (984 of 1524) PASS: lldb-api :: commands/command/script/import/rdar-12586188/TestRdar12586188.py (985 of 1524) PASS: lldb-api :: commands/thread/select/TestThreadSelect.py (986 of 1524) PASS: lldb-api :: functionalities/data-formatter/hexcaps/TestDataFormatterHexCaps.py (987 of 1524) PASS: lldb-shell :: ScriptInterpreter/None/none.test (988 of 1524) PASS: lldb-api :: functionalities/target-new-solib-notifications/TestModuleLoadedNotifys.py (989 of 1524) PASS: lldb-api :: lang/cpp/constructors/TestCppConstructors.py (990 of 1524) PASS: lldb-api :: functionalities/thread/concurrent_events/TestConcurrentSignalWatchBreak.py (991 of 1524) PASS: lldb-shell :: SymbolFile/add-dsym.test (992 of 1524) PASS: lldb-api :: commands/quit/TestQuit.py (993 of 1524) PASS: lldb-api :: python_api/interpreter/TestCommandInterpreterAPI.py (994 of 1524) PASS: lldb-api :: commands/expression/import_base_class_when_class_has_derived_member/TestImportBaseClassWhenClassHasDerivedMember.py (995 of 1524) UNSUPPORTED: lldb-shell :: SymbolFile/NativePDB/local-variables.cpp (996 of 1524) PASS: lldb-shell :: SymbolFile/DWARF/x86/unused-inlined-params.test (997 of 1524) PASS: lldb-api :: lang/cpp/non-type-template-param/TestCppNonTypeTemplateParam.py (998 of 1524) UNSUPPORTED: lldb-shell :: ScriptInterpreter/Lua/breakpoint_callback.test (999 of 1524) PASS: lldb-api :: functionalities/signal/raise/TestRaise.py (1000 of 1524) UNSUPPORTED: lldb-shell :: BuildScript/toolchain-clang-cl.test (1001 of 1524) PASS: lldb-api :: lang/objc/objc-property/TestObjCProperty.py (1002 of 1524) PASS: lldb-api :: lang/cpp/incompatible-class-templates/TestCppIncompatibleClassTemplates.py (1003 of 1524) PASS: lldb-api :: lang/objc/foundation/TestObjCMethodsString.py (1004 of 1524) PASS: lldb-api :: commands/expression/import-std-module/missing-module-sources/TestStdModuleSourcesMissing.py (1005 of 1524) UNSUPPORTED: lldb-api :: functionalities/signal/handle-segv/TestHandleSegv.py (1006 of 1524) UNSUPPORTED: lldb-api :: linux/aarch64/non_address_bit_memory_access/TestAArch64LinuxNonAddressBitMemoryAccess.py (1007 of 1524) PASS: lldb-api :: lang/cpp/structured-binding/TestStructuredBinding.py (1008 of 1524) PASS: lldb-api :: functionalities/unused-inlined-parameters/TestUnusedInlinedParameters.py (1009 of 1524) PASS: lldb-shell :: REPL/Basic.test (1010 of 1524) UNSUPPORTED: lldb-api :: commands/trace/TestTraceSave.py (1011 of 1524) PASS: lldb-shell :: ObjectFile/PECOFF/section-types.yaml (1012 of 1524) UNSUPPORTED: lldb-shell :: ScriptInterpreter/Lua/breakpoint_function_callback.test (1013 of 1524) UNSUPPORTED: lldb-shell :: Commands/command-target-create-resolve-exe.test (1014 of 1524) UNSUPPORTED: lldb-shell :: SymbolFile/DWARF/debug-types-expressions.test (1015 of 1524) PASS: lldb-shell :: SymbolFile/DWARF/x86/find-function-regex.cpp (1016 of 1524) PASS: lldb-api :: functionalities/thread/concurrent_events/TestConcurrentBreakpointDelayBreakpointOneSignal.py (1017 of 1524) PASS: lldb-api :: commands/frame/select/TestFrameSelect.py (1018 of 1524) UNSUPPORTED: lldb-api :: commands/trace/TestTraceExport.py (1019 of 1524) PASS: lldb-api :: commands/command/script/TestCommandScript.py (1020 of 1524) PASS: lldb-api :: functionalities/data-formatter/frameformat_smallstruct/TestFrameFormatSmallStruct.py (1021 of 1524) UNSUPPORTED: lldb-shell :: Subprocess/fork-follow-child.test (1022 of 1524) PASS: lldb-shell :: Register/Core/x86-64-freebsd-gp.test (1023 of 1524) PASS: lldb-api :: lang/objc/objc_direct-methods/TestObjCDirectMethods.py (1024 of 1524) PASS: lldb-shell :: Reproducer/TestWorkingDir.test (1025 of 1524) PASS: lldb-api :: functionalities/breakpoint/scripted_bkpt/TestScriptedResolver.py (1026 of 1524) PASS: lldb-shell :: Reproducer/TestDriverOptions.test (1027 of 1524) PASS: lldb-shell :: Settings/TestFrameFormatMangling.test (1028 of 1524) PASS: lldb-api :: commands/version/TestVersion.py (1029 of 1524) PASS: lldb-api :: iohandler/resize/TestIOHandlerResizeNoEditline.py (1030 of 1524) PASS: lldb-shell :: Breakpoint/split-dwarf-5-addrbase.test (1031 of 1524) PASS: lldb-api :: functionalities/data-formatter/refpointer-recursion/TestDataFormatterRefPtrRecursion.py (1032 of 1524) PASS: lldb-api :: tools/lldb-vscode/stop-hooks/TestVSCode_stop_hooks.py (1033 of 1524) PASS: lldb-api :: python_api/thread/TestThreadAPI.py (1034 of 1524) PASS: lldb-api :: lang/cpp/static_members/TestCPPStaticMembers.py (1035 of 1524) PASS: lldb-api :: commands/expression/regression-access-function-template-in-record/TestRegressionAccessFunctionTemplateInRecord.py (1036 of 1524) PASS: lldb-api :: functionalities/thread/concurrent_events/TestConcurrentBreakpointsDelayedBreakpointOneWatchpoint.py (1037 of 1524) PASS: lldb-api :: lang/c/tls_globals/TestTlsGlobals.py (1038 of 1524) PASS: lldb-shell :: Driver/TestCore.test (1039 of 1524) PASS: lldb-api :: functionalities/abbreviation/TestCommonShortSpellings.py (1040 of 1524) PASS: lldb-api :: macosx/lc-note/multiple-binary-corefile/TestMultipleBinaryCorefile.py (1041 of 1524) PASS: lldb-api :: functionalities/data-formatter/boolreference/TestFormattersBoolRefPtr.py (1042 of 1524) PASS: lldb-shell :: ScriptInterpreter/Python/Crashlog/json.test (1043 of 1524) PASS: lldb-api :: functionalities/data-formatter/data-formatter-advanced/TestDataFormatterAdv.py (1044 of 1524) PASS: lldb-api :: python_api/signals/TestSignalsAPI.py (1045 of 1524) PASS: lldb-api :: lang/c/blocks/TestBlocks.py (1046 of 1524) UNSUPPORTED: lldb-shell :: SymbolFile/PDB/enums-layout.test (1047 of 1524) PASS: lldb-api :: tools/lldb-server/TestGdbRemoteAttach.py (1048 of 1524) UNSUPPORTED: lldb-api :: functionalities/unwind/ehframe/TestEhFrameUnwind.py (1049 of 1524) PASS: lldb-api :: lang/c/bitfields/TestBitfields.py (1050 of 1524) UNSUPPORTED: lldb-api :: arm/breakpoint-it/TestBreakpointIt.py (1051 of 1524) UNSUPPORTED: lldb-api :: functionalities/tsan/global_location/TestTsanGlobalLocation.py (1052 of 1524) PASS: lldb-api :: types/TestRecursiveTypes.py (1053 of 1524) UNSUPPORTED: lldb-api :: functionalities/ptrauth_diagnostics/brkC47x_code/TestPtrauthBRKc47xDiagnostic.py (1054 of 1524) PASS: lldb-shell :: SymbolFile/DWARF/x86/debug_static-member-anonymous-namespace.s (1055 of 1524) PASS: lldb-api :: lang/objc/modules-auto-import/TestModulesAutoImport.py (1056 of 1524) PASS: lldb-shell :: SymbolFile/DWARF/x86/debug_ranges_and_rnglists.test (1057 of 1524) PASS: lldb-api :: tools/lldb-server/TestGdbRemoteProcessInfo.py (1058 of 1524) PASS: lldb-api :: commands/expression/import-std-module/list-dbg-info-content/TestDbgInfoContentListFromStdModule.py (1059 of 1524) UNSUPPORTED: lldb-shell :: ObjectFile/PECOFF/disassemble-thumb.yaml (1060 of 1524) UNSUPPORTED: lldb-api :: iohandler/unicode/TestUnicode.py (1061 of 1524) PASS: lldb-api :: api/command-return-object/TestSBCommandReturnObject.py (1062 of 1524) UNSUPPORTED: lldb-shell :: SymbolFile/PDB/variables-locations.test (1063 of 1524) PASS: lldb-api :: lang/cpp/auto/TestCPPAuto.py (1064 of 1524) PASS: lldb-api :: commands/log/basic/TestLogHandlers.py (1065 of 1524) PASS: lldb-api :: types/TestCharTypeExpr.py (1066 of 1524) PASS: lldb-api :: macosx/profile_vrs_detach/TestDetachVrsProfile.py (1067 of 1524) UNSUPPORTED: lldb-api :: commands/register/register/aarch64_dynamic_regset/TestArm64DynamicRegsets.py (1068 of 1524) PASS: lldb-api :: python_api/sberror/TestSBError.py (1069 of 1524) PASS: lldb-api :: commands/expression/import-std-module/sysroot/TestStdModuleSysroot.py (1070 of 1524) UNSUPPORTED: lldb-shell :: SymbolFile/PDB/calling-conventions-x86.test (1071 of 1524) PASS: lldb-api :: commands/expression/import-std-module/empty-module/TestEmptyStdModule.py (1072 of 1524) PASS: lldb-api :: commands/expression/fixits/TestFixIts.py (1073 of 1524) PASS: lldb-shell :: SymbolFile/DWARF/x86/find-variable-dwo.cpp (1074 of 1524) PASS: lldb-api :: functionalities/breakpoint/breakpoint_locations/TestBreakpointLocations.py (1075 of 1524) UNSUPPORTED: lldb-api :: commands/gui/basicdebug/TestGuiBasicDebug.py (1076 of 1524) PASS: lldb-shell :: ObjectFile/PDB/object.test (1077 of 1524) PASS: lldb-api :: functionalities/gdb_remote_client/TestqOffsets.py (1078 of 1524) XFAIL: lldb-shell :: Register/x86-64-fp-write.test (1079 of 1524) UNSUPPORTED: lldb-api :: tools/lldb-server/TestGdbRemotePlatformFile.py (1080 of 1524) PASS: lldb-api :: commands/watchpoints/watchpoint_disable/TestWatchpointDisable.py (1081 of 1524) UNSUPPORTED: lldb-api :: benchmarks/stepping/TestSteppingSpeed.py (1082 of 1524) PASS: lldb-api :: lang/cpp/crtp/TestCppCRTP.py (1083 of 1524) PASS: lldb-api :: lang/objc/radar-9691614/TestObjCMethodReturningBOOL.py (1084 of 1524) PASS: lldb-api :: lang/c/unicode/TestUnicodeSymbols.py (1085 of 1524) UNSUPPORTED: lldb-api :: commands/expression/completion-crash-invalid-iterator/TestInvalidIteratorCompletionCrash.py (1086 of 1524) PASS: lldb-api :: functionalities/data-formatter/user-format-vs-summary/TestUserFormatVsSummary.py (1087 of 1524) PASS: lldb-api :: commands/expression/namespace_local_var_same_name_cpp_and_c/TestNamespaceLocalVarSameNameCppAndC.py (1088 of 1524) PASS: lldb-shell :: Symtab/symtab-regex-mangled.test (1089 of 1524) UNSUPPORTED: lldb-api :: functionalities/ptrauth_diagnostics/brkC47x_x16_invalid/TestPtrauthBRKc47xX16Invalid.py (1090 of 1524) PASS: lldb-shell :: Minidump/no-process-id.yaml (1091 of 1524) UNSUPPORTED: lldb-api :: commands/trace/TestTraceEvents.py (1092 of 1524) PASS: lldb-api :: macosx/save_crashlog/TestSaveCrashlog.py (1093 of 1524) PASS: lldb-api :: commands/breakpoint/set/func-regex/TestBreakpointRegexError.py (1094 of 1524) PASS: lldb-api :: lang/cpp/const_static_integral_member/TestConstStaticIntegralMember.py (1095 of 1524) PASS: lldb-shell :: SymbolFile/NativePDB/load-pdb.cpp (1096 of 1524) UNSUPPORTED: lldb-api :: benchmarks/expression/TestRepeatedExprs.py (1097 of 1524) PASS: lldb-shell :: SymbolFile/Breakpad/unwind-via-stack-win.test (1098 of 1524) PASS: lldb-api :: lang/cpp/dereferencing_references/TestCPPDereferencingReferences.py (1099 of 1524) PASS: lldb-api :: commands/expression/import-std-module/module-build-errors/TestStdModuleBuildErrors.py (1100 of 1524) PASS: lldb-shell :: Driver/LocalLLDBInit.test (1101 of 1524) PASS: lldb-api :: tools/lldb-vscode/evaluate/TestVSCode_evaluate.py (1102 of 1524) PASS: lldb-shell :: Commands/command-regex-unalias.test (1103 of 1524) PASS: lldb-shell :: Settings/TestDefaultModuleCachePath.test (1104 of 1524) PASS: lldb-shell :: SymbolFile/NativePDB/locate-pdb.cpp (1105 of 1524) PASS: lldb-api :: lang/cpp/typedef/TestCppTypedef.py (1106 of 1524) PASS: lldb-api :: functionalities/data-formatter/data-formatter-synthval/TestDataFormatterSynthVal.py (1107 of 1524) UNSUPPORTED: lldb-api :: linux/aarch64/tagged_memory_region/TestAArch64LinuxTaggedMemoryRegion.py (1108 of 1524) UNSUPPORTED: lldb-api :: linux/aarch64/mte_core_file/TestAArch64LinuxMTEMemoryTagCoreFile.py (1109 of 1524) PASS: lldb-api :: functionalities/thread/concurrent_events/TestConcurrentSignalDelayBreak.py (1110 of 1524) PASS: lldb-api :: types/TestCharType.py (1111 of 1524) PASS: lldb-api :: python_api/get-value-32bit-int/TestGetValue32BitInt.py (1112 of 1524) PASS: lldb-api :: lang/objc/objc-struct-argument/TestObjCStructArgument.py (1113 of 1524) PASS: lldb-api :: lang/objcxx/conflicting-names-class-update-utility-expr/TestObjCConflictingNamesForClassUpdateExpr.py (1114 of 1524) PASS: lldb-shell :: Driver/TestCommands.test (1115 of 1524) PASS: lldb-api :: lang/c/find_struct_type/TestFindStructTypes.py (1116 of 1524) PASS: lldb-api :: functionalities/data-formatter/data-formatter-stl/libcxx/atomic/TestLibCxxAtomic.py (1117 of 1524) PASS: lldb-api :: lang/objc/objc-class-method/TestObjCClassMethod.py (1118 of 1524) UNSUPPORTED: lldb-api :: commands/platform/connect/TestPlatformConnect.py (1119 of 1524) UNSUPPORTED: lldb-shell :: Subprocess/clone-follow-child.test (1120 of 1524) UNSUPPORTED: lldb-shell :: Process/Windows/exception_access_violation.cpp (1121 of 1524) PASS: lldb-api :: tools/lldb-server/commandline/TestGdbRemoteConnection.py (1122 of 1524) XFAIL: lldb-api :: lang/objc/objc-dynamic-value/TestObjCDynamicValue.py (1123 of 1524) PASS: lldb-api :: commands/expression/vector_of_enums/TestVectorOfEnums.py (1124 of 1524) PASS: lldb-shell :: SymbolFile/DWARF/x86/debug_aranges-empty-section.s (1125 of 1524) PASS: lldb-api :: functionalities/gdb_remote_client/TestPlatformClient.py (1126 of 1524) UNSUPPORTED: lldb-api :: arm/breakpoint-thumb-codesection/TestBreakpointThumbCodesection.py (1127 of 1524) UNSUPPORTED: lldb-api :: commands/trace/TestTraceLoad.py (1128 of 1524) PASS: lldb-api :: commands/process/handle/TestProcessHandle.py (1129 of 1524) PASS: lldb-api :: tools/lldb-server/attach-wait/TestGdbRemoteAttachWait.py (1130 of 1524) PASS: lldb-shell :: Commands/command-regex-delete.test (1131 of 1524) PASS: lldb-api :: functionalities/data-formatter/data-formatter-stl/libcxx/map/TestDataFormatterLibccMap.py (1132 of 1524) PASS: lldb-shell :: ObjectFile/ELF/section-types.yaml (1133 of 1524) PASS: lldb-shell :: ObjectFile/ELF/many-sections.s (1134 of 1524) PASS: lldb-api :: functionalities/gdb_remote_client/TestGDBRemoteLoad.py (1135 of 1524) PASS: lldb-api :: commands/expression/namespace_local_var_same_name_obj_c/TestNamespaceLocalVarSameNameObjC.py (1136 of 1524) PASS: lldb-api :: commands/expression/persistent_ptr_update/TestPersistentPtrUpdate.py (1137 of 1524) PASS: lldb-shell :: Minidump/fb-dump.test (1138 of 1524) PASS: lldb-api :: lang/objc/objc-ivar-offsets/TestObjCIvarOffsets.py (1139 of 1524) PASS: lldb-api :: commands/platform/basic/TestPlatformCommand.py (1140 of 1524) PASS: lldb-api :: python_api/hello_world/TestHelloWorld.py (1141 of 1524) PASS: lldb-api :: functionalities/limit-debug-info/TestLimitDebugInfo.py (1142 of 1524) PASS: lldb-shell :: SymbolFile/Breakpad/inline-record.test (1143 of 1524) PASS: lldb-api :: commands/target/dump-symtab-demangle/TestDumpSymtabDemangle.py (1144 of 1524) PASS: lldb-api :: functionalities/data-formatter/array_typedef/TestArrayTypedef.py (1145 of 1524) PASS: lldb-api :: python_api/symbol-context/two-files/TestSymbolContextTwoFiles.py (1146 of 1524) PASS: lldb-api :: functionalities/thread/concurrent_events/TestConcurrentTwoBreakpointsOneWatchpoint.py (1147 of 1524) PASS: lldb-api :: lang/objc/blocks/TestObjCIvarsInBlocks.py (1148 of 1524) PASS: lldb-api :: commands/settings/TestSettings.py (1149 of 1524) PASS: lldb-api :: macosx/lc-note/firmware-corefile/TestFirmwareCorefiles.py (1150 of 1524) PASS: lldb-api :: functionalities/reproducers/fs-case-sensitivity/TestReproducerFSCaseSensitivity.py (1151 of 1524) UNSUPPORTED: lldb-api :: functionalities/ubsan/basic/TestUbsanBasic.py (1152 of 1524) PASS: lldb-api :: functionalities/data-formatter/typedef_array/TestTypedefArray.py (1153 of 1524) PASS: lldb-shell :: Reproducer/TestVersionCheck.test (1154 of 1524) UNSUPPORTED: lldb-api :: iohandler/autosuggestion/TestAutosuggestion.py (1155 of 1524) PASS: lldb-api :: functionalities/inferior-crashing/TestInferiorCrashingStep.py (1156 of 1524) PASS: lldb-api :: lang/cpp/virtual-overload/TestVirtualOverload.py (1157 of 1524) PASS: lldb-shell :: Breakpoint/debug_addrx.test (1158 of 1524) PASS: lldb-api :: lang/cpp/bool/TestCPPBool.py (1159 of 1524) PASS: lldb-api :: functionalities/data-formatter/data-formatter-stl/generic/list/TestDataFormatterGenericList.py (1160 of 1524) UNSUPPORTED: lldb-api :: macosx/rosetta/TestRosetta.py (1161 of 1524) PASS: lldb-api :: functionalities/load_using_paths/TestLoadUsingPaths.py (1162 of 1524) PASS: lldb-api :: lang/cpp/covariant-return-types/TestCovariantReturnTypes.py (1163 of 1524) PASS: lldb-shell :: SymbolFile/NativePDB/ast-methods.cpp (1164 of 1524) PASS: lldb-shell :: SymbolFile/DWARF/x86/debug_rnglists.s (1165 of 1524) PASS: lldb-api :: lang/cpp/namespace/TestNamespaceLookup.py (1166 of 1524) PASS: lldb-api :: lang/objcxx/cpp_keywords_enabled/TestObjCppKeywordsEnabled.py (1167 of 1524) UNSUPPORTED: lldb-api :: macosx/corefile-default-ptrauth/TestCorefileDefaultPtrauth.py (1168 of 1524) PASS: lldb-shell :: SymbolFile/DWARF/x86/module-ownership.mm (1169 of 1524) PASS: lldb-api :: functionalities/paths/TestPaths.py (1170 of 1524) PASS: lldb-api :: lang/c/calling-conventions/TestCCallingConventions.py (1171 of 1524) PASS: lldb-shell :: Settings/TestFrameFormatNoColor.test (1172 of 1524) PASS: lldb-shell :: SymbolFile/DWARF/x86/DW_OP_piece-struct.s (1173 of 1524) PASS: lldb-api :: functionalities/breakpoint/two_hits_one_actual/TestTwoHitsOneActual.py (1174 of 1524) PASS: lldb-api :: commands/expression/radar_9673664/TestExprHelpExamples.py (1175 of 1524) PASS: lldb-api :: lang/objc/real-definition/TestRealDefinition.py (1176 of 1524) PASS: lldb-shell :: ObjectFile/PECOFF/sections-names.yaml (1177 of 1524) PASS: lldb-api :: macosx/nslog/TestDarwinNSLogOutput.py (1178 of 1524) PASS: lldb-shell :: Register/Core/x86-64-netbsd-multithread.test (1179 of 1524) PASS: lldb-api :: test_utils/TestDecorators.py (1180 of 1524) PASS: lldb-api :: functionalities/thread/concurrent_events/TestConcurrentTwoBreakpointsOneSignal.py (1181 of 1524) PASS: lldb-api :: functionalities/module_cache/simple_exe/TestModuleCacheSimple.py (1182 of 1524) PASS: lldb-api :: commands/expression/anonymous-struct/TestCallUserAnonTypedef.py (1183 of 1524) PASS: lldb-api :: functionalities/scripted_process/TestScriptedProcess.py (1184 of 1524) PASS: lldb-api :: functionalities/gdb_remote_client/TestGdbClientModuleLoad.py (1185 of 1524) PASS: lldb-api :: commands/expression/char/TestExprsChar.py (1186 of 1524) PASS: lldb-shell :: ScriptInterpreter/Python/eof.test (1187 of 1524) PASS: lldb-shell :: SymbolFile/DWARF/x86/debug-types-line-tables.s (1188 of 1524) PASS: lldb-shell :: Expr/TestIRMemoryMap.test (1189 of 1524) PASS: lldb-shell :: Unwind/thread-step-out-ret-addr-check.test (1190 of 1524) PASS: lldb-api :: symbol_ondemand/breakpoint_source_regex/TestSourceTextRegexBreakpoint.py (1191 of 1524) PASS: lldb-api :: test_utils/TestPExpectTest.py (1192 of 1524) PASS: lldb-api :: lang/c/global_variables/TestGlobalVariables.py (1193 of 1524) UNSUPPORTED: lldb-shell :: SymbolFile/target-symbols-add-unwind.test (1194 of 1524) PASS: lldb-shell :: Register/Core/x86-32-freebsd-addr.test (1195 of 1524) PASS: lldb-shell :: Subprocess/fork-follow-parent.test (1196 of 1524) UNSUPPORTED: lldb-shell :: Reproducer/TestLuaImport.test (1197 of 1524) PASS: lldb-api :: functionalities/data-formatter/data-formatter-objc/TestDataFormatterObjCCF.py (1198 of 1524) PASS: lldb-api :: functionalities/tail_call_frames/cross_object/TestCrossObjectTailCalls.py (1199 of 1524) PASS: lldb-api :: functionalities/breakpoint/objc/TestObjCBreakpoints.py (1200 of 1524) UNSUPPORTED: lldb-api :: iohandler/completion/TestIOHandlerCompletion.py (1201 of 1524) PASS: lldb-api :: tools/lldb-server/TestGdbRemoteHostInfo.py (1202 of 1524) PASS: lldb-api :: commands/expression/import-std-module/conflicts/TestStdModuleWithConflicts.py (1203 of 1524) PASS: lldb-api :: tools/lldb-vscode/attach/TestVSCode_attach.py (1204 of 1524) UNSUPPORTED: lldb-api :: functionalities/postmortem/FreeBSDKernel/TestFreeBSDKernelLive.py (1205 of 1524) UNSUPPORTED: lldb-shell :: Register/aarch64-gp-read.test (1206 of 1524) XFAIL: lldb-api :: lang/c/local_types/TestUseClosestType.py (1207 of 1524) PASS: lldb-api :: lang/cpp/virtual-functions/TestCppVirtualFunctions.py (1208 of 1524) UNSUPPORTED: lldb-api :: tools/lldb-server/TestNonStop.py (1209 of 1524) PASS: lldb-api :: lang/cpp/stl/TestSTL.py (1210 of 1524) PASS: lldb-api :: lldbutil-tests/failed-to-hit-breakpoint/TestLLDBUtilFailedToHitBreakpoint.py (1211 of 1524) PASS: lldb-api :: functionalities/thread/concurrent_events/TestConcurrentSignalDelayWatch.py (1212 of 1524) PASS: lldb-shell :: SymbolFile/DWARF/x86/DW_TAG_variable-DW_AT_const_value.s (1213 of 1524) PASS: lldb-api :: functionalities/gdb_remote_client/TestRemoteRegNums.py (1214 of 1524) PASS: lldb-shell :: SymbolFile/DWARF/x86/dwarf5-partial-index.cpp (1215 of 1524) PASS: lldb-api :: lang/objc/complete-type-check/TestObjCIsTypeComplete.py (1216 of 1524) PASS: lldb-api :: commands/expression/po_verbosity/TestPoVerbosity.py (1217 of 1524) PASS: lldb-api :: macosx/thread_suspend/TestInternalThreadSuspension.py (1218 of 1524) PASS: lldb-shell :: Driver/TestConvenienceVariables.test (1219 of 1524) PASS: lldb-api :: lang/cpp/function-qualifiers/TestCppFunctionQualifiers.py (1220 of 1524) PASS: lldb-api :: functionalities/data-formatter/data-formatter-stl/libstdcpp/unique_ptr/invalid/TestDataFormatterInvalidStdUniquePtr.py (1221 of 1524) PASS: lldb-api :: commands/expression/call-function/TestCallStdStringFunction.py (1222 of 1524) PASS: lldb-api :: commands/target/select/TestTargetSelect.py (1223 of 1524) PASS: lldb-api :: lang/cpp/std-function-step-into-callable/TestStdFunctionStepIntoCallable.py (1224 of 1524) PASS: lldb-api :: commands/target/stop-hook/disable/TestTargetStopHookDisable.py (1225 of 1524) UNSUPPORTED: lldb-api :: commands/watchpoints/watch_tagged_addr/TestWatchTaggedAddress.py (1226 of 1524) PASS: lldb-shell :: SymbolFile/NativePDB/disassembly.cpp (1227 of 1524) PASS: lldb-api :: macosx/safe-to-func-call/TestSafeFuncCalls.py (1228 of 1524) PASS: lldb-api :: lang/cpp/complete-type-check/TestCppIsTypeComplete.py (1229 of 1524) PASS: lldb-api :: tools/lldb-server/TestGdbRemoteExpeditedRegisters.py (1230 of 1524) PASS: lldb-api :: lang/cpp/inlines/TestInlines.py (1231 of 1524) PASS: lldb-shell :: ScriptInterpreter/Python/scripted_breakpoint.test (1232 of 1524) UNSUPPORTED: lldb-api :: functionalities/breakpoint/breakpoint_callback_command_source/TestBreakpointCallbackCommandSource.py (1233 of 1524) PASS: lldb-api :: functionalities/data-formatter/data-formatter-objc/TestDataFormatterObjCNSNumber.py (1234 of 1524) PASS: lldb-shell :: SymbolFile/DWARF/x86/find-basic-namespace.cpp (1235 of 1524) PASS: lldb-api :: commands/gui/invalid-args/TestInvalidArgsGui.py (1236 of 1524) PASS: lldb-shell :: ObjectFile/MachO/subsections.yaml (1237 of 1524) PASS: lldb-api :: lang/cpp/symbols/TestSymbols.py (1238 of 1524) PASS: lldb-api :: lang/objc/foundation/TestRuntimeTypes.py (1239 of 1524) UNSUPPORTED: lldb-api :: commands/gui/expand-threads-tree/TestGuiExpandThreadsTree.py (1240 of 1524) PASS: lldb-api :: functionalities/thread/concurrent_events/TestConcurrentDelayWatchBreak.py (1241 of 1524) PASS: lldb-api :: macosx/find-dsym/bundle-with-dot-in-filename/TestBundleWithDotInFilename.py (1242 of 1524) PASS: lldb-api :: commands/target/dump/TestTargetDumpTypeSystem.py (1243 of 1524) UNSUPPORTED: lldb-api :: android/platform/TestDefaultCacheLineSize.py (1244 of 1524) PASS: lldb-shell :: SymbolFile/DWARF/x86/dwo-not-found-warning.cpp (1245 of 1524) UNSUPPORTED: lldb-api :: commands/trace/TestTraceStartStop.py (1246 of 1524) UNSUPPORTED: lldb-api :: api/multiple-targets/TestMultipleTargets.py (1247 of 1524) PASS: lldb-shell :: SymbolFile/DWARF/x86/array-sizes.s (1248 of 1524) PASS: lldb-api :: functionalities/conditional_break/TestConditionalBreak.py (1249 of 1524) PASS: lldb-api :: python_api/lldbutil/process/TestPrintStackTraces.py (1250 of 1524) PASS: lldb-api :: commands/settings/quoting/TestQuoting.py (1251 of 1524) PASS: lldb-shell :: SymbolFile/DWARF/x86/DW_TAG_variable-invalid_location.s (1252 of 1524) UNSUPPORTED: lldb-api :: functionalities/thread/state/TestThreadStates.py (1253 of 1524) UNSUPPORTED: lldb-api :: commands/trace/TestTraceTSC.py (1254 of 1524) PASS: lldb-shell :: SymbolFile/DWARF/x86/find-basic-function.cpp (1255 of 1524) XFAIL: lldb-api :: functionalities/thread/create_during_step/TestCreateDuringStep.py (1256 of 1524) PASS: lldb-shell :: SymbolFile/Breakpad/line-table.test (1257 of 1524) PASS: lldb-api :: functionalities/postmortem/elf-core/thread_crash/TestLinuxCoreThreads.py (1258 of 1524) PASS: lldb-api :: functionalities/breakpoint/hardware_breakpoints/require_hw_breakpoints/TestRequireHWBreakpoints.py (1259 of 1524) PASS: lldb-shell :: SymbolFile/DWARF/x86/DW_AT_const_value-bitfields.s (1260 of 1524) PASS: lldb-api :: functionalities/data-formatter/data-formatter-named-summaries/TestDataFormatterNamedSummaries.py (1261 of 1524) PASS: lldb-api :: lang/cpp/incomplete-types/members/TestCppIncompleteTypeMembers.py (1262 of 1524) PASS: lldb-api :: functionalities/gdb_remote_client/TestMemoryRegionDirtyPages.py (1263 of 1524) PASS: lldb-api :: tools/lldb-vscode/console/TestVSCode_redirection_to_console.py (1264 of 1524) PASS: lldb-api :: tools/lldb-server/thread-name/TestGdbRemoteThreadName.py (1265 of 1524) UNSUPPORTED: lldb-api :: repl/clang/TestClangREPL.py (1266 of 1524) PASS: lldb-api :: commands/expression/issue_11588/Test11588.py (1267 of 1524) PASS: lldb-shell :: ObjectFile/PECOFF/settings-abi.yaml (1268 of 1524) UNSUPPORTED: lldb-shell :: Unwind/split-machine-functions.test (1269 of 1524) PASS: lldb-shell :: Error/assert.test (1270 of 1524) PASS: lldb-api :: commands/expression/call-throws/TestCallThatThrows.py (1271 of 1524) UNSUPPORTED: lldb-api :: functionalities/process_save_core_minidump/TestProcessSaveCoreMinidump.py (1272 of 1524) PASS: lldb-api :: lang/objc/ivar-IMP/TestObjCiVarIMP.py (1273 of 1524) PASS: lldb-api :: macosx/add-dsym/TestAddDsymMidExecutionCommand.py (1274 of 1524) PASS: lldb-api :: functionalities/postmortem/elf-core/TestLinuxCore.py (1275 of 1524) PASS: lldb-api :: python_api/lldbutil/frame/TestFrameUtils.py (1276 of 1524) PASS: lldb-api :: lang/objc/objc++/TestObjCXX.py (1277 of 1524) UNSUPPORTED: lldb-shell :: SymbolFile/PDB/vbases.test (1278 of 1524) UNSUPPORTED: lldb-api :: commands/register/register/aarch64_sve_registers/rw_access_dynamic_resize/TestSVEThreadedDynamic.py (1279 of 1524) PASS: lldb-api :: functionalities/data-formatter/data-formatter-stl/generic/forward_list/TestDataFormatterGenericForwardList.py (1280 of 1524) PASS: lldb-shell :: SymbolFile/DWARF/x86/DW_AT_declaration-with-children.s (1281 of 1524) PASS: lldb-api :: lang/c/modules/TestCModules.py (1282 of 1524) PASS: lldb-api :: test_utils/TestInlineTest.py (1283 of 1524) PASS: lldb-shell :: SymbolFile/DWARF/x86/debug_loclists-dwp.s (1284 of 1524) PASS: lldb-shell :: SymbolFile/DWARF/x86/dir-separator-no-comp-dir-relative-name.s (1285 of 1524) PASS: lldb-api :: tools/lldb-vscode/launch/TestVSCode_launch.py (1286 of 1524) PASS: lldb-api :: functionalities/thread/thread_exit/TestThreadExit.py (1287 of 1524) PASS: lldb-shell :: ObjectFile/PECOFF/uuid.yaml (1288 of 1524) PASS: lldb-api :: functionalities/postmortem/mach-core/TestMachCore.py (1289 of 1524) PASS: lldb-api :: lang/cpp/member-and-local-vars-with-same-name/TestMembersAndLocalsWithSameName.py (1290 of 1524) PASS: lldb-api :: lang/c/anonymous/TestAnonymous.py (1291 of 1524) PASS: lldb-shell :: SymbolFile/DWARF/x86/debug-line-basic.s (1292 of 1524) PASS: lldb-api :: python_api/watchpoint/TestSetWatchpoint.py (1293 of 1524) PASS: lldb-api :: commands/process/attach-resume/TestAttachResume.py (1294 of 1524) UNSUPPORTED: lldb-shell :: ScriptInterpreter/Lua/command_script_import.test (1295 of 1524) PASS: lldb-api :: lang/objc/objc-new-syntax/TestObjCNewSyntaxArray.py (1296 of 1524) PASS: lldb-shell :: ObjectFile/ELF/aarch64-relocations.yaml (1297 of 1524) PASS: lldb-shell :: SymbolFile/NativePDB/function-types-builtins.cpp (1298 of 1524) PASS: lldb-api :: functionalities/deleted-executable/TestDeletedExecutable.py (1299 of 1524) PASS: lldb-api :: functionalities/history/TestHistoryRecall.py (1300 of 1524) UNSUPPORTED: lldb-shell :: Register/x86-64-xmm16-write.test (1301 of 1524) PASS: lldb-api :: commands/expression/unicode-in-variable/TestUnicodeInVariable.py (1302 of 1524) UNSUPPORTED: lldb-shell :: SymbolFile/PDB/function-nested-block.test (1303 of 1524) UNSUPPORTED: lldb-shell :: ScriptInterpreter/Lua/nested_sessions.test (1304 of 1524) PASS: lldb-shell :: SymbolFile/DWARF/x86/dir-separator-posix.s (1305 of 1524) PASS: lldb-shell :: SymbolFile/DWARF/DW_AT_range-DW_FORM_sec_offset.s (1306 of 1524) PASS: lldb-shell :: Breakpoint/case-sensitive.test (1307 of 1524) PASS: lldb-api :: commands/expression/calculator_mode/TestCalculatorMode.py (1308 of 1524) UNSUPPORTED: lldb-api :: terminal/TestEditline.py (1309 of 1524) PASS: lldb-shell :: SymbolFile/DWARF/x86/dwp-debug-types.s (1310 of 1524) PASS: lldb-api :: lang/cpp/pointer_to_member_type_depending_on_parent_size/TestPointerToMemberTypeDependingOnParentSize.py (1311 of 1524) UNSUPPORTED: lldb-shell :: SymbolFile/PDB/calling-conventions-arm.test (1312 of 1524) PASS: lldb-api :: functionalities/data-formatter/data-formatter-stl/generic/optional/TestDataFormatterGenericOptional.py (1313 of 1524) PASS: lldb-shell :: Register/Core/x86-64-freebsd-fp.test (1314 of 1524) PASS: lldb-shell :: SymbolFile/DWARF/x86/debug_loclists-dwo.s (1315 of 1524) PASS: lldb-api :: functionalities/unwind/noreturn/module-end/TestNoReturnModuleEnd.py (1316 of 1524) UNSUPPORTED: lldb-api :: lang/objc/rdar-12408181/TestRdar12408181.py (1317 of 1524) PASS: lldb-api :: commands/expression/scoped_enums/TestScopedEnumType.py (1318 of 1524) PASS: lldb-api :: functionalities/target_var/TestTargetVar.py (1319 of 1524) PASS: lldb-api :: python_api/frame/get-variables/TestGetVariables.py (1320 of 1524) PASS: lldb-api :: commands/expression/import-std-module/shared_ptr/TestSharedPtrFromStdModule.py (1321 of 1524) PASS: lldb-api :: lang/cpp/dynamic-value/TestCppValueCast.py (1322 of 1524) PASS: lldb-shell :: Register/Core/x86-64-linux-addr.test (1323 of 1524) PASS: lldb-api :: functionalities/thread/concurrent_events/TestConcurrentTwoWatchpointsOneDelayBreakpoint.py (1324 of 1524) PASS: lldb-shell :: SymbolFile/DWARF/x86/find-qualified-variable.cpp (1325 of 1524) PASS: lldb-api :: python_api/sbmodule/TestSBModule.py (1326 of 1524) PASS: lldb-api :: lang/cpp/operator-overload/TestOperatorOverload.py (1327 of 1524) PASS: lldb-api :: functionalities/gdb_remote_client/TestGDBRemoteDiskFileCompletion.py (1328 of 1524) PASS: lldb-api :: macosx/thread-names/TestInterruptThreadNames.py (1329 of 1524) UNSUPPORTED: lldb-api :: lang/objc/foundation/TestFoundationDisassembly.py (1330 of 1524) PASS: lldb-shell :: ObjectFile/PECOFF/basic-info-arm.yaml (1331 of 1524) UNSUPPORTED: lldb-shell :: Unwind/eh-frame-small-fde.test (1332 of 1524) PASS: lldb-api :: commands/command/invalid-args/TestInvalidArgsCommand.py (1333 of 1524) XFAIL: lldb-shell :: Register/x86-mm-xmm-read.test (1334 of 1524) PASS: lldb-api :: functionalities/data-formatter/poarray/TestPrintObjectArray.py (1335 of 1524) PASS: lldb-api :: lang/cpp/llvm-style/TestLLVMStyle.py (1336 of 1524) PASS: lldb-api :: lang/cpp/unicode-literals/TestUnicodeLiterals.py (1337 of 1524) PASS: lldb-api :: commands/expression/deleting-implicit-copy-constructor/TestDeletingImplicitCopyConstructor.py (1338 of 1524) PASS: lldb-shell :: ObjectFile/ELF/gnu-debuglink.yaml (1339 of 1524) UNSUPPORTED: lldb-api :: functionalities/data-formatter/data-formatter-stl/libstdcpp/vector/TestDataFormatterStdVector.py (1340 of 1524) PASS: lldb-api :: macosx/dyld-trie-symbols/TestDyldTrieSymbols.py (1341 of 1524) PASS: lldb-api :: tools/lldb-vscode/breakpoint-events/TestVSCode_breakpointEvents.py (1342 of 1524) PASS: lldb-shell :: SymbolFile/DWARF/deterministic-build.cpp (1343 of 1524) PASS: lldb-api :: commands/expression/dollar-in-variable/TestDollarInVariable.py (1344 of 1524) PASS: lldb-api :: lang/objc/objc-runtime-ivars/TestRuntimeIvars.py (1345 of 1524) UNSUPPORTED: lldb-shell :: Register/x86-ymm-read.test (1346 of 1524) PASS: lldb-shell :: Register/Core/x86-64-freebsd-multithread.test (1347 of 1524) PASS: lldb-api :: functionalities/data-formatter/data-formatter-categories/TestDataFormatterCategories.py (1348 of 1524) PASS: lldb-shell :: Reproducer/TestFileRepro.test (1349 of 1524) PASS: lldb-api :: commands/expression/function_template_specialization_temp_args/TestFunctionTemplateSpecializationTempArgs.py (1350 of 1524) PASS: lldb-api :: driver/job_control/TestJobControl.py (1351 of 1524) PASS: lldb-api :: functionalities/data-formatter/parray/TestPrintArray.py (1352 of 1524) PASS: lldb-api :: commands/watchpoints/watchpoint_events/TestWatchpointEvents.py (1353 of 1524) PASS: lldb-shell :: Commands/command-stop-hook-output.test (1354 of 1524) PASS: lldb-shell :: Register/Core/x86-32-linux-gp.test (1355 of 1524) PASS: lldb-shell :: ObjectFile/ELF/section-addresses.yaml (1356 of 1524) UNSUPPORTED: lldb-shell :: SymbolFile/dissassemble-entry-point.s (1357 of 1524) PASS: lldb-api :: lang/c/builtin-types/TestCBuiltinTypes.py (1358 of 1524) PASS: lldb-api :: functionalities/thread/concurrent_events/TestConcurrentSignalWatch.py (1359 of 1524) PASS: lldb-api :: lang/objc/objc-optimized/TestObjcOptimized.py (1360 of 1524) PASS: lldb-api :: commands/target/auto-install-main-executable/TestAutoInstallMainExecutable.py (1361 of 1524) PASS: lldb-api :: functionalities/breakpoint/consecutive_breakpoints/TestConsecutiveBreakpoints.py (1362 of 1524) PASS: lldb-shell :: Commands/CommandScriptImmediateOutput/CommandScriptImmediateOutputConsole.test (1363 of 1524) PASS: lldb-api :: functionalities/thread/concurrent_events/TestConcurrentWatchpointWithDelayWatchpointThreads.py (1364 of 1524) PASS: lldb-api :: functionalities/gdb_remote_client/TestNoWatchpointSupportInfo.py (1365 of 1524) PASS: lldb-shell :: Minidump/memory-region.yaml (1366 of 1524) PASS: lldb-api :: lang/cpp/break-on-initializers/TestBreakOnCPP11Initializers.py (1367 of 1524) UNSUPPORTED: lldb-shell :: ObjectFile/ELF/minidebuginfo-no-lzma.yaml (1368 of 1524) PASS: lldb-api :: functionalities/data-formatter/data-formatter-stl/libcxx/vbool/TestDataFormatterLibcxxVBool.py (1369 of 1524) PASS: lldb-api :: tools/lldb-server/TestLldbGdbServer.py (1370 of 1524) PASS: lldb-api :: commands/process/continue_to_bkpt/TestContinueToBkpts.py (1371 of 1524) PASS: lldb-shell :: Commands/CommandScriptImmediateOutput/CommandScriptImmediateOutputFile.test (1372 of 1524) PASS: lldb-api :: commands/expression/import-std-module/vector-bool/TestVectorBoolFromStdModule.py (1373 of 1524) PASS: lldb-api :: lang/cpp/rvalue-references/TestRvalueReferences.py (1374 of 1524) UNSUPPORTED: lldb-shell :: Subprocess/clone-follow-parent-wp.test (1375 of 1524) PASS: lldb-api :: python_api/sblaunchinfo/TestSBLaunchInfo.py (1376 of 1524) PASS: lldb-shell :: SymbolFile/Breakpad/line-table-mixed-path-styles.test (1377 of 1524) PASS: lldb-api :: commands/watchpoints/step_over_watchpoint/TestStepOverWatchpoint.py (1378 of 1524) UNSUPPORTED: lldb-api :: tools/lldb-server/memory-tagging/TestGdbRemoteMemoryTagging.py (1379 of 1524) PASS: lldb-api :: commands/platform/basic/TestPlatformPython.py (1380 of 1524) PASS: lldb-shell :: SymbolFile/DWARF/x86/debug-types-address-ranges.s (1381 of 1524) PASS: lldb-shell :: SymbolFile/Breakpad/stack-cfi-parsing.test (1382 of 1524) PASS: lldb-api :: functionalities/signal/TestSendSignal.py (1383 of 1524) PASS: lldb-api :: lang/objc/modules-incomplete/TestIncompleteModules.py (1384 of 1524) PASS: lldb-shell :: SymbolFile/NativePDB/lookup-by-types.cpp (1385 of 1524) PASS: lldb-api :: lang/cpp/accelerator-table/TestCPPAccelerator.py (1386 of 1524) PASS: lldb-api :: commands/expression/save_jit_objects/TestSaveJITObjects.py (1387 of 1524) PASS: lldb-shell :: Settings/TestEchoCommands.test (1388 of 1524) PASS: lldb-api :: lang/cpp/const_static_integral_member_int128/TestConstStaticIntegralMemberInt128.py (1389 of 1524) UNSUPPORTED: lldb-shell :: Register/arm-gp-read.test (1390 of 1524) UNSUPPORTED: lldb-api :: commands/watchpoints/multi_watchpoint_slots/TestWatchpointMultipleSlots.py (1391 of 1524) PASS: lldb-api :: functionalities/data-formatter/data-formatter-stl/libcxx/shared_ptr/TestDataFormatterLibcxxSharedPtr.py (1392 of 1524) PASS: lldb-api :: functionalities/breakpoint/step_over_breakpoint/TestStepOverBreakpoint.py (1393 of 1524) PASS: lldb-api :: functionalities/tail_call_frames/cross_dso/TestCrossDSOTailCalls.py (1394 of 1524) UNSUPPORTED: lldb-shell :: Unwind/eh-frame-augment-noop.test (1395 of 1524) PASS: lldb-api :: functionalities/thread/concurrent_events/TestConcurrentCrashWithBreak.py (1396 of 1524) PASS: lldb-api :: commands/expression/rdar44436068/Test128BitsInteger.py (1397 of 1524) PASS: lldb-api :: commands/add-dsym/uuid/TestAddDsymCommand.py (1398 of 1524) PASS: lldb-api :: functionalities/thread/concurrent_events/TestConcurrentNWatchNBreak.py (1399 of 1524) PASS: lldb-shell :: SymbolFile/DWARF/x86/apple-index-is-used.cpp (1400 of 1524) UNSUPPORTED: lldb-shell :: SymbolFile/PDB/udt-layout.test (1401 of 1524) UNSUPPORTED: lldb-shell :: Unwind/windows-unaligned-x86_64.test (1402 of 1524) PASS: lldb-api :: functionalities/data-formatter/pyobjsynthprovider/TestPyObjSynthProvider.py (1403 of 1524) PASS: lldb-api :: commands/target/basic/TestTargetCommand.py (1404 of 1524) PASS: lldb-api :: python_api/sbenvironment/TestSBEnvironment.py (1405 of 1524) PASS: lldb-shell :: BuildScript/script-args.test (1406 of 1524) UNSUPPORTED: lldb-shell :: SymbolFile/DWARF/split-dwarf-expression-eval-bug.cpp (1407 of 1524) UNSUPPORTED: lldb-api :: functionalities/thread/main_thread_exit/TestMainThreadExit.py (1408 of 1524) PASS: lldb-shell :: SymbolFile/DWARF/x86/dwarf5-split.s (1409 of 1524) PASS: lldb-api :: functionalities/tail_call_frames/disambiguate_call_site/TestDisambiguateCallSite.py (1410 of 1524) UNSUPPORTED: lldb-shell :: SymbolFile/PDB/compilands.test (1411 of 1524) PASS: lldb-api :: lang/cpp/thread_local/TestThreadLocal.py (1412 of 1524) PASS: lldb-api :: functionalities/data-formatter/data-formatter-stl/libcxx/variant/TestDataFormatterLibcxxVariant.py (1413 of 1524) PASS: lldb-api :: lang/objcxx/hide-runtime-values/TestObjCXXHideRuntimeValues.py (1414 of 1524) PASS: lldb-api :: commands/expression/persistent_variables/TestPersistentVariables.py (1415 of 1524) PASS: lldb-shell :: SymbolFile/DWARF/clang-ast-from-dwarf-unamed-and-anon-structs.cpp (1416 of 1524) PASS: lldb-shell :: SymbolFile/DWARF/x86/debug-types-signature-loop.s (1417 of 1524) PASS: lldb-api :: lang/objc/objc-static-method-stripped/TestObjCStaticMethodStripped.py (1418 of 1524) PASS: lldb-api :: functionalities/memory/find/TestMemoryFind.py (1419 of 1524) PASS: lldb-api :: python_api/default-constructor/TestDefaultConstructorForAPIObjects.py (1420 of 1524) PASS: lldb-api :: commands/expression/import-std-module/deque-dbg-info-content/TestDbgInfoContentDequeFromStdModule.py (1421 of 1524) UNSUPPORTED: lldb-shell :: SymbolFile/DWARF/x86/DW_TAG_GNU_call_site-DW_AT_low_pc.s (1422 of 1524) PASS: lldb-api :: types/TestShortType.py (1423 of 1524) PASS: lldb-shell :: BuildScript/modes.test (1424 of 1524) PASS: lldb-api :: tools/lldb-vscode/step/TestVSCode_step.py (1425 of 1524) UNSUPPORTED: lldb-api :: benchmarks/startup/TestStartupDelays.py (1426 of 1524) UNSUPPORTED: lldb-shell :: Subprocess/fork-follow-child-wp.test (1427 of 1524) PASS: lldb-api :: commands/platform/process/list/TestProcessList.py (1428 of 1524) UNSUPPORTED: lldb-shell :: Subprocess/vfork-follow-child-wp.test (1429 of 1524) PASS: lldb-api :: python_api/interpreter/TestRunCommandInterpreterAPI.py (1430 of 1524) PASS: lldb-api :: python_api/exprpath_synthetic/TestExprPathSynthetic.py (1431 of 1524) PASS: lldb-api :: arm/emulation/TestEmulations.py (1432 of 1524) PASS: lldb-api :: python_api/lldbutil/iter/TestLLDBIterator.py (1433 of 1524) PASS: lldb-api :: lang/cpp/sizeof/TestCPPSizeof.py (1434 of 1524) PASS: lldb-api :: commands/watchpoints/watchpoint_commands/command/TestWatchpointCommandLLDB.py (1435 of 1524) UNSUPPORTED: lldb-api :: commands/trace/multiple-threads/TestTraceStartStopMultipleThreads.py (1436 of 1524) XFAIL: lldb-api :: lang/cpp/reference-to-outer-type/TestCppReferenceToOuterClass.py (1437 of 1524) UNSUPPORTED: lldb-shell :: SymbolFile/PDB/func-symbols.test (1438 of 1524) PASS: lldb-shell :: Breakpoint/debug_rnglistx_rlex.test (1439 of 1524) UNSUPPORTED: lldb-api :: lang/cpp/limit-debug-info/TestWithLimitDebugInfo.py (1440 of 1524) PASS: lldb-shell :: Driver/TestSingleQuote.test (1441 of 1524) XFAIL: lldb-shell :: Register/x86-fp-write.test (1442 of 1524) PASS: lldb-api :: lang/c/shared_lib_stripped_symbols/TestSharedLibStrippedSymbols.py (1443 of 1524) UNSUPPORTED: lldb-shell :: BuildScript/toolchain-msvc.test (1444 of 1524) PASS: lldb-api :: functionalities/thread/concurrent_events/TestConcurrentManyCrash.py (1445 of 1524) PASS: lldb-api :: functionalities/thread/num_threads/TestNumThreads.py (1446 of 1524) PASS: lldb-shell :: ObjectFile/PECOFF/export-dllfunc.yaml (1447 of 1524) PASS: lldb-api :: functionalities/breakpoint/breakpoint_set_restart/TestBreakpointSetRestart.py (1448 of 1524) PASS: lldb-shell :: Commands/command-image-lookup.yaml (1449 of 1524) UNSUPPORTED: lldb-shell :: Unwind/unwind-plan-dwarf-dump.test (1450 of 1524) PASS: lldb-api :: functionalities/source-map/TestTargetSourceMap.py (1451 of 1524) PASS: lldb-api :: lang/cpp/class_types/TestClassTypesDisassembly.py (1452 of 1524) PASS: lldb-api :: functionalities/data-formatter/data-formatter-python-synth/TestDataFormatterPythonSynth.py (1453 of 1524) PASS: lldb-shell :: ObjectFile/Breakpad/discontiguous-sections.test (1454 of 1524) PASS: lldb-shell :: ObjectFile/ELF/netbsd-exec-8.99.30-amd64.yaml (1455 of 1524) PASS: lldb-api :: commands/expression/import-std-module/vector/TestVectorFromStdModule.py (1456 of 1524) PASS: lldb-shell :: SymbolFile/DWARF/x86/dwarf5-debug_line.s (1457 of 1524) PASS: lldb-api :: functionalities/breakpoint/breakpoint_names/TestBreakpointNames.py (1458 of 1524) PASS: lldb-api :: lang/cpp/alignas_base_class/TestAlignAsBaseClass.py (1459 of 1524) PASS: lldb-api :: functionalities/breakpoint/breakpoint_command/TestRegexpBreakCommand.py (1460 of 1524) UNSUPPORTED: lldb-shell :: ScriptInterpreter/Lua/persistent_state.test (1461 of 1524) PASS: lldb-api :: commands/command/script_alias/TestCommandScriptAlias.py (1462 of 1524) PASS: lldb-shell :: Unwind/trap_frame_sym_ctx.test (1463 of 1524) PASS: lldb-api :: commands/expression/codegen-crash-import-def-arraytype-element/TestImportDefinitionArrayType.py (1464 of 1524) PASS: lldb-api :: lang/objc/foundation/TestObjCMethodsNSError.py (1465 of 1524) UNSUPPORTED: lldb-api :: functionalities/gdb_remote_client/TestQemuAArch64TargetXml.py (1466 of 1524) PASS: lldb-shell :: SymbolFile/NativePDB/globals-bss.cpp (1467 of 1524) PASS: lldb-api :: types/TestFloatTypesExpr.py (1468 of 1524) PASS: lldb-shell :: Commands/command-stop-hook-no-target.test (1469 of 1524) PASS: lldb-shell :: Subprocess/fork-follow-parent-wp.test (1470 of 1524) UNSUPPORTED: lldb-api :: linux/aarch64/unwind_signal/TestUnwindSignal.py (1471 of 1524) PASS: lldb-shell :: Minidump/Windows/broken-unwind.test (1472 of 1524) PASS: lldb-api :: lang/objc/rdar-10967107/TestRdar10967107.py (1473 of 1524) PASS: lldb-api :: lang/cpp/forward-declared-template-specialization/TestCppForwardDeclaredTemplateSpecialization.py (1474 of 1524) PASS: lldb-api :: lang/cpp/this/TestCPPThis.py (1475 of 1524) UNSUPPORTED: lldb-api :: iohandler/sigint/TestIOHandlerPythonREPLSigint.py (1476 of 1524) PASS: lldb-api :: lang/cpp/scope/TestCppScope.py (1477 of 1524) UNSUPPORTED: lldb-shell :: Register/x86-64-ymm16-write.test (1478 of 1524) PASS: lldb-api :: functionalities/data-formatter/cstring-utf8-summary/TestCstringUnicode.py (1479 of 1524) PASS: lldb-api :: lang/cpp/class_static/TestStaticVariables.py (1480 of 1524) PASS: lldb-api :: functionalities/thread/step_out/TestThreadStepOut.py (1481 of 1524) UNSUPPORTED: lldb-api :: functionalities/dyld-exec-linux/TestDyldExecLinux.py (1482 of 1524) PASS: lldb-shell :: ScriptInterpreter/Python/scripted_breakpoint_lua.test (1483 of 1524) PASS: lldb-shell :: Host/TestCustomShell.test (1484 of 1524) PASS: lldb-shell :: SymbolFile/DWARF/x86/dwp-separate-debug-file.cpp (1485 of 1524) PASS: lldb-shell :: SymbolFile/DWARF/x86/debug_ranges.s (1486 of 1524) PASS: lldb-api :: python_api/function_symbol/TestDisasmAPI.py (1487 of 1524) UNSUPPORTED: lldb-api :: functionalities/tsan/thread_leak/TestTsanThreadLeak.py (1488 of 1524) PASS: lldb-api :: functionalities/gdb_remote_client/TestJLink6Armv7RegisterDefinition.py (1489 of 1524) PASS: lldb-api :: python_api/value/empty_class/TestValueAPIEmptyClass.py (1490 of 1524) PASS: lldb-api :: lang/objc/modules-objc-property/TestModulesObjCProperty.py (1491 of 1524) PASS: lldb-api :: functionalities/unwind/noreturn/TestNoreturnUnwind.py (1492 of 1524) PASS: lldb-api :: functionalities/tail_call_frames/disambiguate_tail_call_seq/TestDisambiguateTailCallSeq.py (1493 of 1524) PASS: lldb-shell :: Breakpoint/debug_rnglist_rlestartend.test (1494 of 1524) PASS: lldb-api :: commands/expression/import-std-module/weak_ptr/TestWeakPtrFromStdModule.py (1495 of 1524) PASS: lldb-api :: macosx/unregistered-macho/TestUnregisteredMacho.py (1496 of 1524) PASS: lldb-api :: functionalities/data-formatter/data-formatter-stl/libcxx/span/TestDataFormatterLibcxxSpan.py (1497 of 1524) PASS: lldb-api :: lang/cpp/gmodules-templates/TestGModules.py (1498 of 1524) PASS: lldb-api :: functionalities/optimized_code/TestNoASanExceptionAfterEvalOP_piece.py (1499 of 1524) PASS: lldb-api :: lang/c/flexible-array-members/TestCFlexibleArrayMembers.py (1500 of 1524) PASS: lldb-api :: functionalities/data-formatter/summary-string-onfail/Test-rdar-9974002.py (1501 of 1524) PASS: lldb-shell :: SymbolFile/DWARF/x86/static_scope.s (1502 of 1524) PASS: lldb-api :: functionalities/var_path/TestVarPath.py (1503 of 1524) PASS: lldb-shell :: Commands/command-backtrace-parser-1.test (1504 of 1524) UNSUPPORTED: lldb-api :: functionalities/data-formatter/data-formatter-stl/libstdcpp/vbool/TestDataFormatterStdVBool.py (1505 of 1524) PASS: lldb-api :: functionalities/data-formatter/data-formatter-synthtype/TestDataFormatterSynthType.py (1506 of 1524) PASS: lldb-shell :: ObjectFile/PECOFF/dwarf-gnu-debuglink.yaml (1507 of 1524) PASS: lldb-shell :: Settings/TestLineMarkerColor.test (1508 of 1524) PASS: lldb-shell :: SymbolFile/Breakpad/unwind-via-raSearch.test (1509 of 1524) PASS: lldb-api :: functionalities/data-formatter/type_summary_list_script/TestTypeSummaryListScript.py (1510 of 1524) PASS: lldb-api :: functionalities/thread/exit_during_break/TestExitDuringBreak.py (1511 of 1524) PASS: lldb-api :: functionalities/postmortem/netbsd-core/TestNetBSDCore.py (1512 of 1524) UNSUPPORTED: lldb-shell :: ScriptInterpreter/Lua/watchpoint_callback.test (1513 of 1524) PASS: lldb-api :: functionalities/param_entry_vals/basic_entry_values/TestBasicEntryValues.py (1514 of 1524) UNSUPPORTED: lldb-shell :: Subprocess/clone-follow-child-softbp.test (1515 of 1524) PASS: lldb-api :: functionalities/data-formatter/ptr_ref_typedef/TestPtrRef2Typedef.py (1516 of 1524) PASS: lldb-api :: lang/objc/self/TestObjCSelf.py (1517 of 1524) PASS: lldb-api :: functionalities/signal/handle-abrt/TestHandleAbort.py (1518 of 1524) PASS: lldb-shell :: SymbolFile/DWARF/x86/find-method.cpp (1519 of 1524) PASS: lldb-api :: functionalities/thread/concurrent_events/TestConcurrentSignalBreak.py (1520 of 1524) PASS: lldb-api :: lang/cpp/nsimport/TestCppNsImport.py (1521 of 1524) PASS: lldb-api :: lang/c/step_over_no_deadlock/TestStepOverDoesntBlock.py (1522 of 1524) PASS: lldb-api :: functionalities/breakpoint/breakpoint_by_line_and_column/TestBreakpointByLineAndColumn.py (1523 of 1524) PASS: lldb-api :: macosx/stack-corefile/TestStackCorefile.py (1524 of 1524)

Hide Details

1 warning(s) in tests Slowest Tests: -------------------------------------------------------------------------- 293.78s: lldb-api :: python_api/target/TestTargetAPI.py 273.63s: lldb-api :: tools/lldb-server/TestLldbGdbServer.py 206.87s: lldb-api :: tools/lldb-server/TestGdbRemoteThreadsInStopReply.py 158.62s: lldb-api :: functionalities/breakpoint/address_breakpoints/TestBadAddressBreakpoints.py 154.31s: lldb-api :: macosx/stack-corefile/TestStackCorefile.py 150.65s: lldb-api :: functionalities/scripted_process/TestStackCoreScriptedProcess.py 145.69s: lldb-api :: api/multithreaded/TestMultithreaded.py 115.53s: lldb-api :: macosx/skinny-corefile/TestSkinnyCorefile.py 112.42s: lldb-api :: commands/expression/import-std-module/queue/TestQueueFromStdModule.py 103.05s: lldb-api :: functionalities/set-data/TestSetData.py 101.20s: lldb-api :: functionalities/data-formatter/data-formatter-stl/generic/unordered/TestDataFormatterGenericUnordered.py 97.94s: lldb-api :: commands/frame/diagnose/array/TestArray.py 96.51s: lldb-api :: functionalities/data-formatter/stringprinter/TestStringPrinter.py 94.54s: lldb-api :: commands/expression/import-std-module/vector/TestVectorFromStdModule.py 94.50s: lldb-api :: macosx/macCatalyst/TestMacCatalyst.py 93.91s: lldb-api :: commands/expression/persist_objc_pointeetype/TestPersistObjCPointeeType.py 93.35s: lldb-api :: functionalities/gdb_remote_client/TestWasm.py 89.04s: lldb-api :: types/TestLongTypesExpr.py 86.66s: lldb-api :: commands/expression/import-std-module/deque-basic/TestDequeFromStdModule.py 83.76s: lldb-api :: lang/objc/exceptions/TestObjCExceptions.py

Hide Details

Tests Times: -------------------------------------------------------------------------- [ Range ] :: [ Percentage ] :: [ Count ] -------------------------------------------------------------------------- [280s,300s) :: [ ] :: [ 1/1524] [260s,280s) :: [ ] :: [ 1/1524] [240s,260s) :: [ ] :: [ 0/1524] [220s,240s) :: [ ] :: [ 0/1524] [200s,220s) :: [ ] :: [ 1/1524] [180s,200s) :: [ ] :: [ 0/1524] [160s,180s) :: [ ] :: [ 1/1524] [140s,160s) :: [ ] :: [ 3/1524] [120s,140s) :: [ ] :: [ 0/1524] [100s,120s) :: [ ] :: [ 5/1524] [ 80s,100s) :: [ ] :: [ 8/1524] [ 60s, 80s) :: [ ] :: [ 9/1524] [ 40s, 60s) :: [ ] :: [ 28/1524] [ 20s, 40s) :: [** ] :: [ 83/1524] [ 0s, 20s) :: [************************************ ] :: [1384/1524] -------------------------------------------------------------------------- ******************** Failed Tests (10): lldb-api :: api/check_public_api_headers/TestPublicAPIHeaders.py lldb-api :: commands/expression/import-std-module/deque-basic/TestDequeFromStdModule.py lldb-api :: commands/expression/persist_objc_pointeetype/TestPersistObjCPointeeType.py lldb-api :: commands/frame/diagnose/array/TestArray.py lldb-api :: functionalities/data-formatter/data-formatter-stl/generic/unordered/TestDataFormatterGenericUnordered.py lldb-api :: functionalities/data-formatter/stringprinter/TestStringPrinter.py lldb-api :: functionalities/set-data/TestSetData.py lldb-api :: functionalities/thread/concurrent_events/TestConcurrentCrashWithWatchpoint.py lldb-api :: macosx/macCatalyst/TestMacCatalyst.py lldb-api :: python_api/target/TestTargetAPI.py

Hide Details

Hide Details

Testing Time: 3519.22s Unsupported : 254 Passed : 1241 Expectedly Failed: 19 Failed : 10 FAILED: tools/lldb/test/CMakeFiles/check-lldb /Users/buildslave/jenkins/workspace/lldb-cmake-sanitized/lldb-build/tools/lldb/test/CMakeFiles/check-lldb cd /Users/buildslave/jenkins/workspace/lldb-cmake-sanitized/lldb-build/tools/lldb/test && /Applications/Xcode.app/Contents/Developer/Library/Frameworks/Python3.framework/Versions/3.8/bin/python3.8 /Users/buildslave/jenkins/workspace/lldb-cmake-sanitized/lldb-build/./bin/llvm-lit -v --time-tests --shuffle --xunit-xml-output=/Users/buildslave/jenkins/workspace/lldb-cmake-sanitized/test/results.xml -v -j 4 --timeout 1200 /Users/buildslave/jenkins/workspace/lldb-cmake-sanitized/lldb-build/tools/lldb/test ninja: build stopped: subcommand failed. Command failed: Command '['/usr/bin/env', 'TERM=vt100', '/usr/local/bin/ninja', '-v', 'check-lldb']' returned non-zero exit status 1. Command: ['/usr/bin/env', 'TERM=vt100', '/usr/local/bin/ninja', '-v', 'check-lldb'] [Pipeline] } [Pipeline] // timeout [Pipeline] } [Pipeline] // stage [Pipeline] stage [Pipeline] { (Declarative: Post Actions) [Pipeline] scanForIssues [Clang] Sleeping for 5 seconds due to JENKINS-32191... [Clang] Parsing console log (workspace: '/Users/buildslave/jenkins/workspace/lldb-cmake-sanitized') [Clang] -> found 2 issues (skipped 2 duplicates) [Clang] Parsing console log (workspace: '/Users/buildslave/jenkins/workspace/lldb-cmake-sanitized') [Clang] [-ERROR-] Can't create fingerprints for some files: [Clang] [-ERROR-] - '/Users/buildslave/jenkins/workspace/lldb-cmake-sanitized/lldb-build/llvm-lit: /Users/buildslave/jenkins/workspace/lldb-cmake-sanitized/llvm-project/llvm/utils/lit/lit/discovery.py', IO exception has been thrown: java.nio.file.NoSuchFileException: /Users/buildslave/jenkins/workspace/lldb-cmake-sanitized/lldb-build/llvm-lit: /Users/buildslave/jenkins/workspace/lldb-cmake-sanitized/llvm-project/llvm/utils/lit/lit/discovery.py [Clang] -> found 2 issues (skipped 2 duplicates) [Clang] Successfully parsed console log [Clang] -> found 2 issues (skipped 2 duplicates) [Clang] Parsing console log (workspace: '/Users/buildslave/jenkins/workspace/lldb-cmake-sanitized') [Clang] Post processing issues on 'green-dragon-23' with source code encoding 'UTF-8' [Clang] Creating SCM blamer to obtain author and commit information for affected files [Clang] -> No blamer installed yet. You need to install the 'git-forensics' plugin to enable blaming for Git. [Clang] Resolving file names for all issues in source directory '/Users/buildslave/jenkins/workspace/lldb-cmake-sanitized' [Clang] -> resolved paths in source directory (1 found, 1 not found) [Clang] Resolving module names from module definitions (build.xml, pom.xml, or Manifest.mf files) [Clang] -> resolved module names for 2 issues [Clang] Resolving package names (or namespaces) by parsing the affected files [Clang] -> resolved package names of 2 affected files [Clang] No filter has been set, publishing all 2 issues [Clang] Creating fingerprints for all affected code blocks to track issues over different builds [Clang] -> created fingerprints for 1 issues (skipped 1 issues) [Clang] Copying affected files to Jenkins' build folder '/Users/Shared/Jenkins/Home/jobs/lldb-cmake-sanitized/builds/2725/files-with-issues' [Clang] -> 1 copied, 0 not in workspace, 1 not-found, 0 with I/O error [Clang] Repository miner is not configured, skipping repository mining [Pipeline] junit Recording test results [Checks API] No suitable checks publisher found. [Pipeline] } [Pipeline] // stage [Pipeline] } [Pipeline] // withEnv [Pipeline] } [Pipeline] // node [Pipeline] End of Pipeline ERROR: script returned exit code 1 Finished: FAILURE