Console Output

Skipping 6,875 KB.. Full Log
warning: unknown warning option '-Wno-suggest-override'; did you mean '-Wno-shift-overflow'? [-Wunknown-warning-option]
1 warning generated.

Hide Details

Ld /Users/buildslave/jenkins/workspace/lldb-cmake-standalone/lldb-xcode-build/unittests/Utility/Release/UtilityTests normal x86_64 cd /Users/buildslave/jenkins/workspace/lldb-cmake-standalone/llvm-project/lldb /Applications/Xcode.app/Contents/Developer/Toolchains/XcodeDefault.xctoolchain/usr/bin/clang++ -target x86_64-apple-macos10.12 -isysroot /Applications/Xcode.app/Contents/Developer/Platforms/MacOSX.platform/Developer/SDKs/MacOSX10.15.sdk -L/Users/buildslave/jenkins/workspace/lldb-cmake-standalone/lldb-xcode-build/unittests/Utility/Release -F/Users/buildslave/jenkins/workspace/lldb-cmake-standalone/lldb-xcode-build/unittests/Utility/Release -filelist /Users/buildslave/jenkins/workspace/lldb-cmake-standalone/lldb-xcode-build/unittests/Utility/lldb.build/Release/UtilityTests.build/Objects-normal/x86_64/UtilityTests.LinkFileList -Wl,-dead_strip -Wl,-search_paths_first -Wl,-headerpad_max_install_names /Users/buildslave/jenkins/workspace/lldb-cmake-standalone/clang-build/lib/libLLVMSupport.a /Users/buildslave/jenkins/workspace/lldb-cmake-standalone/clang-build/lib/libLLVMSupport.a /Users/buildslave/jenkins/workspace/lldb-cmake-standalone/clang-build/lib/libgtest_main.a /Users/buildslave/jenkins/workspace/lldb-cmake-standalone/clang-build/lib/libgtest.a /Users/buildslave/jenkins/workspace/lldb-cmake-standalone/lldb-xcode-build/Release/lib/liblldbUtility.a /Users/buildslave/jenkins/workspace/lldb-cmake-standalone/lldb-xcode-build/Release/lib/liblldbUtilityHelpers.a /Users/buildslave/jenkins/workspace/lldb-cmake-standalone/clang-build/lib/libLLVMTestingSupport.a /Users/buildslave/jenkins/workspace/lldb-cmake-standalone/lldb-xcode-build/Release/lib/liblldbUtility.a -framework Foundation -framework CoreFoundation -framework CoreServices -framework Security /Users/buildslave/jenkins/workspace/lldb-cmake-standalone/clang-build/lib/libLLVMObjectYAML.a /Users/buildslave/jenkins/workspace/lldb-cmake-standalone/clang-build/lib/libLLVMObject.a /Users/buildslave/jenkins/workspace/lldb-cmake-standalone/clang-build/lib/libLLVMBitReader.a /Users/buildslave/jenkins/workspace/lldb-cmake-standalone/clang-build/lib/libLLVMCore.a /Users/buildslave/jenkins/workspace/lldb-cmake-standalone/clang-build/lib/libLLVMRemarks.a /Users/buildslave/jenkins/workspace/lldb-cmake-standalone/clang-build/lib/libLLVMBitstreamReader.a /Users/buildslave/jenkins/workspace/lldb-cmake-standalone/clang-build/lib/libLLVMMCParser.a /Users/buildslave/jenkins/workspace/lldb-cmake-standalone/clang-build/lib/libLLVMTextAPI.a /Users/buildslave/jenkins/workspace/lldb-cmake-standalone/clang-build/lib/libLLVMMC.a /Users/buildslave/jenkins/workspace/lldb-cmake-standalone/clang-build/lib/libLLVMBinaryFormat.a /Users/buildslave/jenkins/workspace/lldb-cmake-standalone/clang-build/lib/libLLVMDebugInfoCodeView.a /Users/buildslave/jenkins/workspace/lldb-cmake-standalone/clang-build/lib/libgtest.a /Users/buildslave/jenkins/workspace/lldb-cmake-standalone/clang-build/lib/libLLVMSupport.a -lm /usr/lib/libz.dylib /usr/lib/libcurses.dylib /Users/buildslave/jenkins/workspace/lldb-cmake-standalone/clang-build/lib/libLLVMDemangle.a -lpthread -Xlinker -dependency_info -Xlinker /Users/buildslave/jenkins/workspace/lldb-cmake-standalone/lldb-xcode-build/unittests/Utility/lldb.build/Release/UtilityTests.build/Objects-normal/x86_64/UtilityTests_dependency_info.dat -o /Users/buildslave/jenkins/workspace/lldb-cmake-standalone/lldb-xcode-build/unittests/Utility/Release/UtilityTests

Hide Details

PhaseScriptExecution CMake\ PostBuild\ Rules /Users/buildslave/jenkins/workspace/lldb-cmake-standalone/lldb-xcode-build/unittests/Utility/lldb.build/Release/UtilityTests.build/Script-E0B7C8A434CB4EF68873659F.sh cd /Users/buildslave/jenkins/workspace/lldb-cmake-standalone/llvm-project/lldb /bin/sh -c /Users/buildslave/jenkins/workspace/lldb-cmake-standalone/lldb-xcode-build/unittests/Utility/lldb.build/Release/UtilityTests.build/Script-E0B7C8A434CB4EF68873659F.sh /usr/local/Cellar/cmake/3.17.2/bin/cmake -E make_directory /Users/buildslave/jenkins/workspace/lldb-cmake-standalone/lldb-xcode-build/unittests/Utility/Release/Inputs echo "Copying StructuredData-basic.json to binary directory." Copying StructuredData-basic.json to binary directory. /usr/local/Cellar/cmake/3.17.2/bin/cmake -E copy /Users/buildslave/jenkins/workspace/lldb-cmake-standalone/llvm-project/lldb/unittests/Utility/Inputs/StructuredData-basic.json /Users/buildslave/jenkins/workspace/lldb-cmake-standalone/lldb-xcode-build/unittests/Utility/Release/Inputs

Hide Details

CodeSign /Users/buildslave/jenkins/workspace/lldb-cmake-standalone/lldb-xcode-build/unittests/Utility/Release/UtilityTests cd /Users/buildslave/jenkins/workspace/lldb-cmake-standalone/llvm-project/lldb

Hide Details

Signing Identity: "-"

Hide Details

/usr/bin/codesign --force --sign - --entitlements /Users/buildslave/jenkins/workspace/lldb-cmake-standalone/lldb-xcode-build/unittests/Utility/lldb.build/Release/UtilityTests.build/UtilityTests.xcent --timestamp=none /Users/buildslave/jenkins/workspace/lldb-cmake-standalone/lldb-xcode-build/unittests/Utility/Release/UtilityTests

Hide Details

=== BUILD TARGET ThreadTests OF PROJECT lldb WITH CONFIGURATION Release ===

Hide Details

Check dependencies

Hide Details

Write auxiliary files write-file /Users/buildslave/jenkins/workspace/lldb-cmake-standalone/lldb-xcode-build/unittests/Thread/lldb.build/Release/ThreadTests.build/Script-A2FA2B5B0E6B43AAB29D1E8B.sh chmod 0755 /Users/buildslave/jenkins/workspace/lldb-cmake-standalone/lldb-xcode-build/unittests/Thread/lldb.build/Release/ThreadTests.build/Script-A2FA2B5B0E6B43AAB29D1E8B.sh

Hide Details

CompileC /Users/buildslave/jenkins/workspace/lldb-cmake-standalone/lldb-xcode-build/unittests/Thread/lldb.build/Release/ThreadTests.build/Objects-normal/x86_64/ThreadTest.o unittests/Thread/ThreadTest.cpp normal x86_64 c++ com.apple.compilers.llvm.clang.1_0.compiler cd /Users/buildslave/jenkins/workspace/lldb-cmake-standalone/llvm-project/lldb /Applications/Xcode.app/Contents/Developer/Toolchains/XcodeDefault.xctoolchain/usr/bin/clang -x c++ -target x86_64-apple-macos10.12 -fmessage-length=0 -fdiagnostics-show-note-include-stack -fmacro-backtrace-limit=0 -Wno-trigraphs -fpascal-strings -O3 -Wno-missing-field-initializers -Wno-missing-prototypes -Wnon-virtual-dtor -Woverloaded-virtual -Wno-exit-time-destructors -Wmissing-braces -Wparentheses -Wswitch -Wunused-function -Wno-unused-label -Wno-unused-parameter -Wunused-variable -Wunused-value -Wempty-body -Wuninitialized -Wno-unknown-pragmas -Wno-shadow -Wno-four-char-constants -Wno-conversion -Wconstant-conversion -Wint-conversion -Wbool-conversion -Wenum-conversion -Wno-float-conversion -Wno-non-literal-null-conversion -Wno-objc-literal-conversion -Wsign-compare -Wno-shorten-64-to-32 -Wnewline-eof -Wno-c++11-extensions -DCMAKE_INTDIR=\"Release\" -DGTEST_HAS_RTTI=0 -D_DEBUG -D__STDC_CONSTANT_MACROS -D__STDC_FORMAT_MACROS -D__STDC_LIMIT_MACROS -DHAVE_ROUND -isysroot /Applications/Xcode.app/Contents/Developer/Platforms/MacOSX.platform/Developer/SDKs/MacOSX10.15.sdk -fasm-blocks -fstrict-aliasing -Wdeprecated-declarations -Winvalid-offsetof -Wno-sign-conversion -Wno-infinite-recursion -Wno-move -Wno-comma -Wno-block-capture-autoreleasing -Wno-strict-prototypes -Wno-range-loop-analysis -Wno-semicolon-before-method-body -I/Users/buildslave/jenkins/workspace/lldb-cmake-standalone/lldb-xcode-build/unittests/Thread/Release/include -I/Users/buildslave/jenkins/workspace/lldb-cmake-standalone/lldb-xcode-build/unittests/Thread -I/Users/buildslave/jenkins/workspace/lldb-cmake-standalone/llvm-project/lldb/unittests/Thread -I/Users/buildslave/jenkins/workspace/lldb-cmake-standalone/llvm-project/lldb/include -I/Users/buildslave/jenkins/workspace/lldb-cmake-standalone/lldb-xcode-build/include -I/Users/buildslave/jenkins/workspace/lldb-cmake-standalone/llvm-project/llvm/include -I/Users/buildslave/jenkins/workspace/lldb-cmake-standalone/clang-build/include -I/Users/buildslave/jenkins/workspace/lldb-cmake-standalone/llvm-project/clang/include -I/Users/buildslave/jenkins/workspace/lldb-cmake-standalone/clang-build/tools/clang/include -I/usr/local/Cellar/python/3.7.0/Frameworks/Python.framework/Versions/3.7/include/python3.7m -I/Users/buildslave/jenkins/workspace/lldb-cmake-standalone/llvm-project/lldb/tools/clang/include -I/Users/buildslave/jenkins/workspace/lldb-cmake-standalone/lldb-xcode-build/../clang/include -I/usr/local/include -I/Applications/Xcode.app/Contents/Developer/Platforms/MacOSX.platform/Developer/SDKs/MacOSX10.15.sdk/usr/include/libxml2 -I/Users/buildslave/jenkins/workspace/lldb-cmake-standalone/llvm-project/lldb/source -I/Users/buildslave/jenkins/workspace/lldb-cmake-standalone/llvm-project/lldb/unittests -isystem /Users/buildslave/jenkins/workspace/lldb-cmake-standalone/llvm-project/llvm/utils/unittest/googletest/include -isystem /Users/buildslave/jenkins/workspace/lldb-cmake-standalone/llvm-project/llvm/utils/unittest/googlemock/include -I/Users/buildslave/jenkins/workspace/lldb-cmake-standalone/lldb-xcode-build/unittests/Thread/lldb.build/Release/ThreadTests.build/DerivedSources-normal/x86_64 -I/Users/buildslave/jenkins/workspace/lldb-cmake-standalone/lldb-xcode-build/unittests/Thread/lldb.build/Release/ThreadTests.build/DerivedSources/x86_64 -I/Users/buildslave/jenkins/workspace/lldb-cmake-standalone/lldb-xcode-build/unittests/Thread/lldb.build/Release/ThreadTests.build/DerivedSources -F/Users/buildslave/jenkins/workspace/lldb-cmake-standalone/lldb-xcode-build/unittests/Thread/Release -fvisibility-inlines-hidden -Werror=date-time -Werror=unguarded-availability-new -Wall -Wextra -Wno-unused-parameter -Wwrite-strings -Wcast-qual -Wmissing-field-initializers -Wimplicit-fallthrough -Wcovered-switch-default -Wno-noexcept-type -Wnon-virtual-dtor -Wdelete-non-virtual-dtor -Wstring-conversion -Wno-deprecated-declarations -Wno-unknown-pragmas -Wno-strict-aliasing -Wno-deprecated-register -Wno-vla-extension -DNDEBUG -include /Users/buildslave/jenkins/workspace/lldb-cmake-standalone/llvm-project/lldb/unittests/gtest_common.h -fno-exceptions -fno-rtti -UNDEBUG -Wno-suggest-override -std=c++14 -MMD -MT dependencies -MF /Users/buildslave/jenkins/workspace/lldb-cmake-standalone/lldb-xcode-build/unittests/Thread/lldb.build/Release/ThreadTests.build/Objects-normal/x86_64/ThreadTest.d --serialize-diagnostics /Users/buildslave/jenkins/workspace/lldb-cmake-standalone/lldb-xcode-build/unittests/Thread/lldb.build/Release/ThreadTests.build/Objects-normal/x86_64/ThreadTest.dia -c /Users/buildslave/jenkins/workspace/lldb-cmake-standalone/llvm-project/lldb/unittests/Thread/ThreadTest.cpp -o /Users/buildslave/jenkins/workspace/lldb-cmake-standalone/lldb-xcode-build/unittests/Thread/lldb.build/Release/ThreadTests.build/Objects-normal/x86_64/ThreadTest.o warning: unknown warning option '-Wno-suggest-override'; did you mean '-Wno-shift-overflow'? [-Wunknown-warning-option] 1 warning generated.

Hide Details

Ld /Users/buildslave/jenkins/workspace/lldb-cmake-standalone/lldb-xcode-build/unittests/Thread/Release/ThreadTests normal x86_64 cd /Users/buildslave/jenkins/workspace/lldb-cmake-standalone/llvm-project/lldb /Applications/Xcode.app/Contents/Developer/Toolchains/XcodeDefault.xctoolchain/usr/bin/clang++ -target x86_64-apple-macos10.12 -isysroot /Applications/Xcode.app/Contents/Developer/Platforms/MacOSX.platform/Developer/SDKs/MacOSX10.15.sdk -L/Users/buildslave/jenkins/workspace/lldb-cmake-standalone/lldb-xcode-build/unittests/Thread/Release -F/Users/buildslave/jenkins/workspace/lldb-cmake-standalone/lldb-xcode-build/unittests/Thread/Release -filelist /Users/buildslave/jenkins/workspace/lldb-cmake-standalone/lldb-xcode-build/unittests/Thread/lldb.build/Release/ThreadTests.build/Objects-normal/x86_64/ThreadTests.LinkFileList -Wl,-dead_strip -Wl,-search_paths_first -Wl,-headerpad_max_install_names /Users/buildslave/jenkins/workspace/lldb-cmake-standalone/clang-build/lib/libLLVMSupport.a /Users/buildslave/jenkins/workspace/lldb-cmake-standalone/clang-build/lib/libgtest_main.a /Users/buildslave/jenkins/workspace/lldb-cmake-standalone/clang-build/lib/libgtest.a /Users/buildslave/jenkins/workspace/lldb-cmake-standalone/lldb-xcode-build/Release/lib/liblldbCore.a /Users/buildslave/jenkins/workspace/lldb-cmake-standalone/lldb-xcode-build/Release/lib/liblldbHost.a /Users/buildslave/jenkins/workspace/lldb-cmake-standalone/lldb-xcode-build/Release/lib/liblldbTarget.a /Users/buildslave/jenkins/workspace/lldb-cmake-standalone/lldb-xcode-build/Release/lib/liblldbSymbol.a /Users/buildslave/jenkins/workspace/lldb-cmake-standalone/lldb-xcode-build/Release/lib/liblldbUtility.a /Users/buildslave/jenkins/workspace/lldb-cmake-standalone/lldb-xcode-build/Release/lib/liblldbUtilityHelpers.a /Users/buildslave/jenkins/workspace/lldb-cmake-standalone/lldb-xcode-build/Release/lib/liblldbInterpreter.a /Users/buildslave/jenkins/workspace/lldb-cmake-standalone/lldb-xcode-build/Release/lib/liblldbBreakpoint.a /Users/buildslave/jenkins/workspace/lldb-cmake-standalone/lldb-xcode-build/Release/lib/liblldbPluginPlatformLinux.a /Users/buildslave/jenkins/workspace/lldb-cmake-standalone/clang-build/lib/libgtest.a -lpthread /Users/buildslave/jenkins/workspace/lldb-cmake-standalone/clang-build/lib/libLLVMObjectYAML.a /Users/buildslave/jenkins/workspace/lldb-cmake-standalone/lldb-xcode-build/Release/lib/liblldbPluginPlatformPOSIX.a /Users/buildslave/jenkins/workspace/lldb-cmake-standalone/lldb-xcode-build/Release/lib/liblldbCore.a /Users/buildslave/jenkins/workspace/lldb-cmake-standalone/lldb-xcode-build/Release/lib/liblldbTarget.a /Users/buildslave/jenkins/workspace/lldb-cmake-standalone/lldb-xcode-build/Release/lib/liblldbSymbol.a /Users/buildslave/jenkins/workspace/lldb-cmake-standalone/lldb-xcode-build/Release/lib/liblldbInterpreter.a /Users/buildslave/jenkins/workspace/lldb-cmake-standalone/lldb-xcode-build/Release/lib/liblldbBreakpoint.a /Users/buildslave/jenkins/workspace/lldb-cmake-standalone/lldb-xcode-build/Release/lib/liblldbDataFormatters.a /Users/buildslave/jenkins/workspace/lldb-cmake-standalone/lldb-xcode-build/Release/lib/liblldbExpression.a /Users/buildslave/jenkins/workspace/lldb-cmake-standalone/lldb-xcode-build/Release/lib/liblldbPluginCPlusPlusLanguage.a /Users/buildslave/jenkins/workspace/lldb-cmake-standalone/lldb-xcode-build/Release/lib/liblldbPluginObjCLanguage.a /Users/buildslave/jenkins/workspace/lldb-cmake-standalone/lldb-xcode-build/Release/lib/liblldbPluginProcessUtility.a /Users/buildslave/jenkins/workspace/lldb-cmake-standalone/lldb-xcode-build/Release/lib/liblldbCommands.a /Users/buildslave/jenkins/workspace/lldb-cmake-standalone/lldb-xcode-build/Release/lib/liblldbPluginObjectFileJIT.a /Users/buildslave/jenkins/workspace/lldb-cmake-standalone/lldb-xcode-build/Release/lib/liblldbPluginClangCommon.a /Users/buildslave/jenkins/workspace/lldb-cmake-standalone/lldb-xcode-build/Release/lib/liblldbPluginCPPRuntime.a /Users/buildslave/jenkins/workspace/lldb-cmake-standalone/lldb-xcode-build/Release/lib/liblldbPluginTypeSystemClang.a /Users/buildslave/jenkins/workspace/lldb-cmake-standalone/lldb-xcode-build/Release/lib/liblldbPluginAppleObjCRuntime.a /Users/buildslave/jenkins/workspace/lldb-cmake-standalone/lldb-xcode-build/Release/lib/liblldbPluginExpressionParserClang.a /Users/buildslave/jenkins/workspace/lldb-cmake-standalone/lldb-xcode-build/Release/lib/liblldbPluginSymbolFileDWARF.a /Users/buildslave/jenkins/workspace/lldb-cmake-standalone/lldb-xcode-build/Release/lib/liblldbPluginSymbolFilePDB.a /Users/buildslave/jenkins/workspace/lldb-cmake-standalone/lldb-xcode-build/Release/lib/liblldbPluginObjCRuntime.a /Users/buildslave/jenkins/workspace/lldb-cmake-standalone/lldb-xcode-build/Release/lib/liblldbPluginRenderScriptRuntime.a /Users/buildslave/jenkins/workspace/lldb-cmake-standalone/lldb-xcode-build/Release/lib/liblldbPluginSymbolFileNativePDB.a /Users/buildslave/jenkins/workspace/lldb-cmake-standalone/lldb-xcode-build/Release/lib/liblldbPluginObjectFilePDB.a /Users/buildslave/jenkins/workspace/lldb-cmake-standalone/lldb-xcode-build/Release/lib/liblldbCore.a /Users/buildslave/jenkins/workspace/lldb-cmake-standalone/lldb-xcode-build/Release/lib/liblldbTarget.a /Users/buildslave/jenkins/workspace/lldb-cmake-standalone/lldb-xcode-build/Release/lib/liblldbSymbol.a /Users/buildslave/jenkins/workspace/lldb-cmake-standalone/lldb-xcode-build/Release/lib/liblldbInterpreter.a /Users/buildslave/jenkins/workspace/lldb-cmake-standalone/lldb-xcode-build/Release/lib/liblldbBreakpoint.a /Users/buildslave/jenkins/workspace/lldb-cmake-standalone/lldb-xcode-build/Release/lib/liblldbDataFormatters.a /Users/buildslave/jenkins/workspace/lldb-cmake-standalone/lldb-xcode-build/Release/lib/liblldbExpression.a /Users/buildslave/jenkins/workspace/lldb-cmake-standalone/lldb-xcode-build/Release/lib/liblldbPluginCPlusPlusLanguage.a /Users/buildslave/jenkins/workspace/lldb-cmake-standalone/lldb-xcode-build/Release/lib/liblldbPluginObjCLanguage.a /Users/buildslave/jenkins/workspace/lldb-cmake-standalone/lldb-xcode-build/Release/lib/liblldbPluginProcessUtility.a /Users/buildslave/jenkins/workspace/lldb-cmake-standalone/lldb-xcode-build/Release/lib/liblldbCommands.a /Users/buildslave/jenkins/workspace/lldb-cmake-standalone/lldb-xcode-build/Release/lib/liblldbPluginObjectFileJIT.a /Users/buildslave/jenkins/workspace/lldb-cmake-standalone/lldb-xcode-build/Release/lib/liblldbPluginClangCommon.a /Users/buildslave/jenkins/workspace/lldb-cmake-standalone/lldb-xcode-build/Release/lib/liblldbPluginCPPRuntime.a /Users/buildslave/jenkins/workspace/lldb-cmake-standalone/lldb-xcode-build/Release/lib/liblldbPluginTypeSystemClang.a /Users/buildslave/jenkins/workspace/lldb-cmake-standalone/lldb-xcode-build/Release/lib/liblldbPluginAppleObjCRuntime.a /Users/buildslave/jenkins/workspace/lldb-cmake-standalone/lldb-xcode-build/Release/lib/liblldbPluginExpressionParserClang.a /Users/buildslave/jenkins/workspace/lldb-cmake-standalone/lldb-xcode-build/Release/lib/liblldbPluginSymbolFileDWARF.a /Users/buildslave/jenkins/workspace/lldb-cmake-standalone/lldb-xcode-build/Release/lib/liblldbPluginSymbolFilePDB.a /Users/buildslave/jenkins/workspace/lldb-cmake-standalone/lldb-xcode-build/Release/lib/liblldbPluginObjCRuntime.a /Users/buildslave/jenkins/workspace/lldb-cmake-standalone/lldb-xcode-build/Release/lib/liblldbPluginRenderScriptRuntime.a /Users/buildslave/jenkins/workspace/lldb-cmake-standalone/lldb-xcode-build/Release/lib/liblldbPluginSymbolFileNativePDB.a /Users/buildslave/jenkins/workspace/lldb-cmake-standalone/lldb-xcode-build/Release/lib/liblldbPluginObjectFilePDB.a /Users/buildslave/jenkins/workspace/lldb-cmake-standalone/lldb-xcode-build/Release/lib/liblldbCore.a /Users/buildslave/jenkins/workspace/lldb-cmake-standalone/lldb-xcode-build/Release/lib/liblldbTarget.a /Users/buildslave/jenkins/workspace/lldb-cmake-standalone/lldb-xcode-build/Release/lib/liblldbSymbol.a /Users/buildslave/jenkins/workspace/lldb-cmake-standalone/lldb-xcode-build/Release/lib/liblldbInterpreter.a /Users/buildslave/jenkins/workspace/lldb-cmake-standalone/lldb-xcode-build/Release/lib/liblldbBreakpoint.a /Users/buildslave/jenkins/workspace/lldb-cmake-standalone/lldb-xcode-build/Release/lib/liblldbDataFormatters.a /Users/buildslave/jenkins/workspace/lldb-cmake-standalone/lldb-xcode-build/Release/lib/liblldbExpression.a /Users/buildslave/jenkins/workspace/lldb-cmake-standalone/lldb-xcode-build/Release/lib/liblldbPluginCPlusPlusLanguage.a /Users/buildslave/jenkins/workspace/lldb-cmake-standalone/lldb-xcode-build/Release/lib/liblldbPluginObjCLanguage.a /Users/buildslave/jenkins/workspace/lldb-cmake-standalone/lldb-xcode-build/Release/lib/liblldbPluginProcessUtility.a /Users/buildslave/jenkins/workspace/lldb-cmake-standalone/lldb-xcode-build/Release/lib/liblldbCommands.a /Users/buildslave/jenkins/workspace/lldb-cmake-standalone/lldb-xcode-build/Release/lib/liblldbPluginObjectFileJIT.a /Users/buildslave/jenkins/workspace/lldb-cmake-standalone/lldb-xcode-build/Release/lib/liblldbPluginClangCommon.a /Users/buildslave/jenkins/workspace/lldb-cmake-standalone/lldb-xcode-build/Release/lib/liblldbPluginCPPRuntime.a /Users/buildslave/jenkins/workspace/lldb-cmake-standalone/lldb-xcode-build/Release/lib/liblldbPluginTypeSystemClang.a /Users/buildslave/jenkins/workspace/lldb-cmake-standalone/lldb-xcode-build/Release/lib/liblldbPluginAppleObjCRuntime.a /Users/buildslave/jenkins/workspace/lldb-cmake-standalone/lldb-xcode-build/Release/lib/liblldbPluginExpressionParserClang.a /Users/buildslave/jenkins/workspace/lldb-cmake-standalone/lldb-xcode-build/Release/lib/liblldbPluginSymbolFileDWARF.a /Users/buildslave/jenkins/workspace/lldb-cmake-standalone/lldb-xcode-build/Release/lib/liblldbPluginSymbolFilePDB.a /Users/buildslave/jenkins/workspace/lldb-cmake-standalone/lldb-xcode-build/Release/lib/liblldbPluginObjCRuntime.a /Users/buildslave/jenkins/workspace/lldb-cmake-standalone/lldb-xcode-build/Release/lib/liblldbPluginRenderScriptRuntime.a /Users/buildslave/jenkins/workspace/lldb-cmake-standalone/lldb-xcode-build/Release/lib/liblldbPluginSymbolFileNativePDB.a /Users/buildslave/jenkins/workspace/lldb-cmake-standalone/lldb-xcode-build/Release/lib/liblldbPluginObjectFilePDB.a /Users/buildslave/jenkins/workspace/lldb-cmake-standalone/lldb-xcode-build/Release/lib/liblldbCore.a /Users/buildslave/jenkins/workspace/lldb-cmake-standalone/lldb-xcode-build/Release/lib/liblldbTarget.a /Users/buildslave/jenkins/workspace/lldb-cmake-standalone/lldb-xcode-build/Release/lib/liblldbSymbol.a /Users/buildslave/jenkins/workspace/lldb-cmake-standalone/lldb-xcode-build/Release/lib/liblldbInterpreter.a /Users/buildslave/jenkins/workspace/lldb-cmake-standalone/lldb-xcode-build/Release/lib/liblldbBreakpoint.a /Users/buildslave/jenkins/workspace/lldb-cmake-standalone/lldb-xcode-build/Release/lib/liblldbDataFormatters.a /Users/buildslave/jenkins/workspace/lldb-cmake-standalone/lldb-xcode-build/Release/lib/liblldbExpression.a /Users/buildslave/jenkins/workspace/lldb-cmake-standalone/lldb-xcode-build/Release/lib/liblldbPluginCPlusPlusLanguage.a /Users/buildslave/jenkins/workspace/lldb-cmake-standalone/lldb-xcode-build/Release/lib/liblldbPluginObjCLanguage.a /Users/buildslave/jenkins/workspace/lldb-cmake-standalone/lldb-xcode-build/Release/lib/liblldbPluginProcessUtility.a /Users/buildslave/jenkins/workspace/lldb-cmake-standalone/lldb-xcode-build/Release/lib/liblldbCommands.a /Users/buildslave/jenkins/workspace/lldb-cmake-standalone/lldb-xcode-build/Release/lib/liblldbPluginObjectFileJIT.a /Users/buildslave/jenkins/workspace/lldb-cmake-standalone/lldb-xcode-build/Release/lib/liblldbPluginClangCommon.a /Users/buildslave/jenkins/workspace/lldb-cmake-standalone/lldb-xcode-build/Release/lib/liblldbPluginCPPRuntime.a /Users/buildslave/jenkins/workspace/lldb-cmake-standalone/lldb-xcode-build/Release/lib/liblldbPluginTypeSystemClang.a /Users/buildslave/jenkins/workspace/lldb-cmake-standalone/lldb-xcode-build/Release/lib/liblldbPluginAppleObjCRuntime.a /Users/buildslave/jenkins/workspace/lldb-cmake-standalone/lldb-xcode-build/Release/lib/liblldbPluginExpressionParserClang.a /Users/buildslave/jenkins/workspace/lldb-cmake-standalone/lldb-xcode-build/Release/lib/liblldbPluginSymbolFileDWARF.a /Users/buildslave/jenkins/workspace/lldb-cmake-standalone/lldb-xcode-build/Release/lib/liblldbPluginSymbolFilePDB.a /Users/buildslave/jenkins/workspace/lldb-cmake-standalone/lldb-xcode-build/Release/lib/liblldbPluginObjCRuntime.a /Users/buildslave/jenkins/workspace/lldb-cmake-standalone/lldb-xcode-build/Release/lib/liblldbPluginRenderScriptRuntime.a /Users/buildslave/jenkins/workspace/lldb-cmake-standalone/lldb-xcode-build/Release/lib/liblldbPluginSymbolFileNativePDB.a /Users/buildslave/jenkins/workspace/lldb-cmake-standalone/lldb-xcode-build/Release/lib/liblldbPluginObjectFilePDB.a /Users/buildslave/jenkins/workspace/lldb-cmake-standalone/lldb-xcode-build/Release/lib/liblldbCore.a /Users/buildslave/jenkins/workspace/lldb-cmake-standalone/lldb-xcode-build/Release/lib/liblldbTarget.a /Users/buildslave/jenkins/workspace/lldb-cmake-standalone/lldb-xcode-build/Release/lib/liblldbSymbol.a /Users/buildslave/jenkins/workspace/lldb-cmake-standalone/lldb-xcode-build/Release/lib/liblldbInterpreter.a /Users/buildslave/jenkins/workspace/lldb-cmake-standalone/lldb-xcode-build/Release/lib/liblldbBreakpoint.a /Users/buildslave/jenkins/workspace/lldb-cmake-standalone/lldb-xcode-build/Release/lib/liblldbDataFormatters.a /Users/buildslave/jenkins/workspace/lldb-cmake-standalone/lldb-xcode-build/Release/lib/liblldbExpression.a /Users/buildslave/jenkins/workspace/lldb-cmake-standalone/lldb-xcode-build/Release/lib/liblldbPluginCPlusPlusLanguage.a /Users/buildslave/jenkins/workspace/lldb-cmake-standalone/lldb-xcode-build/Release/lib/liblldbPluginObjCLanguage.a /Users/buildslave/jenkins/workspace/lldb-cmake-standalone/lldb-xcode-build/Release/lib/liblldbPluginProcessUtility.a /Users/buildslave/jenkins/workspace/lldb-cmake-standalone/lldb-xcode-build/Release/lib/liblldbCommands.a /Users/buildslave/jenkins/workspace/lldb-cmake-standalone/lldb-xcode-build/Release/lib/liblldbPluginObjectFileJIT.a /Users/buildslave/jenkins/workspace/lldb-cmake-standalone/lldb-xcode-build/Release/lib/liblldbPluginClangCommon.a /Users/buildslave/jenkins/workspace/lldb-cmake-standalone/lldb-xcode-build/Release/lib/liblldbPluginCPPRuntime.a /Users/buildslave/jenkins/workspace/lldb-cmake-standalone/lldb-xcode-build/Release/lib/liblldbPluginTypeSystemClang.a /Users/buildslave/jenkins/workspace/lldb-cmake-standalone/lldb-xcode-build/Release/lib/liblldbPluginAppleObjCRuntime.a /Users/buildslave/jenkins/workspace/lldb-cmake-standalone/lldb-xcode-build/Release/lib/liblldbPluginExpressionParserClang.a /Users/buildslave/jenkins/workspace/lldb-cmake-standalone/lldb-xcode-build/Release/lib/liblldbPluginSymbolFileDWARF.a /Users/buildslave/jenkins/workspace/lldb-cmake-standalone/lldb-xcode-build/Release/lib/liblldbPluginSymbolFilePDB.a /Users/buildslave/jenkins/workspace/lldb-cmake-standalone/lldb-xcode-build/Release/lib/liblldbPluginObjCRuntime.a /Users/buildslave/jenkins/workspace/lldb-cmake-standalone/lldb-xcode-build/Release/lib/liblldbPluginRenderScriptRuntime.a /Users/buildslave/jenkins/workspace/lldb-cmake-standalone/lldb-xcode-build/Release/lib/liblldbPluginSymbolFileNativePDB.a /Users/buildslave/jenkins/workspace/lldb-cmake-standalone/lldb-xcode-build/Release/lib/liblldbPluginObjectFilePDB.a /usr/lib/libform.dylib /usr/lib/libpanel.dylib /Users/buildslave/jenkins/workspace/lldb-cmake-standalone/lldb-xcode-build/Release/lib/liblldbBase.a /Users/buildslave/jenkins/workspace/lldb-cmake-standalone/clang-build/lib/libLLVMMCJIT.a /Users/buildslave/jenkins/workspace/lldb-cmake-standalone/clang-build/lib/libLLVMExecutionEngine.a /Users/buildslave/jenkins/workspace/lldb-cmake-standalone/clang-build/lib/libLLVMOrcTargetProcess.a /Users/buildslave/jenkins/workspace/lldb-cmake-standalone/clang-build/lib/libLLVMOrcShared.a /Users/buildslave/jenkins/workspace/lldb-cmake-standalone/clang-build/lib/libLLVMRuntimeDyld.a /Users/buildslave/jenkins/workspace/lldb-cmake-standalone/clang-build/lib/libclangCodeGen.a /Users/buildslave/jenkins/workspace/lldb-cmake-standalone/clang-build/lib/libLLVMCoverage.a /Users/buildslave/jenkins/workspace/lldb-cmake-standalone/clang-build/lib/libLLVMLTO.a /Users/buildslave/jenkins/workspace/lldb-cmake-standalone/clang-build/lib/libLLVMExtensions.a /Users/buildslave/jenkins/workspace/lldb-cmake-standalone/clang-build/lib/libLLVMCodeGen.a /Users/buildslave/jenkins/workspace/lldb-cmake-standalone/clang-build/lib/libLLVMPasses.a /Users/buildslave/jenkins/workspace/lldb-cmake-standalone/clang-build/lib/libLLVMCoroutines.a /Users/buildslave/jenkins/workspace/lldb-cmake-standalone/clang-build/lib/libLLVMipo.a /Users/buildslave/jenkins/workspace/lldb-cmake-standalone/clang-build/lib/libLLVMBitWriter.a /Users/buildslave/jenkins/workspace/lldb-cmake-standalone/clang-build/lib/libLLVMLinker.a /Users/buildslave/jenkins/workspace/lldb-cmake-standalone/clang-build/lib/libLLVMVectorize.a /Users/buildslave/jenkins/workspace/lldb-cmake-standalone/clang-build/lib/libLLVMInstrumentation.a /Users/buildslave/jenkins/workspace/lldb-cmake-standalone/clang-build/lib/libLLVMObjCARCOpts.a /Users/buildslave/jenkins/workspace/lldb-cmake-standalone/clang-build/lib/libclangRewriteFrontend.a /Users/buildslave/jenkins/workspace/lldb-cmake-standalone/clang-build/lib/libclangFrontend.a /Users/buildslave/jenkins/workspace/lldb-cmake-standalone/clang-build/lib/libclangDriver.a /Users/buildslave/jenkins/workspace/lldb-cmake-standalone/clang-build/lib/libLLVMOption.a /Users/buildslave/jenkins/workspace/lldb-cmake-standalone/clang-build/lib/libclangParse.a /Users/buildslave/jenkins/workspace/lldb-cmake-standalone/clang-build/lib/libclangRewrite.a /Users/buildslave/jenkins/workspace/lldb-cmake-standalone/clang-build/lib/libclangSerialization.a /Users/buildslave/jenkins/workspace/lldb-cmake-standalone/clang-build/lib/libclangSema.a /Users/buildslave/jenkins/workspace/lldb-cmake-standalone/clang-build/lib/libclangEdit.a /Users/buildslave/jenkins/workspace/lldb-cmake-standalone/clang-build/lib/libclangAnalysis.a /Users/buildslave/jenkins/workspace/lldb-cmake-standalone/clang-build/lib/libclangASTMatchers.a /Users/buildslave/jenkins/workspace/lldb-cmake-standalone/clang-build/lib/libLLVMDebugInfoDWARF.a /Users/buildslave/jenkins/workspace/lldb-cmake-standalone/lldb-xcode-build/Release/lib/liblldbHost.a /usr/lib/libxml2.dylib /usr/lib/libedit.dylib /usr/local/lib/liblzma.dylib /usr/lib/libedit.dylib /usr/local/lib/liblzma.dylib /Users/buildslave/jenkins/workspace/lldb-cmake-standalone/lldb-xcode-build/Release/lib/liblldbHostMacOSXObjCXX.a /Users/buildslave/jenkins/workspace/lldb-cmake-standalone/clang-build/lib/libLLVMTarget.a /Users/buildslave/jenkins/workspace/lldb-cmake-standalone/clang-build/lib/libLLVMIRReader.a /Users/buildslave/jenkins/workspace/lldb-cmake-standalone/clang-build/lib/libLLVMAsmParser.a /Users/buildslave/jenkins/workspace/lldb-cmake-standalone/clang-build/lib/libclangAST.a /Users/buildslave/jenkins/workspace/lldb-cmake-standalone/clang-build/lib/libLLVMFrontendOpenMP.a /Users/buildslave/jenkins/workspace/lldb-cmake-standalone/clang-build/lib/libLLVMScalarOpts.a /Users/buildslave/jenkins/workspace/lldb-cmake-standalone/clang-build/lib/libLLVMAggressiveInstCombine.a /Users/buildslave/jenkins/workspace/lldb-cmake-standalone/clang-build/lib/libLLVMInstCombine.a /Users/buildslave/jenkins/workspace/lldb-cmake-standalone/clang-build/lib/libLLVMTransformUtils.a /Users/buildslave/jenkins/workspace/lldb-cmake-standalone/clang-build/lib/libLLVMAnalysis.a /Users/buildslave/jenkins/workspace/lldb-cmake-standalone/clang-build/lib/libLLVMProfileData.a /Users/buildslave/jenkins/workspace/lldb-cmake-standalone/clang-build/lib/libclangLex.a /Users/buildslave/jenkins/workspace/lldb-cmake-standalone/clang-build/lib/libclangBasic.a /Users/buildslave/jenkins/workspace/lldb-cmake-standalone/clang-build/lib/libLLVMDebugInfoPDB.a /Users/buildslave/jenkins/workspace/lldb-cmake-standalone/clang-build/lib/libLLVMObject.a /Users/buildslave/jenkins/workspace/lldb-cmake-standalone/clang-build/lib/libLLVMBitReader.a /Users/buildslave/jenkins/workspace/lldb-cmake-standalone/clang-build/lib/libLLVMCore.a /Users/buildslave/jenkins/workspace/lldb-cmake-standalone/clang-build/lib/libLLVMRemarks.a /Users/buildslave/jenkins/workspace/lldb-cmake-standalone/clang-build/lib/libLLVMBitstreamReader.a /Users/buildslave/jenkins/workspace/lldb-cmake-standalone/clang-build/lib/libLLVMMCParser.a /Users/buildslave/jenkins/workspace/lldb-cmake-standalone/clang-build/lib/libLLVMMC.a /Users/buildslave/jenkins/workspace/lldb-cmake-standalone/clang-build/lib/libLLVMTextAPI.a /Users/buildslave/jenkins/workspace/lldb-cmake-standalone/clang-build/lib/libLLVMDebugInfoCodeView.a /Users/buildslave/jenkins/workspace/lldb-cmake-standalone/clang-build/lib/libLLVMDebugInfoMSF.a /Users/buildslave/jenkins/workspace/lldb-cmake-standalone/lldb-xcode-build/Release/lib/liblldbUtility.a -framework Foundation -framework CoreFoundation -framework CoreServices -framework Security /Users/buildslave/jenkins/workspace/lldb-cmake-standalone/clang-build/lib/libLLVMBinaryFormat.a /Users/buildslave/jenkins/workspace/lldb-cmake-standalone/clang-build/lib/libLLVMSupport.a -lm /usr/lib/libz.dylib /usr/lib/libcurses.dylib /Users/buildslave/jenkins/workspace/lldb-cmake-standalone/clang-build/lib/libLLVMDemangle.a -Xlinker -dependency_info -Xlinker /Users/buildslave/jenkins/workspace/lldb-cmake-standalone/lldb-xcode-build/unittests/Thread/lldb.build/Release/ThreadTests.build/Objects-normal/x86_64/ThreadTests_dependency_info.dat -o /Users/buildslave/jenkins/workspace/lldb-cmake-standalone/lldb-xcode-build/unittests/Thread/Release/ThreadTests

Hide Details

PhaseScriptExecution CMake\ PostBuild\ Rules /Users/buildslave/jenkins/workspace/lldb-cmake-standalone/lldb-xcode-build/unittests/Thread/lldb.build/Release/ThreadTests.build/Script-A2FA2B5B0E6B43AAB29D1E8B.sh cd /Users/buildslave/jenkins/workspace/lldb-cmake-standalone/llvm-project/lldb /bin/sh -c /Users/buildslave/jenkins/workspace/lldb-cmake-standalone/lldb-xcode-build/unittests/Thread/lldb.build/Release/ThreadTests.build/Script-A2FA2B5B0E6B43AAB29D1E8B.sh /usr/local/Cellar/cmake/3.17.2/bin/cmake -E make_directory /Users/buildslave/jenkins/workspace/lldb-cmake-standalone/lldb-xcode-build/unittests/Thread/Release/Inputs

Hide Details

CodeSign /Users/buildslave/jenkins/workspace/lldb-cmake-standalone/lldb-xcode-build/unittests/Thread/Release/ThreadTests cd /Users/buildslave/jenkins/workspace/lldb-cmake-standalone/llvm-project/lldb

Hide Details

Signing Identity: "-"

Hide Details

/usr/bin/codesign --force --sign - --entitlements /Users/buildslave/jenkins/workspace/lldb-cmake-standalone/lldb-xcode-build/unittests/Thread/lldb.build/Release/ThreadTests.build/ThreadTests.xcent --timestamp=none /Users/buildslave/jenkins/workspace/lldb-cmake-standalone/lldb-xcode-build/unittests/Thread/Release/ThreadTests

Hide Details

=== BUILD TARGET debugserverTests OF PROJECT lldb WITH CONFIGURATION Release ===

Hide Details

Check dependencies

Hide Details

Write auxiliary files write-file /Users/buildslave/jenkins/workspace/lldb-cmake-standalone/lldb-xcode-build/unittests/debugserver/lldb.build/Release/debugserverTests.build/Script-41B3D44268ED4245860A72D4.sh chmod 0755 /Users/buildslave/jenkins/workspace/lldb-cmake-standalone/lldb-xcode-build/unittests/debugserver/lldb.build/Release/debugserverTests.build/Script-41B3D44268ED4245860A72D4.sh

Hide Details

Ld /Users/buildslave/jenkins/workspace/lldb-cmake-standalone/lldb-xcode-build/unittests/debugserver/Release/debugserverTests normal x86_64 cd /Users/buildslave/jenkins/workspace/lldb-cmake-standalone/llvm-project/lldb /Applications/Xcode.app/Contents/Developer/Toolchains/XcodeDefault.xctoolchain/usr/bin/clang++ -target x86_64-apple-macos10.12 -isysroot /Applications/Xcode.app/Contents/Developer/Platforms/MacOSX.platform/Developer/SDKs/MacOSX10.15.sdk -L/Users/buildslave/jenkins/workspace/lldb-cmake-standalone/lldb-xcode-build/unittests/debugserver/Release -F/Users/buildslave/jenkins/workspace/lldb-cmake-standalone/lldb-xcode-build/unittests/debugserver/Release -filelist /Users/buildslave/jenkins/workspace/lldb-cmake-standalone/lldb-xcode-build/unittests/debugserver/lldb.build/Release/debugserverTests.build/Objects-normal/x86_64/debugserverTests.LinkFileList -Wl,-dead_strip -Wl,-search_paths_first -Wl,-headerpad_max_install_names /Users/buildslave/jenkins/workspace/lldb-cmake-standalone/clang-build/lib/libLLVMSupport.a /Users/buildslave/jenkins/workspace/lldb-cmake-standalone/clang-build/lib/libLLVMSupport.a /Users/buildslave/jenkins/workspace/lldb-cmake-standalone/clang-build/lib/libgtest_main.a /Users/buildslave/jenkins/workspace/lldb-cmake-standalone/clang-build/lib/libgtest.a /Users/buildslave/jenkins/workspace/lldb-cmake-standalone/lldb-xcode-build/Release/lib/liblldbDebugserverCommon.a /Users/buildslave/jenkins/workspace/lldb-cmake-standalone/lldb-xcode-build/Release/lib/liblldbHost.a /Users/buildslave/jenkins/workspace/lldb-cmake-standalone/clang-build/lib/libLLVMTestingSupport.a /Users/buildslave/jenkins/workspace/lldb-cmake-standalone/lldb-xcode-build/lib/Release/liblldbDebugserverArchSupport.a -lcompression /usr/lib/libxml2.dylib /usr/lib/libedit.dylib /usr/local/lib/liblzma.dylib /usr/lib/libedit.dylib /usr/local/lib/liblzma.dylib /Users/buildslave/jenkins/workspace/lldb-cmake-standalone/lldb-xcode-build/Release/lib/liblldbHostMacOSXObjCXX.a /Users/buildslave/jenkins/workspace/lldb-cmake-standalone/lldb-xcode-build/Release/lib/liblldbUtility.a -framework CoreFoundation -framework Foundation -framework CoreServices -framework Security /Users/buildslave/jenkins/workspace/lldb-cmake-standalone/clang-build/lib/libLLVMObject.a /Users/buildslave/jenkins/workspace/lldb-cmake-standalone/clang-build/lib/libLLVMBitReader.a /Users/buildslave/jenkins/workspace/lldb-cmake-standalone/clang-build/lib/libLLVMCore.a /Users/buildslave/jenkins/workspace/lldb-cmake-standalone/clang-build/lib/libLLVMRemarks.a /Users/buildslave/jenkins/workspace/lldb-cmake-standalone/clang-build/lib/libLLVMBitstreamReader.a /Users/buildslave/jenkins/workspace/lldb-cmake-standalone/clang-build/lib/libLLVMMCParser.a /Users/buildslave/jenkins/workspace/lldb-cmake-standalone/clang-build/lib/libLLVMMC.a /Users/buildslave/jenkins/workspace/lldb-cmake-standalone/clang-build/lib/libLLVMDebugInfoCodeView.a /Users/buildslave/jenkins/workspace/lldb-cmake-standalone/clang-build/lib/libLLVMTextAPI.a /Users/buildslave/jenkins/workspace/lldb-cmake-standalone/clang-build/lib/libLLVMBinaryFormat.a /Users/buildslave/jenkins/workspace/lldb-cmake-standalone/clang-build/lib/libgtest.a /Users/buildslave/jenkins/workspace/lldb-cmake-standalone/clang-build/lib/libLLVMSupport.a -lm /usr/lib/libz.dylib /usr/lib/libcurses.dylib /Users/buildslave/jenkins/workspace/lldb-cmake-standalone/clang-build/lib/libLLVMDemangle.a -lpthread -Xlinker -dependency_info -Xlinker /Users/buildslave/jenkins/workspace/lldb-cmake-standalone/lldb-xcode-build/unittests/debugserver/lldb.build/Release/debugserverTests.build/Objects-normal/x86_64/debugserverTests_dependency_info.dat -o /Users/buildslave/jenkins/workspace/lldb-cmake-standalone/lldb-xcode-build/unittests/debugserver/Release/debugserverTests

Hide Details

PhaseScriptExecution CMake\ PostBuild\ Rules /Users/buildslave/jenkins/workspace/lldb-cmake-standalone/lldb-xcode-build/unittests/debugserver/lldb.build/Release/debugserverTests.build/Script-41B3D44268ED4245860A72D4.sh cd /Users/buildslave/jenkins/workspace/lldb-cmake-standalone/llvm-project/lldb /bin/sh -c /Users/buildslave/jenkins/workspace/lldb-cmake-standalone/lldb-xcode-build/unittests/debugserver/lldb.build/Release/debugserverTests.build/Script-41B3D44268ED4245860A72D4.sh /usr/local/Cellar/cmake/3.17.2/bin/cmake -E make_directory /Users/buildslave/jenkins/workspace/lldb-cmake-standalone/lldb-xcode-build/unittests/debugserver/Release/Inputs

Hide Details

CodeSign /Users/buildslave/jenkins/workspace/lldb-cmake-standalone/lldb-xcode-build/unittests/debugserver/Release/debugserverTests cd /Users/buildslave/jenkins/workspace/lldb-cmake-standalone/llvm-project/lldb

Hide Details

Signing Identity: "-"

Hide Details

/usr/bin/codesign --force --sign - --entitlements /Users/buildslave/jenkins/workspace/lldb-cmake-standalone/lldb-xcode-build/unittests/debugserver/lldb.build/Release/debugserverTests.build/debugserverTests.xcent --timestamp=none /Users/buildslave/jenkins/workspace/lldb-cmake-standalone/lldb-xcode-build/unittests/debugserver/Release/debugserverTests

Hide Details

=== BUILD AGGREGATE TARGET LLDBUnitTests OF PROJECT lldb WITH CONFIGURATION Release ===

Hide Details

Check dependencies

Hide Details

=== BUILD AGGREGATE TARGET lldb-unit-test-deps OF PROJECT lldb WITH CONFIGURATION Release ===

Hide Details

Check dependencies

Hide Details

=== BUILD AGGREGATE TARGET check-lldb OF PROJECT lldb WITH CONFIGURATION Release ===

Hide Details

Check dependencies

Hide Details

Write auxiliary files write-file /Users/buildslave/jenkins/workspace/lldb-cmake-standalone/lldb-xcode-build/test/lldb.build/Release/check-lldb.build/Script-34B58722988F4DB5A3B20CC7.sh chmod 0755 /Users/buildslave/jenkins/workspace/lldb-cmake-standalone/lldb-xcode-build/test/lldb.build/Release/check-lldb.build/Script-34B58722988F4DB5A3B20CC7.sh

Hide Details

PhaseScriptExecution CMake\ Rules /Users/buildslave/jenkins/workspace/lldb-cmake-standalone/lldb-xcode-build/test/lldb.build/Release/check-lldb.build/Script-34B58722988F4DB5A3B20CC7.sh cd /Users/buildslave/jenkins/workspace/lldb-cmake-standalone/llvm-project/lldb /bin/sh -c /Users/buildslave/jenkins/workspace/lldb-cmake-standalone/lldb-xcode-build/test/lldb.build/Release/check-lldb.build/Script-34B58722988F4DB5A3B20CC7.sh echo "Running lldb lit test suite" Running lldb lit test suite /usr/local/Frameworks/Python.framework/Versions/3.7/bin/python3.7 /Users/buildslave/jenkins/workspace/lldb-cmake-standalone/lldb-xcode-build/Release/bin/llvm-lit --xunit-xml-output=testresults.xunit.xml -v -vv --timeout=600 --param build_mode=Release /Users/buildslave/jenkins/workspace/lldb-cmake-standalone/lldb-xcode-build/test Deleting module cache at /Users/buildslave/jenkins/workspace/lldb-cmake-standalone/lldb-xcode-build/lldb-test-build.noindex/module-cache-lldb/lldb-api. Deleting module cache at /Users/buildslave/jenkins/workspace/lldb-cmake-standalone/lldb-xcode-build/lldb-test-build.noindex/module-cache-clang/lldb-api. -- Testing: 2403 tests, 16 workers -- llvm-lit: /Users/buildslave/jenkins/workspace/lldb-cmake-standalone/llvm-project/lldb/test/Shell/helper/toolchain.py:126: note: using SDKROOT: '/Applications/Xcode.app/Contents/Developer/Platforms/MacOSX.platform/Developer/SDKs/MacOSX10.15.sdk' llvm-lit: /Users/buildslave/jenkins/workspace/lldb-cmake-standalone/llvm-project/llvm/utils/lit/lit/llvm/config.py:436: note: using clang: /Users/buildslave/jenkins/workspace/lldb-cmake-standalone/clang-build/bin/clang PASS: lldb-api :: lang/c/anonymous/TestAnonymous.py (1 of 2403) PASS: lldb-api :: types/TestIntegerTypeExpr.py (2 of 2403) PASS: lldb-api :: functionalities/completion/TestCompletion.py (3 of 2403) PASS: lldb-api :: python_api/target/TestTargetAPI.py (4 of 2403) PASS: lldb-api :: lang/objc/foundation/TestObjCMethods.py (5 of 2403) UNSUPPORTED: lldb-api :: tools/lldb-server/vCont-threads/TestGdbRemote_vContThreads.py (6 of 2403) PASS: lldb-api :: functionalities/load_unload/TestLoadUnload.py (7 of 2403) PASS: lldb-api :: types/TestLongTypes.py (8 of 2403) PASS: lldb-api :: lang/objc/objc-new-syntax/TestObjCNewSyntaxLiteral.py (9 of 2403) PASS: lldb-api :: lang/cpp/namespace/TestNamespaceLookup.py (10 of 2403) PASS: lldb-api :: types/TestLongTypesExpr.py (11 of 2403) PASS: lldb-api :: lang/objc/foundation/TestFoundationDisassembly.py (12 of 2403) PASS: lldb-api :: lang/objc/exceptions/TestObjCExceptions.py (13 of 2403) PASS: lldb-api :: lang/objc/hidden-ivars/TestHiddenIvars.py (14 of 2403) PASS: lldb-api :: python_api/process/TestProcessAPI.py (15 of 2403) PASS: lldb-api :: commands/target/basic/TestTargetCommand.py (16 of 2403) PASS: lldb-api :: python_api/thread/TestThreadAPI.py (17 of 2403) PASS: lldb-api :: types/TestShortTypeExpr.py (18 of 2403) PASS: lldb-api :: api/multithreaded/TestMultithreaded.py (19 of 2403) PASS: lldb-api :: types/TestCharTypeExpr.py (20 of 2403) PASS: lldb-api :: functionalities/breakpoint/breakpoint_conditions/TestBreakpointConditions.py (21 of 2403) PASS: lldb-api :: functionalities/inferior-crashing/TestInferiorCrashingStep.py (22 of 2403) PASS: lldb-api :: tools/lldb-server/TestGdbRemoteThreadsInStopReply.py (23 of 2403) PASS: lldb-api :: functionalities/inferior-assert/TestInferiorAssert.py (24 of 2403) PASS: lldb-api :: lang/objc/objc-new-syntax/TestObjCNewSyntaxArray.py (25 of 2403) PASS: lldb-api :: types/TestCharType.py (26 of 2403) PASS: lldb-api :: lang/cpp/virtual-functions/TestCppVirtualFunctions.py (27 of 2403) PASS: lldb-api :: lang/c/shared_lib/TestSharedLib.py (28 of 2403) PASS: lldb-api :: lang/objc/objc-new-syntax/TestObjCNewSyntaxDictionary.py (29 of 2403) PASS: lldb-api :: commands/expression/import-std-module/queue/TestQueueFromStdModule.py (30 of 2403) PASS: lldb-api :: functionalities/limit-debug-info/TestLimitDebugInfo.py (31 of 2403) PASS: lldb-api :: lang/objc/real-definition/TestRealDefinition.py (32 of 2403) PASS: lldb-api :: types/TestIntegerType.py (33 of 2403) PASS: lldb-api :: functionalities/breakpoint/breakpoint_ignore_count/TestBreakpointIgnoreCount.py (34 of 2403) PASS: lldb-api :: functionalities/inferior-crashing/TestInferiorCrashing.py (35 of 2403) PASS: lldb-api :: functionalities/inferior-crashing/recursive-inferior/TestRecursiveInferior.py (36 of 2403) PASS: lldb-api :: functionalities/data-formatter/poarray/TestPrintObjectArray.py (37 of 2403) FAIL: lldb-api :: tools/lldb-vscode/launch/TestVSCode_launch.py (38 of 2403) ******************** TEST 'lldb-api :: tools/lldb-vscode/launch/TestVSCode_launch.py' FAILED ******************** Script: -- /usr/local/Frameworks/Python.framework/Versions/3.7/bin/python3.7 /Users/buildslave/jenkins/workspace/lldb-cmake-standalone/llvm-project/lldb/test/API/dotest.py -u CXXFLAGS -u CFLAGS --codesign-identity lldb_codesign --env LLVM_LIBS_DIR=/Users/buildslave/jenkins/workspace/lldb-cmake-standalone/clang-build/./lib --arch x86_64 --build-dir /Users/buildslave/jenkins/workspace/lldb-cmake-standalone/lldb-xcode-build/lldb-test-build.noindex --lldb-module-cache-dir /Users/buildslave/jenkins/workspace/lldb-cmake-standalone/lldb-xcode-build/lldb-test-build.noindex/module-cache-lldb/lldb-api --clang-module-cache-dir /Users/buildslave/jenkins/workspace/lldb-cmake-standalone/lldb-xcode-build/lldb-test-build.noindex/module-cache-clang/lldb-api --executable /Users/buildslave/jenkins/workspace/lldb-cmake-standalone/lldb-xcode-build/Release/bin/lldb --compiler /Users/buildslave/jenkins/workspace/lldb-cmake-standalone/clang-build/./bin/clang --dsymutil /Users/buildslave/jenkins/workspace/lldb-cmake-standalone/clang-build/./bin/dsymutil --llvm-tools-dir /Users/buildslave/jenkins/workspace/lldb-cmake-standalone/clang-build/./bin --lldb-libs-dir /Users/buildslave/jenkins/workspace/lldb-cmake-standalone/lldb-xcode-build/Release/lib --framework /Users/buildslave/jenkins/workspace/lldb-cmake-standalone/lldb-xcode-build/Release/bin/LLDB.framework /Users/buildslave/jenkins/workspace/lldb-cmake-standalone/llvm-project/lldb/test/API/tools/lldb-vscode/launch -p TestVSCode_launch.py -- Exit Code: 1

Hide Details

Command Output (stdout): -- lldb version 14.0.0 (http://labmaster3.local/git/llvm-project.git revision 336291e777f3e74bea2ae16f7bf61b8f4a76c869) clang revision 336291e777f3e74bea2ae16f7bf61b8f4a76c869 llvm revision 336291e777f3e74bea2ae16f7bf61b8f4a76c869 Skipping the following test categories: ['libstdcxx', 'dwo', 'llgs', 'fork'] ========= DEBUG ADAPTER PROTOCOL LOGS ========= --> Content-Length: 284

Hide Details

{"command":"initialize","type":"request","arguments":{"adapterID":"lldb-native","clientID":"vscode","columnsStartAt1":true,"linesStartAt1":true,"locale":"en-us","pathFormat":"path","supportsRunInTerminalRequest":true,"supportsVariablePaging":true,"supportsVariableType":true},"seq":1} <-- Content-Length: 1222

Hide Details

{"body":{"exceptionBreakpointFilters":[{"default":false,"filter":"cpp_catch","label":"C++ Catch"},{"default":false,"filter":"cpp_throw","label":"C++ Throw"},{"default":false,"filter":"objc_catch","label":"Objective C Catch"},{"default":false,"filter":"objc_throw","label":"Objective C Throw"},{"default":false,"filter":"swift_catch","label":"Swift Catch"},{"default":false,"filter":"swift_throw","label":"Swift Throw"}],"supportTerminateDebuggee":true,"supportsCompletionsRequest":false,"supportsConditionalBreakpoints":true,"supportsConfigurationDoneRequest":true,"supportsDelayedStackTraceLoading":true,"supportsEvaluateForHovers":true,"supportsExceptionInfoRequest":true,"supportsExceptionOptions":true,"supportsFunctionBreakpoints":true,"supportsGotoTargetsRequest":false,"supportsHitConditionalBreakpoints":true,"supportsLoadedSourcesRequest":false,"supportsModulesRequest":false,"supportsProgressReporting":true,"supportsRestartFrame":false,"supportsRestartRequest":false,"supportsRunInTerminalRequest":true,"supportsSetVariable":true,"supportsStepBack":false,"supportsStepInTargetsRequest":false,"supportsValueFormattingOptions":true},"command":"initialize","request_seq":1,"seq":0,"success":true,"type":"response"} --> Content-Length: 872

Hide Details

{"command":"launch","type":"request","arguments":{"program":"/Users/buildslave/jenkins/workspace/lldb-cmake-standalone/lldb-xcode-build/lldb-test-build.noindex/tools/lldb-vscode/launch/TestVSCode_launch.test_args/a.out","args":["one","with space","'with single quotes'","\"with double quotes\""],"disableASLR":true,"initCommands":["settings clear -all","settings set symbols.enable-external-lookup false","settings set target.inherit-tcc true","settings set target.detach-on-error false","settings set target.auto-apply-fixits false","settings set plugin.process.gdb-remote.packet-timeout 60","settings set symbols.clang-modules-cache-path \"/Users/buildslave/jenkins/workspace/lldb-cmake-standalone/lldb-xcode-build/lldb-test-build.noindex/module-cache-lldb/lldb-api\"","settings set use-color false","setting set target.prefer-dynamic-value no-dynamic-values"]},"seq":2} <-- Content-Length: 691

Hide Details

{"body":{"category":"console","output":"Running initCommands:\n(lldb) settings clear -all\n(lldb) settings set symbols.enable-external-lookup false\n(lldb) settings set target.inherit-tcc true\n(lldb) settings set target.detach-on-error false\n(lldb) settings set target.auto-apply-fixits false\n(lldb) settings set plugin.process.gdb-remote.packet-timeout 60\n(lldb) settings set symbols.clang-modules-cache-path \"/Users/buildslave/jenkins/workspace/lldb-cmake-standalone/lldb-xcode-build/lldb-test-build.noindex/module-cache-lldb/lldb-api\"\n(lldb) settings set use-color false\n(lldb) setting set target.prefer-dynamic-value no-dynamic-values\n"},"event":"output","seq":0,"type":"event"} <-- Content-Length: 77

Hide Details

{"command":"launch","request_seq":2,"seq":0,"success":true,"type":"response"} <-- Content-Length: 287

Hide Details

{"body":{"isLocalProcess":true,"name":"/Users/buildslave/jenkins/workspace/lldb-cmake-standalone/lldb-xcode-build/lldb-test-build.noindex/tools/lldb-vscode/launch/TestVSCode_launch.test_args/a.out","startMethod":"launch","systemProcessId":76053},"event":"process","seq":0,"type":"event"} <-- Content-Length: 46

Hide Details

{"event":"initialized","seq":0,"type":"event"} --> Content-Length: 71

Hide Details

{"command":"configurationDone","type":"request","arguments":{},"seq":3} <-- Content-Length: 88

Hide Details

{"command":"configurationDone","request_seq":3,"seq":0,"success":true,"type":"response"} <-- Content-Length: 1153

Hide Details

{"body":{"category":"stdout","output":"arg[0] = \"/Users/buildslave/jenkins/workspace/lldb-cmake-standalone/lldb-xcode-build/lldb-test-build.noindex/tools/lldb-vscode/launch/TestVSCode_launch.test_args/a.out\"\r\narg[1] = \"one\"\r\narg[2] = \"with space\"\r\narg[3] = \"'with single quotes'\"\r\narg[4] = \"\"with double quotes\"\"\r\nenv[0] = \"LLVM_LIBS_DIR=/Users/buildslave/jenkins/workspace/lldb-cmake-standalone/clang-build/./lib\"\r\nenv[1] = \"LLDBVSCODE_LOG=/Users/buildslave/jenkins/workspace/lldb-cmake-standalone/lldb-xcode-build/lldb-test-build.noindex/tools/lldb-vscode/launch/TestVSCode_launch.test_args/vscode.txt\"\r\nenv[2] = \"LLDB_SRC=/Users/buildslave/jenkins/workspace/lldb-cmake-standalone/llvm-project/lldb\"\r\nenv[3] = \"LLDBVSCODE_EXEC=/Users/buildslave/jenkins/workspace/lldb-cmake-standalone/lldb-xcode-build/Release/bin/lldb-vscode\"\r\nenv[4] = \"OS_ACTIVITY_DT_MODE=enable\"\r\nenv[5] = \"LLDB_FRAMEWORK=/Users/buildslave/jenkins/workspace/lldb-cmake-standalone/lldb-xcode-build/Release/bin/LLDB.framework\"\r\nenv[6] = \"PATH=/Applications/Xcode.app/Contents/Developer/Toolcha"},"event":"output","seq":0,"type":"event"} <-- Content-Length: 1122

Hide Details

{"body":{"category":"stdout","output":"ins/XcodeDefault.xctoolchain/usr/bin:/Applications/Xcode.app/Contents/Developer/Toolchains/XcodeDefault.xctoolchain/usr/local/bin:/Applications/Xcode.app/Contents/Developer/Toolchains/XcodeDefault.xctoolchain/usr/libexec:/Applications/Xcode.app/Contents/Developer/Platforms/MacOSX.platform/Developer/usr/bin:/Applications/Xcode.app/Contents/Developer/Platforms/MacOSX.platform/Developer/usr/local/bin:/Applications/Xcode.app/Contents/Developer/Platforms/MacOSX.platform/usr/bin:/Applications/Xcode.app/Contents/Developer/Platforms/MacOSX.platform/usr/local/bin:/Applications/Xcode.app/Contents/Developer/usr/bin:/Applications/Xcode.app/Contents/Developer/usr/local/bin:/Applications/Xcode.app/Contents/Developer/Tools:/usr/local/bin:/usr/local/sbin:/usr/bin:/bin:/usr/sbin:/sbin\"\r\nenv[7] = \"__CF_USER_TEXT_ENCODING=0x1F5:0x0:0x0\"\r\nenv[8] = \"TMPDIR=/var/folders/09/r4vw4v8n5kb67jl66zvlbljw0000gn/T/\"\r\nenv[9] = \"LC_CTYPE=UTF-8\"\r\nenv[10] = \"__PYVENV_LAUNCHER__=/usr/local/Cellar/python/3.7.0/Frameworks/Python.framework/Version"},"event":"output","seq":0,"type":"event"} <-- Content-Length: 437

Hide Details

{"body":{"category":"stdout","output":"s/3.7/bin/python3.7\"\r\nenv[11] = \"TERM=vt100\"\r\nenv[12] = \"LLVM_DISABLE_CRASH_REPORT=1\"\r\nenv[13] = \"LLDB_TEST=/Users/buildslave/jenkins/workspace/lldb-cmake-standalone/llvm-project/lldb/packages/Python/lldbsuite/test\"\r\ncwd = \"/Users/buildslave/jenkins/workspace/lldb-cmake-standalone/llvm-project/lldb/test/API/tools/lldb-vscode/launch\"\r\n"},"event":"output","seq":0,"type":"event"} <-- Content-Length: 63

Hide Details

{"body":{"exitCode":0},"event":"exited","seq":0,"type":"event"} <-- Content-Length: 45

Hide Details

{"event":"terminated","seq":0,"type":"event"} --> Content-Length: 88

Hide Details

{"command":"disconnect","type":"request","arguments":{"terminateDebuggee":true},"seq":4} <-- Content-Length: 81

Hide Details

{"command":"disconnect","request_seq":4,"seq":0,"success":true,"type":"response"}

Hide Details

========= END ========= ========= DEBUG ADAPTER PROTOCOL LOGS ========= --> Content-Length: 284

Hide Details

{"command":"initialize","type":"request","arguments":{"adapterID":"lldb-native","clientID":"vscode","columnsStartAt1":true,"linesStartAt1":true,"locale":"en-us","pathFormat":"path","supportsRunInTerminalRequest":true,"supportsVariablePaging":true,"supportsVariableType":true},"seq":1} <-- Content-Length: 1222

Hide Details

{"body":{"exceptionBreakpointFilters":[{"default":false,"filter":"cpp_catch","label":"C++ Catch"},{"default":false,"filter":"cpp_throw","label":"C++ Throw"},{"default":false,"filter":"objc_catch","label":"Objective C Catch"},{"default":false,"filter":"objc_throw","label":"Objective C Throw"},{"default":false,"filter":"swift_catch","label":"Swift Catch"},{"default":false,"filter":"swift_throw","label":"Swift Throw"}],"supportTerminateDebuggee":true,"supportsCompletionsRequest":false,"supportsConditionalBreakpoints":true,"supportsConfigurationDoneRequest":true,"supportsDelayedStackTraceLoading":true,"supportsEvaluateForHovers":true,"supportsExceptionInfoRequest":true,"supportsExceptionOptions":true,"supportsFunctionBreakpoints":true,"supportsGotoTargetsRequest":false,"supportsHitConditionalBreakpoints":true,"supportsLoadedSourcesRequest":false,"supportsModulesRequest":false,"supportsProgressReporting":true,"supportsRestartFrame":false,"supportsRestartRequest":false,"supportsRunInTerminalRequest":true,"supportsSetVariable":true,"supportsStepBack":false,"supportsStepInTargetsRequest":false,"supportsValueFormattingOptions":true},"command":"initialize","request_seq":1,"seq":0,"success":true,"type":"response"} --> Content-Length: 1061

Hide Details

{"command":"launch","type":"request","arguments":{"program":"/Users/buildslave/jenkins/workspace/lldb-cmake-standalone/lldb-xcode-build/lldb-test-build.noindex/tools/lldb-vscode/launch/TestVSCode_launch.test_commands/a.out","disableASLR":true,"initCommands":["settings clear -all","settings set symbols.enable-external-lookup false","settings set target.inherit-tcc true","settings set target.detach-on-error false","settings set target.auto-apply-fixits false","settings set plugin.process.gdb-remote.packet-timeout 60","settings set symbols.clang-modules-cache-path \"/Users/buildslave/jenkins/workspace/lldb-cmake-standalone/lldb-xcode-build/lldb-test-build.noindex/module-cache-lldb/lldb-api\"","settings set use-color false","setting set target.prefer-dynamic-value no-dynamic-values","target list","platform list"],"preRunCommands":["image list a.out","image dump sections a.out"],"stopCommands":["frame variable","bt"],"exitCommands":["expr 2+3","expr 3+4"],"terminateCommands":["expr 4+2"],"postRunCommands":["help trace","help process trace"]},"seq":2} <-- Content-Length: 1739

Hide Details

{"body":{"category":"console","output":"Running initCommands:\n(lldb) settings clear -all\n(lldb) settings set symbols.enable-external-lookup false\n(lldb) settings set target.inherit-tcc true\n(lldb) settings set target.detach-on-error false\n(lldb) settings set target.auto-apply-fixits false\n(lldb) settings set plugin.process.gdb-remote.packet-timeout 60\n(lldb) settings set symbols.clang-modules-cache-path \"/Users/buildslave/jenkins/workspace/lldb-cmake-standalone/lldb-xcode-build/lldb-test-build.noindex/module-cache-lldb/lldb-api\"\n(lldb) settings set use-color false\n(lldb) setting set target.prefer-dynamic-value no-dynamic-values\n(lldb) target list\nNo targets.\n(lldb) platform list\nAvailable platforms:\nhost: Local Mac OS X user platform plug-in.\nremote-linux: Remote Linux user platform plug-in.\nremote-android: Remote Android user platform plug-in.\nremote-freebsd: Remote FreeBSD user platform plug-in.\nremote-gdb-server: A platform that uses the GDB remote protocol as the communication transport.\nremote-ios: Remote iOS platform plug-in.\nremote-macosx: Remote Mac OS X user platform plug-in.\nios-simulator: iPhone simulator platform plug-in.\ntvos-simulator: tvOS simulator platform plug-in.\nwatchos-simulator: Apple Watch simulator platform plug-in.\ndarwin-kernel: Darwin Kernel platform plug-in.\nremote-tvos: Remote Apple TV platform plug-in.\nremote-watchos: Remote Apple Watch platform plug-in.\nremote-bridgeos: Remote BridgeOS platform plug-in.\nhost: Local Mac OS X user platform plug-in.\nremote-netbsd: Remote NetBSD user platform plug-in.\nremote-openbsd: Remote OpenBSD user platform plug-in.\nremote-windows: Remote Windows user platform plug-in.\n"},"event":"output","seq":0,"type":"event"} <-- Content-Length: 4116

Hide Details

{"body":{"category":"console","output":"Running preRunCommands:\n(lldb) image list a.out\n[ 0] 51102923-DEBB-3D90-9007-5E29DE8C0AA9 0x0000000100000000 /Users/buildslave/jenkins/workspace/lldb-cmake-standalone/lldb-xcode-build/lldb-test-build.noindex/tools/lldb-vscode/launch/TestVSCode_launch.test_commands/a.out \n /Users/buildslave/jenkins/workspace/lldb-cmake-standalone/lldb-xcode-build/lldb-test-build.noindex/tools/lldb-vscode/launch/TestVSCode_launch.test_commands/a.out.dSYM/Contents/Resources/DWARF/a.out\n(lldb) image dump sections a.out\nSections for '/Users/buildslave/jenkins/workspace/lldb-cmake-standalone/lldb-xcode-build/lldb-test-build.noindex/tools/lldb-vscode/launch/TestVSCode_launch.test_commands/a.out' (x86_64):\n SectID Type File Address Perm File Off. File Size Flags Section Name\n ---------- ---------------- --------------------------------------- ---- ---------- ---------- ---------- ----------------------------\n 0x00000100 container [0x0000000000000000-0x0000000100000000) --- 0x00000000 0x00000000 0x00000000 a.out.__PAGEZERO\n 0x00000200 container [0x0000000100000000-0x0000000100001000) r-x 0x00000000 0x00001000 0x00000000 a.out.__TEXT\n 0x00000001 code [0x0000000100000e70-0x0000000100000f48) r-x 0x00000e70 0x000000d8 0x80000400 a.out.__TEXT.__text\n 0x00000002 code [0x0000000100000f48-0x0000000100000f5a) r-x 0x00000f48 0x00000012 0x80000408 a.out.__TEXT.__stubs\n 0x00000003 code [0x0000000100000f5c-0x0000000100000f8a) r-x 0x00000f5c 0x0000002e 0x80000400 a.out.__TEXT.__stub_helper\n 0x00000004 data-cstr [0x0000000100000f8a-0x0000000100000fb6) r-x 0x00000f8a 0x0000002c 0x00000002 a.out.__TEXT.__cstring\n 0x00000005 compact-unwind [0x0000000100000fb8-0x0000000100001000) r-x 0x00000fb8 0x00000048 0x00000000 a.out.__TEXT.__unwind_info\n 0x00000300 container [0x0000000100001000-0x0000000100002000) rw- 0x00001000 0x00001000 0x00000010 a.out.__DATA_CONST\n 0x00000006 data-ptrs [0x0000000100001000-0x0000000100001008) rw- 0x00001000 0x00000008 0x00000006 a.out.__DATA_CONST.__got\n 0x00000400 container [0x0000000100002000-0x0000000100003000) rw- 0x00002000 0x00001000 0x00000000 a.out.__DATA\n 0x00000007 data-ptrs [0x0000000100002000-0x0000000100002018) rw- 0x00002000 0x00000018 0x00000007 a.out.__DATA.__la_symbol_ptr\n 0x00000008 data [0x0000000100002018-0x0000000100002020) rw- 0x00002018 0x00000008 0x00000000 a.out.__DATA.__data\n 0x00000500 container [0x0000000100003000-0x0000000100008000) r-- 0x00003000 0x00004ae0 0x00000000 a.out.__LINKEDIT\n 0x00000200 container [0x0000000100004000-0x0000000100005000) rw- 0x00002000 0x00000592 0x00000000 a.out.__DWARF\n 0x00000001 dwarf-line [0x0000000100004000-0x0000000100004106) rw- 0x00002000 0x00000106 0x00000000 a.out.__DWARF.__debug_line\n 0x00000002 dwarf-aranges [0x0000000100004106-0x0000000100004136) rw- 0x00002106 0x00000030 0x00000000 a.out.__DWARF.__debug_aranges\n 0x00000003 dwarf-info [0x0000000100004136-0x0000000100004215) rw- 0x00002136 0x000000df 0x00000000 a.out.__DWARF.__debug_info\n 0x00000004 dwarf-abbrev [0x0000000100004215-0x0000000100004286) rw- 0x00002215 0x00000071 0x00000000 a.out.__DWARF.__debug_abbrev\n 0x00000005 dwarf-str [0x0000000100004286-0x000000010000449c) rw- 0x00002286 0x00000216 0x00000000 a.out.__DWARF.__debug_str\n 0x00000006 apple-names [0x000000010000449c-0x00000001000044d8) rw- 0x0000249c 0x0000003c 0x00000000 a.out.__DWARF.__apple_names\n 0x00000007 apple-namespaces [0x00000001000044d8-0x00000001000044fc) rw- 0x000024d8 0x00000024 0x00000000 a.out.__DWARF.__apple_namespac\n 0x00000008 apple-types [0x00000001000044fc-0x000000010000456e) rw- 0x000024fc 0x00000072 0x00000000 a.out.__DWARF.__apple_types\n 0x00000009 apple-objc [0x000000010000456e-0x0000000100004592) rw- 0x0000256e 0x00000024 0x00000000 a.out.__DWARF.__apple_objc\n"},"event":"output","seq":0,"type":"event"} <-- Content-Length: 1500

Hide Details

{"body":{"category":"console","output":"Running postRunCommands:\n(lldb) help trace\nCommands for loading and using processor trace information.\n\nSyntax: trace [<sub-command-options>]\n\nThe following subcommands are supported:\n\n dump -- Dump the loaded processor trace data.\n load -- Load a processor trace session from a JSON file.\n schema -- Show the schema of the given trace plugin.\n\nFor more help on any particular subcommand, type 'help <command> <subcommand>'.\n(lldb) help process trace\nCommands for tracing the current process.\n\nSyntax: process trace <subcommand> [<subcommand objects>]\n\nThe following subcommands are supported:\n\n save -- Save the trace of the current process in the specified\n directory. The directory will be created if needed. This will\n also create a file <directory>/trace.json with the main\n properties of the trace session, along with others files which\n contain the actual trace data. The trace.json file can be used\n later as input for the \"trace load\" command to load the trace in\n LLDB\n start -- Start tracing this process with the corresponding trace plug-in.\n stop -- Stop tracing this process. This does not affect traces started\n with the \"thread trace start\" command.\n\nFor more help on any particular subcommand, type 'help <command> <subcommand>'.\n"},"event":"output","seq":0,"type":"event"} <-- Content-Length: 77

Hide Details

{"command":"launch","request_seq":2,"seq":0,"success":true,"type":"response"} <-- Content-Length: 291

Hide Details

{"body":{"isLocalProcess":true,"name":"/Users/buildslave/jenkins/workspace/lldb-cmake-standalone/lldb-xcode-build/lldb-test-build.noindex/tools/lldb-vscode/launch/TestVSCode_launch.test_commands/a.out","startMethod":"launch","systemProcessId":76246},"event":"process","seq":0,"type":"event"} <-- Content-Length: 46

Hide Details

{"event":"initialized","seq":0,"type":"event"} --> Content-Length: 192

Hide Details

{"command":"setBreakpoints","type":"request","arguments":{"source":{"name":"main.c","path":"main.c"},"sourceModified":false,"lines":"[11, 14]","breakpoints":[{"line":11},{"line":14}]},"seq":3} <-- Content-Length: 266

Hide Details

{"body":{"breakpoints":[{"id":1,"line":11,"source":{"name":"main.c","path":"main.c"},"verified":true},{"id":2,"line":14,"source":{"name":"main.c","path":"main.c"},"verified":true}]},"command":"setBreakpoints","request_seq":3,"seq":0,"success":true,"type":"response"} --> Content-Length: 71

Hide Details

{"command":"configurationDone","type":"request","arguments":{},"seq":4} <-- Content-Length: 88

Hide Details

{"command":"configurationDone","request_seq":4,"seq":0,"success":true,"type":"response"} <-- Content-Length: 1135

Hide Details

{"body":{"category":"stdout","output":"arg[0] = \"/Users/buildslave/jenkins/workspace/lldb-cmake-standalone/lldb-xcode-build/lldb-test-build.noindex/tools/lldb-vscode/launch/TestVSCode_launch.test_commands/a.out\"\r\nenv[0] = \"LLVM_LIBS_DIR=/Users/buildslave/jenkins/workspace/lldb-cmake-standalone/clang-build/./lib\"\r\nenv[1] = \"LLDBVSCODE_LOG=/Users/buildslave/jenkins/workspace/lldb-cmake-standalone/lldb-xcode-build/lldb-test-build.noindex/tools/lldb-vscode/launch/TestVSCode_launch.test_commands/vscode.txt\"\r\nenv[2] = \"LLDB_SRC=/Users/buildslave/jenkins/workspace/lldb-cmake-standalone/llvm-project/lldb\"\r\nenv[3] = \"LLDBVSCODE_EXEC=/Users/buildslave/jenkins/workspace/lldb-cmake-standalone/lldb-xcode-build/Release/bin/lldb-vscode\"\r\nenv[4] = \"OS_ACTIVITY_DT_MODE=enable\"\r\nenv[5] = \"LLDB_FRAMEWORK=/Users/buildslave/jenkins/workspace/lldb-cmake-standalone/lldb-xcode-build/Release/bin/LLDB.framework\"\r\nenv[6] = \"PATH=/Applications/Xcode.app/Contents/Developer/Toolchains/XcodeDefault.xctoolchain/usr/bin:/Applications/Xcode.app/Contents/Developer/Toolchains/XcodeD"},"event":"output","seq":0,"type":"event"} <-- Content-Length: 1133

Hide Details

{"body":{"category":"stdout","output":"efault.xctoolchain/usr/local/bin:/Applications/Xcode.app/Contents/Developer/Toolchains/XcodeDefault.xctoolchain/usr/libexec:/Applications/Xcode.app/Contents/Developer/Platforms/MacOSX.platform/Developer/usr/bin:/Applications/Xcode.app/Contents/Developer/Platforms/MacOSX.platform/Developer/usr/local/bin:/Applications/Xcode.app/Contents/Developer/Platforms/MacOSX.platform/usr/bin:/Applications/Xcode.app/Contents/Developer/Platforms/MacOSX.platform/usr/local/bin:/Applications/Xcode.app/Contents/Developer/usr/bin:/Applications/Xcode.app/Contents/Developer/usr/local/bin:/Applications/Xcode.app/Contents/Developer/Tools:/usr/local/bin:/usr/local/sbin:/usr/bin:/bin:/usr/sbin:/sbin\"\r\nenv[7] = \"__CF_USER_TEXT_ENCODING=0x1F5:0x0:0x0\"\r\nenv[8] = \"TMPDIR=/var/folders/09/r4vw4v8n5kb67jl66zvlbljw0000gn/T/\"\r\nenv[9] = \"LC_CTYPE=UTF-8\"\r\nenv[10] = \"__PYVENV_LAUNCHER__=/usr/local/Cellar/python/3.7.0/Frameworks/Python.framework/Versions/3.7/bin/python3.7\"\r\nenv[11] = \"TERM=vt100\"\r\nenv[12] = \"LLVM_DISABLE_CRASH_REPORT=1\"\r\nenv[13] = "},"event":"output","seq":0,"type":"event"} <-- Content-Length: 206

Hide Details

{"body":{"category":"stdout","output":"\"LLDB_TEST=/Users/buildslave/jenkins/workspace/lldb-cmake-standalone/llvm-project/lldb/packages/Python/lldbsuite/test\"\r\n"},"event":"output","seq":0,"type":"event"} <-- Content-Length: 199

Hide Details

{"body":{"allThreadsStopped":true,"description":"breakpoint 1.1","preserveFocusHint":false,"reason":"breakpoint","threadCausedFocus":true,"threadId":4694033},"event":"stopped","seq":0,"type":"event"} <-- Content-Length: 644

Hide Details

{"body":{"category":"console","output":"Running stopCommands:\n(lldb) frame variable\n(int) argc = 1\n(const char **) argv = 0x00007ffeefbff560\n(const char **) envp = 0x00007ffeefbff570\n(char *) cwd = 0x0000000101808200 \"/Users/buildslave/jenkins/workspace/lldb-cmake-standalone/llvm-project/lldb/test/API/tools/lldb-vscode/launch\"\n(lldb) bt\n* thread #1, queue = 'com.apple.main-thread', stop reason = breakpoint 1.1\n * frame #0: 0x0000000100000f1d a.out`main(argc=1, argv=0x00007ffeefbff560, envp=0x00007ffeefbff570) at main.c:11:28\n frame #1: 0x00007fff6fb97cc9 libdyld.dylib`start + 1\n"},"event":"output","seq":0,"type":"event"} --> Content-Length: 61

Hide Details

{"command":"threads","type":"request","arguments":{},"seq":5} <-- Content-Length: 133

Hide Details

{"body":{"threads":[{"id":4694033,"name":"Thread #1"}]},"command":"threads","request_seq":5,"seq":0,"success":true,"type":"response"} --> Content-Length: 80

Hide Details

{"command":"continue","type":"request","arguments":{"threadId":4694033},"seq":6} <-- Content-Length: 115

Hide Details

{"body":{"allThreadsContinued":true},"command":"continue","request_seq":6,"seq":0,"success":true,"type":"response"} <-- Content-Length: 205

Hide Details

{"body":{"category":"stdout","output":"cwd = \"/Users/buildslave/jenkins/workspace/lldb-cmake-standalone/llvm-project/lldb/test/API/tools/lldb-vscode/launch\"\r\n"},"event":"output","seq":0,"type":"event"} <-- Content-Length: 199

Hide Details

{"body":{"allThreadsStopped":true,"description":"breakpoint 2.1","preserveFocusHint":false,"reason":"breakpoint","threadCausedFocus":true,"threadId":4694033},"event":"stopped","seq":0,"type":"event"} <-- Content-Length: 529

Hide Details

{"body":{"category":"console","output":"Running stopCommands:\n(lldb) frame variable\n(int) argc = 1\n(const char **) argv = 0x00007ffeefbff560\n(const char **) envp = 0x00007ffeefbff570\n(char *) cwd = 0x0000000000000000\n(lldb) bt\n* thread #1, queue = 'com.apple.main-thread', stop reason = breakpoint 2.1\n * frame #0: 0x0000000100000f40 a.out`main(argc=1, argv=0x00007ffeefbff560, envp=0x00007ffeefbff570) at main.c:14:3\n frame #1: 0x00007fff6fb97cc9 libdyld.dylib`start + 1\n"},"event":"output","seq":0,"type":"event"} --> Content-Length: 61

Hide Details

{"command":"threads","type":"request","arguments":{},"seq":7} <-- Content-Length: 133

Hide Details

{"body":{"threads":[{"id":4694033,"name":"Thread #1"}]},"command":"threads","request_seq":7,"seq":0,"success":true,"type":"response"} --> Content-Length: 80

Hide Details

{"command":"continue","type":"request","arguments":{"threadId":4694033},"seq":8} <-- Content-Length: 115

Hide Details

{"body":{"allThreadsContinued":true},"command":"continue","request_seq":8,"seq":0,"success":true,"type":"response"} <-- Content-Length: 168

Hide Details

{"body":{"category":"console","output":"Running exitCommands:\n(lldb) expr 2+3\n(int) $0 = 5\n(lldb) expr 3+4\n(int) $1 = 7\n"},"event":"output","seq":0,"type":"event"} <-- Content-Length: 63

Hide Details

{"body":{"exitCode":0},"event":"exited","seq":0,"type":"event"} <-- Content-Length: 142

Hide Details

{"body":{"category":"console","output":"Running terminateCommands:\n(lldb) expr 4+2\n(int) $2 = 6\n"},"event":"output","seq":0,"type":"event"} <-- Content-Length: 45

Hide Details

{"event":"terminated","seq":0,"type":"event"} --> Content-Length: 88

Hide Details

{"command":"disconnect","type":"request","arguments":{"terminateDebuggee":true},"seq":9} <-- Content-Length: 81

Hide Details

{"command":"disconnect","request_seq":9,"seq":0,"success":true,"type":"response"}

Hide Details

========= END ========= ========= DEBUG ADAPTER PROTOCOL LOGS ========= --> Content-Length: 284

Hide Details

{"command":"initialize","type":"request","arguments":{"adapterID":"lldb-native","clientID":"vscode","columnsStartAt1":true,"linesStartAt1":true,"locale":"en-us","pathFormat":"path","supportsRunInTerminalRequest":true,"supportsVariablePaging":true,"supportsVariableType":true},"seq":1} <-- Content-Length: 1222

Hide Details

{"body":{"exceptionBreakpointFilters":[{"default":false,"filter":"cpp_catch","label":"C++ Catch"},{"default":false,"filter":"cpp_throw","label":"C++ Throw"},{"default":false,"filter":"objc_catch","label":"Objective C Catch"},{"default":false,"filter":"objc_throw","label":"Objective C Throw"},{"default":false,"filter":"swift_catch","label":"Swift Catch"},{"default":false,"filter":"swift_throw","label":"Swift Throw"}],"supportTerminateDebuggee":true,"supportsCompletionsRequest":false,"supportsConditionalBreakpoints":true,"supportsConfigurationDoneRequest":true,"supportsDelayedStackTraceLoading":true,"supportsEvaluateForHovers":true,"supportsExceptionInfoRequest":true,"supportsExceptionOptions":true,"supportsFunctionBreakpoints":true,"supportsGotoTargetsRequest":false,"supportsHitConditionalBreakpoints":true,"supportsLoadedSourcesRequest":false,"supportsModulesRequest":false,"supportsProgressReporting":true,"supportsRestartFrame":false,"supportsRestartRequest":false,"supportsRunInTerminalRequest":true,"supportsSetVariable":true,"supportsStepBack":false,"supportsStepInTargetsRequest":false,"supportsValueFormattingOptions":true},"command":"initialize","request_seq":1,"seq":0,"success":true,"type":"response"} --> Content-Length: 927

Hide Details

{"command":"launch","type":"request","arguments":{"program":"/Users/buildslave/jenkins/workspace/lldb-cmake-standalone/lldb-xcode-build/lldb-test-build.noindex/tools/lldb-vscode/launch/TestVSCode_launch.test_cwd/a.out","cwd":"/Users/buildslave/jenkins/workspace/lldb-cmake-standalone/lldb-xcode-build/lldb-test-build.noindex/tools/lldb-vscode/launch","disableASLR":true,"initCommands":["settings clear -all","settings set symbols.enable-external-lookup false","settings set target.inherit-tcc true","settings set target.detach-on-error false","settings set target.auto-apply-fixits false","settings set plugin.process.gdb-remote.packet-timeout 60","settings set symbols.clang-modules-cache-path \"/Users/buildslave/jenkins/workspace/lldb-cmake-standalone/lldb-xcode-build/lldb-test-build.noindex/module-cache-lldb/lldb-api\"","settings set use-color false","setting set target.prefer-dynamic-value no-dynamic-values"]},"seq":2} <-- Content-Length: 691

Hide Details

{"body":{"category":"console","output":"Running initCommands:\n(lldb) settings clear -all\n(lldb) settings set symbols.enable-external-lookup false\n(lldb) settings set target.inherit-tcc true\n(lldb) settings set target.detach-on-error false\n(lldb) settings set target.auto-apply-fixits false\n(lldb) settings set plugin.process.gdb-remote.packet-timeout 60\n(lldb) settings set symbols.clang-modules-cache-path \"/Users/buildslave/jenkins/workspace/lldb-cmake-standalone/lldb-xcode-build/lldb-test-build.noindex/module-cache-lldb/lldb-api\"\n(lldb) settings set use-color false\n(lldb) setting set target.prefer-dynamic-value no-dynamic-values\n"},"event":"output","seq":0,"type":"event"} <-- Content-Length: 77

Hide Details

{"command":"launch","request_seq":2,"seq":0,"success":true,"type":"response"} <-- Content-Length: 286

Hide Details

{"body":{"isLocalProcess":true,"name":"/Users/buildslave/jenkins/workspace/lldb-cmake-standalone/lldb-xcode-build/lldb-test-build.noindex/tools/lldb-vscode/launch/TestVSCode_launch.test_cwd/a.out","startMethod":"launch","systemProcessId":76536},"event":"process","seq":0,"type":"event"} <-- Content-Length: 46

Hide Details

{"event":"initialized","seq":0,"type":"event"} --> Content-Length: 71

Hide Details

{"command":"configurationDone","type":"request","arguments":{},"seq":3} <-- Content-Length: 88

Hide Details

{"command":"configurationDone","request_seq":3,"seq":0,"success":true,"type":"response"} <-- Content-Length: 1135

Hide Details

{"body":{"category":"stdout","output":"arg[0] = \"/Users/buildslave/jenkins/workspace/lldb-cmake-standalone/lldb-xcode-build/lldb-test-build.noindex/tools/lldb-vscode/launch/TestVSCode_launch.test_cwd/a.out\"\r\nenv[0] = \"LLVM_LIBS_DIR=/Users/buildslave/jenkins/workspace/lldb-cmake-standalone/clang-build/./lib\"\r\nenv[1] = \"LLDBVSCODE_LOG=/Users/buildslave/jenkins/workspace/lldb-cmake-standalone/lldb-xcode-build/lldb-test-build.noindex/tools/lldb-vscode/launch/TestVSCode_launch.test_cwd/vscode.txt\"\r\nenv[2] = \"LLDB_SRC=/Users/buildslave/jenkins/workspace/lldb-cmake-standalone/llvm-project/lldb\"\r\nenv[3] = \"LLDBVSCODE_EXEC=/Users/buildslave/jenkins/workspace/lldb-cmake-standalone/lldb-xcode-build/Release/bin/lldb-vscode\"\r\nenv[4] = \"OS_ACTIVITY_DT_MODE=enable\"\r\nenv[5] = \"LLDB_FRAMEWORK=/Users/buildslave/jenkins/workspace/lldb-cmake-standalone/lldb-xcode-build/Release/bin/LLDB.framework\"\r\nenv[6] = \"PATH=/Applications/Xcode.app/Contents/Developer/Toolchains/XcodeDefault.xctoolchain/usr/bin:/Applications/Xcode.app/Contents/Developer/Toolchains/XcodeDefault.xct"},"event":"output","seq":0,"type":"event"} <-- Content-Length: 1134

Hide Details

{"body":{"category":"stdout","output":"oolchain/usr/local/bin:/Applications/Xcode.app/Contents/Developer/Toolchains/XcodeDefault.xctoolchain/usr/libexec:/Applications/Xcode.app/Contents/Developer/Platforms/MacOSX.platform/Developer/usr/bin:/Applications/Xcode.app/Contents/Developer/Platforms/MacOSX.platform/Developer/usr/local/bin:/Applications/Xcode.app/Contents/Developer/Platforms/MacOSX.platform/usr/bin:/Applications/Xcode.app/Contents/Developer/Platforms/MacOSX.platform/usr/local/bin:/Applications/Xcode.app/Contents/Developer/usr/bin:/Applications/Xcode.app/Contents/Developer/usr/local/bin:/Applications/Xcode.app/Contents/Developer/Tools:/usr/local/bin:/usr/local/sbin:/usr/bin:/bin:/usr/sbin:/sbin\"\r\nenv[7] = \"__CF_USER_TEXT_ENCODING=0x1F5:0x0:0x0\"\r\nenv[8] = \"TMPDIR=/var/folders/09/r4vw4v8n5kb67jl66zvlbljw0000gn/T/\"\r\nenv[9] = \"LC_CTYPE=UTF-8\"\r\nenv[10] = \"__PYVENV_LAUNCHER__=/usr/local/Cellar/python/3.7.0/Frameworks/Python.framework/Versions/3.7/bin/python3.7\"\r\nenv[11] = \"TERM=vt100\"\r\nenv[12] = \"LLVM_DISABLE_CRASH_REPORT=1\"\r\nenv[13] = \"LLDB_TEST"},"event":"output","seq":0,"type":"event"} <-- Content-Length: 332

Hide Details

{"body":{"category":"stdout","output":"=/Users/buildslave/jenkins/workspace/lldb-cmake-standalone/llvm-project/lldb/packages/Python/lldbsuite/test\"\r\ncwd = \"/Users/buildslave/jenkins/workspace/lldb-cmake-standalone/lldb-xcode-build/lldb-test-build.noindex/tools/lldb-vscode/launch\"\r\n"},"event":"output","seq":0,"type":"event"} <-- Content-Length: 63

Hide Details

{"body":{"exitCode":0},"event":"exited","seq":0,"type":"event"} <-- Content-Length: 45

Hide Details

{"event":"terminated","seq":0,"type":"event"} --> Content-Length: 88

Hide Details

{"command":"disconnect","type":"request","arguments":{"terminateDebuggee":true},"seq":4} <-- Content-Length: 81

Hide Details

{"command":"disconnect","request_seq":4,"seq":0,"success":true,"type":"response"}

Hide Details

========= END ========= ========= DEBUG ADAPTER PROTOCOL LOGS ========= --> Content-Length: 284

Hide Details

{"command":"initialize","type":"request","arguments":{"adapterID":"lldb-native","clientID":"vscode","columnsStartAt1":true,"linesStartAt1":true,"locale":"en-us","pathFormat":"path","supportsRunInTerminalRequest":true,"supportsVariablePaging":true,"supportsVariableType":true},"seq":1} <-- Content-Length: 1222

Hide Details

{"body":{"exceptionBreakpointFilters":[{"default":false,"filter":"cpp_catch","label":"C++ Catch"},{"default":false,"filter":"cpp_throw","label":"C++ Throw"},{"default":false,"filter":"objc_catch","label":"Objective C Catch"},{"default":false,"filter":"objc_throw","label":"Objective C Throw"},{"default":false,"filter":"swift_catch","label":"Swift Catch"},{"default":false,"filter":"swift_throw","label":"Swift Throw"}],"supportTerminateDebuggee":true,"supportsCompletionsRequest":false,"supportsConditionalBreakpoints":true,"supportsConfigurationDoneRequest":true,"supportsDelayedStackTraceLoading":true,"supportsEvaluateForHovers":true,"supportsExceptionInfoRequest":true,"supportsExceptionOptions":true,"supportsFunctionBreakpoints":true,"supportsGotoTargetsRequest":false,"supportsHitConditionalBreakpoints":true,"supportsLoadedSourcesRequest":false,"supportsModulesRequest":false,"supportsProgressReporting":true,"supportsRestartFrame":false,"supportsRestartRequest":false,"supportsRunInTerminalRequest":true,"supportsSetVariable":true,"supportsStepBack":false,"supportsStepInTargetsRequest":false,"supportsValueFormattingOptions":true},"command":"initialize","request_seq":1,"seq":0,"success":true,"type":"response"} --> Content-Length: 978

Hide Details

{"command":"launch","type":"request","arguments":{"program":"/Users/buildslave/jenkins/workspace/lldb-cmake-standalone/lldb-xcode-build/lldb-test-build.noindex/tools/lldb-vscode/launch/TestVSCode_launch.test_debuggerRoot/a.out","disableASLR":true,"initCommands":["settings clear -all","settings set symbols.enable-external-lookup false","settings set target.inherit-tcc true","settings set target.detach-on-error false","settings set target.auto-apply-fixits false","settings set plugin.process.gdb-remote.packet-timeout 60","settings set symbols.clang-modules-cache-path \"/Users/buildslave/jenkins/workspace/lldb-cmake-standalone/lldb-xcode-build/lldb-test-build.noindex/module-cache-lldb/lldb-api\"","settings set use-color false","setting set target.prefer-dynamic-value no-dynamic-values","platform shell echo cwd = $PWD"],"debuggerRoot":"/Users/buildslave/jenkins/workspace/lldb-cmake-standalone/lldb-xcode-build/lldb-test-build.noindex/tools/lldb-vscode/launch"},"seq":2} <-- Content-Length: 861

Hide Details

{"body":{"category":"console","output":"Running initCommands:\n(lldb) settings clear -all\n(lldb) settings set symbols.enable-external-lookup false\n(lldb) settings set target.inherit-tcc true\n(lldb) settings set target.detach-on-error false\n(lldb) settings set target.auto-apply-fixits false\n(lldb) settings set plugin.process.gdb-remote.packet-timeout 60\n(lldb) settings set symbols.clang-modules-cache-path \"/Users/buildslave/jenkins/workspace/lldb-cmake-standalone/lldb-xcode-build/lldb-test-build.noindex/module-cache-lldb/lldb-api\"\n(lldb) settings set use-color false\n(lldb) setting set target.prefer-dynamic-value no-dynamic-values\n(lldb) platform shell echo cwd = $PWD\ncwd = /Users/buildslave/jenkins/workspace/lldb-cmake-standalone/lldb-xcode-build/lldb-test-build.noindex/tools/lldb-vscode/launch\n"},"event":"output","seq":0,"type":"event"} <-- Content-Length: 77

Hide Details

{"command":"launch","request_seq":2,"seq":0,"success":true,"type":"response"} <-- Content-Length: 295

Hide Details

{"body":{"isLocalProcess":true,"name":"/Users/buildslave/jenkins/workspace/lldb-cmake-standalone/lldb-xcode-build/lldb-test-build.noindex/tools/lldb-vscode/launch/TestVSCode_launch.test_debuggerRoot/a.out","startMethod":"launch","systemProcessId":76738},"event":"process","seq":0,"type":"event"} <-- Content-Length: 46

Hide Details

{"event":"initialized","seq":0,"type":"event"} --> Content-Length: 71

Hide Details

{"command":"configurationDone","type":"request","arguments":{},"seq":3} <-- Content-Length: 88

Hide Details

{"command":"configurationDone","request_seq":3,"seq":0,"success":true,"type":"response"} <-- Content-Length: 1135

Hide Details

{"body":{"category":"stdout","output":"arg[0] = \"/Users/buildslave/jenkins/workspace/lldb-cmake-standalone/lldb-xcode-build/lldb-test-build.noindex/tools/lldb-vscode/launch/TestVSCode_launch.test_debuggerRoot/a.out\"\r\nenv[0] = \"LLVM_LIBS_DIR=/Users/buildslave/jenkins/workspace/lldb-cmake-standalone/clang-build/./lib\"\r\nenv[1] = \"LLDBVSCODE_LOG=/Users/buildslave/jenkins/workspace/lldb-cmake-standalone/lldb-xcode-build/lldb-test-build.noindex/tools/lldb-vscode/launch/TestVSCode_launch.test_debuggerRoot/vscode.txt\"\r\nenv[2] = \"LLDB_SRC=/Users/buildslave/jenkins/workspace/lldb-cmake-standalone/llvm-project/lldb\"\r\nenv[3] = \"LLDBVSCODE_EXEC=/Users/buildslave/jenkins/workspace/lldb-cmake-standalone/lldb-xcode-build/Release/bin/lldb-vscode\"\r\nenv[4] = \"OS_ACTIVITY_DT_MODE=enable\"\r\nenv[5] = \"LLDB_FRAMEWORK=/Users/buildslave/jenkins/workspace/lldb-cmake-standalone/lldb-xcode-build/Release/bin/LLDB.framework\"\r\nenv[6] = \"PATH=/Applications/Xcode.app/Contents/Developer/Toolchains/XcodeDefault.xctoolchain/usr/bin:/Applications/Xcode.app/Contents/Developer/Toolchain"},"event":"output","seq":0,"type":"event"} <-- Content-Length: 1134

Hide Details

{"body":{"category":"stdout","output":"s/XcodeDefault.xctoolchain/usr/local/bin:/Applications/Xcode.app/Contents/Developer/Toolchains/XcodeDefault.xctoolchain/usr/libexec:/Applications/Xcode.app/Contents/Developer/Platforms/MacOSX.platform/Developer/usr/bin:/Applications/Xcode.app/Contents/Developer/Platforms/MacOSX.platform/Developer/usr/local/bin:/Applications/Xcode.app/Contents/Developer/Platforms/MacOSX.platform/usr/bin:/Applications/Xcode.app/Contents/Developer/Platforms/MacOSX.platform/usr/local/bin:/Applications/Xcode.app/Contents/Developer/usr/bin:/Applications/Xcode.app/Contents/Developer/usr/local/bin:/Applications/Xcode.app/Contents/Developer/Tools:/usr/local/bin:/usr/local/sbin:/usr/bin:/bin:/usr/sbin:/sbin\"\r\nenv[7] = \"__CF_USER_TEXT_ENCODING=0x1F5:0x0:0x0\"\r\r\nenv[8] = \"TMPDIR=/var/folders/09/r4vw4v8n5kb67jl66zvlbljw0000gn/T/\"\r\nenv[9] = \"LC_CTYPE=UTF-8\"\r\nenv[10] = \"__PYVENV_LAUNCHER__=/usr/local/Cellar/python/3.7.0/Frameworks/Python.framework/Versions/3.7/bin/python3.7\"\r\nenv[11] = \"TERM=vt100\"\r\nenv[12] = \"LLVM_DISABLE_CRASH_REPORT=1\"\r\ne"},"event":"output","seq":0,"type":"event"} <-- Content-Length: 352

Hide Details

{"body":{"category":"stdout","output":"nv[13] = \"LLDB_TEST=/Users/buildslave/jenkins/workspace/lldb-cmake-standalone/llvm-project/lldb/packages/Python/lldbsuite/test\"\r\ncwd = \"/Users/buildslave/jenkins/workspace/lldb-cmake-standalone/lldb-xcode-build/lldb-test-build.noindex/tools/lldb-vscode/launch\"\r\n"},"event":"output","seq":0,"type":"event"} <-- Content-Length: 63

Hide Details

{"body":{"exitCode":0},"event":"exited","seq":0,"type":"event"} <-- Content-Length: 45

Hide Details

{"event":"terminated","seq":0,"type":"event"} --> Content-Length: 88

Hide Details

{"command":"disconnect","type":"request","arguments":{"terminateDebuggee":true},"seq":4} <-- Content-Length: 81

Hide Details

{"command":"disconnect","request_seq":4,"seq":0,"success":true,"type":"response"}

Hide Details

========= END ========= ========= DEBUG ADAPTER PROTOCOL LOGS ========= --> Content-Length: 284

Hide Details

{"command":"initialize","type":"request","arguments":{"adapterID":"lldb-native","clientID":"vscode","columnsStartAt1":true,"linesStartAt1":true,"locale":"en-us","pathFormat":"path","supportsRunInTerminalRequest":true,"supportsVariablePaging":true,"supportsVariableType":true},"seq":1} <-- Content-Length: 1222

Hide Details

{"body":{"exceptionBreakpointFilters":[{"default":false,"filter":"cpp_catch","label":"C++ Catch"},{"default":false,"filter":"cpp_throw","label":"C++ Throw"},{"default":false,"filter":"objc_catch","label":"Objective C Catch"},{"default":false,"filter":"objc_throw","label":"Objective C Throw"},{"default":false,"filter":"swift_catch","label":"Swift Catch"},{"default":false,"filter":"swift_throw","label":"Swift Throw"}],"supportTerminateDebuggee":true,"supportsCompletionsRequest":false,"supportsConditionalBreakpoints":true,"supportsConfigurationDoneRequest":true,"supportsDelayedStackTraceLoading":true,"supportsEvaluateForHovers":true,"supportsExceptionInfoRequest":true,"supportsExceptionOptions":true,"supportsFunctionBreakpoints":true,"supportsGotoTargetsRequest":false,"supportsHitConditionalBreakpoints":true,"supportsLoadedSourcesRequest":false,"supportsModulesRequest":false,"supportsProgressReporting":true,"supportsRestartFrame":false,"supportsRestartRequest":false,"supportsRunInTerminalRequest":true,"supportsSetVariable":true,"supportsStepBack":false,"supportsStepInTargetsRequest":false,"supportsValueFormattingOptions":true},"command":"initialize","request_seq":1,"seq":0,"success":true,"type":"response"} --> Content-Length: 824

Hide Details

{"command":"launch","type":"request","arguments":{"program":"/Users/buildslave/jenkins/workspace/lldb-cmake-standalone/lldb-xcode-build/lldb-test-build.noindex/tools/lldb-vscode/launch/TestVSCode_launch.test_disableSTDIO/a.out","disableASLR":true,"disableSTDIO":true,"initCommands":["settings clear -all","settings set symbols.enable-external-lookup false","settings set target.inherit-tcc true","settings set target.detach-on-error false","settings set target.auto-apply-fixits false","settings set plugin.process.gdb-remote.packet-timeout 60","settings set symbols.clang-modules-cache-path \"/Users/buildslave/jenkins/workspace/lldb-cmake-standalone/lldb-xcode-build/lldb-test-build.noindex/module-cache-lldb/lldb-api\"","settings set use-color false","setting set target.prefer-dynamic-value no-dynamic-values"]},"seq":2} <-- Content-Length: 691

Hide Details

{"body":{"category":"console","output":"Running initCommands:\n(lldb) settings clear -all\n(lldb) settings set symbols.enable-external-lookup false\n(lldb) settings set target.inherit-tcc true\n(lldb) settings set target.detach-on-error false\n(lldb) settings set target.auto-apply-fixits false\n(lldb) settings set plugin.process.gdb-remote.packet-timeout 60\n(lldb) settings set symbols.clang-modules-cache-path \"/Users/buildslave/jenkins/workspace/lldb-cmake-standalone/lldb-xcode-build/lldb-test-build.noindex/module-cache-lldb/lldb-api\"\n(lldb) settings set use-color false\n(lldb) setting set target.prefer-dynamic-value no-dynamic-values\n"},"event":"output","seq":0,"type":"event"} <-- Content-Length: 77

Hide Details

{"command":"launch","request_seq":2,"seq":0,"success":true,"type":"response"} <-- Content-Length: 295

Hide Details

{"body":{"isLocalProcess":true,"name":"/Users/buildslave/jenkins/workspace/lldb-cmake-standalone/lldb-xcode-build/lldb-test-build.noindex/tools/lldb-vscode/launch/TestVSCode_launch.test_disableSTDIO/a.out","startMethod":"launch","systemProcessId":76929},"event":"process","seq":0,"type":"event"} <-- Content-Length: 46

Hide Details

{"event":"initialized","seq":0,"type":"event"} --> Content-Length: 71

Hide Details

{"command":"configurationDone","type":"request","arguments":{},"seq":3} <-- Content-Length: 88

Hide Details

{"command":"configurationDone","request_seq":3,"seq":0,"success":true,"type":"response"} <-- Content-Length: 63

Hide Details

{"body":{"exitCode":0},"event":"exited","seq":0,"type":"event"} <-- Content-Length: 45

Hide Details

{"event":"terminated","seq":0,"type":"event"} --> Content-Length: 88

Hide Details

{"command":"disconnect","type":"request","arguments":{"terminateDebuggee":true},"seq":4} <-- Content-Length: 81

Hide Details

{"command":"disconnect","request_seq":4,"seq":0,"success":true,"type":"response"}

Hide Details

========= END ========= ========= DEBUG ADAPTER PROTOCOL LOGS ========= --> Content-Length: 284

Hide Details

{"command":"initialize","type":"request","arguments":{"adapterID":"lldb-native","clientID":"vscode","columnsStartAt1":true,"linesStartAt1":true,"locale":"en-us","pathFormat":"path","supportsRunInTerminalRequest":true,"supportsVariablePaging":true,"supportsVariableType":true},"seq":1} <-- Content-Length: 1222

Hide Details

{"body":{"exceptionBreakpointFilters":[{"default":false,"filter":"cpp_catch","label":"C++ Catch"},{"default":false,"filter":"cpp_throw","label":"C++ Throw"},{"default":false,"filter":"objc_catch","label":"Objective C Catch"},{"default":false,"filter":"objc_throw","label":"Objective C Throw"},{"default":false,"filter":"swift_catch","label":"Swift Catch"},{"default":false,"filter":"swift_throw","label":"Swift Throw"}],"supportTerminateDebuggee":true,"supportsCompletionsRequest":false,"supportsConditionalBreakpoints":true,"supportsConfigurationDoneRequest":true,"supportsDelayedStackTraceLoading":true,"supportsEvaluateForHovers":true,"supportsExceptionInfoRequest":true,"supportsExceptionOptions":true,"supportsFunctionBreakpoints":true,"supportsGotoTargetsRequest":false,"supportsHitConditionalBreakpoints":true,"supportsLoadedSourcesRequest":false,"supportsModulesRequest":false,"supportsProgressReporting":true,"supportsRestartFrame":false,"supportsRestartRequest":false,"supportsRunInTerminalRequest":true,"supportsSetVariable":true,"supportsStepBack":false,"supportsStepInTargetsRequest":false,"supportsValueFormattingOptions":true},"command":"initialize","request_seq":1,"seq":0,"success":true,"type":"response"} --> Content-Length: 874

Hide Details

{"command":"launch","type":"request","arguments":{"program":"/Users/buildslave/jenkins/workspace/lldb-cmake-standalone/lldb-xcode-build/lldb-test-build.noindex/tools/lldb-vscode/launch/TestVSCode_launch.test_environment/a.out","env":["NO_VALUE","WITH_VALUE=BAR","EMPTY_VALUE=","SPACE=Hello World"],"disableASLR":true,"initCommands":["settings clear -all","settings set symbols.enable-external-lookup false","settings set target.inherit-tcc true","settings set target.detach-on-error false","settings set target.auto-apply-fixits false","settings set plugin.process.gdb-remote.packet-timeout 60","settings set symbols.clang-modules-cache-path \"/Users/buildslave/jenkins/workspace/lldb-cmake-standalone/lldb-xcode-build/lldb-test-build.noindex/module-cache-lldb/lldb-api\"","settings set use-color false","setting set target.prefer-dynamic-value no-dynamic-values"]},"seq":2} <-- Content-Length: 691

Hide Details

{"body":{"category":"console","output":"Running initCommands:\n(lldb) settings clear -all\n(lldb) settings set symbols.enable-external-lookup false\n(lldb) settings set target.inherit-tcc true\n(lldb) settings set target.detach-on-error false\n(lldb) settings set target.auto-apply-fixits false\n(lldb) settings set plugin.process.gdb-remote.packet-timeout 60\n(lldb) settings set symbols.clang-modules-cache-path \"/Users/buildslave/jenkins/workspace/lldb-cmake-standalone/lldb-xcode-build/lldb-test-build.noindex/module-cache-lldb/lldb-api\"\n(lldb) settings set use-color false\n(lldb) setting set target.prefer-dynamic-value no-dynamic-values\n"},"event":"output","seq":0,"type":"event"} <-- Content-Length: 77

Hide Details

{"command":"launch","request_seq":2,"seq":0,"success":true,"type":"response"} <-- Content-Length: 294

Hide Details

{"body":{"isLocalProcess":true,"name":"/Users/buildslave/jenkins/workspace/lldb-cmake-standalone/lldb-xcode-build/lldb-test-build.noindex/tools/lldb-vscode/launch/TestVSCode_launch.test_environment/a.out","startMethod":"launch","systemProcessId":77101},"event":"process","seq":0,"type":"event"} <-- Content-Length: 46

Hide Details

{"event":"initialized","seq":0,"type":"event"} --> Content-Length: 71

Hide Details

{"command":"configurationDone","type":"request","arguments":{},"seq":3} <-- Content-Length: 88

Hide Details

{"command":"configurationDone","request_seq":3,"seq":0,"success":true,"type":"response"} <-- Content-Length: 1139

Hide Details

{"body":{"category":"stdout","output":"arg[0] = \"/Users/buildslave/jenkins/workspace/lldb-cmake-standalone/lldb-xcode-build/lldb-test-build.noindex/tools/lldb-vscode/launch/TestVSCode_launch.test_environment/a.out\"\r\nenv[0] = \"LLVM_LIBS_DIR=/Users/buildslave/jenkins/workspace/lldb-cmake-standalone/clang-build/./lib\"\r\nenv[1] = \"LLDBVSCODE_LOG=/Users/buildslave/jenkins/workspace/lldb-cmake-standalone/lldb-xcode-build/lldb-test-build.noindex/tools/lldb-vscode/launch/TestVSCode_launch.test_environment/vscode.txt\"\r\nenv[2] = \"LLDB_SRC=/Users/buildslave/jenkins/workspace/lldb-cmake-standalone/llvm-project/lldb\"\r\nenv[3] = \"LLDBVSCODE_EXEC=/Users/buildslave/jenkins/workspace/lldb-cmake-standalone/lldb-xcode-build/Release/bin/lldb-vscode\"\r\nenv[4] = \"OS_ACTIVITY_DT_MODE=enable\"\r\nenv[5] = \"LLDB_FRAMEWORK=/Users/buildslave/jenkins/workspace/lldb-cmake-standalone/lldb-xcode-build/Release/bin/LLDB.framework\"\r\nenv[6] = \"EMPTY_VALUE=\"\r\nenv[7] = \"PATH=/Applications/Xcode.app/Contents/Developer/Toolchains/XcodeDefault.xctoolchain/usr/bin:/Applications/Xcode.app/Conte"},"event":"output","seq":0,"type":"event"} <-- Content-Length: 1130

Hide Details

{"body":{"category":"stdout","output":"nts/Developer/Toolchains/XcodeDefault.xctoolchain/usr/local/bin:/Applications/Xcode.app/Contents/Developer/Toolchains/XcodeDefault.xctoolchain/usr/libexec:/Applications/Xcode.app/Contents/Developer/Platforms/MacOSX.platform/Developer/usr/bin:/Applications/Xcode.app/Contents/Developer/Platforms/MacOSX.platform/Developer/usr/local/bin:/Applications/Xcode.app/Contents/Developer/Platforms/MacOSX.platform/usr/bin:/Applications/Xcode.app/Contents/Developer/Platforms/MacOSX.platform/usr/local/bin:/Applications/Xcode.app/Contents/Developer/usr/bin:/Applications/Xcode.app/Contents/Developer/usr/local/bin:/Applications/Xcode.app/Contents/Developer/Tools:/usr/local/bin:/usr/local/sbin:/usr/bin:/bin:/usr/sbin:/sbin\"\r\nenv[8] = \"__CF_USER_TEXT_ENCODING=0x1F5:0x0:0x0\"\r\nenv[9] = \"TMPDIR=/var/folders/09/r4vw4v8n5kb67jl66zvlbljw0000gn/T/\"\r\nenv[10] = \"SPACE=Hello World\"\r\nenv[11] = \"LC_CTYPE=UTF-8\"\r\nenv[12] = \"__PYVENV_LAUNCHER__=/usr/local/Cellar/python/3.7.0/Frameworks/Python.framework/Versions/3.7/bin/python3.7\"\r\nenv[13] = \"T"},"event":"output","seq":0,"type":"event"} <-- Content-Length: 458

Hide Details

{"body":{"category":"stdout","output":"ERM=vt100\"\r\nenv[14] = \"LLVM_DISABLE_CRASH_REPORT=1\"\r\nenv[15] = \"NO_VALUE=\"\r\nenv[16] = \"WITH_VALUE=BAR\"\r\nenv[17] = \"LLDB_TEST=/Users/buildslave/jenkins/workspace/lldb-cmake-standalone/llvm-project/lldb/packages/Python/lldbsuite/test\"\r\ncwd = \"/Users/buildslave/jenkins/workspace/lldb-cmake-standalone/llvm-project/lldb/test/API/tools/lldb-vscode/launch\"\r\n"},"event":"output","seq":0,"type":"event"} <-- Content-Length: 63

Hide Details

{"body":{"exitCode":0},"event":"exited","seq":0,"type":"event"} <-- Content-Length: 45

Hide Details

{"event":"terminated","seq":0,"type":"event"} --> Content-Length: 88

Hide Details

{"command":"disconnect","type":"request","arguments":{"terminateDebuggee":true},"seq":4} <-- Content-Length: 81

Hide Details

{"command":"disconnect","request_seq":4,"seq":0,"success":true,"type":"response"}

Hide Details

========= END ========= ========= DEBUG ADAPTER PROTOCOL LOGS ========= --> Content-Length: 284

Hide Details

{"command":"initialize","type":"request","arguments":{"adapterID":"lldb-native","clientID":"vscode","columnsStartAt1":true,"linesStartAt1":true,"locale":"en-us","pathFormat":"path","supportsRunInTerminalRequest":true,"supportsVariablePaging":true,"supportsVariableType":true},"seq":1} <-- Content-Length: 1222

Hide Details

{"body":{"exceptionBreakpointFilters":[{"default":false,"filter":"cpp_catch","label":"C++ Catch"},{"default":false,"filter":"cpp_throw","label":"C++ Throw"},{"default":false,"filter":"objc_catch","label":"Objective C Catch"},{"default":false,"filter":"objc_throw","label":"Objective C Throw"},{"default":false,"filter":"swift_catch","label":"Swift Catch"},{"default":false,"filter":"swift_throw","label":"Swift Throw"}],"supportTerminateDebuggee":true,"supportsCompletionsRequest":false,"supportsConditionalBreakpoints":true,"supportsConfigurationDoneRequest":true,"supportsDelayedStackTraceLoading":true,"supportsEvaluateForHovers":true,"supportsExceptionInfoRequest":true,"supportsExceptionOptions":true,"supportsFunctionBreakpoints":true,"supportsGotoTargetsRequest":false,"supportsHitConditionalBreakpoints":true,"supportsLoadedSourcesRequest":false,"supportsModulesRequest":false,"supportsProgressReporting":true,"supportsRestartFrame":false,"supportsRestartRequest":false,"supportsRunInTerminalRequest":true,"supportsSetVariable":true,"supportsStepBack":false,"supportsStepInTargetsRequest":false,"supportsValueFormattingOptions":true},"command":"initialize","request_seq":1,"seq":0,"success":true,"type":"response"} --> Content-Length: 1296

Hide Details

{"command":"launch","type":"request","arguments":{"program":"/Users/buildslave/jenkins/workspace/lldb-cmake-standalone/lldb-xcode-build/lldb-test-build.noindex/tools/lldb-vscode/launch/TestVSCode_launch.test_extra_launch_commands/a.out","disableASLR":true,"initCommands":["settings clear -all","settings set symbols.enable-external-lookup false","settings set target.inherit-tcc true","settings set target.detach-on-error false","settings set target.auto-apply-fixits false","settings set plugin.process.gdb-remote.packet-timeout 60","settings set symbols.clang-modules-cache-path \"/Users/buildslave/jenkins/workspace/lldb-cmake-standalone/lldb-xcode-build/lldb-test-build.noindex/module-cache-lldb/lldb-api\"","settings set use-color false","setting set target.prefer-dynamic-value no-dynamic-values","target list","platform list"],"preRunCommands":["image list a.out","image dump sections a.out"],"stopCommands":["frame variable","bt"],"exitCommands":["expr 2+3","expr 3+4"],"launchCommands":["target create \"/Users/buildslave/jenkins/workspace/lldb-cmake-standalone/lldb-xcode-build/lldb-test-build.noindex/tools/lldb-vscode/launch/TestVSCode_launch.test_extra_launch_commands/a.out\"","breakpoint s -f main.c -l 11","breakpoint s -f main.c -l 14","process launch --stop-at-entry"]},"seq":2} <-- Content-Length: 1739

Hide Details

{"body":{"category":"console","output":"Running initCommands:\n(lldb) settings clear -all\n(lldb) settings set symbols.enable-external-lookup false\n(lldb) settings set target.inherit-tcc true\n(lldb) settings set target.detach-on-error false\n(lldb) settings set target.auto-apply-fixits false\n(lldb) settings set plugin.process.gdb-remote.packet-timeout 60\n(lldb) settings set symbols.clang-modules-cache-path \"/Users/buildslave/jenkins/workspace/lldb-cmake-standalone/lldb-xcode-build/lldb-test-build.noindex/module-cache-lldb/lldb-api\"\n(lldb) settings set use-color false\n(lldb) setting set target.prefer-dynamic-value no-dynamic-values\n(lldb) target list\nNo targets.\n(lldb) platform list\nAvailable platforms:\nhost: Local Mac OS X user platform plug-in.\nremote-linux: Remote Linux user platform plug-in.\nremote-android: Remote Android user platform plug-in.\nremote-freebsd: Remote FreeBSD user platform plug-in.\nremote-gdb-server: A platform that uses the GDB remote protocol as the communication transport.\nremote-ios: Remote iOS platform plug-in.\nremote-macosx: Remote Mac OS X user platform plug-in.\nios-simulator: iPhone simulator platform plug-in.\ntvos-simulator: tvOS simulator platform plug-in.\nwatchos-simulator: Apple Watch simulator platform plug-in.\ndarwin-kernel: Darwin Kernel platform plug-in.\nremote-tvos: Remote Apple TV platform plug-in.\nremote-watchos: Remote Apple Watch platform plug-in.\nremote-bridgeos: Remote BridgeOS platform plug-in.\nhost: Local Mac OS X user platform plug-in.\nremote-netbsd: Remote NetBSD user platform plug-in.\nremote-openbsd: Remote OpenBSD user platform plug-in.\nremote-windows: Remote Windows user platform plug-in.\n"},"event":"output","seq":0,"type":"event"} <-- Content-Length: 4155

Hide Details

{"body":{"category":"console","output":"Running preRunCommands:\n(lldb) image list a.out\n[ 0] 51102923-DEBB-3D90-9007-5E29DE8C0AA9 0x0000000100000000 /Users/buildslave/jenkins/workspace/lldb-cmake-standalone/lldb-xcode-build/lldb-test-build.noindex/tools/lldb-vscode/launch/TestVSCode_launch.test_extra_launch_commands/a.out \n /Users/buildslave/jenkins/workspace/lldb-cmake-standalone/lldb-xcode-build/lldb-test-build.noindex/tools/lldb-vscode/launch/TestVSCode_launch.test_extra_launch_commands/a.out.dSYM/Contents/Resources/DWARF/a.out\n(lldb) image dump sections a.out\nSections for '/Users/buildslave/jenkins/workspace/lldb-cmake-standalone/lldb-xcode-build/lldb-test-build.noindex/tools/lldb-vscode/launch/TestVSCode_launch.test_extra_launch_commands/a.out' (x86_64):\n SectID Type File Address Perm File Off. File Size Flags Section Name\n ---------- ---------------- --------------------------------------- ---- ---------- ---------- ---------- ----------------------------\n 0x00000100 container [0x0000000000000000-0x0000000100000000) --- 0x00000000 0x00000000 0x00000000 a.out.__PAGEZERO\n 0x00000200 container [0x0000000100000000-0x0000000100001000) r-x 0x00000000 0x00001000 0x00000000 a.out.__TEXT\n 0x00000001 code [0x0000000100000e70-0x0000000100000f48) r-x 0x00000e70 0x000000d8 0x80000400 a.out.__TEXT.__text\n 0x00000002 code [0x0000000100000f48-0x0000000100000f5a) r-x 0x00000f48 0x00000012 0x80000408 a.out.__TEXT.__stubs\n 0x00000003 code [0x0000000100000f5c-0x0000000100000f8a) r-x 0x00000f5c 0x0000002e 0x80000400 a.out.__TEXT.__stub_helper\n 0x00000004 data-cstr [0x0000000100000f8a-0x0000000100000fb6) r-x 0x00000f8a 0x0000002c 0x00000002 a.out.__TEXT.__cstring\n 0x00000005 compact-unwind [0x0000000100000fb8-0x0000000100001000) r-x 0x00000fb8 0x00000048 0x00000000 a.out.__TEXT.__unwind_info\n 0x00000300 container [0x0000000100001000-0x0000000100002000) rw- 0x00001000 0x00001000 0x00000010 a.out.__DATA_CONST\n 0x00000006 data-ptrs [0x0000000100001000-0x0000000100001008) rw- 0x00001000 0x00000008 0x00000006 a.out.__DATA_CONST.__got\n 0x00000400 container [0x0000000100002000-0x0000000100003000) rw- 0x00002000 0x00001000 0x00000000 a.out.__DATA\n 0x00000007 data-ptrs [0x0000000100002000-0x0000000100002018) rw- 0x00002000 0x00000018 0x00000007 a.out.__DATA.__la_symbol_ptr\n 0x00000008 data [0x0000000100002018-0x0000000100002020) rw- 0x00002018 0x00000008 0x00000000 a.out.__DATA.__data\n 0x00000500 container [0x0000000100003000-0x0000000100008000) r-- 0x00003000 0x00004ae0 0x00000000 a.out.__LINKEDIT\n 0x00000200 container [0x0000000100004000-0x0000000100005000) rw- 0x00002000 0x0000059f 0x00000000 a.out.__DWARF\n 0x00000001 dwarf-line [0x0000000100004000-0x0000000100004106) rw- 0x00002000 0x00000106 0x00000000 a.out.__DWARF.__debug_line\n 0x00000002 dwarf-aranges [0x0000000100004106-0x0000000100004136) rw- 0x00002106 0x00000030 0x00000000 a.out.__DWARF.__debug_aranges\n 0x00000003 dwarf-info [0x0000000100004136-0x0000000100004215) rw- 0x00002136 0x000000df 0x00000000 a.out.__DWARF.__debug_info\n 0x00000004 dwarf-abbrev [0x0000000100004215-0x0000000100004286) rw- 0x00002215 0x00000071 0x00000000 a.out.__DWARF.__debug_abbrev\n 0x00000005 dwarf-str [0x0000000100004286-0x00000001000044a9) rw- 0x00002286 0x00000223 0x00000000 a.out.__DWARF.__debug_str\n 0x00000006 apple-names [0x00000001000044a9-0x00000001000044e5) rw- 0x000024a9 0x0000003c 0x00000000 a.out.__DWARF.__apple_names\n 0x00000007 apple-namespaces [0x00000001000044e5-0x0000000100004509) rw- 0x000024e5 0x00000024 0x00000000 a.out.__DWARF.__apple_namespac\n 0x00000008 apple-types [0x0000000100004509-0x000000010000457b) rw- 0x00002509 0x00000072 0x00000000 a.out.__DWARF.__apple_types\n 0x00000009 apple-objc [0x000000010000457b-0x000000010000459f) rw- 0x0000257b 0x00000024 0x00000000 a.out.__DWARF.__apple_objc\n"},"event":"output","seq":0,"type":"event"} <-- Content-Length: 1018

Hide Details

{"body":{"category":"console","output":"Running launchCommands:\n(lldb) target create \"/Users/buildslave/jenkins/workspace/lldb-cmake-standalone/lldb-xcode-build/lldb-test-build.noindex/tools/lldb-vscode/launch/TestVSCode_launch.test_extra_launch_commands/a.out\"\nCurrent executable set to '/Users/buildslave/jenkins/workspace/lldb-cmake-standalone/lldb-xcode-build/lldb-test-build.noindex/tools/lldb-vscode/launch/TestVSCode_launch.test_extra_launch_commands/a.out' (x86_64).\n(lldb) breakpoint s -f main.c -l 11\nBreakpoint 1: where = a.out`main + 173 at main.c:11:28, address = 0x0000000100000f1d\n(lldb) breakpoint s -f main.c -l 14\nBreakpoint 2: where = a.out`main + 208 at main.c:14:3, address = 0x0000000100000f40\n(lldb) process launch --stop-at-entry\nProcess 77360 launched: '/Users/buildslave/jenkins/workspace/lldb-cmake-standalone/lldb-xcode-build/lldb-test-build.noindex/tools/lldb-vscode/launch/TestVSCode_launch.test_extra_launch_commands/a.out' (x86_64)\n"},"event":"output","seq":0,"type":"event"} <-- Content-Length: 77

Hide Details

{"command":"launch","request_seq":2,"seq":0,"success":true,"type":"response"} <-- Content-Length: 304

Hide Details

{"body":{"isLocalProcess":true,"name":"/Users/buildslave/jenkins/workspace/lldb-cmake-standalone/lldb-xcode-build/lldb-test-build.noindex/tools/lldb-vscode/launch/TestVSCode_launch.test_extra_launch_commands/a.out","startMethod":"launch","systemProcessId":77360},"event":"process","seq":0,"type":"event"} <-- Content-Length: 46

Hide Details

{"event":"initialized","seq":0,"type":"event"} --> Content-Length: 71

Hide Details

{"command":"configurationDone","type":"request","arguments":{},"seq":3} <-- Content-Length: 88

Hide Details

{"command":"configurationDone","request_seq":3,"seq":0,"success":true,"type":"response"} <-- Content-Length: 167

Hide Details

{"body":{"allThreadsStopped":true,"preserveFocusHint":false,"reason":"exception","threadCausedFocus":true,"threadId":4698113},"event":"stopped","seq":0,"type":"event"} <-- Content-Length: 234

Hide Details

{"body":{"category":"console","output":"Running stopCommands:\n(lldb) frame variable\n(lldb) bt\n* thread #1, stop reason = signal SIGSTOP\n * frame #0: 0x0000000100009000 dyld`_dyld_start\n"},"event":"output","seq":0,"type":"event"} --> Content-Length: 61

Hide Details

{"command":"threads","type":"request","arguments":{},"seq":4} <-- Content-Length: 133

Hide Details

{"body":{"threads":[{"id":4698113,"name":"Thread #1"}]},"command":"threads","request_seq":4,"seq":0,"success":true,"type":"response"} --> Content-Length: 80

Hide Details

{"command":"continue","type":"request","arguments":{"threadId":4698113},"seq":5} <-- Content-Length: 115

Hide Details

{"body":{"allThreadsContinued":true},"command":"continue","request_seq":5,"seq":0,"success":true,"type":"response"} <-- Content-Length: 1139

Hide Details

{"body":{"category":"stdout","output":"arg[0] = \"/Users/buildslave/jenkins/workspace/lldb-cmake-standalone/lldb-xcode-build/lldb-test-build.noindex/tools/lldb-vscode/launch/TestVSCode_launch.test_extra_launch_commands/a.out\"\r\nenv[0] = \"COLUMNS=80\"\r\nenv[1] = \"LLVM_LIBS_DIR=/Users/buildslave/jenkins/workspace/lldb-cmake-standalone/clang-build/./lib\"\r\nenv[2] = \"LLDBVSCODE_LOG=/Users/buildslave/jenkins/workspace/lldb-cmake-standalone/lldb-xcode-build/lldb-test-build.noindex/tools/lldb-vscode/launch/TestVSCode_launch.test_extra_launch_commands/vscode.txt\"\r\nenv[3] = \"LLDB_SRC=/Users/buildslave/jenkins/workspace/lldb-cmake-standalone/llvm-project/lldb\"\r\nenv[4] = \"LLDBVSCODE_EXEC=/Users/buildslave/jenkins/workspace/lldb-cmake-standalone/lldb-xcode-build/Release/bin/lldb-vscode\"\r\nenv[5] = \"OS_ACTIVITY_DT_MODE=enable\"\r\nenv[6] = \"LLDB_FRAMEWORK=/Users/buildslave/jenkins/workspace/lldb-cmake-standalone/lldb-xcode-build/Release/bin/LLDB.framework\"\r\nenv[7] = \"PATH=/Applications/Xcode.app/Contents/Developer/Toolchains/XcodeDefault.xctoolchain/usr/bin:/Applicatio"},"event":"output","seq":0,"type":"event"} <-- Content-Length: 1130

Hide Details

{"body":{"category":"stdout","output":"ns/Xcode.app/Contents/Developer/Toolchains/XcodeDefault.xctoolchain/usr/local/bin:/Applications/Xcode.app/Contents/Developer/Toolchains/XcodeDefault.xctoolchain/usr/libexec:/Applications/Xcode.app/Contents/Developer/Platforms/MacOSX.platform/Developer/usr/bin:/Applications/Xcode.app/Contents/Developer/Platforms/MacOSX.platform/Developer/usr/local/bin:/Applications/Xcode.app/Contents/Developer/Platforms/MacOSX.platform/usr/bin:/Applications/Xcode.app/Contents/Developer/Platforms/MacOSX.platform/usr/local/bin:/Applications/Xcode.app/Contents/Developer/usr/bin:/Applications/Xcode.app/Contents/Developer/usr/local/bin:/Applications/Xcode.app/Contents/Developer/Tools:/usr/local/bin:/usr/local/sbin:/usr/bin:/bin:/usr/sbin:/sbin\"\r\nenv[8] = \"__CF_USER_TEXT_ENCODING=0x1F5:0x0:0x0\"\r\r\nenv[9] = \"TMPDIR=/var/folders/09/r4vw4v8n5kb67jl66zvlbljw0000gn/T/\"\r\nenv[10] = \"LC_CTYPE=UTF-8\"\r\nenv[11] = \"__PYVENV_LAUNCHER__=/usr/local/Cellar/python/3.7.0/Frameworks/Python.framework/Versions/3.7/bin/python3.7\"\r\nenv[12] = \"TERM=vt100\"\r\n"},"event":"output","seq":0,"type":"event"} <-- Content-Length: 287

Hide Details

{"body":{"category":"stdout","output":"env[13] = \"LLVM_DISABLE_CRASH_REPORT=1\"\r\nenv[14] = \"LINES=24\"\r\nenv[15] = \"LLDB_TEST=/Users/buildslave/jenkins/workspace/lldb-cmake-standalone/llvm-project/lldb/packages/Python/lldbsuite/test\"\r\n"},"event":"output","seq":0,"type":"event"} <-- Content-Length: 199

Hide Details

{"body":{"allThreadsStopped":true,"description":"breakpoint 1.1","preserveFocusHint":false,"reason":"breakpoint","threadCausedFocus":true,"threadId":4698113},"event":"stopped","seq":0,"type":"event"} <-- Content-Length: 702

Hide Details

{"body":{"category":"console","output":"Running stopCommands:\n(lldb) frame variable\n(int) argc = 1\n(const char **) argv = 0x00007ffeefbff518\n(const char **) envp = 0x00007ffeefbff528\n(char *) cwd = 0x0000000101808200 \"/Users/buildslave/jenkins/workspace/lldb-cmake-standalone/llvm-project/lldb/test/API/tools/lldb-vscode/launch\"\n(lldb) bt\n* thread #1, queue = 'com.apple.main-thread', stop reason = breakpoint 1.1\n * frame #0: 0x0000000100000f1d a.out`main(argc=1, argv=0x00007ffeefbff518, envp=0x00007ffeefbff528) at main.c:11:28\n frame #1: 0x00007fff6fb97cc9 libdyld.dylib`start + 1\n frame #2: 0x00007fff6fb97cc9 libdyld.dylib`start + 1\n"},"event":"output","seq":0,"type":"event"} --> Content-Length: 61

Hide Details

{"command":"threads","type":"request","arguments":{},"seq":6} <-- Content-Length: 133

Hide Details

{"body":{"threads":[{"id":4698113,"name":"Thread #1"}]},"command":"threads","request_seq":6,"seq":0,"success":true,"type":"response"} --> Content-Length: 80

Hide Details

{"command":"continue","type":"request","arguments":{"threadId":4698113},"seq":7} <-- Content-Length: 115

Hide Details

{"body":{"allThreadsContinued":true},"command":"continue","request_seq":7,"seq":0,"success":true,"type":"response"} <-- Content-Length: 205

Hide Details

{"body":{"category":"stdout","output":"cwd = \"/Users/buildslave/jenkins/workspace/lldb-cmake-standalone/llvm-project/lldb/test/API/tools/lldb-vscode/launch\"\r\n"},"event":"output","seq":0,"type":"event"} <-- Content-Length: 199

Hide Details

{"body":{"allThreadsStopped":true,"description":"breakpoint 2.1","preserveFocusHint":false,"reason":"breakpoint","threadCausedFocus":true,"threadId":4698113},"event":"stopped","seq":0,"type":"event"} <-- Content-Length: 587

Hide Details

{"body":{"category":"console","output":"Running stopCommands:\n(lldb) frame variable\n(int) argc = 1\n(const char **) argv = 0x00007ffeefbff518\n(const char **) envp = 0x00007ffeefbff528\n(char *) cwd = 0x0000000000000000\n(lldb) bt\n* thread #1, queue = 'com.apple.main-thread', stop reason = breakpoint 2.1\n * frame #0: 0x0000000100000f40 a.out`main(argc=1, argv=0x00007ffeefbff518, envp=0x00007ffeefbff528) at main.c:14:3\n frame #1: 0x00007fff6fb97cc9 libdyld.dylib`start + 1\n frame #2: 0x00007fff6fb97cc9 libdyld.dylib`start + 1\n"},"event":"output","seq":0,"type":"event"} --> Content-Length: 88

Hide Details

{"command":"disconnect","type":"request","arguments":{"terminateDebuggee":true},"seq":8} <-- Content-Length: 45

Hide Details

{"event":"terminated","seq":0,"type":"event"} <-- Content-Length: 81

Hide Details

{"command":"disconnect","request_seq":8,"seq":0,"success":true,"type":"response"}

Hide Details

========= END ========= ========= DEBUG ADAPTER PROTOCOL LOGS ========= --> Content-Length: 284

Hide Details

{"command":"initialize","type":"request","arguments":{"adapterID":"lldb-native","clientID":"vscode","columnsStartAt1":true,"linesStartAt1":true,"locale":"en-us","pathFormat":"path","supportsRunInTerminalRequest":true,"supportsVariablePaging":true,"supportsVariableType":true},"seq":1} <-- Content-Length: 1222

Hide Details

{"body":{"exceptionBreakpointFilters":[{"default":false,"filter":"cpp_catch","label":"C++ Catch"},{"default":false,"filter":"cpp_throw","label":"C++ Throw"},{"default":false,"filter":"objc_catch","label":"Objective C Catch"},{"default":false,"filter":"objc_throw","label":"Objective C Throw"},{"default":false,"filter":"swift_catch","label":"Swift Catch"},{"default":false,"filter":"swift_throw","label":"Swift Throw"}],"supportTerminateDebuggee":true,"supportsCompletionsRequest":false,"supportsConditionalBreakpoints":true,"supportsConfigurationDoneRequest":true,"supportsDelayedStackTraceLoading":true,"supportsEvaluateForHovers":true,"supportsExceptionInfoRequest":true,"supportsExceptionOptions":true,"supportsFunctionBreakpoints":true,"supportsGotoTargetsRequest":false,"supportsHitConditionalBreakpoints":true,"supportsLoadedSourcesRequest":false,"supportsModulesRequest":false,"supportsProgressReporting":true,"supportsRestartFrame":false,"supportsRestartRequest":false,"supportsRunInTerminalRequest":true,"supportsSetVariable":true,"supportsStepBack":false,"supportsStepInTargetsRequest":false,"supportsValueFormattingOptions":true},"command":"initialize","request_seq":1,"seq":0,"success":true,"type":"response"} --> Content-Length: 1015

Hide Details

{"command":"launch","type":"request","arguments":{"program":"/Users/buildslave/jenkins/workspace/lldb-cmake-standalone/lldb-xcode-build/lldb-test-build.noindex/tools/lldb-vscode/launch/TestVSCode_launch.test_shellExpandArguments_disabled/a.out","args":["/Users/buildslave/jenkins/workspace/lldb-cmake-standalone/lldb-xcode-build/lldb-test-build.noindex/tools/lldb-vscode/launch/TestVSCode_launch.test_shellExpandArguments_disabled/*.out"],"disableASLR":true,"initCommands":["settings clear -all","settings set symbols.enable-external-lookup false","settings set target.inherit-tcc true","settings set target.detach-on-error false","settings set target.auto-apply-fixits false","settings set plugin.process.gdb-remote.packet-timeout 60","settings set symbols.clang-modules-cache-path \"/Users/buildslave/jenkins/workspace/lldb-cmake-standalone/lldb-xcode-build/lldb-test-build.noindex/module-cache-lldb/lldb-api\"","settings set use-color false","setting set target.prefer-dynamic-value no-dynamic-values"]},"seq":2} <-- Content-Length: 691

Hide Details

{"body":{"category":"console","output":"Running initCommands:\n(lldb) settings clear -all\n(lldb) settings set symbols.enable-external-lookup false\n(lldb) settings set target.inherit-tcc true\n(lldb) settings set target.detach-on-error false\n(lldb) settings set target.auto-apply-fixits false\n(lldb) settings set plugin.process.gdb-remote.packet-timeout 60\n(lldb) settings set symbols.clang-modules-cache-path \"/Users/buildslave/jenkins/workspace/lldb-cmake-standalone/lldb-xcode-build/lldb-test-build.noindex/module-cache-lldb/lldb-api\"\n(lldb) settings set use-color false\n(lldb) setting set target.prefer-dynamic-value no-dynamic-values\n"},"event":"output","seq":0,"type":"event"} <-- Content-Length: 77

Hide Details

{"command":"launch","request_seq":2,"seq":0,"success":true,"type":"response"} <-- Content-Length: 312

Hide Details

{"body":{"isLocalProcess":true,"name":"/Users/buildslave/jenkins/workspace/lldb-cmake-standalone/lldb-xcode-build/lldb-test-build.noindex/tools/lldb-vscode/launch/TestVSCode_launch.test_shellExpandArguments_disabled/a.out","startMethod":"launch","systemProcessId":77571},"event":"process","seq":0,"type":"event"} <-- Content-Length: 46

Hide Details

{"event":"initialized","seq":0,"type":"event"} --> Content-Length: 71

Hide Details

{"command":"configurationDone","type":"request","arguments":{},"seq":3} <-- Content-Length: 88

Hide Details

{"command":"configurationDone","request_seq":3,"seq":0,"success":true,"type":"response"} <-- Content-Length: 1135

Hide Details

{"body":{"category":"stdout","output":"arg[0] = \"/Users/buildslave/jenkins/workspace/lldb-cmake-standalone/lldb-xcode-build/lldb-test-build.noindex/tools/lldb-vscode/launch/TestVSCode_launch.test_shellExpandArguments_disabled/a.out\"\r\narg[1] = \"/Users/buildslave/jenkins/workspace/lldb-cmake-standalone/lldb-xcode-build/lldb-test-build.noindex/tools/lldb-vscode/launch/TestVSCode_launch.test_shellExpandArguments_disabled/*.out\"\r\nenv[0] = \"LLVM_LIBS_DIR=/Users/buildslave/jenkins/workspace/lldb-cmake-standalone/clang-build/./lib\"\r\nenv[1] = \"LLDBVSCODE_LOG=/Users/buildslave/jenkins/workspace/lldb-cmake-standalone/lldb-xcode-build/lldb-test-build.noindex/tools/lldb-vscode/launch/TestVSCode_launch.test_shellExpandArguments_disabled/vscode.txt\"\r\nenv[2] = \"LLDB_SRC=/Users/buildslave/jenkins/workspace/lldb-cmake-standalone/llvm-project/lldb\"\r\nenv[3] = \"LLDBVSCODE_EXEC=/Users/buildslave/jenkins/workspace/lldb-cmake-standalone/lldb-xcode-build/Release/bin/lldb-vscode\"\r\nenv[4] = \"OS_ACTIVITY_DT_MODE=enable\"\r\nenv[5] = \"LLDB_FRAMEWORK=/Users/buildslave/jenkins/wor"},"event":"output","seq":0,"type":"event"} <-- Content-Length: 1119

Hide Details

{"body":{"category":"stdout","output":"kspace/lldb-cmake-standalone/lldb-xcode-build/Release/bin/LLDB.framework\"\r\nenv[6] = \"PATH=/Applications/Xcode.app/Contents/Developer/Toolchains/XcodeDefault.xctoolchain/usr/bin:/Applications/Xcode.app/Contents/Developer/Toolchains/XcodeDefault.xctoolchain/usr/local/bin:/Applications/Xcode.app/Contents/Developer/Toolchains/XcodeDefault.xctoolchain/usr/libexec:/Applications/Xcode.app/Contents/Developer/Platforms/MacOSX.platform/Developer/usr/bin:/Applications/Xcode.app/Contents/Developer/Platforms/MacOSX.platform/Developer/usr/local/bin:/Applications/Xcode.app/Contents/Developer/Platforms/MacOSX.platform/usr/bin:/Applications/Xcode.app/Contents/Developer/Platforms/MacOSX.platform/usr/local/bin:/Applications/Xcode.app/Contents/Developer/usr/bin:/Applications/Xcode.app/Contents/Developer/usr/local/bin:/Applications/Xcode.app/Contents/Developer/Tools:/usr/local/bin:/usr/local/sbin:/usr/bin:/bin:/usr/sbin:/sbin\"\r\nenv[7] = \"__CF_USER_TEXT_ENCODING=0x1F5:0x0:0x0\"\r\r\nenv[8] = \"TMPDIR=/var/folders/09/r4vw4v8n5kb67jl66zv"},"event":"output","seq":0,"type":"event"} <-- Content-Length: 586

Hide Details

{"body":{"category":"stdout","output":"lbljw0000gn/T/\"\r\nenv[9] = \"LC_CTYPE=UTF-8\"\r\nenv[10] = \"__PYVENV_LAUNCHER__=/usr/local/Cellar/python/3.7.0/Frameworks/Python.framework/Versions/3.7/bin/python3.7\"\r\nenv[11] = \"TERM=vt100\"\r\nenv[12] = \"LLVM_DISABLE_CRASH_REPORT=1\"\r\nenv[13] = \"LLDB_TEST=/Users/buildslave/jenkins/workspace/lldb-cmake-standalone/llvm-project/lldb/packages/Python/lldbsuite/test\"\r\ncwd = \"/Users/buildslave/jenkins/workspace/lldb-cmake-standalone/llvm-project/lldb/test/API/tools/lldb-vscode/launch\"\r\n"},"event":"output","seq":0,"type":"event"} <-- Content-Length: 63

Hide Details

{"body":{"exitCode":0},"event":"exited","seq":0,"type":"event"} <-- Content-Length: 45

Hide Details

{"event":"terminated","seq":0,"type":"event"} --> Content-Length: 88

Hide Details

{"command":"disconnect","type":"request","arguments":{"terminateDebuggee":true},"seq":4} <-- Content-Length: 81

Hide Details

{"command":"disconnect","request_seq":4,"seq":0,"success":true,"type":"response"}

Hide Details

========= END ========= ========= DEBUG ADAPTER PROTOCOL LOGS ========= --> Content-Length: 284

Hide Details

{"command":"initialize","type":"request","arguments":{"adapterID":"lldb-native","clientID":"vscode","columnsStartAt1":true,"linesStartAt1":true,"locale":"en-us","pathFormat":"path","supportsRunInTerminalRequest":true,"supportsVariablePaging":true,"supportsVariableType":true},"seq":1} <-- Content-Length: 1222

Hide Details

{"body":{"exceptionBreakpointFilters":[{"default":false,"filter":"cpp_catch","label":"C++ Catch"},{"default":false,"filter":"cpp_throw","label":"C++ Throw"},{"default":false,"filter":"objc_catch","label":"Objective C Catch"},{"default":false,"filter":"objc_throw","label":"Objective C Throw"},{"default":false,"filter":"swift_catch","label":"Swift Catch"},{"default":false,"filter":"swift_throw","label":"Swift Throw"}],"supportTerminateDebuggee":true,"supportsCompletionsRequest":false,"supportsConditionalBreakpoints":true,"supportsConfigurationDoneRequest":true,"supportsDelayedStackTraceLoading":true,"supportsEvaluateForHovers":true,"supportsExceptionInfoRequest":true,"supportsExceptionOptions":true,"supportsFunctionBreakpoints":true,"supportsGotoTargetsRequest":false,"supportsHitConditionalBreakpoints":true,"supportsLoadedSourcesRequest":false,"supportsModulesRequest":false,"supportsProgressReporting":true,"supportsRestartFrame":false,"supportsRestartRequest":false,"supportsRunInTerminalRequest":true,"supportsSetVariable":true,"supportsStepBack":false,"supportsStepInTargetsRequest":false,"supportsValueFormattingOptions":true},"command":"initialize","request_seq":1,"seq":0,"success":true,"type":"response"} --> Content-Length: 1041

Hide Details

{"command":"launch","type":"request","arguments":{"program":"/Users/buildslave/jenkins/workspace/lldb-cmake-standalone/lldb-xcode-build/lldb-test-build.noindex/tools/lldb-vscode/launch/TestVSCode_launch.test_shellExpandArguments_enabled/a.out","args":["/Users/buildslave/jenkins/workspace/lldb-cmake-standalone/lldb-xcode-build/lldb-test-build.noindex/tools/lldb-vscode/launch/TestVSCode_launch.test_shellExpandArguments_enabled/*.out"],"disableASLR":true,"shellExpandArguments":true,"initCommands":["settings clear -all","settings set symbols.enable-external-lookup false","settings set target.inherit-tcc true","settings set target.detach-on-error false","settings set target.auto-apply-fixits false","settings set plugin.process.gdb-remote.packet-timeout 60","settings set symbols.clang-modules-cache-path \"/Users/buildslave/jenkins/workspace/lldb-cmake-standalone/lldb-xcode-build/lldb-test-build.noindex/module-cache-lldb/lldb-api\"","settings set use-color false","setting set target.prefer-dynamic-value no-dynamic-values"]},"seq":2} <-- Content-Length: 691

Hide Details

{"body":{"category":"console","output":"Running initCommands:\n(lldb) settings clear -all\n(lldb) settings set symbols.enable-external-lookup false\n(lldb) settings set target.inherit-tcc true\n(lldb) settings set target.detach-on-error false\n(lldb) settings set target.auto-apply-fixits false\n(lldb) settings set plugin.process.gdb-remote.packet-timeout 60\n(lldb) settings set symbols.clang-modules-cache-path \"/Users/buildslave/jenkins/workspace/lldb-cmake-standalone/lldb-xcode-build/lldb-test-build.noindex/module-cache-lldb/lldb-api\"\n(lldb) settings set use-color false\n(lldb) setting set target.prefer-dynamic-value no-dynamic-values\n"},"event":"output","seq":0,"type":"event"} <-- Content-Length: 77

Hide Details

{"command":"launch","request_seq":2,"seq":0,"success":true,"type":"response"} <-- Content-Length: 311

Hide Details

{"body":{"isLocalProcess":true,"name":"/Users/buildslave/jenkins/workspace/lldb-cmake-standalone/lldb-xcode-build/lldb-test-build.noindex/tools/lldb-vscode/launch/TestVSCode_launch.test_shellExpandArguments_enabled/a.out","startMethod":"launch","systemProcessId":77787},"event":"process","seq":0,"type":"event"} <-- Content-Length: 46

Hide Details

{"event":"initialized","seq":0,"type":"event"} --> Content-Length: 71

Hide Details

{"command":"configurationDone","type":"request","arguments":{},"seq":3} <-- Content-Length: 88

Hide Details

{"command":"configurationDone","request_seq":3,"seq":0,"success":true,"type":"response"} <-- Content-Length: 1135

Hide Details

{"body":{"category":"stdout","output":"arg[0] = \"/Users/buildslave/jenkins/workspace/lldb-cmake-standalone/lldb-xcode-build/lldb-test-build.noindex/tools/lldb-vscode/launch/TestVSCode_launch.test_shellExpandArguments_enabled/a.out\"\r\narg[1] = \"/Users/buildslave/jenkins/workspace/lldb-cmake-standalone/lldb-xcode-build/lldb-test-build.noindex/tools/lldb-vscode/launch/TestVSCode_launch.test_shellExpandArguments_enabled/a.out\"\r\nenv[0] = \"LLVM_LIBS_DIR=/Users/buildslave/jenkins/workspace/lldb-cmake-standalone/clang-build/./lib\"\r\nenv[1] = \"LLDBVSCODE_LOG=/Users/buildslave/jenkins/workspace/lldb-cmake-standalone/lldb-xcode-build/lldb-test-build.noindex/tools/lldb-vscode/launch/TestVSCode_launch.test_shellExpandArguments_enabled/vscode.txt\"\r\nenv[2] = \"LLDB_SRC=/Users/buildslave/jenkins/workspace/lldb-cmake-standalone/llvm-project/lldb\"\r\nenv[3] = \"LLDBVSCODE_EXEC=/Users/buildslave/jenkins/workspace/lldb-cmake-standalone/lldb-xcode-build/Release/bin/lldb-vscode\"\r\nenv[4] = \"OS_ACTIVITY_DT_MODE=enable\"\r\nenv[5] = \"LLDB_FRAMEWORK=/Users/buildslave/jenkins/worksp"},"event":"output","seq":0,"type":"event"} <-- Content-Length: 1118

Hide Details

{"body":{"category":"stdout","output":"ace/lldb-cmake-standalone/lldb-xcode-build/Release/bin/LLDB.framework\"\r\nenv[6] = \"PATH=/Applications/Xcode.app/Contents/Developer/Toolchains/XcodeDefault.xctoolchain/usr/bin:/Applications/Xcode.app/Contents/Developer/Toolchains/XcodeDefault.xctoolchain/usr/local/bin:/Applications/Xcode.app/Contents/Developer/Toolchains/XcodeDefault.xctoolchain/usr/libexec:/Applications/Xcode.app/Contents/Developer/Platforms/MacOSX.platform/Developer/usr/bin:/Applications/Xcode.app/Contents/Developer/Platforms/MacOSX.platform/Developer/usr/local/bin:/Applications/Xcode.app/Contents/Developer/Platforms/MacOSX.platform/usr/bin:/Applications/Xcode.app/Contents/Developer/Platforms/MacOSX.platform/usr/local/bin:/Applications/Xcode.app/Contents/Developer/usr/bin:/Applications/Xcode.app/Contents/Developer/usr/local/bin:/Applications/Xcode.app/Contents/Developer/Tools:/usr/local/bin:/usr/local/sbin:/usr/bin:/bin:/usr/sbin:/sbin\"\r\nenv[7] = \"__CF_USER_TEXT_ENCODING=0x1F5:0x0:0x0\"\r\nenv[8] = \"TMPDIR=/var/folders/09/r4vw4v8n5kb67jl66zvlblj"},"event":"output","seq":0,"type":"event"} <-- Content-Length: 582

Hide Details

{"body":{"category":"stdout","output":"w0000gn/T/\"\r\nenv[9] = \"LC_CTYPE=UTF-8\"\r\nenv[10] = \"__PYVENV_LAUNCHER__=/usr/local/Cellar/python/3.7.0/Frameworks/Python.framework/Versions/3.7/bin/python3.7\"\r\nenv[11] = \"TERM=vt100\"\r\nenv[12] = \"LLVM_DISABLE_CRASH_REPORT=1\"\r\nenv[13] = \"LLDB_TEST=/Users/buildslave/jenkins/workspace/lldb-cmake-standalone/llvm-project/lldb/packages/Python/lldbsuite/test\"\r\ncwd = \"/Users/buildslave/jenkins/workspace/lldb-cmake-standalone/llvm-project/lldb/test/API/tools/lldb-vscode/launch\"\r\n"},"event":"output","seq":0,"type":"event"} <-- Content-Length: 63

Hide Details

{"body":{"exitCode":0},"event":"exited","seq":0,"type":"event"} <-- Content-Length: 45

Hide Details

{"event":"terminated","seq":0,"type":"event"} --> Content-Length: 88

Hide Details

{"command":"disconnect","type":"request","arguments":{"terminateDebuggee":true},"seq":4} <-- Content-Length: 81

Hide Details

{"command":"disconnect","request_seq":4,"seq":0,"success":true,"type":"response"}

Hide Details

========= END ========= ========= DEBUG ADAPTER PROTOCOL LOGS ========= --> Content-Length: 284

Hide Details

{"command":"initialize","type":"request","arguments":{"adapterID":"lldb-native","clientID":"vscode","columnsStartAt1":true,"linesStartAt1":true,"locale":"en-us","pathFormat":"path","supportsRunInTerminalRequest":true,"supportsVariablePaging":true,"supportsVariableType":true},"seq":1} <-- Content-Length: 1222

Hide Details

{"body":{"exceptionBreakpointFilters":[{"default":false,"filter":"cpp_catch","label":"C++ Catch"},{"default":false,"filter":"cpp_throw","label":"C++ Throw"},{"default":false,"filter":"objc_catch","label":"Objective C Catch"},{"default":false,"filter":"objc_throw","label":"Objective C Throw"},{"default":false,"filter":"swift_catch","label":"Swift Catch"},{"default":false,"filter":"swift_throw","label":"Swift Throw"}],"supportTerminateDebuggee":true,"supportsCompletionsRequest":false,"supportsConditionalBreakpoints":true,"supportsConfigurationDoneRequest":true,"supportsDelayedStackTraceLoading":true,"supportsEvaluateForHovers":true,"supportsExceptionInfoRequest":true,"supportsExceptionOptions":true,"supportsFunctionBreakpoints":true,"supportsGotoTargetsRequest":false,"supportsHitConditionalBreakpoints":true,"supportsLoadedSourcesRequest":false,"supportsModulesRequest":false,"supportsProgressReporting":true,"supportsRestartFrame":false,"supportsRestartRequest":false,"supportsRunInTerminalRequest":true,"supportsSetVariable":true,"supportsStepBack":false,"supportsStepInTargetsRequest":false,"supportsValueFormattingOptions":true},"command":"initialize","request_seq":1,"seq":0,"success":true,"type":"response"} --> Content-Length: 975

Hide Details

{"command":"launch","type":"request","arguments":{"program":"/Users/buildslave/jenkins/workspace/lldb-cmake-standalone/lldb-xcode-build/lldb-test-build.noindex/tools/lldb-vscode/launch/TestVSCode_launch.test_sourcePath/a.out","disableASLR":true,"initCommands":["settings clear -all","settings set symbols.enable-external-lookup false","settings set target.inherit-tcc true","settings set target.detach-on-error false","settings set target.auto-apply-fixits false","settings set plugin.process.gdb-remote.packet-timeout 60","settings set symbols.clang-modules-cache-path \"/Users/buildslave/jenkins/workspace/lldb-cmake-standalone/lldb-xcode-build/lldb-test-build.noindex/module-cache-lldb/lldb-api\"","settings set use-color false","setting set target.prefer-dynamic-value no-dynamic-values"],"sourcePath":"/Users/buildslave/jenkins/workspace/lldb-cmake-standalone/lldb-xcode-build/lldb-test-build.noindex/tools/lldb-vscode/launch/TestVSCode_launch.test_sourcePath"},"seq":2} <-- Content-Length: 691

Hide Details

{"body":{"category":"console","output":"Running initCommands:\n(lldb) settings clear -all\n(lldb) settings set symbols.enable-external-lookup false\n(lldb) settings set target.inherit-tcc true\n(lldb) settings set target.detach-on-error false\n(lldb) settings set target.auto-apply-fixits false\n(lldb) settings set plugin.process.gdb-remote.packet-timeout 60\n(lldb) settings set symbols.clang-modules-cache-path \"/Users/buildslave/jenkins/workspace/lldb-cmake-standalone/lldb-xcode-build/lldb-test-build.noindex/module-cache-lldb/lldb-api\"\n(lldb) settings set use-color false\n(lldb) setting set target.prefer-dynamic-value no-dynamic-values\n"},"event":"output","seq":0,"type":"event"} <-- Content-Length: 311

Hide Details

{"body":{"category":"console","output":"Setting source map:\n(lldb) settings set target.source-map \".\" \"/Users/buildslave/jenkins/workspace/lldb-cmake-standalone/lldb-xcode-build/lldb-test-build.noindex/tools/lldb-vscode/launch/TestVSCode_launch.test_sourcePath\"\n"},"event":"output","seq":0,"type":"event"} <-- Content-Length: 77

Hide Details

{"command":"launch","request_seq":2,"seq":0,"success":true,"type":"response"} <-- Content-Length: 293

Hide Details

{"body":{"isLocalProcess":true,"name":"/Users/buildslave/jenkins/workspace/lldb-cmake-standalone/lldb-xcode-build/lldb-test-build.noindex/tools/lldb-vscode/launch/TestVSCode_launch.test_sourcePath/a.out","startMethod":"launch","systemProcessId":78012},"event":"process","seq":0,"type":"event"} <-- Content-Length: 46

Hide Details

{"event":"initialized","seq":0,"type":"event"} --> Content-Length: 71

Hide Details

{"command":"configurationDone","type":"request","arguments":{},"seq":3} <-- Content-Length: 88

Hide Details

{"command":"configurationDone","request_seq":3,"seq":0,"success":true,"type":"response"} <-- Content-Length: 1135

Hide Details

{"body":{"category":"stdout","output":"arg[0] = \"/Users/buildslave/jenkins/workspace/lldb-cmake-standalone/lldb-xcode-build/lldb-test-build.noindex/tools/lldb-vscode/launch/TestVSCode_launch.test_sourcePath/a.out\"\r\nenv[0] = \"LLVM_LIBS_DIR=/Users/buildslave/jenkins/workspace/lldb-cmake-standalone/clang-build/./lib\"\r\nenv[1] = \"LLDBVSCODE_LOG=/Users/buildslave/jenkins/workspace/lldb-cmake-standalone/lldb-xcode-build/lldb-test-build.noindex/tools/lldb-vscode/launch/TestVSCode_launch.test_sourcePath/vscode.txt\"\r\nenv[2] = \"LLDB_SRC=/Users/buildslave/jenkins/workspace/lldb-cmake-standalone/llvm-project/lldb\"\r\nenv[3] = \"LLDBVSCODE_EXEC=/Users/buildslave/jenkins/workspace/lldb-cmake-standalone/lldb-xcode-build/Release/bin/lldb-vscode\"\r\nenv[4] = \"OS_ACTIVITY_DT_MODE=enable\"\r\nenv[5] = \"LLDB_FRAMEWORK=/Users/buildslave/jenkins/workspace/lldb-cmake-standalone/lldb-xcode-build/Release/bin/LLDB.framework\"\r\nenv[6] = \"PATH=/Applications/Xcode.app/Contents/Developer/Toolchains/XcodeDefault.xctoolchain/usr/bin:/Applications/Xcode.app/Contents/Developer/Toolchains/Xc"},"event":"output","seq":0,"type":"event"} <-- Content-Length: 1133

Hide Details

{"body":{"category":"stdout","output":"odeDefault.xctoolchain/usr/local/bin:/Applications/Xcode.app/Contents/Developer/Toolchains/XcodeDefault.xctoolchain/usr/libexec:/Applications/Xcode.app/Contents/Developer/Platforms/MacOSX.platform/Developer/usr/bin:/Applications/Xcode.app/Contents/Developer/Platforms/MacOSX.platform/Developer/usr/local/bin:/Applications/Xcode.app/Contents/Developer/Platforms/MacOSX.platform/usr/bin:/Applications/Xcode.app/Contents/Developer/Platforms/MacOSX.platform/usr/local/bin:/Applications/Xcode.app/Contents/Developer/usr/bin:/Applications/Xcode.app/Contents/Developer/usr/local/bin:/Applications/Xcode.app/Contents/Developer/Tools:/usr/local/bin:/usr/local/sbin:/usr/bin:/bin:/usr/sbin:/sbin\"\r\nenv[7] = \"__CF_USER_TEXT_ENCODING=0x1F5:0x0:0x0\"\r\nenv[8] = \"TMPDIR=/var/folders/09/r4vw4v8n5kb67jl66zvlbljw0000gn/T/\"\r\nenv[9] = \"LC_CTYPE=UTF-8\"\r\nenv[10] = \"__PYVENV_LAUNCHER__=/usr/local/Cellar/python/3.7.0/Frameworks/Python.framework/Versions/3.7/bin/python3.7\"\r\nenv[11] = \"TERM=vt100\"\r\nenv[12] = \"LLVM_DISABLE_CRASH_REPORT=1\"\r\nenv[13"},"event":"output","seq":0,"type":"event"} <-- Content-Length: 333

Hide Details

{"body":{"category":"stdout","output":"] = \"LLDB_TEST=/Users/buildslave/jenkins/workspace/lldb-cmake-standalone/llvm-project/lldb/packages/Python/lldbsuite/test\"\r\ncwd = \"/Users/buildslave/jenkins/workspace/lldb-cmake-standalone/llvm-project/lldb/test/API/tools/lldb-vscode/launch\"\r\n"},"event":"output","seq":0,"type":"event"} <-- Content-Length: 63

Hide Details

{"body":{"exitCode":0},"event":"exited","seq":0,"type":"event"} <-- Content-Length: 45

Hide Details

{"event":"terminated","seq":0,"type":"event"} --> Content-Length: 88

Hide Details

{"command":"disconnect","type":"request","arguments":{"terminateDebuggee":true},"seq":4} <-- Content-Length: 81

Hide Details

{"command":"disconnect","request_seq":4,"seq":0,"success":true,"type":"response"}

Hide Details

========= END ========= ========= DEBUG ADAPTER PROTOCOL LOGS ========= --> Content-Length: 284

Hide Details

{"command":"initialize","type":"request","arguments":{"adapterID":"lldb-native","clientID":"vscode","columnsStartAt1":true,"linesStartAt1":true,"locale":"en-us","pathFormat":"path","supportsRunInTerminalRequest":true,"supportsVariablePaging":true,"supportsVariableType":true},"seq":1} <-- Content-Length: 1222

Hide Details

{"body":{"exceptionBreakpointFilters":[{"default":false,"filter":"cpp_catch","label":"C++ Catch"},{"default":false,"filter":"cpp_throw","label":"C++ Throw"},{"default":false,"filter":"objc_catch","label":"Objective C Catch"},{"default":false,"filter":"objc_throw","label":"Objective C Throw"},{"default":false,"filter":"swift_catch","label":"Swift Catch"},{"default":false,"filter":"swift_throw","label":"Swift Throw"}],"supportTerminateDebuggee":true,"supportsCompletionsRequest":false,"supportsConditionalBreakpoints":true,"supportsConfigurationDoneRequest":true,"supportsDelayedStackTraceLoading":true,"supportsEvaluateForHovers":true,"supportsExceptionInfoRequest":true,"supportsExceptionOptions":true,"supportsFunctionBreakpoints":true,"supportsGotoTargetsRequest":false,"supportsHitConditionalBreakpoints":true,"supportsLoadedSourcesRequest":false,"supportsModulesRequest":false,"supportsProgressReporting":true,"supportsRestartFrame":false,"supportsRestartRequest":false,"supportsRunInTerminalRequest":true,"supportsSetVariable":true,"supportsStepBack":false,"supportsStepInTargetsRequest":false,"supportsValueFormattingOptions":true},"command":"initialize","request_seq":1,"seq":0,"success":true,"type":"response"} --> Content-Length: 822

Hide Details

{"command":"launch","type":"request","arguments":{"program":"/Users/buildslave/jenkins/workspace/lldb-cmake-standalone/lldb-xcode-build/lldb-test-build.noindex/tools/lldb-vscode/launch/TestVSCode_launch.test_stopOnEntry/a.out","stopOnEntry":true,"disableASLR":true,"initCommands":["settings clear -all","settings set symbols.enable-external-lookup false","settings set target.inherit-tcc true","settings set target.detach-on-error false","settings set target.auto-apply-fixits false","settings set plugin.process.gdb-remote.packet-timeout 60","settings set symbols.clang-modules-cache-path \"/Users/buildslave/jenkins/workspace/lldb-cmake-standalone/lldb-xcode-build/lldb-test-build.noindex/module-cache-lldb/lldb-api\"","settings set use-color false","setting set target.prefer-dynamic-value no-dynamic-values"]},"seq":2} <-- Content-Length: 691

Hide Details

{"body":{"category":"console","output":"Running initCommands:\n(lldb) settings clear -all\n(lldb) settings set symbols.enable-external-lookup false\n(lldb) settings set target.inherit-tcc true\n(lldb) settings set target.detach-on-error false\n(lldb) settings set target.auto-apply-fixits false\n(lldb) settings set plugin.process.gdb-remote.packet-timeout 60\n(lldb) settings set symbols.clang-modules-cache-path \"/Users/buildslave/jenkins/workspace/lldb-cmake-standalone/lldb-xcode-build/lldb-test-build.noindex/module-cache-lldb/lldb-api\"\n(lldb) settings set use-color false\n(lldb) setting set target.prefer-dynamic-value no-dynamic-values\n"},"event":"output","seq":0,"type":"event"} <-- Content-Length: 77

Hide Details

{"command":"launch","request_seq":2,"seq":0,"success":true,"type":"response"} <-- Content-Length: 294

Hide Details

{"body":{"isLocalProcess":true,"name":"/Users/buildslave/jenkins/workspace/lldb-cmake-standalone/lldb-xcode-build/lldb-test-build.noindex/tools/lldb-vscode/launch/TestVSCode_launch.test_stopOnEntry/a.out","startMethod":"launch","systemProcessId":78213},"event":"process","seq":0,"type":"event"} <-- Content-Length: 46

Hide Details

{"event":"initialized","seq":0,"type":"event"} --> Content-Length: 107

Hide Details

{"command":"setFunctionBreakpoints","type":"request","arguments":{"breakpoints":[{"name":"main"}]},"seq":3} <-- Content-Length: 305

Hide Details

{"body":{"breakpoints":[{"id":1,"line":6,"source":{"name":"main.c","path":"/Users/buildslave/jenkins/workspace/lldb-cmake-standalone/llvm-project/lldb/test/API/tools/lldb-vscode/launch/main.c"},"verified":true}]},"command":"setFunctionBreakpoints","request_seq":3,"seq":0,"success":true,"type":"response"} --> Content-Length: 71

Hide Details

{"command":"configurationDone","type":"request","arguments":{},"seq":4} <-- Content-Length: 88

Hide Details

{"command":"configurationDone","request_seq":4,"seq":0,"success":true,"type":"response"} <-- Content-Length: 167

Hide Details

{"body":{"allThreadsStopped":true,"preserveFocusHint":false,"reason":"exception","threadCausedFocus":true,"threadId":4701282},"event":"stopped","seq":0,"type":"event"} --> Content-Length: 88

Hide Details

{"command":"disconnect","type":"request","arguments":{"terminateDebuggee":true},"seq":5} <-- Content-Length: 63

Hide Details

{"body":{"exitCode":9},"event":"exited","seq":0,"type":"event"} <-- Content-Length: 45

Hide Details

{"event":"terminated","seq":0,"type":"event"} <-- Content-Length: 81

Hide Details

{"command":"disconnect","request_seq":5,"seq":0,"success":true,"type":"response"}

Hide Details

========= END ========= ========= DEBUG ADAPTER PROTOCOL LOGS ========= --> Content-Length: 64

Hide Details

{"command":"disconnect","type":"request","arguments":{},"seq":1} <-- Content-Length: 45

Hide Details

{"event":"terminated","seq":0,"type":"event"} <-- Content-Length: 81

Hide Details

{"command":"disconnect","request_seq":1,"seq":0,"success":true,"type":"response"}

Hide Details

========= END =========

Hide Details

-- Command Output (stderr): -- PASS: LLDB (/Users/buildslave/jenkins/workspace/lldb-cmake-standalone/clang-build/bin/clang-x86_64) :: test_args (TestVSCode_launch.TestVSCode_launch) PASS: LLDB (/Users/buildslave/jenkins/workspace/lldb-cmake-standalone/clang-build/bin/clang-x86_64) :: test_commands (TestVSCode_launch.TestVSCode_launch) PASS: LLDB (/Users/buildslave/jenkins/workspace/lldb-cmake-standalone/clang-build/bin/clang-x86_64) :: test_cwd (TestVSCode_launch.TestVSCode_launch) PASS: LLDB (/Users/buildslave/jenkins/workspace/lldb-cmake-standalone/clang-build/bin/clang-x86_64) :: test_debuggerRoot (TestVSCode_launch.TestVSCode_launch) UNSUPPORTED: LLDB (/Users/buildslave/jenkins/workspace/lldb-cmake-standalone/clang-build/bin/clang-x86_64) :: test_default (TestVSCode_launch.TestVSCode_launch) (skip on macosx, darwin, ios, tvos, watchos, bridgeos, iphonesimulator, watchsimulator, appletvsimulator) PASS: LLDB (/Users/buildslave/jenkins/workspace/lldb-cmake-standalone/clang-build/bin/clang-x86_64) :: test_disableSTDIO (TestVSCode_launch.TestVSCode_launch) PASS: LLDB (/Users/buildslave/jenkins/workspace/lldb-cmake-standalone/clang-build/bin/clang-x86_64) :: test_environment (TestVSCode_launch.TestVSCode_launch) FAIL: LLDB (/Users/buildslave/jenkins/workspace/lldb-cmake-standalone/clang-build/bin/clang-x86_64) :: test_extra_launch_commands (TestVSCode_launch.TestVSCode_launch) PASS: LLDB (/Users/buildslave/jenkins/workspace/lldb-cmake-standalone/clang-build/bin/clang-x86_64) :: test_shellExpandArguments_disabled (TestVSCode_launch.TestVSCode_launch) PASS: LLDB (/Users/buildslave/jenkins/workspace/lldb-cmake-standalone/clang-build/bin/clang-x86_64) :: test_shellExpandArguments_enabled (TestVSCode_launch.TestVSCode_launch) PASS: LLDB (/Users/buildslave/jenkins/workspace/lldb-cmake-standalone/clang-build/bin/clang-x86_64) :: test_sourcePath (TestVSCode_launch.TestVSCode_launch) PASS: LLDB (/Users/buildslave/jenkins/workspace/lldb-cmake-standalone/clang-build/bin/clang-x86_64) :: test_stopOnEntry (TestVSCode_launch.TestVSCode_launch) UNSUPPORTED: LLDB (/Users/buildslave/jenkins/workspace/lldb-cmake-standalone/clang-build/bin/clang-x86_64) :: test_terminate_commands (TestVSCode_launch.TestVSCode_launch) (skip on macosx, darwin, ios, tvos, watchos, bridgeos, iphonesimulator, watchsimulator, appletvsimulator) PASS: LLDB (/Users/buildslave/jenkins/workspace/lldb-cmake-standalone/clang-build/bin/clang-x86_64) :: test_termination (TestVSCode_launch.TestVSCode_launch) ====================================================================== FAIL: test_extra_launch_commands (TestVSCode_launch.TestVSCode_launch) ---------------------------------------------------------------------- Traceback (most recent call last): File "/Users/buildslave/jenkins/workspace/lldb-cmake-standalone/llvm-project/lldb/test/API/tools/lldb-vscode/launch/TestVSCode_launch.py", line 431, in test_extra_launch_commands self.continue_to_exit() File "/Users/buildslave/jenkins/workspace/lldb-cmake-standalone/llvm-project/lldb/packages/Python/lldbsuite/test/tools/lldb-vscode/lldbvscode_testcase.py", line 246, in continue_to_exit 'make sure program ran to completion') AssertionError: 'stopped' != 'exited' - stopped+ exited : make sure program ran to completion Config=x86_64-/Users/buildslave/jenkins/workspace/lldb-cmake-standalone/clang-build/bin/clang ---------------------------------------------------------------------- Ran 14 tests in 31.138s

Hide Details

RESULT: FAILED (11 passes, 1 failures, 0 errors, 2 skipped, 0 expected failures, 0 unexpected successes)

Hide Details

--

Hide Details

******************** PASS: lldb-api :: commands/register/register/register_command/TestRegisters.py (39 of 2403) UNSUPPORTED: lldb-api :: functionalities/thread/create_during_step/TestCreateDuringStep.py (40 of 2403) PASS: lldb-api :: commands/expression/test/TestExprs.py (41 of 2403) PASS: lldb-api :: functionalities/thread/step_until/TestStepUntil.py (42 of 2403) PASS: lldb-api :: lang/c/shared_lib_stripped_symbols/TestSharedLibStrippedSymbols.py (43 of 2403) PASS: lldb-api :: types/TestShortType.py (44 of 2403) PASS: lldb-api :: tools/lldb-server/TestLldbGdbServer.py (45 of 2403) PASS: lldb-api :: functionalities/thread/step_out/TestThreadStepOut.py (46 of 2403) PASS: lldb-api :: functionalities/inline-stepping/TestInlineStepping.py (47 of 2403) PASS: lldb-api :: functionalities/thread/exit_during_step/TestExitDuringStep.py (48 of 2403) PASS: lldb-api :: lang/objc/foundation/TestObjCMethodsString.py (49 of 2403) PASS: lldb-api :: python_api/lldbutil/iter/TestLLDBIterator.py (50 of 2403) PASS: lldb-api :: tools/lldb-vscode/module/TestVSCode_module.py (51 of 2403) PASS: lldb-api :: lang/objc/foundation/TestObjCMethodsNSError.py (52 of 2403) PASS: lldb-api :: functionalities/data-formatter/nsdictionarysynth/TestNSDictionarySynthetic.py (53 of 2403) PASS: lldb-api :: functionalities/stop-on-sharedlibrary-load/TestStopOnSharedlibraryEvents.py (54 of 2403) PASS: lldb-api :: lang/c/step-target/TestStepTarget.py (55 of 2403) PASS: lldb-api :: commands/settings/TestSettings.py (56 of 2403) PASS: lldb-api :: lang/cpp/class_types/TestClassTypes.py (57 of 2403) PASS: lldb-api :: functionalities/return-value/TestReturnValue.py (58 of 2403) PASS: lldb-api :: lang/cpp/template/TestTemplateArgs.py (59 of 2403) PASS: lldb-api :: lang/c/bitfields/TestBitfields.py (60 of 2403) PASS: lldb-api :: tools/lldb-server/TestGdbRemote_vCont.py (61 of 2403) PASS: lldb-api :: functionalities/breakpoint/breakpoint_by_line_and_column/TestBreakpointByLineAndColumn.py (62 of 2403) PASS: lldb-api :: lang/objc/single-entry-dictionary/TestObjCSingleEntryDictionary.py (63 of 2403) PASS: lldb-api :: functionalities/step-avoids-no-debug/TestStepNoDebug.py (64 of 2403) PASS: lldb-api :: functionalities/data-formatter/nssetsynth/TestNSSetSynthetic.py (65 of 2403) PASS: lldb-api :: tools/lldb-vscode/evaluate/TestVSCode_evaluate.py (66 of 2403) PASS: lldb-api :: lang/objc/forward-decl/TestForwardDecl.py (67 of 2403) PASS: lldb-api :: commands/expression/import-std-module/stack/TestStackFromStdModule.py (68 of 2403) PASS: lldb-api :: lang/objc/conflicting-definition/TestConflictingDefinition.py (69 of 2403) PASS: lldb-api :: commands/expression/import-std-module/basic/TestImportStdModule.py (70 of 2403) PASS: lldb-api :: commands/expression/import-std-module/vector/TestVectorFromStdModule.py (71 of 2403) PASS: lldb-api :: functionalities/inferior-crashing/recursive-inferior/TestRecursiveInferiorStep.py (72 of 2403) PASS: lldb-api :: lang/objc/orderedset/TestOrderedSet.py (73 of 2403) PASS: lldb-api :: functionalities/process_crash_info/TestProcessCrashInfo.py (74 of 2403) PASS: lldb-api :: functionalities/data-formatter/data-formatter-objc/TestDataFormatterObjNSException.py (75 of 2403) PASS: lldb-api :: functionalities/data-formatter/compactvectors/TestCompactVectors.py (76 of 2403) PASS: lldb-api :: functionalities/gdb_remote_client/TestPlatformClient.py (77 of 2403) PASS: lldb-api :: commands/expression/expr-in-syscall/TestExpressionInSyscall.py (78 of 2403) PASS: lldb-api :: functionalities/data-formatter/data-formatter-objc/TestDataFormatterObjCNSURL.py (79 of 2403) PASS: lldb-api :: functionalities/data-formatter/data-formatter-objc/TestDataFormatterObjCNSError.py (80 of 2403) PASS: lldb-api :: commands/target/stop-hooks/TestStopHookScripted.py (81 of 2403) PASS: lldb-api :: functionalities/data-formatter/data-formatter-stl/libcxx/multiset/TestDataFormatterLibcxxMultiSet.py (82 of 2403) PASS: lldb-api :: functionalities/data-formatter/data-formatter-objc/TestDataFormatterObjCNSData.py (83 of 2403) PASS: lldb-api :: functionalities/data-formatter/data-formatter-objc/TestDataFormatterObjCNSNumber.py (84 of 2403) PASS: lldb-api :: commands/expression/import-std-module/vector-dbg-info-content/TestDbgInfoContentVectorFromStdModule.py (85 of 2403) make: *** [/Users/buildslave/jenkins/workspace/lldb-cmake-standalone/lldb-xcode-build/test/CMakeFiles/check-lldb] Hangup: 1

Hide Details

** BUILD FAILED **

Hide Details

Hide Details

The following build commands failed: PhaseScriptExecution CMake\ Rules /Users/buildslave/jenkins/workspace/lldb-cmake-standalone/lldb-xcode-build/test/lldb.build/Release/check-lldb.build/Script-34B58722988F4DB5A3B20CC7.sh (1 failure) Command failed: Command '['/usr/bin/env', 'TERM=vt100', '/usr/local/bin/cmake', '--build', '.', '--config', 'Release', '--target', 'check-lldb']' returned non-zero exit status 65. Command: ['/usr/bin/env', 'TERM=vt100', '/usr/local/bin/cmake', '--build', '.', '--config', 'Release', '--target', 'check-lldb'] [Pipeline] } [Pipeline] // timeout [Pipeline] } [Pipeline] // stage [Pipeline] } [Pipeline] // withEnv [Pipeline] } [Pipeline] // node [Pipeline] End of Pipeline ERROR: script returned exit code 1 Finished: FAILURE