Console Output

Skipping 1,665 KB.. Full Log

Hide Details

PhaseScriptExecution CMake\ PostBuild\ Rules /Users/buildslave/jenkins/workspace/lldb-cmake-standalone/lldb-xcode-build/unittests/SymbolFile/DWARF/lldb.build/Release/SymbolFileDWARFTests.build/Script-9D84BAA2E5C7451DA18C00B6.sh cd /Users/buildslave/jenkins/workspace/lldb-cmake-standalone/llvm-project/lldb /bin/sh -c /Users/buildslave/jenkins/workspace/lldb-cmake-standalone/lldb-xcode-build/unittests/SymbolFile/DWARF/lldb.build/Release/SymbolFileDWARFTests.build/Script-9D84BAA2E5C7451DA18C00B6.sh /usr/local/Cellar/cmake/3.17.2/bin/cmake -E make_directory /Users/buildslave/jenkins/workspace/lldb-cmake-standalone/lldb-xcode-build/unittests/SymbolFile/DWARF/Release/Inputs echo "Copying test-dwarf.exe to binary directory." Copying test-dwarf.exe to binary directory. /usr/local/Cellar/cmake/3.17.2/bin/cmake -E copy /Users/buildslave/jenkins/workspace/lldb-cmake-standalone/llvm-project/lldb/unittests/SymbolFile/DWARF/Inputs/test-dwarf.exe /Users/buildslave/jenkins/workspace/lldb-cmake-standalone/lldb-xcode-build/unittests/SymbolFile/DWARF/Release/Inputs

Hide Details

CodeSign /Users/buildslave/jenkins/workspace/lldb-cmake-standalone/lldb-xcode-build/unittests/SymbolFile/DWARF/Release/SymbolFileDWARFTests cd /Users/buildslave/jenkins/workspace/lldb-cmake-standalone/llvm-project/lldb

Hide Details

Signing Identity: "-"

Hide Details

/usr/bin/codesign --force --sign - --entitlements /Users/buildslave/jenkins/workspace/lldb-cmake-standalone/lldb-xcode-build/unittests/SymbolFile/DWARF/lldb.build/Release/SymbolFileDWARFTests.build/SymbolFileDWARFTests.xcent --timestamp=none /Users/buildslave/jenkins/workspace/lldb-cmake-standalone/lldb-xcode-build/unittests/SymbolFile/DWARF/Release/SymbolFileDWARFTests

Hide Details

=== BUILD TARGET SymbolFileNativePDBTests OF PROJECT lldb WITH CONFIGURATION Release ===

Hide Details

Check dependencies

Hide Details

Write auxiliary files write-file /Users/buildslave/jenkins/workspace/lldb-cmake-standalone/lldb-xcode-build/unittests/SymbolFile/NativePDB/lldb.build/Release/SymbolFileNativePDBTests.build/Script-BC90260F013F421DB73E4C39.sh chmod 0755 /Users/buildslave/jenkins/workspace/lldb-cmake-standalone/lldb-xcode-build/unittests/SymbolFile/NativePDB/lldb.build/Release/SymbolFileNativePDBTests.build/Script-BC90260F013F421DB73E4C39.sh

Hide Details

Ld /Users/buildslave/jenkins/workspace/lldb-cmake-standalone/lldb-xcode-build/unittests/SymbolFile/NativePDB/Release/SymbolFileNativePDBTests normal x86_64 cd /Users/buildslave/jenkins/workspace/lldb-cmake-standalone/llvm-project/lldb /Applications/Xcode.app/Contents/Developer/Toolchains/XcodeDefault.xctoolchain/usr/bin/clang++ -target x86_64-apple-macos10.12 -isysroot /Applications/Xcode.app/Contents/Developer/Platforms/MacOSX.platform/Developer/SDKs/MacOSX10.15.sdk -L/Users/buildslave/jenkins/workspace/lldb-cmake-standalone/lldb-xcode-build/unittests/SymbolFile/NativePDB/Release -F/Users/buildslave/jenkins/workspace/lldb-cmake-standalone/lldb-xcode-build/unittests/SymbolFile/NativePDB/Release -filelist /Users/buildslave/jenkins/workspace/lldb-cmake-standalone/lldb-xcode-build/unittests/SymbolFile/NativePDB/lldb.build/Release/SymbolFileNativePDBTests.build/Objects-normal/x86_64/SymbolFileNativePDBTests.LinkFileList -Wl,-dead_strip -Wl,-search_paths_first -Wl,-headerpad_max_install_names /Users/buildslave/jenkins/workspace/lldb-cmake-standalone/clang-build/lib/libLLVMSupport.a /Users/buildslave/jenkins/workspace/lldb-cmake-standalone/clang-build/lib/libLLVMDebugInfoPDB.a /Users/buildslave/jenkins/workspace/lldb-cmake-standalone/clang-build/lib/libLLVMSupport.a /Users/buildslave/jenkins/workspace/lldb-cmake-standalone/clang-build/lib/libgtest_main.a /Users/buildslave/jenkins/workspace/lldb-cmake-standalone/clang-build/lib/libgtest.a /Users/buildslave/jenkins/workspace/lldb-cmake-standalone/lldb-xcode-build/Release/lib/liblldbCore.a /Users/buildslave/jenkins/workspace/lldb-cmake-standalone/lldb-xcode-build/Release/lib/liblldbHost.a /Users/buildslave/jenkins/workspace/lldb-cmake-standalone/lldb-xcode-build/Release/lib/liblldbSymbol.a /Users/buildslave/jenkins/workspace/lldb-cmake-standalone/lldb-xcode-build/Release/lib/liblldbPluginSymbolFileNativePDB.a /Users/buildslave/jenkins/workspace/lldb-cmake-standalone/lldb-xcode-build/Release/lib/liblldbUtilityHelpers.a /Users/buildslave/jenkins/workspace/lldb-cmake-standalone/lldb-xcode-build/Release/lib/liblldbBreakpoint.a /Users/buildslave/jenkins/workspace/lldb-cmake-standalone/lldb-xcode-build/Release/lib/liblldbDataFormatters.a /Users/buildslave/jenkins/workspace/lldb-cmake-standalone/lldb-xcode-build/Release/lib/liblldbExpression.a /Users/buildslave/jenkins/workspace/lldb-cmake-standalone/lldb-xcode-build/Release/lib/liblldbInterpreter.a /Users/buildslave/jenkins/workspace/lldb-cmake-standalone/lldb-xcode-build/Release/lib/liblldbTarget.a /Users/buildslave/jenkins/workspace/lldb-cmake-standalone/lldb-xcode-build/Release/lib/liblldbPluginCPlusPlusLanguage.a /Users/buildslave/jenkins/workspace/lldb-cmake-standalone/lldb-xcode-build/Release/lib/liblldbPluginObjCLanguage.a /Users/buildslave/jenkins/workspace/lldb-cmake-standalone/lldb-xcode-build/Release/lib/liblldbPluginTypeSystemClang.a /Users/buildslave/jenkins/workspace/lldb-cmake-standalone/lldb-xcode-build/Release/lib/liblldbPluginObjectFilePDB.a /Users/buildslave/jenkins/workspace/lldb-cmake-standalone/lldb-xcode-build/Release/lib/liblldbPluginObjectFileJIT.a /Users/buildslave/jenkins/workspace/lldb-cmake-standalone/lldb-xcode-build/Release/lib/liblldbCommands.a /Users/buildslave/jenkins/workspace/lldb-cmake-standalone/lldb-xcode-build/Release/lib/liblldbPluginProcessUtility.a /Users/buildslave/jenkins/workspace/lldb-cmake-standalone/lldb-xcode-build/Release/lib/liblldbPluginClangCommon.a /Users/buildslave/jenkins/workspace/lldb-cmake-standalone/lldb-xcode-build/Release/lib/liblldbPluginCPPRuntime.a /Users/buildslave/jenkins/workspace/lldb-cmake-standalone/lldb-xcode-build/Release/lib/liblldbPluginAppleObjCRuntime.a /Users/buildslave/jenkins/workspace/lldb-cmake-standalone/lldb-xcode-build/Release/lib/liblldbPluginExpressionParserClang.a /Users/buildslave/jenkins/workspace/lldb-cmake-standalone/lldb-xcode-build/Release/lib/liblldbPluginSymbolFileDWARF.a /Users/buildslave/jenkins/workspace/lldb-cmake-standalone/lldb-xcode-build/Release/lib/liblldbPluginSymbolFilePDB.a /Users/buildslave/jenkins/workspace/lldb-cmake-standalone/lldb-xcode-build/Release/lib/liblldbPluginObjCRuntime.a /Users/buildslave/jenkins/workspace/lldb-cmake-standalone/lldb-xcode-build/Release/lib/liblldbPluginRenderScriptRuntime.a /Users/buildslave/jenkins/workspace/lldb-cmake-standalone/lldb-xcode-build/Release/lib/liblldbCore.a /Users/buildslave/jenkins/workspace/lldb-cmake-standalone/lldb-xcode-build/Release/lib/liblldbSymbol.a /Users/buildslave/jenkins/workspace/lldb-cmake-standalone/lldb-xcode-build/Release/lib/liblldbPluginSymbolFileNativePDB.a /Users/buildslave/jenkins/workspace/lldb-cmake-standalone/lldb-xcode-build/Release/lib/liblldbBreakpoint.a /Users/buildslave/jenkins/workspace/lldb-cmake-standalone/lldb-xcode-build/Release/lib/liblldbDataFormatters.a /Users/buildslave/jenkins/workspace/lldb-cmake-standalone/lldb-xcode-build/Release/lib/liblldbExpression.a /Users/buildslave/jenkins/workspace/lldb-cmake-standalone/lldb-xcode-build/Release/lib/liblldbInterpreter.a /Users/buildslave/jenkins/workspace/lldb-cmake-standalone/lldb-xcode-build/Release/lib/liblldbTarget.a /Users/buildslave/jenkins/workspace/lldb-cmake-standalone/lldb-xcode-build/Release/lib/liblldbPluginCPlusPlusLanguage.a /Users/buildslave/jenkins/workspace/lldb-cmake-standalone/lldb-xcode-build/Release/lib/liblldbPluginObjCLanguage.a /Users/buildslave/jenkins/workspace/lldb-cmake-standalone/lldb-xcode-build/Release/lib/liblldbPluginTypeSystemClang.a /Users/buildslave/jenkins/workspace/lldb-cmake-standalone/lldb-xcode-build/Release/lib/liblldbPluginObjectFilePDB.a /Users/buildslave/jenkins/workspace/lldb-cmake-standalone/lldb-xcode-build/Release/lib/liblldbPluginObjectFileJIT.a /Users/buildslave/jenkins/workspace/lldb-cmake-standalone/lldb-xcode-build/Release/lib/liblldbCommands.a /Users/buildslave/jenkins/workspace/lldb-cmake-standalone/lldb-xcode-build/Release/lib/liblldbPluginProcessUtility.a /Users/buildslave/jenkins/workspace/lldb-cmake-standalone/lldb-xcode-build/Release/lib/liblldbPluginClangCommon.a /Users/buildslave/jenkins/workspace/lldb-cmake-standalone/lldb-xcode-build/Release/lib/liblldbPluginCPPRuntime.a /Users/buildslave/jenkins/workspace/lldb-cmake-standalone/lldb-xcode-build/Release/lib/liblldbPluginAppleObjCRuntime.a /Users/buildslave/jenkins/workspace/lldb-cmake-standalone/lldb-xcode-build/Release/lib/liblldbPluginExpressionParserClang.a /Users/buildslave/jenkins/workspace/lldb-cmake-standalone/lldb-xcode-build/Release/lib/liblldbPluginSymbolFileDWARF.a /Users/buildslave/jenkins/workspace/lldb-cmake-standalone/lldb-xcode-build/Release/lib/liblldbPluginSymbolFilePDB.a /Users/buildslave/jenkins/workspace/lldb-cmake-standalone/lldb-xcode-build/Release/lib/liblldbPluginObjCRuntime.a /Users/buildslave/jenkins/workspace/lldb-cmake-standalone/lldb-xcode-build/Release/lib/liblldbPluginRenderScriptRuntime.a /Users/buildslave/jenkins/workspace/lldb-cmake-standalone/lldb-xcode-build/Release/lib/liblldbCore.a /Users/buildslave/jenkins/workspace/lldb-cmake-standalone/lldb-xcode-build/Release/lib/liblldbSymbol.a /Users/buildslave/jenkins/workspace/lldb-cmake-standalone/lldb-xcode-build/Release/lib/liblldbPluginSymbolFileNativePDB.a /Users/buildslave/jenkins/workspace/lldb-cmake-standalone/lldb-xcode-build/Release/lib/liblldbBreakpoint.a /Users/buildslave/jenkins/workspace/lldb-cmake-standalone/lldb-xcode-build/Release/lib/liblldbDataFormatters.a /Users/buildslave/jenkins/workspace/lldb-cmake-standalone/lldb-xcode-build/Release/lib/liblldbExpression.a /Users/buildslave/jenkins/workspace/lldb-cmake-standalone/lldb-xcode-build/Release/lib/liblldbInterpreter.a /Users/buildslave/jenkins/workspace/lldb-cmake-standalone/lldb-xcode-build/Release/lib/liblldbTarget.a /Users/buildslave/jenkins/workspace/lldb-cmake-standalone/lldb-xcode-build/Release/lib/liblldbPluginCPlusPlusLanguage.a /Users/buildslave/jenkins/workspace/lldb-cmake-standalone/lldb-xcode-build/Release/lib/liblldbPluginObjCLanguage.a /Users/buildslave/jenkins/workspace/lldb-cmake-standalone/lldb-xcode-build/Release/lib/liblldbPluginTypeSystemClang.a /Users/buildslave/jenkins/workspace/lldb-cmake-standalone/lldb-xcode-build/Release/lib/liblldbPluginObjectFilePDB.a /Users/buildslave/jenkins/workspace/lldb-cmake-standalone/lldb-xcode-build/Release/lib/liblldbPluginObjectFileJIT.a /Users/buildslave/jenkins/workspace/lldb-cmake-standalone/lldb-xcode-build/Release/lib/liblldbCommands.a /Users/buildslave/jenkins/workspace/lldb-cmake-standalone/lldb-xcode-build/Release/lib/liblldbPluginProcessUtility.a /Users/buildslave/jenkins/workspace/lldb-cmake-standalone/lldb-xcode-build/Release/lib/liblldbPluginClangCommon.a /Users/buildslave/jenkins/workspace/lldb-cmake-standalone/lldb-xcode-build/Release/lib/liblldbPluginCPPRuntime.a /Users/buildslave/jenkins/workspace/lldb-cmake-standalone/lldb-xcode-build/Release/lib/liblldbPluginAppleObjCRuntime.a /Users/buildslave/jenkins/workspace/lldb-cmake-standalone/lldb-xcode-build/Release/lib/liblldbPluginExpressionParserClang.a /Users/buildslave/jenkins/workspace/lldb-cmake-standalone/lldb-xcode-build/Release/lib/liblldbPluginSymbolFileDWARF.a /Users/buildslave/jenkins/workspace/lldb-cmake-standalone/lldb-xcode-build/Release/lib/liblldbPluginSymbolFilePDB.a /Users/buildslave/jenkins/workspace/lldb-cmake-standalone/lldb-xcode-build/Release/lib/liblldbPluginObjCRuntime.a /Users/buildslave/jenkins/workspace/lldb-cmake-standalone/lldb-xcode-build/Release/lib/liblldbPluginRenderScriptRuntime.a /Users/buildslave/jenkins/workspace/lldb-cmake-standalone/lldb-xcode-build/Release/lib/liblldbCore.a /Users/buildslave/jenkins/workspace/lldb-cmake-standalone/lldb-xcode-build/Release/lib/liblldbSymbol.a /Users/buildslave/jenkins/workspace/lldb-cmake-standalone/lldb-xcode-build/Release/lib/liblldbPluginSymbolFileNativePDB.a /Users/buildslave/jenkins/workspace/lldb-cmake-standalone/lldb-xcode-build/Release/lib/liblldbBreakpoint.a /Users/buildslave/jenkins/workspace/lldb-cmake-standalone/lldb-xcode-build/Release/lib/liblldbDataFormatters.a /Users/buildslave/jenkins/workspace/lldb-cmake-standalone/lldb-xcode-build/Release/lib/liblldbExpression.a /Users/buildslave/jenkins/workspace/lldb-cmake-standalone/lldb-xcode-build/Release/lib/liblldbInterpreter.a /Users/buildslave/jenkins/workspace/lldb-cmake-standalone/lldb-xcode-build/Release/lib/liblldbTarget.a /Users/buildslave/jenkins/workspace/lldb-cmake-standalone/lldb-xcode-build/Release/lib/liblldbPluginCPlusPlusLanguage.a /Users/buildslave/jenkins/workspace/lldb-cmake-standalone/lldb-xcode-build/Release/lib/liblldbPluginObjCLanguage.a /Users/buildslave/jenkins/workspace/lldb-cmake-standalone/lldb-xcode-build/Release/lib/liblldbPluginTypeSystemClang.a /Users/buildslave/jenkins/workspace/lldb-cmake-standalone/lldb-xcode-build/Release/lib/liblldbPluginObjectFilePDB.a /Users/buildslave/jenkins/workspace/lldb-cmake-standalone/lldb-xcode-build/Release/lib/liblldbPluginObjectFileJIT.a /Users/buildslave/jenkins/workspace/lldb-cmake-standalone/lldb-xcode-build/Release/lib/liblldbCommands.a /Users/buildslave/jenkins/workspace/lldb-cmake-standalone/lldb-xcode-build/Release/lib/liblldbPluginProcessUtility.a /Users/buildslave/jenkins/workspace/lldb-cmake-standalone/lldb-xcode-build/Release/lib/liblldbPluginClangCommon.a /Users/buildslave/jenkins/workspace/lldb-cmake-standalone/lldb-xcode-build/Release/lib/liblldbPluginCPPRuntime.a /Users/buildslave/jenkins/workspace/lldb-cmake-standalone/lldb-xcode-build/Release/lib/liblldbPluginAppleObjCRuntime.a /Users/buildslave/jenkins/workspace/lldb-cmake-standalone/lldb-xcode-build/Release/lib/liblldbPluginExpressionParserClang.a /Users/buildslave/jenkins/workspace/lldb-cmake-standalone/lldb-xcode-build/Release/lib/liblldbPluginSymbolFileDWARF.a /Users/buildslave/jenkins/workspace/lldb-cmake-standalone/lldb-xcode-build/Release/lib/liblldbPluginSymbolFilePDB.a /Users/buildslave/jenkins/workspace/lldb-cmake-standalone/lldb-xcode-build/Release/lib/liblldbPluginObjCRuntime.a /Users/buildslave/jenkins/workspace/lldb-cmake-standalone/lldb-xcode-build/Release/lib/liblldbPluginRenderScriptRuntime.a /Users/buildslave/jenkins/workspace/lldb-cmake-standalone/lldb-xcode-build/Release/lib/liblldbCore.a /Users/buildslave/jenkins/workspace/lldb-cmake-standalone/lldb-xcode-build/Release/lib/liblldbSymbol.a /Users/buildslave/jenkins/workspace/lldb-cmake-standalone/lldb-xcode-build/Release/lib/liblldbPluginSymbolFileNativePDB.a /Users/buildslave/jenkins/workspace/lldb-cmake-standalone/lldb-xcode-build/Release/lib/liblldbBreakpoint.a /Users/buildslave/jenkins/workspace/lldb-cmake-standalone/lldb-xcode-build/Release/lib/liblldbDataFormatters.a /Users/buildslave/jenkins/workspace/lldb-cmake-standalone/lldb-xcode-build/Release/lib/liblldbExpression.a /Users/buildslave/jenkins/workspace/lldb-cmake-standalone/lldb-xcode-build/Release/lib/liblldbInterpreter.a /Users/buildslave/jenkins/workspace/lldb-cmake-standalone/lldb-xcode-build/Release/lib/liblldbTarget.a /Users/buildslave/jenkins/workspace/lldb-cmake-standalone/lldb-xcode-build/Release/lib/liblldbPluginCPlusPlusLanguage.a /Users/buildslave/jenkins/workspace/lldb-cmake-standalone/lldb-xcode-build/Release/lib/liblldbPluginObjCLanguage.a /Users/buildslave/jenkins/workspace/lldb-cmake-standalone/lldb-xcode-build/Release/lib/liblldbPluginTypeSystemClang.a /Users/buildslave/jenkins/workspace/lldb-cmake-standalone/lldb-xcode-build/Release/lib/liblldbPluginObjectFilePDB.a /Users/buildslave/jenkins/workspace/lldb-cmake-standalone/lldb-xcode-build/Release/lib/liblldbPluginObjectFileJIT.a /Users/buildslave/jenkins/workspace/lldb-cmake-standalone/lldb-xcode-build/Release/lib/liblldbCommands.a /Users/buildslave/jenkins/workspace/lldb-cmake-standalone/lldb-xcode-build/Release/lib/liblldbPluginProcessUtility.a /Users/buildslave/jenkins/workspace/lldb-cmake-standalone/lldb-xcode-build/Release/lib/liblldbPluginClangCommon.a /Users/buildslave/jenkins/workspace/lldb-cmake-standalone/lldb-xcode-build/Release/lib/liblldbPluginCPPRuntime.a /Users/buildslave/jenkins/workspace/lldb-cmake-standalone/lldb-xcode-build/Release/lib/liblldbPluginAppleObjCRuntime.a /Users/buildslave/jenkins/workspace/lldb-cmake-standalone/lldb-xcode-build/Release/lib/liblldbPluginExpressionParserClang.a /Users/buildslave/jenkins/workspace/lldb-cmake-standalone/lldb-xcode-build/Release/lib/liblldbPluginSymbolFileDWARF.a /Users/buildslave/jenkins/workspace/lldb-cmake-standalone/lldb-xcode-build/Release/lib/liblldbPluginSymbolFilePDB.a /Users/buildslave/jenkins/workspace/lldb-cmake-standalone/lldb-xcode-build/Release/lib/liblldbPluginObjCRuntime.a /Users/buildslave/jenkins/workspace/lldb-cmake-standalone/lldb-xcode-build/Release/lib/liblldbPluginRenderScriptRuntime.a /usr/lib/libform.dylib /usr/lib/libpanel.dylib /Users/buildslave/jenkins/workspace/lldb-cmake-standalone/lldb-xcode-build/Release/lib/liblldbBase.a /Users/buildslave/jenkins/workspace/lldb-cmake-standalone/clang-build/lib/libLLVMMCJIT.a /Users/buildslave/jenkins/workspace/lldb-cmake-standalone/clang-build/lib/libLLVMExecutionEngine.a /Users/buildslave/jenkins/workspace/lldb-cmake-standalone/clang-build/lib/libLLVMOrcTargetProcess.a /Users/buildslave/jenkins/workspace/lldb-cmake-standalone/clang-build/lib/libLLVMOrcShared.a /Users/buildslave/jenkins/workspace/lldb-cmake-standalone/clang-build/lib/libLLVMRuntimeDyld.a /Users/buildslave/jenkins/workspace/lldb-cmake-standalone/clang-build/lib/libclangCodeGen.a /Users/buildslave/jenkins/workspace/lldb-cmake-standalone/clang-build/lib/libLLVMCoverage.a /Users/buildslave/jenkins/workspace/lldb-cmake-standalone/clang-build/lib/libLLVMLTO.a /Users/buildslave/jenkins/workspace/lldb-cmake-standalone/clang-build/lib/libLLVMExtensions.a /Users/buildslave/jenkins/workspace/lldb-cmake-standalone/clang-build/lib/libLLVMCodeGen.a /Users/buildslave/jenkins/workspace/lldb-cmake-standalone/clang-build/lib/libLLVMPasses.a /Users/buildslave/jenkins/workspace/lldb-cmake-standalone/clang-build/lib/libLLVMCoroutines.a /Users/buildslave/jenkins/workspace/lldb-cmake-standalone/clang-build/lib/libLLVMipo.a /Users/buildslave/jenkins/workspace/lldb-cmake-standalone/clang-build/lib/libLLVMBitWriter.a /Users/buildslave/jenkins/workspace/lldb-cmake-standalone/clang-build/lib/libLLVMLinker.a /Users/buildslave/jenkins/workspace/lldb-cmake-standalone/clang-build/lib/libLLVMVectorize.a /Users/buildslave/jenkins/workspace/lldb-cmake-standalone/clang-build/lib/libLLVMInstrumentation.a /Users/buildslave/jenkins/workspace/lldb-cmake-standalone/clang-build/lib/libLLVMObjCARCOpts.a /Users/buildslave/jenkins/workspace/lldb-cmake-standalone/clang-build/lib/libclangRewriteFrontend.a /Users/buildslave/jenkins/workspace/lldb-cmake-standalone/clang-build/lib/libclangFrontend.a /Users/buildslave/jenkins/workspace/lldb-cmake-standalone/clang-build/lib/libclangDriver.a /Users/buildslave/jenkins/workspace/lldb-cmake-standalone/clang-build/lib/libLLVMOption.a /Users/buildslave/jenkins/workspace/lldb-cmake-standalone/clang-build/lib/libclangParse.a /Users/buildslave/jenkins/workspace/lldb-cmake-standalone/clang-build/lib/libclangRewrite.a /Users/buildslave/jenkins/workspace/lldb-cmake-standalone/clang-build/lib/libclangSerialization.a /Users/buildslave/jenkins/workspace/lldb-cmake-standalone/clang-build/lib/libclangSema.a /Users/buildslave/jenkins/workspace/lldb-cmake-standalone/clang-build/lib/libclangEdit.a /Users/buildslave/jenkins/workspace/lldb-cmake-standalone/clang-build/lib/libclangAnalysis.a /Users/buildslave/jenkins/workspace/lldb-cmake-standalone/clang-build/lib/libclangASTMatchers.a /Users/buildslave/jenkins/workspace/lldb-cmake-standalone/clang-build/lib/libLLVMDebugInfoDWARF.a /Users/buildslave/jenkins/workspace/lldb-cmake-standalone/clang-build/lib/libLLVMDebugInfoPDB.a /Users/buildslave/jenkins/workspace/lldb-cmake-standalone/clang-build/lib/libLLVMDebugInfoMSF.a /Users/buildslave/jenkins/workspace/lldb-cmake-standalone/clang-build/lib/libclangAST.a /Users/buildslave/jenkins/workspace/lldb-cmake-standalone/clang-build/lib/libLLVMFrontendOpenMP.a /Users/buildslave/jenkins/workspace/lldb-cmake-standalone/clang-build/lib/libLLVMScalarOpts.a /Users/buildslave/jenkins/workspace/lldb-cmake-standalone/clang-build/lib/libLLVMAggressiveInstCombine.a /Users/buildslave/jenkins/workspace/lldb-cmake-standalone/clang-build/lib/libLLVMInstCombine.a /Users/buildslave/jenkins/workspace/lldb-cmake-standalone/clang-build/lib/libLLVMTransformUtils.a /Users/buildslave/jenkins/workspace/lldb-cmake-standalone/clang-build/lib/libclangLex.a /Users/buildslave/jenkins/workspace/lldb-cmake-standalone/lldb-xcode-build/Release/lib/liblldbHost.a /usr/lib/libxml2.dylib /usr/lib/libedit.dylib /usr/local/lib/liblzma.dylib /usr/lib/libedit.dylib /usr/local/lib/liblzma.dylib /Users/buildslave/jenkins/workspace/lldb-cmake-standalone/lldb-xcode-build/Release/lib/liblldbHostMacOSXObjCXX.a /Users/buildslave/jenkins/workspace/lldb-cmake-standalone/clang-build/lib/libclangBasic.a /Users/buildslave/jenkins/workspace/lldb-cmake-standalone/clang-build/lib/libLLVMTarget.a /Users/buildslave/jenkins/workspace/lldb-cmake-standalone/clang-build/lib/libLLVMAnalysis.a /Users/buildslave/jenkins/workspace/lldb-cmake-standalone/clang-build/lib/libLLVMProfileData.a /Users/buildslave/jenkins/workspace/lldb-cmake-standalone/clang-build/lib/libLLVMIRReader.a /Users/buildslave/jenkins/workspace/lldb-cmake-standalone/clang-build/lib/libLLVMAsmParser.a /Users/buildslave/jenkins/workspace/lldb-cmake-standalone/clang-build/lib/libgtest.a -lpthread /Users/buildslave/jenkins/workspace/lldb-cmake-standalone/lldb-xcode-build/Release/lib/liblldbUtility.a -framework Foundation -framework CoreFoundation -framework CoreServices -framework Security /Users/buildslave/jenkins/workspace/lldb-cmake-standalone/clang-build/lib/libLLVMObjectYAML.a /Users/buildslave/jenkins/workspace/lldb-cmake-standalone/clang-build/lib/libLLVMObject.a /Users/buildslave/jenkins/workspace/lldb-cmake-standalone/clang-build/lib/libLLVMBitReader.a /Users/buildslave/jenkins/workspace/lldb-cmake-standalone/clang-build/lib/libLLVMCore.a /Users/buildslave/jenkins/workspace/lldb-cmake-standalone/clang-build/lib/libLLVMRemarks.a /Users/buildslave/jenkins/workspace/lldb-cmake-standalone/clang-build/lib/libLLVMBitstreamReader.a /Users/buildslave/jenkins/workspace/lldb-cmake-standalone/clang-build/lib/libLLVMMCParser.a /Users/buildslave/jenkins/workspace/lldb-cmake-standalone/clang-build/lib/libLLVMTextAPI.a /Users/buildslave/jenkins/workspace/lldb-cmake-standalone/clang-build/lib/libLLVMMC.a /Users/buildslave/jenkins/workspace/lldb-cmake-standalone/clang-build/lib/libLLVMBinaryFormat.a /Users/buildslave/jenkins/workspace/lldb-cmake-standalone/clang-build/lib/libLLVMDebugInfoCodeView.a /Users/buildslave/jenkins/workspace/lldb-cmake-standalone/clang-build/lib/libLLVMSupport.a -lm /usr/lib/libz.dylib /usr/lib/libcurses.dylib /Users/buildslave/jenkins/workspace/lldb-cmake-standalone/clang-build/lib/libLLVMDemangle.a -Xlinker -dependency_info -Xlinker /Users/buildslave/jenkins/workspace/lldb-cmake-standalone/lldb-xcode-build/unittests/SymbolFile/NativePDB/lldb.build/Release/SymbolFileNativePDBTests.build/Objects-normal/x86_64/SymbolFileNativePDBTests_dependency_info.dat -o /Users/buildslave/jenkins/workspace/lldb-cmake-standalone/lldb-xcode-build/unittests/SymbolFile/NativePDB/Release/SymbolFileNativePDBTests

Hide Details

PhaseScriptExecution CMake\ PostBuild\ Rules /Users/buildslave/jenkins/workspace/lldb-cmake-standalone/lldb-xcode-build/unittests/SymbolFile/NativePDB/lldb.build/Release/SymbolFileNativePDBTests.build/Script-BC90260F013F421DB73E4C39.sh cd /Users/buildslave/jenkins/workspace/lldb-cmake-standalone/llvm-project/lldb /bin/sh -c /Users/buildslave/jenkins/workspace/lldb-cmake-standalone/lldb-xcode-build/unittests/SymbolFile/NativePDB/lldb.build/Release/SymbolFileNativePDBTests.build/Script-BC90260F013F421DB73E4C39.sh /usr/local/Cellar/cmake/3.17.2/bin/cmake -E make_directory /Users/buildslave/jenkins/workspace/lldb-cmake-standalone/lldb-xcode-build/unittests/SymbolFile/NativePDB/Release/Inputs

Hide Details

CodeSign /Users/buildslave/jenkins/workspace/lldb-cmake-standalone/lldb-xcode-build/unittests/SymbolFile/NativePDB/Release/SymbolFileNativePDBTests cd /Users/buildslave/jenkins/workspace/lldb-cmake-standalone/llvm-project/lldb

Hide Details

Signing Identity: "-"

Hide Details

/usr/bin/codesign --force --sign - --entitlements /Users/buildslave/jenkins/workspace/lldb-cmake-standalone/lldb-xcode-build/unittests/SymbolFile/NativePDB/lldb.build/Release/SymbolFileNativePDBTests.build/SymbolFileNativePDBTests.xcent --timestamp=none /Users/buildslave/jenkins/workspace/lldb-cmake-standalone/lldb-xcode-build/unittests/SymbolFile/NativePDB/Release/SymbolFileNativePDBTests

Hide Details

=== BUILD TARGET TargetTests OF PROJECT lldb WITH CONFIGURATION Release ===

Hide Details

Check dependencies

Hide Details

Write auxiliary files write-file /Users/buildslave/jenkins/workspace/lldb-cmake-standalone/lldb-xcode-build/unittests/Target/lldb.build/Release/TargetTests.build/Script-BBFCFCE2EAE040A384EF42D3.sh chmod 0755 /Users/buildslave/jenkins/workspace/lldb-cmake-standalone/lldb-xcode-build/unittests/Target/lldb.build/Release/TargetTests.build/Script-BBFCFCE2EAE040A384EF42D3.sh

Hide Details

Ld /Users/buildslave/jenkins/workspace/lldb-cmake-standalone/lldb-xcode-build/unittests/Target/Release/TargetTests normal x86_64 cd /Users/buildslave/jenkins/workspace/lldb-cmake-standalone/llvm-project/lldb /Applications/Xcode.app/Contents/Developer/Toolchains/XcodeDefault.xctoolchain/usr/bin/clang++ -target x86_64-apple-macos10.12 -isysroot /Applications/Xcode.app/Contents/Developer/Platforms/MacOSX.platform/Developer/SDKs/MacOSX10.15.sdk -L/Users/buildslave/jenkins/workspace/lldb-cmake-standalone/lldb-xcode-build/unittests/Target/Release -F/Users/buildslave/jenkins/workspace/lldb-cmake-standalone/lldb-xcode-build/unittests/Target/Release -filelist /Users/buildslave/jenkins/workspace/lldb-cmake-standalone/lldb-xcode-build/unittests/Target/lldb.build/Release/TargetTests.build/Objects-normal/x86_64/TargetTests.LinkFileList -Wl,-dead_strip -Wl,-search_paths_first -Wl,-headerpad_max_install_names /Users/buildslave/jenkins/workspace/lldb-cmake-standalone/clang-build/lib/libLLVMSupport.a /Users/buildslave/jenkins/workspace/lldb-cmake-standalone/clang-build/lib/libLLVMSupport.a /Users/buildslave/jenkins/workspace/lldb-cmake-standalone/clang-build/lib/libgtest_main.a /Users/buildslave/jenkins/workspace/lldb-cmake-standalone/clang-build/lib/libgtest.a /Users/buildslave/jenkins/workspace/lldb-cmake-standalone/lldb-xcode-build/Release/lib/liblldbCore.a /Users/buildslave/jenkins/workspace/lldb-cmake-standalone/lldb-xcode-build/Release/lib/liblldbHost.a /Users/buildslave/jenkins/workspace/lldb-cmake-standalone/lldb-xcode-build/Release/lib/liblldbPluginObjectFileELF.a /Users/buildslave/jenkins/workspace/lldb-cmake-standalone/lldb-xcode-build/Release/lib/liblldbPluginPlatformLinux.a /Users/buildslave/jenkins/workspace/lldb-cmake-standalone/lldb-xcode-build/Release/lib/liblldbPluginSymbolFileSymtab.a /Users/buildslave/jenkins/workspace/lldb-cmake-standalone/lldb-xcode-build/Release/lib/liblldbTarget.a /Users/buildslave/jenkins/workspace/lldb-cmake-standalone/lldb-xcode-build/Release/lib/liblldbSymbol.a /Users/buildslave/jenkins/workspace/lldb-cmake-standalone/lldb-xcode-build/Release/lib/liblldbUtility.a /Users/buildslave/jenkins/workspace/lldb-cmake-standalone/lldb-xcode-build/Release/lib/liblldbUtilityHelpers.a /Users/buildslave/jenkins/workspace/lldb-cmake-standalone/lldb-xcode-build/Release/lib/liblldbPluginPlatformPOSIX.a /Users/buildslave/jenkins/workspace/lldb-cmake-standalone/lldb-xcode-build/Release/lib/liblldbCore.a /Users/buildslave/jenkins/workspace/lldb-cmake-standalone/lldb-xcode-build/Release/lib/liblldbTarget.a /Users/buildslave/jenkins/workspace/lldb-cmake-standalone/lldb-xcode-build/Release/lib/liblldbSymbol.a /Users/buildslave/jenkins/workspace/lldb-cmake-standalone/lldb-xcode-build/Release/lib/liblldbBreakpoint.a /Users/buildslave/jenkins/workspace/lldb-cmake-standalone/lldb-xcode-build/Release/lib/liblldbDataFormatters.a /Users/buildslave/jenkins/workspace/lldb-cmake-standalone/lldb-xcode-build/Release/lib/liblldbExpression.a /Users/buildslave/jenkins/workspace/lldb-cmake-standalone/lldb-xcode-build/Release/lib/liblldbInterpreter.a /Users/buildslave/jenkins/workspace/lldb-cmake-standalone/lldb-xcode-build/Release/lib/liblldbPluginCPlusPlusLanguage.a /Users/buildslave/jenkins/workspace/lldb-cmake-standalone/lldb-xcode-build/Release/lib/liblldbPluginObjCLanguage.a /Users/buildslave/jenkins/workspace/lldb-cmake-standalone/lldb-xcode-build/Release/lib/liblldbPluginProcessUtility.a /Users/buildslave/jenkins/workspace/lldb-cmake-standalone/lldb-xcode-build/Release/lib/liblldbPluginObjectFileJIT.a /Users/buildslave/jenkins/workspace/lldb-cmake-standalone/lldb-xcode-build/Release/lib/liblldbCommands.a /Users/buildslave/jenkins/workspace/lldb-cmake-standalone/lldb-xcode-build/Release/lib/liblldbPluginClangCommon.a /Users/buildslave/jenkins/workspace/lldb-cmake-standalone/lldb-xcode-build/Release/lib/liblldbPluginCPPRuntime.a /Users/buildslave/jenkins/workspace/lldb-cmake-standalone/lldb-xcode-build/Release/lib/liblldbPluginTypeSystemClang.a /Users/buildslave/jenkins/workspace/lldb-cmake-standalone/lldb-xcode-build/Release/lib/liblldbPluginAppleObjCRuntime.a /Users/buildslave/jenkins/workspace/lldb-cmake-standalone/lldb-xcode-build/Release/lib/liblldbPluginExpressionParserClang.a /Users/buildslave/jenkins/workspace/lldb-cmake-standalone/lldb-xcode-build/Release/lib/liblldbPluginSymbolFileDWARF.a /Users/buildslave/jenkins/workspace/lldb-cmake-standalone/lldb-xcode-build/Release/lib/liblldbPluginSymbolFilePDB.a /Users/buildslave/jenkins/workspace/lldb-cmake-standalone/lldb-xcode-build/Release/lib/liblldbPluginObjCRuntime.a /Users/buildslave/jenkins/workspace/lldb-cmake-standalone/lldb-xcode-build/Release/lib/liblldbPluginRenderScriptRuntime.a /Users/buildslave/jenkins/workspace/lldb-cmake-standalone/lldb-xcode-build/Release/lib/liblldbPluginSymbolFileNativePDB.a /Users/buildslave/jenkins/workspace/lldb-cmake-standalone/lldb-xcode-build/Release/lib/liblldbPluginObjectFilePDB.a /Users/buildslave/jenkins/workspace/lldb-cmake-standalone/lldb-xcode-build/Release/lib/liblldbCore.a /Users/buildslave/jenkins/workspace/lldb-cmake-standalone/lldb-xcode-build/Release/lib/liblldbTarget.a /Users/buildslave/jenkins/workspace/lldb-cmake-standalone/lldb-xcode-build/Release/lib/liblldbSymbol.a /Users/buildslave/jenkins/workspace/lldb-cmake-standalone/lldb-xcode-build/Release/lib/liblldbBreakpoint.a /Users/buildslave/jenkins/workspace/lldb-cmake-standalone/lldb-xcode-build/Release/lib/liblldbDataFormatters.a /Users/buildslave/jenkins/workspace/lldb-cmake-standalone/lldb-xcode-build/Release/lib/liblldbExpression.a /Users/buildslave/jenkins/workspace/lldb-cmake-standalone/lldb-xcode-build/Release/lib/liblldbInterpreter.a /Users/buildslave/jenkins/workspace/lldb-cmake-standalone/lldb-xcode-build/Release/lib/liblldbPluginCPlusPlusLanguage.a /Users/buildslave/jenkins/workspace/lldb-cmake-standalone/lldb-xcode-build/Release/lib/liblldbPluginObjCLanguage.a /Users/buildslave/jenkins/workspace/lldb-cmake-standalone/lldb-xcode-build/Release/lib/liblldbPluginProcessUtility.a /Users/buildslave/jenkins/workspace/lldb-cmake-standalone/lldb-xcode-build/Release/lib/liblldbPluginObjectFileJIT.a /Users/buildslave/jenkins/workspace/lldb-cmake-standalone/lldb-xcode-build/Release/lib/liblldbCommands.a /Users/buildslave/jenkins/workspace/lldb-cmake-standalone/lldb-xcode-build/Release/lib/liblldbPluginClangCommon.a /Users/buildslave/jenkins/workspace/lldb-cmake-standalone/lldb-xcode-build/Release/lib/liblldbPluginCPPRuntime.a /Users/buildslave/jenkins/workspace/lldb-cmake-standalone/lldb-xcode-build/Release/lib/liblldbPluginTypeSystemClang.a /Users/buildslave/jenkins/workspace/lldb-cmake-standalone/lldb-xcode-build/Release/lib/liblldbPluginAppleObjCRuntime.a /Users/buildslave/jenkins/workspace/lldb-cmake-standalone/lldb-xcode-build/Release/lib/liblldbPluginExpressionParserClang.a /Users/buildslave/jenkins/workspace/lldb-cmake-standalone/lldb-xcode-build/Release/lib/liblldbPluginSymbolFileDWARF.a /Users/buildslave/jenkins/workspace/lldb-cmake-standalone/lldb-xcode-build/Release/lib/liblldbPluginSymbolFilePDB.a /Users/buildslave/jenkins/workspace/lldb-cmake-standalone/lldb-xcode-build/Release/lib/liblldbPluginObjCRuntime.a /Users/buildslave/jenkins/workspace/lldb-cmake-standalone/lldb-xcode-build/Release/lib/liblldbPluginRenderScriptRuntime.a /Users/buildslave/jenkins/workspace/lldb-cmake-standalone/lldb-xcode-build/Release/lib/liblldbPluginSymbolFileNativePDB.a /Users/buildslave/jenkins/workspace/lldb-cmake-standalone/lldb-xcode-build/Release/lib/liblldbPluginObjectFilePDB.a /Users/buildslave/jenkins/workspace/lldb-cmake-standalone/lldb-xcode-build/Release/lib/liblldbCore.a /Users/buildslave/jenkins/workspace/lldb-cmake-standalone/lldb-xcode-build/Release/lib/liblldbTarget.a /Users/buildslave/jenkins/workspace/lldb-cmake-standalone/lldb-xcode-build/Release/lib/liblldbSymbol.a /Users/buildslave/jenkins/workspace/lldb-cmake-standalone/lldb-xcode-build/Release/lib/liblldbBreakpoint.a /Users/buildslave/jenkins/workspace/lldb-cmake-standalone/lldb-xcode-build/Release/lib/liblldbDataFormatters.a /Users/buildslave/jenkins/workspace/lldb-cmake-standalone/lldb-xcode-build/Release/lib/liblldbExpression.a /Users/buildslave/jenkins/workspace/lldb-cmake-standalone/lldb-xcode-build/Release/lib/liblldbInterpreter.a /Users/buildslave/jenkins/workspace/lldb-cmake-standalone/lldb-xcode-build/Release/lib/liblldbPluginCPlusPlusLanguage.a /Users/buildslave/jenkins/workspace/lldb-cmake-standalone/lldb-xcode-build/Release/lib/liblldbPluginObjCLanguage.a /Users/buildslave/jenkins/workspace/lldb-cmake-standalone/lldb-xcode-build/Release/lib/liblldbPluginProcessUtility.a /Users/buildslave/jenkins/workspace/lldb-cmake-standalone/lldb-xcode-build/Release/lib/liblldbPluginObjectFileJIT.a /Users/buildslave/jenkins/workspace/lldb-cmake-standalone/lldb-xcode-build/Release/lib/liblldbCommands.a /Users/buildslave/jenkins/workspace/lldb-cmake-standalone/lldb-xcode-build/Release/lib/liblldbPluginClangCommon.a /Users/buildslave/jenkins/workspace/lldb-cmake-standalone/lldb-xcode-build/Release/lib/liblldbPluginCPPRuntime.a /Users/buildslave/jenkins/workspace/lldb-cmake-standalone/lldb-xcode-build/Release/lib/liblldbPluginTypeSystemClang.a /Users/buildslave/jenkins/workspace/lldb-cmake-standalone/lldb-xcode-build/Release/lib/liblldbPluginAppleObjCRuntime.a /Users/buildslave/jenkins/workspace/lldb-cmake-standalone/lldb-xcode-build/Release/lib/liblldbPluginExpressionParserClang.a /Users/buildslave/jenkins/workspace/lldb-cmake-standalone/lldb-xcode-build/Release/lib/liblldbPluginSymbolFileDWARF.a /Users/buildslave/jenkins/workspace/lldb-cmake-standalone/lldb-xcode-build/Release/lib/liblldbPluginSymbolFilePDB.a /Users/buildslave/jenkins/workspace/lldb-cmake-standalone/lldb-xcode-build/Release/lib/liblldbPluginObjCRuntime.a /Users/buildslave/jenkins/workspace/lldb-cmake-standalone/lldb-xcode-build/Release/lib/liblldbPluginRenderScriptRuntime.a /Users/buildslave/jenkins/workspace/lldb-cmake-standalone/lldb-xcode-build/Release/lib/liblldbPluginSymbolFileNativePDB.a /Users/buildslave/jenkins/workspace/lldb-cmake-standalone/lldb-xcode-build/Release/lib/liblldbPluginObjectFilePDB.a /Users/buildslave/jenkins/workspace/lldb-cmake-standalone/lldb-xcode-build/Release/lib/liblldbCore.a /Users/buildslave/jenkins/workspace/lldb-cmake-standalone/lldb-xcode-build/Release/lib/liblldbTarget.a /Users/buildslave/jenkins/workspace/lldb-cmake-standalone/lldb-xcode-build/Release/lib/liblldbSymbol.a /Users/buildslave/jenkins/workspace/lldb-cmake-standalone/lldb-xcode-build/Release/lib/liblldbBreakpoint.a /Users/buildslave/jenkins/workspace/lldb-cmake-standalone/lldb-xcode-build/Release/lib/liblldbDataFormatters.a /Users/buildslave/jenkins/workspace/lldb-cmake-standalone/lldb-xcode-build/Release/lib/liblldbExpression.a /Users/buildslave/jenkins/workspace/lldb-cmake-standalone/lldb-xcode-build/Release/lib/liblldbInterpreter.a /Users/buildslave/jenkins/workspace/lldb-cmake-standalone/lldb-xcode-build/Release/lib/liblldbPluginCPlusPlusLanguage.a /Users/buildslave/jenkins/workspace/lldb-cmake-standalone/lldb-xcode-build/Release/lib/liblldbPluginObjCLanguage.a /Users/buildslave/jenkins/workspace/lldb-cmake-standalone/lldb-xcode-build/Release/lib/liblldbPluginProcessUtility.a /Users/buildslave/jenkins/workspace/lldb-cmake-standalone/lldb-xcode-build/Release/lib/liblldbPluginObjectFileJIT.a /Users/buildslave/jenkins/workspace/lldb-cmake-standalone/lldb-xcode-build/Release/lib/liblldbCommands.a /Users/buildslave/jenkins/workspace/lldb-cmake-standalone/lldb-xcode-build/Release/lib/liblldbPluginClangCommon.a /Users/buildslave/jenkins/workspace/lldb-cmake-standalone/lldb-xcode-build/Release/lib/liblldbPluginCPPRuntime.a /Users/buildslave/jenkins/workspace/lldb-cmake-standalone/lldb-xcode-build/Release/lib/liblldbPluginTypeSystemClang.a /Users/buildslave/jenkins/workspace/lldb-cmake-standalone/lldb-xcode-build/Release/lib/liblldbPluginAppleObjCRuntime.a /Users/buildslave/jenkins/workspace/lldb-cmake-standalone/lldb-xcode-build/Release/lib/liblldbPluginExpressionParserClang.a /Users/buildslave/jenkins/workspace/lldb-cmake-standalone/lldb-xcode-build/Release/lib/liblldbPluginSymbolFileDWARF.a /Users/buildslave/jenkins/workspace/lldb-cmake-standalone/lldb-xcode-build/Release/lib/liblldbPluginSymbolFilePDB.a /Users/buildslave/jenkins/workspace/lldb-cmake-standalone/lldb-xcode-build/Release/lib/liblldbPluginObjCRuntime.a /Users/buildslave/jenkins/workspace/lldb-cmake-standalone/lldb-xcode-build/Release/lib/liblldbPluginRenderScriptRuntime.a /Users/buildslave/jenkins/workspace/lldb-cmake-standalone/lldb-xcode-build/Release/lib/liblldbPluginSymbolFileNativePDB.a /Users/buildslave/jenkins/workspace/lldb-cmake-standalone/lldb-xcode-build/Release/lib/liblldbPluginObjectFilePDB.a /Users/buildslave/jenkins/workspace/lldb-cmake-standalone/lldb-xcode-build/Release/lib/liblldbCore.a /Users/buildslave/jenkins/workspace/lldb-cmake-standalone/lldb-xcode-build/Release/lib/liblldbTarget.a /Users/buildslave/jenkins/workspace/lldb-cmake-standalone/lldb-xcode-build/Release/lib/liblldbSymbol.a /Users/buildslave/jenkins/workspace/lldb-cmake-standalone/lldb-xcode-build/Release/lib/liblldbBreakpoint.a /Users/buildslave/jenkins/workspace/lldb-cmake-standalone/lldb-xcode-build/Release/lib/liblldbDataFormatters.a /Users/buildslave/jenkins/workspace/lldb-cmake-standalone/lldb-xcode-build/Release/lib/liblldbExpression.a /Users/buildslave/jenkins/workspace/lldb-cmake-standalone/lldb-xcode-build/Release/lib/liblldbInterpreter.a /Users/buildslave/jenkins/workspace/lldb-cmake-standalone/lldb-xcode-build/Release/lib/liblldbPluginCPlusPlusLanguage.a /Users/buildslave/jenkins/workspace/lldb-cmake-standalone/lldb-xcode-build/Release/lib/liblldbPluginObjCLanguage.a /Users/buildslave/jenkins/workspace/lldb-cmake-standalone/lldb-xcode-build/Release/lib/liblldbPluginProcessUtility.a /Users/buildslave/jenkins/workspace/lldb-cmake-standalone/lldb-xcode-build/Release/lib/liblldbPluginObjectFileJIT.a /Users/buildslave/jenkins/workspace/lldb-cmake-standalone/lldb-xcode-build/Release/lib/liblldbCommands.a /Users/buildslave/jenkins/workspace/lldb-cmake-standalone/lldb-xcode-build/Release/lib/liblldbPluginClangCommon.a /Users/buildslave/jenkins/workspace/lldb-cmake-standalone/lldb-xcode-build/Release/lib/liblldbPluginCPPRuntime.a /Users/buildslave/jenkins/workspace/lldb-cmake-standalone/lldb-xcode-build/Release/lib/liblldbPluginTypeSystemClang.a /Users/buildslave/jenkins/workspace/lldb-cmake-standalone/lldb-xcode-build/Release/lib/liblldbPluginAppleObjCRuntime.a /Users/buildslave/jenkins/workspace/lldb-cmake-standalone/lldb-xcode-build/Release/lib/liblldbPluginExpressionParserClang.a /Users/buildslave/jenkins/workspace/lldb-cmake-standalone/lldb-xcode-build/Release/lib/liblldbPluginSymbolFileDWARF.a /Users/buildslave/jenkins/workspace/lldb-cmake-standalone/lldb-xcode-build/Release/lib/liblldbPluginSymbolFilePDB.a /Users/buildslave/jenkins/workspace/lldb-cmake-standalone/lldb-xcode-build/Release/lib/liblldbPluginObjCRuntime.a /Users/buildslave/jenkins/workspace/lldb-cmake-standalone/lldb-xcode-build/Release/lib/liblldbPluginRenderScriptRuntime.a /Users/buildslave/jenkins/workspace/lldb-cmake-standalone/lldb-xcode-build/Release/lib/liblldbPluginSymbolFileNativePDB.a /Users/buildslave/jenkins/workspace/lldb-cmake-standalone/lldb-xcode-build/Release/lib/liblldbPluginObjectFilePDB.a /usr/lib/libform.dylib /usr/lib/libpanel.dylib /Users/buildslave/jenkins/workspace/lldb-cmake-standalone/lldb-xcode-build/Release/lib/liblldbBase.a /Users/buildslave/jenkins/workspace/lldb-cmake-standalone/clang-build/lib/libLLVMMCJIT.a /Users/buildslave/jenkins/workspace/lldb-cmake-standalone/clang-build/lib/libLLVMExecutionEngine.a /Users/buildslave/jenkins/workspace/lldb-cmake-standalone/clang-build/lib/libLLVMOrcTargetProcess.a /Users/buildslave/jenkins/workspace/lldb-cmake-standalone/clang-build/lib/libLLVMOrcShared.a /Users/buildslave/jenkins/workspace/lldb-cmake-standalone/clang-build/lib/libLLVMRuntimeDyld.a /Users/buildslave/jenkins/workspace/lldb-cmake-standalone/clang-build/lib/libclangCodeGen.a /Users/buildslave/jenkins/workspace/lldb-cmake-standalone/clang-build/lib/libLLVMCoverage.a /Users/buildslave/jenkins/workspace/lldb-cmake-standalone/clang-build/lib/libLLVMLTO.a /Users/buildslave/jenkins/workspace/lldb-cmake-standalone/clang-build/lib/libLLVMExtensions.a /Users/buildslave/jenkins/workspace/lldb-cmake-standalone/clang-build/lib/libLLVMCodeGen.a /Users/buildslave/jenkins/workspace/lldb-cmake-standalone/clang-build/lib/libLLVMPasses.a /Users/buildslave/jenkins/workspace/lldb-cmake-standalone/clang-build/lib/libLLVMCoroutines.a /Users/buildslave/jenkins/workspace/lldb-cmake-standalone/clang-build/lib/libLLVMipo.a /Users/buildslave/jenkins/workspace/lldb-cmake-standalone/clang-build/lib/libLLVMBitWriter.a /Users/buildslave/jenkins/workspace/lldb-cmake-standalone/clang-build/lib/libLLVMLinker.a /Users/buildslave/jenkins/workspace/lldb-cmake-standalone/clang-build/lib/libLLVMVectorize.a /Users/buildslave/jenkins/workspace/lldb-cmake-standalone/clang-build/lib/libLLVMInstrumentation.a /Users/buildslave/jenkins/workspace/lldb-cmake-standalone/clang-build/lib/libLLVMObjCARCOpts.a /Users/buildslave/jenkins/workspace/lldb-cmake-standalone/clang-build/lib/libclangRewriteFrontend.a /Users/buildslave/jenkins/workspace/lldb-cmake-standalone/clang-build/lib/libclangFrontend.a /Users/buildslave/jenkins/workspace/lldb-cmake-standalone/clang-build/lib/libclangDriver.a /Users/buildslave/jenkins/workspace/lldb-cmake-standalone/clang-build/lib/libLLVMOption.a /Users/buildslave/jenkins/workspace/lldb-cmake-standalone/clang-build/lib/libclangParse.a /Users/buildslave/jenkins/workspace/lldb-cmake-standalone/clang-build/lib/libclangRewrite.a /Users/buildslave/jenkins/workspace/lldb-cmake-standalone/clang-build/lib/libclangSerialization.a /Users/buildslave/jenkins/workspace/lldb-cmake-standalone/clang-build/lib/libclangSema.a /Users/buildslave/jenkins/workspace/lldb-cmake-standalone/clang-build/lib/libclangEdit.a /Users/buildslave/jenkins/workspace/lldb-cmake-standalone/clang-build/lib/libclangAnalysis.a /Users/buildslave/jenkins/workspace/lldb-cmake-standalone/clang-build/lib/libclangASTMatchers.a /Users/buildslave/jenkins/workspace/lldb-cmake-standalone/clang-build/lib/libLLVMDebugInfoDWARF.a /Users/buildslave/jenkins/workspace/lldb-cmake-standalone/lldb-xcode-build/Release/lib/liblldbHost.a /usr/lib/libxml2.dylib /usr/lib/libedit.dylib /usr/local/lib/liblzma.dylib /usr/lib/libedit.dylib /usr/local/lib/liblzma.dylib /Users/buildslave/jenkins/workspace/lldb-cmake-standalone/lldb-xcode-build/Release/lib/liblldbHostMacOSXObjCXX.a /Users/buildslave/jenkins/workspace/lldb-cmake-standalone/clang-build/lib/libLLVMTarget.a /Users/buildslave/jenkins/workspace/lldb-cmake-standalone/clang-build/lib/libLLVMIRReader.a /Users/buildslave/jenkins/workspace/lldb-cmake-standalone/clang-build/lib/libLLVMAsmParser.a /Users/buildslave/jenkins/workspace/lldb-cmake-standalone/clang-build/lib/libclangAST.a /Users/buildslave/jenkins/workspace/lldb-cmake-standalone/clang-build/lib/libLLVMFrontendOpenMP.a /Users/buildslave/jenkins/workspace/lldb-cmake-standalone/clang-build/lib/libLLVMScalarOpts.a /Users/buildslave/jenkins/workspace/lldb-cmake-standalone/clang-build/lib/libLLVMAggressiveInstCombine.a /Users/buildslave/jenkins/workspace/lldb-cmake-standalone/clang-build/lib/libLLVMInstCombine.a /Users/buildslave/jenkins/workspace/lldb-cmake-standalone/clang-build/lib/libLLVMTransformUtils.a /Users/buildslave/jenkins/workspace/lldb-cmake-standalone/clang-build/lib/libLLVMAnalysis.a /Users/buildslave/jenkins/workspace/lldb-cmake-standalone/clang-build/lib/libLLVMProfileData.a /Users/buildslave/jenkins/workspace/lldb-cmake-standalone/clang-build/lib/libclangLex.a /Users/buildslave/jenkins/workspace/lldb-cmake-standalone/clang-build/lib/libclangBasic.a /Users/buildslave/jenkins/workspace/lldb-cmake-standalone/clang-build/lib/libLLVMDebugInfoPDB.a /Users/buildslave/jenkins/workspace/lldb-cmake-standalone/clang-build/lib/libLLVMDebugInfoMSF.a /Users/buildslave/jenkins/workspace/lldb-cmake-standalone/clang-build/lib/libgtest.a -lpthread /Users/buildslave/jenkins/workspace/lldb-cmake-standalone/lldb-xcode-build/Release/lib/liblldbUtility.a -framework Foundation -framework CoreFoundation -framework CoreServices -framework Security /Users/buildslave/jenkins/workspace/lldb-cmake-standalone/clang-build/lib/libLLVMObjectYAML.a /Users/buildslave/jenkins/workspace/lldb-cmake-standalone/clang-build/lib/libLLVMObject.a /Users/buildslave/jenkins/workspace/lldb-cmake-standalone/clang-build/lib/libLLVMBitReader.a /Users/buildslave/jenkins/workspace/lldb-cmake-standalone/clang-build/lib/libLLVMCore.a /Users/buildslave/jenkins/workspace/lldb-cmake-standalone/clang-build/lib/libLLVMRemarks.a /Users/buildslave/jenkins/workspace/lldb-cmake-standalone/clang-build/lib/libLLVMBitstreamReader.a /Users/buildslave/jenkins/workspace/lldb-cmake-standalone/clang-build/lib/libLLVMMCParser.a /Users/buildslave/jenkins/workspace/lldb-cmake-standalone/clang-build/lib/libLLVMTextAPI.a /Users/buildslave/jenkins/workspace/lldb-cmake-standalone/clang-build/lib/libLLVMMC.a /Users/buildslave/jenkins/workspace/lldb-cmake-standalone/clang-build/lib/libLLVMBinaryFormat.a /Users/buildslave/jenkins/workspace/lldb-cmake-standalone/clang-build/lib/libLLVMDebugInfoCodeView.a /Users/buildslave/jenkins/workspace/lldb-cmake-standalone/clang-build/lib/libLLVMSupport.a -lm /usr/lib/libz.dylib /usr/lib/libcurses.dylib /Users/buildslave/jenkins/workspace/lldb-cmake-standalone/clang-build/lib/libLLVMDemangle.a -Xlinker -dependency_info -Xlinker /Users/buildslave/jenkins/workspace/lldb-cmake-standalone/lldb-xcode-build/unittests/Target/lldb.build/Release/TargetTests.build/Objects-normal/x86_64/TargetTests_dependency_info.dat -o /Users/buildslave/jenkins/workspace/lldb-cmake-standalone/lldb-xcode-build/unittests/Target/Release/TargetTests

Hide Details

PhaseScriptExecution CMake\ PostBuild\ Rules /Users/buildslave/jenkins/workspace/lldb-cmake-standalone/lldb-xcode-build/unittests/Target/lldb.build/Release/TargetTests.build/Script-BBFCFCE2EAE040A384EF42D3.sh cd /Users/buildslave/jenkins/workspace/lldb-cmake-standalone/llvm-project/lldb /bin/sh -c /Users/buildslave/jenkins/workspace/lldb-cmake-standalone/lldb-xcode-build/unittests/Target/lldb.build/Release/TargetTests.build/Script-BBFCFCE2EAE040A384EF42D3.sh /usr/local/Cellar/cmake/3.17.2/bin/cmake -E make_directory /Users/buildslave/jenkins/workspace/lldb-cmake-standalone/lldb-xcode-build/unittests/Target/Release/Inputs echo "Copying TestModule.so to binary directory." Copying TestModule.so to binary directory. /usr/local/Cellar/cmake/3.17.2/bin/cmake -E copy /Users/buildslave/jenkins/workspace/lldb-cmake-standalone/llvm-project/lldb/unittests/Target/Inputs/TestModule.so /Users/buildslave/jenkins/workspace/lldb-cmake-standalone/lldb-xcode-build/unittests/Target/Release/Inputs

Hide Details

CodeSign /Users/buildslave/jenkins/workspace/lldb-cmake-standalone/lldb-xcode-build/unittests/Target/Release/TargetTests cd /Users/buildslave/jenkins/workspace/lldb-cmake-standalone/llvm-project/lldb

Hide Details

Signing Identity: "-"

Hide Details

/usr/bin/codesign --force --sign - --entitlements /Users/buildslave/jenkins/workspace/lldb-cmake-standalone/lldb-xcode-build/unittests/Target/lldb.build/Release/TargetTests.build/TargetTests.xcent --timestamp=none /Users/buildslave/jenkins/workspace/lldb-cmake-standalone/lldb-xcode-build/unittests/Target/Release/TargetTests

Hide Details

=== BUILD TARGET environment_check OF PROJECT lldb WITH CONFIGURATION Release ===

Hide Details

Check dependencies

Hide Details

=== BUILD TARGET thread_inferior OF PROJECT lldb WITH CONFIGURATION Release ===

Hide Details

Check dependencies

Hide Details

=== BUILD TARGET LLDBServerTests OF PROJECT lldb WITH CONFIGURATION Release ===

Hide Details

Check dependencies

Hide Details

Write auxiliary files write-file /Users/buildslave/jenkins/workspace/lldb-cmake-standalone/lldb-xcode-build/unittests/tools/lldb-server/tests/lldb.build/Release/LLDBServerTests.build/Script-367E1DB7327846BB96E5A0FA.sh chmod 0755 /Users/buildslave/jenkins/workspace/lldb-cmake-standalone/lldb-xcode-build/unittests/tools/lldb-server/tests/lldb.build/Release/LLDBServerTests.build/Script-367E1DB7327846BB96E5A0FA.sh

Hide Details

Ld /Users/buildslave/jenkins/workspace/lldb-cmake-standalone/lldb-xcode-build/unittests/tools/lldb-server/tests/Release/LLDBServerTests normal x86_64 cd /Users/buildslave/jenkins/workspace/lldb-cmake-standalone/llvm-project/lldb /Applications/Xcode.app/Contents/Developer/Toolchains/XcodeDefault.xctoolchain/usr/bin/clang++ -target x86_64-apple-macos10.12 -isysroot /Applications/Xcode.app/Contents/Developer/Platforms/MacOSX.platform/Developer/SDKs/MacOSX10.15.sdk -L/Users/buildslave/jenkins/workspace/lldb-cmake-standalone/lldb-xcode-build/unittests/tools/lldb-server/tests/Release -F/Users/buildslave/jenkins/workspace/lldb-cmake-standalone/lldb-xcode-build/unittests/tools/lldb-server/tests/Release -filelist /Users/buildslave/jenkins/workspace/lldb-cmake-standalone/lldb-xcode-build/unittests/tools/lldb-server/tests/lldb.build/Release/LLDBServerTests.build/Objects-normal/x86_64/LLDBServerTests.LinkFileList -Wl,-dead_strip -Wl,-search_paths_first -Wl,-headerpad_max_install_names /Users/buildslave/jenkins/workspace/lldb-cmake-standalone/clang-build/lib/libLLVMSupport.a /Users/buildslave/jenkins/workspace/lldb-cmake-standalone/clang-build/lib/libLLVMSupport.a /Users/buildslave/jenkins/workspace/lldb-cmake-standalone/clang-build/lib/libgtest_main.a /Users/buildslave/jenkins/workspace/lldb-cmake-standalone/clang-build/lib/libgtest.a /Users/buildslave/jenkins/workspace/lldb-cmake-standalone/lldb-xcode-build/Release/lib/liblldbHost.a /Users/buildslave/jenkins/workspace/lldb-cmake-standalone/lldb-xcode-build/Release/lib/liblldbCore.a /Users/buildslave/jenkins/workspace/lldb-cmake-standalone/lldb-xcode-build/Release/lib/liblldbInterpreter.a /Users/buildslave/jenkins/workspace/lldb-cmake-standalone/lldb-xcode-build/Release/lib/liblldbTarget.a /Users/buildslave/jenkins/workspace/lldb-cmake-standalone/lldb-xcode-build/Release/lib/liblldbPluginPlatformLinux.a /Users/buildslave/jenkins/workspace/lldb-cmake-standalone/lldb-xcode-build/Release/lib/liblldbPluginProcessGDBRemote.a /Users/buildslave/jenkins/workspace/lldb-cmake-standalone/clang-build/lib/libLLVMTestingSupport.a /Users/buildslave/jenkins/workspace/lldb-cmake-standalone/lldb-xcode-build/Release/lib/liblldbPluginPlatformMacOSX.a /Users/buildslave/jenkins/workspace/lldb-cmake-standalone/lldb-xcode-build/Release/lib/liblldbPluginPlatformPOSIX.a /Users/buildslave/jenkins/workspace/lldb-cmake-standalone/lldb-xcode-build/Release/lib/liblldbPluginPlatformMacOSXObjCXX.a /Users/buildslave/jenkins/workspace/lldb-cmake-standalone/lldb-xcode-build/Release/lib/liblldbCore.a /Users/buildslave/jenkins/workspace/lldb-cmake-standalone/lldb-xcode-build/Release/lib/liblldbInterpreter.a /Users/buildslave/jenkins/workspace/lldb-cmake-standalone/lldb-xcode-build/Release/lib/liblldbTarget.a /Users/buildslave/jenkins/workspace/lldb-cmake-standalone/lldb-xcode-build/Release/lib/liblldbBreakpoint.a /Users/buildslave/jenkins/workspace/lldb-cmake-standalone/lldb-xcode-build/Release/lib/liblldbDataFormatters.a /Users/buildslave/jenkins/workspace/lldb-cmake-standalone/lldb-xcode-build/Release/lib/liblldbExpression.a /Users/buildslave/jenkins/workspace/lldb-cmake-standalone/lldb-xcode-build/Release/lib/liblldbSymbol.a /Users/buildslave/jenkins/workspace/lldb-cmake-standalone/lldb-xcode-build/Release/lib/liblldbPluginCPlusPlusLanguage.a /Users/buildslave/jenkins/workspace/lldb-cmake-standalone/lldb-xcode-build/Release/lib/liblldbPluginObjCLanguage.a /Users/buildslave/jenkins/workspace/lldb-cmake-standalone/lldb-xcode-build/Release/lib/liblldbCommands.a /Users/buildslave/jenkins/workspace/lldb-cmake-standalone/lldb-xcode-build/Release/lib/liblldbPluginProcessUtility.a /Users/buildslave/jenkins/workspace/lldb-cmake-standalone/lldb-xcode-build/Release/lib/liblldbPluginObjectFileJIT.a /Users/buildslave/jenkins/workspace/lldb-cmake-standalone/lldb-xcode-build/Release/lib/liblldbPluginClangCommon.a /Users/buildslave/jenkins/workspace/lldb-cmake-standalone/lldb-xcode-build/Release/lib/liblldbPluginCPPRuntime.a /Users/buildslave/jenkins/workspace/lldb-cmake-standalone/lldb-xcode-build/Release/lib/liblldbPluginTypeSystemClang.a /Users/buildslave/jenkins/workspace/lldb-cmake-standalone/lldb-xcode-build/Release/lib/liblldbPluginAppleObjCRuntime.a /Users/buildslave/jenkins/workspace/lldb-cmake-standalone/lldb-xcode-build/Release/lib/liblldbPluginExpressionParserClang.a /Users/buildslave/jenkins/workspace/lldb-cmake-standalone/lldb-xcode-build/Release/lib/liblldbPluginSymbolFileDWARF.a /Users/buildslave/jenkins/workspace/lldb-cmake-standalone/lldb-xcode-build/Release/lib/liblldbPluginSymbolFilePDB.a /Users/buildslave/jenkins/workspace/lldb-cmake-standalone/lldb-xcode-build/Release/lib/liblldbPluginObjCRuntime.a /Users/buildslave/jenkins/workspace/lldb-cmake-standalone/lldb-xcode-build/Release/lib/liblldbPluginRenderScriptRuntime.a /Users/buildslave/jenkins/workspace/lldb-cmake-standalone/lldb-xcode-build/Release/lib/liblldbPluginSymbolFileNativePDB.a /Users/buildslave/jenkins/workspace/lldb-cmake-standalone/lldb-xcode-build/Release/lib/liblldbPluginObjectFilePDB.a /Users/buildslave/jenkins/workspace/lldb-cmake-standalone/lldb-xcode-build/Release/lib/liblldbCore.a /Users/buildslave/jenkins/workspace/lldb-cmake-standalone/lldb-xcode-build/Release/lib/liblldbInterpreter.a /Users/buildslave/jenkins/workspace/lldb-cmake-standalone/lldb-xcode-build/Release/lib/liblldbTarget.a /Users/buildslave/jenkins/workspace/lldb-cmake-standalone/lldb-xcode-build/Release/lib/liblldbBreakpoint.a /Users/buildslave/jenkins/workspace/lldb-cmake-standalone/lldb-xcode-build/Release/lib/liblldbDataFormatters.a /Users/buildslave/jenkins/workspace/lldb-cmake-standalone/lldb-xcode-build/Release/lib/liblldbExpression.a /Users/buildslave/jenkins/workspace/lldb-cmake-standalone/lldb-xcode-build/Release/lib/liblldbSymbol.a /Users/buildslave/jenkins/workspace/lldb-cmake-standalone/lldb-xcode-build/Release/lib/liblldbPluginCPlusPlusLanguage.a /Users/buildslave/jenkins/workspace/lldb-cmake-standalone/lldb-xcode-build/Release/lib/liblldbPluginObjCLanguage.a /Users/buildslave/jenkins/workspace/lldb-cmake-standalone/lldb-xcode-build/Release/lib/liblldbCommands.a /Users/buildslave/jenkins/workspace/lldb-cmake-standalone/lldb-xcode-build/Release/lib/liblldbPluginProcessUtility.a /Users/buildslave/jenkins/workspace/lldb-cmake-standalone/lldb-xcode-build/Release/lib/liblldbPluginObjectFileJIT.a /Users/buildslave/jenkins/workspace/lldb-cmake-standalone/lldb-xcode-build/Release/lib/liblldbPluginClangCommon.a /Users/buildslave/jenkins/workspace/lldb-cmake-standalone/lldb-xcode-build/Release/lib/liblldbPluginCPPRuntime.a /Users/buildslave/jenkins/workspace/lldb-cmake-standalone/lldb-xcode-build/Release/lib/liblldbPluginTypeSystemClang.a /Users/buildslave/jenkins/workspace/lldb-cmake-standalone/lldb-xcode-build/Release/lib/liblldbPluginAppleObjCRuntime.a /Users/buildslave/jenkins/workspace/lldb-cmake-standalone/lldb-xcode-build/Release/lib/liblldbPluginExpressionParserClang.a /Users/buildslave/jenkins/workspace/lldb-cmake-standalone/lldb-xcode-build/Release/lib/liblldbPluginSymbolFileDWARF.a /Users/buildslave/jenkins/workspace/lldb-cmake-standalone/lldb-xcode-build/Release/lib/liblldbPluginSymbolFilePDB.a /Users/buildslave/jenkins/workspace/lldb-cmake-standalone/lldb-xcode-build/Release/lib/liblldbPluginObjCRuntime.a /Users/buildslave/jenkins/workspace/lldb-cmake-standalone/lldb-xcode-build/Release/lib/liblldbPluginRenderScriptRuntime.a /Users/buildslave/jenkins/workspace/lldb-cmake-standalone/lldb-xcode-build/Release/lib/liblldbPluginSymbolFileNativePDB.a /Users/buildslave/jenkins/workspace/lldb-cmake-standalone/lldb-xcode-build/Release/lib/liblldbPluginObjectFilePDB.a /Users/buildslave/jenkins/workspace/lldb-cmake-standalone/lldb-xcode-build/Release/lib/liblldbCore.a /Users/buildslave/jenkins/workspace/lldb-cmake-standalone/lldb-xcode-build/Release/lib/liblldbInterpreter.a /Users/buildslave/jenkins/workspace/lldb-cmake-standalone/lldb-xcode-build/Release/lib/liblldbTarget.a /Users/buildslave/jenkins/workspace/lldb-cmake-standalone/lldb-xcode-build/Release/lib/liblldbBreakpoint.a /Users/buildslave/jenkins/workspace/lldb-cmake-standalone/lldb-xcode-build/Release/lib/liblldbDataFormatters.a /Users/buildslave/jenkins/workspace/lldb-cmake-standalone/lldb-xcode-build/Release/lib/liblldbExpression.a /Users/buildslave/jenkins/workspace/lldb-cmake-standalone/lldb-xcode-build/Release/lib/liblldbSymbol.a /Users/buildslave/jenkins/workspace/lldb-cmake-standalone/lldb-xcode-build/Release/lib/liblldbPluginCPlusPlusLanguage.a /Users/buildslave/jenkins/workspace/lldb-cmake-standalone/lldb-xcode-build/Release/lib/liblldbPluginObjCLanguage.a /Users/buildslave/jenkins/workspace/lldb-cmake-standalone/lldb-xcode-build/Release/lib/liblldbCommands.a /Users/buildslave/jenkins/workspace/lldb-cmake-standalone/lldb-xcode-build/Release/lib/liblldbPluginProcessUtility.a /Users/buildslave/jenkins/workspace/lldb-cmake-standalone/lldb-xcode-build/Release/lib/liblldbPluginObjectFileJIT.a /Users/buildslave/jenkins/workspace/lldb-cmake-standalone/lldb-xcode-build/Release/lib/liblldbPluginClangCommon.a /Users/buildslave/jenkins/workspace/lldb-cmake-standalone/lldb-xcode-build/Release/lib/liblldbPluginCPPRuntime.a /Users/buildslave/jenkins/workspace/lldb-cmake-standalone/lldb-xcode-build/Release/lib/liblldbPluginTypeSystemClang.a /Users/buildslave/jenkins/workspace/lldb-cmake-standalone/lldb-xcode-build/Release/lib/liblldbPluginAppleObjCRuntime.a /Users/buildslave/jenkins/workspace/lldb-cmake-standalone/lldb-xcode-build/Release/lib/liblldbPluginExpressionParserClang.a /Users/buildslave/jenkins/workspace/lldb-cmake-standalone/lldb-xcode-build/Release/lib/liblldbPluginSymbolFileDWARF.a /Users/buildslave/jenkins/workspace/lldb-cmake-standalone/lldb-xcode-build/Release/lib/liblldbPluginSymbolFilePDB.a /Users/buildslave/jenkins/workspace/lldb-cmake-standalone/lldb-xcode-build/Release/lib/liblldbPluginObjCRuntime.a /Users/buildslave/jenkins/workspace/lldb-cmake-standalone/lldb-xcode-build/Release/lib/liblldbPluginRenderScriptRuntime.a /Users/buildslave/jenkins/workspace/lldb-cmake-standalone/lldb-xcode-build/Release/lib/liblldbPluginSymbolFileNativePDB.a /Users/buildslave/jenkins/workspace/lldb-cmake-standalone/lldb-xcode-build/Release/lib/liblldbPluginObjectFilePDB.a /Users/buildslave/jenkins/workspace/lldb-cmake-standalone/lldb-xcode-build/Release/lib/liblldbCore.a /Users/buildslave/jenkins/workspace/lldb-cmake-standalone/lldb-xcode-build/Release/lib/liblldbInterpreter.a /Users/buildslave/jenkins/workspace/lldb-cmake-standalone/lldb-xcode-build/Release/lib/liblldbTarget.a /Users/buildslave/jenkins/workspace/lldb-cmake-standalone/lldb-xcode-build/Release/lib/liblldbBreakpoint.a /Users/buildslave/jenkins/workspace/lldb-cmake-standalone/lldb-xcode-build/Release/lib/liblldbDataFormatters.a /Users/buildslave/jenkins/workspace/lldb-cmake-standalone/lldb-xcode-build/Release/lib/liblldbExpression.a /Users/buildslave/jenkins/workspace/lldb-cmake-standalone/lldb-xcode-build/Release/lib/liblldbSymbol.a /Users/buildslave/jenkins/workspace/lldb-cmake-standalone/lldb-xcode-build/Release/lib/liblldbPluginCPlusPlusLanguage.a /Users/buildslave/jenkins/workspace/lldb-cmake-standalone/lldb-xcode-build/Release/lib/liblldbPluginObjCLanguage.a /Users/buildslave/jenkins/workspace/lldb-cmake-standalone/lldb-xcode-build/Release/lib/liblldbCommands.a /Users/buildslave/jenkins/workspace/lldb-cmake-standalone/lldb-xcode-build/Release/lib/liblldbPluginProcessUtility.a /Users/buildslave/jenkins/workspace/lldb-cmake-standalone/lldb-xcode-build/Release/lib/liblldbPluginObjectFileJIT.a /Users/buildslave/jenkins/workspace/lldb-cmake-standalone/lldb-xcode-build/Release/lib/liblldbPluginClangCommon.a /Users/buildslave/jenkins/workspace/lldb-cmake-standalone/lldb-xcode-build/Release/lib/liblldbPluginCPPRuntime.a /Users/buildslave/jenkins/workspace/lldb-cmake-standalone/lldb-xcode-build/Release/lib/liblldbPluginTypeSystemClang.a /Users/buildslave/jenkins/workspace/lldb-cmake-standalone/lldb-xcode-build/Release/lib/liblldbPluginAppleObjCRuntime.a /Users/buildslave/jenkins/workspace/lldb-cmake-standalone/lldb-xcode-build/Release/lib/liblldbPluginExpressionParserClang.a /Users/buildslave/jenkins/workspace/lldb-cmake-standalone/lldb-xcode-build/Release/lib/liblldbPluginSymbolFileDWARF.a /Users/buildslave/jenkins/workspace/lldb-cmake-standalone/lldb-xcode-build/Release/lib/liblldbPluginSymbolFilePDB.a /Users/buildslave/jenkins/workspace/lldb-cmake-standalone/lldb-xcode-build/Release/lib/liblldbPluginObjCRuntime.a /Users/buildslave/jenkins/workspace/lldb-cmake-standalone/lldb-xcode-build/Release/lib/liblldbPluginRenderScriptRuntime.a /Users/buildslave/jenkins/workspace/lldb-cmake-standalone/lldb-xcode-build/Release/lib/liblldbPluginSymbolFileNativePDB.a /Users/buildslave/jenkins/workspace/lldb-cmake-standalone/lldb-xcode-build/Release/lib/liblldbPluginObjectFilePDB.a /Users/buildslave/jenkins/workspace/lldb-cmake-standalone/lldb-xcode-build/Release/lib/liblldbCore.a /Users/buildslave/jenkins/workspace/lldb-cmake-standalone/lldb-xcode-build/Release/lib/liblldbInterpreter.a /Users/buildslave/jenkins/workspace/lldb-cmake-standalone/lldb-xcode-build/Release/lib/liblldbTarget.a /Users/buildslave/jenkins/workspace/lldb-cmake-standalone/lldb-xcode-build/Release/lib/liblldbBreakpoint.a /Users/buildslave/jenkins/workspace/lldb-cmake-standalone/lldb-xcode-build/Release/lib/liblldbDataFormatters.a /Users/buildslave/jenkins/workspace/lldb-cmake-standalone/lldb-xcode-build/Release/lib/liblldbExpression.a /Users/buildslave/jenkins/workspace/lldb-cmake-standalone/lldb-xcode-build/Release/lib/liblldbSymbol.a /Users/buildslave/jenkins/workspace/lldb-cmake-standalone/lldb-xcode-build/Release/lib/liblldbPluginCPlusPlusLanguage.a /Users/buildslave/jenkins/workspace/lldb-cmake-standalone/lldb-xcode-build/Release/lib/liblldbPluginObjCLanguage.a /Users/buildslave/jenkins/workspace/lldb-cmake-standalone/lldb-xcode-build/Release/lib/liblldbCommands.a /Users/buildslave/jenkins/workspace/lldb-cmake-standalone/lldb-xcode-build/Release/lib/liblldbPluginProcessUtility.a /Users/buildslave/jenkins/workspace/lldb-cmake-standalone/lldb-xcode-build/Release/lib/liblldbPluginObjectFileJIT.a /Users/buildslave/jenkins/workspace/lldb-cmake-standalone/lldb-xcode-build/Release/lib/liblldbPluginClangCommon.a /Users/buildslave/jenkins/workspace/lldb-cmake-standalone/lldb-xcode-build/Release/lib/liblldbPluginCPPRuntime.a /Users/buildslave/jenkins/workspace/lldb-cmake-standalone/lldb-xcode-build/Release/lib/liblldbPluginTypeSystemClang.a /Users/buildslave/jenkins/workspace/lldb-cmake-standalone/lldb-xcode-build/Release/lib/liblldbPluginAppleObjCRuntime.a /Users/buildslave/jenkins/workspace/lldb-cmake-standalone/lldb-xcode-build/Release/lib/liblldbPluginExpressionParserClang.a /Users/buildslave/jenkins/workspace/lldb-cmake-standalone/lldb-xcode-build/Release/lib/liblldbPluginSymbolFileDWARF.a /Users/buildslave/jenkins/workspace/lldb-cmake-standalone/lldb-xcode-build/Release/lib/liblldbPluginSymbolFilePDB.a /Users/buildslave/jenkins/workspace/lldb-cmake-standalone/lldb-xcode-build/Release/lib/liblldbPluginObjCRuntime.a /Users/buildslave/jenkins/workspace/lldb-cmake-standalone/lldb-xcode-build/Release/lib/liblldbPluginRenderScriptRuntime.a /Users/buildslave/jenkins/workspace/lldb-cmake-standalone/lldb-xcode-build/Release/lib/liblldbPluginSymbolFileNativePDB.a /Users/buildslave/jenkins/workspace/lldb-cmake-standalone/lldb-xcode-build/Release/lib/liblldbPluginObjectFilePDB.a /usr/lib/libform.dylib /usr/lib/libpanel.dylib /Users/buildslave/jenkins/workspace/lldb-cmake-standalone/lldb-xcode-build/Release/lib/liblldbBase.a /Users/buildslave/jenkins/workspace/lldb-cmake-standalone/clang-build/lib/libLLVMMCJIT.a /Users/buildslave/jenkins/workspace/lldb-cmake-standalone/clang-build/lib/libLLVMExecutionEngine.a /Users/buildslave/jenkins/workspace/lldb-cmake-standalone/clang-build/lib/libLLVMOrcTargetProcess.a /Users/buildslave/jenkins/workspace/lldb-cmake-standalone/clang-build/lib/libLLVMOrcShared.a /Users/buildslave/jenkins/workspace/lldb-cmake-standalone/clang-build/lib/libLLVMRuntimeDyld.a /Users/buildslave/jenkins/workspace/lldb-cmake-standalone/clang-build/lib/libclangCodeGen.a /Users/buildslave/jenkins/workspace/lldb-cmake-standalone/clang-build/lib/libLLVMCoverage.a /Users/buildslave/jenkins/workspace/lldb-cmake-standalone/clang-build/lib/libLLVMLTO.a /Users/buildslave/jenkins/workspace/lldb-cmake-standalone/clang-build/lib/libLLVMExtensions.a /Users/buildslave/jenkins/workspace/lldb-cmake-standalone/clang-build/lib/libLLVMCodeGen.a /Users/buildslave/jenkins/workspace/lldb-cmake-standalone/clang-build/lib/libLLVMPasses.a /Users/buildslave/jenkins/workspace/lldb-cmake-standalone/clang-build/lib/libLLVMCoroutines.a /Users/buildslave/jenkins/workspace/lldb-cmake-standalone/clang-build/lib/libLLVMipo.a /Users/buildslave/jenkins/workspace/lldb-cmake-standalone/clang-build/lib/libLLVMBitWriter.a /Users/buildslave/jenkins/workspace/lldb-cmake-standalone/clang-build/lib/libLLVMLinker.a /Users/buildslave/jenkins/workspace/lldb-cmake-standalone/clang-build/lib/libLLVMVectorize.a /Users/buildslave/jenkins/workspace/lldb-cmake-standalone/clang-build/lib/libLLVMInstrumentation.a /Users/buildslave/jenkins/workspace/lldb-cmake-standalone/clang-build/lib/libLLVMObjCARCOpts.a /Users/buildslave/jenkins/workspace/lldb-cmake-standalone/clang-build/lib/libclangRewriteFrontend.a /Users/buildslave/jenkins/workspace/lldb-cmake-standalone/clang-build/lib/libclangFrontend.a /Users/buildslave/jenkins/workspace/lldb-cmake-standalone/clang-build/lib/libclangDriver.a /Users/buildslave/jenkins/workspace/lldb-cmake-standalone/clang-build/lib/libLLVMOption.a /Users/buildslave/jenkins/workspace/lldb-cmake-standalone/clang-build/lib/libclangParse.a /Users/buildslave/jenkins/workspace/lldb-cmake-standalone/clang-build/lib/libclangRewrite.a /Users/buildslave/jenkins/workspace/lldb-cmake-standalone/clang-build/lib/libclangSerialization.a /Users/buildslave/jenkins/workspace/lldb-cmake-standalone/clang-build/lib/libclangSema.a /Users/buildslave/jenkins/workspace/lldb-cmake-standalone/clang-build/lib/libclangEdit.a /Users/buildslave/jenkins/workspace/lldb-cmake-standalone/clang-build/lib/libclangAnalysis.a /Users/buildslave/jenkins/workspace/lldb-cmake-standalone/clang-build/lib/libclangASTMatchers.a /Users/buildslave/jenkins/workspace/lldb-cmake-standalone/clang-build/lib/libLLVMDebugInfoDWARF.a /Users/buildslave/jenkins/workspace/lldb-cmake-standalone/lldb-xcode-build/Release/lib/liblldbHost.a /usr/lib/libxml2.dylib /usr/lib/libedit.dylib /usr/local/lib/liblzma.dylib /usr/lib/libedit.dylib /usr/local/lib/liblzma.dylib /Users/buildslave/jenkins/workspace/lldb-cmake-standalone/lldb-xcode-build/Release/lib/liblldbHostMacOSXObjCXX.a /Users/buildslave/jenkins/workspace/lldb-cmake-standalone/clang-build/lib/libLLVMTarget.a /Users/buildslave/jenkins/workspace/lldb-cmake-standalone/clang-build/lib/libLLVMIRReader.a /Users/buildslave/jenkins/workspace/lldb-cmake-standalone/clang-build/lib/libLLVMAsmParser.a /Users/buildslave/jenkins/workspace/lldb-cmake-standalone/clang-build/lib/libclangAST.a /Users/buildslave/jenkins/workspace/lldb-cmake-standalone/clang-build/lib/libLLVMFrontendOpenMP.a /Users/buildslave/jenkins/workspace/lldb-cmake-standalone/clang-build/lib/libLLVMScalarOpts.a /Users/buildslave/jenkins/workspace/lldb-cmake-standalone/clang-build/lib/libLLVMAggressiveInstCombine.a /Users/buildslave/jenkins/workspace/lldb-cmake-standalone/clang-build/lib/libLLVMInstCombine.a /Users/buildslave/jenkins/workspace/lldb-cmake-standalone/clang-build/lib/libLLVMTransformUtils.a /Users/buildslave/jenkins/workspace/lldb-cmake-standalone/clang-build/lib/libLLVMAnalysis.a /Users/buildslave/jenkins/workspace/lldb-cmake-standalone/clang-build/lib/libLLVMProfileData.a /Users/buildslave/jenkins/workspace/lldb-cmake-standalone/clang-build/lib/libclangLex.a /Users/buildslave/jenkins/workspace/lldb-cmake-standalone/clang-build/lib/libclangBasic.a /Users/buildslave/jenkins/workspace/lldb-cmake-standalone/clang-build/lib/libLLVMDebugInfoPDB.a /Users/buildslave/jenkins/workspace/lldb-cmake-standalone/clang-build/lib/libLLVMObject.a /Users/buildslave/jenkins/workspace/lldb-cmake-standalone/clang-build/lib/libLLVMBitReader.a /Users/buildslave/jenkins/workspace/lldb-cmake-standalone/clang-build/lib/libLLVMCore.a /Users/buildslave/jenkins/workspace/lldb-cmake-standalone/clang-build/lib/libLLVMRemarks.a /Users/buildslave/jenkins/workspace/lldb-cmake-standalone/clang-build/lib/libLLVMBitstreamReader.a /Users/buildslave/jenkins/workspace/lldb-cmake-standalone/clang-build/lib/libLLVMMCParser.a /Users/buildslave/jenkins/workspace/lldb-cmake-standalone/clang-build/lib/libLLVMMC.a /Users/buildslave/jenkins/workspace/lldb-cmake-standalone/clang-build/lib/libLLVMTextAPI.a /Users/buildslave/jenkins/workspace/lldb-cmake-standalone/clang-build/lib/libLLVMDebugInfoCodeView.a /Users/buildslave/jenkins/workspace/lldb-cmake-standalone/clang-build/lib/libLLVMDebugInfoMSF.a /Users/buildslave/jenkins/workspace/lldb-cmake-standalone/lldb-xcode-build/Release/lib/liblldbUtility.a -framework Foundation -framework CoreFoundation -framework CoreServices -framework Security /Users/buildslave/jenkins/workspace/lldb-cmake-standalone/clang-build/lib/libLLVMBinaryFormat.a -lcompression /Users/buildslave/jenkins/workspace/lldb-cmake-standalone/clang-build/lib/libgtest.a /Users/buildslave/jenkins/workspace/lldb-cmake-standalone/clang-build/lib/libLLVMSupport.a -lm /usr/lib/libz.dylib /usr/lib/libcurses.dylib /Users/buildslave/jenkins/workspace/lldb-cmake-standalone/clang-build/lib/libLLVMDemangle.a -lpthread -Xlinker -dependency_info -Xlinker /Users/buildslave/jenkins/workspace/lldb-cmake-standalone/lldb-xcode-build/unittests/tools/lldb-server/tests/lldb.build/Release/LLDBServerTests.build/Objects-normal/x86_64/LLDBServerTests_dependency_info.dat -o /Users/buildslave/jenkins/workspace/lldb-cmake-standalone/lldb-xcode-build/unittests/tools/lldb-server/tests/Release/LLDBServerTests

Hide Details

PhaseScriptExecution CMake\ PostBuild\ Rules /Users/buildslave/jenkins/workspace/lldb-cmake-standalone/lldb-xcode-build/unittests/tools/lldb-server/tests/lldb.build/Release/LLDBServerTests.build/Script-367E1DB7327846BB96E5A0FA.sh cd /Users/buildslave/jenkins/workspace/lldb-cmake-standalone/llvm-project/lldb /bin/sh -c /Users/buildslave/jenkins/workspace/lldb-cmake-standalone/lldb-xcode-build/unittests/tools/lldb-server/tests/lldb.build/Release/LLDBServerTests.build/Script-367E1DB7327846BB96E5A0FA.sh /usr/local/Cellar/cmake/3.17.2/bin/cmake -E make_directory /Users/buildslave/jenkins/workspace/lldb-cmake-standalone/lldb-xcode-build/unittests/tools/lldb-server/tests/Release/Inputs

Hide Details

CodeSign /Users/buildslave/jenkins/workspace/lldb-cmake-standalone/lldb-xcode-build/unittests/tools/lldb-server/tests/Release/LLDBServerTests cd /Users/buildslave/jenkins/workspace/lldb-cmake-standalone/llvm-project/lldb

Hide Details

Signing Identity: "-"

Hide Details

/usr/bin/codesign --force --sign - --entitlements /Users/buildslave/jenkins/workspace/lldb-cmake-standalone/lldb-xcode-build/unittests/tools/lldb-server/tests/lldb.build/Release/LLDBServerTests.build/LLDBServerTests.xcent --timestamp=none /Users/buildslave/jenkins/workspace/lldb-cmake-standalone/lldb-xcode-build/unittests/tools/lldb-server/tests/Release/LLDBServerTests

Hide Details

=== BUILD TARGET UnwindAssemblyx86Tests OF PROJECT lldb WITH CONFIGURATION Release ===

Hide Details

Check dependencies

Hide Details

Write auxiliary files write-file /Users/buildslave/jenkins/workspace/lldb-cmake-standalone/lldb-xcode-build/unittests/UnwindAssembly/x86/lldb.build/Release/UnwindAssemblyx86Tests.build/Script-910EFD26C62F4A3EAE3F5934.sh chmod 0755 /Users/buildslave/jenkins/workspace/lldb-cmake-standalone/lldb-xcode-build/unittests/UnwindAssembly/x86/lldb.build/Release/UnwindAssemblyx86Tests.build/Script-910EFD26C62F4A3EAE3F5934.sh

Hide Details

Ld /Users/buildslave/jenkins/workspace/lldb-cmake-standalone/lldb-xcode-build/unittests/UnwindAssembly/x86/Release/UnwindAssemblyx86Tests normal x86_64 cd /Users/buildslave/jenkins/workspace/lldb-cmake-standalone/llvm-project/lldb /Applications/Xcode.app/Contents/Developer/Toolchains/XcodeDefault.xctoolchain/usr/bin/clang++ -target x86_64-apple-macos10.12 -isysroot /Applications/Xcode.app/Contents/Developer/Platforms/MacOSX.platform/Developer/SDKs/MacOSX10.15.sdk -L/Users/buildslave/jenkins/workspace/lldb-cmake-standalone/lldb-xcode-build/unittests/UnwindAssembly/x86/Release -F/Users/buildslave/jenkins/workspace/lldb-cmake-standalone/lldb-xcode-build/unittests/UnwindAssembly/x86/Release -filelist /Users/buildslave/jenkins/workspace/lldb-cmake-standalone/lldb-xcode-build/unittests/UnwindAssembly/x86/lldb.build/Release/UnwindAssemblyx86Tests.build/Objects-normal/x86_64/UnwindAssemblyx86Tests.LinkFileList -Wl,-dead_strip -Wl,-search_paths_first -Wl,-headerpad_max_install_names /Users/buildslave/jenkins/workspace/lldb-cmake-standalone/clang-build/lib/libLLVMSupport.a /Users/buildslave/jenkins/workspace/lldb-cmake-standalone/clang-build/lib/libLLVMX86CodeGen.a /Users/buildslave/jenkins/workspace/lldb-cmake-standalone/clang-build/lib/libLLVMX86AsmParser.a /Users/buildslave/jenkins/workspace/lldb-cmake-standalone/clang-build/lib/libLLVMX86Desc.a /Users/buildslave/jenkins/workspace/lldb-cmake-standalone/clang-build/lib/libLLVMX86Disassembler.a /Users/buildslave/jenkins/workspace/lldb-cmake-standalone/clang-build/lib/libLLVMX86Info.a /Users/buildslave/jenkins/workspace/lldb-cmake-standalone/clang-build/lib/libLLVMSupport.a /Users/buildslave/jenkins/workspace/lldb-cmake-standalone/clang-build/lib/libgtest_main.a /Users/buildslave/jenkins/workspace/lldb-cmake-standalone/clang-build/lib/libgtest.a /Users/buildslave/jenkins/workspace/lldb-cmake-standalone/lldb-xcode-build/Release/lib/liblldbCore.a /Users/buildslave/jenkins/workspace/lldb-cmake-standalone/lldb-xcode-build/Release/lib/liblldbSymbol.a /Users/buildslave/jenkins/workspace/lldb-cmake-standalone/lldb-xcode-build/Release/lib/liblldbPluginUnwindAssemblyX86.a /Users/buildslave/jenkins/workspace/lldb-cmake-standalone/clang-build/lib/libLLVMAsmPrinter.a /Users/buildslave/jenkins/workspace/lldb-cmake-standalone/clang-build/lib/libLLVMGlobalISel.a /Users/buildslave/jenkins/workspace/lldb-cmake-standalone/clang-build/lib/libLLVMSelectionDAG.a /Users/buildslave/jenkins/workspace/lldb-cmake-standalone/clang-build/lib/libLLVMCFGuard.a -lpthread /Users/buildslave/jenkins/workspace/lldb-cmake-standalone/clang-build/lib/libLLVMMCDisassembler.a /Users/buildslave/jenkins/workspace/lldb-cmake-standalone/lldb-xcode-build/Release/lib/liblldbCore.a /Users/buildslave/jenkins/workspace/lldb-cmake-standalone/lldb-xcode-build/Release/lib/liblldbSymbol.a /Users/buildslave/jenkins/workspace/lldb-cmake-standalone/lldb-xcode-build/Release/lib/liblldbBreakpoint.a /Users/buildslave/jenkins/workspace/lldb-cmake-standalone/lldb-xcode-build/Release/lib/liblldbDataFormatters.a /Users/buildslave/jenkins/workspace/lldb-cmake-standalone/lldb-xcode-build/Release/lib/liblldbExpression.a /Users/buildslave/jenkins/workspace/lldb-cmake-standalone/lldb-xcode-build/Release/lib/liblldbInterpreter.a /Users/buildslave/jenkins/workspace/lldb-cmake-standalone/lldb-xcode-build/Release/lib/liblldbTarget.a /Users/buildslave/jenkins/workspace/lldb-cmake-standalone/lldb-xcode-build/Release/lib/liblldbPluginCPlusPlusLanguage.a /Users/buildslave/jenkins/workspace/lldb-cmake-standalone/lldb-xcode-build/Release/lib/liblldbPluginObjCLanguage.a /Users/buildslave/jenkins/workspace/lldb-cmake-standalone/lldb-xcode-build/Release/lib/liblldbPluginObjectFileJIT.a /Users/buildslave/jenkins/workspace/lldb-cmake-standalone/lldb-xcode-build/Release/lib/liblldbCommands.a /Users/buildslave/jenkins/workspace/lldb-cmake-standalone/lldb-xcode-build/Release/lib/liblldbPluginProcessUtility.a /Users/buildslave/jenkins/workspace/lldb-cmake-standalone/lldb-xcode-build/Release/lib/liblldbPluginClangCommon.a /Users/buildslave/jenkins/workspace/lldb-cmake-standalone/lldb-xcode-build/Release/lib/liblldbPluginCPPRuntime.a /Users/buildslave/jenkins/workspace/lldb-cmake-standalone/lldb-xcode-build/Release/lib/liblldbPluginTypeSystemClang.a /Users/buildslave/jenkins/workspace/lldb-cmake-standalone/lldb-xcode-build/Release/lib/liblldbPluginAppleObjCRuntime.a /Users/buildslave/jenkins/workspace/lldb-cmake-standalone/lldb-xcode-build/Release/lib/liblldbPluginExpressionParserClang.a /Users/buildslave/jenkins/workspace/lldb-cmake-standalone/lldb-xcode-build/Release/lib/liblldbPluginSymbolFileDWARF.a /Users/buildslave/jenkins/workspace/lldb-cmake-standalone/lldb-xcode-build/Release/lib/liblldbPluginSymbolFilePDB.a /Users/buildslave/jenkins/workspace/lldb-cmake-standalone/lldb-xcode-build/Release/lib/liblldbPluginObjCRuntime.a /Users/buildslave/jenkins/workspace/lldb-cmake-standalone/lldb-xcode-build/Release/lib/liblldbPluginRenderScriptRuntime.a /Users/buildslave/jenkins/workspace/lldb-cmake-standalone/lldb-xcode-build/Release/lib/liblldbPluginSymbolFileNativePDB.a /Users/buildslave/jenkins/workspace/lldb-cmake-standalone/lldb-xcode-build/Release/lib/liblldbPluginObjectFilePDB.a /Users/buildslave/jenkins/workspace/lldb-cmake-standalone/lldb-xcode-build/Release/lib/liblldbCore.a /Users/buildslave/jenkins/workspace/lldb-cmake-standalone/lldb-xcode-build/Release/lib/liblldbSymbol.a /Users/buildslave/jenkins/workspace/lldb-cmake-standalone/lldb-xcode-build/Release/lib/liblldbBreakpoint.a /Users/buildslave/jenkins/workspace/lldb-cmake-standalone/lldb-xcode-build/Release/lib/liblldbDataFormatters.a /Users/buildslave/jenkins/workspace/lldb-cmake-standalone/lldb-xcode-build/Release/lib/liblldbExpression.a /Users/buildslave/jenkins/workspace/lldb-cmake-standalone/lldb-xcode-build/Release/lib/liblldbInterpreter.a /Users/buildslave/jenkins/workspace/lldb-cmake-standalone/lldb-xcode-build/Release/lib/liblldbTarget.a /Users/buildslave/jenkins/workspace/lldb-cmake-standalone/lldb-xcode-build/Release/lib/liblldbPluginCPlusPlusLanguage.a /Users/buildslave/jenkins/workspace/lldb-cmake-standalone/lldb-xcode-build/Release/lib/liblldbPluginObjCLanguage.a /Users/buildslave/jenkins/workspace/lldb-cmake-standalone/lldb-xcode-build/Release/lib/liblldbPluginObjectFileJIT.a /Users/buildslave/jenkins/workspace/lldb-cmake-standalone/lldb-xcode-build/Release/lib/liblldbCommands.a /Users/buildslave/jenkins/workspace/lldb-cmake-standalone/lldb-xcode-build/Release/lib/liblldbPluginProcessUtility.a /Users/buildslave/jenkins/workspace/lldb-cmake-standalone/lldb-xcode-build/Release/lib/liblldbPluginClangCommon.a /Users/buildslave/jenkins/workspace/lldb-cmake-standalone/lldb-xcode-build/Release/lib/liblldbPluginCPPRuntime.a /Users/buildslave/jenkins/workspace/lldb-cmake-standalone/lldb-xcode-build/Release/lib/liblldbPluginTypeSystemClang.a /Users/buildslave/jenkins/workspace/lldb-cmake-standalone/lldb-xcode-build/Release/lib/liblldbPluginAppleObjCRuntime.a /Users/buildslave/jenkins/workspace/lldb-cmake-standalone/lldb-xcode-build/Release/lib/liblldbPluginExpressionParserClang.a /Users/buildslave/jenkins/workspace/lldb-cmake-standalone/lldb-xcode-build/Release/lib/liblldbPluginSymbolFileDWARF.a /Users/buildslave/jenkins/workspace/lldb-cmake-standalone/lldb-xcode-build/Release/lib/liblldbPluginSymbolFilePDB.a /Users/buildslave/jenkins/workspace/lldb-cmake-standalone/lldb-xcode-build/Release/lib/liblldbPluginObjCRuntime.a /Users/buildslave/jenkins/workspace/lldb-cmake-standalone/lldb-xcode-build/Release/lib/liblldbPluginRenderScriptRuntime.a /Users/buildslave/jenkins/workspace/lldb-cmake-standalone/lldb-xcode-build/Release/lib/liblldbPluginSymbolFileNativePDB.a /Users/buildslave/jenkins/workspace/lldb-cmake-standalone/lldb-xcode-build/Release/lib/liblldbPluginObjectFilePDB.a /Users/buildslave/jenkins/workspace/lldb-cmake-standalone/lldb-xcode-build/Release/lib/liblldbCore.a /Users/buildslave/jenkins/workspace/lldb-cmake-standalone/lldb-xcode-build/Release/lib/liblldbSymbol.a /Users/buildslave/jenkins/workspace/lldb-cmake-standalone/lldb-xcode-build/Release/lib/liblldbBreakpoint.a /Users/buildslave/jenkins/workspace/lldb-cmake-standalone/lldb-xcode-build/Release/lib/liblldbDataFormatters.a /Users/buildslave/jenkins/workspace/lldb-cmake-standalone/lldb-xcode-build/Release/lib/liblldbExpression.a /Users/buildslave/jenkins/workspace/lldb-cmake-standalone/lldb-xcode-build/Release/lib/liblldbInterpreter.a /Users/buildslave/jenkins/workspace/lldb-cmake-standalone/lldb-xcode-build/Release/lib/liblldbTarget.a /Users/buildslave/jenkins/workspace/lldb-cmake-standalone/lldb-xcode-build/Release/lib/liblldbPluginCPlusPlusLanguage.a /Users/buildslave/jenkins/workspace/lldb-cmake-standalone/lldb-xcode-build/Release/lib/liblldbPluginObjCLanguage.a /Users/buildslave/jenkins/workspace/lldb-cmake-standalone/lldb-xcode-build/Release/lib/liblldbPluginObjectFileJIT.a /Users/buildslave/jenkins/workspace/lldb-cmake-standalone/lldb-xcode-build/Release/lib/liblldbCommands.a /Users/buildslave/jenkins/workspace/lldb-cmake-standalone/lldb-xcode-build/Release/lib/liblldbPluginProcessUtility.a /Users/buildslave/jenkins/workspace/lldb-cmake-standalone/lldb-xcode-build/Release/lib/liblldbPluginClangCommon.a /Users/buildslave/jenkins/workspace/lldb-cmake-standalone/lldb-xcode-build/Release/lib/liblldbPluginCPPRuntime.a /Users/buildslave/jenkins/workspace/lldb-cmake-standalone/lldb-xcode-build/Release/lib/liblldbPluginTypeSystemClang.a /Users/buildslave/jenkins/workspace/lldb-cmake-standalone/lldb-xcode-build/Release/lib/liblldbPluginAppleObjCRuntime.a /Users/buildslave/jenkins/workspace/lldb-cmake-standalone/lldb-xcode-build/Release/lib/liblldbPluginExpressionParserClang.a /Users/buildslave/jenkins/workspace/lldb-cmake-standalone/lldb-xcode-build/Release/lib/liblldbPluginSymbolFileDWARF.a /Users/buildslave/jenkins/workspace/lldb-cmake-standalone/lldb-xcode-build/Release/lib/liblldbPluginSymbolFilePDB.a /Users/buildslave/jenkins/workspace/lldb-cmake-standalone/lldb-xcode-build/Release/lib/liblldbPluginObjCRuntime.a /Users/buildslave/jenkins/workspace/lldb-cmake-standalone/lldb-xcode-build/Release/lib/liblldbPluginRenderScriptRuntime.a /Users/buildslave/jenkins/workspace/lldb-cmake-standalone/lldb-xcode-build/Release/lib/liblldbPluginSymbolFileNativePDB.a /Users/buildslave/jenkins/workspace/lldb-cmake-standalone/lldb-xcode-build/Release/lib/liblldbPluginObjectFilePDB.a /Users/buildslave/jenkins/workspace/lldb-cmake-standalone/lldb-xcode-build/Release/lib/liblldbCore.a /Users/buildslave/jenkins/workspace/lldb-cmake-standalone/lldb-xcode-build/Release/lib/liblldbSymbol.a /Users/buildslave/jenkins/workspace/lldb-cmake-standalone/lldb-xcode-build/Release/lib/liblldbBreakpoint.a /Users/buildslave/jenkins/workspace/lldb-cmake-standalone/lldb-xcode-build/Release/lib/liblldbDataFormatters.a /Users/buildslave/jenkins/workspace/lldb-cmake-standalone/lldb-xcode-build/Release/lib/liblldbExpression.a /Users/buildslave/jenkins/workspace/lldb-cmake-standalone/lldb-xcode-build/Release/lib/liblldbInterpreter.a /Users/buildslave/jenkins/workspace/lldb-cmake-standalone/lldb-xcode-build/Release/lib/liblldbTarget.a /Users/buildslave/jenkins/workspace/lldb-cmake-standalone/lldb-xcode-build/Release/lib/liblldbPluginCPlusPlusLanguage.a /Users/buildslave/jenkins/workspace/lldb-cmake-standalone/lldb-xcode-build/Release/lib/liblldbPluginObjCLanguage.a /Users/buildslave/jenkins/workspace/lldb-cmake-standalone/lldb-xcode-build/Release/lib/liblldbPluginObjectFileJIT.a /Users/buildslave/jenkins/workspace/lldb-cmake-standalone/lldb-xcode-build/Release/lib/liblldbCommands.a /Users/buildslave/jenkins/workspace/lldb-cmake-standalone/lldb-xcode-build/Release/lib/liblldbPluginProcessUtility.a /Users/buildslave/jenkins/workspace/lldb-cmake-standalone/lldb-xcode-build/Release/lib/liblldbPluginClangCommon.a /Users/buildslave/jenkins/workspace/lldb-cmake-standalone/lldb-xcode-build/Release/lib/liblldbPluginCPPRuntime.a /Users/buildslave/jenkins/workspace/lldb-cmake-standalone/lldb-xcode-build/Release/lib/liblldbPluginTypeSystemClang.a /Users/buildslave/jenkins/workspace/lldb-cmake-standalone/lldb-xcode-build/Release/lib/liblldbPluginAppleObjCRuntime.a /Users/buildslave/jenkins/workspace/lldb-cmake-standalone/lldb-xcode-build/Release/lib/liblldbPluginExpressionParserClang.a /Users/buildslave/jenkins/workspace/lldb-cmake-standalone/lldb-xcode-build/Release/lib/liblldbPluginSymbolFileDWARF.a /Users/buildslave/jenkins/workspace/lldb-cmake-standalone/lldb-xcode-build/Release/lib/liblldbPluginSymbolFilePDB.a /Users/buildslave/jenkins/workspace/lldb-cmake-standalone/lldb-xcode-build/Release/lib/liblldbPluginObjCRuntime.a /Users/buildslave/jenkins/workspace/lldb-cmake-standalone/lldb-xcode-build/Release/lib/liblldbPluginRenderScriptRuntime.a /Users/buildslave/jenkins/workspace/lldb-cmake-standalone/lldb-xcode-build/Release/lib/liblldbPluginSymbolFileNativePDB.a /Users/buildslave/jenkins/workspace/lldb-cmake-standalone/lldb-xcode-build/Release/lib/liblldbPluginObjectFilePDB.a /Users/buildslave/jenkins/workspace/lldb-cmake-standalone/lldb-xcode-build/Release/lib/liblldbCore.a /Users/buildslave/jenkins/workspace/lldb-cmake-standalone/lldb-xcode-build/Release/lib/liblldbSymbol.a /Users/buildslave/jenkins/workspace/lldb-cmake-standalone/lldb-xcode-build/Release/lib/liblldbBreakpoint.a /Users/buildslave/jenkins/workspace/lldb-cmake-standalone/lldb-xcode-build/Release/lib/liblldbDataFormatters.a /Users/buildslave/jenkins/workspace/lldb-cmake-standalone/lldb-xcode-build/Release/lib/liblldbExpression.a /Users/buildslave/jenkins/workspace/lldb-cmake-standalone/lldb-xcode-build/Release/lib/liblldbInterpreter.a /Users/buildslave/jenkins/workspace/lldb-cmake-standalone/lldb-xcode-build/Release/lib/liblldbTarget.a /Users/buildslave/jenkins/workspace/lldb-cmake-standalone/lldb-xcode-build/Release/lib/liblldbPluginCPlusPlusLanguage.a /Users/buildslave/jenkins/workspace/lldb-cmake-standalone/lldb-xcode-build/Release/lib/liblldbPluginObjCLanguage.a /Users/buildslave/jenkins/workspace/lldb-cmake-standalone/lldb-xcode-build/Release/lib/liblldbPluginObjectFileJIT.a /Users/buildslave/jenkins/workspace/lldb-cmake-standalone/lldb-xcode-build/Release/lib/liblldbCommands.a /Users/buildslave/jenkins/workspace/lldb-cmake-standalone/lldb-xcode-build/Release/lib/liblldbPluginProcessUtility.a /Users/buildslave/jenkins/workspace/lldb-cmake-standalone/lldb-xcode-build/Release/lib/liblldbPluginClangCommon.a /Users/buildslave/jenkins/workspace/lldb-cmake-standalone/lldb-xcode-build/Release/lib/liblldbPluginCPPRuntime.a /Users/buildslave/jenkins/workspace/lldb-cmake-standalone/lldb-xcode-build/Release/lib/liblldbPluginTypeSystemClang.a /Users/buildslave/jenkins/workspace/lldb-cmake-standalone/lldb-xcode-build/Release/lib/liblldbPluginAppleObjCRuntime.a /Users/buildslave/jenkins/workspace/lldb-cmake-standalone/lldb-xcode-build/Release/lib/liblldbPluginExpressionParserClang.a /Users/buildslave/jenkins/workspace/lldb-cmake-standalone/lldb-xcode-build/Release/lib/liblldbPluginSymbolFileDWARF.a /Users/buildslave/jenkins/workspace/lldb-cmake-standalone/lldb-xcode-build/Release/lib/liblldbPluginSymbolFilePDB.a /Users/buildslave/jenkins/workspace/lldb-cmake-standalone/lldb-xcode-build/Release/lib/liblldbPluginObjCRuntime.a /Users/buildslave/jenkins/workspace/lldb-cmake-standalone/lldb-xcode-build/Release/lib/liblldbPluginRenderScriptRuntime.a /Users/buildslave/jenkins/workspace/lldb-cmake-standalone/lldb-xcode-build/Release/lib/liblldbPluginSymbolFileNativePDB.a /Users/buildslave/jenkins/workspace/lldb-cmake-standalone/lldb-xcode-build/Release/lib/liblldbPluginObjectFilePDB.a /usr/lib/libform.dylib /usr/lib/libpanel.dylib /Users/buildslave/jenkins/workspace/lldb-cmake-standalone/lldb-xcode-build/Release/lib/liblldbBase.a /Users/buildslave/jenkins/workspace/lldb-cmake-standalone/clang-build/lib/libLLVMMCJIT.a /Users/buildslave/jenkins/workspace/lldb-cmake-standalone/clang-build/lib/libLLVMExecutionEngine.a /Users/buildslave/jenkins/workspace/lldb-cmake-standalone/clang-build/lib/libLLVMOrcTargetProcess.a /Users/buildslave/jenkins/workspace/lldb-cmake-standalone/clang-build/lib/libLLVMOrcShared.a /Users/buildslave/jenkins/workspace/lldb-cmake-standalone/clang-build/lib/libLLVMRuntimeDyld.a /Users/buildslave/jenkins/workspace/lldb-cmake-standalone/clang-build/lib/libclangCodeGen.a /Users/buildslave/jenkins/workspace/lldb-cmake-standalone/clang-build/lib/libLLVMCoverage.a /Users/buildslave/jenkins/workspace/lldb-cmake-standalone/clang-build/lib/libLLVMLTO.a /Users/buildslave/jenkins/workspace/lldb-cmake-standalone/clang-build/lib/libLLVMCodeGen.a /Users/buildslave/jenkins/workspace/lldb-cmake-standalone/clang-build/lib/libLLVMExtensions.a /Users/buildslave/jenkins/workspace/lldb-cmake-standalone/clang-build/lib/libLLVMPasses.a /Users/buildslave/jenkins/workspace/lldb-cmake-standalone/clang-build/lib/libLLVMCoroutines.a /Users/buildslave/jenkins/workspace/lldb-cmake-standalone/clang-build/lib/libLLVMipo.a /Users/buildslave/jenkins/workspace/lldb-cmake-standalone/clang-build/lib/libLLVMInstrumentation.a /Users/buildslave/jenkins/workspace/lldb-cmake-standalone/clang-build/lib/libLLVMBitWriter.a /Users/buildslave/jenkins/workspace/lldb-cmake-standalone/clang-build/lib/libLLVMLinker.a /Users/buildslave/jenkins/workspace/lldb-cmake-standalone/clang-build/lib/libLLVMVectorize.a /Users/buildslave/jenkins/workspace/lldb-cmake-standalone/clang-build/lib/libLLVMObjCARCOpts.a /Users/buildslave/jenkins/workspace/lldb-cmake-standalone/clang-build/lib/libclangRewriteFrontend.a /Users/buildslave/jenkins/workspace/lldb-cmake-standalone/clang-build/lib/libclangFrontend.a /Users/buildslave/jenkins/workspace/lldb-cmake-standalone/clang-build/lib/libclangDriver.a /Users/buildslave/jenkins/workspace/lldb-cmake-standalone/clang-build/lib/libLLVMOption.a /Users/buildslave/jenkins/workspace/lldb-cmake-standalone/clang-build/lib/libclangParse.a /Users/buildslave/jenkins/workspace/lldb-cmake-standalone/clang-build/lib/libclangRewrite.a /Users/buildslave/jenkins/workspace/lldb-cmake-standalone/clang-build/lib/libclangSerialization.a /Users/buildslave/jenkins/workspace/lldb-cmake-standalone/clang-build/lib/libclangSema.a /Users/buildslave/jenkins/workspace/lldb-cmake-standalone/clang-build/lib/libclangEdit.a /Users/buildslave/jenkins/workspace/lldb-cmake-standalone/clang-build/lib/libclangAnalysis.a /Users/buildslave/jenkins/workspace/lldb-cmake-standalone/clang-build/lib/libclangASTMatchers.a /Users/buildslave/jenkins/workspace/lldb-cmake-standalone/clang-build/lib/libLLVMDebugInfoDWARF.a /Users/buildslave/jenkins/workspace/lldb-cmake-standalone/clang-build/lib/libLLVMTarget.a /Users/buildslave/jenkins/workspace/lldb-cmake-standalone/lldb-xcode-build/Release/lib/liblldbHost.a /usr/lib/libxml2.dylib /usr/lib/libedit.dylib /usr/local/lib/liblzma.dylib /usr/lib/libedit.dylib /usr/local/lib/liblzma.dylib /Users/buildslave/jenkins/workspace/lldb-cmake-standalone/lldb-xcode-build/Release/lib/liblldbHostMacOSXObjCXX.a /Users/buildslave/jenkins/workspace/lldb-cmake-standalone/clang-build/lib/libLLVMIRReader.a /Users/buildslave/jenkins/workspace/lldb-cmake-standalone/clang-build/lib/libLLVMAsmParser.a /Users/buildslave/jenkins/workspace/lldb-cmake-standalone/clang-build/lib/libclangAST.a /Users/buildslave/jenkins/workspace/lldb-cmake-standalone/clang-build/lib/libLLVMFrontendOpenMP.a /Users/buildslave/jenkins/workspace/lldb-cmake-standalone/clang-build/lib/libLLVMScalarOpts.a /Users/buildslave/jenkins/workspace/lldb-cmake-standalone/clang-build/lib/libLLVMAggressiveInstCombine.a /Users/buildslave/jenkins/workspace/lldb-cmake-standalone/clang-build/lib/libLLVMInstCombine.a /Users/buildslave/jenkins/workspace/lldb-cmake-standalone/clang-build/lib/libLLVMTransformUtils.a /Users/buildslave/jenkins/workspace/lldb-cmake-standalone/clang-build/lib/libLLVMAnalysis.a /Users/buildslave/jenkins/workspace/lldb-cmake-standalone/clang-build/lib/libLLVMProfileData.a /Users/buildslave/jenkins/workspace/lldb-cmake-standalone/clang-build/lib/libclangLex.a /Users/buildslave/jenkins/workspace/lldb-cmake-standalone/clang-build/lib/libclangBasic.a /Users/buildslave/jenkins/workspace/lldb-cmake-standalone/clang-build/lib/libLLVMDebugInfoPDB.a /Users/buildslave/jenkins/workspace/lldb-cmake-standalone/clang-build/lib/libLLVMObject.a /Users/buildslave/jenkins/workspace/lldb-cmake-standalone/clang-build/lib/libLLVMMCParser.a /Users/buildslave/jenkins/workspace/lldb-cmake-standalone/clang-build/lib/libLLVMMC.a /Users/buildslave/jenkins/workspace/lldb-cmake-standalone/clang-build/lib/libLLVMBitReader.a /Users/buildslave/jenkins/workspace/lldb-cmake-standalone/clang-build/lib/libLLVMCore.a /Users/buildslave/jenkins/workspace/lldb-cmake-standalone/clang-build/lib/libLLVMRemarks.a /Users/buildslave/jenkins/workspace/lldb-cmake-standalone/clang-build/lib/libLLVMBitstreamReader.a /Users/buildslave/jenkins/workspace/lldb-cmake-standalone/clang-build/lib/libLLVMTextAPI.a /Users/buildslave/jenkins/workspace/lldb-cmake-standalone/clang-build/lib/libLLVMDebugInfoCodeView.a /Users/buildslave/jenkins/workspace/lldb-cmake-standalone/clang-build/lib/libLLVMDebugInfoMSF.a /Users/buildslave/jenkins/workspace/lldb-cmake-standalone/lldb-xcode-build/Release/lib/liblldbUtility.a /Users/buildslave/jenkins/workspace/lldb-cmake-standalone/clang-build/lib/libLLVMBinaryFormat.a /Users/buildslave/jenkins/workspace/lldb-cmake-standalone/clang-build/lib/libLLVMSupport.a -lm /usr/lib/libz.dylib /usr/lib/libcurses.dylib /Users/buildslave/jenkins/workspace/lldb-cmake-standalone/clang-build/lib/libLLVMDemangle.a -framework Foundation -framework CoreFoundation -framework CoreServices -framework Security -Xlinker -dependency_info -Xlinker /Users/buildslave/jenkins/workspace/lldb-cmake-standalone/lldb-xcode-build/unittests/UnwindAssembly/x86/lldb.build/Release/UnwindAssemblyx86Tests.build/Objects-normal/x86_64/UnwindAssemblyx86Tests_dependency_info.dat -o /Users/buildslave/jenkins/workspace/lldb-cmake-standalone/lldb-xcode-build/unittests/UnwindAssembly/x86/Release/UnwindAssemblyx86Tests

Hide Details

PhaseScriptExecution CMake\ PostBuild\ Rules /Users/buildslave/jenkins/workspace/lldb-cmake-standalone/lldb-xcode-build/unittests/UnwindAssembly/x86/lldb.build/Release/UnwindAssemblyx86Tests.build/Script-910EFD26C62F4A3EAE3F5934.sh cd /Users/buildslave/jenkins/workspace/lldb-cmake-standalone/llvm-project/lldb /bin/sh -c /Users/buildslave/jenkins/workspace/lldb-cmake-standalone/lldb-xcode-build/unittests/UnwindAssembly/x86/lldb.build/Release/UnwindAssemblyx86Tests.build/Script-910EFD26C62F4A3EAE3F5934.sh /usr/local/Cellar/cmake/3.17.2/bin/cmake -E make_directory /Users/buildslave/jenkins/workspace/lldb-cmake-standalone/lldb-xcode-build/unittests/UnwindAssembly/x86/Release/Inputs

Hide Details

CodeSign /Users/buildslave/jenkins/workspace/lldb-cmake-standalone/lldb-xcode-build/unittests/UnwindAssembly/x86/Release/UnwindAssemblyx86Tests cd /Users/buildslave/jenkins/workspace/lldb-cmake-standalone/llvm-project/lldb

Hide Details

Signing Identity: "-"

Hide Details

/usr/bin/codesign --force --sign - --entitlements /Users/buildslave/jenkins/workspace/lldb-cmake-standalone/lldb-xcode-build/unittests/UnwindAssembly/x86/lldb.build/Release/UnwindAssemblyx86Tests.build/UnwindAssemblyx86Tests.xcent --timestamp=none /Users/buildslave/jenkins/workspace/lldb-cmake-standalone/lldb-xcode-build/unittests/UnwindAssembly/x86/Release/UnwindAssemblyx86Tests

Hide Details

=== BUILD TARGET UtilityTests OF PROJECT lldb WITH CONFIGURATION Release ===

Hide Details

Check dependencies

Hide Details

Write auxiliary files write-file /Users/buildslave/jenkins/workspace/lldb-cmake-standalone/lldb-xcode-build/unittests/Utility/lldb.build/Release/UtilityTests.build/Script-AB97C323CE564164AF8DE0BF.sh chmod 0755 /Users/buildslave/jenkins/workspace/lldb-cmake-standalone/lldb-xcode-build/unittests/Utility/lldb.build/Release/UtilityTests.build/Script-AB97C323CE564164AF8DE0BF.sh

Hide Details

Ld /Users/buildslave/jenkins/workspace/lldb-cmake-standalone/lldb-xcode-build/unittests/Utility/Release/UtilityTests normal x86_64 cd /Users/buildslave/jenkins/workspace/lldb-cmake-standalone/llvm-project/lldb /Applications/Xcode.app/Contents/Developer/Toolchains/XcodeDefault.xctoolchain/usr/bin/clang++ -target x86_64-apple-macos10.12 -isysroot /Applications/Xcode.app/Contents/Developer/Platforms/MacOSX.platform/Developer/SDKs/MacOSX10.15.sdk -L/Users/buildslave/jenkins/workspace/lldb-cmake-standalone/lldb-xcode-build/unittests/Utility/Release -F/Users/buildslave/jenkins/workspace/lldb-cmake-standalone/lldb-xcode-build/unittests/Utility/Release -filelist /Users/buildslave/jenkins/workspace/lldb-cmake-standalone/lldb-xcode-build/unittests/Utility/lldb.build/Release/UtilityTests.build/Objects-normal/x86_64/UtilityTests.LinkFileList -Wl,-dead_strip -Wl,-search_paths_first -Wl,-headerpad_max_install_names /Users/buildslave/jenkins/workspace/lldb-cmake-standalone/clang-build/lib/libLLVMSupport.a /Users/buildslave/jenkins/workspace/lldb-cmake-standalone/clang-build/lib/libLLVMSupport.a /Users/buildslave/jenkins/workspace/lldb-cmake-standalone/clang-build/lib/libgtest_main.a /Users/buildslave/jenkins/workspace/lldb-cmake-standalone/clang-build/lib/libgtest.a /Users/buildslave/jenkins/workspace/lldb-cmake-standalone/lldb-xcode-build/Release/lib/liblldbUtility.a /Users/buildslave/jenkins/workspace/lldb-cmake-standalone/lldb-xcode-build/Release/lib/liblldbUtilityHelpers.a /Users/buildslave/jenkins/workspace/lldb-cmake-standalone/clang-build/lib/libLLVMTestingSupport.a /Users/buildslave/jenkins/workspace/lldb-cmake-standalone/lldb-xcode-build/Release/lib/liblldbUtility.a -framework Foundation -framework CoreFoundation -framework CoreServices -framework Security /Users/buildslave/jenkins/workspace/lldb-cmake-standalone/clang-build/lib/libLLVMObjectYAML.a /Users/buildslave/jenkins/workspace/lldb-cmake-standalone/clang-build/lib/libLLVMObject.a /Users/buildslave/jenkins/workspace/lldb-cmake-standalone/clang-build/lib/libLLVMBitReader.a /Users/buildslave/jenkins/workspace/lldb-cmake-standalone/clang-build/lib/libLLVMCore.a /Users/buildslave/jenkins/workspace/lldb-cmake-standalone/clang-build/lib/libLLVMRemarks.a /Users/buildslave/jenkins/workspace/lldb-cmake-standalone/clang-build/lib/libLLVMBitstreamReader.a /Users/buildslave/jenkins/workspace/lldb-cmake-standalone/clang-build/lib/libLLVMMCParser.a /Users/buildslave/jenkins/workspace/lldb-cmake-standalone/clang-build/lib/libLLVMTextAPI.a /Users/buildslave/jenkins/workspace/lldb-cmake-standalone/clang-build/lib/libLLVMMC.a /Users/buildslave/jenkins/workspace/lldb-cmake-standalone/clang-build/lib/libLLVMBinaryFormat.a /Users/buildslave/jenkins/workspace/lldb-cmake-standalone/clang-build/lib/libLLVMDebugInfoCodeView.a /Users/buildslave/jenkins/workspace/lldb-cmake-standalone/clang-build/lib/libgtest.a /Users/buildslave/jenkins/workspace/lldb-cmake-standalone/clang-build/lib/libLLVMSupport.a -lm /usr/lib/libz.dylib /usr/lib/libcurses.dylib /Users/buildslave/jenkins/workspace/lldb-cmake-standalone/clang-build/lib/libLLVMDemangle.a -lpthread -Xlinker -dependency_info -Xlinker /Users/buildslave/jenkins/workspace/lldb-cmake-standalone/lldb-xcode-build/unittests/Utility/lldb.build/Release/UtilityTests.build/Objects-normal/x86_64/UtilityTests_dependency_info.dat -o /Users/buildslave/jenkins/workspace/lldb-cmake-standalone/lldb-xcode-build/unittests/Utility/Release/UtilityTests

Hide Details

PhaseScriptExecution CMake\ PostBuild\ Rules /Users/buildslave/jenkins/workspace/lldb-cmake-standalone/lldb-xcode-build/unittests/Utility/lldb.build/Release/UtilityTests.build/Script-AB97C323CE564164AF8DE0BF.sh cd /Users/buildslave/jenkins/workspace/lldb-cmake-standalone/llvm-project/lldb /bin/sh -c /Users/buildslave/jenkins/workspace/lldb-cmake-standalone/lldb-xcode-build/unittests/Utility/lldb.build/Release/UtilityTests.build/Script-AB97C323CE564164AF8DE0BF.sh /usr/local/Cellar/cmake/3.17.2/bin/cmake -E make_directory /Users/buildslave/jenkins/workspace/lldb-cmake-standalone/lldb-xcode-build/unittests/Utility/Release/Inputs echo "Copying StructuredData-basic.json to binary directory." Copying StructuredData-basic.json to binary directory. /usr/local/Cellar/cmake/3.17.2/bin/cmake -E copy /Users/buildslave/jenkins/workspace/lldb-cmake-standalone/llvm-project/lldb/unittests/Utility/Inputs/StructuredData-basic.json /Users/buildslave/jenkins/workspace/lldb-cmake-standalone/lldb-xcode-build/unittests/Utility/Release/Inputs

Hide Details

CodeSign /Users/buildslave/jenkins/workspace/lldb-cmake-standalone/lldb-xcode-build/unittests/Utility/Release/UtilityTests cd /Users/buildslave/jenkins/workspace/lldb-cmake-standalone/llvm-project/lldb

Hide Details

Signing Identity: "-"

Hide Details

/usr/bin/codesign --force --sign - --entitlements /Users/buildslave/jenkins/workspace/lldb-cmake-standalone/lldb-xcode-build/unittests/Utility/lldb.build/Release/UtilityTests.build/UtilityTests.xcent --timestamp=none /Users/buildslave/jenkins/workspace/lldb-cmake-standalone/lldb-xcode-build/unittests/Utility/Release/UtilityTests

Hide Details

=== BUILD TARGET ThreadTests OF PROJECT lldb WITH CONFIGURATION Release ===

Hide Details

Check dependencies

Hide Details

Write auxiliary files write-file /Users/buildslave/jenkins/workspace/lldb-cmake-standalone/lldb-xcode-build/unittests/Thread/lldb.build/Release/ThreadTests.build/Script-F999C1FD49F643B3B868F1C8.sh chmod 0755 /Users/buildslave/jenkins/workspace/lldb-cmake-standalone/lldb-xcode-build/unittests/Thread/lldb.build/Release/ThreadTests.build/Script-F999C1FD49F643B3B868F1C8.sh

Hide Details

Ld /Users/buildslave/jenkins/workspace/lldb-cmake-standalone/lldb-xcode-build/unittests/Thread/Release/ThreadTests normal x86_64 cd /Users/buildslave/jenkins/workspace/lldb-cmake-standalone/llvm-project/lldb /Applications/Xcode.app/Contents/Developer/Toolchains/XcodeDefault.xctoolchain/usr/bin/clang++ -target x86_64-apple-macos10.12 -isysroot /Applications/Xcode.app/Contents/Developer/Platforms/MacOSX.platform/Developer/SDKs/MacOSX10.15.sdk -L/Users/buildslave/jenkins/workspace/lldb-cmake-standalone/lldb-xcode-build/unittests/Thread/Release -F/Users/buildslave/jenkins/workspace/lldb-cmake-standalone/lldb-xcode-build/unittests/Thread/Release -filelist /Users/buildslave/jenkins/workspace/lldb-cmake-standalone/lldb-xcode-build/unittests/Thread/lldb.build/Release/ThreadTests.build/Objects-normal/x86_64/ThreadTests.LinkFileList -Wl,-dead_strip -Wl,-search_paths_first -Wl,-headerpad_max_install_names /Users/buildslave/jenkins/workspace/lldb-cmake-standalone/clang-build/lib/libLLVMSupport.a /Users/buildslave/jenkins/workspace/lldb-cmake-standalone/clang-build/lib/libgtest_main.a /Users/buildslave/jenkins/workspace/lldb-cmake-standalone/clang-build/lib/libgtest.a /Users/buildslave/jenkins/workspace/lldb-cmake-standalone/lldb-xcode-build/Release/lib/liblldbCore.a /Users/buildslave/jenkins/workspace/lldb-cmake-standalone/lldb-xcode-build/Release/lib/liblldbHost.a /Users/buildslave/jenkins/workspace/lldb-cmake-standalone/lldb-xcode-build/Release/lib/liblldbTarget.a /Users/buildslave/jenkins/workspace/lldb-cmake-standalone/lldb-xcode-build/Release/lib/liblldbSymbol.a /Users/buildslave/jenkins/workspace/lldb-cmake-standalone/lldb-xcode-build/Release/lib/liblldbUtility.a /Users/buildslave/jenkins/workspace/lldb-cmake-standalone/lldb-xcode-build/Release/lib/liblldbUtilityHelpers.a /Users/buildslave/jenkins/workspace/lldb-cmake-standalone/lldb-xcode-build/Release/lib/liblldbInterpreter.a /Users/buildslave/jenkins/workspace/lldb-cmake-standalone/lldb-xcode-build/Release/lib/liblldbBreakpoint.a /Users/buildslave/jenkins/workspace/lldb-cmake-standalone/lldb-xcode-build/Release/lib/liblldbPluginPlatformLinux.a /Users/buildslave/jenkins/workspace/lldb-cmake-standalone/clang-build/lib/libgtest.a -lpthread /Users/buildslave/jenkins/workspace/lldb-cmake-standalone/clang-build/lib/libLLVMObjectYAML.a /Users/buildslave/jenkins/workspace/lldb-cmake-standalone/lldb-xcode-build/Release/lib/liblldbPluginPlatformPOSIX.a /Users/buildslave/jenkins/workspace/lldb-cmake-standalone/lldb-xcode-build/Release/lib/liblldbCore.a /Users/buildslave/jenkins/workspace/lldb-cmake-standalone/lldb-xcode-build/Release/lib/liblldbTarget.a /Users/buildslave/jenkins/workspace/lldb-cmake-standalone/lldb-xcode-build/Release/lib/liblldbSymbol.a /Users/buildslave/jenkins/workspace/lldb-cmake-standalone/lldb-xcode-build/Release/lib/liblldbInterpreter.a /Users/buildslave/jenkins/workspace/lldb-cmake-standalone/lldb-xcode-build/Release/lib/liblldbBreakpoint.a /Users/buildslave/jenkins/workspace/lldb-cmake-standalone/lldb-xcode-build/Release/lib/liblldbDataFormatters.a /Users/buildslave/jenkins/workspace/lldb-cmake-standalone/lldb-xcode-build/Release/lib/liblldbExpression.a /Users/buildslave/jenkins/workspace/lldb-cmake-standalone/lldb-xcode-build/Release/lib/liblldbPluginCPlusPlusLanguage.a /Users/buildslave/jenkins/workspace/lldb-cmake-standalone/lldb-xcode-build/Release/lib/liblldbPluginObjCLanguage.a /Users/buildslave/jenkins/workspace/lldb-cmake-standalone/lldb-xcode-build/Release/lib/liblldbPluginProcessUtility.a /Users/buildslave/jenkins/workspace/lldb-cmake-standalone/lldb-xcode-build/Release/lib/liblldbCommands.a /Users/buildslave/jenkins/workspace/lldb-cmake-standalone/lldb-xcode-build/Release/lib/liblldbPluginObjectFileJIT.a /Users/buildslave/jenkins/workspace/lldb-cmake-standalone/lldb-xcode-build/Release/lib/liblldbPluginClangCommon.a /Users/buildslave/jenkins/workspace/lldb-cmake-standalone/lldb-xcode-build/Release/lib/liblldbPluginCPPRuntime.a /Users/buildslave/jenkins/workspace/lldb-cmake-standalone/lldb-xcode-build/Release/lib/liblldbPluginTypeSystemClang.a /Users/buildslave/jenkins/workspace/lldb-cmake-standalone/lldb-xcode-build/Release/lib/liblldbPluginAppleObjCRuntime.a /Users/buildslave/jenkins/workspace/lldb-cmake-standalone/lldb-xcode-build/Release/lib/liblldbPluginExpressionParserClang.a /Users/buildslave/jenkins/workspace/lldb-cmake-standalone/lldb-xcode-build/Release/lib/liblldbPluginSymbolFileDWARF.a /Users/buildslave/jenkins/workspace/lldb-cmake-standalone/lldb-xcode-build/Release/lib/liblldbPluginSymbolFilePDB.a /Users/buildslave/jenkins/workspace/lldb-cmake-standalone/lldb-xcode-build/Release/lib/liblldbPluginObjCRuntime.a /Users/buildslave/jenkins/workspace/lldb-cmake-standalone/lldb-xcode-build/Release/lib/liblldbPluginRenderScriptRuntime.a /Users/buildslave/jenkins/workspace/lldb-cmake-standalone/lldb-xcode-build/Release/lib/liblldbPluginSymbolFileNativePDB.a /Users/buildslave/jenkins/workspace/lldb-cmake-standalone/lldb-xcode-build/Release/lib/liblldbPluginObjectFilePDB.a /Users/buildslave/jenkins/workspace/lldb-cmake-standalone/lldb-xcode-build/Release/lib/liblldbCore.a /Users/buildslave/jenkins/workspace/lldb-cmake-standalone/lldb-xcode-build/Release/lib/liblldbTarget.a /Users/buildslave/jenkins/workspace/lldb-cmake-standalone/lldb-xcode-build/Release/lib/liblldbSymbol.a /Users/buildslave/jenkins/workspace/lldb-cmake-standalone/lldb-xcode-build/Release/lib/liblldbInterpreter.a /Users/buildslave/jenkins/workspace/lldb-cmake-standalone/lldb-xcode-build/Release/lib/liblldbBreakpoint.a /Users/buildslave/jenkins/workspace/lldb-cmake-standalone/lldb-xcode-build/Release/lib/liblldbDataFormatters.a /Users/buildslave/jenkins/workspace/lldb-cmake-standalone/lldb-xcode-build/Release/lib/liblldbExpression.a /Users/buildslave/jenkins/workspace/lldb-cmake-standalone/lldb-xcode-build/Release/lib/liblldbPluginCPlusPlusLanguage.a /Users/buildslave/jenkins/workspace/lldb-cmake-standalone/lldb-xcode-build/Release/lib/liblldbPluginObjCLanguage.a /Users/buildslave/jenkins/workspace/lldb-cmake-standalone/lldb-xcode-build/Release/lib/liblldbPluginProcessUtility.a /Users/buildslave/jenkins/workspace/lldb-cmake-standalone/lldb-xcode-build/Release/lib/liblldbCommands.a /Users/buildslave/jenkins/workspace/lldb-cmake-standalone/lldb-xcode-build/Release/lib/liblldbPluginObjectFileJIT.a /Users/buildslave/jenkins/workspace/lldb-cmake-standalone/lldb-xcode-build/Release/lib/liblldbPluginClangCommon.a /Users/buildslave/jenkins/workspace/lldb-cmake-standalone/lldb-xcode-build/Release/lib/liblldbPluginCPPRuntime.a /Users/buildslave/jenkins/workspace/lldb-cmake-standalone/lldb-xcode-build/Release/lib/liblldbPluginTypeSystemClang.a /Users/buildslave/jenkins/workspace/lldb-cmake-standalone/lldb-xcode-build/Release/lib/liblldbPluginAppleObjCRuntime.a /Users/buildslave/jenkins/workspace/lldb-cmake-standalone/lldb-xcode-build/Release/lib/liblldbPluginExpressionParserClang.a /Users/buildslave/jenkins/workspace/lldb-cmake-standalone/lldb-xcode-build/Release/lib/liblldbPluginSymbolFileDWARF.a /Users/buildslave/jenkins/workspace/lldb-cmake-standalone/lldb-xcode-build/Release/lib/liblldbPluginSymbolFilePDB.a /Users/buildslave/jenkins/workspace/lldb-cmake-standalone/lldb-xcode-build/Release/lib/liblldbPluginObjCRuntime.a /Users/buildslave/jenkins/workspace/lldb-cmake-standalone/lldb-xcode-build/Release/lib/liblldbPluginRenderScriptRuntime.a /Users/buildslave/jenkins/workspace/lldb-cmake-standalone/lldb-xcode-build/Release/lib/liblldbPluginSymbolFileNativePDB.a /Users/buildslave/jenkins/workspace/lldb-cmake-standalone/lldb-xcode-build/Release/lib/liblldbPluginObjectFilePDB.a /Users/buildslave/jenkins/workspace/lldb-cmake-standalone/lldb-xcode-build/Release/lib/liblldbCore.a /Users/buildslave/jenkins/workspace/lldb-cmake-standalone/lldb-xcode-build/Release/lib/liblldbTarget.a /Users/buildslave/jenkins/workspace/lldb-cmake-standalone/lldb-xcode-build/Release/lib/liblldbSymbol.a /Users/buildslave/jenkins/workspace/lldb-cmake-standalone/lldb-xcode-build/Release/lib/liblldbInterpreter.a /Users/buildslave/jenkins/workspace/lldb-cmake-standalone/lldb-xcode-build/Release/lib/liblldbBreakpoint.a /Users/buildslave/jenkins/workspace/lldb-cmake-standalone/lldb-xcode-build/Release/lib/liblldbDataFormatters.a /Users/buildslave/jenkins/workspace/lldb-cmake-standalone/lldb-xcode-build/Release/lib/liblldbExpression.a /Users/buildslave/jenkins/workspace/lldb-cmake-standalone/lldb-xcode-build/Release/lib/liblldbPluginCPlusPlusLanguage.a /Users/buildslave/jenkins/workspace/lldb-cmake-standalone/lldb-xcode-build/Release/lib/liblldbPluginObjCLanguage.a /Users/buildslave/jenkins/workspace/lldb-cmake-standalone/lldb-xcode-build/Release/lib/liblldbPluginProcessUtility.a /Users/buildslave/jenkins/workspace/lldb-cmake-standalone/lldb-xcode-build/Release/lib/liblldbCommands.a /Users/buildslave/jenkins/workspace/lldb-cmake-standalone/lldb-xcode-build/Release/lib/liblldbPluginObjectFileJIT.a /Users/buildslave/jenkins/workspace/lldb-cmake-standalone/lldb-xcode-build/Release/lib/liblldbPluginClangCommon.a /Users/buildslave/jenkins/workspace/lldb-cmake-standalone/lldb-xcode-build/Release/lib/liblldbPluginCPPRuntime.a /Users/buildslave/jenkins/workspace/lldb-cmake-standalone/lldb-xcode-build/Release/lib/liblldbPluginTypeSystemClang.a /Users/buildslave/jenkins/workspace/lldb-cmake-standalone/lldb-xcode-build/Release/lib/liblldbPluginAppleObjCRuntime.a /Users/buildslave/jenkins/workspace/lldb-cmake-standalone/lldb-xcode-build/Release/lib/liblldbPluginExpressionParserClang.a /Users/buildslave/jenkins/workspace/lldb-cmake-standalone/lldb-xcode-build/Release/lib/liblldbPluginSymbolFileDWARF.a /Users/buildslave/jenkins/workspace/lldb-cmake-standalone/lldb-xcode-build/Release/lib/liblldbPluginSymbolFilePDB.a /Users/buildslave/jenkins/workspace/lldb-cmake-standalone/lldb-xcode-build/Release/lib/liblldbPluginObjCRuntime.a /Users/buildslave/jenkins/workspace/lldb-cmake-standalone/lldb-xcode-build/Release/lib/liblldbPluginRenderScriptRuntime.a /Users/buildslave/jenkins/workspace/lldb-cmake-standalone/lldb-xcode-build/Release/lib/liblldbPluginSymbolFileNativePDB.a /Users/buildslave/jenkins/workspace/lldb-cmake-standalone/lldb-xcode-build/Release/lib/liblldbPluginObjectFilePDB.a /Users/buildslave/jenkins/workspace/lldb-cmake-standalone/lldb-xcode-build/Release/lib/liblldbCore.a /Users/buildslave/jenkins/workspace/lldb-cmake-standalone/lldb-xcode-build/Release/lib/liblldbTarget.a /Users/buildslave/jenkins/workspace/lldb-cmake-standalone/lldb-xcode-build/Release/lib/liblldbSymbol.a /Users/buildslave/jenkins/workspace/lldb-cmake-standalone/lldb-xcode-build/Release/lib/liblldbInterpreter.a /Users/buildslave/jenkins/workspace/lldb-cmake-standalone/lldb-xcode-build/Release/lib/liblldbBreakpoint.a /Users/buildslave/jenkins/workspace/lldb-cmake-standalone/lldb-xcode-build/Release/lib/liblldbDataFormatters.a /Users/buildslave/jenkins/workspace/lldb-cmake-standalone/lldb-xcode-build/Release/lib/liblldbExpression.a /Users/buildslave/jenkins/workspace/lldb-cmake-standalone/lldb-xcode-build/Release/lib/liblldbPluginCPlusPlusLanguage.a /Users/buildslave/jenkins/workspace/lldb-cmake-standalone/lldb-xcode-build/Release/lib/liblldbPluginObjCLanguage.a /Users/buildslave/jenkins/workspace/lldb-cmake-standalone/lldb-xcode-build/Release/lib/liblldbPluginProcessUtility.a /Users/buildslave/jenkins/workspace/lldb-cmake-standalone/lldb-xcode-build/Release/lib/liblldbCommands.a /Users/buildslave/jenkins/workspace/lldb-cmake-standalone/lldb-xcode-build/Release/lib/liblldbPluginObjectFileJIT.a /Users/buildslave/jenkins/workspace/lldb-cmake-standalone/lldb-xcode-build/Release/lib/liblldbPluginClangCommon.a /Users/buildslave/jenkins/workspace/lldb-cmake-standalone/lldb-xcode-build/Release/lib/liblldbPluginCPPRuntime.a /Users/buildslave/jenkins/workspace/lldb-cmake-standalone/lldb-xcode-build/Release/lib/liblldbPluginTypeSystemClang.a /Users/buildslave/jenkins/workspace/lldb-cmake-standalone/lldb-xcode-build/Release/lib/liblldbPluginAppleObjCRuntime.a /Users/buildslave/jenkins/workspace/lldb-cmake-standalone/lldb-xcode-build/Release/lib/liblldbPluginExpressionParserClang.a /Users/buildslave/jenkins/workspace/lldb-cmake-standalone/lldb-xcode-build/Release/lib/liblldbPluginSymbolFileDWARF.a /Users/buildslave/jenkins/workspace/lldb-cmake-standalone/lldb-xcode-build/Release/lib/liblldbPluginSymbolFilePDB.a /Users/buildslave/jenkins/workspace/lldb-cmake-standalone/lldb-xcode-build/Release/lib/liblldbPluginObjCRuntime.a /Users/buildslave/jenkins/workspace/lldb-cmake-standalone/lldb-xcode-build/Release/lib/liblldbPluginRenderScriptRuntime.a /Users/buildslave/jenkins/workspace/lldb-cmake-standalone/lldb-xcode-build/Release/lib/liblldbPluginSymbolFileNativePDB.a /Users/buildslave/jenkins/workspace/lldb-cmake-standalone/lldb-xcode-build/Release/lib/liblldbPluginObjectFilePDB.a /Users/buildslave/jenkins/workspace/lldb-cmake-standalone/lldb-xcode-build/Release/lib/liblldbCore.a /Users/buildslave/jenkins/workspace/lldb-cmake-standalone/lldb-xcode-build/Release/lib/liblldbTarget.a /Users/buildslave/jenkins/workspace/lldb-cmake-standalone/lldb-xcode-build/Release/lib/liblldbSymbol.a /Users/buildslave/jenkins/workspace/lldb-cmake-standalone/lldb-xcode-build/Release/lib/liblldbInterpreter.a /Users/buildslave/jenkins/workspace/lldb-cmake-standalone/lldb-xcode-build/Release/lib/liblldbBreakpoint.a /Users/buildslave/jenkins/workspace/lldb-cmake-standalone/lldb-xcode-build/Release/lib/liblldbDataFormatters.a /Users/buildslave/jenkins/workspace/lldb-cmake-standalone/lldb-xcode-build/Release/lib/liblldbExpression.a /Users/buildslave/jenkins/workspace/lldb-cmake-standalone/lldb-xcode-build/Release/lib/liblldbPluginCPlusPlusLanguage.a /Users/buildslave/jenkins/workspace/lldb-cmake-standalone/lldb-xcode-build/Release/lib/liblldbPluginObjCLanguage.a /Users/buildslave/jenkins/workspace/lldb-cmake-standalone/lldb-xcode-build/Release/lib/liblldbPluginProcessUtility.a /Users/buildslave/jenkins/workspace/lldb-cmake-standalone/lldb-xcode-build/Release/lib/liblldbCommands.a /Users/buildslave/jenkins/workspace/lldb-cmake-standalone/lldb-xcode-build/Release/lib/liblldbPluginObjectFileJIT.a /Users/buildslave/jenkins/workspace/lldb-cmake-standalone/lldb-xcode-build/Release/lib/liblldbPluginClangCommon.a /Users/buildslave/jenkins/workspace/lldb-cmake-standalone/lldb-xcode-build/Release/lib/liblldbPluginCPPRuntime.a /Users/buildslave/jenkins/workspace/lldb-cmake-standalone/lldb-xcode-build/Release/lib/liblldbPluginTypeSystemClang.a /Users/buildslave/jenkins/workspace/lldb-cmake-standalone/lldb-xcode-build/Release/lib/liblldbPluginAppleObjCRuntime.a /Users/buildslave/jenkins/workspace/lldb-cmake-standalone/lldb-xcode-build/Release/lib/liblldbPluginExpressionParserClang.a /Users/buildslave/jenkins/workspace/lldb-cmake-standalone/lldb-xcode-build/Release/lib/liblldbPluginSymbolFileDWARF.a /Users/buildslave/jenkins/workspace/lldb-cmake-standalone/lldb-xcode-build/Release/lib/liblldbPluginSymbolFilePDB.a /Users/buildslave/jenkins/workspace/lldb-cmake-standalone/lldb-xcode-build/Release/lib/liblldbPluginObjCRuntime.a /Users/buildslave/jenkins/workspace/lldb-cmake-standalone/lldb-xcode-build/Release/lib/liblldbPluginRenderScriptRuntime.a /Users/buildslave/jenkins/workspace/lldb-cmake-standalone/lldb-xcode-build/Release/lib/liblldbPluginSymbolFileNativePDB.a /Users/buildslave/jenkins/workspace/lldb-cmake-standalone/lldb-xcode-build/Release/lib/liblldbPluginObjectFilePDB.a /usr/lib/libform.dylib /usr/lib/libpanel.dylib /Users/buildslave/jenkins/workspace/lldb-cmake-standalone/lldb-xcode-build/Release/lib/liblldbBase.a /Users/buildslave/jenkins/workspace/lldb-cmake-standalone/clang-build/lib/libLLVMMCJIT.a /Users/buildslave/jenkins/workspace/lldb-cmake-standalone/clang-build/lib/libLLVMExecutionEngine.a /Users/buildslave/jenkins/workspace/lldb-cmake-standalone/clang-build/lib/libLLVMOrcTargetProcess.a /Users/buildslave/jenkins/workspace/lldb-cmake-standalone/clang-build/lib/libLLVMOrcShared.a /Users/buildslave/jenkins/workspace/lldb-cmake-standalone/clang-build/lib/libLLVMRuntimeDyld.a /Users/buildslave/jenkins/workspace/lldb-cmake-standalone/clang-build/lib/libclangCodeGen.a /Users/buildslave/jenkins/workspace/lldb-cmake-standalone/clang-build/lib/libLLVMCoverage.a /Users/buildslave/jenkins/workspace/lldb-cmake-standalone/clang-build/lib/libLLVMLTO.a /Users/buildslave/jenkins/workspace/lldb-cmake-standalone/clang-build/lib/libLLVMExtensions.a /Users/buildslave/jenkins/workspace/lldb-cmake-standalone/clang-build/lib/libLLVMCodeGen.a /Users/buildslave/jenkins/workspace/lldb-cmake-standalone/clang-build/lib/libLLVMPasses.a /Users/buildslave/jenkins/workspace/lldb-cmake-standalone/clang-build/lib/libLLVMCoroutines.a /Users/buildslave/jenkins/workspace/lldb-cmake-standalone/clang-build/lib/libLLVMipo.a /Users/buildslave/jenkins/workspace/lldb-cmake-standalone/clang-build/lib/libLLVMBitWriter.a /Users/buildslave/jenkins/workspace/lldb-cmake-standalone/clang-build/lib/libLLVMLinker.a /Users/buildslave/jenkins/workspace/lldb-cmake-standalone/clang-build/lib/libLLVMVectorize.a /Users/buildslave/jenkins/workspace/lldb-cmake-standalone/clang-build/lib/libLLVMInstrumentation.a /Users/buildslave/jenkins/workspace/lldb-cmake-standalone/clang-build/lib/libLLVMObjCARCOpts.a /Users/buildslave/jenkins/workspace/lldb-cmake-standalone/clang-build/lib/libclangRewriteFrontend.a /Users/buildslave/jenkins/workspace/lldb-cmake-standalone/clang-build/lib/libclangFrontend.a /Users/buildslave/jenkins/workspace/lldb-cmake-standalone/clang-build/lib/libclangDriver.a /Users/buildslave/jenkins/workspace/lldb-cmake-standalone/clang-build/lib/libLLVMOption.a /Users/buildslave/jenkins/workspace/lldb-cmake-standalone/clang-build/lib/libclangParse.a /Users/buildslave/jenkins/workspace/lldb-cmake-standalone/clang-build/lib/libclangRewrite.a /Users/buildslave/jenkins/workspace/lldb-cmake-standalone/clang-build/lib/libclangSerialization.a /Users/buildslave/jenkins/workspace/lldb-cmake-standalone/clang-build/lib/libclangSema.a /Users/buildslave/jenkins/workspace/lldb-cmake-standalone/clang-build/lib/libclangEdit.a /Users/buildslave/jenkins/workspace/lldb-cmake-standalone/clang-build/lib/libclangAnalysis.a /Users/buildslave/jenkins/workspace/lldb-cmake-standalone/clang-build/lib/libclangASTMatchers.a /Users/buildslave/jenkins/workspace/lldb-cmake-standalone/clang-build/lib/libLLVMDebugInfoDWARF.a /Users/buildslave/jenkins/workspace/lldb-cmake-standalone/lldb-xcode-build/Release/lib/liblldbHost.a /usr/lib/libxml2.dylib /usr/lib/libedit.dylib /usr/local/lib/liblzma.dylib /usr/lib/libedit.dylib /usr/local/lib/liblzma.dylib /Users/buildslave/jenkins/workspace/lldb-cmake-standalone/lldb-xcode-build/Release/lib/liblldbHostMacOSXObjCXX.a /Users/buildslave/jenkins/workspace/lldb-cmake-standalone/clang-build/lib/libLLVMTarget.a /Users/buildslave/jenkins/workspace/lldb-cmake-standalone/clang-build/lib/libLLVMIRReader.a /Users/buildslave/jenkins/workspace/lldb-cmake-standalone/clang-build/lib/libLLVMAsmParser.a /Users/buildslave/jenkins/workspace/lldb-cmake-standalone/clang-build/lib/libclangAST.a /Users/buildslave/jenkins/workspace/lldb-cmake-standalone/clang-build/lib/libLLVMFrontendOpenMP.a /Users/buildslave/jenkins/workspace/lldb-cmake-standalone/clang-build/lib/libLLVMScalarOpts.a /Users/buildslave/jenkins/workspace/lldb-cmake-standalone/clang-build/lib/libLLVMAggressiveInstCombine.a /Users/buildslave/jenkins/workspace/lldb-cmake-standalone/clang-build/lib/libLLVMInstCombine.a /Users/buildslave/jenkins/workspace/lldb-cmake-standalone/clang-build/lib/libLLVMTransformUtils.a /Users/buildslave/jenkins/workspace/lldb-cmake-standalone/clang-build/lib/libLLVMAnalysis.a /Users/buildslave/jenkins/workspace/lldb-cmake-standalone/clang-build/lib/libLLVMProfileData.a /Users/buildslave/jenkins/workspace/lldb-cmake-standalone/clang-build/lib/libclangLex.a /Users/buildslave/jenkins/workspace/lldb-cmake-standalone/clang-build/lib/libclangBasic.a /Users/buildslave/jenkins/workspace/lldb-cmake-standalone/clang-build/lib/libLLVMDebugInfoPDB.a /Users/buildslave/jenkins/workspace/lldb-cmake-standalone/clang-build/lib/libLLVMObject.a /Users/buildslave/jenkins/workspace/lldb-cmake-standalone/clang-build/lib/libLLVMBitReader.a /Users/buildslave/jenkins/workspace/lldb-cmake-standalone/clang-build/lib/libLLVMCore.a /Users/buildslave/jenkins/workspace/lldb-cmake-standalone/clang-build/lib/libLLVMRemarks.a /Users/buildslave/jenkins/workspace/lldb-cmake-standalone/clang-build/lib/libLLVMBitstreamReader.a /Users/buildslave/jenkins/workspace/lldb-cmake-standalone/clang-build/lib/libLLVMMCParser.a /Users/buildslave/jenkins/workspace/lldb-cmake-standalone/clang-build/lib/libLLVMMC.a /Users/buildslave/jenkins/workspace/lldb-cmake-standalone/clang-build/lib/libLLVMTextAPI.a /Users/buildslave/jenkins/workspace/lldb-cmake-standalone/clang-build/lib/libLLVMDebugInfoCodeView.a /Users/buildslave/jenkins/workspace/lldb-cmake-standalone/clang-build/lib/libLLVMDebugInfoMSF.a /Users/buildslave/jenkins/workspace/lldb-cmake-standalone/lldb-xcode-build/Release/lib/liblldbUtility.a -framework Foundation -framework CoreFoundation -framework CoreServices -framework Security /Users/buildslave/jenkins/workspace/lldb-cmake-standalone/clang-build/lib/libLLVMBinaryFormat.a /Users/buildslave/jenkins/workspace/lldb-cmake-standalone/clang-build/lib/libLLVMSupport.a -lm /usr/lib/libz.dylib /usr/lib/libcurses.dylib /Users/buildslave/jenkins/workspace/lldb-cmake-standalone/clang-build/lib/libLLVMDemangle.a -Xlinker -dependency_info -Xlinker /Users/buildslave/jenkins/workspace/lldb-cmake-standalone/lldb-xcode-build/unittests/Thread/lldb.build/Release/ThreadTests.build/Objects-normal/x86_64/ThreadTests_dependency_info.dat -o /Users/buildslave/jenkins/workspace/lldb-cmake-standalone/lldb-xcode-build/unittests/Thread/Release/ThreadTests

Hide Details

PhaseScriptExecution CMake\ PostBuild\ Rules /Users/buildslave/jenkins/workspace/lldb-cmake-standalone/lldb-xcode-build/unittests/Thread/lldb.build/Release/ThreadTests.build/Script-F999C1FD49F643B3B868F1C8.sh cd /Users/buildslave/jenkins/workspace/lldb-cmake-standalone/llvm-project/lldb /bin/sh -c /Users/buildslave/jenkins/workspace/lldb-cmake-standalone/lldb-xcode-build/unittests/Thread/lldb.build/Release/ThreadTests.build/Script-F999C1FD49F643B3B868F1C8.sh /usr/local/Cellar/cmake/3.17.2/bin/cmake -E make_directory /Users/buildslave/jenkins/workspace/lldb-cmake-standalone/lldb-xcode-build/unittests/Thread/Release/Inputs

Hide Details

CodeSign /Users/buildslave/jenkins/workspace/lldb-cmake-standalone/lldb-xcode-build/unittests/Thread/Release/ThreadTests cd /Users/buildslave/jenkins/workspace/lldb-cmake-standalone/llvm-project/lldb

Hide Details

Signing Identity: "-"

Hide Details

/usr/bin/codesign --force --sign - --entitlements /Users/buildslave/jenkins/workspace/lldb-cmake-standalone/lldb-xcode-build/unittests/Thread/lldb.build/Release/ThreadTests.build/ThreadTests.xcent --timestamp=none /Users/buildslave/jenkins/workspace/lldb-cmake-standalone/lldb-xcode-build/unittests/Thread/Release/ThreadTests

Hide Details

=== BUILD TARGET debugserverTests OF PROJECT lldb WITH CONFIGURATION Release ===

Hide Details

Check dependencies

Hide Details

Write auxiliary files write-file /Users/buildslave/jenkins/workspace/lldb-cmake-standalone/lldb-xcode-build/unittests/debugserver/lldb.build/Release/debugserverTests.build/Script-78C4536B8F404B5AA109F545.sh chmod 0755 /Users/buildslave/jenkins/workspace/lldb-cmake-standalone/lldb-xcode-build/unittests/debugserver/lldb.build/Release/debugserverTests.build/Script-78C4536B8F404B5AA109F545.sh

Hide Details

Ld /Users/buildslave/jenkins/workspace/lldb-cmake-standalone/lldb-xcode-build/unittests/debugserver/Release/debugserverTests normal x86_64 cd /Users/buildslave/jenkins/workspace/lldb-cmake-standalone/llvm-project/lldb /Applications/Xcode.app/Contents/Developer/Toolchains/XcodeDefault.xctoolchain/usr/bin/clang++ -target x86_64-apple-macos10.12 -isysroot /Applications/Xcode.app/Contents/Developer/Platforms/MacOSX.platform/Developer/SDKs/MacOSX10.15.sdk -L/Users/buildslave/jenkins/workspace/lldb-cmake-standalone/lldb-xcode-build/unittests/debugserver/Release -F/Users/buildslave/jenkins/workspace/lldb-cmake-standalone/lldb-xcode-build/unittests/debugserver/Release -filelist /Users/buildslave/jenkins/workspace/lldb-cmake-standalone/lldb-xcode-build/unittests/debugserver/lldb.build/Release/debugserverTests.build/Objects-normal/x86_64/debugserverTests.LinkFileList -Wl,-dead_strip -Wl,-search_paths_first -Wl,-headerpad_max_install_names /Users/buildslave/jenkins/workspace/lldb-cmake-standalone/clang-build/lib/libLLVMSupport.a /Users/buildslave/jenkins/workspace/lldb-cmake-standalone/clang-build/lib/libLLVMSupport.a /Users/buildslave/jenkins/workspace/lldb-cmake-standalone/clang-build/lib/libgtest_main.a /Users/buildslave/jenkins/workspace/lldb-cmake-standalone/clang-build/lib/libgtest.a /Users/buildslave/jenkins/workspace/lldb-cmake-standalone/lldb-xcode-build/Release/lib/liblldbDebugserverCommon.a /Users/buildslave/jenkins/workspace/lldb-cmake-standalone/lldb-xcode-build/Release/lib/liblldbHost.a /Users/buildslave/jenkins/workspace/lldb-cmake-standalone/clang-build/lib/libLLVMTestingSupport.a /Users/buildslave/jenkins/workspace/lldb-cmake-standalone/lldb-xcode-build/lib/Release/liblldbDebugserverArchSupport.a -lcompression /usr/lib/libxml2.dylib /usr/lib/libedit.dylib /usr/local/lib/liblzma.dylib /usr/lib/libedit.dylib /usr/local/lib/liblzma.dylib /Users/buildslave/jenkins/workspace/lldb-cmake-standalone/lldb-xcode-build/Release/lib/liblldbHostMacOSXObjCXX.a /Users/buildslave/jenkins/workspace/lldb-cmake-standalone/lldb-xcode-build/Release/lib/liblldbUtility.a -framework CoreFoundation -framework Foundation -framework CoreServices -framework Security /Users/buildslave/jenkins/workspace/lldb-cmake-standalone/clang-build/lib/libLLVMObject.a /Users/buildslave/jenkins/workspace/lldb-cmake-standalone/clang-build/lib/libLLVMBitReader.a /Users/buildslave/jenkins/workspace/lldb-cmake-standalone/clang-build/lib/libLLVMCore.a /Users/buildslave/jenkins/workspace/lldb-cmake-standalone/clang-build/lib/libLLVMRemarks.a /Users/buildslave/jenkins/workspace/lldb-cmake-standalone/clang-build/lib/libLLVMBitstreamReader.a /Users/buildslave/jenkins/workspace/lldb-cmake-standalone/clang-build/lib/libLLVMMCParser.a /Users/buildslave/jenkins/workspace/lldb-cmake-standalone/clang-build/lib/libLLVMMC.a /Users/buildslave/jenkins/workspace/lldb-cmake-standalone/clang-build/lib/libLLVMDebugInfoCodeView.a /Users/buildslave/jenkins/workspace/lldb-cmake-standalone/clang-build/lib/libLLVMTextAPI.a /Users/buildslave/jenkins/workspace/lldb-cmake-standalone/clang-build/lib/libLLVMBinaryFormat.a /Users/buildslave/jenkins/workspace/lldb-cmake-standalone/clang-build/lib/libgtest.a /Users/buildslave/jenkins/workspace/lldb-cmake-standalone/clang-build/lib/libLLVMSupport.a -lm /usr/lib/libz.dylib /usr/lib/libcurses.dylib /Users/buildslave/jenkins/workspace/lldb-cmake-standalone/clang-build/lib/libLLVMDemangle.a -lpthread -Xlinker -dependency_info -Xlinker /Users/buildslave/jenkins/workspace/lldb-cmake-standalone/lldb-xcode-build/unittests/debugserver/lldb.build/Release/debugserverTests.build/Objects-normal/x86_64/debugserverTests_dependency_info.dat -o /Users/buildslave/jenkins/workspace/lldb-cmake-standalone/lldb-xcode-build/unittests/debugserver/Release/debugserverTests

Hide Details

PhaseScriptExecution CMake\ PostBuild\ Rules /Users/buildslave/jenkins/workspace/lldb-cmake-standalone/lldb-xcode-build/unittests/debugserver/lldb.build/Release/debugserverTests.build/Script-78C4536B8F404B5AA109F545.sh cd /Users/buildslave/jenkins/workspace/lldb-cmake-standalone/llvm-project/lldb /bin/sh -c /Users/buildslave/jenkins/workspace/lldb-cmake-standalone/lldb-xcode-build/unittests/debugserver/lldb.build/Release/debugserverTests.build/Script-78C4536B8F404B5AA109F545.sh /usr/local/Cellar/cmake/3.17.2/bin/cmake -E make_directory /Users/buildslave/jenkins/workspace/lldb-cmake-standalone/lldb-xcode-build/unittests/debugserver/Release/Inputs

Hide Details

CodeSign /Users/buildslave/jenkins/workspace/lldb-cmake-standalone/lldb-xcode-build/unittests/debugserver/Release/debugserverTests cd /Users/buildslave/jenkins/workspace/lldb-cmake-standalone/llvm-project/lldb

Hide Details

Signing Identity: "-"

Hide Details

/usr/bin/codesign --force --sign - --entitlements /Users/buildslave/jenkins/workspace/lldb-cmake-standalone/lldb-xcode-build/unittests/debugserver/lldb.build/Release/debugserverTests.build/debugserverTests.xcent --timestamp=none /Users/buildslave/jenkins/workspace/lldb-cmake-standalone/lldb-xcode-build/unittests/debugserver/Release/debugserverTests

Hide Details

=== BUILD AGGREGATE TARGET LLDBUnitTests OF PROJECT lldb WITH CONFIGURATION Release ===

Hide Details

Check dependencies

Hide Details

=== BUILD AGGREGATE TARGET lldb-unit-test-deps OF PROJECT lldb WITH CONFIGURATION Release ===

Hide Details

Check dependencies

Hide Details

=== BUILD AGGREGATE TARGET check-lldb OF PROJECT lldb WITH CONFIGURATION Release ===

Hide Details

Check dependencies

Hide Details

Write auxiliary files write-file /Users/buildslave/jenkins/workspace/lldb-cmake-standalone/lldb-xcode-build/test/lldb.build/Release/check-lldb.build/Script-459E356AC45A4772B4F32507.sh chmod 0755 /Users/buildslave/jenkins/workspace/lldb-cmake-standalone/lldb-xcode-build/test/lldb.build/Release/check-lldb.build/Script-459E356AC45A4772B4F32507.sh

Hide Details

PhaseScriptExecution CMake\ Rules /Users/buildslave/jenkins/workspace/lldb-cmake-standalone/lldb-xcode-build/test/lldb.build/Release/check-lldb.build/Script-459E356AC45A4772B4F32507.sh cd /Users/buildslave/jenkins/workspace/lldb-cmake-standalone/llvm-project/lldb /bin/sh -c /Users/buildslave/jenkins/workspace/lldb-cmake-standalone/lldb-xcode-build/test/lldb.build/Release/check-lldb.build/Script-459E356AC45A4772B4F32507.sh echo "Running lldb lit test suite" Running lldb lit test suite /usr/local/Frameworks/Python.framework/Versions/3.7/bin/python3.7 /Users/buildslave/jenkins/workspace/lldb-cmake-standalone/lldb-xcode-build/Release/bin/llvm-lit --xunit-xml-output=testresults.xunit.xml -v -vv --timeout=600 --param build_mode=Release /Users/buildslave/jenkins/workspace/lldb-cmake-standalone/lldb-xcode-build/test Deleting module cache at /Users/buildslave/jenkins/workspace/lldb-cmake-standalone/lldb-xcode-build/lldb-test-build.noindex/module-cache-lldb/lldb-api. Deleting module cache at /Users/buildslave/jenkins/workspace/lldb-cmake-standalone/lldb-xcode-build/lldb-test-build.noindex/module-cache-clang/lldb-api. -- Testing: 2403 tests, 16 workers -- llvm-lit: /Users/buildslave/jenkins/workspace/lldb-cmake-standalone/llvm-project/lldb/test/Shell/helper/toolchain.py:126: note: using SDKROOT: '/Applications/Xcode.app/Contents/Developer/Platforms/MacOSX.platform/Developer/SDKs/MacOSX10.15.sdk' llvm-lit: /Users/buildslave/jenkins/workspace/lldb-cmake-standalone/llvm-project/llvm/utils/lit/lit/llvm/config.py:436: note: using clang: /Users/buildslave/jenkins/workspace/lldb-cmake-standalone/clang-build/bin/clang PASS: lldb-api :: functionalities/inferior-crashing/TestInferiorCrashingStep.py (1 of 2403) PASS: lldb-api :: types/TestIntegerTypeExpr.py (2 of 2403) PASS: lldb-api :: functionalities/completion/TestCompletion.py (3 of 2403) PASS: lldb-api :: python_api/target/TestTargetAPI.py (4 of 2403) PASS: lldb-api :: lang/objc/foundation/TestObjCMethods.py (5 of 2403) PASS: lldb-api :: functionalities/load_unload/TestLoadUnload.py (6 of 2403) UNSUPPORTED: lldb-api :: tools/lldb-server/vCont-threads/TestGdbRemote_vContThreads.py (7 of 2403) PASS: lldb-api :: types/TestLongTypes.py (8 of 2403) PASS: lldb-api :: lang/objc/objc-new-syntax/TestObjCNewSyntaxLiteral.py (9 of 2403) PASS: lldb-api :: lang/cpp/namespace/TestNamespaceLookup.py (10 of 2403) PASS: lldb-api :: lang/objc/foundation/TestFoundationDisassembly.py (11 of 2403) PASS: lldb-api :: types/TestLongTypesExpr.py (12 of 2403) PASS: lldb-api :: lang/objc/exceptions/TestObjCExceptions.py (13 of 2403) PASS: lldb-api :: types/TestShortTypeExpr.py (14 of 2403) PASS: lldb-api :: lang/objc/hidden-ivars/TestHiddenIvars.py (15 of 2403) PASS: lldb-api :: python_api/thread/TestThreadAPI.py (16 of 2403) PASS: lldb-api :: lang/c/anonymous/TestAnonymous.py (17 of 2403) PASS: lldb-api :: types/TestCharType.py (18 of 2403) PASS: lldb-api :: tools/lldb-server/TestGdbRemoteThreadsInStopReply.py (19 of 2403) PASS: lldb-api :: types/TestCharTypeExpr.py (20 of 2403) PASS: lldb-api :: api/multithreaded/TestMultithreaded.py (21 of 2403) PASS: lldb-api :: python_api/process/TestProcessAPI.py (22 of 2403) PASS: lldb-api :: commands/target/basic/TestTargetCommand.py (23 of 2403) PASS: lldb-api :: lang/objc/real-definition/TestRealDefinition.py (24 of 2403) PASS: lldb-api :: lang/c/shared_lib/TestSharedLib.py (25 of 2403) PASS: lldb-api :: lang/objc/objc-new-syntax/TestObjCNewSyntaxArray.py (26 of 2403) PASS: lldb-api :: commands/expression/import-std-module/queue/TestQueueFromStdModule.py (27 of 2403) PASS: lldb-api :: lang/objc/objc-new-syntax/TestObjCNewSyntaxDictionary.py (28 of 2403) PASS: lldb-api :: functionalities/inferior-assert/TestInferiorAssert.py (29 of 2403) PASS: lldb-api :: functionalities/breakpoint/breakpoint_ignore_count/TestBreakpointIgnoreCount.py (30 of 2403) PASS: lldb-api :: functionalities/inferior-crashing/recursive-inferior/TestRecursiveInferior.py (31 of 2403) PASS: lldb-api :: functionalities/breakpoint/breakpoint_conditions/TestBreakpointConditions.py (32 of 2403) PASS: lldb-api :: functionalities/limit-debug-info/TestLimitDebugInfo.py (33 of 2403) PASS: lldb-api :: lang/cpp/virtual-functions/TestCppVirtualFunctions.py (34 of 2403) PASS: lldb-api :: functionalities/data-formatter/poarray/TestPrintObjectArray.py (35 of 2403) PASS: lldb-api :: functionalities/inferior-crashing/TestInferiorCrashing.py (36 of 2403) PASS: lldb-api :: commands/expression/test/TestExprs.py (37 of 2403) PASS: lldb-api :: functionalities/thread/step_until/TestStepUntil.py (38 of 2403) PASS: lldb-api :: types/TestIntegerType.py (39 of 2403) PASS: lldb-api :: tools/lldb-vscode/launch/TestVSCode_launch.py (40 of 2403) UNSUPPORTED: lldb-api :: functionalities/thread/create_during_step/TestCreateDuringStep.py (41 of 2403) PASS: lldb-api :: lang/c/bitfields/TestBitfields.py (42 of 2403) PASS: lldb-api :: types/TestShortType.py (43 of 2403) PASS: lldb-api :: functionalities/thread/step_out/TestThreadStepOut.py (44 of 2403) PASS: lldb-api :: functionalities/return-value/TestReturnValue.py (45 of 2403) PASS: lldb-api :: python_api/lldbutil/iter/TestLLDBIterator.py (46 of 2403) PASS: lldb-api :: tools/lldb-server/TestLldbGdbServer.py (47 of 2403) PASS: lldb-api :: tools/lldb-server/TestGdbRemote_vCont.py (48 of 2403) PASS: lldb-api :: functionalities/data-formatter/nsdictionarysynth/TestNSDictionarySynthetic.py (49 of 2403) PASS: lldb-api :: functionalities/stop-on-sharedlibrary-load/TestStopOnSharedlibraryEvents.py (50 of 2403) PASS: lldb-api :: functionalities/thread/exit_during_step/TestExitDuringStep.py (51 of 2403) PASS: lldb-api :: commands/settings/TestSettings.py (52 of 2403) PASS: lldb-api :: functionalities/inline-stepping/TestInlineStepping.py (53 of 2403) PASS: lldb-api :: commands/register/register/register_command/TestRegisters.py (54 of 2403) PASS: lldb-api :: lang/objc/foundation/TestObjCMethodsString.py (55 of 2403) PASS: lldb-api :: tools/lldb-vscode/module/TestVSCode_module.py (56 of 2403) PASS: lldb-api :: commands/expression/import-std-module/basic/TestImportStdModule.py (57 of 2403) PASS: lldb-api :: lang/c/step-target/TestStepTarget.py (58 of 2403) PASS: lldb-api :: commands/expression/char/TestExprsChar.py (59 of 2403) PASS: lldb-api :: lang/c/shared_lib_stripped_symbols/TestSharedLibStrippedSymbols.py (60 of 2403) PASS: lldb-api :: lang/objc/foundation/TestObjCMethodsNSError.py (61 of 2403) PASS: lldb-api :: commands/expression/import-std-module/stack/TestStackFromStdModule.py (62 of 2403) PASS: lldb-api :: tools/lldb-vscode/evaluate/TestVSCode_evaluate.py (63 of 2403) PASS: lldb-api :: lang/cpp/template/TestTemplateArgs.py (64 of 2403) PASS: lldb-api :: lang/cpp/class_types/TestClassTypes.py (65 of 2403) PASS: lldb-api :: commands/expression/import-std-module/vector/TestVectorFromStdModule.py (66 of 2403) PASS: lldb-api :: commands/expression/import-std-module/vector-dbg-info-content/TestDbgInfoContentVectorFromStdModule.py (67 of 2403) PASS: lldb-api :: lang/objc/orderedset/TestOrderedSet.py (68 of 2403) PASS: lldb-api :: functionalities/inferior-crashing/recursive-inferior/TestRecursiveInferiorStep.py (69 of 2403) PASS: lldb-api :: functionalities/data-formatter/data-formatter-objc/TestDataFormatterObjNSException.py (70 of 2403) PASS: lldb-api :: lang/objc/conflicting-definition/TestConflictingDefinition.py (71 of 2403) PASS: lldb-api :: functionalities/gdb_remote_client/TestPlatformClient.py (72 of 2403) PASS: lldb-api :: lang/objc/forward-decl/TestForwardDecl.py (73 of 2403) PASS: lldb-api :: functionalities/data-formatter/data-formatter-objc/TestDataFormatterObjCNSURL.py (74 of 2403) PASS: lldb-api :: functionalities/data-formatter/data-formatter-objc/TestDataFormatterObjCNSBundle.py (75 of 2403) PASS: lldb-api :: functionalities/data-formatter/data-formatter-objc/TestDataFormatterObjCNSData.py (76 of 2403) PASS: lldb-api :: functionalities/data-formatter/data-formatter-objc/TestDataFormatterObjCNSNumber.py (77 of 2403) PASS: lldb-api :: functionalities/data-formatter/compactvectors/TestCompactVectors.py (78 of 2403) PASS: lldb-api :: functionalities/data-formatter/nssetsynth/TestNSSetSynthetic.py (79 of 2403) PASS: lldb-api :: lang/cpp/namespace_definitions/TestNamespaceDefinitions.py (80 of 2403) PASS: lldb-api :: commands/expression/expr-in-syscall/TestExpressionInSyscall.py (81 of 2403) PASS: lldb-api :: functionalities/data-formatter/data-formatter-objc/TestDataFormatterObjCNSError.py (82 of 2403) PASS: lldb-api :: lang/objc/single-entry-dictionary/TestObjCSingleEntryDictionary.py (83 of 2403) PASS: lldb-api :: commands/expression/import-std-module/deque-basic/TestDequeFromStdModule.py (84 of 2403) PASS: lldb-api :: functionalities/data-formatter/data-formatter-stl/libcxx/multiset/TestDataFormatterLibcxxMultiSet.py (85 of 2403) PASS: lldb-api :: commands/expression/import-std-module/deque-dbg-info-content/TestDbgInfoContentDequeFromStdModule.py (86 of 2403) PASS: lldb-api :: functionalities/tail_call_frames/cross_dso/TestCrossDSOTailCalls.py (87 of 2403) PASS: lldb-api :: commands/target/stop-hooks/TestStopHookScripted.py (88 of 2403) PASS: lldb-api :: functionalities/mtc/simple/TestMTCSimple.py (89 of 2403) PASS: lldb-api :: lang/cpp/template-function/TestTemplateFunctions.py (90 of 2403) PASS: lldb-api :: functionalities/data-formatter/data-formatter-stl/libcxx/set/TestDataFormatterLibcxxSet.py (91 of 2403) PASS: lldb-api :: functionalities/thread/backtrace_all/TestBacktraceAll.py (92 of 2403) PASS: lldb-api :: commands/expression/persist_objc_pointeetype/TestPersistObjCPointeeType.py (93 of 2403) PASS: lldb-api :: functionalities/data-formatter/data-formatter-stl/libcxx/vector/TestDataFormatterLibcxxVector.py (94 of 2403) PASS: lldb-api :: lang/objc/objc-optimized/TestObjcOptimized.py (95 of 2403) PASS: lldb-api :: lang/c/tls_globals/TestTlsGlobals.py (96 of 2403) PASS: lldb-api :: functionalities/step-avoids-no-debug/TestStepNoDebug.py (97 of 2403) PASS: lldb-api :: lang/c/conflicting-symbol/TestConflictingSymbol.py (98 of 2403) PASS: lldb-api :: tools/lldb-server/TestGdbRemoteExpeditedRegisters.py (99 of 2403) PASS: lldb-api :: lang/cpp/member-and-local-vars-with-same-name/TestMembersAndLocalsWithSameName.py (100 of 2403) PASS: lldb-api :: commands/expression/import-std-module/array/TestArrayFromStdModule.py (101 of 2403) PASS: lldb-api :: lang/c/blocks/TestBlocks.py (102 of 2403) PASS: lldb-api :: lang/c/function_types/TestFunctionTypes.py (103 of 2403) PASS: lldb-api :: commands/expression/import-std-module/list/TestListFromStdModule.py (104 of 2403) PASS: lldb-api :: functionalities/tail_call_frames/ambiguous_tail_call_seq1/TestAmbiguousTailCallSeq1.py (105 of 2403) PASS: lldb-api :: functionalities/data-formatter/data-formatter-stl/libcxx/unordered/TestDataFormatterUnordered.py (106 of 2403) PASS: lldb-api :: lang/objc/modules/TestObjCModules.py (107 of 2403) PASS: lldb-api :: commands/expression/two-files/TestObjCTypeQueryFromOtherCompileUnit.py (108 of 2403) PASS: lldb-api :: commands/expression/static-initializers/TestStaticInitializers.py (109 of 2403) PASS: lldb-api :: functionalities/data-formatter/data-formatter-python-synth/TestDataFormatterPythonSynth.py (110 of 2403) PASS: lldb-api :: lang/cpp/constructors/TestCppConstructors.py (111 of 2403) PASS: lldb-api :: lang/cpp/modules-import/TestCXXModulesImport.py (112 of 2403) PASS: lldb-api :: lang/cpp/class_static/TestStaticVariables.py (113 of 2403) PASS: lldb-api :: commands/expression/import-std-module/vector-bool/TestVectorBoolFromStdModule.py (114 of 2403) PASS: lldb-api :: lang/c/vla/TestVLA.py (115 of 2403) PASS: lldb-api :: functionalities/data-formatter/data-formatter-stl/libcxx/optional/TestDataFormatterLibcxxOptional.py (116 of 2403) PASS: lldb-api :: python_api/frame/TestFrames.py (117 of 2403) PASS: lldb-api :: lang/cpp/unicode-literals/TestUnicodeLiterals.py (118 of 2403) PASS: lldb-api :: python_api/watchpoint/watchlocation/TestTargetWatchAddress.py (119 of 2403) make: *** [/Users/buildslave/jenkins/workspace/lldb-cmake-standalone/lldb-xcode-build/test/CMakeFiles/check-lldb] Hangup: 1

Hide Details

** BUILD FAILED **

Hide Details

Hide Details

The following build commands failed: PhaseScriptExecution CMake\ Rules /Users/buildslave/jenkins/workspace/lldb-cmake-standalone/lldb-xcode-build/test/lldb.build/Release/check-lldb.build/Script-459E356AC45A4772B4F32507.sh (1 failure) Command failed: Command '['/usr/bin/env', 'TERM=vt100', '/usr/local/bin/cmake', '--build', '.', '--config', 'Release', '--target', 'check-lldb']' returned non-zero exit status 65. Command: ['/usr/bin/env', 'TERM=vt100', '/usr/local/bin/cmake', '--build', '.', '--config', 'Release', '--target', 'check-lldb'] [Pipeline] } [Pipeline] // timeout [Pipeline] } [Pipeline] // stage [Pipeline] } [Pipeline] // withEnv [Pipeline] } [Pipeline] // node [Pipeline] End of Pipeline ERROR: script returned exit code 1 Finished: FAILURE