Console Output

Skipping 1,991 KB.. Full Log
+ : 'RUN: at line 8'
+ /Users/buildslave/jenkins/workspace/lldb-cmake-standalone/lldb-xcode-build/Release/bin/lldb --no-lldbinit -S /Users/buildslave/jenkins/workspace/lldb-cmake-standalone/lldb-xcode-build/test/Shell/lit-lldb-init /Users/buildslave/jenkins/workspace/lldb-cmake-standalone/lldb-xcode-build/test/Shell/Unwind/Output/eh-frame-dwarf-unwind.test.tmp -s /Users/buildslave/jenkins/workspace/lldb-cmake-standalone/llvm-project/lldb/test/Shell/Unwind/eh-frame-dwarf-unwind.test -o exit
+ /Users/buildslave/jenkins/workspace/lldb-cmake-standalone/clang-build/bin/FileCheck /Users/buildslave/jenkins/workspace/lldb-cmake-standalone/llvm-project/lldb/test/Shell/Unwind/eh-frame-dwarf-unwind.test
error: process exited with status -1 (tried to attach to process already being debugged)
/Users/buildslave/jenkins/workspace/lldb-cmake-standalone/llvm-project/lldb/test/Shell/Unwind/eh-frame-dwarf-unwind.test:14:10: error: CHECK: expected string not found in input
# CHECK: stop reason = breakpoint 1.1
         ^
<stdin>:16:57: note: scanning from here
Breakpoint 1: where = eh-frame-dwarf-unwind.test.tmp`bar, address = 0x0000000100000ecc
                                                        ^
<stdin>:17:8: note: possible intended match here
(lldb) process launch
       ^

Hide Details

Input file: <stdin> Check file: /Users/buildslave/jenkins/workspace/lldb-cmake-standalone/llvm-project/lldb/test/Shell/Unwind/eh-frame-dwarf-unwind.test

Hide Details

-dump-input=help explains the following input dump.

Hide Details

Input was: <<<<<< . . . 11: (lldb) target create "/Users/buildslave/jenkins/workspace/lldb-cmake-standalone/lldb-xcode-build/test/Shell/Unwind/Output/eh-frame-dwarf-unwind.test.tmp" 12: Current executable set to '/Users/buildslave/jenkins/workspace/lldb-cmake-standalone/lldb-xcode-build/test/Shell/Unwind/Output/eh-frame-dwarf-unwind.test.tmp' (x86_64). 13: (lldb) command source -s 0 '/Users/buildslave/jenkins/workspace/lldb-cmake-standalone/llvm-project/lldb/test/Shell/Unwind/eh-frame-dwarf-unwind.test' 14: Executing commands in '/Users/buildslave/jenkins/workspace/lldb-cmake-standalone/llvm-project/lldb/test/Shell/Unwind/eh-frame-dwarf-unwind.test'. 15: (lldb) breakpoint set -n bar 16: Breakpoint 1: where = eh-frame-dwarf-unwind.test.tmp`bar, address = 0x0000000100000ecc check:14'0 X~~~~~~~~~~~~~~~~~~~~~~~~~~~~~~ error: no match found 17: (lldb) process launch check:14'0 ~~~~~~~~~~~~~~~~~~~~~~ check:14'1 ? possible intended match 18: (lldb) exit check:14'0 ~~~~~~~~~~~~ >>>>>>

Hide Details

--

Hide Details

******************** PASS: lldb-shell :: ObjectFile/ELF/PT_LOAD-overlap.yaml (1246 of 2403) PASS: lldb-shell :: ObjectFile/ELF/PT_LOAD-empty.yaml (1247 of 2403) PASS: lldb-shell :: ObjectFile/PECOFF/section-types.yaml (1248 of 2403) PASS: lldb-shell :: ObjectFile/wasm/stripped-debug-sections.yaml (1249 of 2403) PASS: lldb-shell :: Driver/TestNoUseColor.test (1250 of 2403) PASS: lldb-shell :: Settings/TestDisassemblyFormat.test (1251 of 2403) PASS: lldb-shell :: Breakpoint/debug_rnglistx_rlex.test (1252 of 2403) PASS: lldb-unit :: ScriptInterpreter/Python/Release/ScriptInterpreterPythonTests/PythonDataObjectsTest.TestGlobalNameResolutionWithDot (1253 of 2403) PASS: lldb-unit :: ScriptInterpreter/Python/Release/ScriptInterpreterPythonTests/PythonDataObjectsTest.TestPythonBoolean (1254 of 2403) PASS: lldb-unit :: ScriptInterpreter/Python/Release/ScriptInterpreterPythonTests/PythonDataObjectsTest.TestPythonTupleInitializerList (1255 of 2403) PASS: lldb-shell :: ObjectFile/ELF/PT_LOAD.yaml (1256 of 2403) PASS: lldb-shell :: Quit/TestQuitExitCodeHex0.test (1257 of 2403) PASS: lldb-unit :: ScriptInterpreter/Python/Release/ScriptInterpreterPythonTests/PythonDataObjectsTest.TestPythonListToStructuredList (1258 of 2403) PASS: lldb-unit :: ScriptInterpreter/Python/Release/ScriptInterpreterPythonTests/PythonDataObjectsTest.TestPythonStringToStructuredString (1259 of 2403) PASS: lldb-unit :: ScriptInterpreter/Python/Release/ScriptInterpreterPythonTests/PythonDataObjectsTest.TestInstanceNameResolutionNoDot (1260 of 2403) PASS: lldb-unit :: ScriptInterpreter/Python/Release/ScriptInterpreterPythonTests/PythonDataObjectsTest.TestPythonIntegerToStructuredInteger (1261 of 2403) FAIL: lldb-shell :: Unwind/trap_frame_sym_ctx.test (1262 of 2403) ******************** TEST 'lldb-shell :: Unwind/trap_frame_sym_ctx.test' FAILED ******************** Script: -- : 'RUN: at line 7'; /Users/buildslave/jenkins/workspace/lldb-cmake-standalone/clang-build/bin/clang --target=specify-a-target-or-use-a-_host-substitution --target=x86_64-apple-darwin19.5.0 -isysroot /Applications/Xcode.app/Contents/Developer/Platforms/MacOSX.platform/Developer/SDKs/MacOSX10.15.sdk -fmodules-cache-path=/Users/buildslave/jenkins/workspace/lldb-cmake-standalone/lldb-xcode-build/lldb-test-build.noindex/module-cache-clang/lldb-shell /Users/buildslave/jenkins/workspace/lldb-cmake-standalone/llvm-project/lldb/test/Shell/Unwind/Inputs/call-asm.c /Users/buildslave/jenkins/workspace/lldb-cmake-standalone/llvm-project/lldb/test/Shell/Unwind/Inputs/trap_frame_sym_ctx.s -o /Users/buildslave/jenkins/workspace/lldb-cmake-standalone/lldb-xcode-build/test/Shell/Unwind/Output/trap_frame_sym_ctx.test.tmp : 'RUN: at line 8'; /Users/buildslave/jenkins/workspace/lldb-cmake-standalone/lldb-xcode-build/Release/bin/lldb --no-lldbinit -S /Users/buildslave/jenkins/workspace/lldb-cmake-standalone/lldb-xcode-build/test/Shell/lit-lldb-init /Users/buildslave/jenkins/workspace/lldb-cmake-standalone/lldb-xcode-build/test/Shell/Unwind/Output/trap_frame_sym_ctx.test.tmp -s /Users/buildslave/jenkins/workspace/lldb-cmake-standalone/llvm-project/lldb/test/Shell/Unwind/trap_frame_sym_ctx.test -o exit | /Users/buildslave/jenkins/workspace/lldb-cmake-standalone/clang-build/bin/FileCheck /Users/buildslave/jenkins/workspace/lldb-cmake-standalone/llvm-project/lldb/test/Shell/Unwind/trap_frame_sym_ctx.test -- Exit Code: 1

Hide Details

Command Output (stderr): -- + : 'RUN: at line 7' + /Users/buildslave/jenkins/workspace/lldb-cmake-standalone/clang-build/bin/clang --target=specify-a-target-or-use-a-_host-substitution --target=x86_64-apple-darwin19.5.0 -isysroot /Applications/Xcode.app/Contents/Developer/Platforms/MacOSX.platform/Developer/SDKs/MacOSX10.15.sdk -fmodules-cache-path=/Users/buildslave/jenkins/workspace/lldb-cmake-standalone/lldb-xcode-build/lldb-test-build.noindex/module-cache-clang/lldb-shell /Users/buildslave/jenkins/workspace/lldb-cmake-standalone/llvm-project/lldb/test/Shell/Unwind/Inputs/call-asm.c /Users/buildslave/jenkins/workspace/lldb-cmake-standalone/llvm-project/lldb/test/Shell/Unwind/Inputs/trap_frame_sym_ctx.s -o /Users/buildslave/jenkins/workspace/lldb-cmake-standalone/lldb-xcode-build/test/Shell/Unwind/Output/trap_frame_sym_ctx.test.tmp clang-14: warning: argument unused during compilation: '-fmodules-cache-path=/Users/buildslave/jenkins/workspace/lldb-cmake-standalone/lldb-xcode-build/lldb-test-build.noindex/module-cache-clang/lldb-shell' [-Wunused-command-line-argument] + : 'RUN: at line 8' + /Users/buildslave/jenkins/workspace/lldb-cmake-standalone/lldb-xcode-build/Release/bin/lldb --no-lldbinit -S /Users/buildslave/jenkins/workspace/lldb-cmake-standalone/lldb-xcode-build/test/Shell/lit-lldb-init /Users/buildslave/jenkins/workspace/lldb-cmake-standalone/lldb-xcode-build/test/Shell/Unwind/Output/trap_frame_sym_ctx.test.tmp -s /Users/buildslave/jenkins/workspace/lldb-cmake-standalone/llvm-project/lldb/test/Shell/Unwind/trap_frame_sym_ctx.test -o exit + /Users/buildslave/jenkins/workspace/lldb-cmake-standalone/clang-build/bin/FileCheck /Users/buildslave/jenkins/workspace/lldb-cmake-standalone/llvm-project/lldb/test/Shell/Unwind/trap_frame_sym_ctx.test error: process exited with status -1 (tried to attach to process already being debugged) /Users/buildslave/jenkins/workspace/lldb-cmake-standalone/llvm-project/lldb/test/Shell/Unwind/trap_frame_sym_ctx.test:16:10: error: CHECK: expected string not found in input # CHECK: stop reason = breakpoint 1.1 ^ <stdin>:17:54: note: scanning from here Breakpoint 1: where = trap_frame_sym_ctx.test.tmp`bar, address = 0x0000000100000ecc ^ <stdin>:18:8: note: possible intended match here (lldb) process launch ^

Hide Details

Input file: <stdin> Check file: /Users/buildslave/jenkins/workspace/lldb-cmake-standalone/llvm-project/lldb/test/Shell/Unwind/trap_frame_sym_ctx.test

Hide Details

-dump-input=help explains the following input dump.

Hide Details

Input was: <<<<<< . . . 12: Current executable set to '/Users/buildslave/jenkins/workspace/lldb-cmake-standalone/lldb-xcode-build/test/Shell/Unwind/Output/trap_frame_sym_ctx.test.tmp' (x86_64). 13: (lldb) command source -s 0 '/Users/buildslave/jenkins/workspace/lldb-cmake-standalone/llvm-project/lldb/test/Shell/Unwind/trap_frame_sym_ctx.test' 14: Executing commands in '/Users/buildslave/jenkins/workspace/lldb-cmake-standalone/llvm-project/lldb/test/Shell/Unwind/trap_frame_sym_ctx.test'. 15: (lldb) settings append target.trap-handler-names tramp 16: (lldb) breakpoint set -n bar 17: Breakpoint 1: where = trap_frame_sym_ctx.test.tmp`bar, address = 0x0000000100000ecc check:16'0 X~~~~~~~~~~~~~~~~~~~~~~~~~~~~~~ error: no match found 18: (lldb) process launch check:16'0 ~~~~~~~~~~~~~~~~~~~~~~ check:16'1 ? possible intended match 19: (lldb) exit check:16'0 ~~~~~~~~~~~~ >>>>>>

Hide Details

--

Hide Details

******************** PASS: lldb-shell :: ObjectFile/MachO/lc_build_version.yaml (1263 of 2403) PASS: lldb-unit :: ScriptInterpreter/Python/Release/ScriptInterpreterPythonTests/PythonDataObjectsTest.TestPythonCallableInvoke (1264 of 2403) PASS: lldb-shell :: ObjectFile/ELF/PT_LOAD-overlap-PT_INTERP.yaml (1265 of 2403) PASS: lldb-unit :: ScriptInterpreter/Python/Release/ScriptInterpreterPythonTests/PythonDataObjectsTest.TestTypeNameResolutionNoDot (1266 of 2403) PASS: lldb-shell :: ObjectFile/PECOFF/sections-names.yaml (1267 of 2403) PASS: lldb-unit :: ScriptInterpreter/Python/Release/ScriptInterpreterPythonTests/PythonDataObjectsTest.TestResetting (1268 of 2403) PASS: lldb-shell :: ObjectFile/ELF/section-permissions.yaml (1269 of 2403) PASS: lldb-shell :: Quit/TestQuitExitCodeImplicit0.test (1270 of 2403) PASS: lldb-shell :: Driver/TestFile.test (1271 of 2403) PASS: lldb-shell :: ObjectFile/ELF/netbsd-exec-8.99.30-amd64.yaml (1272 of 2403) PASS: lldb-shell :: Commands/command-backtrace-parser-2.test (1273 of 2403) PASS: lldb-shell :: ObjectFile/MachO/lc_build_version_notools.yaml (1274 of 2403) PASS: lldb-shell :: ObjectFile/wasm/embedded-debug-sections.yaml (1275 of 2403) PASS: lldb-shell :: ObjectFile/MachO/lc_version_min.yaml (1276 of 2403) PASS: lldb-shell :: ObjectFile/ELF/aarch64-relocations.yaml (1277 of 2403) PASS: lldb-shell :: ObjectFile/ELF/short-build-id.yaml (1278 of 2403) PASS: lldb-shell :: ObjectFile/MachO/subsections.yaml (1279 of 2403) PASS: lldb-shell :: ObjectFile/ELF/compressed-sections.yaml (1280 of 2403) PASS: lldb-shell :: Settings/TestDisableColor.test (1281 of 2403) PASS: lldb-shell :: SymbolFile/DWARF/x86/childless-compile-unit.s (1282 of 2403) PASS: lldb-shell :: ScriptInterpreter/None/none.test (1283 of 2403) PASS: lldb-shell :: Commands/command-backtrace-parser-1.test (1284 of 2403) PASS: lldb-shell :: Settings/TestDefaultModuleCachePath.test (1285 of 2403) PASS: lldb-shell :: Commands/command-regex-unalias.test (1286 of 2403) PASS: lldb-shell :: Driver/TestHelp.test (1287 of 2403) PASS: lldb-shell :: Settings/TestModuleCacheSanity.test (1288 of 2403) PASS: lldb-unit :: Process/Release/ProcessEventDataTests/ProcessEventDataTest.DoOnRemoval (1289 of 2403) PASS: lldb-shell :: ObjectFile/Breakpad/sections-trailing-func.test (1290 of 2403) PASS: lldb-shell :: ObjectFile/ELF/netbsd-core-amd64.test (1291 of 2403) PASS: lldb-shell :: Quit/TestQuitExitCode0.test (1292 of 2403) PASS: lldb-shell :: ScriptInterpreter/None/import_module.test (1293 of 2403) PASS: lldb-shell :: ObjectFile/Breakpad/sections.test (1294 of 2403) PASS: lldb-shell :: Breakpoint/debug_addrx.test (1295 of 2403) PASS: lldb-unit :: Utility/Release/UtilityTests/ListenerTest.GetEventWait (1296 of 2403) PASS: lldb-unit :: Target/Release/TargetTests/ExecutionContextTest.GetByteOrderTarget (1297 of 2403) PASS: lldb-unit :: Expression/Release/ExpressionTests/DWARFExpression.DW_OP_convert (1298 of 2403) PASS: lldb-shell :: Driver/TestError.test (1299 of 2403) PASS: lldb-shell :: ObjectFile/ELF/PT_LOAD-overlap-section.yaml (1300 of 2403) PASS: lldb-unit :: Thread/Release/ThreadTests/ThreadTest.GetPrivateStopInfo (1301 of 2403) PASS: lldb-shell :: ObjectFile/Breakpad/discontiguous-sections.test (1302 of 2403) PASS: lldb-unit :: Target/Release/TargetTests/ExecutionContextTest.GetByteOrderProcess (1303 of 2403) PASS: lldb-unit :: Expression/Release/ExpressionTests/CppModuleConfigurationTest.LibCppV2 (1304 of 2403) PASS: lldb-unit :: Symbol/Release/SymbolTests/LineEntryTest.GetAllExactLineColumnMatches (1305 of 2403) PASS: lldb-unit :: Expression/Release/ExpressionTests/CppModuleConfigurationTest.Xcode (1306 of 2403) PASS: lldb-unit :: Utility/Release/UtilityTests/TimerTest.CategoryTimesNested (1307 of 2403) PASS: lldb-unit :: Expression/Release/ExpressionTests/CppModuleConfigurationTest.IgnoreLibStdCpp (1308 of 2403) PASS: lldb-unit :: API/Release/APITests/SBCommandInterpreterTest.SingleWordCommand (1309 of 2403) PASS: lldb-unit :: Process/Release/ProcessEventDataTests/ProcessEventDataTest.ShouldStop (1310 of 2403) PASS: lldb-unit :: Utility/Release/UtilityTests/PassiveReplayTest.InstrumentedFooInvalid (1311 of 2403) PASS: lldb-unit :: API/Release/APITests/SBCommandInterpreterTest.MultiWordCommand (1312 of 2403) PASS: lldb-unit :: Expression/Release/ExpressionTests/CppModuleConfigurationTest.Linux (1313 of 2403) XFAIL: lldb-shell :: Register/x86-mm-xmm-read.test (1314 of 2403) PASS: lldb-unit :: Symbol/Release/SymbolTests/LineEntryTest.GetAllExactLineMatchesWithoutColumn (1315 of 2403) PASS: lldb-unit :: Symbol/Release/SymbolTests/LineEntryTest.GetSameLineContiguousAddressRangeNestedInline (1316 of 2403) PASS: lldb-unit :: Symbol/Release/SymbolTests/DWARFCallFrameInfoTest.Basic_dwarf3 (1317 of 2403) PASS: lldb-unit :: Target/Release/TargetTests/ModuleCacheTest.GetAndPut (1318 of 2403) PASS: lldb-shell :: Breakpoint/debug_rnglist_basic.test (1319 of 2403) PASS: lldb-unit :: Symbol/Release/SymbolTests/LineEntryTest.GetSameLineContiguousAddressRangeNoInlines (1320 of 2403) PASS: lldb-unit :: Target/Release/TargetTests/ModuleCacheTest.GetAndPutStrangeHostname (1321 of 2403) PASS: lldb-unit :: Utility/Release/UtilityTests/RecordReplayTest.InvalidSequence (1322 of 2403) PASS: lldb-unit :: API/Release/APITests/SBStructuredDataTest.NullImpl (1323 of 2403) PASS: lldb-unit :: SymbolFile/DWARF/Release/SymbolFileDWARFTests/DWARFASTParserClangTests.EnsureAllDIEsInDeclContextHaveBeenParsedParsesOnlyMatchingEntries (1324 of 2403) PASS: lldb-unit :: Target/Release/TargetTests/StackFrameRecognizerTest.NullModuleRegex (1325 of 2403) PASS: lldb-unit :: Utility/Release/UtilityTests/Predicate.WaitForValueNotEqualTo (1326 of 2403) PASS: lldb-unit :: Expression/Release/ExpressionTests/CppModuleConfigurationTest.UnrelatedLibrary (1327 of 2403) PASS: lldb-unit :: Thread/Release/ThreadTests/ThreadTest.SetStopInfo (1328 of 2403) PASS: lldb-unit :: Target/Release/TargetTests/ModuleCacheTest.GetAndPutUuidExists (1329 of 2403) PASS: lldb-unit :: ObjectFile/MachO/Release/ObjectFileMachOTests/ObjectFileMachOTest.ModuleFromSharedCacheInfo (1330 of 2403) PASS: lldb-unit :: Symbol/Release/SymbolTests/TestTypeSystemClang.TestGetEnumIntegerTypeBasicTypes (1331 of 2403) PASS: lldb-unit :: Interpreter/Release/InterpreterTests/CompletionTest.FileCompletionAbsolute (1332 of 2403) PASS: lldb-unit :: Symbol/Release/SymbolTests/LineEntryTest.GetSameLineContiguousAddressRangeOneInline (1333 of 2403) PASS: lldb-unit :: Utility/Release/UtilityTests/TimerTest.CategoryTimes (1334 of 2403) PASS: lldb-unit :: Expression/Release/ExpressionTests/ClangExpressionDeclMapTest.TestPersistentDeclLookup (1335 of 2403) PASS: lldb-unit :: Target/Release/TargetTests/ExecutionContextTest.GetByteOrder (1336 of 2403) PASS: lldb-unit :: Interpreter/Release/InterpreterTests/CompletionTest.DirCompletionAbsolute (1337 of 2403) PASS: lldb-unit :: Core/Release/LLDBCoreTests/MangledTest.NameIndexes_FindFunctionSymbols (1338 of 2403) PASS: lldb-unit :: Process/gdb-remote/Release/ProcessGdbRemoteTests/GDBRemoteClientBaseTest.SendContinueDelegateStructuredDataReceipt (1339 of 2403) PASS: lldb-unit :: Language/Highlighting/Release/HighlighterTests/HighlighterTest.ClangPPDirectives (1340 of 2403) PASS: lldb-unit :: Symbol/Release/SymbolTests/DWARFCallFrameInfoTest.Basic_dwarf4 (1341 of 2403) PASS: lldb-unit :: Symbol/Release/SymbolTests/DWARFCallFrameInfoTest.Basic_eh (1342 of 2403) PASS: lldb-unit :: SymbolFile/DWARF/Release/SymbolFileDWARFTests/SymbolFileDWARFTests.TestAbilitiesForDWARF (1343 of 2403) PASS: lldb-unit :: Language/Highlighting/Release/HighlighterTests/HighlighterTest.ClangIdentifiers (1344 of 2403) PASS: lldb-unit :: SymbolFile/DWARF/Release/SymbolFileDWARFTests/DWARFUnitTest.MissingSentinel (1345 of 2403) PASS: lldb-unit :: Expression/Release/ExpressionTests/DiagnosticManagerTest.PutStringMultiple (1346 of 2403) PASS: lldb-unit :: Symbol/Release/SymbolTests/SymbolsTest.TerminateLocateExecutableSymbolFileForUnknownExecutableAndUnknownSymbolFile (1347 of 2403) PASS: lldb-unit :: Symbol/Release/SymbolTests/TestClangASTImporter.CopyDeclTagDecl (1348 of 2403) PASS: lldb-unit :: Symbol/Release/SymbolTests/SymbolsTest.LocateExecutableSymbolFileForUnknownExecutableAndMissingSymbolFile (1349 of 2403) PASS: lldb-unit :: Platform/Release/LLDBPlatformTests/PlatformDarwinTest.TestParseVersionBuildDir (1350 of 2403) PASS: lldb-unit :: UnwindAssembly/x86/Release/UnwindAssemblyx86Tests/Testx86AssemblyInspectionEngine.TestSimple32bitFrameFunction (1351 of 2403) PASS: lldb-unit :: Target/Release/TargetTests/PathMappingListTest.RemapRoot (1352 of 2403) PASS: lldb-unit :: Symbol/Release/SymbolTests/TestCreateClassTemplateDecl.FindExistingTemplatesWithParameterPack (1353 of 2403) PASS: lldb-unit :: Utility/Release/UtilityTests/OptionsWithRawTest.WhitespaceInput (1354 of 2403) PASS: lldb-unit :: Symbol/Release/SymbolTests/TestTypeSystemClang.TestGetEnumIntegerTypeUnexpectedType (1355 of 2403) PASS: lldb-unit :: Language/CLanguages/Release/LanguageCLanguagesTests/CLanguages.LookupCLanguagesByLanguageType (1356 of 2403) PASS: lldb-unit :: Symbol/Release/SymbolTests/TestTypeSystemClang.TestConvertAccessTypeToAccessSpecifier (1357 of 2403) PASS: lldb-unit :: Symbol/Release/SymbolTests/TestTypeSystemClang.TestGetEnumIntegerTypeInvalid (1358 of 2403) PASS: lldb-unit :: Expression/Release/ExpressionTests/ClangHostTest.ComputeClangResourceDirectory (1359 of 2403) PASS: lldb-unit :: UnwindAssembly/x86/Release/UnwindAssemblyx86Tests/Testx86AssemblyInspectionEngine.TestPopEDI (1360 of 2403) PASS: lldb-unit :: Expression/Release/ExpressionTests/CppModuleConfigurationTest.LinuxLocalLibCpp (1361 of 2403) PASS: lldb-unit :: Editline/Release/EditlineTests/EditlineTestFixture.EditlineReceivesSingleLineText (1362 of 2403) PASS: lldb-unit :: Expression/Release/ExpressionTests/CppModuleConfigurationTest.AmbiguousCLib (1363 of 2403) PASS: lldb-unit :: SymbolFile/DWARF/Release/SymbolFileDWARFTests/SymbolFileDWARFTests.ParseArangesNonzeroSegmentSize (1364 of 2403) PASS: lldb-unit :: Symbol/Release/SymbolTests/TestTypeSystemClang.TemplateArguments (1365 of 2403) PASS: lldb-unit :: Symbol/Release/SymbolTests/TestClangASTImporter.MetadataPropagationAfterCopying (1366 of 2403) PASS: lldb-unit :: Symbol/Release/SymbolTests/TestTypeSystemClang.TestDeletingImplicitCopyCstrDueToMoveCStr (1367 of 2403) PASS: lldb-unit :: Process/Utility/Release/ProcessUtilityTests/ProcSMapTests/LinuxProcSMapsTestFixture.ParseSMapRegions/5 (1368 of 2403) PASS: lldb-unit :: Process/gdb-remote/Release/ProcessGdbRemoteTests/GDBRemoteCommunicationClientTest.GetModulesInfo (1369 of 2403) PASS: lldb-unit :: Symbol/Release/SymbolTests/TestClangASTImporter.CompleteFwdDeclWithOtherOrigin (1370 of 2403) PASS: lldb-unit :: Symbol/Release/SymbolTests/TestTypeSystemClang.TestGetTypeClassNested (1371 of 2403) PASS: lldb-unit :: Symbol/Release/SymbolTests/TestClangASTImporter.DeportDeclTagDecl (1372 of 2403) PASS: lldb-unit :: Symbol/Release/SymbolTests/Type.CompilerContextPattern (1373 of 2403) PASS: lldb-unit :: Expression/Release/ExpressionTests/DWARFExpression.DW_OP_piece (1374 of 2403) PASS: lldb-unit :: Expression/Release/ExpressionTests/DWARFExpression.DW_OP_stack_value (1375 of 2403) PASS: lldb-unit :: Language/Highlighting/Release/HighlighterTests/HighlighterTest.ClangTrailingBackslashWithWhitespace (1376 of 2403) PASS: lldb-unit :: Language/Highlighting/Release/HighlighterTests/HighlighterTest.ClangTrailingBackslashMissingNewLine (1377 of 2403) PASS: lldb-unit :: Symbol/Release/SymbolTests/TestTypeSystemClang.TestOwningModule (1378 of 2403) PASS: lldb-unit :: Expression/Release/ExpressionTests/ClangHostTest.MacOSX (1379 of 2403) PASS: lldb-unit :: Symbol/Release/SymbolTests/TestClangASTImporter.ImportInvalidType (1380 of 2403) PASS: lldb-unit :: Expression/Release/ExpressionTests/ClangExpressionDeclMapTest.TestUnknownIdentifierLookup (1381 of 2403) PASS: lldb-unit :: Symbol/Release/SymbolTests/TestTypeSystemClang.TestRecordHasFields (1382 of 2403) FAIL: lldb-shell :: Register/x86-64-gp-read.test (1383 of 2403) ******************** TEST 'lldb-shell :: Register/x86-64-gp-read.test' FAILED ******************** Script: -- : 'RUN: at line 3'; /Users/buildslave/jenkins/workspace/lldb-cmake-standalone/clang-build/bin/clang --driver-mode=g++ --target=specify-a-target-or-use-a-_host-substitution --target=x86_64-apple-darwin19.5.0 -isysroot /Applications/Xcode.app/Contents/Developer/Platforms/MacOSX.platform/Developer/SDKs/MacOSX10.15.sdk -fmodules-cache-path=/Users/buildslave/jenkins/workspace/lldb-cmake-standalone/lldb-xcode-build/lldb-test-build.noindex/module-cache-clang/lldb-shell -fomit-frame-pointer /Users/buildslave/jenkins/workspace/lldb-cmake-standalone/llvm-project/lldb/test/Shell/Register/Inputs/x86-64-gp-read.cpp -o /Users/buildslave/jenkins/workspace/lldb-cmake-standalone/lldb-xcode-build/test/Shell/Register/Output/x86-64-gp-read.test.tmp : 'RUN: at line 4'; /Users/buildslave/jenkins/workspace/lldb-cmake-standalone/lldb-xcode-build/Release/bin/lldb --no-lldbinit -S /Users/buildslave/jenkins/workspace/lldb-cmake-standalone/lldb-xcode-build/test/Shell/lit-lldb-init -b -s /Users/buildslave/jenkins/workspace/lldb-cmake-standalone/llvm-project/lldb/test/Shell/Register/x86-64-gp-read.test /Users/buildslave/jenkins/workspace/lldb-cmake-standalone/lldb-xcode-build/test/Shell/Register/Output/x86-64-gp-read.test.tmp | /Users/buildslave/jenkins/workspace/lldb-cmake-standalone/clang-build/bin/FileCheck /Users/buildslave/jenkins/workspace/lldb-cmake-standalone/llvm-project/lldb/test/Shell/Register/x86-64-gp-read.test -- Exit Code: 1

Hide Details

Command Output (stderr): -- + : 'RUN: at line 3' + /Users/buildslave/jenkins/workspace/lldb-cmake-standalone/clang-build/bin/clang --driver-mode=g++ --target=specify-a-target-or-use-a-_host-substitution --target=x86_64-apple-darwin19.5.0 -isysroot /Applications/Xcode.app/Contents/Developer/Platforms/MacOSX.platform/Developer/SDKs/MacOSX10.15.sdk -fmodules-cache-path=/Users/buildslave/jenkins/workspace/lldb-cmake-standalone/lldb-xcode-build/lldb-test-build.noindex/module-cache-clang/lldb-shell -fomit-frame-pointer /Users/buildslave/jenkins/workspace/lldb-cmake-standalone/llvm-project/lldb/test/Shell/Register/Inputs/x86-64-gp-read.cpp -o /Users/buildslave/jenkins/workspace/lldb-cmake-standalone/lldb-xcode-build/test/Shell/Register/Output/x86-64-gp-read.test.tmp clang-14: warning: argument unused during compilation: '-fmodules-cache-path=/Users/buildslave/jenkins/workspace/lldb-cmake-standalone/lldb-xcode-build/lldb-test-build.noindex/module-cache-clang/lldb-shell' [-Wunused-command-line-argument] + : 'RUN: at line 4' + /Users/buildslave/jenkins/workspace/lldb-cmake-standalone/lldb-xcode-build/Release/bin/lldb --no-lldbinit -S /Users/buildslave/jenkins/workspace/lldb-cmake-standalone/lldb-xcode-build/test/Shell/lit-lldb-init -b -s /Users/buildslave/jenkins/workspace/lldb-cmake-standalone/llvm-project/lldb/test/Shell/Register/x86-64-gp-read.test /Users/buildslave/jenkins/workspace/lldb-cmake-standalone/lldb-xcode-build/test/Shell/Register/Output/x86-64-gp-read.test.tmp + /Users/buildslave/jenkins/workspace/lldb-cmake-standalone/clang-build/bin/FileCheck /Users/buildslave/jenkins/workspace/lldb-cmake-standalone/llvm-project/lldb/test/Shell/Register/x86-64-gp-read.test error: process exited with status -1 (tried to attach to process already being debugged) /Users/buildslave/jenkins/workspace/lldb-cmake-standalone/llvm-project/lldb/test/Shell/Register/x86-64-gp-read.test:8:14: error: CHECK-DAG: expected string not found in input # CHECK-DAG: rax = 0x0102030405060708 ^ <stdin>:1:1: note: scanning from here (lldb) command source -s 0 '/Users/buildslave/jenkins/workspace/lldb-cmake-standalone/lldb-xcode-build/test/Shell/lit-lldb-init' ^ <stdin>:1:19: note: possible intended match here (lldb) command source -s 0 '/Users/buildslave/jenkins/workspace/lldb-cmake-standalone/lldb-xcode-build/test/Shell/lit-lldb-init' ^

Hide Details

Input file: <stdin> Check file: /Users/buildslave/jenkins/workspace/lldb-cmake-standalone/llvm-project/lldb/test/Shell/Register/x86-64-gp-read.test

Hide Details

-dump-input=help explains the following input dump.

Hide Details

Input was: <<<<<< 1: (lldb) command source -s 0 '/Users/buildslave/jenkins/workspace/lldb-cmake-standalone/lldb-xcode-build/test/Shell/lit-lldb-init' dag:8'0 X~~~~~~~~~~~~~~~~~~~~~~~~~~~~~~~~~~~~~~~~~~~~~~~~~~~~~~~~~~~~~~~~~~~~~~~~~~~~~~~~~~~~~~~~~~~~~~~~~~~~~~~~~~~~~~~~~~~~~~~~~~~~~~~~ error: no match found dag:8'1 ? possible intended match 2: Executing commands in '/Users/buildslave/jenkins/workspace/lldb-cmake-standalone/lldb-xcode-build/test/Shell/lit-lldb-init'. dag:8'0 ~~~~~~~~~~~~~~~~~~~~~~~~~~~~~~~~~~~~~~~~~~~~~~~~~~~~~~~~~~~~~~~~~~~~~~~~~~~~~~~~~~~~~~~~~~~~~~~~~~~~~~~~~~~~~~~~~~~~~~~~~~~~~ 3: (lldb) # LLDB init file for the LIT tests. dag:8'0 ~~~~~~~~~~~~~~~~~~~~~~~~~~~~~~~~~~~~~~~~~~~ 4: (lldb) settings set symbols.enable-external-lookup false dag:8'0 ~~~~~~~~~~~~~~~~~~~~~~~~~~~~~~~~~~~~~~~~~~~~~~~~~~~~~~~~~ 5: (lldb) settings set plugin.process.gdb-remote.packet-timeout 60 dag:8'0 ~~~~~~~~~~~~~~~~~~~~~~~~~~~~~~~~~~~~~~~~~~~~~~~~~~~~~~~~~~~~~~~~ 6: (lldb) settings set interpreter.echo-comment-commands false dag:8'0 ~~~~~~~~~~~~~~~~~~~~~~~~~~~~~~~~~~~~~~~~~~~~~~~~~~~~~~~~~~~~ . . . >>>>>>

Hide Details

--

Hide Details

******************** PASS: lldb-unit :: Expression/Release/ExpressionTests/DiagnosticManagerTest.FixedExpression (1384 of 2403) PASS: lldb-unit :: SymbolFile/DWARF/Release/SymbolFileDWARFTests/SymbolFileDWARFTests.ParseAranges (1385 of 2403) PASS: lldb-unit :: SymbolFile/DWARF/Release/SymbolFileDWARFTests/DWARFDIETest.ChildIteration (1386 of 2403) PASS: lldb-unit :: SymbolFile/DWARF/Release/SymbolFileDWARFTests/SymbolFileDWARFTests.ParseArangesWithMultipleTerminators (1387 of 2403) PASS: lldb-unit :: Language/Highlighting/Release/HighlighterTests/HighlighterTest.HighlighterSelectionPath (1388 of 2403) PASS: lldb-unit :: Symbol/Release/SymbolTests/TestTypeSystemClang.TestNotDeletingUserCopyCstrDueToMoveCStr (1389 of 2403) PASS: lldb-unit :: Utility/Release/UtilityTests/GeneratorTest.YamlMultiProvider (1390 of 2403) PASS: lldb-unit :: Expression/Release/ExpressionTests/DiagnosticManagerTest.GetStringPreserveOrder (1391 of 2403) PASS: lldb-unit :: SymbolFile/DWARF/Release/SymbolFileDWARFTests/SymbolFileDWARFTests.TestAbbrevOrder1Start1 (1392 of 2403) PASS: lldb-unit :: SymbolFile/DWARF/Release/SymbolFileDWARFTests/DWARFUnitTest.NullUnitDie (1393 of 2403) PASS: lldb-unit :: ObjectFile/ELF/Release/ObjectFileELFTests/ObjectFileELFTest.GetSymtab_NoSymEntryPointArmAddressClass (1394 of 2403) PASS: lldb-unit :: Expression/Release/ExpressionTests/CppModuleConfigurationTest.UnknownLibCppFile (1395 of 2403) PASS: lldb-unit :: Expression/Release/ExpressionTests/DiagnosticManagerTest.PutString (1396 of 2403) PASS: lldb-unit :: Expression/Release/ExpressionTests/DiagnosticManagerTest.AppendMessageNoDiag (1397 of 2403) PASS: lldb-unit :: Process/gdb-remote/Release/ProcessGdbRemoteTests/GDBRemoteCommunicationClientTest.ReadMemoryTags (1398 of 2403) FAIL: lldb-shell :: Register/x86-64-read.test (1399 of 2403) ******************** TEST 'lldb-shell :: Register/x86-64-read.test' FAILED ******************** Script: -- : 'RUN: at line 4'; /Users/buildslave/jenkins/workspace/lldb-cmake-standalone/clang-build/bin/clang --driver-mode=g++ --target=specify-a-target-or-use-a-_host-substitution --target=x86_64-apple-darwin19.5.0 -isysroot /Applications/Xcode.app/Contents/Developer/Platforms/MacOSX.platform/Developer/SDKs/MacOSX10.15.sdk -fmodules-cache-path=/Users/buildslave/jenkins/workspace/lldb-cmake-standalone/lldb-xcode-build/lldb-test-build.noindex/module-cache-clang/lldb-shell /Users/buildslave/jenkins/workspace/lldb-cmake-standalone/llvm-project/lldb/test/Shell/Register/Inputs/x86-64-read.cpp -o /Users/buildslave/jenkins/workspace/lldb-cmake-standalone/lldb-xcode-build/test/Shell/Register/Output/x86-64-read.test.tmp : 'RUN: at line 5'; /Users/buildslave/jenkins/workspace/lldb-cmake-standalone/lldb-xcode-build/Release/bin/lldb --no-lldbinit -S /Users/buildslave/jenkins/workspace/lldb-cmake-standalone/lldb-xcode-build/test/Shell/lit-lldb-init -b -s /Users/buildslave/jenkins/workspace/lldb-cmake-standalone/llvm-project/lldb/test/Shell/Register/x86-64-read.test /Users/buildslave/jenkins/workspace/lldb-cmake-standalone/lldb-xcode-build/test/Shell/Register/Output/x86-64-read.test.tmp | /Users/buildslave/jenkins/workspace/lldb-cmake-standalone/clang-build/bin/FileCheck /Users/buildslave/jenkins/workspace/lldb-cmake-standalone/llvm-project/lldb/test/Shell/Register/x86-64-read.test -- Exit Code: 1

Hide Details

Command Output (stderr): -- + : 'RUN: at line 4' + /Users/buildslave/jenkins/workspace/lldb-cmake-standalone/clang-build/bin/clang --driver-mode=g++ --target=specify-a-target-or-use-a-_host-substitution --target=x86_64-apple-darwin19.5.0 -isysroot /Applications/Xcode.app/Contents/Developer/Platforms/MacOSX.platform/Developer/SDKs/MacOSX10.15.sdk -fmodules-cache-path=/Users/buildslave/jenkins/workspace/lldb-cmake-standalone/lldb-xcode-build/lldb-test-build.noindex/module-cache-clang/lldb-shell /Users/buildslave/jenkins/workspace/lldb-cmake-standalone/llvm-project/lldb/test/Shell/Register/Inputs/x86-64-read.cpp -o /Users/buildslave/jenkins/workspace/lldb-cmake-standalone/lldb-xcode-build/test/Shell/Register/Output/x86-64-read.test.tmp clang-14: warning: argument unused during compilation: '-fmodules-cache-path=/Users/buildslave/jenkins/workspace/lldb-cmake-standalone/lldb-xcode-build/lldb-test-build.noindex/module-cache-clang/lldb-shell' [-Wunused-command-line-argument] + : 'RUN: at line 5' + /Users/buildslave/jenkins/workspace/lldb-cmake-standalone/lldb-xcode-build/Release/bin/lldb --no-lldbinit -S /Users/buildslave/jenkins/workspace/lldb-cmake-standalone/lldb-xcode-build/test/Shell/lit-lldb-init -b -s /Users/buildslave/jenkins/workspace/lldb-cmake-standalone/llvm-project/lldb/test/Shell/Register/x86-64-read.test /Users/buildslave/jenkins/workspace/lldb-cmake-standalone/lldb-xcode-build/test/Shell/Register/Output/x86-64-read.test.tmp + /Users/buildslave/jenkins/workspace/lldb-cmake-standalone/clang-build/bin/FileCheck /Users/buildslave/jenkins/workspace/lldb-cmake-standalone/llvm-project/lldb/test/Shell/Register/x86-64-read.test error: process exited with status -1 (tried to attach to process already being debugged) /Users/buildslave/jenkins/workspace/lldb-cmake-standalone/llvm-project/lldb/test/Shell/Register/x86-64-read.test:9:14: error: CHECK-DAG: expected string not found in input # CHECK-DAG: r8 = 0x0001020304050607 ^ <stdin>:1:1: note: scanning from here (lldb) command source -s 0 '/Users/buildslave/jenkins/workspace/lldb-cmake-standalone/lldb-xcode-build/test/Shell/lit-lldb-init' ^ <stdin>:5:57: note: possible intended match here (lldb) settings set plugin.process.gdb-remote.packet-timeout 60 ^

Hide Details

Input file: <stdin> Check file: /Users/buildslave/jenkins/workspace/lldb-cmake-standalone/llvm-project/lldb/test/Shell/Register/x86-64-read.test

Hide Details

-dump-input=help explains the following input dump.

Hide Details

Input was: <<<<<< 1: (lldb) command source -s 0 '/Users/buildslave/jenkins/workspace/lldb-cmake-standalone/lldb-xcode-build/test/Shell/lit-lldb-init' dag:9'0 X~~~~~~~~~~~~~~~~~~~~~~~~~~~~~~~~~~~~~~~~~~~~~~~~~~~~~~~~~~~~~~~~~~~~~~~~~~~~~~~~~~~~~~~~~~~~~~~~~~~~~~~~~~~~~~~~~~~~~~~~~~~~~~~~ error: no match found 2: Executing commands in '/Users/buildslave/jenkins/workspace/lldb-cmake-standalone/lldb-xcode-build/test/Shell/lit-lldb-init'. dag:9'0 ~~~~~~~~~~~~~~~~~~~~~~~~~~~~~~~~~~~~~~~~~~~~~~~~~~~~~~~~~~~~~~~~~~~~~~~~~~~~~~~~~~~~~~~~~~~~~~~~~~~~~~~~~~~~~~~~~~~~~~~~~~~~~ 3: (lldb) # LLDB init file for the LIT tests. dag:9'0 ~~~~~~~~~~~~~~~~~~~~~~~~~~~~~~~~~~~~~~~~~~~ 4: (lldb) settings set symbols.enable-external-lookup false dag:9'0 ~~~~~~~~~~~~~~~~~~~~~~~~~~~~~~~~~~~~~~~~~~~~~~~~~~~~~~~~~ 5: (lldb) settings set plugin.process.gdb-remote.packet-timeout 60 dag:9'0 ~~~~~~~~~~~~~~~~~~~~~~~~~~~~~~~~~~~~~~~~~~~~~~~~~~~~~~~~~~~~~~~~ dag:9'1 ? possible intended match 6: (lldb) settings set interpreter.echo-comment-commands false dag:9'0 ~~~~~~~~~~~~~~~~~~~~~~~~~~~~~~~~~~~~~~~~~~~~~~~~~~~~~~~~~~~~ 7: (lldb) settings set symbols.clang-modules-cache-path "/Users/buildslave/jenkins/workspace/lldb-cmake-standalone/lldb-xcode-build/lldb-test-build.noindex/module-cache-lldb" dag:9'0 ~~~~~~~~~~~~~~~~~~~~~~~~~~~~~~~~~~~~~~~~~~~~~~~~~~~~~~~~~~~~~~~~~~~~~~~~~~~~~~~~~~~~~~~~~~~~~~~~~~~~~~~~~~~~~~~~~~~~~~~~~~~~~~~~~~~~~~~~~~~~~~~~~~~~~~~~~~~~~~~~~~~~~~~~~~~~ 8: (lldb) settings set target.auto-apply-fixits false dag:9'0 ~~~~~~~~~~~~~~~~~~~~~~~~~~~~~~~~~~~~~~~~~~~~~~~~~~~ 9: (lldb) settings set target.inherit-tcc true dag:9'0 ~~~~~~~~~~~~~~~~~~~~~~~~~~~~~~~~~~~~~~~~~~~~ 10: (lldb) settings set target.detach-on-error false dag:9'0 ~~~~~~~~~~~~~~~~~~~~~~~~~~~~~~~~~~~~~~~~~~~~~~~~~ . . . >>>>>>

Hide Details

--

Hide Details

******************** PASS: lldb-unit :: Symbol/Release/SymbolTests/TestClangASTImporter.CopyTypeTagDecl (1400 of 2403) PASS: lldb-unit :: Expression/Release/ExpressionTests/DiagnosticManagerTest.GetStringMultiline (1401 of 2403) PASS: lldb-unit :: Language/Highlighting/Release/HighlighterTests/HighlighterTest.ClangCursorPosInOtherToken (1402 of 2403) PASS: lldb-unit :: Symbol/Release/SymbolTests/TestClangASTImporter.MetadataPropagationIndirectImport (1403 of 2403) PASS: lldb-unit :: Expression/Release/ExpressionTests/DWARFExpression.DW_OP_pick (1404 of 2403) PASS: lldb-unit :: SymbolFile/DWARF/Release/SymbolFileDWARFTests/SymbolFileDWARFTests.TestAbbrevNullAttrValidForm (1405 of 2403) PASS: lldb-unit :: Expression/Release/ExpressionTests/DiagnosticManagerTest.GetStringSeverityLabels (1406 of 2403) PASS: lldb-unit :: Language/Highlighting/Release/HighlighterTests/HighlighterTest.ClangScalarLiterals (1407 of 2403) PASS: lldb-unit :: Language/Highlighting/Release/HighlighterTests/HighlighterTest.ClangComments (1408 of 2403) PASS: lldb-unit :: Expression/Release/ExpressionTests/CppModuleConfigurationTest.Sysroot (1409 of 2403) PASS: lldb-unit :: Symbol/Release/SymbolTests/Type.GetTypeScopeAndBasename (1410 of 2403) PASS: lldb-unit :: Language/Highlighting/Release/HighlighterTests/HighlighterTest.ClangEmptyInput (1411 of 2403) PASS: lldb-unit :: SymbolFile/DWARF/Release/SymbolFileDWARFTests/SymbolFileDWARFTests.TestAbbrevOutOfOrder (1412 of 2403) PASS: lldb-unit :: Target/Release/TargetTests/RemoteAwarePlatformTest.TestResolveExecutabelOnClientByPlatform (1413 of 2403) PASS: lldb-unit :: Symbol/Release/SymbolTests/TestScratchTypeSystemClang.InferSubASTFromLangOpts (1414 of 2403) PASS: lldb-unit :: Interpreter/Release/InterpreterTests/CompletionTest.DirCompletionUsername (1415 of 2403) PASS: lldb-unit :: Process/gdb-remote/Release/ProcessGdbRemoteTests/GDBRemoteCommunicationClientTest.WriteRegisterNoSuffix (1416 of 2403) PASS: lldb-unit :: Expression/Release/ExpressionTests/DiagnosticManagerTest.AppendMessageSubsequentDiags (1417 of 2403) PASS: lldb-unit :: Language/Highlighting/Release/HighlighterTests/HighlighterTest.ClangPreserveNewLine (1418 of 2403) PASS: lldb-unit :: SymbolFile/DWARF/Release/SymbolFileDWARFTests/SymbolFileDWARFTests.TestAbbrevMissingTerminator (1419 of 2403) PASS: lldb-unit :: Symbol/Release/SymbolTests/TestTypeSystemClang.TestGetTypeClassDeclType (1420 of 2403) PASS: lldb-unit :: Language/Highlighting/Release/HighlighterTests/HighlighterTest.FallbackHighlighter (1421 of 2403) PASS: lldb-unit :: Expression/Release/ExpressionTests/DiagnosticManagerTest.HasFixits (1422 of 2403) PASS: lldb-unit :: SymbolFile/DWARF/Release/SymbolFileDWARFTests/SymbolFileDWARFTests.TestAbbrevOrder1Start5 (1423 of 2403) PASS: lldb-unit :: Symbol/Release/SymbolTests/TestClangASTImporter.CanImportInvalidType (1424 of 2403) PASS: lldb-unit :: Symbol/Release/SymbolTests/TestClangASTImporter.DeportTypeTagDecl (1425 of 2403) PASS: lldb-unit :: ObjectFile/PECOFF/Release/ObjectFilePECOFFTests/PECallFrameInfoTest.Basic_eh (1426 of 2403) PASS: lldb-unit :: Language/Highlighting/Release/HighlighterTests/HighlighterTest.ClangTrailingBackslashBeforeNewline (1427 of 2403) PASS: lldb-unit :: SymbolFile/DWARF/Release/SymbolFileDWARFTests/SymbolFileDWARFTests.ParseArangesSkipErrors (1428 of 2403) PASS: lldb-unit :: Target/Release/TargetTests/MCBasedABI.MapRegisterName (1429 of 2403) PASS: lldb-unit :: Symbol/Release/SymbolTests/TestTypeSystemClang.TestIsClangType (1430 of 2403) PASS: lldb-unit :: Language/Highlighting/Release/HighlighterTests/HighlighterTest.DefaultHighlighterWithCursor (1431 of 2403) PASS: lldb-unit :: Language/Highlighting/Release/HighlighterTests/HighlighterTest.ClangOperators (1432 of 2403) PASS: lldb-unit :: UnwindAssembly/x86/Release/UnwindAssemblyx86Tests/Testx86AssemblyInspectionEngine.TestSimple64bitFrameFunction (1433 of 2403) PASS: lldb-unit :: Target/Release/TargetTests/PathMappingListTest.CrossPlatformTests (1434 of 2403) PASS: lldb-unit :: Symbol/Release/SymbolTests/TestTypeSystemClang.TestGetBasicTypeFromEnum (1435 of 2403) PASS: lldb-unit :: Utility/Release/UtilityTests/UUIDTest.Validity (1436 of 2403) PASS: lldb-unit :: SymbolFile/DWARF/Release/SymbolFileDWARFTests/SymbolFileDWARFTests.TestAbbrevValidAttrNullForm (1437 of 2403) PASS: lldb-unit :: Symbol/Release/SymbolTests/PostfixExpression.ToDWARF (1438 of 2403) PASS: lldb-unit :: Symbol/Release/SymbolTests/TestCreateClassTemplateDecl.FindExistingTemplates (1439 of 2403) PASS: lldb-unit :: Symbol/Release/SymbolTests/TestTypeSystemClang.OnlyPackName (1440 of 2403) PASS: lldb-unit :: SymbolFile/DWARF/Release/SymbolFileDWARFTests/SymbolFileDWARFTests.TestAbbrevInvalidNULLTag (1441 of 2403) PASS: lldb-unit :: UnwindAssembly/x86/Release/UnwindAssemblyx86Tests/Testx86AssemblyInspectionEngine.TestPopEBX (1442 of 2403) PASS: lldb-unit :: Expression/Release/ExpressionTests/CppModuleConfigurationTest.MissingLibCpp (1443 of 2403) PASS: lldb-unit :: Symbol/Release/SymbolTests/TestTypeSystemClang.TestDisplayNameEmpty (1444 of 2403) PASS: lldb-unit :: Symbol/Release/SymbolTests/TestClangASTImporter.RecordLayout (1445 of 2403) PASS: lldb-unit :: Language/Highlighting/Release/HighlighterTests/HighlighterTest.ClangCommas (1446 of 2403) PASS: lldb-unit :: Symbol/Release/SymbolTests/TestTypeSystemClang.TestFunctionTemplateInRecordConstruction (1447 of 2403) PASS: lldb-unit :: Symbol/Release/SymbolTests/TestTypeSystemClang.TestFunctionTemplateConstruction (1448 of 2403) PASS: lldb-unit :: Symbol/Release/SymbolTests/TestTypeSystemClang.TestRemoveFastQualifiers (1449 of 2403) PASS: lldb-unit :: Symbol/Release/SymbolTests/TestTypeSystemClang.TestGetBasicTypeFromName (1450 of 2403) PASS: lldb-unit :: Language/Highlighting/Release/HighlighterTests/HighlighterTest.ClangCursorPosAfterOtherToken (1451 of 2403) PASS: lldb-unit :: Utility/Release/UtilityTests/LogChannelEnabledTest.LLDB_LOG_ERROR (1452 of 2403) PASS: lldb-unit :: Language/Highlighting/Release/HighlighterTests/HighlighterTest.DefaultHighlighter (1453 of 2403) PASS: lldb-unit :: Editline/Release/EditlineTests/EditlineTestFixture.EditlineReceivesMultiLineText (1454 of 2403) PASS: lldb-unit :: Symbol/Release/SymbolTests/TestTypeSystemClang.TestGetTypeClassTypeOfExpr (1455 of 2403) PASS: lldb-unit :: Expression/Release/ExpressionTests/DWARFExpression.DW_OP_implicit_value (1456 of 2403) PASS: lldb-unit :: Language/Highlighting/Release/HighlighterTests/HighlighterTest.ClangStringLiterals (1457 of 2403) PASS: lldb-unit :: Language/Highlighting/Release/HighlighterTests/HighlighterTest.ClangUnterminatedString (1458 of 2403) PASS: lldb-unit :: Symbol/Release/SymbolTests/TestTypeSystemMap.GetTypeSystemForLanguageWithNoTarget (1459 of 2403) PASS: lldb-unit :: Symbol/Release/SymbolTests/TestClangASTImporter.MetadataPropagation (1460 of 2403) PASS: lldb-unit :: Target/Release/TargetTests/PathMappingListTest.AbsoluteTests (1461 of 2403) PASS: lldb-unit :: Language/Highlighting/Release/HighlighterTests/HighlighterTest.ClangCursorOutOfBounds (1462 of 2403) PASS: lldb-unit :: UnwindAssembly/x86/Release/UnwindAssemblyx86Tests/Testx86AssemblyInspectionEngine.TestPopESI (1463 of 2403) PASS: lldb-unit :: Symbol/Release/SymbolTests/TestTypeSystemClang.AddMethodToObjCObjectType (1464 of 2403) PASS: lldb-unit :: Symbol/Release/SymbolTests/TestTypeSystemClang.TestBuiltinTypeForEncodingAndBitSize (1465 of 2403) PASS: lldb-unit :: UnwindAssembly/x86/Release/UnwindAssemblyx86Tests/Testx86AssemblyInspectionEngine.TestPushEDX (1466 of 2403) PASS: lldb-unit :: Symbol/Release/SymbolTests/TestTypeSystemClang.TestDisplayName (1467 of 2403) PASS: lldb-unit :: UnwindAssembly/x86/Release/UnwindAssemblyx86Tests/Testx86AssemblyInspectionEngine.TestPushEDI (1468 of 2403) PASS: lldb-unit :: Language/Highlighting/Release/HighlighterTests/HighlighterTest.ClangSquareBrackets (1469 of 2403) PASS: lldb-unit :: Symbol/Release/SymbolTests/TestTypeSystemClang.TestUnifyAccessSpecifiers (1470 of 2403) PASS: lldb-unit :: Process/gdb-remote/Release/ProcessGdbRemoteTests/GDBRemoteCommunicationClientTest.GetQOffsets (1471 of 2403) PASS: lldb-unit :: Expression/Release/ExpressionTests/DiagnosticManagerTest.GetStringMultipleDiags (1472 of 2403) PASS: lldb-unit :: Target/Release/TargetTests/MemoryRegionInfoTest.Formatv (1473 of 2403) PASS: lldb-unit :: UnwindAssembly/x86/Release/UnwindAssemblyx86Tests/Testx86AssemblyInspectionEngine.TestDisassemblyMidFunctionEpilogues (1474 of 2403) PASS: lldb-unit :: Symbol/Release/SymbolTests/TestTypeSystemMap.GetTypeSystemForLanguageWithInvalidModule (1475 of 2403) PASS: lldb-unit :: Expression/Release/ExpressionTests/DiagnosticManagerTest.PutStringSeverities (1476 of 2403) PASS: lldb-unit :: Symbol/Release/SymbolTests/PostfixExpression.ParseOneExpression (1477 of 2403) PASS: lldb-unit :: ObjectFile/ELF/Release/ObjectFileELFTests/ObjectFileELFTest.SectionsResolveConsistently (1478 of 2403) PASS: lldb-unit :: Expression/Release/ExpressionTests/CppModuleConfigurationTest.MissingUsrInclude (1479 of 2403) PASS: lldb-unit :: UnwindAssembly/x86/Release/UnwindAssemblyx86Tests/Testx86AssemblyInspectionEngine.TestPushESI (1480 of 2403) PASS: lldb-unit :: UnwindAssembly/x86/Release/UnwindAssemblyx86Tests/Testx86AssemblyInspectionEngine.TestStackRealign8BitDisp_i386 (1481 of 2403) PASS: lldb-unit :: UnwindAssembly/x86/Release/UnwindAssemblyx86Tests/Testx86AssemblyInspectionEngine.TestPushEAX (1482 of 2403) PASS: lldb-unit :: Process/gdb-remote/Release/ProcessGdbRemoteTests/GDBRemoteCommunicationClientTest.SendTraceSupportedPacket (1483 of 2403) PASS: lldb-unit :: Language/Highlighting/Release/HighlighterTests/HighlighterTest.HighlighterSelectionType (1484 of 2403) PASS: lldb-unit :: Symbol/Release/SymbolTests/TestTypeSystemClang.TestGetTypeClassTypeOf (1485 of 2403) PASS: lldb-unit :: Utility/Release/UtilityTests/StreamTest.PutCharWhitespace (1486 of 2403) PASS: lldb-unit :: UnwindAssembly/x86/Release/UnwindAssemblyx86Tests/Testx86AssemblyInspectionEngine.TestMovRSPtoRBP (1487 of 2403) PASS: lldb-unit :: Language/Highlighting/Release/HighlighterTests/HighlighterTest.Colons (1488 of 2403) PASS: lldb-unit :: Expression/Release/ExpressionTests/DiagnosticManagerTest.GetStringNoDiags (1489 of 2403) PASS: lldb-unit :: Symbol/Release/SymbolTests/TestTypeSystemClang.GetExeModuleWhenMissingSymbolFile (1490 of 2403) PASS: lldb-unit :: Language/Highlighting/Release/HighlighterTests/HighlighterTest.Keywords (1491 of 2403) PASS: lldb-unit :: Language/Highlighting/Release/HighlighterTests/HighlighterTest.ClangCursorPosBeforeOtherToken (1492 of 2403) PASS: lldb-unit :: Expression/Release/ExpressionTests/DiagnosticManagerTest.AppendMessageAttachToLastDiag (1493 of 2403) PASS: lldb-unit :: Utility/Release/UtilityTests/StringListTest.SplitIntoLinesEmpty (1494 of 2403) PASS: lldb-unit :: UnwindAssembly/x86/Release/UnwindAssemblyx86Tests/Testx86AssemblyInspectionEngine.TestPushR15 (1495 of 2403) PASS: lldb-unit :: SymbolFile/DWARF/Release/SymbolFileDWARFTests/SymbolFileDWARFTests.ParseArangesIgnoreEmpty (1496 of 2403) PASS: lldb-unit :: Language/Highlighting/Release/HighlighterTests/HighlighterTest.ClangCursorPos (1497 of 2403) PASS: lldb-unit :: Process/gdb-remote/Release/ProcessGdbRemoteTests/GDBRemoteCommunicationClientTest.GetModulesInfoInvalidResponse (1498 of 2403) PASS: lldb-unit :: Expression/Release/ExpressionTests/DWARFExpression.DW_OP_const (1499 of 2403) PASS: lldb-unit :: Target/Release/TargetTests/PathMappingListTest.RelativeTests (1500 of 2403) PASS: lldb-unit :: UnwindAssembly/x86/Release/UnwindAssemblyx86Tests/Testx86AssemblyInspectionEngine.TestPopR15 (1501 of 2403) PASS: lldb-unit :: UnwindAssembly/x86/Release/UnwindAssemblyx86Tests/Testx86AssemblyInspectionEngine.Test64bitFramelessBigStackFrame (1502 of 2403) PASS: lldb-unit :: Expression/Release/ExpressionTests/DiagnosticManagerTest.GetStringBasic (1503 of 2403) PASS: lldb-unit :: UnwindAssembly/x86/Release/UnwindAssemblyx86Tests/Testx86AssemblyInspectionEngine.TestPopR13 (1504 of 2403) PASS: lldb-unit :: UnwindAssembly/x86/Release/UnwindAssemblyx86Tests/Testx86AssemblyInspectionEngine.TestCALLNextInsn (1505 of 2403) PASS: lldb-unit :: UnwindAssembly/x86/Release/UnwindAssemblyx86Tests/Testx86AssemblyInspectionEngine.Test32bitFramelessSmallStackFrame (1506 of 2403) PASS: lldb-unit :: UnwindAssembly/x86/Release/UnwindAssemblyx86Tests/Testx86AssemblyInspectionEngine.TestSpillRegToStackViaMOVi386 (1507 of 2403) PASS: lldb-unit :: UnwindAssembly/x86/Release/UnwindAssemblyx86Tests/Testx86AssemblyInspectionEngine.TestAddRSP (1508 of 2403) FAIL: lldb-shell :: Register/x86-64-ymm-read.test (1509 of 2403) ******************** TEST 'lldb-shell :: Register/x86-64-ymm-read.test' FAILED ******************** Script: -- : 'RUN: at line 4'; /Users/buildslave/jenkins/workspace/lldb-cmake-standalone/clang-build/bin/clang --driver-mode=g++ --target=specify-a-target-or-use-a-_host-substitution --target=x86_64-apple-darwin19.5.0 -isysroot /Applications/Xcode.app/Contents/Developer/Platforms/MacOSX.platform/Developer/SDKs/MacOSX10.15.sdk -fmodules-cache-path=/Users/buildslave/jenkins/workspace/lldb-cmake-standalone/lldb-xcode-build/lldb-test-build.noindex/module-cache-clang/lldb-shell /Users/buildslave/jenkins/workspace/lldb-cmake-standalone/llvm-project/lldb/test/Shell/Register/Inputs/x86-ymm-read.cpp -o /Users/buildslave/jenkins/workspace/lldb-cmake-standalone/lldb-xcode-build/test/Shell/Register/Output/x86-64-ymm-read.test.tmp : 'RUN: at line 5'; /Users/buildslave/jenkins/workspace/lldb-cmake-standalone/lldb-xcode-build/Release/bin/lldb --no-lldbinit -S /Users/buildslave/jenkins/workspace/lldb-cmake-standalone/lldb-xcode-build/test/Shell/lit-lldb-init -b -s /Users/buildslave/jenkins/workspace/lldb-cmake-standalone/llvm-project/lldb/test/Shell/Register/x86-64-ymm-read.test /Users/buildslave/jenkins/workspace/lldb-cmake-standalone/lldb-xcode-build/test/Shell/Register/Output/x86-64-ymm-read.test.tmp | /Users/buildslave/jenkins/workspace/lldb-cmake-standalone/clang-build/bin/FileCheck /Users/buildslave/jenkins/workspace/lldb-cmake-standalone/llvm-project/lldb/test/Shell/Register/x86-64-ymm-read.test -- Exit Code: 1

Hide Details

Command Output (stderr): -- + : 'RUN: at line 4' + /Users/buildslave/jenkins/workspace/lldb-cmake-standalone/clang-build/bin/clang --driver-mode=g++ --target=specify-a-target-or-use-a-_host-substitution --target=x86_64-apple-darwin19.5.0 -isysroot /Applications/Xcode.app/Contents/Developer/Platforms/MacOSX.platform/Developer/SDKs/MacOSX10.15.sdk -fmodules-cache-path=/Users/buildslave/jenkins/workspace/lldb-cmake-standalone/lldb-xcode-build/lldb-test-build.noindex/module-cache-clang/lldb-shell /Users/buildslave/jenkins/workspace/lldb-cmake-standalone/llvm-project/lldb/test/Shell/Register/Inputs/x86-ymm-read.cpp -o /Users/buildslave/jenkins/workspace/lldb-cmake-standalone/lldb-xcode-build/test/Shell/Register/Output/x86-64-ymm-read.test.tmp clang-14: warning: argument unused during compilation: '-fmodules-cache-path=/Users/buildslave/jenkins/workspace/lldb-cmake-standalone/lldb-xcode-build/lldb-test-build.noindex/module-cache-clang/lldb-shell' [-Wunused-command-line-argument] + : 'RUN: at line 5' + /Users/buildslave/jenkins/workspace/lldb-cmake-standalone/lldb-xcode-build/Release/bin/lldb --no-lldbinit -S /Users/buildslave/jenkins/workspace/lldb-cmake-standalone/lldb-xcode-build/test/Shell/lit-lldb-init -b -s /Users/buildslave/jenkins/workspace/lldb-cmake-standalone/llvm-project/lldb/test/Shell/Register/x86-64-ymm-read.test /Users/buildslave/jenkins/workspace/lldb-cmake-standalone/lldb-xcode-build/test/Shell/Register/Output/x86-64-ymm-read.test.tmp + /Users/buildslave/jenkins/workspace/lldb-cmake-standalone/clang-build/bin/FileCheck /Users/buildslave/jenkins/workspace/lldb-cmake-standalone/llvm-project/lldb/test/Shell/Register/x86-64-ymm-read.test error: process exited with status -1 (tried to attach to process already being debugged) /Users/buildslave/jenkins/workspace/lldb-cmake-standalone/llvm-project/lldb/test/Shell/Register/x86-64-ymm-read.test:9:14: error: CHECK-DAG: expected string not found in input # CHECK-DAG: xmm0 = {0x00 0x01 0x02 0x03 0x04 0x05 0x06 0x07 0x08 0x09 0x0a 0x0b 0x0c 0x0d 0x0e 0x0f} ^ <stdin>:1:1: note: scanning from here (lldb) command source -s 0 '/Users/buildslave/jenkins/workspace/lldb-cmake-standalone/lldb-xcode-build/test/Shell/lit-lldb-init' ^

Hide Details

Input file: <stdin> Check file: /Users/buildslave/jenkins/workspace/lldb-cmake-standalone/llvm-project/lldb/test/Shell/Register/x86-64-ymm-read.test

Hide Details

-dump-input=help explains the following input dump.

Hide Details

Input was: <<<<<< 1: (lldb) command source -s 0 '/Users/buildslave/jenkins/workspace/lldb-cmake-standalone/lldb-xcode-build/test/Shell/lit-lldb-init' dag:9 X~~~~~~~~~~~~~~~~~~~~~~~~~~~~~~~~~~~~~~~~~~~~~~~~~~~~~~~~~~~~~~~~~~~~~~~~~~~~~~~~~~~~~~~~~~~~~~~~~~~~~~~~~~~~~~~~~~~~~~~~~~~~~~~~ error: no match found 2: Executing commands in '/Users/buildslave/jenkins/workspace/lldb-cmake-standalone/lldb-xcode-build/test/Shell/lit-lldb-init'. dag:9 ~~~~~~~~~~~~~~~~~~~~~~~~~~~~~~~~~~~~~~~~~~~~~~~~~~~~~~~~~~~~~~~~~~~~~~~~~~~~~~~~~~~~~~~~~~~~~~~~~~~~~~~~~~~~~~~~~~~~~~~~~~~~~ 3: (lldb) # LLDB init file for the LIT tests. dag:9 ~~~~~~~~~~~~~~~~~~~~~~~~~~~~~~~~~~~~~~~~~~~ 4: (lldb) settings set symbols.enable-external-lookup false dag:9 ~~~~~~~~~~~~~~~~~~~~~~~~~~~~~~~~~~~~~~~~~~~~~~~~~~~~~~~~~ 5: (lldb) settings set plugin.process.gdb-remote.packet-timeout 60 dag:9 ~~~~~~~~~~~~~~~~~~~~~~~~~~~~~~~~~~~~~~~~~~~~~~~~~~~~~~~~~~~~~~~~ 6: (lldb) settings set interpreter.echo-comment-commands false dag:9 ~~~~~~~~~~~~~~~~~~~~~~~~~~~~~~~~~~~~~~~~~~~~~~~~~~~~~~~~~~~~ . . . >>>>>>

Hide Details

--

Hide Details

******************** PASS: lldb-unit :: UnwindAssembly/x86/Release/UnwindAssemblyx86Tests/Testx86AssemblyInspectionEngine.TestPopRBPWithREX (1510 of 2403) PASS: lldb-unit :: UnwindAssembly/x86/Release/UnwindAssemblyx86Tests/Testx86AssemblyInspectionEngine.Test32BitOnlyInstruction (1511 of 2403) PASS: lldb-unit :: UnwindAssembly/x86/Release/UnwindAssemblyx86Tests/Testx86AssemblyInspectionEngine.TestDisassemblyJunkBytes (1512 of 2403) PASS: lldb-unit :: ObjectFile/PECOFF/Release/ObjectFilePECOFFTests/PECallFrameInfoTest.Chained_eh (1513 of 2403) PASS: lldb-unit :: Process/gdb-remote/Release/ProcessGdbRemoteTests/GDBRemoteCommunicationClientTest.GetMemoryRegionInfo (1514 of 2403) PASS: lldb-unit :: Symbol/Release/SymbolTests/TestTypeSystemMap.GetTypeSystemForLanguageWithNoModule (1515 of 2403) PASS: lldb-unit :: Platform/Release/LLDBPlatformTests/PlatformDarwinTest.FindComponentInPath (1516 of 2403) PASS: lldb-unit :: Language/Highlighting/Release/HighlighterTests/HighlighterTest.ClangCursorPosEndOfLine (1517 of 2403) PASS: lldb-unit :: Language/Highlighting/Release/HighlighterTests/HighlighterTest.ClangBraces (1518 of 2403) PASS: lldb-unit :: UnwindAssembly/x86/Release/UnwindAssemblyx86Tests/Testx86AssemblyInspectionEngine.TestPopRBP (1519 of 2403) PASS: lldb-unit :: UnwindAssembly/x86/Release/UnwindAssemblyx86Tests/Testx86AssemblyInspectionEngine.TestReturnDetect (1520 of 2403) PASS: lldb-unit :: UnwindAssembly/x86/Release/UnwindAssemblyx86Tests/Testx86AssemblyInspectionEngine.TestPopR14 (1521 of 2403) PASS: lldb-unit :: Utility/Release/UtilityTests/ListenerTest.GetEventImmediate (1522 of 2403) PASS: lldb-unit :: Core/Release/LLDBCoreTests/ModuleSpecTest.TestCOFFFile (1523 of 2403) PASS: lldb-unit :: Symbol/Release/SymbolTests/PostfixExpression.ParseFPOProgram (1524 of 2403) PASS: lldb-unit :: Expression/Release/ExpressionTests/CppModuleConfigurationTest.AmbiguousLibCpp (1525 of 2403) PASS: lldb-unit :: Utility/Release/UtilityTests/OptionsWithRawTest.EmptySuffix (1526 of 2403) PASS: lldb-unit :: Process/gdb-remote/Release/ProcessGdbRemoteTests/GDBRemoteCommunicationClientTest.SendSignalsToIgnore (1527 of 2403) PASS: lldb-unit :: Process/gdb-remote/Release/ProcessGdbRemoteTests/GDBRemoteCommunicationTest.ReadPacket_checksum (1528 of 2403) PASS: lldb-unit :: Process/gdb-remote/Release/ProcessGdbRemoteTests/GDBRemoteClientBaseTest.SendContinueAndWait (1529 of 2403) PASS: lldb-unit :: Language/Highlighting/Release/HighlighterTests/HighlighterTest.DefaultHighlighterWithCursorOutOfBounds (1530 of 2403) PASS: lldb-unit :: Expression/Release/ExpressionTests/DWARFExpression.DW_OP_unknown (1531 of 2403) PASS: lldb-unit :: Core/Release/LLDBCoreTests/ModuleSpecTest.TestMachOFile (1532 of 2403) PASS: lldb-unit :: UnwindAssembly/x86/Release/UnwindAssemblyx86Tests/Testx86AssemblyInspectionEngine.TestPushEBX (1533 of 2403) PASS: lldb-unit :: ObjectFile/ELF/Release/ObjectFileELFTests/ObjectFileELFTest.GetSymtab_NoSymEntryPointArmThumbAddressClass (1534 of 2403) PASS: lldb-unit :: Expression/Release/ExpressionTests/DiagnosticManagerTest.AddDiagnostic (1535 of 2403) PASS: lldb-unit :: UnwindAssembly/x86/Release/UnwindAssemblyx86Tests/Testx86AssemblyInspectionEngine.TestSubESP (1536 of 2403) PASS: lldb-unit :: Process/gdb-remote/Release/ProcessGdbRemoteTests/GDBRemoteCommunicationClientTest.WriteRegister (1537 of 2403) PASS: lldb-unit :: UnwindAssembly/x86/Release/UnwindAssemblyx86Tests/Testx86AssemblyInspectionEngine.TestPushR12 (1538 of 2403) PASS: lldb-unit :: Core/Release/LLDBCoreTests/CommunicationTest.SynchronizeWhileClosing (1539 of 2403) PASS: lldb-unit :: UnwindAssembly/x86/Release/UnwindAssemblyx86Tests/Testx86AssemblyInspectionEngine.TestPushRBPWithREX (1540 of 2403) PASS: lldb-unit :: UnwindAssembly/x86/Release/UnwindAssemblyx86Tests/Testx86AssemblyInspectionEngine.TestAddESP (1541 of 2403) PASS: lldb-unit :: UnwindAssembly/x86/Release/UnwindAssemblyx86Tests/Testx86AssemblyInspectionEngine.TestPushExtended (1542 of 2403) PASS: lldb-unit :: UnwindAssembly/x86/Release/UnwindAssemblyx86Tests/Testx86AssemblyInspectionEngine.TestSimplei386ugmented (1543 of 2403) PASS: lldb-unit :: UnwindAssembly/x86/Release/UnwindAssemblyx86Tests/Testx86AssemblyInspectionEngine.TestPushEBP (1544 of 2403) PASS: lldb-unit :: UnwindAssembly/x86/Release/UnwindAssemblyx86Tests/Testx86AssemblyInspectionEngine.Test32bitFramelessBigStackFrame (1545 of 2403) PASS: lldb-unit :: Process/gdb-remote/Release/ProcessGdbRemoteTests/GDBRemoteCommunicationClientTest.GetModulesInfo_UUID20 (1546 of 2403) PASS: lldb-unit :: Process/gdb-remote/Release/ProcessGdbRemoteTests/GDBRemoteClientBaseTest.SendContinueAndInterrupt2PacketBug (1547 of 2403) PASS: lldb-unit :: Process/gdb-remote/Release/ProcessGdbRemoteTests/GDBRemoteCommunicationClientTest.WriteMemoryTags (1548 of 2403) PASS: lldb-unit :: UnwindAssembly/x86/Release/UnwindAssemblyx86Tests/Testx86AssemblyInspectionEngine.TestStackRealignMSVC_i386 (1549 of 2403) PASS: lldb-unit :: Process/gdb-remote/Release/ProcessGdbRemoteTests/GDBRemoteCommunicationClientTest.SyncThreadState (1550 of 2403) PASS: lldb-unit :: UnwindAssembly/x86/Release/UnwindAssemblyx86Tests/Testx86AssemblyInspectionEngine.TestSimplex86_64Augmented (1551 of 2403) PASS: lldb-unit :: Utility/Release/UtilityTests/XcodeSDKTest.FindXcodeContentsDirectoryInPath (1552 of 2403) PASS: lldb-unit :: UnwindAssembly/x86/Release/UnwindAssemblyx86Tests/Testx86AssemblyInspectionEngine.TestStackRealign32BitDisp_x86_64 (1553 of 2403) PASS: lldb-unit :: Utility/Release/UtilityTests/XcodeSDKTest.SDKSupportsSwift (1554 of 2403) PASS: lldb-unit :: SymbolFile/NativePDB/Release/SymbolFileNativePDBTests/PDBFPOProgramToDWARFExpressionTests.UnresolvedRegisterAssignmentReference (1555 of 2403) PASS: lldb-unit :: Core/Release/LLDBCoreTests/RichManglingContextTest.IPDRealloc (1556 of 2403) PASS: lldb-unit :: UnwindAssembly/x86/Release/UnwindAssemblyx86Tests/Testx86AssemblyInspectionEngine.TestLEAVE (1557 of 2403) PASS: lldb-unit :: Utility/Release/UtilityTests/StringExtractorTest.DecodeHexU8_InvalidHex2 (1558 of 2403) PASS: lldb-unit :: Utility/Release/UtilityTests/ArchSpecTest.TestSetTriple (1559 of 2403) PASS: lldb-unit :: Utility/Release/UtilityTests/StringListTest.LongestCommonPrefixSingleElement (1560 of 2403) PASS: lldb-unit :: debugserver/Release/debugserverTests/RNBSocket.AnyListen (1561 of 2403) PASS: lldb-unit :: UnwindAssembly/x86/Release/UnwindAssemblyx86Tests/Testx86AssemblyInspectionEngine.TestSpArithx86_64Augmented (1562 of 2403) PASS: lldb-unit :: UnwindAssembly/x86/Release/UnwindAssemblyx86Tests/Testx86AssemblyInspectionEngine.TestPush0 (1563 of 2403) PASS: lldb-unit :: UnwindAssembly/x86/Release/UnwindAssemblyx86Tests/Testx86AssemblyInspectionEngine.TestPushR14 (1564 of 2403) PASS: lldb-unit :: UnwindAssembly/x86/Release/UnwindAssemblyx86Tests/Testx86AssemblyInspectionEngine.TestPushECX (1565 of 2403) PASS: lldb-unit :: Utility/Release/UtilityTests/RangeTest.ClearWithStarAddress (1566 of 2403) PASS: lldb-unit :: Core/Release/LLDBCoreTests/ModuleSpecTest.InvalidInMemoryBuffer (1567 of 2403) PASS: lldb-unit :: UnwindAssembly/x86/Release/UnwindAssemblyx86Tests/Testx86AssemblyInspectionEngine.TestPopRBX (1568 of 2403) PASS: lldb-unit :: Process/gdb-remote/Release/ProcessGdbRemoteTests/GDBRemoteCommunicationClientTest.ReadRegister (1569 of 2403) PASS: lldb-unit :: Process/gdb-remote/Release/ProcessGdbRemoteTests/GDBRemoteClientBaseTest.SendPacketAndReceiveResponseWithOutputSupport (1570 of 2403) PASS: lldb-unit :: UnwindAssembly/x86/Release/UnwindAssemblyx86Tests/Testx86AssemblyInspectionEngine.TestPushRBP (1571 of 2403) PASS: lldb-unit :: UnwindAssembly/x86/Release/UnwindAssemblyx86Tests/Testx86AssemblyInspectionEngine.TestSubRSP (1572 of 2403) PASS: lldb-unit :: UnwindAssembly/x86/Release/UnwindAssemblyx86Tests/Testx86AssemblyInspectionEngine.Test64bitFramelessSmallStackFrame (1573 of 2403) PASS: lldb-unit :: UnwindAssembly/x86/Release/UnwindAssemblyx86Tests/Testx86AssemblyInspectionEngine.TestPushRBX (1574 of 2403) PASS: lldb-unit :: Process/minidump/Release/LLDBMinidumpTests/MinidumpParserTest.FindMemoryRangeWithFullMemoryMinidump (1575 of 2403) PASS: lldb-unit :: DataFormatter/Release/LLDBFormatterTests/TypeMatcherTests.RegexName (1576 of 2403) PASS: lldb-unit :: Core/Release/LLDBCoreTests/ModuleSpecTest.TestELFFile (1577 of 2403) PASS: lldb-unit :: Utility/Release/UtilityTests/BinaryStreamTest.PutULEB128ThreeBytes (1578 of 2403) PASS: lldb-unit :: Utility/Release/UtilityTests/AnsiTerminal.Empty (1579 of 2403) PASS: lldb-unit :: Utility/Release/UtilityTests/ArchSpecTest.MergeFromMachOUnknown (1580 of 2403) PASS: lldb-unit :: UnwindAssembly/x86/Release/UnwindAssemblyx86Tests/Testx86AssemblyInspectionEngine.TestSpillRegToStackViaMOVx86_64 (1581 of 2403) PASS: lldb-unit :: debugserver/Release/debugserverTests/RNBSocket.LoopBackListenIPv4 (1582 of 2403) PASS: lldb-unit :: UnwindAssembly/x86/Release/UnwindAssemblyx86Tests/Testx86AssemblyInspectionEngine.TestPushImm (1583 of 2403) PASS: lldb-unit :: Utility/Release/UtilityTests/RangeTest.SetRangeBase (1584 of 2403) PASS: lldb-unit :: Process/gdb-remote/Release/ProcessGdbRemoteTests/GDBRemoteCommunicationClientTest.SaveRestoreRegistersNoSuffix (1585 of 2403) PASS: lldb-unit :: Process/gdb-remote/Release/ProcessGdbRemoteTests/GDBRemoteClientBaseTest.SendContinueDelegateInterface (1586 of 2403) PASS: lldb-unit :: Utility/Release/UtilityTests/ProcessInstanceInfo.DumpTable_invalidUID (1587 of 2403) PASS: lldb-unit :: Utility/Release/UtilityTests/ProcessInstanceInfo.DumpTable (1588 of 2403) PASS: lldb-unit :: Utility/Release/UtilityTests/ReproducerTest.SetCapture (1589 of 2403) PASS: lldb-unit :: Utility/Release/UtilityTests/RegularExpression.Valid (1590 of 2403) PASS: lldb-unit :: Interpreter/Release/InterpreterTests/OptionArgParserTest.toScriptLanguage (1591 of 2403) PASS: lldb-unit :: UnwindAssembly/x86/Release/UnwindAssemblyx86Tests/Testx86AssemblyInspectionEngine.Testi386IgnoredRegisters (1592 of 2403) PASS: lldb-unit :: UnwindAssembly/x86/Release/UnwindAssemblyx86Tests/Testx86AssemblyInspectionEngine.TestPushR13 (1593 of 2403) PASS: lldb-unit :: UnwindAssembly/x86/Release/UnwindAssemblyx86Tests/Testx86AssemblyInspectionEngine.TestPopEBP (1594 of 2403) PASS: lldb-unit :: Utility/Release/UtilityTests/PassiveReplayTest.InstrumentedBarRef (1595 of 2403) PASS: lldb-unit :: Utility/Release/UtilityTests/ScalarTest.LongLongAssigmentOperator (1596 of 2403) PASS: lldb-unit :: Utility/Release/UtilityTests/UriParserTest.BracketedHostnameWithColon (1597 of 2403) PASS: lldb-unit :: Utility/Release/UtilityTests/RangeDataVector.FindEntryThatContains_Overlap (1598 of 2403) PASS: lldb-unit :: Utility/Release/UtilityTests/DataExtractorTest.GetCStrAtEnd (1599 of 2403) PASS: lldb-unit :: Utility/Release/UtilityTests/ReproducerTest.SetReplay (1600 of 2403) PASS: lldb-unit :: Utility/Release/UtilityTests/StringExtractorTest.InitMisc (1601 of 2403) PASS: lldb-unit :: Utility/Release/UtilityTests/ArgsTest.DoubleQuotedItem (1602 of 2403) PASS: lldb-unit :: Utility/Release/UtilityTests/ScalarTest.TruncOrExtendTo (1603 of 2403) PASS: lldb-unit :: Utility/Release/UtilityTests/VASprintfTest.NoBufferResize (1604 of 2403) PASS: lldb-unit :: Core/Release/LLDBCoreTests/FormatEntityTest.DefinitionConstructionNameTypeChildren (1605 of 2403) PASS: lldb-unit :: Utility/Release/UtilityTests/StreamTest.SetIndentLevel (1606 of 2403) PASS: lldb-unit :: Utility/Release/UtilityTests/StringListTest.ForRange (1607 of 2403) PASS: lldb-unit :: Utility/Release/UtilityTests/ScalarTest.Getters (1608 of 2403) PASS: lldb-unit :: Core/Release/LLDBCoreTests/SourceLocationSpecTest.Equal (1609 of 2403) PASS: lldb-unit :: Process/minidump/Release/LLDBMinidumpTests/RegisterContextMinidump.CheckRegisterContextMinidump_ARM (1610 of 2403) PASS: lldb-unit :: Signals/Release/SignalsTests/UnixSignalsTest.GetFilteredSignals (1611 of 2403) PASS: lldb-unit :: Process/Utility/Release/ProcessUtilityTests/ProcSMapTests/LinuxProcSMapsTestFixture.ParseSMapRegions/3 (1612 of 2403) PASS: lldb-unit :: Interpreter/Release/InterpreterTests/TestProperties.DeepCopy (1613 of 2403) PASS: lldb-unit :: Utility/Release/UtilityTests/UriParserTest.BracketedHostname (1614 of 2403) PASS: lldb-unit :: Core/Release/LLDBCoreTests/MangledTest.ResultForBlockInvocation (1615 of 2403) PASS: lldb-unit :: Utility/Release/UtilityTests/StatusTest.ErrorConstructor (1616 of 2403) PASS: lldb-unit :: Utility/Release/UtilityTests/VASprintfTest.EncodingError (1617 of 2403) PASS: lldb-unit :: Utility/Release/UtilityTests/ProcessInstanceInfo.Yaml (1618 of 2403) PASS: lldb-unit :: Utility/Release/UtilityTests/ArgsTest.TestAppendArg (1619 of 2403) PASS: lldb-unit :: ObjectFile/PECOFF/Release/ObjectFilePECOFFTests/PECallFrameInfoTest.Frame_reg_eh (1620 of 2403) PASS: lldb-unit :: Process/gdb-remote/Release/ProcessGdbRemoteTests/GDBRemoteCommunicationServerTest.SendErrorResponse_Status (1621 of 2403) PASS: lldb-unit :: debugserver/Release/debugserverTests/RNBSocket.LoopBackConnectIPv6 (1622 of 2403) PASS: lldb-unit :: Process/minidump/Release/LLDBMinidumpTests/MinidumpParserTest.GetLinuxProcStatus_no_stream (1623 of 2403) PASS: lldb-unit :: Core/Release/LLDBCoreTests/MangledTest.ResultForValidRustV0Name (1624 of 2403) PASS: lldb-unit :: Process/minidump/Release/LLDBMinidumpTests/MinidumpParserTest.GetThreadContext_x86_32_wow64 (1625 of 2403) PASS: lldb-unit :: Utility/Release/UtilityTests/OptionsWithRawTest.EmptyInput (1626 of 2403) PASS: lldb-unit :: Core/Release/LLDBCoreTests/RichManglingContextTest.FromCxxMethodName (1627 of 2403) PASS: lldb-unit :: Utility/Release/UtilityTests/LogChannelEnabledTest.LogThread (1628 of 2403) PASS: lldb-unit :: Utility/Release/UtilityTests/StreamTeeTest.Assignment (1629 of 2403) PASS: lldb-unit :: Process/gdb-remote/Release/ProcessGdbRemoteTests/GDBRemoteCommunicationClientTest.GetMemoryRegionInfoInvalidResponse (1630 of 2403) PASS: lldb-unit :: Utility/Release/UtilityTests/OptionsWithRawTest.EmptyArgsOnlySuffix (1631 of 2403) PASS: lldb-unit :: UnwindAssembly/x86/Release/UnwindAssemblyx86Tests/Testx86AssemblyInspectionEngine.TestPopR12 (1632 of 2403) PASS: lldb-unit :: Utility/Release/UtilityTests/ArgsTest.GetShellSafeArgument (1633 of 2403) PASS: lldb-unit :: Utility/Release/UtilityTests/XcodeSDKTest.GetCanonicalNameAndConstruct (1634 of 2403) PASS: lldb-unit :: Utility/Release/UtilityTests/XcodeSDKTest.GetSDKTypeForTriple (1635 of 2403) PASS: lldb-unit :: Language/CPlusPlus/Release/LanguageCPlusPlusTests/CPlusPlusLanguage.ExtractContextAndIdentifier (1636 of 2403) PASS: lldb-unit :: Utility/Release/UtilityTests/StringListTest.RemoveBlankLines (1637 of 2403) PASS: lldb-unit :: Utility/Release/UtilityTests/ArgsTest.Yaml (1638 of 2403) PASS: lldb-unit :: Host/Release/HostTests/NativeProcessProtocolTest.SetBreakpointFailVerify (1639 of 2403) PASS: lldb-unit :: Utility/Release/UtilityTests/IndexToObjectTest.ObjectForIndex (1640 of 2403) PASS: lldb-unit :: Process/minidump/Release/LLDBMinidumpTests/MinidumpParserTest.GetMemoryRegionInfoLinuxMapsError (1641 of 2403) PASS: lldb-unit :: Core/Release/LLDBCoreTests/FormatEntityTest.DefinitionConstructionNameTypeData (1642 of 2403) PASS: lldb-unit :: Process/minidump/Release/LLDBMinidumpTests/MinidumpParserTest.GetMiscInfo_no_stream (1643 of 2403) PASS: lldb-unit :: Process/gdb-remote/Release/ProcessGdbRemoteTests/PortMapTest.FreePort (1644 of 2403) PASS: lldb-unit :: Utility/Release/UtilityTests/PassiveReplayTest.InstrumentedBarPtr (1645 of 2403) PASS: lldb-unit :: Interpreter/Release/InterpreterTests/OptionArgParserTest.toChar (1646 of 2403) PASS: lldb-unit :: Utility/Release/UtilityTests/StringExtractorTest.GetNameColonValueSuccess (1647 of 2403) PASS: lldb-unit :: Process/minidump/Release/LLDBMinidumpTests/MinidumpParserTest.MinidumpDuplicateModuleMappedSecond (1648 of 2403) PASS: lldb-unit :: Utility/Release/UtilityTests/StreamTest.AddressRangeEmptyRange (1649 of 2403) PASS: lldb-unit :: Utility/Release/UtilityTests/GeneratorTest.Get (1650 of 2403) PASS: lldb-unit :: Utility/Release/UtilityTests/TildeExpressionResolver.ResolveFullPath (1651 of 2403) PASS: lldb-unit :: Utility/Release/UtilityTests/RegularExpression.Empty (1652 of 2403) PASS: lldb-unit :: Utility/Release/UtilityTests/ArgsTest.StringListConstructor (1653 of 2403) PASS: lldb-unit :: Utility/Release/UtilityTests/StreamTeeTest.AppendStream (1654 of 2403) PASS: lldb-unit :: Host/Release/HostTests/NativeProcessProtocolTest.SetBreakpointFailWrite (1655 of 2403) PASS: lldb-unit :: Utility/Release/UtilityTests/StreamTest.PutCString (1656 of 2403) PASS: lldb-unit :: Utility/Release/UtilityTests/CompletionRequest.Constructor (1657 of 2403) PASS: lldb-unit :: Utility/Release/UtilityTests/ScalarTest.RightShiftOperator (1658 of 2403) PASS: lldb-unit :: Utility/Release/UtilityTests/UriParserTest.SchemeHostSeparator3 (1659 of 2403) PASS: lldb-unit :: Utility/Release/UtilityTests/CompletionRequest.DuplicateFilteringWithComments (1660 of 2403) PASS: lldb-unit :: Utility/Release/UtilityTests/UriParserTest.TypicalPortPathIPv6 (1661 of 2403) PASS: lldb-unit :: Utility/Release/UtilityTests/StreamTest.PutBytesAsRawHex8ToBigEndian (1662 of 2403) PASS: lldb-unit :: Process/minidump/Release/LLDBMinidumpTests/MinidumpParserTest.GetThreadContext_x86_64 (1663 of 2403) PASS: lldb-unit :: Utility/Release/UtilityTests/EnvironmentTest.EnvpConversion (1664 of 2403) PASS: lldb-unit :: Host/Release/HostTests/SocketAddressTest.Set (1665 of 2403) PASS: lldb-unit :: DataFormatter/Release/LLDBFormatterTests/TypeMatcherTests.RegexMatchPart (1666 of 2403) PASS: lldb-unit :: Interpreter/Release/InterpreterTests/OptionValueString.DeepCopy (1667 of 2403) PASS: lldb-unit :: Utility/Release/UtilityTests/BinaryStreamTest.PutULEB128OneByte (1668 of 2403) PASS: lldb-unit :: Utility/Release/UtilityTests/CompletionRequest.FakeLastArg (1669 of 2403) PASS: lldb-unit :: Utility/Release/UtilityTests/RegularExpression.Invalid (1670 of 2403) PASS: lldb-unit :: Process/minidump/Release/LLDBMinidumpTests/MinidumpParserTest.MinidumpModuleOrder (1671 of 2403) PASS: lldb-unit :: Host/Release/HostTests/SocketTests/SocketTest.TCPGetConnectURI/ipv6 (1672 of 2403) PASS: lldb-unit :: Utility/Release/UtilityTests/RangeTest.Union (1673 of 2403) PASS: lldb-unit :: Utility/Release/UtilityTests/AnsiTerminal.AtStart (1674 of 2403) PASS: lldb-unit :: Host/Release/HostTests/MainLoopTest.Signal (1675 of 2403) PASS: lldb-unit :: Utility/Release/UtilityTests/StreamTeeTest.Constructor2Streams (1676 of 2403) PASS: lldb-unit :: Utility/Release/UtilityTests/SerializationRountripTest.SerializeDeserializePod (1677 of 2403) PASS: lldb-unit :: Utility/Release/UtilityTests/BinaryStreamTest.PutULEB128SixBytes (1678 of 2403) PASS: lldb-unit :: DataFormatter/Release/LLDBFormatterTests/TypeMatcherTests.GetMatchStringExactName (1679 of 2403) PASS: lldb-unit :: Utility/Release/UtilityTests/GeneratorTest.GetOrCreate (1680 of 2403) PASS: lldb-unit :: Utility/Release/UtilityTests/UUIDTest.RelationalOperators (1681 of 2403) PASS: lldb-unit :: Utility/Release/UtilityTests/StringListTest.Join (1682 of 2403) PASS: lldb-unit :: Utility/Release/UtilityTests/StringListTest.JoinEmpty (1683 of 2403) PASS: lldb-unit :: Utility/Release/UtilityTests/ArgsTest.TestQuotedUnknownEscape (1684 of 2403) PASS: lldb-unit :: Process/minidump/Release/LLDBMinidumpTests/MinidumpParserTest.GetExceptionStream (1685 of 2403) PASS: lldb-unit :: Host/Release/HostTests/SocketAddressTest.GetAddressInfo (1686 of 2403) PASS: lldb-unit :: Core/Release/LLDBCoreTests/SourceFileCache.FindSourceFileFound (1687 of 2403) PASS: lldb-unit :: Utility/Release/UtilityTests/RegisterValueTest.GetScalarValue (1688 of 2403) PASS: lldb-unit :: Utility/Release/UtilityTests/StringExtractorTest.GetNameColonValueContainsColon (1689 of 2403) PASS: lldb-unit :: Host/Release/HostTests/MainLoopTest.TwoSignalCallbacks (1690 of 2403) PASS: lldb-unit :: Host/Release/HostTests/MainLoopTest.ReadObject (1691 of 2403) PASS: lldb-unit :: DataFormatter/Release/LLDBFormatterTests/TypeMatcherTests.GetMatchStringRegex (1692 of 2403) PASS: lldb-unit :: ObjectFile/Breakpad/Release/ObjectFileBreakpadTests/InfoRecord.parse (1693 of 2403) PASS: lldb-unit :: Host/Release/HostTests/SocketTests/SocketTest.DomainListenConnectAccept/ipv6 (1694 of 2403) PASS: lldb-unit :: Process/minidump/Release/LLDBMinidumpTests/MinidumpParserTest.InvalidMinidump (1695 of 2403) PASS: lldb-unit :: ObjectFile/ELF/Release/ObjectFileELFTests/ObjectFileELFTest.GetModuleSpecifications_EarlySectionHeaders (1696 of 2403) PASS: lldb-unit :: Utility/Release/UtilityTests/RangeTest.ContainsRange (1697 of 2403) PASS: lldb-unit :: Utility/Release/UtilityTests/UriParserTest.SchemeHostSeparator (1698 of 2403) PASS: lldb-unit :: ObjectFile/Breakpad/Release/ObjectFileBreakpadTests/FuncRecord.parse (1699 of 2403) PASS: lldb-unit :: Utility/Release/UtilityTests/BinaryStreamTest.PutSLEB128FiveBytes (1700 of 2403) PASS: lldb-unit :: Utility/Release/UtilityTests/RangeTest.Equal (1701 of 2403) PASS: lldb-unit :: Utility/Release/UtilityTests/UserIDResolver.GetUserName (1702 of 2403) PASS: lldb-unit :: Core/Release/LLDBCoreTests/MangledTest.ResultForValidName (1703 of 2403) PASS: lldb-unit :: Utility/Release/UtilityTests/StringExtractorTest.GetU32BigEndian (1704 of 2403) PASS: lldb-unit :: Host/Release/HostTests/MainLoopTest.DetectsEOF (1705 of 2403) PASS: lldb-unit :: Process/minidump/Release/LLDBMinidumpTests/MinidumpParserTest.GetFilteredModuleList (1706 of 2403) PASS: lldb-unit :: Utility/Release/UtilityTests/FileSpecTest.PrependPathComponent (1707 of 2403) PASS: lldb-unit :: Utility/Release/UtilityTests/StatusTest.ErrorConversion (1708 of 2403) PASS: lldb-unit :: Host/Release/HostTests/ConnectionFileDescriptorTest.TCPGetURIv6 (1709 of 2403) PASS: lldb-unit :: Utility/Release/UtilityTests/RangeTest.NotEqual (1710 of 2403) PASS: lldb-unit :: Utility/Release/UtilityTests/StringListTest.JoinMultiCharSeparator (1711 of 2403) PASS: lldb-unit :: Utility/Release/UtilityTests/LogTest.Register (1712 of 2403) PASS: lldb-unit :: Utility/Release/UtilityTests/StreamTest.ShiftOperatorStrings (1713 of 2403) PASS: lldb-unit :: Utility/Release/UtilityTests/OptionsWithRawTest.TerminatedQuote (1714 of 2403) PASS: lldb-unit :: Utility/Release/UtilityTests/ScalarTest.Division (1715 of 2403) PASS: lldb-unit :: Utility/Release/UtilityTests/StreamTest.PutBytesAsRawHex8ToLittleEndian (1716 of 2403) PASS: lldb-unit :: Utility/Release/UtilityTests/StringExtractorTest.GetHexBytesAvail_Partial (1717 of 2403) PASS: lldb-unit :: Utility/Release/UtilityTests/ConstStringTest.MangledCounterpart (1718 of 2403) PASS: lldb-unit :: Process/minidump/Release/LLDBMinidumpTests/MinidumpParserTest.GetPidWindows (1719 of 2403) PASS: lldb-unit :: debugserver/Release/debugserverTests/RNBSocket.LoopBackConnectIPv4 (1720 of 2403) PASS: lldb-unit :: Utility/Release/UtilityTests/UriParserTest.BracketedHostnamePort (1721 of 2403) PASS: lldb-unit :: Utility/Release/UtilityTests/RangeTest.DefaultConstructor (1722 of 2403) PASS: lldb-unit :: Host/Release/HostTests/NativeProcessProtocolTest.ReadCStringFromMemory_CrossPageBoundary (1723 of 2403) PASS: lldb-unit :: Utility/Release/UtilityTests/LogChannelTest.EnableOptions (1724 of 2403) PASS: lldb-unit :: Utility/Release/UtilityTests/RangeTest.NotEqualInvalid (1725 of 2403) PASS: lldb-unit :: Utility/Release/UtilityTests/RangeDataVector.FindEntryThatContains (1726 of 2403) PASS: lldb-unit :: Utility/Release/UtilityTests/StreamTeeTest.CopyConstructor (1727 of 2403) PASS: lldb-unit :: Utility/Release/UtilityTests/StringListTest.LongestCommonPrefix (1728 of 2403) PASS: lldb-unit :: Utility/Release/UtilityTests/DataExtractorTest.GetDoubleUnaligned (1729 of 2403) PASS: lldb-unit :: Utility/Release/UtilityTests/ScalarTest.APIntConstructor (1730 of 2403) PASS: lldb-unit :: Utility/Release/UtilityTests/UriParserTest.Minimal (1731 of 2403) PASS: lldb-unit :: Utility/Release/UtilityTests/StringExtractorTest.GetHexBytes_FullString (1732 of 2403) PASS: lldb-unit :: Utility/Release/UtilityTests/Flags.AnyClear (1733 of 2403) PASS: lldb-unit :: Utility/Release/UtilityTests/OptionsWithRawTest.ArgsButNoDelimiter (1734 of 2403) PASS: lldb-unit :: Utility/Release/UtilityTests/VMRange.ContainsAddr (1735 of 2403) PASS: lldb-unit :: Utility/Release/UtilityTests/StringExtractorTest.GetHexBytesAvail_FullString (1736 of 2403) PASS: lldb-unit :: Utility/Release/UtilityTests/FileSpecTest.Match (1737 of 2403) PASS: lldb-unit :: Utility/Release/UtilityTests/StringListTest.AppendListCStringArrayEmpty (1738 of 2403) PASS: lldb-unit :: Process/minidump/Release/LLDBMinidumpTests/MinidumpParserTest.GetPidWow64 (1739 of 2403) FAIL: lldb-shell :: SymbolFile/DWARF/deterministic-build.cpp (1740 of 2403) ******************** TEST 'lldb-shell :: SymbolFile/DWARF/deterministic-build.cpp' FAILED ******************** Script: -- : 'RUN: at line 5'; /Users/buildslave/jenkins/workspace/lldb-cmake-standalone/clang-build/bin/clang --target=specify-a-target-or-use-a-_host-substitution --target=x86_64-apple-darwin19.5.0 -isysroot /Applications/Xcode.app/Contents/Developer/Platforms/MacOSX.platform/Developer/SDKs/MacOSX10.15.sdk -fmodules-cache-path=/Users/buildslave/jenkins/workspace/lldb-cmake-standalone/lldb-xcode-build/lldb-test-build.noindex/module-cache-clang/lldb-shell /Users/buildslave/jenkins/workspace/lldb-cmake-standalone/llvm-project/lldb/test/Shell/SymbolFile/DWARF/deterministic-build.cpp -g -c -o /Users/buildslave/jenkins/workspace/lldb-cmake-standalone/lldb-xcode-build/test/Shell/SymbolFile/DWARF/Output/deterministic-build.cpp.tmp.o : 'RUN: at line 6'; ZERO_AR_DATE=1 /Users/buildslave/jenkins/workspace/lldb-cmake-standalone/clang-build/bin/clang --target=specify-a-target-or-use-a-_host-substitution --target=x86_64-apple-darwin19.5.0 -isysroot /Applications/Xcode.app/Contents/Developer/Platforms/MacOSX.platform/Developer/SDKs/MacOSX10.15.sdk -fmodules-cache-path=/Users/buildslave/jenkins/workspace/lldb-cmake-standalone/lldb-xcode-build/lldb-test-build.noindex/module-cache-clang/lldb-shell /Users/buildslave/jenkins/workspace/lldb-cmake-standalone/lldb-xcode-build/test/Shell/SymbolFile/DWARF/Output/deterministic-build.cpp.tmp.o -g -o /Users/buildslave/jenkins/workspace/lldb-cmake-standalone/lldb-xcode-build/test/Shell/SymbolFile/DWARF/Output/deterministic-build.cpp.tmp : 'RUN: at line 7'; /Users/buildslave/jenkins/workspace/lldb-cmake-standalone/lldb-xcode-build/Release/bin/lldb --no-lldbinit -S /Users/buildslave/jenkins/workspace/lldb-cmake-standalone/lldb-xcode-build/test/Shell/lit-lldb-init /Users/buildslave/jenkins/workspace/lldb-cmake-standalone/lldb-xcode-build/test/Shell/SymbolFile/DWARF/Output/deterministic-build.cpp.tmp -o "breakpoint set -f /Users/buildslave/jenkins/workspace/lldb-cmake-standalone/llvm-project/lldb/test/Shell/SymbolFile/DWARF/deterministic-build.cpp -l 11" -o run -o exit | /Users/buildslave/jenkins/workspace/lldb-cmake-standalone/clang-build/bin/FileCheck /Users/buildslave/jenkins/workspace/lldb-cmake-standalone/llvm-project/lldb/test/Shell/SymbolFile/DWARF/deterministic-build.cpp -- Exit Code: 1

Hide Details

Command Output (stderr): -- + : 'RUN: at line 5' + /Users/buildslave/jenkins/workspace/lldb-cmake-standalone/clang-build/bin/clang --target=specify-a-target-or-use-a-_host-substitution --target=x86_64-apple-darwin19.5.0 -isysroot /Applications/Xcode.app/Contents/Developer/Platforms/MacOSX.platform/Developer/SDKs/MacOSX10.15.sdk -fmodules-cache-path=/Users/buildslave/jenkins/workspace/lldb-cmake-standalone/lldb-xcode-build/lldb-test-build.noindex/module-cache-clang/lldb-shell /Users/buildslave/jenkins/workspace/lldb-cmake-standalone/llvm-project/lldb/test/Shell/SymbolFile/DWARF/deterministic-build.cpp -g -c -o /Users/buildslave/jenkins/workspace/lldb-cmake-standalone/lldb-xcode-build/test/Shell/SymbolFile/DWARF/Output/deterministic-build.cpp.tmp.o clang-14: warning: argument unused during compilation: '-fmodules-cache-path=/Users/buildslave/jenkins/workspace/lldb-cmake-standalone/lldb-xcode-build/lldb-test-build.noindex/module-cache-clang/lldb-shell' [-Wunused-command-line-argument] + : 'RUN: at line 6' + ZERO_AR_DATE=1 + /Users/buildslave/jenkins/workspace/lldb-cmake-standalone/clang-build/bin/clang --target=specify-a-target-or-use-a-_host-substitution --target=x86_64-apple-darwin19.5.0 -isysroot /Applications/Xcode.app/Contents/Developer/Platforms/MacOSX.platform/Developer/SDKs/MacOSX10.15.sdk -fmodules-cache-path=/Users/buildslave/jenkins/workspace/lldb-cmake-standalone/lldb-xcode-build/lldb-test-build.noindex/module-cache-clang/lldb-shell /Users/buildslave/jenkins/workspace/lldb-cmake-standalone/lldb-xcode-build/test/Shell/SymbolFile/DWARF/Output/deterministic-build.cpp.tmp.o -g -o /Users/buildslave/jenkins/workspace/lldb-cmake-standalone/lldb-xcode-build/test/Shell/SymbolFile/DWARF/Output/deterministic-build.cpp.tmp + : 'RUN: at line 7' + /Users/buildslave/jenkins/workspace/lldb-cmake-standalone/lldb-xcode-build/Release/bin/lldb --no-lldbinit -S /Users/buildslave/jenkins/workspace/lldb-cmake-standalone/lldb-xcode-build/test/Shell/lit-lldb-init /Users/buildslave/jenkins/workspace/lldb-cmake-standalone/lldb-xcode-build/test/Shell/SymbolFile/DWARF/Output/deterministic-build.cpp.tmp -o 'breakpoint set -f /Users/buildslave/jenkins/workspace/lldb-cmake-standalone/llvm-project/lldb/test/Shell/SymbolFile/DWARF/deterministic-build.cpp -l 11' -o run -o exit + /Users/buildslave/jenkins/workspace/lldb-cmake-standalone/clang-build/bin/FileCheck /Users/buildslave/jenkins/workspace/lldb-cmake-standalone/llvm-project/lldb/test/Shell/SymbolFile/DWARF/deterministic-build.cpp error: process exited with status -1 (tried to attach to process already being debugged) /Users/buildslave/jenkins/workspace/lldb-cmake-standalone/llvm-project/lldb/test/Shell/SymbolFile/DWARF/deterministic-build.cpp:8:11: error: CHECK: expected string not found in input // CHECK: stop reason = breakpoint ^ <stdin>:1:1: note: scanning from here (lldb) command source -s 0 '/Users/buildslave/jenkins/workspace/lldb-cmake-standalone/lldb-xcode-build/test/Shell/lit-lldb-init' ^ <stdin>:5:3: note: possible intended match here (lldb) settings set plugin.process.gdb-remote.packet-timeout 60 ^

Hide Details

Input file: <stdin> Check file: /Users/buildslave/jenkins/workspace/lldb-cmake-standalone/llvm-project/lldb/test/Shell/SymbolFile/DWARF/deterministic-build.cpp

Hide Details

-dump-input=help explains the following input dump.

Hide Details

Input was: <<<<<< 1: (lldb) command source -s 0 '/Users/buildslave/jenkins/workspace/lldb-cmake-standalone/lldb-xcode-build/test/Shell/lit-lldb-init' check:8'0 X~~~~~~~~~~~~~~~~~~~~~~~~~~~~~~~~~~~~~~~~~~~~~~~~~~~~~~~~~~~~~~~~~~~~~~~~~~~~~~~~~~~~~~~~~~~~~~~~~~~~~~~~~~~~~~~~~~~~~~~~~~~~~~~~ error: no match found 2: Executing commands in '/Users/buildslave/jenkins/workspace/lldb-cmake-standalone/lldb-xcode-build/test/Shell/lit-lldb-init'. check:8'0 ~~~~~~~~~~~~~~~~~~~~~~~~~~~~~~~~~~~~~~~~~~~~~~~~~~~~~~~~~~~~~~~~~~~~~~~~~~~~~~~~~~~~~~~~~~~~~~~~~~~~~~~~~~~~~~~~~~~~~~~~~~~~~ 3: (lldb) # LLDB init file for the LIT tests. check:8'0 ~~~~~~~~~~~~~~~~~~~~~~~~~~~~~~~~~~~~~~~~~~~ 4: (lldb) settings set symbols.enable-external-lookup false check:8'0 ~~~~~~~~~~~~~~~~~~~~~~~~~~~~~~~~~~~~~~~~~~~~~~~~~~~~~~~~~ 5: (lldb) settings set plugin.process.gdb-remote.packet-timeout 60 check:8'0 ~~~~~~~~~~~~~~~~~~~~~~~~~~~~~~~~~~~~~~~~~~~~~~~~~~~~~~~~~~~~~~~~ check:8'1 ? possible intended match 6: (lldb) settings set interpreter.echo-comment-commands false check:8'0 ~~~~~~~~~~~~~~~~~~~~~~~~~~~~~~~~~~~~~~~~~~~~~~~~~~~~~~~~~~~~ 7: (lldb) settings set symbols.clang-modules-cache-path "/Users/buildslave/jenkins/workspace/lldb-cmake-standalone/lldb-xcode-build/lldb-test-build.noindex/module-cache-lldb" check:8'0 ~~~~~~~~~~~~~~~~~~~~~~~~~~~~~~~~~~~~~~~~~~~~~~~~~~~~~~~~~~~~~~~~~~~~~~~~~~~~~~~~~~~~~~~~~~~~~~~~~~~~~~~~~~~~~~~~~~~~~~~~~~~~~~~~~~~~~~~~~~~~~~~~~~~~~~~~~~~~~~~~~~~~~~~~~~~~ 8: (lldb) settings set target.auto-apply-fixits false check:8'0 ~~~~~~~~~~~~~~~~~~~~~~~~~~~~~~~~~~~~~~~~~~~~~~~~~~~ 9: (lldb) settings set target.inherit-tcc true check:8'0 ~~~~~~~~~~~~~~~~~~~~~~~~~~~~~~~~~~~~~~~~~~~~ 10: (lldb) settings set target.detach-on-error false check:8'0 ~~~~~~~~~~~~~~~~~~~~~~~~~~~~~~~~~~~~~~~~~~~~~~~~~ . . . >>>>>>

Hide Details

--

Hide Details

******************** PASS: lldb-unit :: Utility/Release/UtilityTests/UriParserTest.BadPort (1741 of 2403) PASS: lldb-unit :: Utility/Release/UtilityTests/ArgsTest.TestOverwriteArgs (1742 of 2403) PASS: lldb-unit :: Utility/Release/UtilityTests/FileSpecTest.EqualDotsPosixRoot (1743 of 2403) PASS: lldb-unit :: Utility/Release/UtilityTests/StringExtractorTest.GetU32LittleEndian (1744 of 2403) PASS: lldb-unit :: Utility/Release/UtilityTests/DataExtractorTest.GetCStrUnterminated (1745 of 2403) PASS: lldb-unit :: Utility/Release/UtilityTests/StatusTest.ErrorCodeConstructor (1746 of 2403) PASS: lldb-unit :: Host/Release/HostTests/SocketTests/SocketTest.TCPListen0ConnectAccept/ipv6 (1747 of 2403) PASS: lldb-unit :: Utility/Release/UtilityTests/VMRange.SetEndAddress (1748 of 2403) PASS: lldb-unit :: Core/Release/LLDBCoreTests/DumpDataExtractorTest.BaseAddress (1749 of 2403) PASS: lldb-unit :: Utility/Release/UtilityTests/FileSpecTest.EqualDotsWindows (1750 of 2403) PASS: lldb-unit :: Utility/Release/UtilityTests/DataExtractorTest.UncommonAddressSize (1751 of 2403) PASS: lldb-unit :: Utility/Release/UtilityTests/FileSpecTest.FormatFileSpec (1752 of 2403) PASS: lldb-unit :: Utility/Release/UtilityTests/BinaryStreamTest.PutSLEB128EightBytes (1753 of 2403) PASS: lldb-unit :: Interpreter/Release/InterpreterTests/OptionValueFileColonLine.setFromString (1754 of 2403) PASS: lldb-unit :: Utility/Release/UtilityTests/StreamTest.PutStringAsRawHex8 (1755 of 2403) PASS: lldb-unit :: Utility/Release/UtilityTests/StringExtractorGDBRemoteTest.GetPidTidMultipleValues (1756 of 2403) PASS: lldb-unit :: Utility/Release/UtilityTests/BinaryStreamTest.PutULEB128Zero (1757 of 2403) PASS: lldb-unit :: Utility/Release/UtilityTests/ScalarTest.SetValueFromCString (1758 of 2403) PASS: lldb-unit :: Utility/Release/UtilityTests/StringListTest.GetMaxStringLengthEqualSize (1759 of 2403) PASS: lldb-unit :: Process/gdb-remote/Release/ProcessGdbRemoteTests/GDBRemoteCommunicationServerTest.SendErrorResponse_StringError (1760 of 2403) PASS: lldb-unit :: Utility/Release/UtilityTests/StreamTeeTest.SetStreamAtIndexOutOfBounds (1761 of 2403) PASS: lldb-unit :: SymbolFile/NativePDB/Release/SymbolFileNativePDBTests/PDBFPOProgramToDWARFExpressionTests.InvalidAssignmentSingle (1762 of 2403) PASS: lldb-unit :: Utility/Release/UtilityTests/StringExtractorTest.GetHexU8_InvalidHex_NoEof (1763 of 2403) PASS: lldb-unit :: Utility/Release/UtilityTests/StreamTest.PutHex64ByteOrderLittle (1764 of 2403) PASS: lldb-unit :: Utility/Release/UtilityTests/StringListTest.Clear (1765 of 2403) PASS: lldb-unit :: Core/Release/LLDBCoreTests/UniqueCStringMap.NoDefaultConstructor (1766 of 2403) PASS: lldb-unit :: Utility/Release/UtilityTests/StreamTeeTest.Flush (1767 of 2403) PASS: lldb-unit :: Utility/Release/UtilityTests/StreamTest.AddressPrefixAndSuffix (1768 of 2403) PASS: lldb-unit :: Utility/Release/UtilityTests/BinaryStreamTest.PutULEB128EightBytes (1769 of 2403) PASS: lldb-unit :: Utility/Release/UtilityTests/ArchSpecTest.TestParseMachCPUDashSubtypeTripleSimple (1770 of 2403) PASS: lldb-unit :: Utility/Release/UtilityTests/PassiveReplayTest.InstrumentedFoo (1771 of 2403) PASS: lldb-unit :: Utility/Release/UtilityTests/ScalarTest.Equality (1772 of 2403) PASS: lldb-unit :: Utility/Release/UtilityTests/StreamTest.PutMaxHex64ByteOrderBig (1773 of 2403) PASS: lldb-unit :: Utility/Release/UtilityTests/FileSpecTest.OperatorBool (1774 of 2403) PASS: lldb-unit :: Utility/Release/UtilityTests/StreamTest.AddressPrefix (1775 of 2403) PASS: lldb-unit :: Process/minidump/Release/LLDBMinidumpTests/MinidumpParserTest.GetArchitectureWindows (1776 of 2403) PASS: lldb-unit :: Process/minidump/Release/LLDBMinidumpTests/MinidumpParserTest.GetThreadsAndGetThreadContext (1777 of 2403) PASS: lldb-unit :: Utility/Release/UtilityTests/StringExtractorTest.GetHexBytesAvail_OddPair2 (1778 of 2403) PASS: lldb-unit :: Utility/Release/UtilityTests/StringExtractorTest.GetU64BigEndian (1779 of 2403) PASS: lldb-unit :: Utility/Release/UtilityTests/StringListTest.InsertStringAtIndexStart (1780 of 2403) PASS: lldb-unit :: Utility/Release/UtilityTests/StringExtractorTest.GetHexU8_Exact_NoEof (1781 of 2403) PASS: lldb-unit :: Utility/Release/UtilityTests/OptionsWithRawTest.WhitespaceSuffix (1782 of 2403) PASS: lldb-unit :: Utility/Release/UtilityTests/StringListTest.GetMaxStringLengthDecreasingSize (1783 of 2403) PASS: lldb-unit :: Core/Release/LLDBCoreTests/ModuleSpecTest.InvalidInMemoryBufferValidFile (1784 of 2403) PASS: lldb-unit :: Utility/Release/UtilityTests/ProcessInstanceInfoMatch.Name (1785 of 2403) PASS: lldb-unit :: Host/Release/HostTests/FileSystemTest.EmptyTest (1786 of 2403) PASS: lldb-unit :: Utility/Release/UtilityTests/StringListTest.LongestCommonPrefixEmpty (1787 of 2403) PASS: lldb-unit :: Utility/Release/UtilityTests/DataExtractorTest.GetBitfield (1788 of 2403) PASS: lldb-unit :: Utility/Release/UtilityTests/StringExtractorTest.GetHexU8_Exact (1789 of 2403) PASS: lldb-unit :: Utility/Release/UtilityTests/LogChannelTest.Enable (1790 of 2403) PASS: lldb-unit :: Utility/Release/UtilityTests/StringListTest.ShiftMove (1791 of 2403) PASS: lldb-unit :: Utility/Release/UtilityTests/FileSpecTest.AppendPathComponent (1792 of 2403) PASS: lldb-unit :: Utility/Release/UtilityTests/StreamTest.PutRawBytesToLittleEndian (1793 of 2403) PASS: lldb-unit :: Utility/Release/UtilityTests/RegularExpression.Match (1794 of 2403) PASS: lldb-unit :: Utility/Release/UtilityTests/RangeTest.LessThanInvalid (1795 of 2403) PASS: lldb-unit :: Utility/Release/UtilityTests/StringListTest.CopyListSingle (1796 of 2403) PASS: lldb-unit :: Language/CPlusPlus/Release/LanguageCPlusPlusTests/CPlusPlusLanguage.FindAlternateFunctionManglings (1797 of 2403) PASS: lldb-unit :: Utility/Release/UtilityTests/StreamTeeTest.Write (1798 of 2403) PASS: lldb-unit :: Interpreter/Release/InterpreterTests/OptionValueArgs.DeepCopy (1799 of 2403) PASS: lldb-unit :: Utility/Release/UtilityTests/NameMatchesTest.EndsWith (1800 of 2403) PASS: lldb-unit :: Utility/Release/UtilityTests/StringExtractorTest.GetHexBytes_OddPair2 (1801 of 2403) PASS: lldb-unit :: Utility/Release/UtilityTests/BinaryStreamTest.PutSLEB128SevenBytes (1802 of 2403) PASS: lldb-unit :: Utility/Release/UtilityTests/RangeDataVector.FindEntryIndexesThatContain (1803 of 2403) PASS: lldb-unit :: Utility/Release/UtilityTests/StringExtractorTest.GetHexU8_Underflow_NoEof (1804 of 2403) PASS: lldb-unit :: Process/minidump/Release/LLDBMinidumpTests/MinidumpParserTest.GetMemoryRegionInfoFromMemoryList (1805 of 2403) PASS: lldb-unit :: Utility/Release/UtilityTests/AnsiTerminal.Incomplete (1806 of 2403) PASS: lldb-unit :: Utility/Release/UtilityTests/StringLexerTest.PutBack (1807 of 2403) PASS: lldb-unit :: Process/minidump/Release/LLDBMinidumpTests/MinidumpParserTest.GetThreadContext_x86_32 (1808 of 2403) PASS: lldb-unit :: Utility/Release/UtilityTests/UserIDResolver.GetGroupName (1809 of 2403) PASS: lldb-unit :: Utility/Release/UtilityTests/GeneratorTest.Create (1810 of 2403) PASS: lldb-unit :: Host/Release/HostTests/SocketTests/SocketTest.TCPGetAddress/ipv4 (1811 of 2403) PASS: lldb-unit :: Utility/Release/UtilityTests/StreamTest.PutHex8 (1812 of 2403) PASS: lldb-unit :: Process/gdb-remote/Release/ProcessGdbRemoteTests/GDBRemoteCommunicationServerTest.SendErrorResponse_ErrorList (1813 of 2403) PASS: lldb-unit :: Utility/Release/UtilityTests/StreamTeeTest.Constructor1Stream (1814 of 2403) PASS: lldb-unit :: Utility/Release/UtilityTests/AnsiTerminal.Twice (1815 of 2403) PASS: lldb-unit :: Utility/Release/UtilityTests/ConstStringTest.UpdateMangledCounterpart (1816 of 2403) PASS: lldb-unit :: Process/minidump/Release/LLDBMinidumpTests/MinidumpParserTest.GetPid (1817 of 2403) PASS: lldb-unit :: Utility/Release/UtilityTests/RangeDataVector.CustomSort (1818 of 2403) PASS: lldb-unit :: Signals/Release/SignalsTests/UnixSignalsTest.VersionChange (1819 of 2403) PASS: lldb-unit :: Utility/Release/UtilityTests/StringListTest.AppendStringStdString (1820 of 2403) PASS: lldb-unit :: DataFormatter/Release/LLDBFormatterTests/StringPrinterTests.SwiftUTF8 (1821 of 2403) PASS: lldb-unit :: Utility/Release/UtilityTests/StringExtractorTest.DecodeHexU8_Underflow (1822 of 2403) PASS: lldb-unit :: Utility/Release/UtilityTests/StreamTest.AddressNoSuffix (1823 of 2403) PASS: lldb-unit :: Core/Release/LLDBCoreTests/StreamCallbackTest.Callback (1824 of 2403) PASS: lldb-unit :: Core/Release/LLDBCoreTests/DumpDataExtractorTest.Formats (1825 of 2403) PASS: lldb-unit :: Utility/Release/UtilityTests/RangeTest.Clear (1826 of 2403) PASS: lldb-unit :: Core/Release/LLDBCoreTests/DumpDataExtractorTest.FormatCharArray (1827 of 2403) PASS: lldb-unit :: Process/minidump/Release/LLDBMinidumpTests/MinidumpParserTest.MinidumpDuplicateModuleSeparateCode (1828 of 2403) PASS: lldb-unit :: Utility/Release/UtilityTests/XcodeSDKTest.ParseTest (1829 of 2403) PASS: lldb-unit :: Utility/Release/UtilityTests/OptionsWithRawTest.ArgsButNoLeadingDash (1830 of 2403) PASS: lldb-unit :: Utility/Release/UtilityTests/StringListTest.JoinNonSpace (1831 of 2403) PASS: lldb-unit :: Utility/Release/UtilityTests/StringExtractorTest.DecodeHexU8_Exact (1832 of 2403) PASS: lldb-unit :: Utility/Release/UtilityTests/StreamTest.PutHex64ByteOrderBig (1833 of 2403) PASS: lldb-unit :: Utility/Release/UtilityTests/ConstStringTest.CompareConstString (1834 of 2403) PASS: lldb-unit :: Utility/Release/UtilityTests/BinaryStreamTest.PutULEB128One (1835 of 2403) PASS: lldb-unit :: Utility/Release/UtilityTests/StreamTest.AddressSuffix (1836 of 2403) PASS: lldb-unit :: Utility/Release/UtilityTests/ScalarTest.CastOperations (1837 of 2403) PASS: lldb-unit :: Utility/Release/UtilityTests/ConstStringTest.NullAndEmptyStates (1838 of 2403) PASS: lldb-unit :: Utility/Release/UtilityTests/ArgsTest.TestArgv (1839 of 2403) PASS: lldb-unit :: Utility/Release/UtilityTests/BinaryStreamTest.PutSLEB128NineBytes (1840 of 2403) PASS: lldb-unit :: Process/minidump/Release/LLDBMinidumpTests/MinidumpParserTest.GetMiscInfoWindows (1841 of 2403) PASS: lldb-unit :: Process/minidump/Release/LLDBMinidumpTests/MinidumpParserTest.GetMemory (1842 of 2403) PASS: lldb-unit :: Host/Release/HostTests/File.GetStreamFromDescriptor (1843 of 2403) PASS: lldb-unit :: Utility/Release/UtilityTests/VMRange.CollectionContains (1844 of 2403) PASS: lldb-unit :: Utility/Release/UtilityTests/StringExtractorTest.GetNameColonValueNoColon (1845 of 2403) PASS: lldb-unit :: Host/Release/HostTests/MainLoopTest.TerminatesImmediately (1846 of 2403) PASS: lldb-unit :: Utility/Release/UtilityTests/BroadcasterTest.EventTypeHasListeners (1847 of 2403) PASS: lldb-unit :: Utility/Release/UtilityTests/StateTest.Formatv (1848 of 2403) PASS: lldb-unit :: Utility/Release/UtilityTests/ConstStringTest.YAML (1849 of 2403) PASS: lldb-unit :: debugserver/Release/debugserverTests/RNBSocket.LoopBackListenIPv6 (1850 of 2403) PASS: lldb-unit :: Utility/Release/UtilityTests/EventTest.DumpEventDataBytes (1851 of 2403) PASS: lldb-unit :: Utility/Release/UtilityTests/FileSpecTest.RemoveLastPathComponent (1852 of 2403) PASS: lldb-unit :: Platform/Android/Release/AdbClientTests/AdbClientTest.CreateByDeviceId_ByEnvVar (1853 of 2403) PASS: lldb-unit :: Utility/Release/UtilityTests/StringListTest.SetSize (1854 of 2403) PASS: lldb-unit :: Utility/Release/UtilityTests/SubsystemRAIITest.SubsystemWithErrorFailure (1855 of 2403) PASS: lldb-unit :: Utility/Release/UtilityTests/StreamTest.PutSLEB128 (1856 of 2403) PASS: lldb-unit :: Utility/Release/UtilityTests/SerializationRountripTest.SerializeDeserializeObjectReference (1857 of 2403) PASS: lldb-unit :: Utility/Release/UtilityTests/CompletionRequest.ShiftArguments (1858 of 2403) PASS: lldb-unit :: Utility/Release/UtilityTests/BinaryStreamTest.PutSLEB128OneByte (1859 of 2403) PASS: lldb-unit :: Utility/Release/UtilityTests/ScalarTest.GetValue (1860 of 2403) PASS: lldb-unit :: Utility/Release/UtilityTests/StringExtractorTest.GetHexBytes_Partial (1861 of 2403) PASS: lldb-unit :: Utility/Release/UtilityTests/ArgsTest.GetArgumentArrayRef (1862 of 2403) PASS: lldb-unit :: Host/Release/HostTests/SocketTests/SocketTest.TCPGetAddress/ipv6 (1863 of 2403) PASS: lldb-unit :: Utility/Release/UtilityTests/ConstStringTest.CompareStringRef (1864 of 2403) PASS: lldb-unit :: Utility/Release/UtilityTests/BroadcasterTest.BroadcastEvent (1865 of 2403) PASS: lldb-unit :: Utility/Release/UtilityTests/StringExtractorTest.GetHexU8_Extra (1866 of 2403) PASS: lldb-unit :: Utility/Release/UtilityTests/SerializationRountripTest.SerializeDeserializeCStringArrayNullptrElem (1867 of 2403) PASS: lldb-unit :: DataFormatter/Release/LLDBFormatterTests/FormatManagerTests.CompatibleLangs (1868 of 2403) PASS: lldb-unit :: Utility/Release/UtilityTests/SerializationRountripTest.SerializeDeserializeCString (1869 of 2403) PASS: lldb-unit :: Utility/Release/UtilityTests/StreamTest.ShiftOperatorPtr (1870 of 2403) PASS: lldb-unit :: Utility/Release/UtilityTests/XcodeSDKTest.SDKSupportsModules (1871 of 2403) PASS: lldb-unit :: DataFormatter/Release/LLDBFormatterTests/TypeMatcherTests.ExactName (1872 of 2403) PASS: lldb-unit :: Utility/Release/UtilityTests/StringListTest.DefaultConstructor (1873 of 2403) PASS: lldb-unit :: Host/Release/HostTests/SocketTests/SocketTest.TCPListen0GetPort/ipv4 (1874 of 2403) PASS: lldb-unit :: Utility/Release/UtilityTests/TimeoutTest.Format (1875 of 2403) PASS: lldb-unit :: Utility/Release/UtilityTests/AnsiTerminal.Unknown (1876 of 2403) PASS: lldb-unit :: Utility/Release/UtilityTests/StringLexerTest.Peek (1877 of 2403) PASS: lldb-unit :: Utility/Release/UtilityTests/StringListTest.LongestCommonPrefixNoPrefix (1878 of 2403) PASS: lldb-unit :: SymbolFile/NativePDB/Release/SymbolFileNativePDBTests/PDBFPOProgramToDWARFExpressionTests.MultipleIndependentAssignments (1879 of 2403) PASS: lldb-unit :: Utility/Release/UtilityTests/ArgsTest.ReplaceArgumentAtIndexEqual (1880 of 2403) PASS: lldb-unit :: Utility/Release/UtilityTests/ScalarTest.SetValueFromData (1881 of 2403) PASS: lldb-unit :: Utility/Release/UtilityTests/SubsystemRAIITest.NormalSubsystem (1882 of 2403) PASS: lldb-unit :: Utility/Release/UtilityTests/ArgsTest.TestUnknownEscape (1883 of 2403) PASS: lldb-unit :: Utility/Release/UtilityTests/ArchSpecTest.TestParseMachCPUDashSubtypeTripleExtra (1884 of 2403) PASS: lldb-unit :: Utility/Release/UtilityTests/BinaryStreamTest.PutSLEB128SixBytes (1885 of 2403) PASS: lldb-unit :: Utility/Release/UtilityTests/StringLexerTest.NextIf (1886 of 2403) PASS: lldb-unit :: Utility/Release/UtilityTests/ArgsTest.TestQuotedTrailingBackslash (1887 of 2403) PASS: lldb-unit :: Utility/Release/UtilityTests/StringLexerTest.NextIfList (1888 of 2403) PASS: lldb-unit :: Utility/Release/UtilityTests/EnvironmentTest.EnvpConstruction (1889 of 2403) PASS: lldb-unit :: Utility/Release/UtilityTests/StringListTest.InsertStringAtIndexOutOfBounds (1890 of 2403) PASS: lldb-unit :: Utility/Release/UtilityTests/RangeTest.ContainsAddr (1891 of 2403) PASS: lldb-unit :: Utility/Release/UtilityTests/StreamTest.PutChar (1892 of 2403) PASS: lldb-unit :: Utility/Release/UtilityTests/ProcessInfoTest.Constructor (1893 of 2403) PASS: lldb-unit :: Utility/Release/UtilityTests/ConstStringTest.format_provider (1894 of 2403) PASS: lldb-unit :: Core/Release/LLDBCoreTests/RichManglingContextTest.Basic (1895 of 2403) PASS: lldb-unit :: Utility/Release/UtilityTests/RangeTest.EqualInvalid (1896 of 2403) PASS: lldb-unit :: Utility/Release/UtilityTests/StreamTest.PutHex32ByteOrderLittle (1897 of 2403) PASS: lldb-unit :: Host/Release/HostTests/NativeProcessProtocolTest.SetBreakpointFailRead (1898 of 2403) PASS: lldb-unit :: Utility/Release/UtilityTests/DataExtractorTest.GetSLEB128_bit63 (1899 of 2403) PASS: lldb-unit :: Utility/Release/UtilityTests/StringLexerTest.AdvanceIf (1900 of 2403) PASS: lldb-unit :: Utility/Release/UtilityTests/UriParserTest.SchemeHostSeparator4 (1901 of 2403) PASS: lldb-unit :: Utility/Release/UtilityTests/RangeTest.Slide (1902 of 2403) PASS: lldb-unit :: Utility/Release/UtilityTests/StreamTest.QuotedCString (1903 of 2403) PASS: lldb-unit :: Utility/Release/UtilityTests/ArgsTest.ReplaceArgumentAtIndexLonger (1904 of 2403) PASS: lldb-unit :: Utility/Release/UtilityTests/RangeTest.Copy (1905 of 2403) PASS: lldb-unit :: Utility/Release/UtilityTests/OptionsWithRawTest.SingleWhitespaceInput (1906 of 2403) PASS: lldb-unit :: Process/minidump/Release/LLDBMinidumpTests/MinidumpParserTest.GetMemoryRegionInfoLinuxMaps (1907 of 2403) PASS: lldb-unit :: Utility/Release/UtilityTests/LogChannelEnabledTest.LogGetLogThread (1908 of 2403) PASS: lldb-unit :: Utility/Release/UtilityTests/StringListTest.ShiftStdString (1909 of 2403) PASS: lldb-unit :: Utility/Release/UtilityTests/LogChannelTest.Disable (1910 of 2403) PASS: lldb-unit :: Utility/Release/UtilityTests/RegisterValueTest.GetSet8 (1911 of 2403) PASS: lldb-unit :: Process/gdb-remote/Release/ProcessGdbRemoteTests/GDBRemoteCommunicationServerTest.SendErrorResponse_ErrorNumber (1912 of 2403) PASS: lldb-unit :: Process/minidump/Release/LLDBMinidumpTests/MinidumpParserTest.MinidumpDuplicateModuleMappedFirst (1913 of 2403) PASS: lldb-unit :: Utility/Release/UtilityTests/StringLexerTest.Next (1914 of 2403) PASS: lldb-unit :: Utility/Release/UtilityTests/NameMatchesTest.Contains (1915 of 2403) PASS: lldb-unit :: Utility/Release/UtilityTests/OptionsWithRawTest.UnterminatedQuote (1916 of 2403) PASS: lldb-unit :: Utility/Release/UtilityTests/StreamTest.PutMaxHex64ByteOrderLittle (1917 of 2403) PASS: lldb-unit :: Utility/Release/UtilityTests/ArgsTest.ReplaceArgumentAtIndexFarOutOfRange (1918 of 2403) PASS: lldb-unit :: Utility/Release/UtilityTests/DataExtractorTest.GetCStrEmpty (1919 of 2403) PASS: lldb-unit :: Process/minidump/Release/LLDBMinidumpTests/MinidumpParserTest.MinidumpDuplicateModuleMappedSecondHigh (1920 of 2403) PASS: lldb-unit :: Utility/Release/UtilityTests/UriParserTest.Empty (1921 of 2403) PASS: lldb-unit :: Utility/Release/UtilityTests/UriParserTest.BadPort2 (1922 of 2403) PASS: lldb-unit :: Utility/Release/UtilityTests/StringExtractorTest.GetNameColonValueNoSemicolon (1923 of 2403) PASS: lldb-unit :: Utility/Release/UtilityTests/RangeTest.ContainsEndInclusive (1924 of 2403) PASS: lldb-unit :: Utility/Release/UtilityTests/DataExtractorTest.GetCStr (1925 of 2403) PASS: lldb-unit :: Utility/Release/UtilityTests/StringListTest.ShiftCString (1926 of 2403) PASS: lldb-unit :: Utility/Release/UtilityTests/FileSpecTest.GetPath (1927 of 2403) PASS: lldb-unit :: Utility/Release/UtilityTests/ArchSpecTest.Compatibility (1928 of 2403) PASS: lldb-unit :: Utility/Release/UtilityTests/ScalarTest.ComparisonFloat (1929 of 2403) PASS: lldb-unit :: Utility/Release/UtilityTests/StreamTest.PutNHex8 (1930 of 2403) PASS: lldb-unit :: Host/Release/HostTests/SocketTests/SocketTest.DecodeHostAndPort/ipv6 (1931 of 2403) PASS: lldb-unit :: Utility/Release/UtilityTests/ArchSpecTest.MergeFrom (1932 of 2403) PASS: lldb-unit :: Host/Release/HostTests/HostInfoTest.GetHostname (1933 of 2403) PASS: lldb-unit :: Host/Release/HostTests/FileSystemTest.EnumerateDirectory (1934 of 2403) PASS: lldb-unit :: Utility/Release/UtilityTests/StringListTest.GetMaxStringLengthMixed (1935 of 2403) PASS: lldb-unit :: Process/minidump/Release/LLDBMinidumpTests/MinidumpParserTest.GetMemoryRegionInfo (1936 of 2403) PASS: lldb-unit :: Utility/Release/UtilityTests/ScalarTest.Comparison (1937 of 2403) PASS: lldb-unit :: Utility/Release/UtilityTests/StringExtractorTest.GetHexU8_Underflow2_NoEof (1938 of 2403) PASS: lldb-unit :: Utility/Release/UtilityTests/ArchSpecTest.TripleComponentsWereSpecified (1939 of 2403) PASS: lldb-unit :: Utility/Release/UtilityTests/StringExtractorTest.GetU64LittleEndian (1940 of 2403) PASS: lldb-unit :: Utility/Release/UtilityTests/BinaryStreamTest.PutSLEB128One (1941 of 2403) PASS: lldb-unit :: Utility/Release/UtilityTests/RangeTest.ContainsEndInclusiveInvalid (1942 of 2403) PASS: lldb-unit :: Core/Release/LLDBCoreTests/SourceFileCache.FindSourceFileNotFound (1943 of 2403) PASS: lldb-unit :: ObjectFile/Breakpad/Release/ObjectFileBreakpadTests/FileRecord.parse (1944 of 2403) PASS: lldb-unit :: Utility/Release/UtilityTests/StringListTest.JoinSingle (1945 of 2403) PASS: lldb-unit :: Utility/Release/UtilityTests/StreamTeeTest.GetStreamAtIndexOutOfBounds (1946 of 2403) PASS: lldb-unit :: Utility/Release/UtilityTests/VMRange.ContainsRange (1947 of 2403) PASS: lldb-unit :: Utility/Release/UtilityTests/StreamTest.PutHex32ByteOrderBig (1948 of 2403) PASS: lldb-unit :: Utility/Release/UtilityTests/FileSpecTest.IsRelative (1949 of 2403) PASS: lldb-unit :: Utility/Release/UtilityTests/DataExtractorTest.GetFloatUnaligned (1950 of 2403) PASS: lldb-unit :: Utility/Release/UtilityTests/CompletionRequest.TryCompleteCurrentArgGood (1951 of 2403) PASS: lldb-unit :: Utility/Release/UtilityTests/ArchSpecTest.YAML (1952 of 2403) PASS: lldb-unit :: Utility/Release/UtilityTests/StringExtractorGDBRemoteTest.GetPidTid (1953 of 2403) PASS: lldb-unit :: Utility/Release/UtilityTests/StringListTest.SplitIntoLinesSingleTrailingCR (1954 of 2403) PASS: lldb-unit :: Utility/Release/UtilityTests/StringExtractorTest.GetHexBytesAvail_OddPair (1955 of 2403) PASS: lldb-unit :: Utility/Release/UtilityTests/StreamTest.PutHex16ByteOrderLittle (1956 of 2403) PASS: lldb-unit :: Utility/Release/UtilityTests/StringListTest.CopyListEmpty (1957 of 2403) PASS: lldb-unit :: Utility/Release/UtilityTests/ArgsTest.TestMultipleArgs (1958 of 2403) PASS: lldb-unit :: Utility/Release/UtilityTests/VMRange.Ordering (1959 of 2403) PASS: lldb-unit :: Utility/Release/UtilityTests/NameMatchesTest.RegularExpression (1960 of 2403) PASS: lldb-unit :: Host/Release/HostTests/SocketTests/SocketTest.TCPGetConnectURI/ipv4 (1961 of 2403) PASS: lldb-unit :: Utility/Release/UtilityTests/StringExtractorTest.GetHexBytes (1962 of 2403) PASS: lldb-unit :: Utility/Release/UtilityTests/StringExtractorTest.InitEmpty (1963 of 2403) PASS: lldb-unit :: Utility/Release/UtilityTests/AnsiTerminal.Basic (1964 of 2403) PASS: lldb-unit :: Utility/Release/UtilityTests/SubsystemRAIITest.SubsystemWithErrorSuccess (1965 of 2403) PASS: lldb-unit :: Utility/Release/UtilityTests/AnsiTerminal.WhiteSpace (1966 of 2403) PASS: lldb-unit :: Utility/Release/UtilityTests/StringListTest.LongestCommonPrefixDuplicateElement (1967 of 2403) PASS: lldb-unit :: Utility/Release/UtilityTests/ArgsTest.TestTrailingBackslash (1968 of 2403) PASS: lldb-unit :: Utility/Release/UtilityTests/StreamTest.PutRawBytesToBigEndian (1969 of 2403) PASS: lldb-unit :: Utility/Release/UtilityTests/StringExtractorTest.GetHexBytesAvail_Underflow (1970 of 2403) PASS: lldb-unit :: Core/Release/LLDBCoreTests/SourceLocationSpecTest.Compare (1971 of 2403) PASS: lldb-unit :: Core/Release/LLDBCoreTests/SourceLocationSpecTest.FileLineColumnComponents (1972 of 2403) PASS: lldb-unit :: Utility/Release/UtilityTests/Flags.Test (1973 of 2403) PASS: lldb-unit :: Utility/Release/UtilityTests/DataExtractorTest.GetFloat (1974 of 2403) PASS: lldb-unit :: Utility/Release/UtilityTests/StringListTest.CopyList (1975 of 2403) PASS: lldb-unit :: Utility/Release/UtilityTests/StringListTest.SplitIntoLines (1976 of 2403) PASS: lldb-unit :: Utility/Release/UtilityTests/StreamTest.AddressRangeSize (1977 of 2403) PASS: lldb-unit :: Utility/Release/UtilityTests/StreamTeeTest.GetStreamAtIndexOutOfBoundsEmpty (1978 of 2403) PASS: lldb-unit :: Process/gdb-remote/Release/ProcessGdbRemoteTests/PortMapTest.AllowPort (1979 of 2403) PASS: lldb-unit :: Process/minidump/Release/LLDBMinidumpTests/MinidumpParserTest.GetMemoryRegionInfoFromMemory64List (1980 of 2403) PASS: lldb-unit :: Utility/Release/UtilityTests/FileSpecTest.EqualSeparator (1981 of 2403) PASS: lldb-unit :: Process/minidump/Release/LLDBMinidumpTests/RegisterContextMinidump.ConvertMinidumpContext_x86_64 (1982 of 2403) PASS: lldb-unit :: Utility/Release/UtilityTests/ArgsTest.BareSingleQuote (1983 of 2403) PASS: lldb-unit :: Utility/Release/UtilityTests/DataExtractorTest.GetULEB128_bit63 (1984 of 2403) PASS: lldb-unit :: Utility/Release/UtilityTests/UriParserTest.BracketedHostnameWithPortIPv6 (1985 of 2403) PASS: lldb-unit :: Utility/Release/UtilityTests/CompletionRequest.DuplicateFiltering (1986 of 2403) PASS: lldb-unit :: Utility/Release/UtilityTests/RangeTest.DoesIntersect (1987 of 2403) PASS: lldb-unit :: Utility/Release/UtilityTests/StringListTest.AppendStringMove (1988 of 2403) PASS: lldb-unit :: Utility/Release/UtilityTests/StreamTest.AddressSize (1989 of 2403) PASS: lldb-unit :: Host/Release/HostTests/SocketTests/SocketTest.UDPGetConnectURI/ipv6 (1990 of 2403) PASS: lldb-unit :: Utility/Release/UtilityTests/FileSpecTest.CopyByAppendingPathComponent (1991 of 2403) PASS: lldb-unit :: Utility/Release/UtilityTests/UUIDTest.StringConverion (1992 of 2403) PASS: lldb-unit :: Utility/Release/UtilityTests/VASprintfTest.BufferResize (1993 of 2403) PASS: lldb-unit :: Utility/Release/UtilityTests/SerializationRountripTest.SerializeDeserializeCStringArrayNullptr (1994 of 2403) PASS: lldb-unit :: Utility/Release/UtilityTests/StringListTest.ForRangeEmpty (1995 of 2403) PASS: lldb-unit :: Utility/Release/UtilityTests/RangeDataVector.FindEntryIndexesThatContain_Overlap (1996 of 2403) PASS: lldb-unit :: Utility/Release/UtilityTests/ArgsTest.TestInsertArg (1997 of 2403) PASS: lldb-unit :: Utility/Release/UtilityTests/SerializationRountripTest.SerializeDeserializeObjectPointer (1998 of 2403) PASS: lldb-unit :: Utility/Release/UtilityTests/RegularExpression.CopyAssignment (1999 of 2403) PASS: lldb-unit :: Utility/Release/UtilityTests/VMRange.IsValid (2000 of 2403) PASS: lldb-unit :: Utility/Release/UtilityTests/StringListTest.InsertStringAtIndexStdString (2001 of 2403) PASS: lldb-unit :: Utility/Release/UtilityTests/NameMatchesTest.StartsWith (2002 of 2403) PASS: lldb-unit :: debugserver/Release/debugserverTests/JSON.Parse (2003 of 2403) PASS: lldb-unit :: SymbolFile/NativePDB/Release/SymbolFileNativePDBTests/PDBFPOProgramToDWARFExpressionTests.UnknownOp (2004 of 2403) PASS: lldb-unit :: Process/Utility/Release/ProcessUtilityTests/ProcMapTests/LinuxProcMapsTestFixture.ParseMapRegions/0 (2005 of 2403) PASS: lldb-unit :: Utility/Release/UtilityTests/StringListTest.AppendList (2006 of 2403) PASS: lldb-unit :: Utility/Release/UtilityTests/BinaryStreamTest.PutULEB128MaxValue (2007 of 2403) PASS: lldb-unit :: Utility/Release/UtilityTests/ScalarTest.Scalar_512 (2008 of 2403) PASS: lldb-unit :: Utility/Release/UtilityTests/Flags.GetBitSize (2009 of 2403) PASS: lldb-unit :: Host/Release/HostTests/SocketTests/SocketTest.TCPListen0GetPort/ipv6 (2010 of 2403) PASS: lldb-unit :: Utility/Release/UtilityTests/DataExtractorTest.PeekData (2011 of 2403) PASS: lldb-unit :: Utility/Release/UtilityTests/FileSpecTest.EqualDotsPosix (2012 of 2403) PASS: lldb-unit :: Utility/Release/UtilityTests/SerializationRountripTest.SerializeDeserializeCStringNull (2013 of 2403) PASS: lldb-unit :: Utility/Release/UtilityTests/StringExtractorTest.DecodeHexU8_InvalidHex (2014 of 2403) PASS: lldb-unit :: Utility/Release/UtilityTests/BinaryStreamTest.PutSLEB128ThreeBytes (2015 of 2403) PASS: lldb-unit :: Utility/Release/UtilityTests/StringExtractorTest.GetHexU8_InvalidHex (2016 of 2403) PASS: lldb-unit :: Host/Release/HostTests/FileSystemTest.GetByteSize (2017 of 2403) PASS: lldb-unit :: Language/CPlusPlus/Release/LanguageCPlusPlusTests/CPlusPlusLanguage.CPlusPlusNameParser (2018 of 2403) PASS: lldb-unit :: Utility/Release/UtilityTests/StreamTest.Indent (2019 of 2403) PASS: lldb-unit :: Utility/Release/UtilityTests/BinaryStreamTest.PutULEB128SevenBytes (2020 of 2403) PASS: lldb-unit :: Utility/Release/UtilityTests/StreamTest.PutHex16ByteOrderBig (2021 of 2403) PASS: lldb-unit :: Utility/Release/UtilityTests/UUIDTest.SetFromStringRef (2022 of 2403) PASS: lldb-unit :: Utility/Release/UtilityTests/StreamTest.PutBytesAsRawHex8ToMixedEndian (2023 of 2403) PASS: lldb-unit :: Utility/Release/UtilityTests/StringExtractorTest.GetHexBytesAvail (2024 of 2403) PASS: lldb-unit :: ObjectFile/Breakpad/Release/ObjectFileBreakpadTests/ModuleRecord.parse (2025 of 2403) PASS: lldb-unit :: Utility/Release/UtilityTests/FileSpecTest.FileAndDirectoryComponents (2026 of 2403) PASS: lldb-unit :: Process/minidump/Release/LLDBMinidumpTests/MinidumpParserTest.MinidumpDuplicateModuleMinAddress (2027 of 2403) PASS: lldb-unit :: Utility/Release/UtilityTests/ArgsTest.TestSingleArgWithQuotedSpace (2028 of 2403) PASS: lldb-unit :: Utility/Release/UtilityTests/StructuredDataTest.ParseJSONFromFile (2029 of 2403) PASS: lldb-unit :: Utility/Release/UtilityTests/StructuredDataTest.StringDump (2030 of 2403) PASS: lldb-unit :: Host/Release/HostTests/HostInfoTestInitialization.InitTwice (2031 of 2403) PASS: lldb-unit :: Host/Release/HostTests/PipeTest.OpenAsReader (2032 of 2403) PASS: lldb-unit :: Utility/Release/UtilityTests/RangeTest.DoesAdjoinOrIntersect (2033 of 2403) PASS: lldb-unit :: Utility/Release/UtilityTests/StringLexerTest.GetUnlexed (2034 of 2403) PASS: lldb-unit :: Utility/Release/UtilityTests/RangeVector.CombineConsecutiveRanges (2035 of 2403) PASS: lldb-unit :: Utility/Release/UtilityTests/StreamTeeTest.SetStreamAtIndexOverwrite (2036 of 2403) PASS: lldb-unit :: Utility/Release/UtilityTests/ConstStringTest.FromMidOfBufferStringRef (2037 of 2403) PASS: lldb-unit :: Utility/Release/UtilityTests/StringListTest.AppendStringCString (2038 of 2403) PASS: lldb-unit :: Utility/Release/UtilityTests/OptionsWithRawTest.QuotedSuffix (2039 of 2403) PASS: lldb-unit :: Utility/Release/UtilityTests/XcodeSDKTest.MergeTest (2040 of 2403) PASS: lldb-unit :: Utility/Release/UtilityTests/StringLexerTest.HasAtLeast (2041 of 2403) PASS: lldb-unit :: Utility/Release/UtilityTests/LogChannelTest.List (2042 of 2403) PASS: lldb-unit :: Process/Utility/Release/ProcessUtilityTests/MemoryTagManagerAArch64MTETest.PackTags (2043 of 2403) PASS: lldb-unit :: Utility/Release/UtilityTests/BinaryStreamTest.PutULEB128TwoBytes (2044 of 2403) PASS: lldb-unit :: Host/Release/HostTests/FileSystemTest.OpenErrno (2045 of 2403) PASS: lldb-unit :: Utility/Release/UtilityTests/ScalarTest.ExtractBitfield (2046 of 2403) PASS: lldb-unit :: Utility/Release/UtilityTests/LogTest.LLDB_LOG_nullptr (2047 of 2403) PASS: lldb-unit :: Utility/Release/UtilityTests/StreamTest.PutULEB128 (2048 of 2403) PASS: lldb-unit :: Utility/Release/UtilityTests/StringExtractorTest.GetHexBytes_Underflow (2049 of 2403) PASS: lldb-unit :: Utility/Release/UtilityTests/OptionsWithRawTest.EmptySuffixSingleWhitespace (2050 of 2403) PASS: lldb-unit :: Core/Release/LLDBCoreTests/SourceLocationSpecTest.OperatorBool (2051 of 2403) PASS: lldb-unit :: DataFormatter/Release/LLDBFormatterTests/TypeMatcherTests.CreatedBySameMatchString (2052 of 2403) PASS: lldb-unit :: Utility/Release/UtilityTests/UriParserTest.SchemeHostSeparator2 (2053 of 2403) PASS: lldb-unit :: Host/Release/HostTests/SocketTests/SocketTest.DomainGetConnectURI/ipv4 (2054 of 2403) PASS: lldb-unit :: Utility/Release/UtilityTests/DataExtractorTest.GetCStrAtNullOffset (2055 of 2403) PASS: lldb-unit :: Utility/Release/UtilityTests/StringListTest.InsertStringAtIndexMove (2056 of 2403) PASS: lldb-unit :: Utility/Release/UtilityTests/PassiveReplayTest.InstrumentedBar (2057 of 2403) PASS: lldb-unit :: Utility/Release/UtilityTests/SharedCluster.ClusterManager (2058 of 2403) PASS: lldb-unit :: Utility/Release/UtilityTests/DataExtractorTest.GetDouble (2059 of 2403) PASS: lldb-unit :: Utility/Release/UtilityTests/ArgsTest.TestSingleArg (2060 of 2403) PASS: lldb-unit :: Utility/Release/UtilityTests/ArgsTest.TestSingleQuotedArgWithSpace (2061 of 2403) PASS: lldb-unit :: Utility/Release/UtilityTests/ProcessInstanceInfoList.Yaml (2062 of 2403) PASS: lldb-unit :: Utility/Release/UtilityTests/Flags.AllClear (2063 of 2403) PASS: lldb-unit :: Utility/Release/UtilityTests/FileSpecTest.Yaml (2064 of 2403) PASS: lldb-unit :: Utility/Release/UtilityTests/FileSpecTest.GuessPathStyle (2065 of 2403) PASS: lldb-unit :: Utility/Release/UtilityTests/BinaryStreamTest.PutULEB128FourBytes (2066 of 2403) PASS: lldb-unit :: Utility/Release/UtilityTests/StreamTest.PutCharNull (2067 of 2403) PASS: lldb-unit :: Core/Release/LLDBCoreTests/DumpDataExtractorTest.NullStream (2068 of 2403) PASS: lldb-unit :: Utility/Release/UtilityTests/StringExtractorTest.DecodeHexU8_Underflow2 (2069 of 2403) PASS: lldb-unit :: Utility/Release/UtilityTests/StringListTest.JoinThree (2070 of 2403) PASS: lldb-unit :: Utility/Release/UtilityTests/RangeTest.SlideZero (2071 of 2403) PASS: lldb-unit :: Utility/Release/UtilityTests/BinaryStreamTest.PutULEB128FiveBytes (2072 of 2403) PASS: lldb-unit :: Process/Utility/Release/ProcessUtilityTests/MemoryTagManagerAArch64MTETest.MakeTaggedRange (2073 of 2403) PASS: lldb-unit :: SymbolFile/NativePDB/Release/SymbolFileNativePDBTests/PDBFPOProgramToDWARFExpressionTests.InvalidOpUnary (2074 of 2403) PASS: lldb-unit :: Core/Release/LLDBCoreTests/MangledTest.EmptyForInvalidRustV0Name (2075 of 2403) PASS: lldb-unit :: Utility/Release/UtilityTests/DataExtractorTest.GetMaxU64 (2076 of 2403) PASS: lldb-unit :: Utility/Release/UtilityTests/Flags.IsClear (2077 of 2403) PASS: lldb-unit :: Utility/Release/UtilityTests/Flags.Clear (2078 of 2403) PASS: lldb-unit :: Utility/Release/UtilityTests/ProcessInstanceInfo.Dump (2079 of 2403) PASS: lldb-unit :: Process/Utility/Release/ProcessUtilityTests/MemoryTagManagerAArch64MTETest.ExpandToGranule (2080 of 2403) PASS: lldb-unit :: Host/Release/HostTests/SocketTests/SocketTest.UDPConnect/ipv6 (2081 of 2403) PASS: lldb-unit :: Core/Release/LLDBCoreTests/MangledTest.EmptyForInvalidName (2082 of 2403) PASS: lldb-unit :: Utility/Release/UtilityTests/StringListTest.Assignment (2083 of 2403) PASS: lldb-unit :: Utility/Release/UtilityTests/UriParserTest.BracketedHostnameWithPortIPv4 (2084 of 2403) PASS: lldb-unit :: Utility/Release/UtilityTests/ArgsTest.EscapeLLDBCommandArgument (2085 of 2403) PASS: lldb-unit :: Utility/Release/UtilityTests/StringExtractorTest.GetHexBytes_OddPair (2086 of 2403) PASS: lldb-unit :: Utility/Release/UtilityTests/StatusTest.Formatv (2087 of 2403) PASS: lldb-unit :: Utility/Release/UtilityTests/LogTest.Unregister (2088 of 2403) PASS: lldb-unit :: Utility/Release/UtilityTests/CompletionRequest.TryCompleteCurrentArgBad (2089 of 2403) PASS: lldb-unit :: Process/gdb-remote/Release/ProcessGdbRemoteTests/GDBRemoteCommunicationServerTest.SendErrorResponse_UnimplementedError (2090 of 2403) PASS: lldb-unit :: Utility/Release/UtilityTests/SerializationRountripTest.SerializeDeserializePodPointers (2091 of 2403) PASS: lldb-unit :: Utility/Release/UtilityTests/StringListTest.PopBack (2092 of 2403) PASS: lldb-unit :: Utility/Release/UtilityTests/SerializationRountripTest.SerializeDeserializePodReferences (2093 of 2403) PASS: lldb-unit :: Host/Release/HostTests/FileSystemTest.Resolve (2094 of 2403) PASS: lldb-unit :: DataFormatter/Release/LLDBFormatterTests/TypeMatcherTests.CreatedBySameMatchStringExactNamePrefixes (2095 of 2403) PASS: lldb-unit :: Utility/Release/UtilityTests/UriParserTest.MinimalPortPath (2096 of 2403) PASS: lldb-unit :: Utility/Release/UtilityTests/DataExtractorTest.GetMaxS64 (2097 of 2403) PASS: lldb-unit :: Utility/Release/UtilityTests/Flags.Reset (2098 of 2403) PASS: lldb-unit :: Utility/Release/UtilityTests/StringListTest.InsertStringAtIndexEnd (2099 of 2403) PASS: lldb-unit :: Utility/Release/UtilityTests/VMRange.Comparison (2100 of 2403) PASS: lldb-unit :: Process/Utility/Release/ProcessUtilityTests/ProcSMapTests/LinuxProcSMapsTestFixture.ParseSMapRegions/8 (2101 of 2403) PASS: lldb-unit :: Host/Release/HostTests/NativeProcessProtocolTest.ReadCStringFromMemory (2102 of 2403) PASS: lldb-unit :: Utility/Release/UtilityTests/StringListTest.GetMaxStringLengthIncreasingSize (2103 of 2403) PASS: lldb-unit :: Utility/Release/UtilityTests/UriParserTest.PortOverflow (2104 of 2403) PASS: lldb-unit :: Utility/Release/UtilityTests/OptionsWithRawTest.SingleWordSuffix (2105 of 2403) PASS: lldb-unit :: Utility/Release/UtilityTests/StreamTeeTest.DefaultConstructor (2106 of 2403) PASS: lldb-unit :: Utility/Release/UtilityTests/LogChannelEnabledTest.log_options (2107 of 2403) PASS: lldb-unit :: Host/Release/HostTests/FileSystemTest.Exists (2108 of 2403) PASS: lldb-unit :: Process/gdb-remote/Release/ProcessGdbRemoteTests/PortMapTest.Constructors (2109 of 2403) PASS: lldb-unit :: Host/Release/HostTests/SocketTests/SocketTest.UDPConnect/ipv4 (2110 of 2403) PASS: lldb-unit :: Utility/Release/UtilityTests/StreamTest.ChangingByteOrder (2111 of 2403) PASS: lldb-unit :: Process/Utility/Release/ProcessUtilityTests/ProcSMapTests/LinuxProcSMapsTestFixture.ParseSMapRegions/0 (2112 of 2403) PASS: lldb-unit :: Host/Release/HostTests/SocketTests/SocketTest.DomainGetConnectURI/ipv6 (2113 of 2403) PASS: lldb-unit :: Utility/Release/UtilityTests/BinaryStreamTest.PutSLEB128TwoBytes (2114 of 2403) PASS: lldb-unit :: Host/Release/HostTests/ProcessLaunchInfoTest.Constructor (2115 of 2403) PASS: lldb-unit :: Utility/Release/UtilityTests/ScalarTest.GetBytes (2116 of 2403) PASS: lldb-unit :: Host/Release/HostTests/ConnectionFileDescriptorTest.TCPGetURIv4 (2117 of 2403) PASS: lldb-unit :: Utility/Release/UtilityTests/FileSpecTest.Equal (2118 of 2403) PASS: lldb-unit :: Utility/Release/UtilityTests/ArgsTest.GetQuotedCommandString (2119 of 2403) PASS: lldb-unit :: Utility/Release/UtilityTests/AnsiTerminal.AtEnd (2120 of 2403) PASS: lldb-unit :: Utility/Release/UtilityTests/TimeoutTest.Construction (2121 of 2403) PASS: lldb-unit :: Host/Release/HostTests/Host.GetEnvironment (2122 of 2403) PASS: lldb-unit :: Utility/Release/UtilityTests/BinaryStreamTest.PutSLEB128FourBytes (2123 of 2403) PASS: lldb-unit :: Utility/Release/UtilityTests/StringExtractorTest.GetHexU8_Extra_NoEof (2124 of 2403) PASS: lldb-unit :: Core/Release/LLDBCoreTests/RichManglingContextTest.SwitchProvider (2125 of 2403) PASS: lldb-unit :: Utility/Release/UtilityTests/ArgsTest.ReplaceArgumentAtIndexOutOfRange (2126 of 2403) PASS: lldb-unit :: Core/Release/LLDBCoreTests/FormatEntityTest.DefinitionConstructionNameAndType (2127 of 2403) PASS: lldb-unit :: Utility/Release/UtilityTests/CompletionRequest.TryCompleteCurrentArgMode (2128 of 2403) PASS: lldb-unit :: SymbolFile/NativePDB/Release/SymbolFileNativePDBTests/PDBFPOProgramToDWARFExpressionTests.DependencyChain (2129 of 2403) PASS: lldb-unit :: Process/Utility/Release/ProcessUtilityTests/ProcSMapTests/LinuxProcSMapsTestFixture.ParseSMapRegions/6 (2130 of 2403) PASS: lldb-unit :: Utility/Release/UtilityTests/SerializationRountripTest.SerializeDeserializeCStringArray (2131 of 2403) PASS: lldb-unit :: Utility/Release/UtilityTests/OptionsWithRawTest.LeadingSpaceArgs (2132 of 2403) PASS: lldb-unit :: Host/Release/HostTests/SocketTests/SocketTest.UDPGetConnectURI/ipv4 (2133 of 2403) PASS: lldb-unit :: Utility/Release/UtilityTests/StringExtractorTest.GetHexU8_Underflow (2134 of 2403) PASS: lldb-unit :: Utility/Release/UtilityTests/BinaryStreamTest.PutSLEB128Zero (2135 of 2403) PASS: lldb-unit :: Breakpoint/Release/LLDBBreakpointTests/BreakpointIDTest.StringIsBreakpointName (2136 of 2403) PASS: lldb-unit :: Process/Utility/Release/ProcessUtilityTests/ProcMapTests/LinuxProcMapsTestFixture.ParseMapRegions/6 (2137 of 2403) PASS: lldb-unit :: Language/CPlusPlus/Release/LanguageCPlusPlusTests/CPlusPlusLanguage.MethodNameParsing (2138 of 2403) PASS: lldb-unit :: Utility/Release/UtilityTests/StreamTest.PutCStringWithStringRef (2139 of 2403) PASS: lldb-unit :: Utility/Release/UtilityTests/BinaryStreamTest.PutULEB128NineBytes (2140 of 2403) PASS: lldb-unit :: Utility/Release/UtilityTests/NameMatchesTest.Equals (2141 of 2403) PASS: lldb-unit :: Utility/Release/UtilityTests/StreamTest.AddressEmptyPrefix (2142 of 2403) PASS: lldb-unit :: Process/minidump/Release/LLDBMinidumpTests/MinidumpParserTest.GetArchitecture (2143 of 2403) PASS: lldb-unit :: Process/Utility/Release/ProcessUtilityTests/MemoryTagManagerAArch64MTETest.RepeatTagsForRange (2144 of 2403) PASS: lldb-unit :: Utility/Release/UtilityTests/StreamTest.ShiftOperatorChars (2145 of 2403) PASS: lldb-unit :: Utility/Release/UtilityTests/ArchSpecTest.OperatorBool (2146 of 2403) PASS: lldb-unit :: Utility/Release/UtilityTests/StreamTest.PutRawBytesToMixedEndian (2147 of 2403) PASS: lldb-unit :: Utility/Release/UtilityTests/RangeTest.LessThan (2148 of 2403) PASS: lldb-unit :: Utility/Release/UtilityTests/NameMatchesTest.Ignore (2149 of 2403) PASS: lldb-unit :: Utility/Release/UtilityTests/VMRange.Clear (2150 of 2403) PASS: lldb-unit :: Process/Utility/Release/ProcessUtilityTests/ProcSMapTests/LinuxProcSMapsTestFixture.ParseSMapRegions/1 (2151 of 2403) PASS: lldb-unit :: Utility/Release/UtilityTests/RangeTest.Constructor (2152 of 2403) PASS: lldb-unit :: Host/Release/HostTests/SocketTests/SocketTest.DomainListenConnectAccept/ipv4 (2153 of 2403) PASS: lldb-unit :: Interpreter/Release/InterpreterTests/OptionArgParserTest.toBoolean (2154 of 2403) PASS: lldb-unit :: Host/Release/HostTests/PipeTest.CreateWithUniqueName (2155 of 2403) PASS: lldb-unit :: Core/Release/LLDBCoreTests/FormatEntityTest.DefinitionConstructionNameAndString (2156 of 2403) PASS: lldb-unit :: Process/minidump/Release/LLDBMinidumpTests/RegisterContextMinidump.ConvertMinidumpContext_x86_32 (2157 of 2403) PASS: lldb-unit :: Utility/Release/UtilityTests/StreamTest.AddressRange (2158 of 2403) PASS: lldb-unit :: DataFormatter/Release/LLDBFormatterTests/StringPrinterTests.CxxASCII (2159 of 2403) PASS: lldb-unit :: Utility/Release/UtilityTests/ArgsTest.AppendArguments (2160 of 2403) PASS: lldb-unit :: Utility/Release/UtilityTests/StringExtractorTest.DecodeHexU8_Extra (2161 of 2403) PASS: lldb-unit :: Utility/Release/UtilityTests/UriParserTest.TypicalPortPathIPv4 (2162 of 2403) PASS: lldb-unit :: Core/Release/LLDBCoreTests/DumpDataExtractorTest.MultiLine (2163 of 2403) PASS: lldb-unit :: Signals/Release/SignalsTests/UnixSignalsTest.Iteration (2164 of 2403) PASS: lldb-unit :: SymbolFile/NativePDB/Release/SymbolFileNativePDBTests/PDBFPOProgramToDWARFExpressionTests.MissingTargetRegister (2165 of 2403) PASS: lldb-unit :: Host/Release/HostTests/Host.WaitStatusFormat (2166 of 2403) PASS: lldb-unit :: Utility/Release/UtilityTests/UriParserTest.MinimalPort (2167 of 2403) PASS: lldb-unit :: Utility/Release/UtilityTests/ArgsTest.ReplaceArgumentAtIndexShort (2168 of 2403) PASS: lldb-unit :: Utility/Release/UtilityTests/LogChannelEnabledTest.LogVerboseThread (2169 of 2403) PASS: lldb-unit :: Utility/Release/UtilityTests/RangeTest.ContainsAddrInvalid (2170 of 2403) PASS: lldb-unit :: Process/minidump/Release/LLDBMinidumpTests/MinidumpParserTest.GetLinuxProcStatus (2171 of 2403) PASS: lldb-unit :: Utility/Release/UtilityTests/Flags.AllSet (2172 of 2403) PASS: lldb-unit :: Utility/Release/UtilityTests/DeserializerTest.HasData (2173 of 2403) PASS: lldb-unit :: Utility/Release/UtilityTests/RangeTest.SizeTypes (2174 of 2403) PASS: lldb-unit :: Utility/Release/UtilityTests/DataExtractorTest.GetMaxU64_unchecked (2175 of 2403) PASS: lldb-unit :: Utility/Release/UtilityTests/UriParserTest.LongPath (2176 of 2403) PASS: lldb-unit :: Utility/Release/UtilityTests/OptionsWithRawTest.MultiWordSuffix (2177 of 2403) PASS: lldb-unit :: SymbolFile/NativePDB/Release/SymbolFileNativePDBTests/PDBFPOProgramToDWARFExpressionTests.UnsupportedRASearch (2178 of 2403) PASS: lldb-unit :: DataFormatter/Release/LLDBFormatterTests/StringPrinterTests.CxxUTF8 (2179 of 2403) PASS: lldb-unit :: Utility/Release/UtilityTests/ScalarTest.Promotion (2180 of 2403) PASS: lldb-unit :: Host/Release/HostTests/FileSystemTest.FileAndDirectoryComponents (2181 of 2403) PASS: lldb-unit :: Process/Utility/Release/ProcessUtilityTests/MemoryTagManagerAArch64MTETest.RemoveNonAddressBits (2182 of 2403) PASS: lldb-unit :: Utility/Release/UtilityTests/UriParserTest.MinimalPath (2183 of 2403) PASS: lldb-unit :: Utility/Release/UtilityTests/StreamTest.AddressRangeInvalidRange (2184 of 2403) PASS: lldb-unit :: Process/Utility/Release/ProcessUtilityTests/ProcMapTests/LinuxProcMapsTestFixture.ParseMapRegions/4 (2185 of 2403) PASS: lldb-unit :: Host/Release/HostTests/FileSystemTest.MakeAbsolute (2186 of 2403) PASS: lldb-unit :: Utility/Release/UtilityTests/StreamTest.PutPtr (2187 of 2403) PASS: lldb-unit :: Process/Utility/Release/ProcessUtilityTests/ProcSMapTests/LinuxProcSMapsTestFixture.ParseSMapRegions/9 (2188 of 2403) PASS: lldb-unit :: Utility/Release/UtilityTests/StringListTest.GetSize (2189 of 2403) PASS: lldb-unit :: Process/minidump/Release/LLDBMinidumpTests/MinidumpParserTest.FindMemoryRange (2190 of 2403) PASS: lldb-unit :: Process/Utility/Release/ProcessUtilityTests/MemoryTagManagerAArch64MTETest.GetLogicalTag (2191 of 2403) PASS: lldb-unit :: Utility/Release/UtilityTests/StringExtractorTest.GetHexU8_Underflow2 (2192 of 2403) PASS: lldb-unit :: Utility/Release/UtilityTests/StringListTest.GetMaxStringLengthEmpty (2193 of 2403) PASS: lldb-unit :: Process/Utility/Release/ProcessUtilityTests/RegisterContext_x86Test.AbridgedToFullTagWord (2194 of 2403) PASS: lldb-unit :: ObjectFile/Breakpad/Release/ObjectFileBreakpadTests/StackWinRecord.parse (2195 of 2403) PASS: lldb-unit :: Process/Utility/Release/ProcessUtilityTests/ProcMapTests/LinuxProcMapsTestFixture.ParseMapRegions/3 (2196 of 2403) PASS: lldb-unit :: Utility/Release/UtilityTests/BinaryStreamTest.PutSLEB128MaxValue (2197 of 2403) PASS: lldb-unit :: Process/Utility/Release/ProcessUtilityTests/MemoryTagManagerAArch64MTETest.UnpackTagsData (2198 of 2403) PASS: lldb-unit :: SymbolFile/NativePDB/Release/SymbolFileNativePDBTests/PDBFPOProgramToDWARFExpressionTests.SingleAssignmentRegisterRef (2199 of 2403) PASS: lldb-unit :: Signals/Release/SignalsTests/UnixSignalsTest.GetInfo (2200 of 2403) PASS: lldb-unit :: Host/Release/HostTests/SocketTests/SocketTest.TCPListen0ConnectAccept/ipv4 (2201 of 2403) PASS: lldb-unit :: Host/Release/HostTests/FileSystemTest.Readable (2202 of 2403) PASS: lldb-unit :: Utility/Release/UtilityTests/AnsiTerminal.KnownPrefix (2203 of 2403) PASS: lldb-unit :: Process/Utility/Release/ProcessUtilityTests/ProcMapTests/LinuxProcMapsTestFixture.ParseMapRegions/2 (2204 of 2403) PASS: lldb-unit :: Utility/Release/UtilityTests/RangeTest.ContainsRangeStartingFromZero (2205 of 2403) PASS: lldb-unit :: Host/Release/HostTests/HostInfoTest.GetAugmentedArchSpec (2206 of 2403) PASS: lldb-unit :: Process/Utility/Release/ProcessUtilityTests/ProcMapTests/LinuxProcMapsTestFixture.ParseMapRegions/8 (2207 of 2403) PASS: lldb-unit :: Process/Utility/Release/ProcessUtilityTests/ProcSMapTests/LinuxProcSMapsTestFixture.ParseSMapRegions/4 (2208 of 2403) PASS: lldb-unit :: Utility/Release/UtilityTests/Flags.AnySet (2209 of 2403) PASS: lldb-unit :: Utility/Release/UtilityTests/StringListTest.AppendListCStringArray (2210 of 2403) PASS: lldb-unit :: Host/Release/HostTests/NativeProcessProtocolTest.SetBreakpoint (2211 of 2403) PASS: lldb-unit :: Core/Release/LLDBCoreTests/DumpDataExtractorTest.StartOffset (2212 of 2403) PASS: lldb-unit :: Host/Release/HostTests/File.GetWaitableHandleFileno (2213 of 2403) PASS: lldb-unit :: Utility/Release/UtilityTests/VMRange.Reset (2214 of 2403) PASS: lldb-unit :: Host/Release/HostTests/FileSystemTest.GetPermissions (2215 of 2403) PASS: lldb-unit :: Process/gdb-remote/Release/ProcessGdbRemoteTests/PortMapTest.FreePortForProcess (2216 of 2403) PASS: lldb-unit :: SymbolFile/NativePDB/Release/SymbolFileNativePDBTests/PDBFPOProgramToDWARFExpressionTests.UnresolvedCyclicRegisterAssignmentReference (2217 of 2403) PASS: lldb-unit :: Core/Release/LLDBCoreTests/DumpDataExtractorTest.ItemByteSizeErrors (2218 of 2403) PASS: lldb-unit :: Process/Utility/Release/ProcessUtilityTests/ProcSMapTests/LinuxProcSMapsTestFixture.ParseSMapRegions/7 (2219 of 2403) PASS: lldb-unit :: ObjectFile/Breakpad/Release/ObjectFileBreakpadTests/Record.classify (2220 of 2403) PASS: lldb-unit :: Process/Utility/Release/ProcessUtilityTests/ProcMapTests/LinuxProcMapsTestFixture.ParseMapRegions/5 (2221 of 2403) PASS: lldb-unit :: Core/Release/LLDBCoreTests/FormatEntity.LookupAllEntriesInTree (2222 of 2403) PASS: lldb-unit :: Host/Release/HostTests/NativeProcessProtocolTest.ReadCStringFromMemory_MaxSize (2223 of 2403) PASS: lldb-unit :: Utility/Release/UtilityTests/CompletionRequest.TestCompletionOwnership (2224 of 2403) PASS: lldb-unit :: Host/Release/HostTests/NativeProcessProtocolTest.ReadMemoryWithoutTrap (2225 of 2403) PASS: lldb-unit :: Process/Utility/Release/ProcessUtilityTests/RegisterContext_x86Test.FullToAbridgedTagWord (2226 of 2403) PASS: lldb-unit :: Process/Utility/Release/ProcessUtilityTests/ProcSMapTests/LinuxProcSMapsTestFixture.ParseSMapRegions/2 (2227 of 2403) PASS: lldb-unit :: Process/Utility/Release/ProcessUtilityTests/ProcMapTests/LinuxProcMapsTestFixture.ParseMapRegions/7 (2228 of 2403) PASS: lldb-unit :: Process/Utility/Release/ProcessUtilityTests/ProcMapTests/LinuxProcMapsTestFixture.ParseMapRegions/1 (2229 of 2403) PASS: lldb-unit :: SymbolFile/NativePDB/Release/SymbolFileNativePDBTests/PDBFPOProgramToDWARFExpressionTests.MultipleDependentAssignments (2230 of 2403) PASS: lldb-unit :: Host/Release/HostTests/SocketTests/SocketTest.DecodeHostAndPort/ipv4 (2231 of 2403) PASS: lldb-unit :: SymbolFile/NativePDB/Release/SymbolFileNativePDBTests/PDBFPOProgramToDWARFExpressionTests.InvalidOpBinary (2232 of 2403) PASS: lldb-unit :: SymbolFile/NativePDB/Release/SymbolFileNativePDBTests/PDBFPOProgramToDWARFExpressionTests.InvalidAssignmentMultiple (2233 of 2403) PASS: lldb-unit :: ObjectFile/Breakpad/Release/ObjectFileBreakpadTests/StackCFIRecord.parse (2234 of 2403) PASS: lldb-unit :: ObjectFile/Breakpad/Release/ObjectFileBreakpadTests/PublicRecord.parse (2235 of 2403) PASS: lldb-unit :: SymbolFile/NativePDB/Release/SymbolFileNativePDBTests/PDBFPOProgramToDWARFExpressionTests.UnresolvedDependentCyclicRegisterAssignmentReference (2236 of 2403) PASS: lldb-unit :: ObjectFile/Breakpad/Release/ObjectFileBreakpadTests/LineRecord.parse (2237 of 2403) PASS: lldb-unit :: SymbolFile/NativePDB/Release/SymbolFileNativePDBTests/PDBFPOProgramToDWARFExpressionTests.UnresolvedRegisterReference (2238 of 2403) PASS: lldb-unit :: Host/Release/HostTests/FileActionTest.Open (2239 of 2403) PASS: lldb-unit :: Process/Utility/Release/ProcessUtilityTests/MemoryTagManagerAArch64MTETest.AddressDiff (2240 of 2403) UNSUPPORTED: lldb-shell :: ObjectFile/ELF/minidebuginfo-set-and-hit-breakpoint.test (2241 of 2403) UNSUPPORTED: lldb-shell :: Register/x86-64-xmm16-read.test (2242 of 2403) UNSUPPORTED: lldb-shell :: SymbolFile/DWARF/x86/find-basic-function.cpp (2243 of 2403) UNSUPPORTED: lldb-shell :: Register/x86-64-ymm16-read.test (2244 of 2403) UNSUPPORTED: lldb-shell :: Register/x86-64-ymm16-write.test (2245 of 2403) UNSUPPORTED: lldb-shell :: Register/x86-64-xmm16-write.test (2246 of 2403) UNSUPPORTED: lldb-shell :: SymbolFile/PDB/class-layout.test (2247 of 2403) UNSUPPORTED: lldb-shell :: SymbolFile/DWARF/x86/find-variable-file.cpp (2248 of 2403) UNSUPPORTED: lldb-shell :: Register/aarch64-fp-read.test (2249 of 2403) PASS: lldb-unit :: Platform/Android/Release/AdbClientTests/AdbClientTest.CreateByDeviceId (2250 of 2403) UNSUPPORTED: lldb-shell :: Unwind/split-machine-functions.test (2251 of 2403) UNSUPPORTED: lldb-shell :: ExecControl/StopHook/stop-hook-threads.test (2252 of 2403) UNSUPPORTED: lldb-shell :: Subprocess/clone-follow-parent-wp.test (2253 of 2403) UNSUPPORTED: lldb-shell :: Register/x86-64-zmm-write.test (2254 of 2403) UNSUPPORTED: lldb-shell :: Register/x86-zmm-read.test (2255 of 2403) UNSUPPORTED: lldb-shell :: Register/x86-ymm-read.test (2256 of 2403) UNSUPPORTED: lldb-shell :: SymbolFile/DWARF/x86/find-basic-type.cpp (2257 of 2403) UNSUPPORTED: lldb-shell :: SymbolFile/DWARF/x86/find-basic-variable.cpp (2258 of 2403) UNSUPPORTED: lldb-shell :: Unwind/basic-block-sections.test (2259 of 2403) UNSUPPORTED: lldb-shell :: SymbolFile/NativePDB/globals-fundamental.cpp (2260 of 2403) UNSUPPORTED: lldb-shell :: Register/x86-64-gp-write.test (2261 of 2403) UNSUPPORTED: lldb-shell :: SymbolFile/DWARF/x86/find-basic-namespace.cpp (2262 of 2403) UNSUPPORTED: lldb-shell :: Register/x86-zmm-write.test (2263 of 2403) UNSUPPORTED: lldb-shell :: Register/x86-db-read.test (2264 of 2403) UNSUPPORTED: lldb-shell :: SymbolFile/NativePDB/load-pdb.cpp (2265 of 2403) UNSUPPORTED: lldb-shell :: Subprocess/clone-follow-child-softbp.test (2266 of 2403) UNSUPPORTED: lldb-shell :: Register/x86-64-zmm-read.test (2267 of 2403) UNSUPPORTED: lldb-shell :: SymbolFile/NativePDB/locate-pdb.cpp (2268 of 2403) UNSUPPORTED: lldb-shell :: BuildScript/toolchain-msvc.test (2269 of 2403) UNSUPPORTED: lldb-shell :: Breakpoint/ppc64-localentry.test (2270 of 2403) UNSUPPORTED: lldb-shell :: SymbolFile/NativePDB/function-types-classes.cpp (2271 of 2403) UNSUPPORTED: lldb-shell :: Subprocess/clone-follow-parent-softbp.test (2272 of 2403) UNSUPPORTED: lldb-shell :: Subprocess/clone-follow-child-wp.test (2273 of 2403) UNSUPPORTED: lldb-shell :: Watchpoint/netbsd-nouserdbregs.test (2274 of 2403) UNSUPPORTED: lldb-shell :: SymbolFile/NativePDB/tag-types.cpp (2275 of 2403) UNSUPPORTED: lldb-shell :: Subprocess/vfork-follow-child-wp.test (2276 of 2403) UNSUPPORTED: lldb-shell :: Subprocess/clone-follow-child.test (2277 of 2403) UNSUPPORTED: lldb-shell :: Subprocess/vfork-follow-parent-wp.test (2278 of 2403) UNSUPPORTED: lldb-shell :: Subprocess/fork-follow-child-wp.test (2279 of 2403) UNSUPPORTED: lldb-shell :: SymbolFile/PDB/variables.test (2280 of 2403) UNSUPPORTED: lldb-shell :: SymbolFile/dissassemble-entry-point.s (2281 of 2403) UNSUPPORTED: lldb-shell :: Subprocess/clone-follow-parent.test (2282 of 2403) UNSUPPORTED: lldb-shell :: SymbolFile/PDB/ast-restore.test (2283 of 2403) UNSUPPORTED: lldb-shell :: Register/x86-ymm-write.test (2284 of 2403) UNSUPPORTED: lldb-shell :: SymbolFile/DWARF/debug-types-expressions.test (2285 of 2403) UNSUPPORTED: lldb-shell :: SymbolFile/PDB/pointers.test (2286 of 2403) UNSUPPORTED: lldb-shell :: SymbolFile/PDB/enums-layout.test (2287 of 2403) UNSUPPORTED: lldb-shell :: SymbolFile/NativePDB/break-by-function.cpp (2288 of 2403) UNSUPPORTED: lldb-shell :: SymbolFile/DWARF/x86/find-variable-dwo.cpp (2289 of 2403) UNSUPPORTED: lldb-shell :: Unwind/eh-frame-augment-noop.test (2290 of 2403) UNSUPPORTED: lldb-shell :: SymbolFile/NativePDB/nested-types.cpp (2291 of 2403) UNSUPPORTED: lldb-shell :: SymbolFile/NativePDB/ast-methods.cpp (2292 of 2403) UNSUPPORTED: lldb-shell :: SymbolFile/NativePDB/disassembly.cpp (2293 of 2403) UNSUPPORTED: lldb-shell :: SymbolFile/DWARF/x86/DW_TAG_variable-DW_AT_decl_file-DW_AT_abstract_origin-crosscu1.s (2294 of 2403) UNSUPPORTED: lldb-shell :: SymbolFile/DWARF/x86/debug-types-basic.test (2295 of 2403) UNSUPPORTED: lldb-shell :: SymbolFile/DWARF/x86/DW_TAG_GNU_call_site-DW_AT_low_pc.s (2296 of 2403) UNSUPPORTED: lldb-shell :: SymbolFile/NativePDB/global-classes.cpp (2297 of 2403) UNSUPPORTED: lldb-shell :: SymbolFile/NativePDB/ast-functions-msvc.cpp (2298 of 2403) UNSUPPORTED: lldb-shell :: SymbolFile/NativePDB/source-list.cpp (2299 of 2403) UNSUPPORTED: lldb-shell :: ObjectFile/PECOFF/dep-modules.yaml (2300 of 2403) UNSUPPORTED: lldb-shell :: Subprocess/vfork-follow-child-softbp.test (2301 of 2403) UNSUPPORTED: lldb-shell :: SymbolFile/PDB/type-quals.test (2302 of 2403) UNSUPPORTED: lldb-shell :: SymbolFile/PDB/compilands.test (2303 of 2403) UNSUPPORTED: lldb-shell :: SymbolFile/DWARF/split-optimized.c (2304 of 2403) UNSUPPORTED: lldb-shell :: SymbolFile/NativePDB/ast-functions.cpp (2305 of 2403) UNSUPPORTED: lldb-shell :: Register/arm-fp-read.test (2306 of 2403) UNSUPPORTED: lldb-shell :: Breakpoint/case-insensitive.test (2307 of 2403) UNSUPPORTED: lldb-shell :: Register/aarch64-gp-read.test (2308 of 2403) UNSUPPORTED: lldb-shell :: SymbolFile/DWARF/x86/debug-types-address-ranges.s (2309 of 2403) UNSUPPORTED: lldb-shell :: SymbolFile/target-symbols-add-unwind.test (2310 of 2403) UNSUPPORTED: lldb-shell :: SymbolFile/DWARF/x86/find-method.cpp (2311 of 2403) UNSUPPORTED: lldb-shell :: Subprocess/fork-follow-child-softbp.test (2312 of 2403) UNSUPPORTED: lldb-shell :: Register/x86-fp-read.test (2313 of 2403) UNSUPPORTED: lldb-shell :: Subprocess/vfork-follow-parent-softbp.test (2314 of 2403) UNSUPPORTED: lldb-shell :: SymbolFile/DWARF/x86/limit-debug-info.s (2315 of 2403) UNSUPPORTED: lldb-shell :: SymbolFile/DWARF/x86/dwarf5-line-strp.s (2316 of 2403) UNSUPPORTED: lldb-shell :: SymbolFile/PDB/function-nested-block.test (2317 of 2403) UNSUPPORTED: lldb-shell :: Subprocess/vfork-follow-child.test (2318 of 2403) UNSUPPORTED: lldb-shell :: SymbolFile/DWARF/split-dwarf-expression-eval-bug.cpp (2319 of 2403) UNSUPPORTED: lldb-shell :: SymbolFile/NativePDB/function-types-builtins.cpp (2320 of 2403) UNSUPPORTED: lldb-shell :: SymbolFile/NativePDB/ast-types.cpp (2321 of 2403) UNSUPPORTED: lldb-shell :: Subprocess/fork-follow-parent-softbp.test (2322 of 2403) UNSUPPORTED: lldb-shell :: Expr/TestIRMemoryMapWindows.test (2323 of 2403) UNSUPPORTED: lldb-shell :: Unwind/eh-frame-small-fde.test (2324 of 2403) UNSUPPORTED: lldb-shell :: SymbolFile/DWARF/x86/dwp-separate-debug-file.cpp (2325 of 2403) UNSUPPORTED: lldb-shell :: SymbolFile/PDB/func-symbols.test (2326 of 2403) UNSUPPORTED: lldb-shell :: SymbolFile/DWARF/x86/find-function-regex.cpp (2327 of 2403) UNSUPPORTED: lldb-shell :: SymbolFile/NativePDB/bitfields.cpp (2328 of 2403) UNSUPPORTED: lldb-shell :: Reproducer/TestLuaImport.test (2329 of 2403) UNSUPPORTED: lldb-shell :: SymbolFile/PDB/function-level-linking.test (2330 of 2403) UNSUPPORTED: lldb-shell :: Subprocess/fork-follow-child.test (2331 of 2403) UNSUPPORTED: lldb-shell :: SymbolFile/NativePDB/s_constant.cpp (2332 of 2403) UNSUPPORTED: lldb-shell :: SymbolFile/DWARF/x86/debug-types-dwo-cross-reference.cpp (2333 of 2403) UNSUPPORTED: lldb-shell :: Unwind/unwind-plan-dwarf-dump.test (2334 of 2403) UNSUPPORTED: lldb-shell :: Register/arm-gp-read.test (2335 of 2403) UNSUPPORTED: lldb-shell :: Register/x86-gp-read.test (2336 of 2403) UNSUPPORTED: lldb-shell :: SymbolFile/NativePDB/break-by-line.cpp (2337 of 2403) UNSUPPORTED: lldb-shell :: ObjectFile/PECOFF/export-dllfunc.yaml (2338 of 2403) UNSUPPORTED: lldb-shell :: ObjectFile/ELF/minidebuginfo-no-lzma.yaml (2339 of 2403) UNSUPPORTED: lldb-shell :: SymbolFile/NativePDB/function-types-calling-conv.cpp (2340 of 2403) UNSUPPORTED: lldb-shell :: SymbolFile/PDB/vbases.test (2341 of 2403) UNSUPPORTED: lldb-shell :: SymbolFile/PDB/variables-locations.test (2342 of 2403) UNSUPPORTED: lldb-shell :: SymbolFile/Breakpad/stack-cfi-arm.yaml (2343 of 2403) UNSUPPORTED: lldb-shell :: Minidump/Windows/arm-fp-unwind.test (2344 of 2403) UNSUPPORTED: lldb-shell :: Register/x86-gp-write.test (2345 of 2403) UNSUPPORTED: lldb-shell :: BuildScript/toolchain-clang-cl.test (2346 of 2403) UNSUPPORTED: lldb-shell :: SymbolFile/DWARF/x86/debug-names-compressed.cpp (2347 of 2403) UNSUPPORTED: lldb-shell :: SymbolFile/PDB/typedefs.test (2348 of 2403) UNSUPPORTED: lldb-shell :: SymbolFile/PDB/udt-layout.test (2349 of 2403) UNSUPPORTED: lldb-shell :: SymbolFile/NativePDB/local-variables.cpp (2350 of 2403) UNSUPPORTED: lldb-shell :: SymbolFile/NativePDB/globals-bss.cpp (2351 of 2403) UNSUPPORTED: lldb-shell :: SymbolFile/DWARF/x86/dir-separator-no-comp-dir-relative-name.s (2352 of 2403) UNSUPPORTED: lldb-shell :: SymbolFile/DWARF/x86/find-inline-method.s (2353 of 2403) UNSUPPORTED: lldb-shell :: SymbolFile/DWARF/dwarf5-lazy-dwo.c (2354 of 2403) UNSUPPORTED: lldb-shell :: SymbolFile/PDB/calling-conventions.test (2355 of 2403) UNSUPPORTED: lldb-shell :: SymbolFile/DWARF/x86/debug-types-signature-loop.s (2356 of 2403) UNSUPPORTED: lldb-shell :: SymbolFile/NativePDB/stack_unwinding01.cpp (2357 of 2403) UNSUPPORTED: lldb-shell :: Process/Windows/exception_access_violation.cpp (2358 of 2403) UNSUPPORTED: lldb-shell :: SymbolFile/DWARF/x86/debug_ranges_and_rnglists.test (2359 of 2403) UNSUPPORTED: lldb-shell :: SymbolFile/PDB/expressions.test (2360 of 2403) UNSUPPORTED: lldb-shell :: SymbolFile/DWARF/x86/dwarf5-partial-index.cpp (2361 of 2403) UNSUPPORTED: lldb-shell :: SymbolFile/DWARF/find-type-in-function.cpp (2362 of 2403) UNSUPPORTED: lldb-shell :: SymbolFile/DWARF/x86/debug-line-basic.s (2363 of 2403) UNSUPPORTED: lldb-shell :: SymbolFile/DWARF/x86/array-sizes.s (2364 of 2403) UNSUPPORTED: lldb-shell :: SymbolFile/DWARF/x86/dir-separator-windows.s (2365 of 2403) UNSUPPORTED: lldb-shell :: SymbolFile/DWARF/x86/win-i386-line-table.s (2366 of 2403) UNSUPPORTED: lldb-shell :: SymbolFile/DWARF/x86/dir-separator-posix.s (2367 of 2403) UNSUPPORTED: lldb-shell :: SymbolFile/NativePDB/typedefs.cpp (2368 of 2403) UNSUPPORTED: lldb-shell :: SymbolFile/DWARF/x86/dwarf5_locations.s (2369 of 2403) UNSUPPORTED: lldb-shell :: ObjectFile/PECOFF/disassemble-thumb.yaml (2370 of 2403) UNSUPPORTED: lldb-shell :: SymbolFile/DWARF/x86/dwarf5-index-is-used.cpp (2371 of 2403) UNSUPPORTED: lldb-shell :: SymbolFile/DWARF/x86/subprogram_ranges.test (2372 of 2403) UNSUPPORTED: lldb-shell :: ScriptInterpreter/Lua/breakpoint_function_callback.test (2373 of 2403) UNSUPPORTED: lldb-shell :: ScriptInterpreter/Lua/persistent_state.test (2374 of 2403) UNSUPPORTED: lldb-shell :: ScriptInterpreter/Lua/watchpoint_callback.test (2375 of 2403) UNSUPPORTED: lldb-shell :: ObjectFile/ELF/basic-info.yaml (2376 of 2403) UNSUPPORTED: lldb-shell :: SymbolFile/DWARF/x86/inline-function-address-shared.test (2377 of 2403) UNSUPPORTED: lldb-shell :: ScriptInterpreter/Lua/command_script_import.test (2378 of 2403) UNSUPPORTED: lldb-shell :: ScriptInterpreter/Lua/bindings.test (2379 of 2403) UNSUPPORTED: lldb-shell :: ScriptInterpreter/Lua/convenience_variables.test (2380 of 2403) UNSUPPORTED: lldb-shell :: ScriptInterpreter/Lua/nested_sessions.test (2381 of 2403) UNSUPPORTED: lldb-shell :: ScriptInterpreter/Lua/io.test (2382 of 2403) UNSUPPORTED: lldb-shell :: ScriptInterpreter/Lua/lua.test (2383 of 2403) UNSUPPORTED: lldb-shell :: ScriptInterpreter/Lua/lua-python.test (2384 of 2403) UNSUPPORTED: lldb-shell :: ScriptInterpreter/Lua/breakpoint_callback.test (2385 of 2403) UNSUPPORTED: lldb-shell :: SymbolFile/DWARF/x86/dir-separator-no-comp-dir.s (2386 of 2403) UNSUPPORTED: lldb-shell :: SymbolFile/DWARF/x86/inline-function-address.ll (2387 of 2403) UNSUPPORTED: lldb-shell :: ScriptInterpreter/Lua/independent_state.test (2388 of 2403) UNSUPPORTED: lldb-shell :: ObjectFile/PECOFF/uuid.yaml (2389 of 2403) UNSUPPORTED: lldb-shell :: ScriptInterpreter/Lua/partial_statements.test (2390 of 2403) UNSUPPORTED: lldb-shell :: ScriptInterpreter/Lua/print.test (2391 of 2403) UNSUPPORTED: lldb-shell :: ScriptInterpreter/Lua/breakpoint_oneline_callback.test (2392 of 2403) UNSUPPORTED: lldb-shell :: ScriptInterpreter/Lua/quit.test (2393 of 2403) UNSUPPORTED: lldb-shell :: ScriptInterpreter/Lua/fail_breakpoint_oneline.test (2394 of 2403) PASS: lldb-shell :: SymbolFile/DWARF/x86/split-dwarf-multiple-cu.ll (2395 of 2403) PASS: lldb-shell :: SymbolFile/DWARF/x86/compilercontext.ll (2396 of 2403) PASS: lldb-shell :: ObjectFile/ELF/gnu-debuglink.yaml (2397 of 2403) PASS: lldb-shell :: ObjectFile/ELF/duplicate-section.yaml (2398 of 2403) PASS: lldb-shell :: ObjectFile/ELF/build-id-case.yaml (2399 of 2403) PASS: lldb-shell :: SymbolFile/DWARF/dwo-relative-path.s (2400 of 2403) PASS: lldb-shell :: SymbolFile/DWARF/anon_class_w_and_wo_export_symbols.ll (2401 of 2403) PASS: lldb-shell :: SymbolFile/DWARF/x86/debug-types-missing-signature.test (2402 of 2403) PASS: lldb-shell :: ObjectFile/PDB/object.test (2403 of 2403) ******************** Failed Tests (17): lldb-shell :: Commands/command-stop-hook-output.test lldb-shell :: Commands/command-thread-select.test lldb-shell :: Process/Optimization.test lldb-shell :: Process/UnsupportedLanguage.test lldb-shell :: Recognizer/assert.test lldb-shell :: Register/x86-64-gp-read.test lldb-shell :: Register/x86-64-read.test lldb-shell :: Register/x86-64-ymm-read.test lldb-shell :: Settings/TestFrameFormatColor.test lldb-shell :: Settings/TestFrameFormatMangling.test lldb-shell :: Settings/TestFrameFormatNoColor.test lldb-shell :: Subprocess/fork-follow-parent.test lldb-shell :: Subprocess/vfork-follow-parent.test lldb-shell :: SymbolFile/DWARF/deterministic-build.cpp lldb-shell :: Unwind/eh-frame-dwarf-unwind.test lldb-shell :: Unwind/thread-step-out-ret-addr-check.test lldb-shell :: Unwind/trap_frame_sym_ctx.test

Hide Details

Hide Details

Testing Time: 672.57s Unsupported : 267 Passed : 2110 Expectedly Failed: 9 Failed : 17 make: *** [/Users/buildslave/jenkins/workspace/lldb-cmake-standalone/lldb-xcode-build/test/CMakeFiles/check-lldb] Error 1

Hide Details

** BUILD FAILED **

Hide Details

Hide Details

The following build commands failed: PhaseScriptExecution CMake\ Rules /Users/buildslave/jenkins/workspace/lldb-cmake-standalone/lldb-xcode-build/test/lldb.build/Release/check-lldb.build/Script-E6CE9EE5ACEE47E0884316FB.sh (1 failure) Command failed: Command '['/usr/bin/env', 'TERM=vt100', '/usr/local/bin/cmake', '--build', '.', '--config', 'Release', '--target', 'check-lldb']' returned non-zero exit status 65. Command: ['/usr/bin/env', 'TERM=vt100', '/usr/local/bin/cmake', '--build', '.', '--config', 'Release', '--target', 'check-lldb'] [Pipeline] } [Pipeline] // timeout [Pipeline] } [Pipeline] // stage [Pipeline] } [Pipeline] // withEnv [Pipeline] } [Pipeline] // node [Pipeline] End of Pipeline ERROR: script returned exit code 1 Finished: FAILURE