Console Output

Skipping 4,002 KB.. Full Log
PASS: lldb-shell :: Unwind/eh-frame-dwarf-unwind.test (878 of 2404)
PASS: lldb-shell :: Unwind/thread-step-out-ret-addr-check.test (879 of 2404)
PASS: lldb-api :: commands/command/script/import/rdar-12586188/TestRdar12586188.py (880 of 2404)
PASS: lldb-api :: functionalities/gdb_remote_client/TestRegDefinitionInParts.py (881 of 2404)
PASS: lldb-api :: functionalities/gdb_remote_client/TestNestedRegDefinitions.py (882 of 2404)
PASS: lldb-api :: functionalities/gdb_remote_client/TestArmRegisterDefinition.py (883 of 2404)
UNSUPPORTED: lldb-api :: commands/register/register/intel_xtended_registers/mpx_offset_intersection/TestMPXOffsetIntersection.py (884 of 2404)
UNSUPPORTED: lldb-api :: commands/trace/TestTraceStartStop.py (885 of 2404)
PASS: lldb-api :: commands/session/history/TestSessionHistory.py (886 of 2404)
PASS: lldb-shell :: Driver/TestSingleQuote.test (887 of 2404)
PASS: lldb-api :: functionalities/reproducers/fs-case-sensitivity/TestReproducerFSCaseSensitivity.py (888 of 2404)
UNSUPPORTED: lldb-api :: lang/cpp/function-template-parameter-pack/TestFunctionTemplateParameterPack.py (889 of 2404)
PASS: lldb-shell :: Driver/TestTarget.test (890 of 2404)
UNSUPPORTED: lldb-api :: commands/register/register/intel_xtended_registers/TestMPXRegisters.py (891 of 2404)
PASS: lldb-api :: functionalities/gdb_remote_client/TestFork.py (892 of 2404)
PASS: lldb-api :: functionalities/backticks/TestBackticksWithoutATarget.py (893 of 2404)
PASS: lldb-api :: lang/cpp/keywords_enabled/TestCppKeywordsEnabled.py (894 of 2404)
PASS: lldb-api :: commands/command/regex/TestRegexCommand.py (895 of 2404)
UNSUPPORTED: lldb-api :: commands/trace/multiple-threads/TestTraceStartStopMultipleThreads.py (896 of 2404)
UNSUPPORTED: lldb-api :: tools/lldb-vscode/disconnect/TestVSCode_disconnect.py (897 of 2404)
PASS: lldb-api :: functionalities/gdb_remote_client/TestPartialGPacket.py (898 of 2404)
PASS: lldb-api :: functionalities/object-file/TestImageListMultiArchitecture.py (899 of 2404)
UNSUPPORTED: lldb-api :: functionalities/ptrauth_diagnostics/brkC47x_code/TestPtrauthBRKc47xDiagnostic.py (900 of 2404)
UNSUPPORTED: lldb-api :: functionalities/breakpoint/breakpoint_in_delayslot/TestAvoidBreakpointInDelaySlot.py (901 of 2404)
PASS: lldb-shell :: Register/x86-64-read.test (902 of 2404)
PASS: lldb-shell :: Register/x86-64-gp-read.test (903 of 2404)
PASS: lldb-shell :: SymbolFile/DWARF/deterministic-build.cpp (904 of 2404)
UNSUPPORTED: lldb-api :: commands/register/register/intel_xtended_registers/mpx_bound_violation/TestBoundViolation.py (905 of 2404)
UNSUPPORTED: lldb-api :: commands/gui/basicdebug/TestGuiBasicDebug.py (906 of 2404)
UNSUPPORTED: lldb-api :: commands/expression/completion-crash-invalid-iterator/TestInvalidIteratorCompletionCrash.py (907 of 2404)
PASS: lldb-api :: functionalities/gdb_remote_client/TestNoGPacketSupported.py (908 of 2404)
PASS: lldb-api :: functionalities/gdb_remote_client/TestRemoteRegNums.py (909 of 2404)
PASS: lldb-api :: functionalities/gdb_remote_client/TestWriteMemory.py (910 of 2404)
PASS: lldb-api :: commands/expression/invalid-args/TestInvalidArgsExpression.py (911 of 2404)
PASS: lldb-api :: functionalities/gdb_remote_client/TestNoWatchpointSupportInfo.py (912 of 2404)
UNSUPPORTED: lldb-api :: functionalities/ptrauth_diagnostics/BLRAA_error/TestPtrauthBLRAADiagnostic.py (913 of 2404)
UNSUPPORTED: lldb-api :: functionalities/unwind/aarch64_unwind_pac/TestAArch64UnwindPAC.py (914 of 2404)
PASS: lldb-api :: functionalities/gdb_remote_client/TestStopPCs.py (915 of 2404)
UNSUPPORTED: lldb-api :: commands/trace/TestTraceSave.py (916 of 2404)
UNSUPPORTED: lldb-api :: tools/lldb-vscode/completions/TestVSCode_completions.py (917 of 2404)
UNSUPPORTED: lldb-api :: tools/lldb-server/TestGdbRemotePlatformFile.py (918 of 2404)
PASS: lldb-api :: iohandler/resize/TestIOHandlerResizeNoEditline.py (919 of 2404)
PASS: lldb-api :: commands/gui/invalid-args/TestInvalidArgsGui.py (920 of 2404)
PASS: lldb-api :: sanity/TestSettingSkipping.py (921 of 2404)
UNSUPPORTED: lldb-api :: commands/trace/TestTraceTimestampCounters.py (922 of 2404)
UNSUPPORTED: lldb-api :: functionalities/ptrauth_diagnostics/BRAA_error/TestPtrauthBRAADiagnostic.py (923 of 2404)
PASS: lldb-api :: functionalities/testid/TestTestId.py (924 of 2404)
PASS: lldb-api :: commands/log/invalid-args/TestInvalidArgsLog.py (925 of 2404)
UNSUPPORTED: lldb-api :: macosx/posix_spawn/TestLaunchProcessPosixSpawn.py (926 of 2404)
PASS: lldb-api :: functionalities/abbreviation/TestCommonShortSpellings.py (927 of 2404)
PASS: lldb-api :: functionalities/gdb_remote_client/TestGDBRemoteDiskFileCompletion.py (928 of 2404)
PASS: lldb-api :: sanity/TestModuleCacheSanity.py (929 of 2404)
PASS: lldb-api :: functionalities/gdb_remote_client/TestMemoryRegionDirtyPages.py (930 of 2404)
PASS: lldb-api :: functionalities/source-map/TestTargetSourceMap.py (931 of 2404)
UNSUPPORTED: lldb-api :: commands/platform/connect/TestPlatformConnect.py (932 of 2404)
PASS: lldb-api :: commands/expression/calculator_mode/TestCalculatorMode.py (933 of 2404)
PASS: lldb-api :: functionalities/multiword-commands/TestMultiWordCommands.py (934 of 2404)
UNSUPPORTED: lldb-api :: macosx/lc-note/addrable-bits/TestAddrableBitsCorefile.py (935 of 2404)
UNSUPPORTED: lldb-api :: commands/trace/TestTraceDumpInstructions.py (936 of 2404)
PASS: lldb-api :: commands/target/dump-symtab-demangle/TestDumpSymtabDemangle.py (937 of 2404)
PASS: lldb-api :: python_api/sbenvironment/TestSBEnvironment.py (938 of 2404)
UNSUPPORTED: lldb-api :: benchmarks/libcxxlist/TestBenchmarkLibcxxList.py (939 of 2404)
UNSUPPORTED: lldb-api :: tools/lldb-server/memory-tagging/TestGdbRemoteMemoryTagging.py (940 of 2404)
UNSUPPORTED: lldb-api :: tools/lldb-server/libraries-svr4/TestGdbRemoteLibrariesSvr4Support.py (941 of 2404)
PASS: lldb-api :: commands/reproducer/invalid-args/TestInvalidArgsReproducer.py (942 of 2404)
UNSUPPORTED: lldb-api :: commands/trace/TestTraceExport.py (943 of 2404)
UNSUPPORTED: lldb-api :: functionalities/longjmp/TestLongjmp.py (944 of 2404)
UNSUPPORTED: lldb-api :: tools/lldb-server/TestGdbRemoteSaveCore.py (945 of 2404)
PASS: lldb-api :: functionalities/multidebugger_commands/TestMultipleDebuggersCommands.py (946 of 2404)
PASS: lldb-api :: commands/session/save/TestSessionSave.py (947 of 2404)
PASS: lldb-api :: python_api/lldbutil/TestSwigVersion.py (948 of 2404)
UNSUPPORTED: lldb-api :: commands/watchpoints/watch_tagged_addr/TestWatchTaggedAddress.py (949 of 2404)
PASS: lldb-api :: commands/platform/file/close/TestPlatformFileClose.py (950 of 2404)
UNSUPPORTED: lldb-api :: commands/expression/import-std-module/pair/TestPairFromStdModule.py (951 of 2404)
PASS: lldb-api :: python_api/disassemble-raw-data/TestDisassembleRawData.py (952 of 2404)
UNSUPPORTED: lldb-api :: functionalities/unwind/standard/TestStandardUnwind.py (953 of 2404)
UNSUPPORTED: lldb-api :: tools/lldb-server/registers-target-xml-reading/TestGdbRemoteTargetXmlPacket.py (954 of 2404)
PASS: lldb-api :: commands/version/TestVersion.py (955 of 2404)
UNSUPPORTED: lldb-api :: functionalities/unwind/ehframe/TestEhFrameUnwind.py (956 of 2404)
PASS: lldb-api :: python_api/interpreter/TestRunCommandInterpreterAPI.py (957 of 2404)
UNSUPPORTED: lldb-api :: functionalities/ptrauth_diagnostics/brkC47x_x16_invalid/TestPtrauthBRKc47xX16Invalid.py (958 of 2404)
PASS: lldb-api :: commands/target/stop-hook/disable/TestTargetStopHookDisable.py (959 of 2404)
PASS: lldb-api :: commands/quit/TestQuit.py (960 of 2404)
UNSUPPORTED: lldb-api :: commands/trace/TestTraceSchema.py (961 of 2404)
PASS: lldb-api :: macosx/load-kext/TestLoadKext.py (962 of 2404)
PASS: lldb-api :: python_api/sberror/TestSBError.py (963 of 2404)
PASS: lldb-api :: functionalities/gdb_remote_client/TestqOffsets.py (964 of 2404)
PASS: lldb-api :: functionalities/paths/TestPaths.py (965 of 2404)
UNSUPPORTED: lldb-api :: commands/watchpoints/multi_watchpoint_slots/TestWatchpointMultipleSlots.py (966 of 2404)
UNSUPPORTED: lldb-api :: commands/target/auto-install-main-executable/TestAutoInstallMainExecutable.py (967 of 2404)
PASS: lldb-api :: lang/c/local_types/TestUseClosestType.py (968 of 2404)
UNSUPPORTED: lldb-api :: functionalities/disassemble/aarch64-adrp-add/TestAArch64AdrpAdd.py (969 of 2404)
UNSUPPORTED: lldb-api :: functionalities/gdb_remote_client/TestAArch64XMLRegOffsets.py (970 of 2404)
UNSUPPORTED: lldb-api :: functionalities/ptrauth_diagnostics/LDRAA_error/TestPtrauthLDRAADiagnostic.py (971 of 2404)
PASS: lldb-api :: commands/platform/file/read/TestPlatformFileRead.py (972 of 2404)
PASS: lldb-api :: commands/target/select/TestTargetSelect.py (973 of 2404)
PASS: lldb-api :: test_utils/TestPExpectTest.py (974 of 2404)
PASS: lldb-api :: functionalities/abbreviation/TestAbbreviations.py (975 of 2404)
PASS: lldb-api :: commands/target/stop-hook/enable/TestTargetStopHookEnable.py (976 of 2404)
UNSUPPORTED: lldb-api :: lang/objc/rdar-12408181/TestRdar12408181.py (977 of 2404)
UNSUPPORTED: lldb-api :: benchmarks/expression/TestExpressionCmd.py (978 of 2404)
UNSUPPORTED: lldb-api :: functionalities/tty/TestTerminal.py (979 of 2404)
UNSUPPORTED: lldb-api :: commands/trace/TestTraceLoad.py (980 of 2404)
PASS: lldb-api :: python_api/sblaunchinfo/TestSBLaunchInfo.py (981 of 2404)
PASS: lldb-shell :: Minidump/memory-region-from-module.yaml (982 of 2404)
UNSUPPORTED: lldb-api :: functionalities/data-formatter/data-formatter-stl/libstdcpp/iterator/TestDataFormatterStdIterator.py (983 of 2404)
PASS: lldb-api :: lang/objcxx/cpp_keywords_enabled/TestObjCppKeywordsEnabled.py (984 of 2404)
UNSUPPORTED: lldb-api :: tools/lldb-server/TestGdbRemoteModuleInfo.py (985 of 2404)
UNSUPPORTED: lldb-api :: benchmarks/libcxxmap/TestBenchmarkLibcxxMap.py (986 of 2404)
UNSUPPORTED: lldb-api :: functionalities/dyld-launch-linux/TestDyldLaunchLinux.py (987 of 2404)
UNSUPPORTED: lldb-api :: python_api/disassemble-raw-data/TestDisassemble_VST1_64.py (988 of 2404)
UNSUPPORTED: lldb-api :: functionalities/data-formatter/data-formatter-stl/libstdcpp/tuple/TestDataFormatterStdTuple.py (989 of 2404)
UNSUPPORTED: lldb-api :: tools/lldb-server/TestGdbRemoteFork.py (990 of 2404)
UNSUPPORTED: lldb-api :: benchmarks/continue/TestBenchmarkContinue.py (991 of 2404)
UNSUPPORTED: lldb-api :: commands/register/register/aarch64_sve_registers/rw_access_dynamic_resize/TestSVEThreadedDynamic.py (992 of 2404)
UNSUPPORTED: lldb-api :: functionalities/gdb_remote_client/TestQemuAArch64TargetXml.py (993 of 2404)
PASS: lldb-api :: commands/breakpoint/set/func-regex/TestBreakpointRegexError.py (994 of 2404)
UNSUPPORTED: lldb-api :: commands/register/register/aarch64_sve_registers/rw_access_static_config/TestSVERegisters.py (995 of 2404)
UNSUPPORTED: lldb-api :: functionalities/process_save_core_minidump/TestProcessSaveCoreMinidump.py (996 of 2404)
UNSUPPORTED: lldb-api :: functionalities/process_save_core/TestProcessSaveCore.py (997 of 2404)
UNSUPPORTED: lldb-api :: tools/lldb-server/TestGdbRemoteCompletion.py (998 of 2404)
PASS: lldb-api :: commands/breakpoint/command/list/TestBreakpointCommandList.py (999 of 2404)
PASS: lldb-api :: functionalities/data-formatter/type_summary_list_arg/TestTypeSummaryListArg.py (1000 of 2404)
UNSUPPORTED: lldb-api :: lang/objc/modules-update/TestClangModulesUpdate.py (1001 of 2404)
PASS: lldb-api :: commands/target/stop-hook/delete/TestTargetStopHookDelete.py (1002 of 2404)
UNSUPPORTED: lldb-api :: linux/add-symbols/TestTargetSymbolsAddCommand.py (1003 of 2404)
UNSUPPORTED: lldb-api :: commands/trace/TestTraceDumpInfo.py (1004 of 2404)
UNSUPPORTED: lldb-api :: functionalities/data-formatter/data-formatter-stl/libstdcpp/string/TestDataFormatterStdString.py (1005 of 2404)
PASS: lldb-api :: functionalities/wrong_commands/TestWrongCommands.py (1006 of 2404)
PASS: lldb-api :: assert_messages_test/TestAssertMessages.py (1007 of 2404)
UNSUPPORTED: lldb-api :: commands/expression/call-restarts/TestCallThatRestarts.py (1008 of 2404)
UNSUPPORTED: lldb-api :: functionalities/signal/handle-segv/TestHandleSegv.py (1009 of 2404)
UNSUPPORTED: lldb-api :: functionalities/data-formatter/data-formatter-stl/libstdcpp/list/TestDataFormatterStdList.py (1010 of 2404)
PASS: lldb-api :: python_api/sbstructureddata/TestStructuredDataAPI.py (1011 of 2404)
UNSUPPORTED: lldb-api :: arm/breakpoint-thumb-codesection/TestBreakpointThumbCodesection.py (1012 of 2404)
UNSUPPORTED: lldb-api :: commands/register/register/aarch64_dynamic_regset/TestArm64DynamicRegsets.py (1013 of 2404)
PASS: lldb-api :: commands/command/delete/TestCommandDelete.py (1014 of 2404)
UNSUPPORTED: lldb-api :: linux/thread/create_during_instruction_step/TestCreateDuringInstructionStep.py (1015 of 2404)
PASS: lldb-api :: commands/apropos/basic/TestApropos.py (1016 of 2404)
UNSUPPORTED: lldb-api :: benchmarks/stepping/TestSteppingSpeed.py (1017 of 2404)
UNSUPPORTED: lldb-api :: linux/mix-dwo-and-regular-objects/TestMixedDwarfBinary.py (1018 of 2404)
UNSUPPORTED: lldb-api :: linux/aarch64/mte_memory_region/TestAArch64LinuxMTEMemoryRegion.py (1019 of 2404)
UNSUPPORTED: lldb-api :: benchmarks/startup/TestStartupDelays.py (1020 of 2404)
UNSUPPORTED: lldb-api :: benchmarks/expression/TestRepeatedExprs.py (1021 of 2404)
UNSUPPORTED: lldb-api :: python_api/event/TestEvents.py (1022 of 2404)
UNSUPPORTED: lldb-api :: functionalities/data-formatter/data-formatter-stl/libstdcpp/vbool/TestDataFormatterStdVBool.py (1023 of 2404)
UNSUPPORTED: lldb-api :: commands/watchpoints/hello_watchlocation/TestWatchLocation.py (1024 of 2404)
UNSUPPORTED: lldb-api :: functionalities/data-formatter/data-formatter-stl/libstdcpp/smart_ptr/TestDataFormatterStdSmartPtr.py (1025 of 2404)
UNSUPPORTED: lldb-api :: commands/watchpoints/variable_out_of_scope/TestWatchedVarHitWhenInScope.py (1026 of 2404)
UNSUPPORTED: lldb-api :: linux/aarch64/mte_tag_faults/TestAArch64LinuxMTEMemoryTagFaults.py (1027 of 2404)
UNSUPPORTED: lldb-api :: functionalities/thread/state/TestThreadStates.py (1028 of 2404)
PASS: lldb-api :: functionalities/history/TestHistoryRecall.py (1029 of 2404)
UNSUPPORTED: lldb-api :: arm/breakpoint-it/TestBreakpointIt.py (1030 of 2404)
UNSUPPORTED: lldb-api :: benchmarks/turnaround/TestCompileRunToBreakpointTurnaround.py (1031 of 2404)
UNSUPPORTED: lldb-api :: linux/aarch64/mte_tag_access/TestAArch64LinuxMTEMemoryTagAccess.py (1032 of 2404)
UNSUPPORTED: lldb-api :: functionalities/data-formatter/data-formatter-stl/libstdcpp/map/TestDataFormatterStdMap.py (1033 of 2404)
UNSUPPORTED: lldb-api :: benchmarks/frame_variable/TestFrameVariableResponse.py (1034 of 2404)
PASS: lldb-shell :: ObjectFile/ELF/build-id-case.yaml (1035 of 2404)
UNSUPPORTED: lldb-api :: functionalities/data-formatter/data-formatter-stl/libstdcpp/unique_ptr/TestDataFormatterStdUniquePtr.py (1036 of 2404)
UNSUPPORTED: lldb-api :: functionalities/thread/concurrent_events/TestConcurrentManySignals.py (1037 of 2404)
UNSUPPORTED: lldb-api :: functionalities/thread/thread_specific_break_plus_condition/TestThreadSpecificBpPlusCondition.py (1038 of 2404)
PASS: lldb-api :: api/log/TestAPILog.py (1039 of 2404)
UNSUPPORTED: lldb-api :: android/platform/TestDefaultCacheLineSize.py (1040 of 2404)
PASS: lldb-shell :: ScriptInterpreter/Python/Crashlog/parser_json.test (1041 of 2404)
PASS: lldb-shell :: Commands/CommandScriptImmediateOutput/CommandScriptImmediateOutputFile.test (1042 of 2404)
PASS: lldb-shell :: Breakpoint/dummy-target.test (1043 of 2404)
PASS: lldb-shell :: ScriptInterpreter/Python/Crashlog/parser_text.test (1044 of 2404)
PASS: lldb-shell :: Reproducer/TestHomeDir.test (1045 of 2404)
UNSUPPORTED: lldb-api :: linux/sepdebugsymlink/TestTargetSymbolsSepDebugSymlink.py (1046 of 2404)
PASS: lldb-shell :: Settings/TestEchoCommands.test (1047 of 2404)
UNSUPPORTED: lldb-api :: functionalities/data-formatter/data-formatter-stl/libstdcpp/vector/TestDataFormatterStdVector.py (1048 of 2404)
PASS: lldb-shell :: Reproducer/TestDebugSymbols.test (1049 of 2404)
PASS: lldb-shell :: Register/Core/x86-32-linux-addr.test (1050 of 2404)
PASS: lldb-shell :: Register/Core/x86-32-linux-multithread.test (1051 of 2404)
PASS: lldb-shell :: SymbolFile/DWARF/x86/debug-types-missing-signature.test (1052 of 2404)
PASS: lldb-shell :: ObjectFile/MachO/symtab.yaml (1053 of 2404)
PASS: lldb-shell :: Driver/LocalLLDBInit.test (1054 of 2404)
PASS: lldb-shell :: Driver/TestCommands.test (1055 of 2404)
PASS: lldb-shell :: Register/Core/x86-32-linux-gp.test (1056 of 2404)
PASS: lldb-shell :: Reproducer/TestDriverOptions.test (1057 of 2404)
PASS: lldb-shell :: Register/Core/x86-64-linux-multithread.test (1058 of 2404)
PASS: lldb-shell :: Register/Core/x86-64-linux-fp.test (1059 of 2404)
PASS: lldb-shell :: Reproducer/TestPythonImport.test (1060 of 2404)
PASS: lldb-shell :: ScriptInterpreter/Python/command_relative_import.test (1061 of 2404)
PASS: lldb-shell :: SymbolFile/DWARF/x86/module-ownership.mm (1062 of 2404)
PASS: lldb-shell :: Register/Core/aarch64-freebsd-multithread.test (1063 of 2404)
PASS: lldb-shell :: Register/Core/x86-64-linux-gp.test (1064 of 2404)
PASS: lldb-shell :: Register/Core/x86-64-netbsd-multithread.test (1065 of 2404)
PASS: lldb-shell :: Register/Core/x86-32-linux-fp.test (1066 of 2404)
PASS: lldb-shell :: SymbolFile/DWARF/x86/debug_loc-aslr.s (1067 of 2404)
PASS: lldb-shell :: Register/Core/x86-64-netbsd-addr.test (1068 of 2404)
PASS: lldb-shell :: Register/Core/x86-32-freebsd-multithread.test (1069 of 2404)
PASS: lldb-shell :: Register/Core/x86-64-linux-addr.test (1070 of 2404)
PASS: lldb-shell :: BuildScript/toolchain-clang.test (1071 of 2404)
PASS: lldb-shell :: ObjectFile/Breakpad/breakpad-identification.test (1072 of 2404)
PASS: lldb-shell :: Settings/TestStopCommandSourceOnError.test (1073 of 2404)
PASS: lldb-shell :: Settings/TestSettingsWrite.test (1074 of 2404)
PASS: lldb-shell :: Minidump/no-process-id.yaml (1075 of 2404)
PASS: lldb-shell :: Minidump/disassemble-no-module.yaml (1076 of 2404)
PASS: lldb-shell :: Commands/command-disassemble.s (1077 of 2404)
PASS: lldb-shell :: VSCode/TestOptions.test (1078 of 2404)
PASS: lldb-shell :: SymbolFile/Breakpad/stack-cfi-parsing.test (1079 of 2404)
PASS: lldb-shell :: Commands/command-source.test (1080 of 2404)
PASS: lldb-shell :: ScriptInterpreter/Python/eof.test (1081 of 2404)
PASS: lldb-shell :: Register/Core/x86-32-netbsd-gp.test (1082 of 2404)
PASS: lldb-shell :: Reproducer/TestProcessList.test (1083 of 2404)
PASS: lldb-shell :: Minidump/breakpad-symbols.test (1084 of 2404)
PASS: lldb-shell :: Minidump/Windows/find-module.test (1085 of 2404)
PASS: lldb-shell :: SymbolFile/Breakpad/unwind-via-stack-win.test (1086 of 2404)
PASS: lldb-shell :: Reproducer/TestCrash.test (1087 of 2404)
PASS: lldb-shell :: Register/Core/x86-32-freebsd-addr.test (1088 of 2404)
PASS: lldb-shell :: Register/Core/x86-64-freebsd-addr.test (1089 of 2404)
PASS: lldb-shell :: Minidump/memory-region.yaml (1090 of 2404)
PASS: lldb-shell :: Minidump/Windows/broken-unwind.test (1091 of 2404)
PASS: lldb-shell :: BuildScript/script-args.test (1092 of 2404)
PASS: lldb-shell :: SymbolFile/Breakpad/unwind-via-raSearch.test (1093 of 2404)
PASS: lldb-shell :: Register/Core/x86-32-freebsd-gp.test (1094 of 2404)
PASS: lldb-shell :: SymbolFile/DWARF/anon_class_w_and_wo_export_symbols.ll (1095 of 2404)
PASS: lldb-shell :: SymbolFile/Breakpad/unwind-via-stack-cfi.test (1096 of 2404)
PASS: lldb-shell :: Register/Core/x86-64-netbsd-fp.test (1097 of 2404)
PASS: lldb-shell :: Register/Core/x86-32-netbsd-multithread.test (1098 of 2404)
PASS: lldb-shell :: Minidump/Windows/Sigsegv/sigsegv.test (1099 of 2404)
PASS: lldb-shell :: Register/Core/x86-64-freebsd-multithread.test (1100 of 2404)
PASS: lldb-shell :: Register/Core/x86-32-netbsd-addr.test (1101 of 2404)
PASS: lldb-shell :: Register/Core/x86-64-netbsd-gp.test (1102 of 2404)
PASS: lldb-shell :: Register/Core/x86-32-freebsd-fp.test (1103 of 2404)
PASS: lldb-shell :: Register/Core/x86-64-freebsd-gp.test (1104 of 2404)
PASS: lldb-shell :: ScriptInterpreter/Python/scripted_breakpoint.test (1105 of 2404)
PASS: lldb-shell :: Register/Core/x86-64-freebsd-fp.test (1106 of 2404)
PASS: lldb-shell :: ScriptInterpreter/Python/fail_breakpoint_oneline.test (1107 of 2404)
PASS: lldb-shell :: ObjectFile/ELF/duplicate-section.yaml (1108 of 2404)
PASS: lldb-shell :: ScriptInterpreter/Python/sb_address_exception.test (1109 of 2404)
PASS: lldb-shell :: Commands/CommandScriptImmediateOutput/CommandScriptImmediateOutputConsole.test (1110 of 2404)
PASS: lldb-unit :: ScriptInterpreter/Python/Release/ScriptInterpreterPythonTests/PythonDataObjectsTest.TestCallable (1111 of 2404)
PASS: lldb-shell :: SymbolFile/DWARF/x86/DW_AT_declaration-with-children.s (1112 of 2404)
PASS: lldb-shell :: ScriptInterpreter/Python/scripted_breakpoint_lua.test (1113 of 2404)
PASS: lldb-shell :: ObjectFile/PDB/object.test (1114 of 2404)
PASS: lldb-shell :: BuildScript/compiler-full-path.test (1115 of 2404)
PASS: lldb-shell :: SymbolFile/DWARF/DW_AT_range-DW_FORM_sec_offset.s (1116 of 2404)
PASS: lldb-shell :: Commands/command-image-lookup.yaml (1117 of 2404)
PASS: lldb-shell :: Breakpoint/case-sensitive.test (1118 of 2404)
PASS: lldb-shell :: SymbolFile/DWARF/x86/DW_TAG_variable-DW_AT_const_value.s (1119 of 2404)
PASS: lldb-shell :: SymbolFile/DWARF/x86/dwp.s (1120 of 2404)
PASS: lldb-unit :: Utility/Release/UtilityTests/TimerTest.CategoryTimesStats (1121 of 2404)
PASS: lldb-shell :: SymbolFile/DWARF/x86/debug_loc.s (1122 of 2404)
PASS: lldb-shell :: SymbolFile/DWARF/x86/dwp-debug-types.s (1123 of 2404)
PASS: lldb-shell :: SymbolFile/DWARF/x86/DW_AT_data_bit_offset-DW_OP_stack_value.s (1124 of 2404)
PASS: lldb-shell :: SymbolFile/DWARF/x86/parallel-indexing-stress.s (1125 of 2404)
PASS: lldb-shell :: SymbolFile/DWARF/x86/dwarf5-implicit-const.s (1126 of 2404)
PASS: lldb-shell :: Driver/TestRepl.test (1127 of 2404)
PASS: lldb-shell :: Quit/TestQuitExitCode30.test (1128 of 2404)
PASS: lldb-shell :: SymbolFile/DWARF/x86/gnu-style-compression.cpp (1129 of 2404)
PASS: lldb-shell :: SymbolFile/DWARF/x86/DW_TAG_variable-invalid_location.s (1130 of 2404)
PASS: lldb-shell :: Quit/TestQuitExitCodeHexA.test (1131 of 2404)
PASS: lldb-shell :: Quit/TestQuitExitCode-30.test (1132 of 2404)
PASS: lldb-shell :: Expr/TestMultilineExpr.test (1133 of 2404)
PASS: lldb-shell :: SymbolFile/DWARF/x86/dwarf5-split.s (1134 of 2404)
PASS: lldb-unit :: Process/gdb-remote/Release/ProcessGdbRemoteTests/GDBRemoteClientBaseTest.SendContinueAndInterrupt (1135 of 2404)
PASS: lldb-unit :: Process/gdb-remote/Release/ProcessGdbRemoteTests/GDBRemoteClientBaseTest.SendContinueAndLateInterrupt (1136 of 2404)
PASS: lldb-unit :: Process/gdb-remote/Release/ProcessGdbRemoteTests/GDBRemoteClientBaseTest.SendContinueAndAsyncSignal (1137 of 2404)
PASS: lldb-unit :: Utility/Release/UtilityTests/TimerTest.CategoryTimes2 (1138 of 2404)
PASS: lldb-unit :: Utility/Release/UtilityTests/Predicate.WaitForValueEqualTo (1139 of 2404)
PASS: lldb-unit :: Process/gdb-remote/Release/ProcessGdbRemoteTests/GDBRemoteClientBaseTest.SendContinueAndAsyncPacket (1140 of 2404)
PASS: lldb-unit :: Utility/Release/UtilityTests/RecordReplayTest.InstrumentedFoo (1141 of 2404)
PASS: lldb-unit :: Utility/Release/UtilityTests/RecordReplayTest.InstrumentedBarPtr (1142 of 2404)
PASS: lldb-unit :: Utility/Release/UtilityTests/RecordReplayTest.InstrumentedBarRef (1143 of 2404)
PASS: lldb-unit :: Utility/Release/UtilityTests/RecordReplayTest.InstrumentedFooSameThis (1144 of 2404)
PASS: lldb-shell :: SymbolFile/DWARF/x86/split-dwarf-inlining.cpp (1145 of 2404)
PASS: lldb-shell :: SymbolFile/DWARF/x86/DW_TAG_basic_type_DW_ATE_UTF_nonC.ll (1146 of 2404)
PASS: lldb-unit :: Utility/Release/UtilityTests/RecordReplayTest.ValidSequence (1147 of 2404)
PASS: lldb-unit :: Utility/Release/UtilityTests/RecordReplayTest.InstrumentedBar (1148 of 2404)
PASS: lldb-shell :: SymbolFile/DWARF/dwo-relative-path.s (1149 of 2404)
PASS: lldb-shell :: SymbolFile/DWARF/x86/dwo-type-in-main-file.s (1150 of 2404)
PASS: lldb-unit :: ScriptInterpreter/Python/Release/ScriptInterpreterPythonTests/PythonDataObjectsTest.TestGlobalNameResolutionWithDot (1151 of 2404)
PASS: lldb-shell :: SymbolFile/DWARF/x86/DW_AT_location-DW_AT_const_value.s (1152 of 2404)
PASS: lldb-shell :: SymbolFile/DWARF/x86/DW_AT_const_value-bitfields.s (1153 of 2404)
PASS: lldb-shell :: ObjectFile/ELF/riscv-arch.yaml (1154 of 2404)
PASS: lldb-shell :: ObjectFile/ELF/PT_LOAD-overlap-PT_TLS.yaml (1155 of 2404)
PASS: lldb-shell :: ObjectFile/ELF/PT_TLS-overlap-PT_LOAD.yaml (1156 of 2404)
PASS: lldb-shell :: SymbolFile/DWARF/x86/DW_OP_piece-smaller-than-struct.s (1157 of 2404)
PASS: lldb-shell :: SymbolFile/DWARF/x86/DW_OP_piece-struct.s (1158 of 2404)
PASS: lldb-shell :: SymbolFile/DWARF/x86/DW_AT_const_value.s (1159 of 2404)
PASS: lldb-shell :: SymbolFile/DWARF/clang-ast-from-dwarf-unamed-and-anon-structs.cpp (1160 of 2404)
PASS: lldb-shell :: SymbolFile/DWARF/x86/find-method-local-struct.cpp (1161 of 2404)
PASS: lldb-shell :: Breakpoint/split-dwarf5-debug-stroffsets.test (1162 of 2404)
PASS: lldb-shell :: SymbolFile/DWARF/x86/dwarf5-atomic.s (1163 of 2404)
PASS: lldb-shell :: SymbolFile/DWARF/x86/apple-index-is-used.cpp (1164 of 2404)
PASS: lldb-unit :: tools/lldb-server/tests/Release/LLDBServerTests/StandardStartupTest.TestStopReplyContainsThreadPcs (1165 of 2404)
PASS: lldb-shell :: SymbolFile/DWARF/x86/debug_rnglists-dwp.s (1166 of 2404)
PASS: lldb-shell :: Breakpoint/split-dwarf-5-addrbase.test (1167 of 2404)
PASS: lldb-shell :: SymbolFile/DWARF/x86/dwarf5-debug_line.s (1168 of 2404)
PASS: lldb-shell :: SymbolFile/symbol-binding.test (1169 of 2404)
PASS: lldb-shell :: SymbolFile/DWARF/clang-ast-from-dwarf-objc-property.m (1170 of 2404)
PASS: lldb-shell :: SymbolFile/DWARF/x86/dwarf5_tu_index_abbrev_offset.s (1171 of 2404)
PASS: lldb-shell :: SymbolFile/DWARF/x86/find-qualified-variable.cpp (1172 of 2404)
PASS: lldb-shell :: SymbolFile/DWARF/x86/debug_loclists-dwp.s (1173 of 2404)
PASS: lldb-shell :: Breakpoint/single-file-split-dwarf.test (1174 of 2404)
PASS: lldb-unit :: ScriptInterpreter/Python/Release/ScriptInterpreterPythonTests/PythonDataObjectsTest.TestRun (1175 of 2404)
PASS: lldb-unit :: ScriptInterpreter/Python/Release/ScriptInterpreterPythonTests/PythonDataObjectsTest.TestPythonListManipulation (1176 of 2404)
PASS: lldb-shell :: SymbolFile/DWARF/x86/split-dwarf-multiple-cu.ll (1177 of 2404)
PASS: lldb-shell :: SymbolFile/DWARF/x86/DW_AT_decl_file-DW_AT_specification-crosscu.s (1178 of 2404)
PASS: lldb-shell :: SymbolFile/DWARF/x86/debug_rnglists-dwo.s (1179 of 2404)
PASS: lldb-shell :: SymbolFile/DWARF/x86/debug_rnglists.s (1180 of 2404)
PASS: lldb-shell :: SymbolFile/DWARF/x86/debug_loc_and_loclists.s (1181 of 2404)
PASS: lldb-unit :: ScriptInterpreter/Python/Release/ScriptInterpreterPythonTests/PythonDataObjectsTest.TestExtractingUInt64ThroughStructuredData (1182 of 2404)
PASS: lldb-shell :: ObjectFile/wasm/unified-debug-sections.yaml (1183 of 2404)
PASS: lldb-shell :: Reproducer/TestFinalize.test (1184 of 2404)
PASS: lldb-unit :: ScriptInterpreter/Python/Release/ScriptInterpreterPythonTests/PythonDataObjectsTest.TestPythonCallableCheck (1185 of 2404)
PASS: lldb-shell :: SymbolFile/Breakpad/line-table-edgecases.test (1186 of 2404)
PASS: lldb-shell :: SymbolFile/DWARF/x86/DW_AT_loclists_base.s (1187 of 2404)
PASS: lldb-shell :: Commands/command-target-modules-dump-sections.yaml (1188 of 2404)
PASS: lldb-shell :: ObjectFile/Breakpad/uuid-matching-mac.test (1189 of 2404)
PASS: lldb-unit :: ScriptInterpreter/Python/Release/ScriptInterpreterPythonTests/PythonDataObjectsTest.TestTypeNameResolutionNoDot (1190 of 2404)
PASS: lldb-unit :: ScriptInterpreter/Python/Release/ScriptInterpreterPythonTests/PythonDataObjectsTest.TestPythonInteger (1191 of 2404)
PASS: lldb-shell :: ObjectFile/ELF/minidebuginfo-corrupt-xz.yaml (1192 of 2404)
PASS: lldb-unit :: ScriptInterpreter/Python/Release/ScriptInterpreterPythonTests/PythonDataObjectsTest.TestGlobalNameResolutionNoDot (1193 of 2404)
PASS: lldb-unit :: ScriptInterpreter/Python/Release/ScriptInterpreterPythonTests/PythonDataObjectsTest.TestObjectAttributes (1194 of 2404)
PASS: lldb-unit :: ScriptInterpreter/Python/Release/ScriptInterpreterPythonTests/PythonDataObjectsTest.TestExceptions (1195 of 2404)
PASS: lldb-shell :: SymbolFile/Breakpad/symtab-macho.test (1196 of 2404)
PASS: lldb-unit :: ScriptInterpreter/Python/Release/ScriptInterpreterPythonTests/PythonDataObjectsTest.TestPythonBytes (1197 of 2404)
PASS: lldb-unit :: ScriptInterpreter/Python/Release/ScriptInterpreterPythonTests/PythonDataObjectsTest.TestPythonStringToStr (1198 of 2404)
PASS: lldb-shell :: Error/assert.test (1199 of 2404)
PASS: lldb-unit :: ScriptInterpreter/Python/Release/ScriptInterpreterPythonTests/PythonDataObjectsTest.TestScript (1200 of 2404)
PASS: lldb-shell :: SymbolFile/DWARF/x86/debug_line-relative_path.s (1201 of 2404)
PASS: lldb-shell :: SymbolFile/DWARF/x86/debug_aranges-empty-section.s (1202 of 2404)
PASS: lldb-shell :: SymbolFile/DWARF/x86/debug_ranges.s (1203 of 2404)
PASS: lldb-shell :: Driver/TestUseColor.test (1204 of 2404)
PASS: lldb-shell :: SymbolFile/DWARF/x86/debug_ranges-missing-section.s (1205 of 2404)
PASS: lldb-shell :: SymbolFile/DWARF/x86/debug_loclists-dwo.s (1206 of 2404)
PASS: lldb-shell :: SymbolFile/Breakpad/line-table-missing-file.test (1207 of 2404)
PASS: lldb-shell :: SymbolFile/Breakpad/symtab.test (1208 of 2404)
PASS: lldb-shell :: SymbolFile/DWARF/x86/DW_AT_low_pc-addrx.s (1209 of 2404)
PASS: lldb-shell :: SymbolFile/DWARF/x86/debug_line-tombstone.s (1210 of 2404)
PASS: lldb-shell :: SymbolFile/Breakpad/line-table-mixed-path-styles.test (1211 of 2404)
PASS: lldb-unit :: ScriptInterpreter/Python/Release/ScriptInterpreterPythonTests/PythonDataObjectsTest.TestResetting (1212 of 2404)
PASS: lldb-shell :: ObjectFile/PECOFF/invalid-export-table.yaml (1213 of 2404)
PASS: lldb-unit :: ScriptInterpreter/Python/Release/ScriptInterpreterPythonTests/PythonDataObjectsTest.TestDictionaryResolutionWithDot (1214 of 2404)
PASS: lldb-unit :: ScriptInterpreter/Python/Release/ScriptInterpreterPythonTests/PythonDataObjectsTest.TestPythonCallableInvoke (1215 of 2404)
PASS: lldb-shell :: ObjectFile/ELF/eh_frame-symbols.yaml (1216 of 2404)
PASS: lldb-shell :: SymbolFile/DWARF/x86/dwarf5-debug_line-file-index.s (1217 of 2404)
PASS: lldb-unit :: tools/lldb-server/tests/Release/LLDBServerTests/TestBase.DebugserverEnv (1218 of 2404)
PASS: lldb-unit :: ScriptInterpreter/Python/Release/ScriptInterpreterPythonTests/PythonDataObjectsTest.TestPythonDictionaryValueEquality (1219 of 2404)
PASS: lldb-unit :: ScriptInterpreter/Python/Release/ScriptInterpreterPythonTests/PythonDataObjectsTest.TestPythonIntegerToStructuredInteger (1220 of 2404)
PASS: lldb-shell :: SymbolFile/Breakpad/line-table.test (1221 of 2404)
PASS: lldb-unit :: tools/lldb-server/tests/Release/LLDBServerTests/TestBase.LaunchModePreservesEnvironment (1222 of 2404)
PASS: lldb-unit :: ScriptInterpreter/Python/Release/ScriptInterpreterPythonTests/PythonDataObjectsTest.TestInstanceNameResolutionNoDot (1223 of 2404)
PASS: lldb-unit :: ScriptInterpreter/Python/Release/ScriptInterpreterPythonTests/PythonDataObjectsTest.TestPythonByteArray (1224 of 2404)
PASS: lldb-shell :: ObjectFile/ELF/section-types.yaml (1225 of 2404)
PASS: lldb-unit :: ScriptInterpreter/Python/Release/ScriptInterpreterPythonTests/PythonDataObjectsTest.TestPythonDictionaryToStructuredDictionary (1226 of 2404)
PASS: lldb-shell :: Quit/TestQuitExitCodeHex0.test (1227 of 2404)
PASS: lldb-shell :: SymbolFile/Breakpad/line-table-discontinuous-file-ids.test (1228 of 2404)
PASS: lldb-unit :: ScriptInterpreter/Python/Release/ScriptInterpreterPythonTests/PythonDataObjectsTest.TestPythonBoolean (1229 of 2404)
PASS: lldb-unit :: ScriptInterpreter/Python/Release/ScriptInterpreterPythonTests/PythonDataObjectsTest.TestModuleNameResolutionNoDot (1230 of 2404)
PASS: lldb-unit :: Host/Release/HostTests/HostInfoTest.GetXcodeSDK (1231 of 2404)
PASS: lldb-unit :: ScriptInterpreter/Python/Release/ScriptInterpreterPythonTests/PythonDataObjectsTest.TestPythonDictionaryManipulation (1232 of 2404)
PASS: lldb-unit :: ScriptInterpreter/Python/Release/ScriptInterpreterPythonTests/PythonDataObjectsTest.TestOwnedReferences (1233 of 2404)
PASS: lldb-unit :: ScriptInterpreter/Python/Release/ScriptInterpreterPythonTests/PythonDataObjectsTest.TestBorrowedReferences (1234 of 2404)
PASS: lldb-shell :: SymbolFile/DWARF/x86/debug-types-dwarf5.s (1235 of 2404)
PASS: lldb-shell :: Quit/TestQuitExitCodeNonInt.test (1236 of 2404)
PASS: lldb-shell :: SymbolFile/DWARF/x86/static_scope.s (1237 of 2404)
PASS: lldb-shell :: ObjectFile/PECOFF/basic-info-arm.yaml (1238 of 2404)
PASS: lldb-shell :: ObjectFile/PECOFF/sections-names.yaml (1239 of 2404)
PASS: lldb-shell :: Driver/TestCore.test (1240 of 2404)
PASS: lldb-shell :: Settings/TestSettingsSet.test (1241 of 2404)
PASS: lldb-shell :: ObjectFile/ELF/minidebuginfo-find-symbols.yaml (1242 of 2404)
PASS: lldb-shell :: ObjectFile/PECOFF/sections.yaml (1243 of 2404)
PASS: lldb-shell :: Breakpoint/debug_rnglistx_rlex.test (1244 of 2404)
PASS: lldb-shell :: Commands/command-regex-unalias.test (1245 of 2404)
PASS: lldb-unit :: Expression/Release/ExpressionTests/DWARFExpressionMockProcessTest.DW_OP_deref (1246 of 2404)
PASS: lldb-unit :: Process/gdb-remote/Release/ProcessGdbRemoteTests/GDBRemoteCommunicationClientTest.TestPacketSpeedJSON (1247 of 2404)
PASS: lldb-shell :: Breakpoint/debug_rnglist_offset_pair.test (1248 of 2404)
PASS: lldb-unit :: ScriptInterpreter/Python/Release/ScriptInterpreterPythonTests/PythonDataObjectsTest.TestPythonListValueEquality (1249 of 2404)
PASS: lldb-unit :: ScriptInterpreter/Python/Release/ScriptInterpreterPythonTests/PythonDataObjectsTest.TestPythonStringToStructuredString (1250 of 2404)
PASS: lldb-unit :: ScriptInterpreter/Python/Release/ScriptInterpreterPythonTests/PythonDataObjectsTest.TestPythonString (1251 of 2404)
PASS: lldb-shell :: Driver/TestFile.test (1252 of 2404)
PASS: lldb-unit :: ScriptInterpreter/Python/Release/ScriptInterpreterPythonTests/PythonDataObjectsTest.TestPythonListToStructuredList (1253 of 2404)
PASS: lldb-unit :: ScriptInterpreter/Python/Release/ScriptInterpreterPythonTests/PythonDataObjectsTest.TestPythonTupleToStructuredList (1254 of 2404)
PASS: lldb-shell :: Breakpoint/debug_rnglist_basic.test (1255 of 2404)
PASS: lldb-shell :: ObjectFile/ELF/short-build-id.yaml (1256 of 2404)
PASS: lldb-shell :: Breakpoint/debug_rnglist_rlestartend.test (1257 of 2404)
PASS: lldb-shell :: ObjectFile/wasm/basic.yaml (1258 of 2404)
PASS: lldb-shell :: ObjectFile/wasm/embedded-debug-sections.yaml (1259 of 2404)
PASS: lldb-unit :: ScriptInterpreter/Python/Release/ScriptInterpreterPythonTests/PythonDataObjectsTest.TestPythonTupleSize (1260 of 2404)
PASS: lldb-unit :: ScriptInterpreter/Python/Release/ScriptInterpreterPythonTests/PythonDataObjectsTest.TestPythonFile (1261 of 2404)
PASS: lldb-unit :: ScriptInterpreter/Python/Release/ScriptInterpreterPythonTests/PythonDataObjectsTest.TestPythonTupleValues (1262 of 2404)
PASS: lldb-shell :: Quit/TestQuitExitCode0.test (1263 of 2404)
PASS: lldb-shell :: SymbolFile/DWARF/x86/debug-types-line-tables.s (1264 of 2404)
PASS: lldb-unit :: ScriptInterpreter/Python/Release/ScriptInterpreterPythonTests/PythonDataObjectsTest.TestPythonTupleInitializerList (1265 of 2404)
PASS: lldb-shell :: ObjectFile/ELF/PT_LOAD-overlap.yaml (1266 of 2404)
PASS: lldb-shell :: ObjectFile/ELF/avr-basic-info.yaml (1267 of 2404)
PASS: lldb-unit :: ScriptInterpreter/Python/Release/ScriptInterpreterPythonTests/PythonDataObjectsTest.TestPythonTupleInitializerList2 (1268 of 2404)
PASS: lldb-unit :: ScriptInterpreter/Python/Release/ScriptInterpreterPythonTests/PythonDataObjectsTest.TestPythonIntegerToStr (1269 of 2404)
PASS: lldb-shell :: ObjectFile/MachO/lc_build_version.yaml (1270 of 2404)
PASS: lldb-shell :: ObjectFile/PECOFF/symbol.yaml (1271 of 2404)
PASS: lldb-shell :: ObjectFile/ELF/netbsd-exec-8.99.30-amd64.yaml (1272 of 2404)
PASS: lldb-shell :: ObjectFile/ELF/section-overlap.yaml (1273 of 2404)
PASS: lldb-shell :: ObjectFile/PECOFF/section-types.yaml (1274 of 2404)
PASS: lldb-shell :: SymbolFile/DWARF/x86/childless-compile-unit.s (1275 of 2404)
PASS: lldb-shell :: ObjectFile/PECOFF/basic-info-arm64.yaml (1276 of 2404)
PASS: lldb-shell :: ObjectFile/MachO/lc_build_version_notools.yaml (1277 of 2404)
PASS: lldb-shell :: ObjectFile/ELF/null-jmprel.yaml (1278 of 2404)
PASS: lldb-shell :: Settings/TestDisableColor.test (1279 of 2404)
PASS: lldb-shell :: ObjectFile/ELF/section-types-edgecases.yaml (1280 of 2404)
PASS: lldb-shell :: ObjectFile/ELF/gnu-debuglink.yaml (1281 of 2404)
PASS: lldb-shell :: ObjectFile/ELF/PT_LOAD-overlap-PT_INTERP.yaml (1282 of 2404)
PASS: lldb-shell :: Commands/command-backtrace-parser-2.test (1283 of 2404)
PASS: lldb-shell :: Quit/TestQuitExitCodeTooManyArgs.test (1284 of 2404)
PASS: lldb-shell :: ObjectFile/MachO/subsections.yaml (1285 of 2404)
PASS: lldb-shell :: ObjectFile/ELF/compressed-sections.yaml (1286 of 2404)
PASS: lldb-shell :: ObjectFile/ELF/PT_LOAD.yaml (1287 of 2404)
PASS: lldb-shell :: ObjectFile/wasm/stripped-debug-sections.yaml (1288 of 2404)
PASS: lldb-shell :: ObjectFile/MachO/lc_version_min.yaml (1289 of 2404)
PASS: lldb-shell :: ObjectFile/ELF/section-permissions.yaml (1290 of 2404)
PASS: lldb-shell :: ObjectFile/ELF/PT_LOAD-empty.yaml (1291 of 2404)
PASS: lldb-shell :: ObjectFile/ELF/aarch64-relocations.yaml (1292 of 2404)
PASS: lldb-shell :: ObjectFile/ELF/section-addresses.yaml (1293 of 2404)
PASS: lldb-shell :: ObjectFile/PECOFF/basic-info.yaml (1294 of 2404)
PASS: lldb-unit :: Thread/Release/ThreadTests/ThreadTest.SetStopInfo (1295 of 2404)
PASS: lldb-shell :: ScriptInterpreter/None/import_module.test (1296 of 2404)
PASS: lldb-shell :: Quit/TestQuitExitCodeImplicit0.test (1297 of 2404)
PASS: lldb-unit :: Expression/Release/ExpressionTests/CppModuleConfigurationTest.LinuxLocalLibCpp (1298 of 2404)
PASS: lldb-shell :: Settings/TestDefaultModuleCachePath.test (1299 of 2404)
PASS: lldb-shell :: ScriptInterpreter/None/none.test (1300 of 2404)
PASS: lldb-shell :: ObjectFile/ELF/base-address.yaml (1301 of 2404)
PASS: lldb-shell :: Driver/TestProcessAttach.test (1302 of 2404)
PASS: lldb-shell :: Driver/TestNoUseColor.test (1303 of 2404)
PASS: lldb-shell :: Driver/TestHelp.test (1304 of 2404)
PASS: lldb-unit :: Expression/Release/ExpressionTests/CppModuleConfigurationTest.Linux (1305 of 2404)
PASS: lldb-shell :: Commands/command-regex-delete.test (1306 of 2404)
PASS: lldb-unit :: Utility/Release/UtilityTests/ListenerTest.GetEventWait (1307 of 2404)
PASS: lldb-shell :: Settings/TestModuleCacheSanity.test (1308 of 2404)
PASS: lldb-shell :: Commands/command-backtrace-parser-1.test (1309 of 2404)
PASS: lldb-shell :: ObjectFile/Breakpad/sections-trailing-func.test (1310 of 2404)
PASS: lldb-shell :: Settings/TestDisassemblyFormat.test (1311 of 2404)
PASS: lldb-shell :: ObjectFile/Breakpad/discontiguous-sections.test (1312 of 2404)
PASS: lldb-shell :: ObjectFile/ELF/PT_LOAD-overlap-section.yaml (1313 of 2404)
PASS: lldb-shell :: ObjectFile/ELF/netbsd-core-amd64.test (1314 of 2404)
PASS: lldb-shell :: ObjectFile/Breakpad/sections.test (1315 of 2404)
PASS: lldb-unit :: Expression/Release/ExpressionTests/ClangExpressionDeclMapTest.TestPersistentDeclLookup (1316 of 2404)
PASS: lldb-unit :: API/Release/APITests/SBCommandInterpreterTest.SingleWordCommand (1317 of 2404)
PASS: lldb-shell :: Driver/TestError.test (1318 of 2404)
PASS: lldb-unit :: Process/Release/ProcessEventDataTests/ProcessEventDataTest.DoOnRemoval (1319 of 2404)
PASS: lldb-unit :: Target/Release/TargetTests/ExecutionContextTest.GetByteOrderProcess (1320 of 2404)
PASS: lldb-unit :: Expression/Release/ExpressionTests/CppModuleConfigurationTest.LibCppV2 (1321 of 2404)
PASS: lldb-shell :: Breakpoint/debug_addrx.test (1322 of 2404)
PASS: lldb-unit :: Expression/Release/ExpressionTests/DWARFExpression.DW_OP_convert (1323 of 2404)
PASS: lldb-unit :: API/Release/APITests/SBCommandInterpreterTest.MultiWordCommand (1324 of 2404)
PASS: lldb-unit :: Target/Release/TargetTests/ModuleCacheTest.GetAndPut (1325 of 2404)
PASS: lldb-unit :: Target/Release/TargetTests/ExecutionContextTest.GetByteOrderTarget (1326 of 2404)
PASS: lldb-unit :: Thread/Release/ThreadTests/ThreadTest.GetPrivateStopInfo (1327 of 2404)
PASS: lldb-unit :: API/Release/APITests/SBStructuredDataTest.NullImpl (1328 of 2404)
PASS: lldb-unit :: Symbol/Release/SymbolTests/DWARFCallFrameInfoTest.Basic_dwarf3 (1329 of 2404)
PASS: lldb-unit :: Symbol/Release/SymbolTests/LineEntryTest.GetAllExactLineColumnMatches (1330 of 2404)
PASS: lldb-unit :: Utility/Release/UtilityTests/PassiveReplayTest.InstrumentedFooInvalid (1331 of 2404)
PASS: lldb-unit :: Utility/Release/UtilityTests/TimerTest.CategoryTimesNested (1332 of 2404)
PASS: lldb-unit :: Target/Release/TargetTests/ModuleCacheTest.GetAndPutUuidExists (1333 of 2404)
PASS: lldb-unit :: Utility/Release/UtilityTests/Predicate.WaitForValueNotEqualTo (1334 of 2404)
PASS: lldb-unit :: Target/Release/TargetTests/ModuleCacheTest.GetAndPutStrangeHostname (1335 of 2404)
PASS: lldb-unit :: Symbol/Release/SymbolTests/LineEntryTest.GetAllExactLineMatchesWithoutColumn (1336 of 2404)
PASS: lldb-unit :: Symbol/Release/SymbolTests/LineEntryTest.GetSameLineContiguousAddressRangeNestedInline (1337 of 2404)
PASS: lldb-unit :: ObjectFile/MachO/Release/ObjectFileMachOTests/ObjectFileMachOTest.ModuleFromSharedCacheInfo (1338 of 2404)
PASS: lldb-unit :: Utility/Release/UtilityTests/RecordReplayTest.InvalidSequence (1339 of 2404)
PASS: lldb-unit :: Target/Release/TargetTests/StackFrameRecognizerTest.NullModuleRegex (1340 of 2404)
PASS: lldb-unit :: SymbolFile/DWARF/Release/SymbolFileDWARFTests/DWARFASTParserClangTests.EnsureAllDIEsInDeclContextHaveBeenParsedParsesOnlyMatchingEntries (1341 of 2404)
PASS: lldb-unit :: Process/Release/ProcessEventDataTests/ProcessEventDataTest.ShouldStop (1342 of 2404)
PASS: lldb-unit :: Symbol/Release/SymbolTests/TestTypeSystemClang.TestGetEnumIntegerTypeUnexpectedType (1343 of 2404)
PASS: lldb-unit :: Utility/Release/UtilityTests/TimerTest.CategoryTimes (1344 of 2404)
PASS: lldb-unit :: Target/Release/TargetTests/MemoryRegionInfoTest.Formatv (1345 of 2404)
PASS: lldb-unit :: Language/Highlighting/Release/HighlighterTests/HighlighterTest.ClangCursorOutOfBounds (1346 of 2404)
PASS: lldb-unit :: Language/Highlighting/Release/HighlighterTests/HighlighterTest.ClangStringLiterals (1347 of 2404)
PASS: lldb-unit :: Language/Highlighting/Release/HighlighterTests/HighlighterTest.ClangTrailingBackslashWithWhitespace (1348 of 2404)
PASS: lldb-unit :: Symbol/Release/SymbolTests/LineEntryTest.GetSameLineContiguousAddressRangeOneInline (1349 of 2404)
PASS: lldb-unit :: Symbol/Release/SymbolTests/TestClangASTImporter.MetadataPropagationIndirectImport (1350 of 2404)
PASS: lldb-unit :: Interpreter/Release/InterpreterTests/CompletionTest.DirCompletionUsername (1351 of 2404)
PASS: lldb-unit :: SymbolFile/DWARF/Release/SymbolFileDWARFTests/SymbolFileDWARFTests.TestAbilitiesForDWARF (1352 of 2404)
PASS: lldb-unit :: Symbol/Release/SymbolTests/LineEntryTest.GetSameLineContiguousAddressRangeNoInlines (1353 of 2404)
PASS: lldb-unit :: Expression/Release/ExpressionTests/CppModuleConfigurationTest.IgnoreLibStdCpp (1354 of 2404)
PASS: lldb-unit :: Interpreter/Release/InterpreterTests/CompletionTest.DirCompletionAbsolute (1355 of 2404)
PASS: lldb-unit :: Symbol/Release/SymbolTests/TestTypeSystemClang.AddMethodToObjCObjectType (1356 of 2404)
PASS: lldb-unit :: Expression/Release/ExpressionTests/ClangExpressionDeclMapTest.TestUnknownIdentifierLookup (1357 of 2404)
PASS: lldb-unit :: Symbol/Release/SymbolTests/TestClangASTImporter.CompleteFwdDeclWithOtherOrigin (1358 of 2404)
PASS: lldb-unit :: Interpreter/Release/InterpreterTests/CompletionTest.FileCompletionAbsolute (1359 of 2404)
PASS: lldb-unit :: UnwindAssembly/x86/Release/UnwindAssemblyx86Tests/Testx86AssemblyInspectionEngine.TestStackRealignMSVC_i386 (1360 of 2404)
PASS: lldb-unit :: UnwindAssembly/x86/Release/UnwindAssemblyx86Tests/Testx86AssemblyInspectionEngine.TestSimple32bitFrameFunction (1361 of 2404)
PASS: lldb-unit :: Language/Highlighting/Release/HighlighterTests/HighlighterTest.ClangEmptyInput (1362 of 2404)
PASS: lldb-unit :: Language/Highlighting/Release/HighlighterTests/HighlighterTest.ClangPreserveNewLine (1363 of 2404)
PASS: lldb-unit :: Expression/Release/ExpressionTests/DiagnosticManagerTest.GetStringMultiline (1364 of 2404)
PASS: lldb-unit :: Symbol/Release/SymbolTests/TestTypeSystemClang.TestDisplayNameEmpty (1365 of 2404)
PASS: lldb-unit :: Symbol/Release/SymbolTests/TestTypeSystemClang.TestGetTypeClassTypeOfExpr (1366 of 2404)
PASS: lldb-unit :: UnwindAssembly/x86/Release/UnwindAssemblyx86Tests/Testx86AssemblyInspectionEngine.Test64bitFramelessSmallStackFrame (1367 of 2404)
PASS: lldb-unit :: Symbol/Release/SymbolTests/TestTypeSystemClang.TestRecordHasFields (1368 of 2404)
PASS: lldb-unit :: Core/Release/LLDBCoreTests/MangledTest.NameIndexes_FindFunctionSymbols (1369 of 2404)
PASS: lldb-unit :: Symbol/Release/SymbolTests/TestClangASTImporter.CopyDeclTagDecl (1370 of 2404)
PASS: lldb-unit :: SymbolFile/DWARF/Release/SymbolFileDWARFTests/DWARFDIETest.ChildIteration (1371 of 2404)
PASS: lldb-unit :: Expression/Release/ExpressionTests/DiagnosticManagerTest.GetStringPreserveOrder (1372 of 2404)
PASS: lldb-unit :: Symbol/Release/SymbolTests/TestClangASTImporter.DeportDeclTagDecl (1373 of 2404)
PASS: lldb-unit :: Symbol/Release/SymbolTests/DWARFCallFrameInfoTest.Basic_dwarf4 (1374 of 2404)
PASS: lldb-unit :: Symbol/Release/SymbolTests/TestTypeSystemMap.GetTypeSystemForLanguageWithNoModule (1375 of 2404)
PASS: lldb-unit :: Expression/Release/ExpressionTests/CppModuleConfigurationTest.MissingLibCpp (1376 of 2404)
PASS: lldb-unit :: Symbol/Release/SymbolTests/TestTypeSystemClang.TestGetTypeClassNested (1377 of 2404)
PASS: lldb-unit :: UnwindAssembly/x86/Release/UnwindAssemblyx86Tests/Testx86AssemblyInspectionEngine.TestPushEAX (1378 of 2404)
PASS: lldb-unit :: UnwindAssembly/x86/Release/UnwindAssemblyx86Tests/Testx86AssemblyInspectionEngine.Test32BitOnlyInstruction (1379 of 2404)
PASS: lldb-unit :: Expression/Release/ExpressionTests/DWARFExpression.DW_OP_piece (1380 of 2404)
PASS: lldb-unit :: Symbol/Release/SymbolTests/Type.GetTypeScopeAndBasename (1381 of 2404)
PASS: lldb-unit :: Symbol/Release/SymbolTests/SymbolsTest.TerminateLocateExecutableSymbolFileForUnknownExecutableAndUnknownSymbolFile (1382 of 2404)
PASS: lldb-unit :: Symbol/Release/SymbolTests/TestClangASTImporter.MetadataPropagationAfterCopying (1383 of 2404)
PASS: lldb-unit :: Symbol/Release/SymbolTests/SymbolsTest.LocateExecutableSymbolFileForUnknownExecutableAndMissingSymbolFile (1384 of 2404)
PASS: lldb-unit :: SymbolFile/DWARF/Release/SymbolFileDWARFTests/SymbolFileDWARFTests.TestAbbrevOrder1Start1 (1385 of 2404)
PASS: lldb-unit :: Symbol/Release/SymbolTests/Type.CompilerContextPattern (1386 of 2404)
PASS: lldb-unit :: SymbolFile/DWARF/Release/SymbolFileDWARFTests/DWARFUnitTest.MissingSentinel (1387 of 2404)
PASS: lldb-unit :: Process/minidump/Release/LLDBMinidumpTests/MinidumpParserTest.GetMemoryRegionInfoFromMemoryList (1388 of 2404)
PASS: lldb-unit :: Expression/Release/ExpressionTests/DiagnosticManagerTest.PutStringMultiple (1389 of 2404)
PASS: lldb-unit :: Language/Highlighting/Release/HighlighterTests/HighlighterTest.DefaultHighlighterWithCursorOutOfBounds (1390 of 2404)
PASS: lldb-unit :: Expression/Release/ExpressionTests/DiagnosticManagerTest.GetStringBasic (1391 of 2404)
PASS: lldb-unit :: Expression/Release/ExpressionTests/DiagnosticManagerTest.AppendMessageSubsequentDiags (1392 of 2404)
PASS: lldb-unit :: Expression/Release/ExpressionTests/DiagnosticManagerTest.GetStringNoDiags (1393 of 2404)
PASS: lldb-unit :: Symbol/Release/SymbolTests/TestTypeSystemClang.TestFunctionTemplateInRecordConstruction (1394 of 2404)
PASS: lldb-unit :: Expression/Release/ExpressionTests/CppModuleConfigurationTest.UnrelatedLibrary (1395 of 2404)
PASS: lldb-unit :: Language/Highlighting/Release/HighlighterTests/HighlighterTest.ClangUnterminatedString (1396 of 2404)
PASS: lldb-unit :: Language/Highlighting/Release/HighlighterTests/HighlighterTest.ClangTrailingBackslashMissingNewLine (1397 of 2404)
PASS: lldb-unit :: Expression/Release/ExpressionTests/DWARFExpression.DW_OP_const (1398 of 2404)
PASS: lldb-unit :: Symbol/Release/SymbolTests/TestTypeSystemClang.TestFunctionTemplateConstruction (1399 of 2404)
PASS: lldb-unit :: Expression/Release/ExpressionTests/CppModuleConfigurationTest.Sysroot (1400 of 2404)
PASS: lldb-unit :: Symbol/Release/SymbolTests/DWARFCallFrameInfoTest.Basic_eh (1401 of 2404)
PASS: lldb-unit :: UnwindAssembly/x86/Release/UnwindAssemblyx86Tests/Testx86AssemblyInspectionEngine.TestDisassemblyMidFunctionEpilogues (1402 of 2404)
PASS: lldb-unit :: Expression/Release/ExpressionTests/CppModuleConfigurationTest.MissingUsrInclude (1403 of 2404)
PASS: lldb-unit :: Symbol/Release/SymbolTests/TestTypeSystemClang.TestNotDeletingUserCopyCstrDueToMoveCStr (1404 of 2404)
PASS: lldb-unit :: Language/Highlighting/Release/HighlighterTests/HighlighterTest.ClangCursorPos (1405 of 2404)
PASS: lldb-unit :: ObjectFile/ELF/Release/ObjectFileELFTests/ObjectFileELFTest.GetSymtab_NoSymEntryPointArmAddressClass (1406 of 2404)
PASS: lldb-unit :: Symbol/Release/SymbolTests/PostfixExpression.ToDWARF (1407 of 2404)
PASS: lldb-unit :: Language/Highlighting/Release/HighlighterTests/HighlighterTest.ClangIdentifiers (1408 of 2404)
PASS: lldb-unit :: SymbolFile/DWARF/Release/SymbolFileDWARFTests/SymbolFileDWARFTests.TestAbbrevNullAttrValidForm (1409 of 2404)
PASS: lldb-unit :: Symbol/Release/SymbolTests/TestClangASTImporter.CopyTypeTagDecl (1410 of 2404)
PASS: lldb-unit :: Symbol/Release/SymbolTests/TestTypeSystemClang.TestGetBasicTypeFromName (1411 of 2404)
PASS: lldb-unit :: Target/Release/TargetTests/ExecutionContextTest.GetByteOrder (1412 of 2404)
PASS: lldb-unit :: Symbol/Release/SymbolTests/TestTypeSystemMap.GetTypeSystemForLanguageWithNoTarget (1413 of 2404)
PASS: lldb-unit :: Symbol/Release/SymbolTests/TestTypeSystemClang.TestGetEnumIntegerTypeInvalid (1414 of 2404)
PASS: lldb-unit :: Expression/Release/ExpressionTests/DiagnosticManagerTest.FixedExpression (1415 of 2404)
PASS: lldb-unit :: Symbol/Release/SymbolTests/TestTypeSystemClang.TestGetEnumIntegerTypeBasicTypes (1416 of 2404)
PASS: lldb-unit :: Symbol/Release/SymbolTests/TestTypeSystemClang.TestDisplayName (1417 of 2404)
PASS: lldb-unit :: Symbol/Release/SymbolTests/TestTypeSystemMap.GetTypeSystemForLanguageWithInvalidModule (1418 of 2404)
PASS: lldb-unit :: Platform/Release/LLDBPlatformTests/PlatformDarwinTest.FindComponentInPath (1419 of 2404)
PASS: lldb-unit :: Language/Highlighting/Release/HighlighterTests/HighlighterTest.DefaultHighlighter (1420 of 2404)
PASS: lldb-unit :: Symbol/Release/SymbolTests/TestTypeSystemClang.TestGetTypeClassDeclType (1421 of 2404)
PASS: lldb-unit :: Symbol/Release/SymbolTests/TestCreateClassTemplateDecl.FindExistingTemplates (1422 of 2404)
PASS: lldb-unit :: Process/gdb-remote/Release/ProcessGdbRemoteTests/GDBRemoteCommunicationClientTest.SendSignalsToIgnore (1423 of 2404)
PASS: lldb-unit :: UnwindAssembly/x86/Release/UnwindAssemblyx86Tests/Testx86AssemblyInspectionEngine.TestPushEBX (1424 of 2404)
PASS: lldb-unit :: Language/Highlighting/Release/HighlighterTests/HighlighterTest.ClangScalarLiterals (1425 of 2404)
PASS: lldb-unit :: Expression/Release/ExpressionTests/CppModuleConfigurationTest.AmbiguousLibCpp (1426 of 2404)
PASS: lldb-unit :: Expression/Release/ExpressionTests/CppModuleConfigurationTest.Xcode (1427 of 2404)
PASS: lldb-unit :: Target/Release/TargetTests/PathMappingListTest.RelativeTests (1428 of 2404)
PASS: lldb-unit :: Editline/Release/EditlineTests/EditlineTestFixture.EditlineReceivesMultiLineText (1429 of 2404)
PASS: lldb-unit :: Utility/Release/UtilityTests/GeneratorTest.YamlMultiProvider (1430 of 2404)
PASS: lldb-unit :: UnwindAssembly/x86/Release/UnwindAssemblyx86Tests/Testx86AssemblyInspectionEngine.TestPushR12 (1431 of 2404)
PASS: lldb-unit :: Language/Highlighting/Release/HighlighterTests/HighlighterTest.ClangSquareBrackets (1432 of 2404)
PASS: lldb-unit :: Symbol/Release/SymbolTests/TestTypeSystemClang.TestConvertAccessTypeToAccessSpecifier (1433 of 2404)
PASS: lldb-unit :: Symbol/Release/SymbolTests/TestClangASTImporter.DeportTypeTagDecl (1434 of 2404)
PASS: lldb-unit :: Symbol/Release/SymbolTests/TestClangASTImporter.ImportInvalidType (1435 of 2404)
PASS: lldb-unit :: UnwindAssembly/x86/Release/UnwindAssemblyx86Tests/Testx86AssemblyInspectionEngine.TestPushRBX (1436 of 2404)
PASS: lldb-unit :: Language/CLanguages/Release/LanguageCLanguagesTests/CLanguages.LookupCLanguagesByLanguageType (1437 of 2404)
PASS: lldb-unit :: Symbol/Release/SymbolTests/TestClangASTImporter.MetadataPropagation (1438 of 2404)
PASS: lldb-unit :: Expression/Release/ExpressionTests/ClangHostTest.ComputeClangResourceDirectory (1439 of 2404)
PASS: lldb-unit :: Language/Highlighting/Release/HighlighterTests/HighlighterTest.ClangOperators (1440 of 2404)
PASS: lldb-unit :: Symbol/Release/SymbolTests/TestClangASTImporter.RecordLayout (1441 of 2404)
PASS: lldb-unit :: Expression/Release/ExpressionTests/DiagnosticManagerTest.AppendMessageNoDiag (1442 of 2404)
PASS: lldb-unit :: SymbolFile/DWARF/Release/SymbolFileDWARFTests/SymbolFileDWARFTests.TestAbbrevOutOfOrder (1443 of 2404)
PASS: lldb-unit :: Target/Release/TargetTests/RemoteAwarePlatformTest.TestResolveExecutabelOnClientByPlatform (1444 of 2404)
PASS: lldb-unit :: Expression/Release/ExpressionTests/CppModuleConfigurationTest.UnknownLibCppFile (1445 of 2404)
PASS: lldb-unit :: SymbolFile/DWARF/Release/SymbolFileDWARFTests/DWARFUnitTest.NullUnitDie (1446 of 2404)
PASS: lldb-unit :: Target/Release/TargetTests/MCBasedABI.MapRegisterName (1447 of 2404)
PASS: lldb-unit :: Symbol/Release/SymbolTests/TestTypeSystemClang.TestGetBasicTypeFromEnum (1448 of 2404)
PASS: lldb-unit :: Language/Highlighting/Release/HighlighterTests/HighlighterTest.Colons (1449 of 2404)
PASS: lldb-unit :: SymbolFile/DWARF/Release/SymbolFileDWARFTests/SymbolFileDWARFTests.ParseArangesIgnoreEmpty (1450 of 2404)
PASS: lldb-unit :: Symbol/Release/SymbolTests/TestTypeSystemClang.TestBuiltinTypeForEncodingAndBitSize (1451 of 2404)
PASS: lldb-unit :: ObjectFile/PECOFF/Release/ObjectFilePECOFFTests/PECallFrameInfoTest.Basic_eh (1452 of 2404)
PASS: lldb-unit :: Expression/Release/ExpressionTests/ClangHostTest.MacOSX (1453 of 2404)
PASS: lldb-unit :: Symbol/Release/SymbolTests/TestTypeSystemClang.TemplateArguments (1454 of 2404)
PASS: lldb-unit :: Utility/Release/UtilityTests/VASprintfTest.BufferResize (1455 of 2404)
PASS: lldb-unit :: UnwindAssembly/x86/Release/UnwindAssemblyx86Tests/Testx86AssemblyInspectionEngine.TestSpillRegToStackViaMOVx86_64 (1456 of 2404)
PASS: lldb-unit :: UnwindAssembly/x86/Release/UnwindAssemblyx86Tests/Testx86AssemblyInspectionEngine.TestPushECX (1457 of 2404)
PASS: lldb-unit :: SymbolFile/DWARF/Release/SymbolFileDWARFTests/SymbolFileDWARFTests.TestAbbrevValidAttrNullForm (1458 of 2404)
PASS: lldb-unit :: SymbolFile/DWARF/Release/SymbolFileDWARFTests/SymbolFileDWARFTests.TestAbbrevOrder1Start5 (1459 of 2404)
PASS: lldb-unit :: Expression/Release/ExpressionTests/DiagnosticManagerTest.AddDiagnostic (1460 of 2404)
PASS: lldb-unit :: Platform/Release/LLDBPlatformTests/PlatformDarwinTest.TestParseVersionBuildDir (1461 of 2404)
PASS: lldb-unit :: Symbol/Release/SymbolTests/TestCreateClassTemplateDecl.FindExistingTemplatesWithParameterPack (1462 of 2404)
PASS: lldb-unit :: Expression/Release/ExpressionTests/DiagnosticManagerTest.AppendMessageAttachToLastDiag (1463 of 2404)
PASS: lldb-unit :: Symbol/Release/SymbolTests/TestTypeSystemClang.TestUnifyAccessSpecifiers (1464 of 2404)
PASS: lldb-unit :: Language/Highlighting/Release/HighlighterTests/HighlighterTest.ClangCursorPosBeforeOtherToken (1465 of 2404)
PASS: lldb-unit :: Symbol/Release/SymbolTests/TestTypeSystemClang.TestIsClangType (1466 of 2404)
PASS: lldb-unit :: Target/Release/TargetTests/PathMappingListTest.CrossPlatformTests (1467 of 2404)
PASS: lldb-unit :: UnwindAssembly/x86/Release/UnwindAssemblyx86Tests/Testx86AssemblyInspectionEngine.TestPopEDI (1468 of 2404)
PASS: lldb-unit :: Symbol/Release/SymbolTests/TestScratchTypeSystemClang.InferSubASTFromLangOpts (1469 of 2404)
PASS: lldb-unit :: Language/Highlighting/Release/HighlighterTests/HighlighterTest.ClangCursorPosEndOfLine (1470 of 2404)
PASS: lldb-unit :: Symbol/Release/SymbolTests/TestTypeSystemClang.TestOwningModule (1471 of 2404)
PASS: lldb-unit :: Language/Highlighting/Release/HighlighterTests/HighlighterTest.Keywords (1472 of 2404)
PASS: lldb-unit :: Language/Highlighting/Release/HighlighterTests/HighlighterTest.ClangCursorPosInOtherToken (1473 of 2404)
PASS: lldb-unit :: Language/Highlighting/Release/HighlighterTests/HighlighterTest.HighlighterSelectionType (1474 of 2404)
PASS: lldb-unit :: Expression/Release/ExpressionTests/DWARFExpression.DW_OP_unknown (1475 of 2404)
PASS: lldb-unit :: SymbolFile/DWARF/Release/SymbolFileDWARFTests/SymbolFileDWARFTests.TestAbbrevMissingTerminator (1476 of 2404)
PASS: lldb-unit :: Utility/Release/UtilityTests/StringExtractorTest.GetHexBytes_Underflow (1477 of 2404)
PASS: lldb-unit :: Symbol/Release/SymbolTests/TestTypeSystemClang.TestGetTypeClassTypeOf (1478 of 2404)
PASS: lldb-unit :: UnwindAssembly/x86/Release/UnwindAssemblyx86Tests/Testx86AssemblyInspectionEngine.TestSpillRegToStackViaMOVi386 (1479 of 2404)
PASS: lldb-unit :: UnwindAssembly/x86/Release/UnwindAssemblyx86Tests/Testx86AssemblyInspectionEngine.TestPushExtended (1480 of 2404)
PASS: lldb-unit :: UnwindAssembly/x86/Release/UnwindAssemblyx86Tests/Testx86AssemblyInspectionEngine.TestPopR13 (1481 of 2404)
PASS: lldb-unit :: Symbol/Release/SymbolTests/TestTypeSystemClang.TestRemoveFastQualifiers (1482 of 2404)
PASS: lldb-unit :: UnwindAssembly/x86/Release/UnwindAssemblyx86Tests/Testx86AssemblyInspectionEngine.TestPushRBP (1483 of 2404)
PASS: lldb-unit :: Symbol/Release/SymbolTests/TestTypeSystemClang.GetExeModuleWhenMissingSymbolFile (1484 of 2404)
PASS: lldb-unit :: UnwindAssembly/x86/Release/UnwindAssemblyx86Tests/Testx86AssemblyInspectionEngine.TestPushEBP (1485 of 2404)
PASS: lldb-unit :: Expression/Release/ExpressionTests/CppModuleConfigurationTest.AmbiguousCLib (1486 of 2404)
PASS: lldb-unit :: UnwindAssembly/x86/Release/UnwindAssemblyx86Tests/Testx86AssemblyInspectionEngine.TestPopR12 (1487 of 2404)
PASS: lldb-unit :: UnwindAssembly/x86/Release/UnwindAssemblyx86Tests/Testx86AssemblyInspectionEngine.TestPushESI (1488 of 2404)
PASS: lldb-unit :: Process/gdb-remote/Release/ProcessGdbRemoteTests/GDBRemoteCommunicationClientTest.ReadMemoryTags (1489 of 2404)
PASS: lldb-unit :: Symbol/Release/SymbolTests/PostfixExpression.ParseFPOProgram (1490 of 2404)
PASS: lldb-unit :: Expression/Release/ExpressionTests/DiagnosticManagerTest.PutStringSeverities (1491 of 2404)
PASS: lldb-unit :: UnwindAssembly/x86/Release/UnwindAssemblyx86Tests/Testx86AssemblyInspectionEngine.TestSubRSP (1492 of 2404)
PASS: lldb-unit :: Target/Release/TargetTests/PathMappingListTest.AbsoluteTests (1493 of 2404)
PASS: lldb-unit :: Language/Highlighting/Release/HighlighterTests/HighlighterTest.ClangBraces (1494 of 2404)
PASS: lldb-unit :: SymbolFile/DWARF/Release/SymbolFileDWARFTests/SymbolFileDWARFTests.TestAbbrevInvalidNULLTag (1495 of 2404)
PASS: lldb-unit :: Language/Highlighting/Release/HighlighterTests/HighlighterTest.ClangCommas (1496 of 2404)
PASS: lldb-unit :: UnwindAssembly/x86/Release/UnwindAssemblyx86Tests/Testx86AssemblyInspectionEngine.TestSimplex86_64Augmented (1497 of 2404)
PASS: lldb-unit :: UnwindAssembly/x86/Release/UnwindAssemblyx86Tests/Testx86AssemblyInspectionEngine.TestPushEDI (1498 of 2404)
PASS: lldb-unit :: Symbol/Release/SymbolTests/TestTypeSystemClang.TestDeletingImplicitCopyCstrDueToMoveCStr (1499 of 2404)
PASS: lldb-unit :: SymbolFile/DWARF/Release/SymbolFileDWARFTests/SymbolFileDWARFTests.ParseArangesWithMultipleTerminators (1500 of 2404)
PASS: lldb-unit :: UnwindAssembly/x86/Release/UnwindAssemblyx86Tests/Testx86AssemblyInspectionEngine.TestPush0 (1501 of 2404)
PASS: lldb-unit :: UnwindAssembly/x86/Release/UnwindAssemblyx86Tests/Testx86AssemblyInspectionEngine.TestPopR15 (1502 of 2404)
PASS: lldb-unit :: Process/gdb-remote/Release/ProcessGdbRemoteTests/GDBRemoteCommunicationClientTest.SendTraceSupportedPacket (1503 of 2404)
PASS: lldb-unit :: Process/gdb-remote/Release/ProcessGdbRemoteTests/GDBRemoteClientBaseTest.SendContinueAndInterrupt2PacketBug (1504 of 2404)
PASS: lldb-unit :: Expression/Release/ExpressionTests/DiagnosticManagerTest.PutString (1505 of 2404)
PASS: lldb-unit :: Expression/Release/ExpressionTests/DWARFExpression.DW_OP_stack_value (1506 of 2404)
PASS: lldb-unit :: Expression/Release/ExpressionTests/DiagnosticManagerTest.GetStringMultipleDiags (1507 of 2404)
PASS: lldb-unit :: Language/Highlighting/Release/HighlighterTests/HighlighterTest.ClangComments (1508 of 2404)
PASS: lldb-unit :: Language/Highlighting/Release/HighlighterTests/HighlighterTest.ClangTrailingBackslashBeforeNewline (1509 of 2404)
PASS: lldb-unit :: UnwindAssembly/x86/Release/UnwindAssemblyx86Tests/Testx86AssemblyInspectionEngine.TestDisassemblyJunkBytes (1510 of 2404)
PASS: lldb-unit :: UnwindAssembly/x86/Release/UnwindAssemblyx86Tests/Testx86AssemblyInspectionEngine.Testi386IgnoredRegisters (1511 of 2404)
PASS: lldb-unit :: Utility/Release/UtilityTests/VMRange.Comparison (1512 of 2404)
PASS: lldb-unit :: UnwindAssembly/x86/Release/UnwindAssemblyx86Tests/Testx86AssemblyInspectionEngine.Test32bitFramelessSmallStackFrame (1513 of 2404)
PASS: lldb-unit :: Expression/Release/ExpressionTests/DiagnosticManagerTest.HasFixits (1514 of 2404)
PASS: lldb-unit :: Symbol/Release/SymbolTests/TestTypeSystemClang.OnlyPackName (1515 of 2404)
PASS: lldb-unit :: Utility/Release/UtilityTests/AnsiTerminal.Unknown (1516 of 2404)
PASS: lldb-unit :: Process/gdb-remote/Release/ProcessGdbRemoteTests/GDBRemoteCommunicationClientTest.GetModulesInfoInvalidResponse (1517 of 2404)
PASS: lldb-unit :: Symbol/Release/SymbolTests/PostfixExpression.ParseOneExpression (1518 of 2404)
PASS: lldb-unit :: UnwindAssembly/x86/Release/UnwindAssemblyx86Tests/Testx86AssemblyInspectionEngine.TestPopRBPWithREX (1519 of 2404)
PASS: lldb-unit :: Symbol/Release/SymbolTests/TestClangASTImporter.CanImportInvalidType (1520 of 2404)
PASS: lldb-unit :: UnwindAssembly/x86/Release/UnwindAssemblyx86Tests/Testx86AssemblyInspectionEngine.TestStackRealign8BitDisp_i386 (1521 of 2404)
PASS: lldb-unit :: UnwindAssembly/x86/Release/UnwindAssemblyx86Tests/Testx86AssemblyInspectionEngine.TestPushR13 (1522 of 2404)
PASS: lldb-unit :: UnwindAssembly/x86/Release/UnwindAssemblyx86Tests/Testx86AssemblyInspectionEngine.TestSimple64bitFrameFunction (1523 of 2404)
PASS: lldb-unit :: Expression/Release/ExpressionTests/DWARFExpression.DW_OP_implicit_value (1524 of 2404)
PASS: lldb-unit :: Expression/Release/ExpressionTests/DWARFExpression.DW_OP_pick (1525 of 2404)
PASS: lldb-unit :: Expression/Release/ExpressionTests/DiagnosticManagerTest.GetStringSeverityLabels (1526 of 2404)
PASS: lldb-unit :: SymbolFile/DWARF/Release/SymbolFileDWARFTests/SymbolFileDWARFTests.ParseAranges (1527 of 2404)
PASS: lldb-unit :: Language/Highlighting/Release/HighlighterTests/HighlighterTest.DefaultHighlighterWithCursor (1528 of 2404)
PASS: lldb-unit :: UnwindAssembly/x86/Release/UnwindAssemblyx86Tests/Testx86AssemblyInspectionEngine.TestPushImm (1529 of 2404)
PASS: lldb-unit :: SymbolFile/DWARF/Release/SymbolFileDWARFTests/SymbolFileDWARFTests.ParseArangesSkipErrors (1530 of 2404)
PASS: lldb-unit :: Language/Highlighting/Release/HighlighterTests/HighlighterTest.HighlighterSelectionPath (1531 of 2404)
PASS: lldb-unit :: Utility/Release/UtilityTests/ProcessInstanceInfo.Yaml (1532 of 2404)
PASS: lldb-unit :: Process/gdb-remote/Release/ProcessGdbRemoteTests/GDBRemoteCommunicationTest.ReadPacket_checksum (1533 of 2404)
PASS: lldb-unit :: UnwindAssembly/x86/Release/UnwindAssemblyx86Tests/Testx86AssemblyInspectionEngine.TestMovRSPtoRBP (1534 of 2404)
PASS: lldb-unit :: UnwindAssembly/x86/Release/UnwindAssemblyx86Tests/Testx86AssemblyInspectionEngine.TestPopRBP (1535 of 2404)
PASS: lldb-unit :: Language/Highlighting/Release/HighlighterTests/HighlighterTest.ClangPPDirectives (1536 of 2404)
PASS: lldb-unit :: Editline/Release/EditlineTests/EditlineTestFixture.EditlineReceivesSingleLineText (1537 of 2404)
PASS: lldb-unit :: ObjectFile/ELF/Release/ObjectFileELFTests/ObjectFileELFTest.GetSymtab_NoSymEntryPointArmThumbAddressClass (1538 of 2404)
PASS: lldb-unit :: Process/gdb-remote/Release/ProcessGdbRemoteTests/GDBRemoteCommunicationClientTest.WriteMemoryTags (1539 of 2404)
PASS: lldb-unit :: UnwindAssembly/x86/Release/UnwindAssemblyx86Tests/Testx86AssemblyInspectionEngine.TestCALLNextInsn (1540 of 2404)
PASS: lldb-unit :: UnwindAssembly/x86/Release/UnwindAssemblyx86Tests/Testx86AssemblyInspectionEngine.Test32bitFramelessBigStackFrame (1541 of 2404)
PASS: lldb-unit :: Language/Highlighting/Release/HighlighterTests/HighlighterTest.ClangCursorPosAfterOtherToken (1542 of 2404)
PASS: lldb-unit :: Target/Release/TargetTests/PathMappingListTest.RemapRoot (1543 of 2404)
PASS: lldb-unit :: UnwindAssembly/x86/Release/UnwindAssemblyx86Tests/Testx86AssemblyInspectionEngine.TestStackRealign32BitDisp_x86_64 (1544 of 2404)
PASS: lldb-unit :: Utility/Release/UtilityTests/SerializationRountripTest.SerializeDeserializeCStringArrayNullptr (1545 of 2404)
PASS: lldb-unit :: UnwindAssembly/x86/Release/UnwindAssemblyx86Tests/Testx86AssemblyInspectionEngine.TestPushR14 (1546 of 2404)
PASS: lldb-unit :: UnwindAssembly/x86/Release/UnwindAssemblyx86Tests/Testx86AssemblyInspectionEngine.TestAddESP (1547 of 2404)
PASS: lldb-unit :: Process/gdb-remote/Release/ProcessGdbRemoteTests/GDBRemoteCommunicationClientTest.SyncThreadState (1548 of 2404)
PASS: lldb-unit :: Utility/Release/UtilityTests/XcodeSDKTest.GetCanonicalNameAndConstruct (1549 of 2404)
PASS: lldb-unit :: ObjectFile/ELF/Release/ObjectFileELFTests/ObjectFileELFTest.SectionsResolveConsistently (1550 of 2404)
PASS: lldb-unit :: Utility/Release/UtilityTests/RangeDataVector.CustomSort (1551 of 2404)
PASS: lldb-unit :: Process/gdb-remote/Release/ProcessGdbRemoteTests/GDBRemoteCommunicationClientTest.WriteRegisterNoSuffix (1552 of 2404)
PASS: lldb-unit :: SymbolFile/DWARF/Release/SymbolFileDWARFTests/SymbolFileDWARFTests.ParseArangesNonzeroSegmentSize (1553 of 2404)
PASS: lldb-unit :: UnwindAssembly/x86/Release/UnwindAssemblyx86Tests/Testx86AssemblyInspectionEngine.TestReturnDetect (1554 of 2404)
PASS: lldb-unit :: UnwindAssembly/x86/Release/UnwindAssemblyx86Tests/Testx86AssemblyInspectionEngine.TestPopESI (1555 of 2404)
PASS: lldb-unit :: Utility/Release/UtilityTests/UriParserTest.MinimalPort (1556 of 2404)
PASS: lldb-unit :: ObjectFile/PECOFF/Release/ObjectFilePECOFFTests/PECallFrameInfoTest.Frame_reg_eh (1557 of 2404)
PASS: lldb-unit :: Process/gdb-remote/Release/ProcessGdbRemoteTests/GDBRemoteCommunicationClientTest.GetQOffsets (1558 of 2404)
PASS: lldb-unit :: UnwindAssembly/x86/Release/UnwindAssemblyx86Tests/Testx86AssemblyInspectionEngine.TestPopR14 (1559 of 2404)
PASS: lldb-unit :: UnwindAssembly/x86/Release/UnwindAssemblyx86Tests/Testx86AssemblyInspectionEngine.Test64bitFramelessBigStackFrame (1560 of 2404)
PASS: lldb-unit :: Core/Release/LLDBCoreTests/ModuleSpecTest.TestMachOFile (1561 of 2404)
PASS: lldb-unit :: Process/gdb-remote/Release/ProcessGdbRemoteTests/GDBRemoteCommunicationClientTest.GetModulesInfo_UUID20 (1562 of 2404)
PASS: lldb-unit :: UnwindAssembly/x86/Release/UnwindAssemblyx86Tests/Testx86AssemblyInspectionEngine.TestPushEDX (1563 of 2404)
PASS: lldb-unit :: Utility/Release/UtilityTests/OptionsWithRawTest.EmptySuffix (1564 of 2404)
PASS: lldb-unit :: Utility/Release/UtilityTests/SerializationRountripTest.SerializeDeserializeObjectReference (1565 of 2404)
PASS: lldb-unit :: Language/CPlusPlus/Release/LanguageCPlusPlusTests/CPlusPlusLanguage.ExtractContextAndIdentifier (1566 of 2404)
PASS: lldb-unit :: Core/Release/LLDBCoreTests/ModuleSpecTest.TestCOFFFile (1567 of 2404)
PASS: lldb-unit :: UnwindAssembly/x86/Release/UnwindAssemblyx86Tests/Testx86AssemblyInspectionEngine.TestSubESP (1568 of 2404)
PASS: lldb-unit :: debugserver/Release/debugserverTests/RNBSocket.LoopBackListenIPv4 (1569 of 2404)
PASS: lldb-unit :: UnwindAssembly/x86/Release/UnwindAssemblyx86Tests/Testx86AssemblyInspectionEngine.TestPopEBP (1570 of 2404)
PASS: lldb-unit :: ObjectFile/PECOFF/Release/ObjectFilePECOFFTests/PECallFrameInfoTest.Chained_eh (1571 of 2404)
PASS: lldb-unit :: UnwindAssembly/x86/Release/UnwindAssemblyx86Tests/Testx86AssemblyInspectionEngine.TestAddRSP (1572 of 2404)
PASS: lldb-unit :: Utility/Release/UtilityTests/LogTest.LLDB_LOG_nullptr (1573 of 2404)
PASS: lldb-unit :: Interpreter/Release/InterpreterTests/TestProperties.DeepCopy (1574 of 2404)
PASS: lldb-unit :: UnwindAssembly/x86/Release/UnwindAssemblyx86Tests/Testx86AssemblyInspectionEngine.TestPopRBX (1575 of 2404)
PASS: lldb-unit :: UnwindAssembly/x86/Release/UnwindAssemblyx86Tests/Testx86AssemblyInspectionEngine.TestPushRBPWithREX (1576 of 2404)
PASS: lldb-unit :: UnwindAssembly/x86/Release/UnwindAssemblyx86Tests/Testx86AssemblyInspectionEngine.TestLEAVE (1577 of 2404)
PASS: lldb-unit :: Process/gdb-remote/Release/ProcessGdbRemoteTests/GDBRemoteCommunicationClientTest.SaveRestoreRegistersNoSuffix (1578 of 2404)
PASS: lldb-unit :: Utility/Release/UtilityTests/BroadcasterTest.EventTypeHasListeners (1579 of 2404)
PASS: lldb-unit :: Process/minidump/Release/LLDBMinidumpTests/MinidumpParserTest.GetThreadsAndGetThreadContext (1580 of 2404)
PASS: lldb-unit :: Language/Highlighting/Release/HighlighterTests/HighlighterTest.FallbackHighlighter (1581 of 2404)
PASS: lldb-unit :: Utility/Release/UtilityTests/VMRange.ContainsRange (1582 of 2404)
PASS: lldb-unit :: Utility/Release/UtilityTests/BinaryStreamTest.PutSLEB128TwoBytes (1583 of 2404)
PASS: lldb-unit :: UnwindAssembly/x86/Release/UnwindAssemblyx86Tests/Testx86AssemblyInspectionEngine.TestPushR15 (1584 of 2404)
PASS: lldb-unit :: Utility/Release/UtilityTests/RangeTest.SetRangeBase (1585 of 2404)
PASS: lldb-unit :: Process/gdb-remote/Release/ProcessGdbRemoteTests/GDBRemoteCommunicationClientTest.GetMemoryRegionInfoInvalidResponse (1586 of 2404)
PASS: lldb-unit :: Core/Release/LLDBCoreTests/RichManglingContextTest.IPDRealloc (1587 of 2404)
PASS: lldb-unit :: UnwindAssembly/x86/Release/UnwindAssemblyx86Tests/Testx86AssemblyInspectionEngine.TestSimplei386ugmented (1588 of 2404)
PASS: lldb-unit :: UnwindAssembly/x86/Release/UnwindAssemblyx86Tests/Testx86AssemblyInspectionEngine.TestPopEBX (1589 of 2404)
PASS: lldb-unit :: Utility/Release/UtilityTests/CompletionRequest.TryCompleteCurrentArgGood (1590 of 2404)
PASS: lldb-unit :: Process/gdb-remote/Release/ProcessGdbRemoteTests/GDBRemoteCommunicationServerTest.SendErrorResponse_StringError (1591 of 2404)
PASS: lldb-unit :: Utility/Release/UtilityTests/StreamTest.AddressRangeEmptyRange (1592 of 2404)
PASS: lldb-unit :: Process/minidump/Release/LLDBMinidumpTests/MinidumpParserTest.FindMemoryRange (1593 of 2404)
PASS: lldb-unit :: Utility/Release/UtilityTests/RangeDataVector.FindEntryIndexesThatContain_Overlap (1594 of 2404)
PASS: lldb-unit :: Utility/Release/UtilityTests/StringListTest.InsertStringAtIndexMove (1595 of 2404)
PASS: lldb-unit :: Utility/Release/UtilityTests/RangeTest.Copy (1596 of 2404)
PASS: lldb-unit :: Process/gdb-remote/Release/ProcessGdbRemoteTests/GDBRemoteClientBaseTest.SendContinueDelegateInterface (1597 of 2404)
PASS: lldb-unit :: Utility/Release/UtilityTests/UriParserTest.BracketedHostnameWithPortIPv6 (1598 of 2404)
PASS: lldb-unit :: Core/Release/LLDBCoreTests/SourceLocationSpecTest.OperatorBool (1599 of 2404)
PASS: lldb-unit :: Process/gdb-remote/Release/ProcessGdbRemoteTests/GDBRemoteCommunicationClientTest.ReadRegister (1600 of 2404)
PASS: lldb-unit :: Process/minidump/Release/LLDBMinidumpTests/MinidumpParserTest.MinidumpDuplicateModuleMappedFirst (1601 of 2404)
PASS: lldb-unit :: UnwindAssembly/x86/Release/UnwindAssemblyx86Tests/Testx86AssemblyInspectionEngine.TestSpArithx86_64Augmented (1602 of 2404)
PASS: lldb-unit :: Utility/Release/UtilityTests/FileSpecTest.EqualDotsWindows (1603 of 2404)
PASS: lldb-unit :: Host/Release/HostTests/SocketTests/SocketTest.DomainListenConnectAccept/ipv6 (1604 of 2404)
PASS: lldb-unit :: Utility/Release/UtilityTests/FileSpecTest.IsRelative (1605 of 2404)
PASS: lldb-unit :: Process/gdb-remote/Release/ProcessGdbRemoteTests/GDBRemoteCommunicationServerTest.SendErrorResponse_Status (1606 of 2404)
PASS: lldb-unit :: Core/Release/LLDBCoreTests/ModuleSpecTest.InvalidInMemoryBufferValidFile (1607 of 2404)
PASS: lldb-unit :: Utility/Release/UtilityTests/BinaryStreamTest.PutULEB128MaxValue (1608 of 2404)
PASS: lldb-unit :: Core/Release/LLDBCoreTests/RichManglingContextTest.FromCxxMethodName (1609 of 2404)
PASS: lldb-unit :: Utility/Release/UtilityTests/StreamTeeTest.Assignment (1610 of 2404)
PASS: lldb-unit :: Utility/Release/UtilityTests/FileSpecTest.PrependPathComponent (1611 of 2404)
PASS: lldb-unit :: Utility/Release/UtilityTests/StreamTest.PutHex32ByteOrderLittle (1612 of 2404)
PASS: lldb-unit :: Utility/Release/UtilityTests/ArgsTest.TestSingleQuotedArgWithSpace (1613 of 2404)
PASS: lldb-unit :: Utility/Release/UtilityTests/ArchSpecTest.TestParseMachCPUDashSubtypeTripleSimple (1614 of 2404)
PASS: lldb-unit :: Utility/Release/UtilityTests/StringExtractorTest.DecodeHexU8_Extra (1615 of 2404)
PASS: lldb-unit :: debugserver/Release/debugserverTests/RNBSocket.LoopBackConnectIPv6 (1616 of 2404)
PASS: lldb-unit :: Utility/Release/UtilityTests/ConstStringTest.FromMidOfBufferStringRef (1617 of 2404)
PASS: lldb-unit :: Utility/Release/UtilityTests/BinaryStreamTest.PutSLEB128EightBytes (1618 of 2404)
PASS: lldb-unit :: Utility/Release/UtilityTests/ProcessInstanceInfo.DumpTable_invalidUID (1619 of 2404)
PASS: lldb-unit :: Process/gdb-remote/Release/ProcessGdbRemoteTests/GDBRemoteCommunicationClientTest.WriteRegister (1620 of 2404)
PASS: lldb-unit :: Utility/Release/UtilityTests/ArchSpecTest.TestSetTriple (1621 of 2404)
PASS: lldb-unit :: Utility/Release/UtilityTests/AnsiTerminal.WhiteSpace (1622 of 2404)
PASS: lldb-unit :: Utility/Release/UtilityTests/StringListTest.SplitIntoLinesSingleTrailingCR (1623 of 2404)
PASS: lldb-unit :: Host/Release/HostTests/MainLoopTest.ReadObject (1624 of 2404)
PASS: lldb-unit :: Utility/Release/UtilityTests/CompletionRequest.TryCompleteCurrentArgMode (1625 of 2404)
PASS: lldb-unit :: Utility/Release/UtilityTests/StringListTest.GetMaxStringLengthMixed (1626 of 2404)
PASS: lldb-unit :: Utility/Release/UtilityTests/XcodeSDKTest.MergeTest (1627 of 2404)
PASS: lldb-unit :: Utility/Release/UtilityTests/ScalarTest.Getters (1628 of 2404)
PASS: lldb-unit :: debugserver/Release/debugserverTests/RNBSocket.LoopBackListenIPv6 (1629 of 2404)
PASS: lldb-unit :: Utility/Release/UtilityTests/ArgsTest.GetShellSafeArgument (1630 of 2404)
PASS: lldb-unit :: Utility/Release/UtilityTests/UriParserTest.PortOverflow (1631 of 2404)
PASS: lldb-unit :: Utility/Release/UtilityTests/StreamTest.PutStringAsRawHex8 (1632 of 2404)
PASS: lldb-unit :: Process/gdb-remote/Release/ProcessGdbRemoteTests/GDBRemoteCommunicationClientTest.GetMemoryRegionInfo (1633 of 2404)
PASS: lldb-unit :: Process/minidump/Release/LLDBMinidumpTests/MinidumpParserTest.GetPid (1634 of 2404)
PASS: lldb-unit :: Utility/Release/UtilityTests/LogChannelEnabledTest.log_options (1635 of 2404)
PASS: lldb-unit :: Utility/Release/UtilityTests/StreamTeeTest.CopyConstructor (1636 of 2404)
PASS: lldb-unit :: Utility/Release/UtilityTests/VMRange.Ordering (1637 of 2404)
PASS: lldb-unit :: Utility/Release/UtilityTests/StringExtractorTest.InitMisc (1638 of 2404)
PASS: lldb-unit :: Host/Release/HostTests/MainLoopTest.TerminatesImmediately (1639 of 2404)
PASS: lldb-unit :: Utility/Release/UtilityTests/FileSpecTest.EqualSeparator (1640 of 2404)
PASS: lldb-unit :: Utility/Release/UtilityTests/StringListTest.SplitIntoLines (1641 of 2404)
PASS: lldb-unit :: Utility/Release/UtilityTests/StringExtractorTest.GetU64BigEndian (1642 of 2404)
PASS: lldb-unit :: Utility/Release/UtilityTests/VMRange.SetEndAddress (1643 of 2404)
PASS: lldb-unit :: Utility/Release/UtilityTests/RangeVector.CombineConsecutiveRanges (1644 of 2404)
PASS: lldb-unit :: Utility/Release/UtilityTests/StringExtractorTest.GetHexBytes_FullString (1645 of 2404)
PASS: lldb-unit :: Process/gdb-remote/Release/ProcessGdbRemoteTests/GDBRemoteCommunicationClientTest.GetModulesInfo (1646 of 2404)
PASS: lldb-unit :: Utility/Release/UtilityTests/RangeTest.NotEqual (1647 of 2404)
PASS: lldb-unit :: Core/Release/LLDBCoreTests/MangledTest.EmptyForInvalidRustV0Name (1648 of 2404)
PASS: lldb-unit :: Utility/Release/UtilityTests/CompletionRequest.TestCompletionOwnership (1649 of 2404)
PASS: lldb-unit :: Utility/Release/UtilityTests/ScalarTest.APIntConstructor (1650 of 2404)
PASS: lldb-unit :: Utility/Release/UtilityTests/UUIDTest.SetFromStringRef (1651 of 2404)
PASS: lldb-unit :: Process/minidump/Release/LLDBMinidumpTests/MinidumpParserTest.GetLinuxProcStatus (1652 of 2404)
PASS: lldb-unit :: Utility/Release/UtilityTests/ConstStringTest.YAML (1653 of 2404)
PASS: lldb-unit :: Utility/Release/UtilityTests/StreamTeeTest.Write (1654 of 2404)
PASS: lldb-unit :: Core/Release/LLDBCoreTests/ModuleSpecTest.TestELFFile (1655 of 2404)
PASS: lldb-unit :: Utility/Release/UtilityTests/GeneratorTest.Create (1656 of 2404)
PASS: lldb-unit :: Process/minidump/Release/LLDBMinidumpTests/MinidumpParserTest.GetFilteredModuleList (1657 of 2404)
PASS: lldb-unit :: Utility/Release/UtilityTests/ArgsTest.TestQuotedUnknownEscape (1658 of 2404)
PASS: lldb-unit :: Utility/Release/UtilityTests/UriParserTest.SchemeHostSeparator (1659 of 2404)
PASS: lldb-unit :: Utility/Release/UtilityTests/StringExtractorTest.GetHexU8_InvalidHex (1660 of 2404)
PASS: lldb-unit :: Utility/Release/UtilityTests/ScalarTest.Equality (1661 of 2404)
PASS: lldb-unit :: Utility/Release/UtilityTests/RangeTest.ContainsAddr (1662 of 2404)
PASS: lldb-unit :: Utility/Release/UtilityTests/DataExtractorTest.UncommonAddressSize (1663 of 2404)
PASS: lldb-unit :: Utility/Release/UtilityTests/StringLexerTest.HasAtLeast (1664 of 2404)
PASS: lldb-unit :: Utility/Release/UtilityTests/StringListTest.ShiftMove (1665 of 2404)
PASS: lldb-unit :: Utility/Release/UtilityTests/StreamTest.AddressPrefix (1666 of 2404)
PASS: lldb-unit :: Interpreter/Release/InterpreterTests/OptionArgParserTest.toBoolean (1667 of 2404)
PASS: lldb-unit :: Utility/Release/UtilityTests/StringExtractorTest.GetHexU8_Extra_NoEof (1668 of 2404)
PASS: lldb-unit :: Utility/Release/UtilityTests/StreamTest.PutCStringWithStringRef (1669 of 2404)
PASS: lldb-unit :: Utility/Release/UtilityTests/StreamTest.PutHex8 (1670 of 2404)
PASS: lldb-unit :: Utility/Release/UtilityTests/StringExtractorTest.GetHexBytesAvail_OddPair2 (1671 of 2404)
PASS: lldb-unit :: Signals/Release/SignalsTests/UnixSignalsTest.Iteration (1672 of 2404)
PASS: lldb-unit :: Process/gdb-remote/Release/ProcessGdbRemoteTests/PortMapTest.Constructors (1673 of 2404)
PASS: lldb-unit :: Core/Release/LLDBCoreTests/UniqueCStringMap.NoDefaultConstructor (1674 of 2404)
PASS: lldb-unit :: Utility/Release/UtilityTests/StreamTest.PutHex64ByteOrderBig (1675 of 2404)
PASS: lldb-unit :: Utility/Release/UtilityTests/RangeDataVector.FindEntryIndexesThatContain (1676 of 2404)
PASS: lldb-unit :: Host/Release/HostTests/MainLoopTest.TwoSignalCallbacks (1677 of 2404)
PASS: lldb-unit :: debugserver/Release/debugserverTests/RNBSocket.AnyListen (1678 of 2404)
PASS: lldb-unit :: Utility/Release/UtilityTests/ScalarTest.Comparison (1679 of 2404)
PASS: lldb-unit :: Core/Release/LLDBCoreTests/ModuleSpecTest.InvalidInMemoryBuffer (1680 of 2404)
PASS: lldb-unit :: Utility/Release/UtilityTests/ReproducerTest.SetCapture (1681 of 2404)
PASS: lldb-unit :: Utility/Release/UtilityTests/BinaryStreamTest.PutULEB128FourBytes (1682 of 2404)
PASS: lldb-unit :: Utility/Release/UtilityTests/ArchSpecTest.TestParseMachCPUDashSubtypeTripleExtra (1683 of 2404)
PASS: lldb-unit :: Utility/Release/UtilityTests/RegisterValueTest.GetSet8 (1684 of 2404)
PASS: lldb-unit :: debugserver/Release/debugserverTests/RNBSocket.LoopBackConnectIPv4 (1685 of 2404)
PASS: lldb-unit :: Utility/Release/UtilityTests/FileSpecTest.GetPath (1686 of 2404)
PASS: lldb-unit :: Utility/Release/UtilityTests/ConstStringTest.CompareConstString (1687 of 2404)
PASS: lldb-unit :: Core/Release/LLDBCoreTests/DumpDataExtractorTest.FormatCharArray (1688 of 2404)
PASS: lldb-unit :: Utility/Release/UtilityTests/StreamTest.PutBytesAsRawHex8ToBigEndian (1689 of 2404)
PASS: lldb-unit :: DataFormatter/Release/LLDBFormatterTests/StringPrinterTests.CxxASCII (1690 of 2404)
PASS: lldb-unit :: ObjectFile/Breakpad/Release/ObjectFileBreakpadTests/LineRecord.parse (1691 of 2404)
PASS: lldb-unit :: DataFormatter/Release/LLDBFormatterTests/TypeMatcherTests.ExactName (1692 of 2404)
PASS: lldb-unit :: Utility/Release/UtilityTests/GeneratorTest.Get (1693 of 2404)
PASS: lldb-unit :: Utility/Release/UtilityTests/SerializationRountripTest.SerializeDeserializeCStringArray (1694 of 2404)
PASS: lldb-unit :: Utility/Release/UtilityTests/RegularExpression.Empty (1695 of 2404)
PASS: lldb-unit :: Utility/Release/UtilityTests/RangeTest.Slide (1696 of 2404)
PASS: lldb-unit :: Utility/Release/UtilityTests/UriParserTest.SchemeHostSeparator4 (1697 of 2404)
PASS: lldb-unit :: ObjectFile/Breakpad/Release/ObjectFileBreakpadTests/PublicRecord.parse (1698 of 2404)
PASS: lldb-unit :: Core/Release/LLDBCoreTests/FormatEntity.LookupAllEntriesInTree (1699 of 2404)
PASS: lldb-unit :: Utility/Release/UtilityTests/OptionsWithRawTest.EmptyInput (1700 of 2404)
PASS: lldb-unit :: Utility/Release/UtilityTests/ScalarTest.SetValueFromData (1701 of 2404)
PASS: lldb-unit :: Utility/Release/UtilityTests/UriParserTest.MinimalPortPath (1702 of 2404)
PASS: lldb-unit :: Utility/Release/UtilityTests/CompletionRequest.FakeLastArg (1703 of 2404)
PASS: lldb-unit :: Interpreter/Release/InterpreterTests/OptionValueString.DeepCopy (1704 of 2404)
PASS: lldb-unit :: Utility/Release/UtilityTests/ArgsTest.TestUnknownEscape (1705 of 2404)
PASS: lldb-unit :: Utility/Release/UtilityTests/BinaryStreamTest.PutSLEB128MaxValue (1706 of 2404)
PASS: lldb-unit :: Utility/Release/UtilityTests/DataExtractorTest.GetFloatUnaligned (1707 of 2404)
PASS: lldb-unit :: Utility/Release/UtilityTests/CompletionRequest.TryCompleteCurrentArgBad (1708 of 2404)
PASS: lldb-unit :: Utility/Release/UtilityTests/DataExtractorTest.GetBitfield (1709 of 2404)
PASS: lldb-unit :: Utility/Release/UtilityTests/StreamTest.ShiftOperatorStrings (1710 of 2404)
PASS: lldb-unit :: Host/Release/HostTests/SocketTests/SocketTest.DomainGetConnectURI/ipv4 (1711 of 2404)
PASS: lldb-unit :: Process/Utility/Release/ProcessUtilityTests/ProcSMapTests/LinuxProcSMapsTestFixture.ParseSMapRegions/1 (1712 of 2404)
PASS: lldb-unit :: Utility/Release/UtilityTests/ScalarTest.ComparisonFloat (1713 of 2404)
PASS: lldb-unit :: Utility/Release/UtilityTests/StreamTeeTest.GetStreamAtIndexOutOfBounds (1714 of 2404)
PASS: lldb-unit :: Utility/Release/UtilityTests/RangeTest.DoesAdjoinOrIntersect (1715 of 2404)
PASS: lldb-unit :: Utility/Release/UtilityTests/SerializationRountripTest.SerializeDeserializeObjectPointer (1716 of 2404)
PASS: lldb-unit :: Utility/Release/UtilityTests/UriParserTest.SchemeHostSeparator3 (1717 of 2404)
PASS: lldb-unit :: Utility/Release/UtilityTests/OptionsWithRawTest.SingleWhitespaceInput (1718 of 2404)
PASS: lldb-unit :: Process/gdb-remote/Release/ProcessGdbRemoteTests/GDBRemoteClientBaseTest.SendContinueDelegateStructuredDataReceipt (1719 of 2404)
PASS: lldb-unit :: DataFormatter/Release/LLDBFormatterTests/StringPrinterTests.CxxUTF8 (1720 of 2404)
PASS: lldb-unit :: Host/Release/HostTests/FileSystemTest.Resolve (1721 of 2404)
PASS: lldb-unit :: Interpreter/Release/InterpreterTests/OptionValueArgs.DeepCopy (1722 of 2404)
PASS: lldb-unit :: Utility/Release/UtilityTests/StringExtractorTest.GetHexU8_Exact_NoEof (1723 of 2404)
PASS: lldb-unit :: Utility/Release/UtilityTests/AnsiTerminal.Twice (1724 of 2404)
PASS: lldb-unit :: Core/Release/LLDBCoreTests/MangledTest.ResultForValidName (1725 of 2404)
PASS: lldb-unit :: Utility/Release/UtilityTests/BinaryStreamTest.PutULEB128SevenBytes (1726 of 2404)
PASS: lldb-unit :: Interpreter/Release/InterpreterTests/OptionValueFileColonLine.setFromString (1727 of 2404)
PASS: lldb-unit :: Core/Release/LLDBCoreTests/FormatEntityTest.DefinitionConstructionNameTypeChildren (1728 of 2404)
PASS: lldb-unit :: Process/Utility/Release/ProcessUtilityTests/ProcSMapTests/LinuxProcSMapsTestFixture.ParseSMapRegions/0 (1729 of 2404)
PASS: lldb-unit :: Utility/Release/UtilityTests/PassiveReplayTest.InstrumentedBarPtr (1730 of 2404)
PASS: lldb-unit :: Utility/Release/UtilityTests/ScalarTest.ExtractBitfield (1731 of 2404)
PASS: lldb-unit :: Utility/Release/UtilityTests/ArgsTest.ReplaceArgumentAtIndexFarOutOfRange (1732 of 2404)
PASS: lldb-unit :: Utility/Release/UtilityTests/ConstStringTest.CompareStringRef (1733 of 2404)
PASS: lldb-unit :: Host/Release/HostTests/MainLoopTest.DetectsEOF (1734 of 2404)
PASS: lldb-unit :: DataFormatter/Release/LLDBFormatterTests/FormatManagerTests.CompatibleLangs (1735 of 2404)
PASS: lldb-unit :: Core/Release/LLDBCoreTests/FormatEntityTest.DefinitionConstructionNameAndType (1736 of 2404)
PASS: lldb-unit :: Utility/Release/UtilityTests/CompletionRequest.ShiftArguments (1737 of 2404)
PASS: lldb-unit :: Utility/Release/UtilityTests/LogChannelEnabledTest.LogThread (1738 of 2404)
PASS: lldb-unit :: Utility/Release/UtilityTests/RangeTest.DoesIntersect (1739 of 2404)
PASS: lldb-unit :: Utility/Release/UtilityTests/ScalarTest.SetValueFromCString (1740 of 2404)
PASS: lldb-unit :: Utility/Release/UtilityTests/StringListTest.Join (1741 of 2404)
PASS: lldb-unit :: Process/gdb-remote/Release/ProcessGdbRemoteTests/GDBRemoteClientBaseTest.SendContinueAndWait (1742 of 2404)
PASS: lldb-unit :: Utility/Release/UtilityTests/ArgsTest.TestTrailingBackslash (1743 of 2404)
PASS: lldb-unit :: Utility/Release/UtilityTests/RangeTest.LessThanInvalid (1744 of 2404)
PASS: lldb-unit :: Utility/Release/UtilityTests/VMRange.ContainsAddr (1745 of 2404)
PASS: lldb-unit :: Process/Utility/Release/ProcessUtilityTests/ProcMapTests/LinuxProcMapsTestFixture.ParseMapRegions/8 (1746 of 2404)
PASS: lldb-unit :: Utility/Release/UtilityTests/XcodeSDKTest.SDKSupportsModules (1747 of 2404)
PASS: lldb-unit :: Utility/Release/UtilityTests/StatusTest.ErrorConversion (1748 of 2404)
PASS: lldb-unit :: Core/Release/LLDBCoreTests/MangledTest.ResultForBlockInvocation (1749 of 2404)
PASS: lldb-unit :: Process/minidump/Release/LLDBMinidumpTests/MinidumpParserTest.GetArchitectureWindows (1750 of 2404)
PASS: lldb-unit :: Utility/Release/UtilityTests/ScalarTest.GetValue (1751 of 2404)
PASS: lldb-unit :: Utility/Release/UtilityTests/OptionsWithRawTest.QuotedSuffix (1752 of 2404)
PASS: lldb-unit :: Core/Release/LLDBCoreTests/FormatEntityTest.DefinitionConstructionNameAndString (1753 of 2404)
PASS: lldb-unit :: Utility/Release/UtilityTests/ScalarTest.Promotion (1754 of 2404)
PASS: lldb-unit :: Utility/Release/UtilityTests/NameMatchesTest.Equals (1755 of 2404)
PASS: lldb-unit :: Core/Release/LLDBCoreTests/SourceFileCache.FindSourceFileFound (1756 of 2404)
PASS: lldb-unit :: Utility/Release/UtilityTests/CompletionRequest.DuplicateFiltering (1757 of 2404)
PASS: lldb-unit :: Utility/Release/UtilityTests/OptionsWithRawTest.UnterminatedQuote (1758 of 2404)
PASS: lldb-unit :: Utility/Release/UtilityTests/UserIDResolver.GetUserName (1759 of 2404)
PASS: lldb-unit :: Host/Release/HostTests/SocketTests/SocketTest.TCPGetConnectURI/ipv6 (1760 of 2404)
PASS: lldb-unit :: Utility/Release/UtilityTests/FileSpecTest.RemoveLastPathComponent (1761 of 2404)
PASS: lldb-unit :: Utility/Release/UtilityTests/ArchSpecTest.YAML (1762 of 2404)
PASS: lldb-unit :: Utility/Release/UtilityTests/ConstStringTest.MangledCounterpart (1763 of 2404)
PASS: lldb-unit :: Utility/Release/UtilityTests/StreamTest.ShiftOperatorChars (1764 of 2404)
PASS: lldb-unit :: Utility/Release/UtilityTests/GeneratorTest.GetOrCreate (1765 of 2404)
PASS: lldb-unit :: ObjectFile/Breakpad/Release/ObjectFileBreakpadTests/InfoRecord.parse (1766 of 2404)
PASS: lldb-unit :: Utility/Release/UtilityTests/RangeTest.EqualInvalid (1767 of 2404)
PASS: lldb-unit :: Interpreter/Release/InterpreterTests/OptionArgParserTest.toScriptLanguage (1768 of 2404)
PASS: lldb-unit :: Process/minidump/Release/LLDBMinidumpTests/RegisterContextMinidump.ConvertMinidumpContext_x86_32 (1769 of 2404)
PASS: lldb-unit :: Utility/Release/UtilityTests/ProcessInstanceInfoMatch.Name (1770 of 2404)
PASS: lldb-unit :: Utility/Release/UtilityTests/DataExtractorTest.GetMaxS64 (1771 of 2404)
PASS: lldb-unit :: Process/minidump/Release/LLDBMinidumpTests/MinidumpParserTest.MinidumpDuplicateModuleMinAddress (1772 of 2404)
PASS: lldb-unit :: Utility/Release/UtilityTests/StateTest.Formatv (1773 of 2404)
PASS: lldb-unit :: Utility/Release/UtilityTests/ScalarTest.GetBytes (1774 of 2404)
PASS: lldb-unit :: Utility/Release/UtilityTests/StreamTest.PutHex32ByteOrderBig (1775 of 2404)
PASS: lldb-unit :: Utility/Release/UtilityTests/ArgsTest.ReplaceArgumentAtIndexLonger (1776 of 2404)
PASS: lldb-unit :: Utility/Release/UtilityTests/ArgsTest.GetQuotedCommandString (1777 of 2404)
PASS: lldb-unit :: Core/Release/LLDBCoreTests/CommunicationTest.SynchronizeWhileClosing (1778 of 2404)
PASS: lldb-unit :: Utility/Release/UtilityTests/LogChannelTest.EnableOptions (1779 of 2404)
PASS: lldb-unit :: Utility/Release/UtilityTests/ArgsTest.ReplaceArgumentAtIndexOutOfRange (1780 of 2404)
PASS: lldb-unit :: Utility/Release/UtilityTests/ArgsTest.EscapeLLDBCommandArgument (1781 of 2404)
PASS: lldb-unit :: Utility/Release/UtilityTests/TimeoutTest.Format (1782 of 2404)
PASS: lldb-unit :: Utility/Release/UtilityTests/IndexToObjectTest.ObjectForIndex (1783 of 2404)
PASS: lldb-unit :: Utility/Release/UtilityTests/StreamTest.PutHex64ByteOrderLittle (1784 of 2404)
PASS: lldb-unit :: Utility/Release/UtilityTests/StreamTest.PutMaxHex64ByteOrderLittle (1785 of 2404)
PASS: lldb-unit :: Utility/Release/UtilityTests/UriParserTest.MinimalPath (1786 of 2404)
PASS: lldb-unit :: Utility/Release/UtilityTests/Flags.GetBitSize (1787 of 2404)
PASS: lldb-unit :: Utility/Release/UtilityTests/VMRange.CollectionContains (1788 of 2404)
PASS: lldb-unit :: DataFormatter/Release/LLDBFormatterTests/TypeMatcherTests.CreatedBySameMatchStringExactNamePrefixes (1789 of 2404)
PASS: lldb-unit :: DataFormatter/Release/LLDBFormatterTests/TypeMatcherTests.GetMatchStringRegex (1790 of 2404)
PASS: lldb-unit :: Process/minidump/Release/LLDBMinidumpTests/MinidumpParserTest.GetLinuxProcStatus_no_stream (1791 of 2404)
PASS: lldb-unit :: Utility/Release/UtilityTests/RegularExpression.CopyAssignment (1792 of 2404)
PASS: lldb-unit :: Utility/Release/UtilityTests/BinaryStreamTest.PutULEB128FiveBytes (1793 of 2404)
PASS: lldb-unit :: Utility/Release/UtilityTests/RangeTest.Equal (1794 of 2404)
PASS: lldb-unit :: Utility/Release/UtilityTests/StreamTest.AddressSuffix (1795 of 2404)
PASS: lldb-unit :: Utility/Release/UtilityTests/UriParserTest.BracketedHostnamePort (1796 of 2404)
PASS: lldb-unit :: Utility/Release/UtilityTests/ProcessInstanceInfo.Dump (1797 of 2404)
PASS: lldb-unit :: Process/minidump/Release/LLDBMinidumpTests/MinidumpParserTest.MinidumpDuplicateModuleSeparateCode (1798 of 2404)
PASS: lldb-unit :: Process/minidump/Release/LLDBMinidumpTests/MinidumpParserTest.GetThreadContext_x86_32_wow64 (1799 of 2404)
PASS: lldb-unit :: Utility/Release/UtilityTests/StringLexerTest.AdvanceIf (1800 of 2404)
PASS: lldb-unit :: Core/Release/LLDBCoreTests/MangledTest.ResultForValidRustV0Name (1801 of 2404)
PASS: lldb-unit :: Utility/Release/UtilityTests/XcodeSDKTest.SDKSupportsSwift (1802 of 2404)
PASS: lldb-unit :: Host/Release/HostTests/FileSystemTest.OpenErrno (1803 of 2404)
PASS: lldb-unit :: Utility/Release/UtilityTests/BinaryStreamTest.PutSLEB128SevenBytes (1804 of 2404)
PASS: lldb-unit :: Utility/Release/UtilityTests/BinaryStreamTest.PutULEB128NineBytes (1805 of 2404)
PASS: lldb-unit :: Core/Release/LLDBCoreTests/SourceLocationSpecTest.Equal (1806 of 2404)
PASS: lldb-unit :: Utility/Release/UtilityTests/StringListTest.GetMaxStringLengthEqualSize (1807 of 2404)
PASS: lldb-unit :: Utility/Release/UtilityTests/StreamTest.PutChar (1808 of 2404)
PASS: lldb-unit :: Host/Release/HostTests/ConnectionFileDescriptorTest.TCPGetURIv6 (1809 of 2404)
PASS: lldb-unit :: Utility/Release/UtilityTests/CompletionRequest.Constructor (1810 of 2404)
PASS: lldb-unit :: Utility/Release/UtilityTests/VMRange.Reset (1811 of 2404)
PASS: lldb-unit :: Utility/Release/UtilityTests/ArchSpecTest.OperatorBool (1812 of 2404)
PASS: lldb-unit :: Utility/Release/UtilityTests/SerializationRountripTest.SerializeDeserializeCStringArrayNullptrElem (1813 of 2404)
PASS: lldb-unit :: Utility/Release/UtilityTests/StringExtractorTest.GetU32LittleEndian (1814 of 2404)
PASS: lldb-unit :: Core/Release/LLDBCoreTests/FormatEntityTest.DefinitionConstructionNameTypeData (1815 of 2404)
PASS: lldb-unit :: Utility/Release/UtilityTests/StreamTeeTest.GetStreamAtIndexOutOfBoundsEmpty (1816 of 2404)
PASS: lldb-unit :: Utility/Release/UtilityTests/StreamTest.AddressEmptyPrefix (1817 of 2404)
PASS: lldb-unit :: Utility/Release/UtilityTests/UUIDTest.StringConverion (1818 of 2404)
PASS: lldb-unit :: Utility/Release/UtilityTests/ProcessInfoTest.Constructor (1819 of 2404)
PASS: lldb-unit :: Utility/Release/UtilityTests/RangeTest.Union (1820 of 2404)
PASS: lldb-unit :: Utility/Release/UtilityTests/FileSpecTest.Equal (1821 of 2404)
PASS: lldb-unit :: Utility/Release/UtilityTests/StringListTest.JoinEmpty (1822 of 2404)
PASS: lldb-unit :: Utility/Release/UtilityTests/SerializationRountripTest.SerializeDeserializeCStringNull (1823 of 2404)
PASS: lldb-unit :: Utility/Release/UtilityTests/StringExtractorTest.GetU32BigEndian (1824 of 2404)
PASS: lldb-unit :: Utility/Release/UtilityTests/NameMatchesTest.EndsWith (1825 of 2404)
PASS: lldb-unit :: Utility/Release/UtilityTests/RangeTest.LessThan (1826 of 2404)
PASS: lldb-unit :: Utility/Release/UtilityTests/BinaryStreamTest.PutULEB128OneByte (1827 of 2404)
PASS: lldb-unit :: Utility/Release/UtilityTests/DataExtractorTest.GetULEB128_bit63 (1828 of 2404)
PASS: lldb-unit :: Utility/Release/UtilityTests/UriParserTest.BracketedHostnameWithColon (1829 of 2404)
PASS: lldb-unit :: Host/Release/HostTests/NativeProcessProtocolTest.ReadCStringFromMemory (1830 of 2404)
PASS: lldb-unit :: Core/Release/LLDBCoreTests/SourceLocationSpecTest.Compare (1831 of 2404)
PASS: lldb-unit :: Utility/Release/UtilityTests/EnvironmentTest.EnvpConversion (1832 of 2404)
PASS: lldb-unit :: Utility/Release/UtilityTests/RangeDataVector.FindEntryThatContains_Overlap (1833 of 2404)
PASS: lldb-unit :: Utility/Release/UtilityTests/StreamTeeTest.SetStreamAtIndexOverwrite (1834 of 2404)
PASS: lldb-unit :: Utility/Release/UtilityTests/ScalarTest.LongLongAssigmentOperator (1835 of 2404)
PASS: lldb-unit :: Utility/Release/UtilityTests/RangeTest.ContainsRange (1836 of 2404)
PASS: lldb-unit :: Utility/Release/UtilityTests/StringExtractorTest.GetHexBytesAvail_FullString (1837 of 2404)
PASS: lldb-unit :: Host/Release/HostTests/SocketTests/SocketTest.TCPListen0GetPort/ipv6 (1838 of 2404)
PASS: lldb-unit :: Utility/Release/UtilityTests/RegularExpression.Invalid (1839 of 2404)
PASS: lldb-unit :: Utility/Release/UtilityTests/ScalarTest.CastOperations (1840 of 2404)
PASS: lldb-unit :: Utility/Release/UtilityTests/StreamTeeTest.Constructor1Stream (1841 of 2404)
PASS: lldb-unit :: Utility/Release/UtilityTests/BinaryStreamTest.PutULEB128EightBytes (1842 of 2404)
PASS: lldb-unit :: Utility/Release/UtilityTests/StructuredDataTest.ParseJSONFromFile (1843 of 2404)
PASS: lldb-unit :: Utility/Release/UtilityTests/StatusTest.ErrorCodeConstructor (1844 of 2404)
PASS: lldb-unit :: Utility/Release/UtilityTests/DataExtractorTest.GetCStrEmpty (1845 of 2404)
PASS: lldb-unit :: Utility/Release/UtilityTests/ListenerTest.GetEventImmediate (1846 of 2404)
PASS: lldb-unit :: Utility/Release/UtilityTests/StringLexerTest.Next (1847 of 2404)
PASS: lldb-unit :: Process/minidump/Release/LLDBMinidumpTests/MinidumpParserTest.GetMemoryRegionInfoFromMemory64List (1848 of 2404)
PASS: lldb-unit :: Utility/Release/UtilityTests/StringListTest.JoinSingle (1849 of 2404)
PASS: lldb-unit :: Core/Release/LLDBCoreTests/RichManglingContextTest.SwitchProvider (1850 of 2404)
PASS: lldb-unit :: Utility/Release/UtilityTests/OptionsWithRawTest.WhitespaceInput (1851 of 2404)
PASS: lldb-unit :: Utility/Release/UtilityTests/PassiveReplayTest.InstrumentedBar (1852 of 2404)
PASS: lldb-unit :: Utility/Release/UtilityTests/StringListTest.AppendListCStringArrayEmpty (1853 of 2404)
PASS: lldb-unit :: Utility/Release/UtilityTests/LogChannelTest.List (1854 of 2404)
PASS: lldb-unit :: Process/minidump/Release/LLDBMinidumpTests/MinidumpParserTest.MinidumpDuplicateModuleMappedSecondHigh (1855 of 2404)
PASS: lldb-unit :: Utility/Release/UtilityTests/StringExtractorTest.GetHexU8_Underflow_NoEof (1856 of 2404)
PASS: lldb-unit :: Utility/Release/UtilityTests/StringListTest.Clear (1857 of 2404)
PASS: lldb-unit :: Utility/Release/UtilityTests/StreamTest.PutHex16ByteOrderBig (1858 of 2404)
PASS: lldb-unit :: Utility/Release/UtilityTests/StreamTest.PutMaxHex64ByteOrderBig (1859 of 2404)
PASS: lldb-unit :: Utility/Release/UtilityTests/EventTest.DumpEventDataBytes (1860 of 2404)
PASS: lldb-unit :: Host/Release/HostTests/MainLoopTest.Signal (1861 of 2404)
PASS: lldb-unit :: Core/Release/LLDBCoreTests/DumpDataExtractorTest.NullStream (1862 of 2404)
PASS: lldb-unit :: Utility/Release/UtilityTests/ScalarTest.Scalar_512 (1863 of 2404)
PASS: lldb-unit :: DataFormatter/Release/LLDBFormatterTests/TypeMatcherTests.RegexName (1864 of 2404)
PASS: lldb-unit :: Utility/Release/UtilityTests/ConstStringTest.NullAndEmptyStates (1865 of 2404)
PASS: lldb-unit :: Utility/Release/UtilityTests/DataExtractorTest.GetCStrAtEnd (1866 of 2404)
PASS: lldb-unit :: Utility/Release/UtilityTests/UriParserTest.TypicalPortPathIPv6 (1867 of 2404)
PASS: lldb-unit :: Utility/Release/UtilityTests/VASprintfTest.NoBufferResize (1868 of 2404)
PASS: lldb-unit :: Utility/Release/UtilityTests/StringExtractorTest.GetHexBytes_OddPair (1869 of 2404)
PASS: lldb-unit :: SymbolFile/NativePDB/Release/SymbolFileNativePDBTests/PDBFPOProgramToDWARFExpressionTests.UnsupportedRASearch (1870 of 2404)
PASS: lldb-unit :: Language/CPlusPlus/Release/LanguageCPlusPlusTests/CPlusPlusLanguage.FindAlternateFunctionManglings (1871 of 2404)
PASS: lldb-unit :: Utility/Release/UtilityTests/RangeTest.ClearWithStarAddress (1872 of 2404)
PASS: lldb-unit :: Core/Release/LLDBCoreTests/DumpDataExtractorTest.StartOffset (1873 of 2404)
PASS: lldb-unit :: Utility/Release/UtilityTests/RangeTest.SlideZero (1874 of 2404)
PASS: lldb-unit :: Utility/Release/UtilityTests/ArchSpecTest.Compatibility (1875 of 2404)
PASS: lldb-unit :: Utility/Release/UtilityTests/StringExtractorTest.GetHexBytesAvail (1876 of 2404)
PASS: lldb-unit :: Utility/Release/UtilityTests/StreamTest.PutULEB128 (1877 of 2404)
PASS: lldb-unit :: Process/minidump/Release/LLDBMinidumpTests/MinidumpParserTest.GetMemoryRegionInfo (1878 of 2404)
PASS: lldb-unit :: Utility/Release/UtilityTests/OptionsWithRawTest.LeadingSpaceArgs (1879 of 2404)
PASS: lldb-unit :: Utility/Release/UtilityTests/StringListTest.InsertStringAtIndexEnd (1880 of 2404)
PASS: lldb-unit :: Host/Release/HostTests/SocketTests/SocketTest.TCPGetConnectURI/ipv4 (1881 of 2404)
PASS: lldb-unit :: Utility/Release/UtilityTests/BinaryStreamTest.PutSLEB128FourBytes (1882 of 2404)
PASS: lldb-unit :: Utility/Release/UtilityTests/AnsiTerminal.Incomplete (1883 of 2404)
PASS: lldb-unit :: Utility/Release/UtilityTests/StringExtractorTest.DecodeHexU8_Exact (1884 of 2404)
PASS: lldb-unit :: Utility/Release/UtilityTests/FileSpecTest.AppendPathComponent (1885 of 2404)
PASS: lldb-unit :: Core/Release/LLDBCoreTests/DumpDataExtractorTest.BaseAddress (1886 of 2404)
PASS: lldb-unit :: Core/Release/LLDBCoreTests/DumpDataExtractorTest.MultiLine (1887 of 2404)
PASS: lldb-unit :: Utility/Release/UtilityTests/StreamTest.AddressSize (1888 of 2404)
PASS: lldb-unit :: Utility/Release/UtilityTests/StatusTest.Formatv (1889 of 2404)
PASS: lldb-unit :: Utility/Release/UtilityTests/BinaryStreamTest.PutSLEB128SixBytes (1890 of 2404)
PASS: lldb-unit :: Utility/Release/UtilityTests/SerializationRountripTest.SerializeDeserializePodReferences (1891 of 2404)
PASS: lldb-unit :: Utility/Release/UtilityTests/FileSpecTest.Yaml (1892 of 2404)
PASS: lldb-unit :: Utility/Release/UtilityTests/BinaryStreamTest.PutSLEB128Zero (1893 of 2404)
PASS: lldb-unit :: Utility/Release/UtilityTests/StringExtractorTest.GetHexBytesAvail_Underflow (1894 of 2404)
PASS: lldb-unit :: Process/minidump/Release/LLDBMinidumpTests/MinidumpParserTest.MinidumpModuleOrder (1895 of 2404)
PASS: lldb-unit :: Process/minidump/Release/LLDBMinidumpTests/MinidumpParserTest.GetPidWindows (1896 of 2404)
PASS: lldb-unit :: Utility/Release/UtilityTests/StringListTest.CopyList (1897 of 2404)
PASS: lldb-unit :: Utility/Release/UtilityTests/DataExtractorTest.GetMaxU64_unchecked (1898 of 2404)
PASS: lldb-unit :: Utility/Release/UtilityTests/RegisterValueTest.GetScalarValue (1899 of 2404)
PASS: lldb-unit :: Utility/Release/UtilityTests/DataExtractorTest.GetCStr (1900 of 2404)
PASS: lldb-unit :: Utility/Release/UtilityTests/StringListTest.GetMaxStringLengthDecreasingSize (1901 of 2404)
PASS: lldb-unit :: Host/Release/HostTests/SocketAddressTest.Set (1902 of 2404)
PASS: lldb-unit :: Utility/Release/UtilityTests/RangeTest.ContainsAddrInvalid (1903 of 2404)
PASS: lldb-unit :: SymbolFile/NativePDB/Release/SymbolFileNativePDBTests/PDBFPOProgramToDWARFExpressionTests.DependencyChain (1904 of 2404)
PASS: lldb-unit :: ObjectFile/ELF/Release/ObjectFileELFTests/ObjectFileELFTest.GetModuleSpecifications_EarlySectionHeaders (1905 of 2404)
PASS: lldb-unit :: Utility/Release/UtilityTests/RangeTest.Constructor (1906 of 2404)
PASS: lldb-unit :: Utility/Release/UtilityTests/FileSpecTest.EqualDotsPosix (1907 of 2404)
PASS: lldb-unit :: Utility/Release/UtilityTests/AnsiTerminal.KnownPrefix (1908 of 2404)
PASS: lldb-unit :: Utility/Release/UtilityTests/SubsystemRAIITest.SubsystemWithErrorFailure (1909 of 2404)
PASS: lldb-unit :: Utility/Release/UtilityTests/StreamTest.Indent (1910 of 2404)
PASS: lldb-unit :: Utility/Release/UtilityTests/StreamTest.PutBytesAsRawHex8ToMixedEndian (1911 of 2404)
PASS: lldb-unit :: Host/Release/HostTests/HostInfoTestInitialization.InitTwice (1912 of 2404)
PASS: lldb-unit :: Utility/Release/UtilityTests/XcodeSDKTest.FindXcodeContentsDirectoryInPath (1913 of 2404)
PASS: lldb-unit :: Utility/Release/UtilityTests/Flags.AllClear (1914 of 2404)
PASS: lldb-unit :: Utility/Release/UtilityTests/EnvironmentTest.EnvpConstruction (1915 of 2404)
PASS: lldb-unit :: Utility/Release/UtilityTests/UserIDResolver.GetGroupName (1916 of 2404)
PASS: lldb-unit :: Utility/Release/UtilityTests/StringLexerTest.Peek (1917 of 2404)
PASS: lldb-unit :: Utility/Release/UtilityTests/RegularExpression.Valid (1918 of 2404)
PASS: lldb-unit :: SymbolFile/NativePDB/Release/SymbolFileNativePDBTests/PDBFPOProgramToDWARFExpressionTests.MultipleDependentAssignments (1919 of 2404)
PASS: lldb-unit :: Core/Release/LLDBCoreTests/RichManglingContextTest.Basic (1920 of 2404)
PASS: lldb-unit :: Utility/Release/UtilityTests/BinaryStreamTest.PutSLEB128FiveBytes (1921 of 2404)
PASS: lldb-unit :: Host/Release/HostTests/SocketTests/SocketTest.DomainGetConnectURI/ipv6 (1922 of 2404)
PASS: lldb-unit :: Utility/Release/UtilityTests/LogTest.Unregister (1923 of 2404)
PASS: lldb-unit :: Utility/Release/UtilityTests/StringListTest.AppendStringMove (1924 of 2404)
PASS: lldb-unit :: Utility/Release/UtilityTests/DataExtractorTest.GetDouble (1925 of 2404)
PASS: lldb-unit :: Utility/Release/UtilityTests/AnsiTerminal.AtEnd (1926 of 2404)
PASS: lldb-unit :: Utility/Release/UtilityTests/StatusTest.ErrorConstructor (1927 of 2404)
PASS: lldb-unit :: Host/Release/HostTests/FileSystemTest.MakeAbsolute (1928 of 2404)
PASS: lldb-unit :: Utility/Release/UtilityTests/XcodeSDKTest.ParseTest (1929 of 2404)
PASS: lldb-unit :: Utility/Release/UtilityTests/RangeTest.Clear (1930 of 2404)
PASS: lldb-unit :: Process/minidump/Release/LLDBMinidumpTests/MinidumpParserTest.GetExceptionStream (1931 of 2404)
PASS: lldb-unit :: Utility/Release/UtilityTests/LogChannelEnabledTest.LogGetLogThread (1932 of 2404)
PASS: lldb-unit :: Utility/Release/UtilityTests/UriParserTest.BracketedHostname (1933 of 2404)
PASS: lldb-unit :: ObjectFile/Breakpad/Release/ObjectFileBreakpadTests/FuncRecord.parse (1934 of 2404)
PASS: lldb-unit :: Utility/Release/UtilityTests/StreamTest.PutNHex8 (1935 of 2404)
PASS: lldb-unit :: Utility/Release/UtilityTests/StreamTeeTest.Flush (1936 of 2404)
PASS: lldb-unit :: Process/Utility/Release/ProcessUtilityTests/ProcMapTests/LinuxProcMapsTestFixture.ParseMapRegions/4 (1937 of 2404)
PASS: lldb-unit :: Utility/Release/UtilityTests/StringExtractorTest.GetHexBytesAvail_OddPair (1938 of 2404)
PASS: lldb-unit :: Utility/Release/UtilityTests/UriParserTest.Empty (1939 of 2404)
PASS: lldb-unit :: Utility/Release/UtilityTests/UriParserTest.BadPort (1940 of 2404)
PASS: lldb-unit :: Utility/Release/UtilityTests/StreamTeeTest.SetStreamAtIndexOutOfBounds (1941 of 2404)
PASS: lldb-unit :: Utility/Release/UtilityTests/ArgsTest.ReplaceArgumentAtIndexShort (1942 of 2404)
PASS: lldb-unit :: Utility/Release/UtilityTests/ScalarTest.RightShiftOperator (1943 of 2404)
PASS: lldb-unit :: Host/Release/HostTests/FileSystemTest.Readable (1944 of 2404)
PASS: lldb-unit :: Utility/Release/UtilityTests/StringListTest.JoinThree (1945 of 2404)
PASS: lldb-unit :: Utility/Release/UtilityTests/StreamTest.QuotedCString (1946 of 2404)
PASS: lldb-unit :: Interpreter/Release/InterpreterTests/OptionArgParserTest.toChar (1947 of 2404)
PASS: lldb-unit :: Utility/Release/UtilityTests/StringListTest.PopBack (1948 of 2404)
PASS: lldb-unit :: Utility/Release/UtilityTests/BinaryStreamTest.PutULEB128ThreeBytes (1949 of 2404)
PASS: lldb-unit :: Process/gdb-remote/Release/ProcessGdbRemoteTests/GDBRemoteClientBaseTest.SendPacketAndReceiveResponseWithOutputSupport (1950 of 2404)
PASS: lldb-unit :: Core/Release/LLDBCoreTests/SourceLocationSpecTest.FileLineColumnComponents (1951 of 2404)
PASS: lldb-unit :: Utility/Release/UtilityTests/LogChannelTest.Disable (1952 of 2404)
PASS: lldb-unit :: Utility/Release/UtilityTests/BroadcasterTest.BroadcastEvent (1953 of 2404)
PASS: lldb-unit :: Utility/Release/UtilityTests/RangeTest.DefaultConstructor (1954 of 2404)
PASS: lldb-unit :: Utility/Release/UtilityTests/BinaryStreamTest.PutSLEB128OneByte (1955 of 2404)
PASS: lldb-unit :: Utility/Release/UtilityTests/ArgsTest.TestAppendArg (1956 of 2404)
PASS: lldb-unit :: Utility/Release/UtilityTests/StringListTest.RemoveBlankLines (1957 of 2404)
PASS: lldb-unit :: Utility/Release/UtilityTests/StringListTest.AppendStringCString (1958 of 2404)
PASS: lldb-unit :: Utility/Release/UtilityTests/ArchSpecTest.MergeFromMachOUnknown (1959 of 2404)
PASS: lldb-unit :: Host/Release/HostTests/SocketTests/SocketTest.TCPListen0ConnectAccept/ipv4 (1960 of 2404)
PASS: lldb-unit :: Process/minidump/Release/LLDBMinidumpTests/MinidumpParserTest.GetMiscInfo_no_stream (1961 of 2404)
PASS: lldb-unit :: Process/Utility/Release/ProcessUtilityTests/ProcMapTests/LinuxProcMapsTestFixture.ParseMapRegions/0 (1962 of 2404)
PASS: lldb-unit :: Process/minidump/Release/LLDBMinidumpTests/MinidumpParserTest.FindMemoryRangeWithFullMemoryMinidump (1963 of 2404)
PASS: lldb-unit :: Utility/Release/UtilityTests/LogChannelEnabledTest.LogVerboseThread (1964 of 2404)
PASS: lldb-unit :: Utility/Release/UtilityTests/UriParserTest.LongPath (1965 of 2404)
PASS: lldb-unit :: Utility/Release/UtilityTests/StringListTest.SetSize (1966 of 2404)
PASS: lldb-unit :: SymbolFile/NativePDB/Release/SymbolFileNativePDBTests/PDBFPOProgramToDWARFExpressionTests.UnresolvedDependentCyclicRegisterAssignmentReference (1967 of 2404)
PASS: lldb-unit :: Utility/Release/UtilityTests/RangeTest.SizeTypes (1968 of 2404)
PASS: lldb-unit :: Utility/Release/UtilityTests/ArgsTest.TestSingleArgWithQuotedSpace (1969 of 2404)
PASS: lldb-unit :: Core/Release/LLDBCoreTests/SourceFileCache.FindSourceFileNotFound (1970 of 2404)
PASS: lldb-unit :: Utility/Release/UtilityTests/NameMatchesTest.RegularExpression (1971 of 2404)
PASS: lldb-unit :: Utility/Release/UtilityTests/SubsystemRAIITest.NormalSubsystem (1972 of 2404)
PASS: lldb-unit :: Utility/Release/UtilityTests/StreamTeeTest.Constructor2Streams (1973 of 2404)
PASS: lldb-unit :: Utility/Release/UtilityTests/PassiveReplayTest.InstrumentedFoo (1974 of 2404)
PASS: lldb-unit :: Utility/Release/UtilityTests/NameMatchesTest.StartsWith (1975 of 2404)
PASS: lldb-unit :: ObjectFile/Breakpad/Release/ObjectFileBreakpadTests/ModuleRecord.parse (1976 of 2404)
PASS: lldb-unit :: Utility/Release/UtilityTests/StreamTeeTest.AppendStream (1977 of 2404)
PASS: lldb-unit :: Utility/Release/UtilityTests/NameMatchesTest.Ignore (1978 of 2404)
PASS: lldb-unit :: Utility/Release/UtilityTests/SerializationRountripTest.SerializeDeserializeCString (1979 of 2404)
PASS: lldb-unit :: Utility/Release/UtilityTests/Flags.Test (1980 of 2404)
PASS: lldb-unit :: Utility/Release/UtilityTests/OptionsWithRawTest.ArgsButNoDelimiter (1981 of 2404)
PASS: lldb-unit :: Host/Release/HostTests/FileSystemTest.FileAndDirectoryComponents (1982 of 2404)
PASS: lldb-unit :: Utility/Release/UtilityTests/StringExtractorTest.GetHexBytes_OddPair2 (1983 of 2404)
PASS: lldb-unit :: Process/minidump/Release/LLDBMinidumpTests/RegisterContextMinidump.ConvertMinidumpContext_x86_64 (1984 of 2404)
PASS: lldb-unit :: Utility/Release/UtilityTests/ConstStringTest.format_provider (1985 of 2404)
PASS: lldb-unit :: Utility/Release/UtilityTests/LogChannelEnabledTest.LLDB_LOG_ERROR (1986 of 2404)
PASS: lldb-unit :: Utility/Release/UtilityTests/StringListTest.ShiftCString (1987 of 2404)
PASS: lldb-unit :: Utility/Release/UtilityTests/ArgsTest.GetArgumentArrayRef (1988 of 2404)
PASS: lldb-unit :: Utility/Release/UtilityTests/StringLexerTest.NextIfList (1989 of 2404)
PASS: lldb-unit :: Utility/Release/UtilityTests/StringListTest.ShiftStdString (1990 of 2404)
PASS: lldb-unit :: Utility/Release/UtilityTests/StringListTest.ForRangeEmpty (1991 of 2404)
PASS: lldb-unit :: Utility/Release/UtilityTests/StreamTest.PutBytesAsRawHex8ToLittleEndian (1992 of 2404)
PASS: lldb-unit :: Utility/Release/UtilityTests/DataExtractorTest.PeekData (1993 of 2404)
PASS: lldb-unit :: Utility/Release/UtilityTests/StringExtractorTest.GetNameColonValueContainsColon (1994 of 2404)
PASS: lldb-unit :: Utility/Release/UtilityTests/DataExtractorTest.GetFloat (1995 of 2404)
PASS: lldb-unit :: Utility/Release/UtilityTests/RangeDataVector.FindEntryThatContains (1996 of 2404)
PASS: lldb-unit :: Utility/Release/UtilityTests/DeserializerTest.HasData (1997 of 2404)
PASS: lldb-unit :: Utility/Release/UtilityTests/StreamTest.AddressRangeInvalidRange (1998 of 2404)
PASS: lldb-unit :: Utility/Release/UtilityTests/ArchSpecTest.TripleComponentsWereSpecified (1999 of 2404)
PASS: lldb-unit :: Utility/Release/UtilityTests/ArgsTest.TestArgv (2000 of 2404)
PASS: lldb-unit :: DataFormatter/Release/LLDBFormatterTests/StringPrinterTests.SwiftUTF8 (2001 of 2404)
PASS: lldb-unit :: Utility/Release/UtilityTests/BinaryStreamTest.PutULEB128TwoBytes (2002 of 2404)
PASS: lldb-unit :: Utility/Release/UtilityTests/StringExtractorTest.GetHexU8_Exact (2003 of 2404)
PASS: lldb-unit :: Utility/Release/UtilityTests/StringExtractorTest.GetNameColonValueNoColon (2004 of 2404)
PASS: lldb-unit :: Utility/Release/UtilityTests/StringExtractorTest.GetHexU8_Extra (2005 of 2404)
PASS: lldb-unit :: Utility/Release/UtilityTests/UriParserTest.SchemeHostSeparator2 (2006 of 2404)
PASS: lldb-unit :: Utility/Release/UtilityTests/BinaryStreamTest.PutULEB128SixBytes (2007 of 2404)
PASS: lldb-unit :: Core/Release/LLDBCoreTests/MangledTest.EmptyForInvalidName (2008 of 2404)
PASS: lldb-unit :: Utility/Release/UtilityTests/StreamTest.PutRawBytesToBigEndian (2009 of 2404)
PASS: lldb-unit :: Utility/Release/UtilityTests/ArgsTest.TestSingleArg (2010 of 2404)
PASS: lldb-unit :: Utility/Release/UtilityTests/StringExtractorTest.GetHexU8_Underflow2_NoEof (2011 of 2404)
PASS: lldb-unit :: Utility/Release/UtilityTests/BinaryStreamTest.PutULEB128One (2012 of 2404)
PASS: lldb-unit :: Utility/Release/UtilityTests/UUIDTest.Validity (2013 of 2404)
PASS: lldb-unit :: Process/gdb-remote/Release/ProcessGdbRemoteTests/GDBRemoteCommunicationServerTest.SendErrorResponse_ErrorList (2014 of 2404)
PASS: lldb-unit :: Host/Release/HostTests/NativeProcessProtocolTest.ReadMemoryWithoutTrap (2015 of 2404)
PASS: lldb-unit :: Utility/Release/UtilityTests/Flags.Clear (2016 of 2404)
PASS: lldb-unit :: Language/CPlusPlus/Release/LanguageCPlusPlusTests/CPlusPlusLanguage.MethodNameParsing (2017 of 2404)
PASS: lldb-unit :: Utility/Release/UtilityTests/StringListTest.Assignment (2018 of 2404)
PASS: lldb-unit :: Utility/Release/UtilityTests/VASprintfTest.EncodingError (2019 of 2404)
PASS: lldb-unit :: Process/Utility/Release/ProcessUtilityTests/ProcSMapTests/LinuxProcSMapsTestFixture.ParseSMapRegions/3 (2020 of 2404)
PASS: lldb-unit :: Process/minidump/Release/LLDBMinidumpTests/MinidumpParserTest.GetThreadContext_x86_32 (2021 of 2404)
PASS: lldb-unit :: Utility/Release/UtilityTests/StreamTest.PutCharWhitespace (2022 of 2404)
PASS: lldb-unit :: Utility/Release/UtilityTests/UriParserTest.BracketedHostnameWithPortIPv4 (2023 of 2404)
PASS: lldb-unit :: Utility/Release/UtilityTests/StringLexerTest.NextIf (2024 of 2404)
PASS: lldb-unit :: Utility/Release/UtilityTests/StreamTest.PutHex16ByteOrderLittle (2025 of 2404)
PASS: lldb-unit :: Utility/Release/UtilityTests/Flags.Reset (2026 of 2404)
PASS: lldb-unit :: Utility/Release/UtilityTests/ScalarTest.TruncOrExtendTo (2027 of 2404)
PASS: lldb-unit :: Utility/Release/UtilityTests/ArgsTest.AppendArguments (2028 of 2404)
PASS: lldb-unit :: Utility/Release/UtilityTests/SerializationRountripTest.SerializeDeserializePod (2029 of 2404)
PASS: lldb-unit :: Utility/Release/UtilityTests/Flags.IsClear (2030 of 2404)
PASS: lldb-unit :: SymbolFile/NativePDB/Release/SymbolFileNativePDBTests/PDBFPOProgramToDWARFExpressionTests.UnresolvedCyclicRegisterAssignmentReference (2031 of 2404)
PASS: lldb-unit :: Utility/Release/UtilityTests/RangeTest.ContainsEndInclusiveInvalid (2032 of 2404)
PASS: lldb-unit :: Utility/Release/UtilityTests/RangeTest.NotEqualInvalid (2033 of 2404)
PASS: lldb-unit :: Host/Release/HostTests/SocketTests/SocketTest.DomainListenConnectAccept/ipv4 (2034 of 2404)
PASS: lldb-unit :: Utility/Release/UtilityTests/ConstStringTest.UpdateMangledCounterpart (2035 of 2404)
PASS: lldb-unit :: Utility/Release/UtilityTests/FileSpecTest.GuessPathStyle (2036 of 2404)
PASS: lldb-unit :: Utility/Release/UtilityTests/RegularExpression.Match (2037 of 2404)
PASS: lldb-unit :: Utility/Release/UtilityTests/OptionsWithRawTest.SingleWordSuffix (2038 of 2404)
PASS: lldb-unit :: Utility/Release/UtilityTests/FileSpecTest.CopyByAppendingPathComponent (2039 of 2404)
PASS: lldb-unit :: Utility/Release/UtilityTests/ArgsTest.TestQuotedTrailingBackslash (2040 of 2404)
PASS: lldb-unit :: Utility/Release/UtilityTests/StructuredDataTest.StringDump (2041 of 2404)
PASS: lldb-unit :: Utility/Release/UtilityTests/ArgsTest.DoubleQuotedItem (2042 of 2404)
PASS: lldb-unit :: Utility/Release/UtilityTests/StringExtractorTest.DecodeHexU8_InvalidHex (2043 of 2404)
PASS: lldb-unit :: Utility/Release/UtilityTests/StreamTest.ShiftOperatorPtr (2044 of 2404)
PASS: lldb-unit :: Core/Release/LLDBCoreTests/StreamCallbackTest.Callback (2045 of 2404)
PASS: lldb-unit :: Process/Utility/Release/ProcessUtilityTests/ProcMapTests/LinuxProcMapsTestFixture.ParseMapRegions/3 (2046 of 2404)
PASS: lldb-unit :: Language/CPlusPlus/Release/LanguageCPlusPlusTests/CPlusPlusLanguage.CPlusPlusNameParser (2047 of 2404)
PASS: lldb-unit :: Utility/Release/UtilityTests/OptionsWithRawTest.EmptyArgsOnlySuffix (2048 of 2404)
PASS: lldb-unit :: Utility/Release/UtilityTests/StringListTest.AppendListCStringArray (2049 of 2404)
PASS: lldb-unit :: Utility/Release/UtilityTests/StringListTest.LongestCommonPrefixNoPrefix (2050 of 2404)
PASS: lldb-unit :: Utility/Release/UtilityTests/StringListTest.CopyListEmpty (2051 of 2404)
PASS: lldb-unit :: Utility/Release/UtilityTests/StreamTest.SetIndentLevel (2052 of 2404)
PASS: lldb-unit :: Utility/Release/UtilityTests/FileSpecTest.OperatorBool (2053 of 2404)
PASS: lldb-unit :: Utility/Release/UtilityTests/OptionsWithRawTest.TerminatedQuote (2054 of 2404)
PASS: lldb-unit :: Utility/Release/UtilityTests/StringListTest.GetMaxStringLengthEmpty (2055 of 2404)
PASS: lldb-unit :: Host/Release/HostTests/NativeProcessProtocolTest.SetBreakpointFailVerify (2056 of 2404)
PASS: lldb-unit :: Host/Release/HostTests/SocketTests/SocketTest.TCPListen0ConnectAccept/ipv6 (2057 of 2404)
PASS: lldb-unit :: Process/Utility/Release/ProcessUtilityTests/MemoryTagManagerAArch64MTETest.UnpackTagsData (2058 of 2404)
PASS: lldb-unit :: Utility/Release/UtilityTests/AnsiTerminal.Basic (2059 of 2404)
PASS: lldb-unit :: Core/Release/LLDBCoreTests/DumpDataExtractorTest.ItemByteSizeErrors (2060 of 2404)
PASS: lldb-unit :: Utility/Release/UtilityTests/StringListTest.LongestCommonPrefixSingleElement (2061 of 2404)
PASS: lldb-unit :: Host/Release/HostTests/SocketTests/SocketTest.TCPGetAddress/ipv4 (2062 of 2404)
PASS: lldb-unit :: Utility/Release/UtilityTests/UriParserTest.BadPort2 (2063 of 2404)
PASS: lldb-unit :: ObjectFile/Breakpad/Release/ObjectFileBreakpadTests/StackWinRecord.parse (2064 of 2404)
PASS: lldb-unit :: Utility/Release/UtilityTests/StringListTest.LongestCommonPrefix (2065 of 2404)
PASS: lldb-unit :: Utility/Release/UtilityTests/StreamTest.ChangingByteOrder (2066 of 2404)
PASS: lldb-unit :: Utility/Release/UtilityTests/ArgsTest.TestOverwriteArgs (2067 of 2404)
PASS: lldb-unit :: Utility/Release/UtilityTests/StreamTest.PutCString (2068 of 2404)
PASS: lldb-unit :: Utility/Release/UtilityTests/TildeExpressionResolver.ResolveFullPath (2069 of 2404)
PASS: lldb-unit :: Utility/Release/UtilityTests/ArchSpecTest.MergeFrom (2070 of 2404)
PASS: lldb-unit :: Utility/Release/UtilityTests/StreamTest.PutCharNull (2071 of 2404)
PASS: lldb-unit :: Host/Release/HostTests/NativeProcessProtocolTest.SetBreakpoint (2072 of 2404)
PASS: lldb-unit :: Host/Release/HostTests/PipeTest.CreateWithUniqueName (2073 of 2404)
PASS: lldb-unit :: Utility/Release/UtilityTests/ProcessInstanceInfo.DumpTable (2074 of 2404)
PASS: lldb-unit :: Process/minidump/Release/LLDBMinidumpTests/MinidumpParserTest.GetThreadContext_x86_64 (2075 of 2404)
PASS: lldb-unit :: Utility/Release/UtilityTests/SubsystemRAIITest.SubsystemWithErrorSuccess (2076 of 2404)
PASS: lldb-unit :: Utility/Release/UtilityTests/UriParserTest.Minimal (2077 of 2404)
PASS: lldb-unit :: Host/Release/HostTests/SocketTests/SocketTest.TCPGetAddress/ipv6 (2078 of 2404)
PASS: lldb-unit :: Host/Release/HostTests/SocketTests/SocketTest.UDPConnect/ipv4 (2079 of 2404)
PASS: lldb-unit :: Process/minidump/Release/LLDBMinidumpTests/MinidumpParserTest.InvalidMinidump (2080 of 2404)
PASS: lldb-unit :: Utility/Release/UtilityTests/StreamTest.AddressRange (2081 of 2404)
PASS: lldb-unit :: Utility/Release/UtilityTests/LogTest.Register (2082 of 2404)
PASS: lldb-unit :: Utility/Release/UtilityTests/StringExtractorTest.GetHexBytesAvail_Partial (2083 of 2404)
PASS: lldb-unit :: Utility/Release/UtilityTests/UriParserTest.TypicalPortPathIPv4 (2084 of 2404)
PASS: lldb-unit :: Utility/Release/UtilityTests/Flags.AllSet (2085 of 2404)
PASS: lldb-unit :: Utility/Release/UtilityTests/ReproducerTest.SetReplay (2086 of 2404)
PASS: lldb-unit :: Utility/Release/UtilityTests/StringExtractorTest.GetHexU8_InvalidHex_NoEof (2087 of 2404)
PASS: lldb-unit :: Host/Release/HostTests/Host.WaitStatusFormat (2088 of 2404)
PASS: lldb-unit :: Utility/Release/UtilityTests/StringExtractorTest.DecodeHexU8_InvalidHex2 (2089 of 2404)
PASS: lldb-unit :: Utility/Release/UtilityTests/StringExtractorTest.GetHexBytes_Partial (2090 of 2404)
PASS: lldb-unit :: Utility/Release/UtilityTests/DataExtractorTest.GetCStrUnterminated (2091 of 2404)
PASS: lldb-unit :: Utility/Release/UtilityTests/StringListTest.GetSize (2092 of 2404)
PASS: lldb-unit :: Utility/Release/UtilityTests/StreamTest.AddressNoSuffix (2093 of 2404)
PASS: lldb-unit :: Utility/Release/UtilityTests/XcodeSDKTest.GetSDKTypeForTriple (2094 of 2404)
PASS: lldb-unit :: DataFormatter/Release/LLDBFormatterTests/TypeMatcherTests.CreatedBySameMatchString (2095 of 2404)
PASS: lldb-unit :: Process/gdb-remote/Release/ProcessGdbRemoteTests/PortMapTest.FreePortForProcess (2096 of 2404)
PASS: lldb-unit :: Utility/Release/UtilityTests/ScalarTest.Division (2097 of 2404)
PASS: lldb-unit :: Utility/Release/UtilityTests/StringExtractorGDBRemoteTest.GetPidTid (2098 of 2404)
PASS: lldb-unit :: Process/Utility/Release/ProcessUtilityTests/MemoryTagManagerAArch64MTETest.ExpandToGranule (2099 of 2404)
PASS: lldb-unit :: Utility/Release/UtilityTests/DataExtractorTest.GetDoubleUnaligned (2100 of 2404)
PASS: lldb-unit :: Utility/Release/UtilityTests/StringListTest.JoinMultiCharSeparator (2101 of 2404)
PASS: lldb-unit :: Utility/Release/UtilityTests/ArgsTest.BareSingleQuote (2102 of 2404)
PASS: lldb-unit :: Utility/Release/UtilityTests/StringListTest.SplitIntoLinesEmpty (2103 of 2404)
PASS: lldb-unit :: Host/Release/HostTests/HostInfoTest.GetHostname (2104 of 2404)
PASS: lldb-unit :: ObjectFile/Breakpad/Release/ObjectFileBreakpadTests/Record.classify (2105 of 2404)
PASS: lldb-unit :: Utility/Release/UtilityTests/BinaryStreamTest.PutSLEB128One (2106 of 2404)
PASS: lldb-unit :: Utility/Release/UtilityTests/RangeTest.ContainsEndInclusive (2107 of 2404)
PASS: lldb-unit :: Utility/Release/UtilityTests/CompletionRequest.DuplicateFilteringWithComments (2108 of 2404)
PASS: lldb-unit :: Utility/Release/UtilityTests/StringListTest.AppendStringStdString (2109 of 2404)
PASS: lldb-unit :: Signals/Release/SignalsTests/UnixSignalsTest.VersionChange (2110 of 2404)
PASS: lldb-unit :: Signals/Release/SignalsTests/UnixSignalsTest.GetFilteredSignals (2111 of 2404)
PASS: lldb-unit :: Utility/Release/UtilityTests/StringExtractorTest.DecodeHexU8_Underflow (2112 of 2404)
PASS: lldb-unit :: Host/Release/HostTests/PipeTest.OpenAsReader (2113 of 2404)
PASS: lldb-unit :: Process/minidump/Release/LLDBMinidumpTests/RegisterContextMinidump.CheckRegisterContextMinidump_ARM (2114 of 2404)
PASS: lldb-unit :: Utility/Release/UtilityTests/ArgsTest.TestMultipleArgs (2115 of 2404)
PASS: lldb-unit :: Utility/Release/UtilityTests/TimeoutTest.Construction (2116 of 2404)
PASS: lldb-unit :: Utility/Release/UtilityTests/BinaryStreamTest.PutSLEB128ThreeBytes (2117 of 2404)
PASS: lldb-unit :: Utility/Release/UtilityTests/OptionsWithRawTest.EmptySuffixSingleWhitespace (2118 of 2404)
PASS: lldb-unit :: Utility/Release/UtilityTests/StringListTest.LongestCommonPrefixEmpty (2119 of 2404)
PASS: lldb-unit :: Utility/Release/UtilityTests/StreamTest.AddressPrefixAndSuffix (2120 of 2404)
PASS: lldb-unit :: Utility/Release/UtilityTests/StringListTest.LongestCommonPrefixDuplicateElement (2121 of 2404)
PASS: lldb-unit :: Utility/Release/UtilityTests/StringExtractorTest.GetU64LittleEndian (2122 of 2404)
PASS: lldb-unit :: Utility/Release/UtilityTests/OptionsWithRawTest.WhitespaceSuffix (2123 of 2404)
PASS: lldb-unit :: Utility/Release/UtilityTests/FileSpecTest.FileAndDirectoryComponents (2124 of 2404)
PASS: lldb-unit :: Utility/Release/UtilityTests/DataExtractorTest.GetCStrAtNullOffset (2125 of 2404)
PASS: lldb-unit :: Process/Utility/Release/ProcessUtilityTests/ProcMapTests/LinuxProcMapsTestFixture.ParseMapRegions/2 (2126 of 2404)
PASS: lldb-unit :: Utility/Release/UtilityTests/ArgsTest.StringListConstructor (2127 of 2404)
PASS: lldb-unit :: Host/Release/HostTests/SocketTests/SocketTest.DecodeHostAndPort/ipv4 (2128 of 2404)
PASS: lldb-unit :: Utility/Release/UtilityTests/FileSpecTest.EqualDotsPosixRoot (2129 of 2404)
PASS: lldb-unit :: Process/minidump/Release/LLDBMinidumpTests/MinidumpParserTest.GetMemoryRegionInfoLinuxMapsError (2130 of 2404)
PASS: lldb-unit :: Utility/Release/UtilityTests/StringListTest.CopyListSingle (2131 of 2404)
PASS: lldb-unit :: Core/Release/LLDBCoreTests/DumpDataExtractorTest.Formats (2132 of 2404)
PASS: lldb-unit :: Utility/Release/UtilityTests/DataExtractorTest.GetMaxU64 (2133 of 2404)
PASS: lldb-unit :: Utility/Release/UtilityTests/StreamTest.PutPtr (2134 of 2404)
PASS: lldb-unit :: Utility/Release/UtilityTests/ProcessInstanceInfoList.Yaml (2135 of 2404)
PASS: lldb-unit :: debugserver/Release/debugserverTests/JSON.Parse (2136 of 2404)
PASS: lldb-unit :: Host/Release/HostTests/ProcessLaunchInfoTest.Constructor (2137 of 2404)
PASS: lldb-unit :: Utility/Release/UtilityTests/StringExtractorTest.GetNameColonValueSuccess (2138 of 2404)
PASS: lldb-unit :: Process/Utility/Release/ProcessUtilityTests/ProcSMapTests/LinuxProcSMapsTestFixture.ParseSMapRegions/9 (2139 of 2404)
PASS: lldb-unit :: Utility/Release/UtilityTests/StringLexerTest.GetUnlexed (2140 of 2404)
PASS: lldb-unit :: Utility/Release/UtilityTests/StreamTest.PutRawBytesToMixedEndian (2141 of 2404)
PASS: lldb-unit :: Utility/Release/UtilityTests/UUIDTest.RelationalOperators (2142 of 2404)
PASS: lldb-unit :: Platform/Android/Release/AdbClientTests/AdbClientTest.CreateByDeviceId (2143 of 2404)
PASS: lldb-unit :: Utility/Release/UtilityTests/StreamTest.AddressRangeSize (2144 of 2404)
PASS: lldb-unit :: Host/Release/HostTests/NativeProcessProtocolTest.SetBreakpointFailWrite (2145 of 2404)
PASS: lldb-unit :: Host/Release/HostTests/FileSystemTest.GetByteSize (2146 of 2404)
PASS: lldb-unit :: Utility/Release/UtilityTests/SerializationRountripTest.SerializeDeserializePodPointers (2147 of 2404)
PASS: lldb-unit :: Utility/Release/UtilityTests/VMRange.IsValid (2148 of 2404)
PASS: lldb-unit :: Utility/Release/UtilityTests/StreamTeeTest.DefaultConstructor (2149 of 2404)
PASS: lldb-unit :: Utility/Release/UtilityTests/AnsiTerminal.AtStart (2150 of 2404)
PASS: lldb-unit :: Utility/Release/UtilityTests/StringListTest.GetMaxStringLengthIncreasingSize (2151 of 2404)
PASS: lldb-unit :: Host/Release/HostTests/FileSystemTest.EmptyTest (2152 of 2404)
PASS: lldb-unit :: Utility/Release/UtilityTests/FileSpecTest.Match (2153 of 2404)
PASS: lldb-unit :: Utility/Release/UtilityTests/StringExtractorTest.GetHexBytes (2154 of 2404)
PASS: lldb-unit :: Utility/Release/UtilityTests/StringExtractorTest.GetNameColonValueNoSemicolon (2155 of 2404)
PASS: lldb-unit :: Utility/Release/UtilityTests/StreamTest.PutSLEB128 (2156 of 2404)
PASS: lldb-unit :: Utility/Release/UtilityTests/StringLexerTest.PutBack (2157 of 2404)
PASS: lldb-unit :: Utility/Release/UtilityTests/LogChannelTest.Enable (2158 of 2404)
PASS: lldb-unit :: Utility/Release/UtilityTests/OptionsWithRawTest.ArgsButNoLeadingDash (2159 of 2404)
PASS: lldb-unit :: Process/Utility/Release/ProcessUtilityTests/ProcSMapTests/LinuxProcSMapsTestFixture.ParseSMapRegions/6 (2160 of 2404)
PASS: lldb-unit :: Host/Release/HostTests/Host.GetEnvironment (2161 of 2404)
PASS: lldb-unit :: Utility/Release/UtilityTests/StringListTest.InsertStringAtIndexStdString (2162 of 2404)
PASS: lldb-unit :: Host/Release/HostTests/SocketTests/SocketTest.DecodeHostAndPort/ipv6 (2163 of 2404)
PASS: lldb-unit :: Utility/Release/UtilityTests/StringExtractorGDBRemoteTest.GetPidTidMultipleValues (2164 of 2404)
PASS: lldb-unit :: Utility/Release/UtilityTests/StringListTest.InsertStringAtIndexStart (2165 of 2404)
PASS: lldb-unit :: Utility/Release/UtilityTests/StringExtractorTest.InitEmpty (2166 of 2404)
PASS: lldb-unit :: Utility/Release/UtilityTests/SharedCluster.ClusterManager (2167 of 2404)
PASS: lldb-unit :: Process/gdb-remote/Release/ProcessGdbRemoteTests/GDBRemoteCommunicationServerTest.SendErrorResponse_UnimplementedError (2168 of 2404)
PASS: lldb-unit :: SymbolFile/NativePDB/Release/SymbolFileNativePDBTests/PDBFPOProgramToDWARFExpressionTests.UnresolvedRegisterAssignmentReference (2169 of 2404)
PASS: lldb-unit :: Host/Release/HostTests/FileActionTest.Open (2170 of 2404)
PASS: lldb-unit :: Utility/Release/UtilityTests/NameMatchesTest.Contains (2171 of 2404)
PASS: lldb-unit :: Utility/Release/UtilityTests/DataExtractorTest.GetSLEB128_bit63 (2172 of 2404)
PASS: lldb-unit :: Utility/Release/UtilityTests/StringListTest.AppendList (2173 of 2404)
PASS: lldb-unit :: Utility/Release/UtilityTests/StringListTest.InsertStringAtIndexOutOfBounds (2174 of 2404)
PASS: lldb-unit :: Host/Release/HostTests/SocketTests/SocketTest.UDPGetConnectURI/ipv4 (2175 of 2404)
PASS: lldb-unit :: SymbolFile/NativePDB/Release/SymbolFileNativePDBTests/PDBFPOProgramToDWARFExpressionTests.SingleAssignmentRegisterRef (2176 of 2404)
PASS: lldb-unit :: Process/minidump/Release/LLDBMinidumpTests/MinidumpParserTest.GetMemoryRegionInfoLinuxMaps (2177 of 2404)
PASS: lldb-unit :: Utility/Release/UtilityTests/ArgsTest.TestInsertArg (2178 of 2404)
PASS: lldb-unit :: Utility/Release/UtilityTests/FileSpecTest.FormatFileSpec (2179 of 2404)
PASS: lldb-unit :: Process/Utility/Release/ProcessUtilityTests/MemoryTagManagerAArch64MTETest.RepeatTagsForRange (2180 of 2404)
PASS: lldb-unit :: Host/Release/HostTests/SocketTests/SocketTest.TCPListen0GetPort/ipv4 (2181 of 2404)
PASS: lldb-unit :: Utility/Release/UtilityTests/StreamTest.PutRawBytesToLittleEndian (2182 of 2404)
PASS: lldb-unit :: Utility/Release/UtilityTests/PassiveReplayTest.InstrumentedBarRef (2183 of 2404)
PASS: lldb-unit :: Utility/Release/UtilityTests/StringExtractorTest.GetHexU8_Underflow2 (2184 of 2404)
PASS: lldb-unit :: DataFormatter/Release/LLDBFormatterTests/TypeMatcherTests.RegexMatchPart (2185 of 2404)
PASS: lldb-unit :: Utility/Release/UtilityTests/Flags.AnySet (2186 of 2404)
PASS: lldb-unit :: Utility/Release/UtilityTests/BinaryStreamTest.PutSLEB128NineBytes (2187 of 2404)
PASS: lldb-unit :: Process/gdb-remote/Release/ProcessGdbRemoteTests/PortMapTest.FreePort (2188 of 2404)
PASS: lldb-unit :: Process/minidump/Release/LLDBMinidumpTests/MinidumpParserTest.GetMiscInfoWindows (2189 of 2404)
PASS: lldb-unit :: Utility/Release/UtilityTests/AnsiTerminal.Empty (2190 of 2404)
PASS: lldb-unit :: Host/Release/HostTests/NativeProcessProtocolTest.SetBreakpointFailRead (2191 of 2404)
PASS: lldb-unit :: Process/Utility/Release/ProcessUtilityTests/ProcSMapTests/LinuxProcSMapsTestFixture.ParseSMapRegions/4 (2192 of 2404)
PASS: lldb-unit :: Utility/Release/UtilityTests/StringListTest.ForRange (2193 of 2404)
PASS: lldb-unit :: Utility/Release/UtilityTests/StringListTest.JoinNonSpace (2194 of 2404)
PASS: lldb-unit :: Process/minidump/Release/LLDBMinidumpTests/MinidumpParserTest.GetPidWow64 (2195 of 2404)
PASS: lldb-unit :: Process/Utility/Release/ProcessUtilityTests/RegisterContext_x86Test.AbridgedToFullTagWord (2196 of 2404)
PASS: lldb-unit :: Utility/Release/UtilityTests/ArgsTest.ReplaceArgumentAtIndexEqual (2197 of 2404)
PASS: lldb-unit :: Process/minidump/Release/LLDBMinidumpTests/MinidumpParserTest.MinidumpDuplicateModuleMappedSecond (2198 of 2404)
PASS: lldb-unit :: Host/Release/HostTests/ConnectionFileDescriptorTest.TCPGetURIv4 (2199 of 2404)
PASS: lldb-unit :: Process/Utility/Release/ProcessUtilityTests/ProcSMapTests/LinuxProcSMapsTestFixture.ParseSMapRegions/8 (2200 of 2404)
PASS: lldb-unit :: Host/Release/HostTests/SocketTests/SocketTest.UDPConnect/ipv6 (2201 of 2404)
PASS: lldb-unit :: Utility/Release/UtilityTests/StringExtractorTest.DecodeHexU8_Underflow2 (2202 of 2404)
PASS: lldb-unit :: Process/Utility/Release/ProcessUtilityTests/ProcSMapTests/LinuxProcSMapsTestFixture.ParseSMapRegions/2 (2203 of 2404)
PASS: lldb-unit :: Utility/Release/UtilityTests/StringListTest.DefaultConstructor (2204 of 2404)
PASS: lldb-unit :: Host/Release/HostTests/SocketTests/SocketTest.UDPGetConnectURI/ipv6 (2205 of 2404)
PASS: lldb-unit :: Process/Utility/Release/ProcessUtilityTests/RegisterContext_x86Test.FullToAbridgedTagWord (2206 of 2404)
PASS: lldb-unit :: Utility/Release/UtilityTests/RangeTest.ContainsRangeStartingFromZero (2207 of 2404)
PASS: lldb-unit :: Utility/Release/UtilityTests/VMRange.Clear (2208 of 2404)
PASS: lldb-unit :: Utility/Release/UtilityTests/OptionsWithRawTest.MultiWordSuffix (2209 of 2404)
PASS: lldb-unit :: Process/minidump/Release/LLDBMinidumpTests/MinidumpParserTest.GetMemory (2210 of 2404)
PASS: lldb-unit :: Host/Release/HostTests/NativeProcessProtocolTest.ReadCStringFromMemory_MaxSize (2211 of 2404)
PASS: lldb-unit :: Process/Utility/Release/ProcessUtilityTests/ProcMapTests/LinuxProcMapsTestFixture.ParseMapRegions/5 (2212 of 2404)
PASS: lldb-unit :: Process/Utility/Release/ProcessUtilityTests/ProcMapTests/LinuxProcMapsTestFixture.ParseMapRegions/1 (2213 of 2404)
PASS: lldb-unit :: Utility/Release/UtilityTests/StringExtractorTest.GetHexU8_Underflow (2214 of 2404)
PASS: lldb-unit :: Host/Release/HostTests/HostInfoTest.GetAugmentedArchSpec (2215 of 2404)
PASS: lldb-unit :: SymbolFile/NativePDB/Release/SymbolFileNativePDBTests/PDBFPOProgramToDWARFExpressionTests.InvalidOpBinary (2216 of 2404)
PASS: lldb-unit :: Process/Utility/Release/ProcessUtilityTests/MemoryTagManagerAArch64MTETest.PackTags (2217 of 2404)
PASS: lldb-unit :: Host/Release/HostTests/File.GetStreamFromDescriptor (2218 of 2404)
PASS: lldb-unit :: ObjectFile/Breakpad/Release/ObjectFileBreakpadTests/StackCFIRecord.parse (2219 of 2404)
PASS: lldb-unit :: Process/Utility/Release/ProcessUtilityTests/ProcSMapTests/LinuxProcSMapsTestFixture.ParseSMapRegions/5 (2220 of 2404)
PASS: lldb-unit :: Process/gdb-remote/Release/ProcessGdbRemoteTests/PortMapTest.AllowPort (2221 of 2404)
PASS: lldb-unit :: Host/Release/HostTests/FileSystemTest.EnumerateDirectory (2222 of 2404)
PASS: lldb-unit :: Process/Utility/Release/ProcessUtilityTests/MemoryTagManagerAArch64MTETest.MakeTaggedRange (2223 of 2404)
PASS: lldb-unit :: Utility/Release/UtilityTests/Flags.AnyClear (2224 of 2404)
PASS: lldb-unit :: SymbolFile/NativePDB/Release/SymbolFileNativePDBTests/PDBFPOProgramToDWARFExpressionTests.InvalidAssignmentSingle (2225 of 2404)
PASS: lldb-unit :: Utility/Release/UtilityTests/ArgsTest.Yaml (2226 of 2404)
PASS: lldb-unit :: Host/Release/HostTests/FileSystemTest.GetPermissions (2227 of 2404)
PASS: lldb-unit :: Signals/Release/SignalsTests/UnixSignalsTest.GetInfo (2228 of 2404)
PASS: lldb-unit :: SymbolFile/NativePDB/Release/SymbolFileNativePDBTests/PDBFPOProgramToDWARFExpressionTests.UnknownOp (2229 of 2404)
PASS: lldb-unit :: Process/minidump/Release/LLDBMinidumpTests/MinidumpParserTest.GetArchitecture (2230 of 2404)
PASS: lldb-unit :: Process/gdb-remote/Release/ProcessGdbRemoteTests/GDBRemoteCommunicationServerTest.SendErrorResponse_ErrorNumber (2231 of 2404)
PASS: lldb-unit :: DataFormatter/Release/LLDBFormatterTests/TypeMatcherTests.GetMatchStringExactName (2232 of 2404)
PASS: lldb-unit :: Host/Release/HostTests/File.GetWaitableHandleFileno (2233 of 2404)
PASS: lldb-unit :: SymbolFile/NativePDB/Release/SymbolFileNativePDBTests/PDBFPOProgramToDWARFExpressionTests.UnresolvedRegisterReference (2234 of 2404)
PASS: lldb-unit :: Host/Release/HostTests/FileSystemTest.Exists (2235 of 2404)
PASS: lldb-unit :: Process/Utility/Release/ProcessUtilityTests/MemoryTagManagerAArch64MTETest.AddressDiff (2236 of 2404)
PASS: lldb-unit :: Host/Release/HostTests/SocketAddressTest.GetAddressInfo (2237 of 2404)
PASS: lldb-unit :: Utility/Release/UtilityTests/BinaryStreamTest.PutULEB128Zero (2238 of 2404)
PASS: lldb-unit :: Host/Release/HostTests/NativeProcessProtocolTest.ReadCStringFromMemory_CrossPageBoundary (2239 of 2404)
PASS: lldb-unit :: Process/Utility/Release/ProcessUtilityTests/ProcMapTests/LinuxProcMapsTestFixture.ParseMapRegions/6 (2240 of 2404)
PASS: lldb-unit :: SymbolFile/NativePDB/Release/SymbolFileNativePDBTests/PDBFPOProgramToDWARFExpressionTests.MultipleIndependentAssignments (2241 of 2404)
PASS: lldb-unit :: Process/Utility/Release/ProcessUtilityTests/MemoryTagManagerAArch64MTETest.GetLogicalTag (2242 of 2404)
PASS: lldb-unit :: SymbolFile/NativePDB/Release/SymbolFileNativePDBTests/PDBFPOProgramToDWARFExpressionTests.InvalidOpUnary (2243 of 2404)
PASS: lldb-unit :: Process/Utility/Release/ProcessUtilityTests/ProcSMapTests/LinuxProcSMapsTestFixture.ParseSMapRegions/7 (2244 of 2404)
PASS: lldb-unit :: SymbolFile/NativePDB/Release/SymbolFileNativePDBTests/PDBFPOProgramToDWARFExpressionTests.InvalidAssignmentMultiple (2245 of 2404)
PASS: lldb-unit :: Process/Utility/Release/ProcessUtilityTests/MemoryTagManagerAArch64MTETest.RemoveNonAddressBits (2246 of 2404)
PASS: lldb-unit :: Process/Utility/Release/ProcessUtilityTests/ProcMapTests/LinuxProcMapsTestFixture.ParseMapRegions/7 (2247 of 2404)
UNSUPPORTED: lldb-shell :: SymbolFile/NativePDB/globals-fundamental.cpp (2248 of 2404)
UNSUPPORTED: lldb-shell :: Register/x86-64-ymm16-read.test (2249 of 2404)
UNSUPPORTED: lldb-shell :: Register/x86-64-ymm16-write.test (2250 of 2404)
UNSUPPORTED: lldb-shell :: SymbolFile/DWARF/x86/find-basic-function.cpp (2251 of 2404)
UNSUPPORTED: lldb-shell :: Register/x86-64-zmm-write.test (2252 of 2404)
UNSUPPORTED: lldb-shell :: ExecControl/StopHook/stop-hook-threads.test (2253 of 2404)
UNSUPPORTED: lldb-shell :: Unwind/basic-block-sections.test (2254 of 2404)
UNSUPPORTED: lldb-shell :: Register/x86-zmm-read.test (2255 of 2404)
UNSUPPORTED: lldb-shell :: Register/x86-64-xmm16-read.test (2256 of 2404)
UNSUPPORTED: lldb-shell :: Register/x86-64-xmm16-write.test (2257 of 2404)
UNSUPPORTED: lldb-shell :: SymbolFile/DWARF/x86/find-basic-namespace.cpp (2258 of 2404)
UNSUPPORTED: lldb-shell :: Breakpoint/ppc64-localentry.test (2259 of 2404)
UNSUPPORTED: lldb-shell :: SymbolFile/DWARF/x86/find-method.cpp (2260 of 2404)
UNSUPPORTED: lldb-shell :: ObjectFile/ELF/minidebuginfo-set-and-hit-breakpoint.test (2261 of 2404)
UNSUPPORTED: lldb-shell :: Reproducer/TestLuaImport.test (2262 of 2404)
UNSUPPORTED: lldb-shell :: SymbolFile/DWARF/x86/find-basic-variable.cpp (2263 of 2404)
UNSUPPORTED: lldb-shell :: Breakpoint/case-insensitive.test (2264 of 2404)
UNSUPPORTED: lldb-shell :: Subprocess/fork-follow-child-wp.test (2265 of 2404)
UNSUPPORTED: lldb-shell :: SymbolFile/DWARF/x86/find-variable-file.cpp (2266 of 2404)
UNSUPPORTED: lldb-shell :: SymbolFile/DWARF/x86/DW_TAG_GNU_call_site-DW_AT_low_pc.s (2267 of 2404)
UNSUPPORTED: lldb-shell :: Register/x86-64-zmm-read.test (2268 of 2404)
UNSUPPORTED: lldb-shell :: Register/x86-zmm-write.test (2269 of 2404)
UNSUPPORTED: lldb-shell :: Subprocess/clone-follow-parent.test (2270 of 2404)
UNSUPPORTED: lldb-shell :: SymbolFile/PDB/ast-restore.test (2271 of 2404)
UNSUPPORTED: lldb-shell :: SymbolFile/DWARF/x86/find-basic-type.cpp (2272 of 2404)
UNSUPPORTED: lldb-shell :: Unwind/split-machine-functions.test (2273 of 2404)
UNSUPPORTED: lldb-shell :: SymbolFile/PDB/variables.test (2274 of 2404)
UNSUPPORTED: lldb-shell :: Watchpoint/netbsd-nouserdbregs.test (2275 of 2404)
UNSUPPORTED: lldb-shell :: SymbolFile/DWARF/x86/DW_TAG_variable-DW_AT_decl_file-DW_AT_abstract_origin-crosscu1.s (2276 of 2404)
UNSUPPORTED: lldb-shell :: Subprocess/vfork-follow-child-wp.test (2277 of 2404)
UNSUPPORTED: lldb-shell :: Register/x86-ymm-write.test (2278 of 2404)
UNSUPPORTED: lldb-shell :: Subprocess/clone-follow-child-wp.test (2279 of 2404)
UNSUPPORTED: lldb-shell :: Unwind/unwind-plan-dwarf-dump.test (2280 of 2404)
UNSUPPORTED: lldb-shell :: Register/x86-db-read.test (2281 of 2404)
UNSUPPORTED: lldb-shell :: SymbolFile/DWARF/debug-types-expressions.test (2282 of 2404)
UNSUPPORTED: lldb-shell :: SymbolFile/PDB/class-layout.test (2283 of 2404)
UNSUPPORTED: lldb-shell :: Subprocess/clone-follow-parent-softbp.test (2284 of 2404)
PASS: lldb-unit :: Breakpoint/Release/LLDBBreakpointTests/BreakpointIDTest.StringIsBreakpointName (2285 of 2404)
PASS: lldb-unit :: ObjectFile/Breakpad/Release/ObjectFileBreakpadTests/FileRecord.parse (2286 of 2404)
PASS: lldb-unit :: Platform/Android/Release/AdbClientTests/AdbClientTest.CreateByDeviceId_ByEnvVar (2287 of 2404)
PASS: lldb-unit :: SymbolFile/NativePDB/Release/SymbolFileNativePDBTests/PDBFPOProgramToDWARFExpressionTests.MissingTargetRegister (2288 of 2404)
UNSUPPORTED: lldb-shell :: BuildScript/toolchain-clang-cl.test (2289 of 2404)
UNSUPPORTED: lldb-shell :: Register/aarch64-gp-read.test (2290 of 2404)
UNSUPPORTED: lldb-shell :: SymbolFile/NativePDB/locate-pdb.cpp (2291 of 2404)
UNSUPPORTED: lldb-shell :: Subprocess/clone-follow-child-softbp.test (2292 of 2404)
UNSUPPORTED: lldb-shell :: Subprocess/vfork-follow-parent-wp.test (2293 of 2404)
UNSUPPORTED: lldb-shell :: Subprocess/vfork-follow-parent-softbp.test (2294 of 2404)
UNSUPPORTED: lldb-shell :: SymbolFile/PDB/enums-layout.test (2295 of 2404)
UNSUPPORTED: lldb-shell :: SymbolFile/PDB/calling-conventions.test (2296 of 2404)
UNSUPPORTED: lldb-shell :: SymbolFile/NativePDB/load-pdb.cpp (2297 of 2404)
UNSUPPORTED: lldb-shell :: SymbolFile/DWARF/x86/debug_ranges_and_rnglists.test (2298 of 2404)
UNSUPPORTED: lldb-shell :: SymbolFile/DWARF/x86/debug-types-basic.test (2299 of 2404)
UNSUPPORTED: lldb-shell :: SymbolFile/DWARF/split-optimized.c (2300 of 2404)
UNSUPPORTED: lldb-shell :: SymbolFile/PDB/pointers.test (2301 of 2404)
UNSUPPORTED: lldb-shell :: Unwind/eh-frame-small-fde.test (2302 of 2404)
UNSUPPORTED: lldb-shell :: Subprocess/clone-follow-child.test (2303 of 2404)
UNSUPPORTED: lldb-shell :: Register/x86-ymm-read.test (2304 of 2404)
UNSUPPORTED: lldb-shell :: Unwind/eh-frame-augment-noop.test (2305 of 2404)
UNSUPPORTED: lldb-shell :: Subprocess/clone-follow-parent-wp.test (2306 of 2404)
UNSUPPORTED: lldb-shell :: SymbolFile/NativePDB/global-classes.cpp (2307 of 2404)
UNSUPPORTED: lldb-shell :: BuildScript/toolchain-msvc.test (2308 of 2404)
UNSUPPORTED: lldb-shell :: Register/x86-gp-read.test (2309 of 2404)
UNSUPPORTED: lldb-shell :: Subprocess/vfork-follow-child.test (2310 of 2404)
UNSUPPORTED: lldb-shell :: ObjectFile/PECOFF/uuid.yaml (2311 of 2404)
UNSUPPORTED: lldb-shell :: SymbolFile/DWARF/x86/debug-names-compressed.cpp (2312 of 2404)
UNSUPPORTED: lldb-shell :: Subprocess/fork-follow-child.test (2313 of 2404)
UNSUPPORTED: lldb-shell :: SymbolFile/DWARF/x86/find-function-regex.cpp (2314 of 2404)
UNSUPPORTED: lldb-shell :: SymbolFile/NativePDB/tag-types.cpp (2315 of 2404)
UNSUPPORTED: lldb-shell :: Register/arm-gp-read.test (2316 of 2404)
UNSUPPORTED: lldb-shell :: SymbolFile/NativePDB/disassembly.cpp (2317 of 2404)
UNSUPPORTED: lldb-shell :: Subprocess/fork-follow-child-softbp.test (2318 of 2404)
UNSUPPORTED: lldb-shell :: SymbolFile/NativePDB/ast-functions.cpp (2319 of 2404)
UNSUPPORTED: lldb-shell :: SymbolFile/PDB/compilands.test (2320 of 2404)
UNSUPPORTED: lldb-shell :: SymbolFile/NativePDB/break-by-line.cpp (2321 of 2404)
UNSUPPORTED: lldb-shell :: SymbolFile/PDB/typedefs.test (2322 of 2404)
UNSUPPORTED: lldb-shell :: SymbolFile/DWARF/x86/debug-types-address-ranges.s (2323 of 2404)
UNSUPPORTED: lldb-shell :: Subprocess/vfork-follow-child-softbp.test (2324 of 2404)
UNSUPPORTED: lldb-shell :: SymbolFile/DWARF/x86/find-variable-dwo.cpp (2325 of 2404)
UNSUPPORTED: lldb-shell :: SymbolFile/NativePDB/ast-methods.cpp (2326 of 2404)
UNSUPPORTED: lldb-shell :: ObjectFile/PECOFF/dep-modules.yaml (2327 of 2404)
UNSUPPORTED: lldb-shell :: SymbolFile/DWARF/split-dwarf-expression-eval-bug.cpp (2328 of 2404)
UNSUPPORTED: lldb-shell :: SymbolFile/PDB/type-quals.test (2329 of 2404)
UNSUPPORTED: lldb-shell :: Subprocess/fork-follow-parent-softbp.test (2330 of 2404)
UNSUPPORTED: lldb-shell :: SymbolFile/DWARF/x86/dwarf5-line-strp.s (2331 of 2404)
UNSUPPORTED: lldb-shell :: Register/x86-fp-read.test (2332 of 2404)
UNSUPPORTED: lldb-shell :: Expr/TestIRMemoryMapWindows.test (2333 of 2404)
UNSUPPORTED: lldb-shell :: SymbolFile/NativePDB/s_constant.cpp (2334 of 2404)
UNSUPPORTED: lldb-shell :: SymbolFile/NativePDB/function-types-classes.cpp (2335 of 2404)
UNSUPPORTED: lldb-shell :: SymbolFile/target-symbols-add-unwind.test (2336 of 2404)
UNSUPPORTED: lldb-shell :: SymbolFile/NativePDB/function-types-builtins.cpp (2337 of 2404)
UNSUPPORTED: lldb-shell :: Register/aarch64-fp-read.test (2338 of 2404)
UNSUPPORTED: lldb-shell :: SymbolFile/dissassemble-entry-point.s (2339 of 2404)
UNSUPPORTED: lldb-shell :: SymbolFile/NativePDB/ast-types.cpp (2340 of 2404)
UNSUPPORTED: lldb-shell :: SymbolFile/NativePDB/nested-types.cpp (2341 of 2404)
UNSUPPORTED: lldb-shell :: SymbolFile/DWARF/x86/find-inline-method.s (2342 of 2404)
UNSUPPORTED: lldb-shell :: SymbolFile/DWARF/x86/limit-debug-info.s (2343 of 2404)
UNSUPPORTED: lldb-shell :: Minidump/Windows/arm-fp-unwind.test (2344 of 2404)
UNSUPPORTED: lldb-shell :: Register/x86-64-gp-write.test (2345 of 2404)
UNSUPPORTED: lldb-shell :: SymbolFile/PDB/func-symbols.test (2346 of 2404)
UNSUPPORTED: lldb-shell :: ObjectFile/ELF/minidebuginfo-no-lzma.yaml (2347 of 2404)
UNSUPPORTED: lldb-shell :: SymbolFile/DWARF/x86/win-i386-line-table.s (2348 of 2404)
UNSUPPORTED: lldb-shell :: SymbolFile/DWARF/x86/dwp-separate-debug-file.cpp (2349 of 2404)
UNSUPPORTED: lldb-shell :: SymbolFile/DWARF/dwarf5-lazy-dwo.c (2350 of 2404)
UNSUPPORTED: lldb-shell :: SymbolFile/PDB/function-level-linking.test (2351 of 2404)
UNSUPPORTED: lldb-shell :: SymbolFile/NativePDB/bitfields.cpp (2352 of 2404)
UNSUPPORTED: lldb-shell :: ObjectFile/PECOFF/export-dllfunc.yaml (2353 of 2404)
UNSUPPORTED: lldb-shell :: Register/arm-fp-read.test (2354 of 2404)
UNSUPPORTED: lldb-shell :: Register/x86-gp-write.test (2355 of 2404)
UNSUPPORTED: lldb-shell :: SymbolFile/NativePDB/break-by-function.cpp (2356 of 2404)
UNSUPPORTED: lldb-shell :: SymbolFile/DWARF/x86/debug-types-dwo-cross-reference.cpp (2357 of 2404)
UNSUPPORTED: lldb-shell :: SymbolFile/DWARF/x86/subprogram_ranges.test (2358 of 2404)
UNSUPPORTED: lldb-shell :: SymbolFile/NativePDB/ast-functions-msvc.cpp (2359 of 2404)
UNSUPPORTED: lldb-shell :: SymbolFile/NativePDB/source-list.cpp (2360 of 2404)
UNSUPPORTED: lldb-shell :: ObjectFile/PECOFF/disassemble-thumb.yaml (2361 of 2404)
UNSUPPORTED: lldb-shell :: SymbolFile/NativePDB/globals-bss.cpp (2362 of 2404)
UNSUPPORTED: lldb-shell :: SymbolFile/PDB/function-nested-block.test (2363 of 2404)
UNSUPPORTED: lldb-shell :: SymbolFile/NativePDB/function-types-calling-conv.cpp (2364 of 2404)
UNSUPPORTED: lldb-shell :: SymbolFile/DWARF/x86/dwarf5-partial-index.cpp (2365 of 2404)
UNSUPPORTED: lldb-shell :: SymbolFile/DWARF/x86/debug-types-signature-loop.s (2366 of 2404)
UNSUPPORTED: lldb-shell :: ObjectFile/ELF/basic-info.yaml (2367 of 2404)
UNSUPPORTED: lldb-shell :: SymbolFile/NativePDB/stack_unwinding01.cpp (2368 of 2404)
UNSUPPORTED: lldb-shell :: SymbolFile/PDB/udt-layout.test (2369 of 2404)
UNSUPPORTED: lldb-shell :: SymbolFile/DWARF/find-type-in-function.cpp (2370 of 2404)
UNSUPPORTED: lldb-shell :: SymbolFile/PDB/variables-locations.test (2371 of 2404)
UNSUPPORTED: lldb-shell :: SymbolFile/NativePDB/local-variables.cpp (2372 of 2404)
UNSUPPORTED: lldb-shell :: SymbolFile/PDB/vbases.test (2373 of 2404)
UNSUPPORTED: lldb-shell :: SymbolFile/DWARF/x86/array-sizes.s (2374 of 2404)
UNSUPPORTED: lldb-shell :: SymbolFile/DWARF/x86/inline-function-address.ll (2375 of 2404)
UNSUPPORTED: lldb-shell :: SymbolFile/PDB/expressions.test (2376 of 2404)
UNSUPPORTED: lldb-shell :: Process/Windows/exception_access_violation.cpp (2377 of 2404)
UNSUPPORTED: lldb-shell :: SymbolFile/DWARF/x86/debug-line-basic.s (2378 of 2404)
UNSUPPORTED: lldb-shell :: SymbolFile/DWARF/x86/dir-separator-windows.s (2379 of 2404)
UNSUPPORTED: lldb-shell :: SymbolFile/DWARF/x86/dir-separator-posix.s (2380 of 2404)
UNSUPPORTED: lldb-shell :: SymbolFile/DWARF/x86/dwarf5_locations.s (2381 of 2404)
UNSUPPORTED: lldb-shell :: SymbolFile/DWARF/x86/inline-function-address-shared.test (2382 of 2404)
UNSUPPORTED: lldb-shell :: SymbolFile/DWARF/x86/dir-separator-no-comp-dir.s (2383 of 2404)
UNSUPPORTED: lldb-shell :: SymbolFile/DWARF/x86/dir-separator-no-comp-dir-relative-name.s (2384 of 2404)
UNSUPPORTED: lldb-shell :: SymbolFile/DWARF/x86/dwarf5-index-is-used.cpp (2385 of 2404)
UNSUPPORTED: lldb-shell :: SymbolFile/Breakpad/stack-cfi-arm.yaml (2386 of 2404)
UNSUPPORTED: lldb-shell :: ScriptInterpreter/Lua/lua.test (2387 of 2404)
UNSUPPORTED: lldb-shell :: SymbolFile/NativePDB/typedefs.cpp (2388 of 2404)
UNSUPPORTED: lldb-shell :: ScriptInterpreter/Lua/bindings.test (2389 of 2404)
UNSUPPORTED: lldb-shell :: ScriptInterpreter/Lua/nested_sessions.test (2390 of 2404)
UNSUPPORTED: lldb-shell :: ScriptInterpreter/Lua/quit.test (2391 of 2404)
UNSUPPORTED: lldb-shell :: ScriptInterpreter/Lua/partial_statements.test (2392 of 2404)
UNSUPPORTED: lldb-shell :: ScriptInterpreter/Lua/breakpoint_callback.test (2393 of 2404)
UNSUPPORTED: lldb-shell :: ScriptInterpreter/Lua/fail_breakpoint_oneline.test (2394 of 2404)
UNSUPPORTED: lldb-shell :: ScriptInterpreter/Lua/persistent_state.test (2395 of 2404)
UNSUPPORTED: lldb-shell :: ScriptInterpreter/Lua/independent_state.test (2396 of 2404)
UNSUPPORTED: lldb-shell :: ScriptInterpreter/Lua/command_script_import.test (2397 of 2404)
UNSUPPORTED: lldb-shell :: ScriptInterpreter/Lua/convenience_variables.test (2398 of 2404)
UNSUPPORTED: lldb-shell :: ScriptInterpreter/Lua/lua-python.test (2399 of 2404)
UNSUPPORTED: lldb-shell :: ScriptInterpreter/Lua/breakpoint_oneline_callback.test (2400 of 2404)
UNSUPPORTED: lldb-shell :: ScriptInterpreter/Lua/watchpoint_callback.test (2401 of 2404)
UNSUPPORTED: lldb-shell :: ScriptInterpreter/Lua/io.test (2402 of 2404)
UNSUPPORTED: lldb-shell :: ScriptInterpreter/Lua/print.test (2403 of 2404)
UNSUPPORTED: lldb-shell :: ScriptInterpreter/Lua/breakpoint_function_callback.test (2404 of 2404)
********************
Failed Tests (1):
  lldb-api :: tools/lldb-vscode/launch/TestVSCode_launch.py

Hide Details

Hide Details

Testing Time: 516.07s Unsupported : 267 Passed : 2127 Expectedly Failed: 9 Failed : 1 make: *** [/Users/buildslave/jenkins/workspace/lldb-cmake-standalone/lldb-xcode-build/test/CMakeFiles/check-lldb] Error 1

Hide Details

** BUILD FAILED **

Hide Details

Hide Details

The following build commands failed: PhaseScriptExecution CMake\ Rules /Users/buildslave/jenkins/workspace/lldb-cmake-standalone/lldb-xcode-build/test/lldb.build/Release/check-lldb.build/Script-5157327CACAD4D70AF063F8B.sh (1 failure) Command failed: Command '['/usr/bin/env', 'TERM=vt100', '/usr/local/bin/cmake', '--build', '.', '--config', 'Release', '--target', 'check-lldb']' returned non-zero exit status 65. Command: ['/usr/bin/env', 'TERM=vt100', '/usr/local/bin/cmake', '--build', '.', '--config', 'Release', '--target', 'check-lldb'] [Pipeline] } [Pipeline] // timeout [Pipeline] } [Pipeline] // stage [Pipeline] } [Pipeline] // withEnv [Pipeline] } [Pipeline] // node [Pipeline] End of Pipeline ERROR: script returned exit code 1 Finished: FAILURE