Console Output

Skipping 147,631 KB.. Full Log
UNSUPPORTED: lldb-api :: functionalities/tsan/global_location/TestTsanGlobalLocation.py (306 of 1406)
UNSUPPORTED: lldb-api :: commands/register/register/intel_xtended_registers/mpx_bound_violation/TestBoundViolation.py (307 of 1406)
PASS: lldb-api :: lang/objc/objc-static-method/TestObjCStaticMethod.py (308 of 1406)
UNSUPPORTED: lldb-shell :: Subprocess/clone-follow-parent-wp.test (309 of 1406)
UNSUPPORTED: lldb-shell :: ScriptInterpreter/Python/Crashlog/json.test (310 of 1406)
PASS: lldb-api :: tools/lldb-server/TestGdbRemoteKill.py (311 of 1406)
UNSUPPORTED: lldb-api :: functionalities/tsan/cpp_global_location/TestTsanCPPGlobalLocation.py (312 of 1406)
PASS: lldb-shell :: ScriptInterpreter/Python/python.test (313 of 1406)
PASS: lldb-api :: commands/reproducer/invalid-args/TestInvalidArgsReproducer.py (314 of 1406)
UNSUPPORTED: lldb-api :: commands/register/register/aarch64_sve_registers/rw_access_static_config/TestSVERegisters.py (315 of 1406)
PASS: lldb-shell :: ObjectFile/ELF/section-permissions.yaml (316 of 1406)
UNSUPPORTED: lldb-api :: python_api/process/io/TestProcessIO.py (317 of 1406)
UNSUPPORTED: lldb-shell :: Breakpoint/case-insensitive.test (318 of 1406)
PASS: lldb-api :: lang/cpp/function-local-class/TestCppFunctionLocalClass.py (319 of 1406)
UNSUPPORTED: lldb-api :: iohandler/resize/TestIOHandlerResizeNoEditline.py (320 of 1406)
PASS: lldb-api :: functionalities/data-formatter/data-formatter-stl/libcxx/variant/TestDataFormatterLibcxxVariant.py (321 of 1406)
PASS: lldb-api :: lang/cpp/frame-var-anon-unions/TestFrameVariableAnonymousUnions.py (322 of 1406)
PASS: lldb-api :: functionalities/data-formatter/data-formatter-objc/TestDataFormatterObjCExpr.py (323 of 1406)
UNSUPPORTED: lldb-api :: linux/thread/create_during_instruction_step/TestCreateDuringInstructionStep.py (324 of 1406)
PASS: lldb-api :: lang/objc/objc-runtime-ivars/TestRuntimeIvars.py (325 of 1406)
PASS: lldb-api :: lang/objc/objc-ivar-protocols/TestIvarProtocols.py (326 of 1406)
PASS: lldb-api :: functionalities/signal/raise/TestRaise.py (327 of 1406)
PASS: lldb-api :: functionalities/gdb_remote_client/TestGDBServerTargetXML.py (328 of 1406)
PASS: lldb-api :: lang/objc/single-entry-dictionary/TestObjCSingleEntryDictionary.py (329 of 1406)
PASS: lldb-api :: functionalities/data-formatter/builtin-formats/TestBuiltinFormats.py (330 of 1406)
PASS: lldb-api :: types/TestIntegerTypeExpr.py (331 of 1406)
PASS: lldb-api :: lang/c/strings/TestCStrings.py (332 of 1406)
PASS: lldb-api :: functionalities/multiword-commands/TestMultiWordCommands.py (333 of 1406)
PASS: lldb-shell :: Unwind/eh-frame-dwarf-unwind.test (334 of 1406)
UNSUPPORTED: lldb-api :: functionalities/thread/concurrent_events/TestConcurrentManySignals.py (335 of 1406)
PASS: lldb-api :: functionalities/data-formatter/data-formatter-smart-array/TestDataFormatterSmartArray.py (336 of 1406)
PASS: lldb-shell :: ObjectFile/PECOFF/invalid-export-table.yaml (337 of 1406)
PASS: lldb-api :: types/TestLongTypesExpr.py (338 of 1406)
UNSUPPORTED: lldb-api :: functionalities/thread/concurrent_events/TestConcurrentBreakpointsDelayedBreakpointOneWatchpoint.py (339 of 1406)
PASS: lldb-shell :: ScriptInterpreter/None/import_module.test (340 of 1406)
PASS: lldb-api :: commands/frame/diagnose/inheritance/TestDiagnoseInheritance.py (341 of 1406)
UNSUPPORTED: lldb-shell :: SymbolFile/PDB/function-nested-block.test (342 of 1406)
PASS: lldb-shell :: SymbolFile/DWARF/anon_class_w_and_wo_export_symbols.ll (343 of 1406)
UNSUPPORTED: lldb-api :: functionalities/data-formatter/data-formatter-stl/libstdcpp/vbool/TestDataFormatterStdVBool.py (344 of 1406)
PASS: lldb-api :: commands/expression/context-object/TestContextObject.py (345 of 1406)
UNSUPPORTED: lldb-shell :: SymbolFile/NativePDB/function-types-builtins.cpp (346 of 1406)
UNSUPPORTED: lldb-api :: benchmarks/libcxxlist/TestBenchmarkLibcxxList.py (347 of 1406)
PASS: lldb-shell :: Minidump/Windows/Sigsegv/sigsegv.test (348 of 1406)
PASS: lldb-shell :: Commands/command-regex-unalias.test (349 of 1406)
PASS: lldb-api :: functionalities/data-formatter/typedef_array/TestTypedefArray.py (350 of 1406)
PASS: lldb-api :: lang/cpp/class_static/TestStaticVariables.py (351 of 1406)
PASS: lldb-api :: python_api/value_var_update/TestValueVarUpdate.py (352 of 1406)
PASS: lldb-api :: commands/quit/TestQuit.py (353 of 1406)
UNSUPPORTED: lldb-api :: tools/lldb-vscode/evaluate/TestVSCode_evaluate.py (354 of 1406)
UNSUPPORTED: lldb-shell :: SymbolFile/DWARF/x86/limit-debug-info.s (355 of 1406)
PASS: lldb-api :: lang/cpp/limit-debug-info/TestWithLimitDebugInfo.py (356 of 1406)
PASS: lldb-api :: functionalities/unwind/zeroth_frame/TestZerothFrame.py (357 of 1406)
UNSUPPORTED: lldb-api :: functionalities/thread/concurrent_events/TestConcurrentSignalWatchBreak.py (358 of 1406)
PASS: lldb-api :: lang/cpp/class-template-type-parameter-pack/TestClassTemplateTypeParameterPack.py (359 of 1406)
PASS: lldb-api :: commands/platform/file/close/TestPlatformFileClose.py (360 of 1406)
PASS: lldb-api :: functionalities/plugins/python_os_plugin/stepping_plugin_threads/TestOSPluginStepping.py (361 of 1406)
PASS: lldb-shell :: SymbolFile/DWARF/x86/find-method-local-struct.cpp (362 of 1406)
UNSUPPORTED: lldb-api :: functionalities/param_entry_vals/basic_entry_values/TestBasicEntryValues.py (363 of 1406)
PASS: lldb-api :: commands/platform/file/read/TestPlatformFileRead.py (364 of 1406)
PASS: lldb-api :: lang/cpp/subst_template_type_param/TestSubstTemplateTypeParam.py (365 of 1406)
PASS: lldb-api :: tools/lldb-server/TestGdbRemote_vCont.py (366 of 1406)
UNSUPPORTED: lldb-shell :: SymbolFile/PDB/expressions.test (367 of 1406)
PASS: lldb-api :: commands/frame/diagnose/local-variable/TestLocalVariable.py (368 of 1406)
UNSUPPORTED: lldb-shell :: SymbolFile/dissassemble-entry-point.s (369 of 1406)
PASS: lldb-api :: commands/expression/dollar-in-variable/TestDollarInVariable.py (370 of 1406)
PASS: lldb-api :: lang/cpp/typeof/TestTypeOfDeclTypeExpr.py (371 of 1406)
PASS: lldb-api :: functionalities/history/TestHistoryRecall.py (372 of 1406)
PASS: lldb-shell :: Register/Core/x86-32-freebsd-gp.test (373 of 1406)
UNSUPPORTED: lldb-shell :: SymbolFile/NativePDB/locate-pdb.cpp (374 of 1406)
UNSUPPORTED: lldb-api :: functionalities/tail_call_frames/unambiguous_sequence/TestUnambiguousTailCalls.py (375 of 1406)
UNSUPPORTED: lldb-api :: commands/expression/import-std-module/conflicts/TestStdModuleWithConflicts.py (376 of 1406)
UNSUPPORTED: lldb-shell :: SymbolFile/DWARF/debug-types-expressions.test (377 of 1406)
PASS: lldb-api :: commands/expression/diagnostics/TestExprDiagnostics.py (378 of 1406)
UNSUPPORTED: lldb-api :: commands/expression/import-std-module/missing-module-sources/TestStdModuleSourcesMissing.py (379 of 1406)
UNSUPPORTED: lldb-api :: commands/expression/import-std-module/weak_ptr/TestWeakPtrFromStdModule.py (380 of 1406)
PASS: lldb-shell :: SymbolFile/DWARF/x86/debug_loc_and_loclists.s (381 of 1406)
XFAIL: lldb-shell :: Register/x86-64-fp-read.test (382 of 1406)
PASS: lldb-api :: lang/cpp/overloaded-functions/TestOverloadedFunctions.py (383 of 1406)
PASS: lldb-api :: python_api/value/change_values/TestChangeValueAPI.py (384 of 1406)
UNSUPPORTED: lldb-shell :: SymbolFile/NativePDB/globals-bss.cpp (385 of 1406)
PASS: lldb-shell :: ObjectFile/ELF/avr-basic-info.yaml (386 of 1406)
UNSUPPORTED: lldb-shell :: Reproducer/TestFinalize.test (387 of 1406)
UNSUPPORTED: lldb-shell :: Driver/TestFile.test (388 of 1406)
UNSUPPORTED: lldb-shell :: Register/x86-64-ymm-read.test (389 of 1406)
UNSUPPORTED: lldb-api :: commands/expression/import-std-module/unique_ptr-dbg-info-content/TestUniquePtrDbgInfoContent.py (390 of 1406)
PASS: lldb-api :: functionalities/data-formatter/compactvectors/TestCompactVectors.py (391 of 1406)
FAIL: lldb-api :: lang/objc/modules-compile-error/TestModulesCompileError.py (392 of 1406)
******************** TEST 'lldb-api :: lang/objc/modules-compile-error/TestModulesCompileError.py' FAILED ********************
Script:
--
/usr/local/Frameworks/Python.framework/Versions/3.7/bin/python3.7 /Users/buildslave/jenkins/workspace/lldb-cmake-matrix/llvm-project/lldb/test/API/dotest.py -u CXXFLAGS -u CFLAGS --codesign-identity lldb_codesign --arch x86_64 --build-dir /Users/buildslave/jenkins/workspace/lldb-cmake-matrix/lldb-build/lldb-test-build.noindex -t --env TERM=vt100 --skip-category gmodules --skip-category watchpoint --arch=x86_64 --env LLVM_LIBS_DIR=/Users/buildslave/jenkins/workspace/lldb-cmake-matrix/lldb-build/./lib --arch x86_64 --build-dir /Users/buildslave/jenkins/workspace/lldb-cmake-matrix/lldb-build/lldb-test-build.noindex --lldb-module-cache-dir /Users/buildslave/jenkins/workspace/lldb-cmake-matrix/lldb-build/lldb-test-build.noindex/module-cache-lldb/lldb-api --clang-module-cache-dir /Users/buildslave/jenkins/workspace/lldb-cmake-matrix/lldb-build/lldb-test-build.noindex/module-cache-clang/lldb-api --executable /Users/buildslave/jenkins/workspace/lldb-cmake-matrix/lldb-build/./bin/lldb --compiler /Users/buildslave/jenkins/workspace/lldb-cmake-matrix/clang_900_build/bin/clang --dsymutil /Users/buildslave/jenkins/workspace/lldb-cmake-matrix/lldb-build/./bin/dsymutil --llvm-tools-dir /Users/buildslave/jenkins/workspace/lldb-cmake-matrix/lldb-build/./bin --lldb-libs-dir /Users/buildslave/jenkins/workspace/lldb-cmake-matrix/lldb-build/./lib --skip-category=lldb-vscode --skip-category=std-module /Users/buildslave/jenkins/workspace/lldb-cmake-matrix/llvm-project/lldb/test/API/lang/objc/modules-compile-error -p TestModulesCompileError.py --capture-path /Users/buildslave/jenkins/workspace/lldb-cmake-matrix/lldb-build/lldb-test-build.noindex/reproducers/TestModulesCompileError.py
--
Exit Code: 1

Hide Details

Command Output (stdout): -- lldb version 14.0.99 (http://labmaster3.local/git/llvm-project.git revision 9689c1b7bb77d65e8acc9a13e5e416803d38b02f) clang revision 9689c1b7bb77d65e8acc9a13e5e416803d38b02f llvm revision 9689c1b7bb77d65e8acc9a13e5e416803d38b02f Skipping the following test categories: ['gmodules', 'watchpoint', 'lldb-vscode', 'std-module', 'libstdcxx', 'dwo', 'llgs', 'fork']

Hide Details

-- Command Output (stderr): -- Change dir to: /Users/buildslave/jenkins/workspace/lldb-cmake-matrix/llvm-project/lldb/test/API/lang/objc/modules-compile-error runCmd: settings clear -all output:

Hide Details

runCmd: settings set symbols.enable-external-lookup false output:

Hide Details

runCmd: settings set target.inherit-tcc true output:

Hide Details

runCmd: settings set target.detach-on-error false output:

Hide Details

runCmd: settings set target.auto-apply-fixits false output:

Hide Details

runCmd: settings set plugin.process.gdb-remote.packet-timeout 60 output:

Hide Details

runCmd: settings set symbols.clang-modules-cache-path "/Users/buildslave/jenkins/workspace/lldb-cmake-matrix/lldb-build/lldb-test-build.noindex/module-cache-lldb/lldb-api" output:

Hide Details

runCmd: settings set use-color false output:

Hide Details

runCmd: setting set target.prefer-dynamic-value no-dynamic-values output:

Hide Details

runCmd: expr @import LLDBTestModule check of return status not required runCmd failed! error: expression failed to parse: error: Header search couldn't locate module LLDBTestModule

Hide Details

error: while importing modules: error: Header search couldn't locate module LLDBTestModule

Hide Details

Hide Details

Hide Details

Ran command: "expr @import LLDBTestModule"

Hide Details

Got output: error: expression failed to parse: error: Header search couldn't locate module LLDBTestModule

Hide Details

error: while importing modules: error: Header search couldn't locate module LLDBTestModule

Hide Details

Hide Details

Expecting sub string: "module.h:4:1: error: unknown type name 'syntax_error_for_lldb_to_find'" (was not found)

Hide Details

FAIL: LLDB (/Users/buildslave/jenkins/workspace/lldb-cmake-matrix/clang_900_build/bin/clang-x86_64) :: test_dsym (TestModulesCompileError.TestCase) <bound method SBProcess.Kill of <lldb.SBProcess; proxy of <Swig Object of type 'lldb::SBProcess *' at 0x10b08d5d0> >>: success

Hide Details

runCmd: settings clear -all output:

Hide Details

runCmd: settings set symbols.enable-external-lookup false output:

Hide Details

runCmd: settings set target.inherit-tcc true output:

Hide Details

runCmd: settings set target.detach-on-error false output:

Hide Details

runCmd: settings set target.auto-apply-fixits false output:

Hide Details

runCmd: settings set plugin.process.gdb-remote.packet-timeout 60 output:

Hide Details

runCmd: settings set symbols.clang-modules-cache-path "/Users/buildslave/jenkins/workspace/lldb-cmake-matrix/lldb-build/lldb-test-build.noindex/module-cache-lldb/lldb-api" output:

Hide Details

runCmd: settings set use-color false output:

Hide Details

runCmd: setting set target.prefer-dynamic-value no-dynamic-values output:

Hide Details

runCmd: expr @import LLDBTestModule check of return status not required runCmd failed! error: expression failed to parse: error: Header search couldn't locate module LLDBTestModule

Hide Details

error: while importing modules: error: Header search couldn't locate module LLDBTestModule

Hide Details

Hide Details

Hide Details

Ran command: "expr @import LLDBTestModule"

Hide Details

Got output: error: expression failed to parse: error: Header search couldn't locate module LLDBTestModule

Hide Details

error: while importing modules: error: Header search couldn't locate module LLDBTestModule

Hide Details

Hide Details

Expecting sub string: "module.h:4:1: error: unknown type name 'syntax_error_for_lldb_to_find'" (was not found)

Hide Details

FAIL: LLDB (/Users/buildslave/jenkins/workspace/lldb-cmake-matrix/clang_900_build/bin/clang-x86_64) :: test_dwarf (TestModulesCompileError.TestCase) <bound method SBProcess.Kill of <lldb.SBProcess; proxy of <Swig Object of type 'lldb::SBProcess *' at 0x1058bfae0> >>: success

Hide Details

UNSUPPORTED: LLDB (/Users/buildslave/jenkins/workspace/lldb-cmake-matrix/clang_900_build/bin/clang-x86_64) :: test_dwo (TestModulesCompileError.TestCase) (test case does not fall in any category of interest for this run) UNSUPPORTED: LLDB (/Users/buildslave/jenkins/workspace/lldb-cmake-matrix/clang_900_build/bin/clang-x86_64) :: test_gmodules (TestModulesCompileError.TestCase) (test case does not fall in any category of interest for this run) Restore dir to: /Users/buildslave/jenkins/workspace/lldb-cmake-matrix/lldb-build/tools/lldb/test ====================================================================== FAIL: test_dsym (TestModulesCompileError.TestCase) ---------------------------------------------------------------------- Traceback (most recent call last): File "/Users/buildslave/jenkins/workspace/lldb-cmake-matrix/llvm-project/lldb/packages/Python/lldbsuite/test/lldbtest.py", line 1835, in test_method return attrvalue(self) File "/Users/buildslave/jenkins/workspace/lldb-cmake-matrix/llvm-project/lldb/test/API/lang/objc/modules-compile-error/TestModulesCompileError.py", line 22, in test "could not build module 'LLDBTestModule'"]) File "/Users/buildslave/jenkins/workspace/lldb-cmake-matrix/llvm-project/lldb/packages/Python/lldbsuite/test/lldbtest.py", line 2555, in expect self.fail(log_msg) AssertionError: Ran command: "expr @import LLDBTestModule"

Hide Details

Got output: error: expression failed to parse: error: Header search couldn't locate module LLDBTestModule

Hide Details

error: while importing modules: error: Header search couldn't locate module LLDBTestModule

Hide Details

Hide Details

Expecting sub string: "module.h:4:1: error: unknown type name 'syntax_error_for_lldb_to_find'" (was not found) Config=x86_64-/Users/buildslave/jenkins/workspace/lldb-cmake-matrix/clang_900_build/bin/clang ====================================================================== FAIL: test_dwarf (TestModulesCompileError.TestCase) ---------------------------------------------------------------------- Traceback (most recent call last): File "/Users/buildslave/jenkins/workspace/lldb-cmake-matrix/llvm-project/lldb/packages/Python/lldbsuite/test/lldbtest.py", line 1835, in test_method return attrvalue(self) File "/Users/buildslave/jenkins/workspace/lldb-cmake-matrix/llvm-project/lldb/test/API/lang/objc/modules-compile-error/TestModulesCompileError.py", line 22, in test "could not build module 'LLDBTestModule'"]) File "/Users/buildslave/jenkins/workspace/lldb-cmake-matrix/llvm-project/lldb/packages/Python/lldbsuite/test/lldbtest.py", line 2555, in expect self.fail(log_msg) AssertionError: Ran command: "expr @import LLDBTestModule"

Hide Details

Got output: error: expression failed to parse: error: Header search couldn't locate module LLDBTestModule

Hide Details

error: while importing modules: error: Header search couldn't locate module LLDBTestModule

Hide Details

Hide Details

Expecting sub string: "module.h:4:1: error: unknown type name 'syntax_error_for_lldb_to_find'" (was not found) Config=x86_64-/Users/buildslave/jenkins/workspace/lldb-cmake-matrix/clang_900_build/bin/clang ---------------------------------------------------------------------- Ran 4 tests in 3.165s

Hide Details

RESULT: FAILED (0 passes, 2 failures, 0 errors, 2 skipped, 0 expected failures, 0 unexpected successes)

Hide Details

--

Hide Details

******************** UNSUPPORTED: lldb-shell :: ObjectFile/PECOFF/disassemble-thumb.yaml (393 of 1406) PASS: lldb-shell :: SymbolFile/DWARF/x86/DW_TAG_variable-invalid_location.s (394 of 1406) PASS: lldb-api :: lang/c/record_decl_in_expr/TestRecordDeclInExpr.py (395 of 1406) FAIL: lldb-api :: python_api/process/TestProcessAPI.py (396 of 1406) ******************** TEST 'lldb-api :: python_api/process/TestProcessAPI.py' FAILED ******************** Script: -- /usr/local/Frameworks/Python.framework/Versions/3.7/bin/python3.7 /Users/buildslave/jenkins/workspace/lldb-cmake-matrix/llvm-project/lldb/test/API/dotest.py -u CXXFLAGS -u CFLAGS --codesign-identity lldb_codesign --arch x86_64 --build-dir /Users/buildslave/jenkins/workspace/lldb-cmake-matrix/lldb-build/lldb-test-build.noindex -t --env TERM=vt100 --skip-category gmodules --skip-category watchpoint --arch=x86_64 --env LLVM_LIBS_DIR=/Users/buildslave/jenkins/workspace/lldb-cmake-matrix/lldb-build/./lib --arch x86_64 --build-dir /Users/buildslave/jenkins/workspace/lldb-cmake-matrix/lldb-build/lldb-test-build.noindex --lldb-module-cache-dir /Users/buildslave/jenkins/workspace/lldb-cmake-matrix/lldb-build/lldb-test-build.noindex/module-cache-lldb/lldb-api --clang-module-cache-dir /Users/buildslave/jenkins/workspace/lldb-cmake-matrix/lldb-build/lldb-test-build.noindex/module-cache-clang/lldb-api --executable /Users/buildslave/jenkins/workspace/lldb-cmake-matrix/lldb-build/./bin/lldb --compiler /Users/buildslave/jenkins/workspace/lldb-cmake-matrix/clang_900_build/bin/clang --dsymutil /Users/buildslave/jenkins/workspace/lldb-cmake-matrix/lldb-build/./bin/dsymutil --llvm-tools-dir /Users/buildslave/jenkins/workspace/lldb-cmake-matrix/lldb-build/./bin --lldb-libs-dir /Users/buildslave/jenkins/workspace/lldb-cmake-matrix/lldb-build/./lib --skip-category=lldb-vscode --skip-category=std-module /Users/buildslave/jenkins/workspace/lldb-cmake-matrix/llvm-project/lldb/test/API/python_api/process -p TestProcessAPI.py --capture-path /Users/buildslave/jenkins/workspace/lldb-cmake-matrix/lldb-build/lldb-test-build.noindex/reproducers/TestProcessAPI.py -- Exit Code: -6

Hide Details

Command Output (stdout): -- lldb version 14.0.99 (http://labmaster3.local/git/llvm-project.git revision 9689c1b7bb77d65e8acc9a13e5e416803d38b02f) clang revision 9689c1b7bb77d65e8acc9a13e5e416803d38b02f llvm revision 9689c1b7bb77d65e8acc9a13e5e416803d38b02f

Hide Details

-- Command Output (stderr): -- Assertion failed: (m_result_recorded && "Did you forget LLDB_RECORD_RESULT?"), function ~Recorder, file /Users/buildslave/jenkins/workspace/lldb-cmake-matrix/llvm-project/lldb/source/Utility/ReproducerInstrumentation.cpp, line 221. Fatal Python error: Aborted

Hide Details

Current thread 0x000000011beecdc0 (most recent call first): File "/Users/buildslave/jenkins/workspace/lldb-cmake-matrix/lldb-build/lib/python3.7/site-packages/lldb/__init__.py", line 8799 in DeallocateMemory File "/Users/buildslave/jenkins/workspace/lldb-cmake-matrix/llvm-project/lldb/test/API/python_api/process/TestProcessAPI.py", line 453 in test_allocate_deallocate_memory File "/Users/buildslave/jenkins/workspace/lldb-cmake-matrix/llvm-project/lldb/packages/Python/lldbsuite/test/lldbtest.py", line 1835 in test_method File "/Users/buildslave/jenkins/workspace/lldb-cmake-matrix/llvm-project/lldb/third_party/Python/module/unittest2/unittest2/case.py", line 413 in runMethod File "/Users/buildslave/jenkins/workspace/lldb-cmake-matrix/llvm-project/lldb/third_party/Python/module/unittest2/unittest2/case.py", line 383 in run File "/Users/buildslave/jenkins/workspace/lldb-cmake-matrix/llvm-project/lldb/third_party/Python/module/unittest2/unittest2/case.py", line 458 in __call__ File "/Users/buildslave/jenkins/workspace/lldb-cmake-matrix/llvm-project/lldb/third_party/Python/module/unittest2/unittest2/suite.py", line 117 in _wrapped_run File "/Users/buildslave/jenkins/workspace/lldb-cmake-matrix/llvm-project/lldb/third_party/Python/module/unittest2/unittest2/suite.py", line 115 in _wrapped_run File "/Users/buildslave/jenkins/workspace/lldb-cmake-matrix/llvm-project/lldb/third_party/Python/module/unittest2/unittest2/suite.py", line 85 in run File "/Users/buildslave/jenkins/workspace/lldb-cmake-matrix/llvm-project/lldb/third_party/Python/module/unittest2/unittest2/suite.py", line 66 in __call__ File "/Users/buildslave/jenkins/workspace/lldb-cmake-matrix/llvm-project/lldb/third_party/Python/module/unittest2/unittest2/runner.py", line 165 in run File "/Users/buildslave/jenkins/workspace/lldb-cmake-matrix/llvm-project/lldb/packages/Python/lldbsuite/test/dotest.py", line 1017 in run_suite File "/Users/buildslave/jenkins/workspace/lldb-cmake-matrix/llvm-project/lldb/test/API/dotest.py", line 7 in <module>

Hide Details

--

Hide Details

******************** PASS: lldb-api :: functionalities/breakpoint/objc/TestObjCBreakpoints.py (397 of 1406) PASS: lldb-api :: commands/process/attach/TestProcessAttach.py (398 of 1406) PASS: lldb-shell :: ObjectFile/PECOFF/sections.yaml (399 of 1406) PASS: lldb-api :: functionalities/data-formatter/data-formatter-stl/libcxx/atomic/TestLibCxxAtomic.py (400 of 1406) PASS: lldb-api :: lang/cpp/dynamic-value/TestCppValueCast.py (401 of 1406) PASS: lldb-api :: functionalities/breakpoint/auto_continue/TestBreakpointAutoContinue.py (402 of 1406) UNSUPPORTED: lldb-shell :: Reproducer/TestPythonImport.test (403 of 1406) PASS: lldb-api :: commands/frame/diagnose/dereference-argument/TestDiagnoseDereferenceArgument.py (404 of 1406) PASS: lldb-shell :: ObjectFile/ELF/PT_LOAD-overlap-PT_TLS.yaml (405 of 1406) UNSUPPORTED: lldb-shell :: Unwind/split-machine-functions.test (406 of 1406) UNSUPPORTED: lldb-shell :: ObjectFile/ELF/basic-info.yaml (407 of 1406) PASS: lldb-api :: functionalities/data-formatter/data-formatter-objc/TestDataFormatterObjCNSError.py (408 of 1406) PASS: lldb-api :: lang/c/unicode/TestUnicodeSymbols.py (409 of 1406) PASS: lldb-api :: functionalities/breakpoint/scripted_bkpt/TestScriptedResolver.py (410 of 1406) UNSUPPORTED: lldb-api :: commands/watchpoints/multiple_threads/TestWatchpointMultipleThreads.py (411 of 1406) PASS: lldb-api :: functionalities/gdb_remote_client/TestRemoteRegNums.py (412 of 1406) UNSUPPORTED: lldb-api :: functionalities/unwind/aarch64_unwind_pac/TestAArch64UnwindPAC.py (413 of 1406) PASS: lldb-api :: lang/c/local_types/TestUseClosestType.py (414 of 1406) UNSUPPORTED: lldb-shell :: Register/x86-ymm-write.test (415 of 1406) PASS: lldb-api :: commands/command/script_alias/TestCommandScriptAlias.py (416 of 1406) UNSUPPORTED: lldb-api :: commands/expression/import-std-module/forward_decl_from_module/TestForwardDeclFromStdModule.py (417 of 1406) UNSUPPORTED: lldb-shell :: SymbolFile/NativePDB/typedefs.cpp (418 of 1406) PASS: lldb-shell :: Quit/TestQuitExitCodeTooManyArgs.test (419 of 1406) PASS: lldb-api :: lang/objc/objc-static-method-stripped/TestObjCStaticMethodStripped.py (420 of 1406) PASS: lldb-api :: lang/cpp/template-arguments/TestCppTemplateArguments.py (421 of 1406) PASS: lldb-api :: lang/c/step-target/TestStepTarget.py (422 of 1406) PASS: lldb-api :: functionalities/breakpoint/consecutive_breakpoints/TestConsecutiveBreakpoints.py (423 of 1406) PASS: lldb-api :: functionalities/exec/TestExec.py (424 of 1406) PASS: lldb-shell :: lldb-server/TestGdbserverPort.test (425 of 1406) UNSUPPORTED: lldb-api :: commands/expression/import-std-module/list/TestListFromStdModule.py (426 of 1406) PASS: lldb-api :: functionalities/data-formatter/summary-string-onfail/Test-rdar-9974002.py (427 of 1406) PASS: lldb-shell :: SymbolFile/Breakpad/stack-cfi-parsing.test (428 of 1406) PASS: lldb-shell :: ObjectFile/PECOFF/sections-names.yaml (429 of 1406) PASS: lldb-api :: lang/objc/forward-decl/TestForwardDecl.py (430 of 1406) PASS: lldb-api :: functionalities/data-formatter/data-formatter-synthtype/TestDataFormatterSynthType.py (431 of 1406) UNSUPPORTED: lldb-api :: lang/objc/rdar-12408181/TestRdar12408181.py (432 of 1406) PASS: lldb-api :: lang/cpp/function_refs/TestFunctionRefs.py (433 of 1406) UNSUPPORTED: lldb-shell :: SymbolFile/NativePDB/bitfields.cpp (434 of 1406) UNSUPPORTED: lldb-api :: functionalities/tsan/thread_numbers/TestTsanThreadNumbers.py (435 of 1406) PASS: lldb-api :: functionalities/abbreviation/TestAbbreviations.py (436 of 1406) UNSUPPORTED: lldb-api :: lang/objc/objc-dynamic-value/TestObjCDynamicValue.py (437 of 1406) XFAIL: lldb-shell :: Register/x86-64-ymm-write.test (438 of 1406) PASS: lldb-api :: lang/cpp/virtual-overload/TestVirtualOverload.py (439 of 1406) UNSUPPORTED: lldb-api :: functionalities/gdb_remote_client/TestAArch64XMLRegOffsets.py (440 of 1406) PASS: lldb-api :: commands/statistics/basic/TestStats.py (441 of 1406) UNSUPPORTED: lldb-shell :: SymbolFile/DWARF/x86/debug-types-signature-loop.s (442 of 1406) PASS: lldb-api :: commands/expression/persist_objc_pointeetype/TestPersistObjCPointeeType.py (443 of 1406) UNSUPPORTED: lldb-shell :: Driver/TestRepl.test (444 of 1406) PASS: lldb-api :: functionalities/postmortem/minidump/TestMiniDump.py (445 of 1406) UNSUPPORTED: lldb-api :: functionalities/tail_call_frames/cross_object/TestCrossObjectTailCalls.py (446 of 1406) PASS: lldb-shell :: SymbolFile/DWARF/x86/dwarf5-debug_line.s (447 of 1406) UNSUPPORTED: lldb-api :: commands/expression/import-std-module/forward_list/TestForwardListFromStdModule.py (448 of 1406) PASS: lldb-api :: lang/c/enum_types/TestEnumTypes.py (449 of 1406) PASS: lldb-shell :: Quit/TestQuitExitCode0.test (450 of 1406) PASS: lldb-api :: commands/expression/result_numbering/TestResultNumbering.py (451 of 1406) PASS: lldb-api :: commands/expression/ignore-artificial-constructors/TestIgnoreArtificialConstructors.py (452 of 1406) UNSUPPORTED: lldb-api :: commands/trace/TestTraceTimestampCounters.py (453 of 1406) PASS: lldb-api :: functionalities/data-formatter/data-formatter-globals/TestDataFormatterGlobals.py (454 of 1406) PASS: lldb-shell :: SymbolFile/DWARF/deterministic-build.cpp (455 of 1406) UNSUPPORTED: lldb-shell :: SymbolFile/DWARF/x86/find-method.cpp (456 of 1406) PASS: lldb-shell :: ScriptInterpreter/Python/silent_command_script_import.test (457 of 1406) UNSUPPORTED: lldb-shell :: SymbolFile/PDB/variables-locations.test (458 of 1406) PASS: lldb-shell :: Minidump/disassemble-no-module.yaml (459 of 1406) UNSUPPORTED: lldb-shell :: SymbolFile/NativePDB/ast-methods.cpp (460 of 1406) PASS: lldb-api :: functionalities/breakpoint/breakpoint_hit_count/TestBreakpointHitCount.py (461 of 1406) PASS: lldb-api :: functionalities/var_path/TestVarPath.py (462 of 1406) PASS: lldb-api :: commands/process/signal/TestProcessSignal.py (463 of 1406) UNSUPPORTED: lldb-shell :: ScriptInterpreter/Python/sb_address_exception.test (464 of 1406) PASS: lldb-api :: lang/objc/objc-struct-argument/TestObjCStructArgument.py (465 of 1406) UNSUPPORTED: lldb-shell :: ScriptInterpreter/Lua/command_script_import.test (466 of 1406) PASS: lldb-api :: lang/c/complex_int/TestComplexInt.py (467 of 1406) PASS: lldb-shell :: ObjectFile/MachO/lc_version_min.yaml (468 of 1406) PASS: lldb-shell :: Quit/TestQuitExitCodeHex0.test (469 of 1406) UNSUPPORTED: lldb-api :: macosx/function-starts/TestFunctionStarts.py (470 of 1406) PASS: lldb-api :: functionalities/breakpoint/cpp_exception/TestCPPExceptionBreakpoint.py (471 of 1406) PASS: lldb-api :: tools/lldb-server/TestGdbRemote_qThreadStopInfo.py (472 of 1406) PASS: lldb-api :: functionalities/paths/TestPaths.py (473 of 1406) PASS: lldb-api :: lang/cpp/global_operators/TestCppGlobalOperators.py (474 of 1406) PASS: lldb-api :: commands/platform/basic/TestPlatformPython.py (475 of 1406) PASS: lldb-api :: functionalities/thread/concurrent_events/TestConcurrentManyCrash.py (476 of 1406) PASS: lldb-shell :: SymbolFile/DWARF/x86/debug-types-missing-signature.test (477 of 1406) PASS: lldb-shell :: SymbolFile/DWARF/x86/DW_TAG_variable-DW_AT_const_value.s (478 of 1406) PASS: lldb-api :: functionalities/gdb_remote_client/TestRegDefinitionInParts.py (479 of 1406) PASS: lldb-api :: functionalities/breakpoint/source_regexp/TestSourceRegexBreakpoints.py (480 of 1406) PASS: lldb-api :: lang/objcxx/objcxx-ivar-vector/TestIvarVector.py (481 of 1406) PASS: lldb-shell :: Breakpoint/split-dwarf-5-addrbase.test (482 of 1406) UNSUPPORTED: lldb-shell :: SymbolFile/DWARF/x86/find-variable-file.cpp (483 of 1406) PASS: lldb-api :: macosx/nslog/TestDarwinNSLogOutput.py (484 of 1406) PASS: lldb-shell :: Expr/TestIRMemoryMap.test (485 of 1406) UNSUPPORTED: lldb-api :: tools/lldb-server/TestGdbRemoteCompletion.py (486 of 1406) UNSUPPORTED: lldb-shell :: ScriptInterpreter/Python/scripted_breakpoint_lua.test (487 of 1406) UNSUPPORTED: lldb-shell :: ObjectFile/ELF/minidebuginfo-set-and-hit-breakpoint.test (488 of 1406) UNSUPPORTED: lldb-api :: functionalities/tsan/multiple/TestTsanMultiple.py (489 of 1406) PASS: lldb-api :: python_api/sbvalue_const_addrof/TestSBValueConstAddrOf.py (490 of 1406) PASS: lldb-api :: functionalities/data-formatter/data-formatter-stl/libstdcpp/unique_ptr/invalid/TestDataFormatterInvalidStdUniquePtr.py (491 of 1406) UNSUPPORTED: lldb-shell :: SymbolFile/NativePDB/disassembly.cpp (492 of 1406) PASS: lldb-shell :: ObjectFile/Breakpad/breakpad-identification.test (493 of 1406) PASS: lldb-api :: lang/mixed/TestMixedLanguages.py (494 of 1406) XFAIL: lldb-shell :: Register/x86-mm-xmm-write.test (495 of 1406) PASS: lldb-shell :: Register/Core/x86-64-freebsd-multithread.test (496 of 1406) FAIL: lldb-api :: lang/cpp/modules-import/TestCXXModulesImport.py (497 of 1406) ******************** TEST 'lldb-api :: lang/cpp/modules-import/TestCXXModulesImport.py' FAILED ******************** Script: -- /usr/local/Frameworks/Python.framework/Versions/3.7/bin/python3.7 /Users/buildslave/jenkins/workspace/lldb-cmake-matrix/llvm-project/lldb/test/API/dotest.py -u CXXFLAGS -u CFLAGS --codesign-identity lldb_codesign --arch x86_64 --build-dir /Users/buildslave/jenkins/workspace/lldb-cmake-matrix/lldb-build/lldb-test-build.noindex -t --env TERM=vt100 --skip-category gmodules --skip-category watchpoint --arch=x86_64 --env LLVM_LIBS_DIR=/Users/buildslave/jenkins/workspace/lldb-cmake-matrix/lldb-build/./lib --arch x86_64 --build-dir /Users/buildslave/jenkins/workspace/lldb-cmake-matrix/lldb-build/lldb-test-build.noindex --lldb-module-cache-dir /Users/buildslave/jenkins/workspace/lldb-cmake-matrix/lldb-build/lldb-test-build.noindex/module-cache-lldb/lldb-api --clang-module-cache-dir /Users/buildslave/jenkins/workspace/lldb-cmake-matrix/lldb-build/lldb-test-build.noindex/module-cache-clang/lldb-api --executable /Users/buildslave/jenkins/workspace/lldb-cmake-matrix/lldb-build/./bin/lldb --compiler /Users/buildslave/jenkins/workspace/lldb-cmake-matrix/clang_900_build/bin/clang --dsymutil /Users/buildslave/jenkins/workspace/lldb-cmake-matrix/lldb-build/./bin/dsymutil --llvm-tools-dir /Users/buildslave/jenkins/workspace/lldb-cmake-matrix/lldb-build/./bin --lldb-libs-dir /Users/buildslave/jenkins/workspace/lldb-cmake-matrix/lldb-build/./lib --skip-category=lldb-vscode --skip-category=std-module /Users/buildslave/jenkins/workspace/lldb-cmake-matrix/llvm-project/lldb/test/API/lang/cpp/modules-import -p TestCXXModulesImport.py --capture-path /Users/buildslave/jenkins/workspace/lldb-cmake-matrix/lldb-build/lldb-test-build.noindex/reproducers/TestCXXModulesImport.py -- Exit Code: 1

Hide Details

Command Output (stdout): -- lldb version 14.0.99 (http://labmaster3.local/git/llvm-project.git revision 9689c1b7bb77d65e8acc9a13e5e416803d38b02f) clang revision 9689c1b7bb77d65e8acc9a13e5e416803d38b02f llvm revision 9689c1b7bb77d65e8acc9a13e5e416803d38b02f Skipping the following test categories: ['gmodules', 'watchpoint', 'lldb-vscode', 'std-module', 'libstdcxx', 'dwo', 'llgs', 'fork']

Hide Details

-- Command Output (stderr): -- Change dir to: /Users/buildslave/jenkins/workspace/lldb-cmake-matrix/llvm-project/lldb/test/API/lang/cpp/modules-import runCmd: settings clear -all output:

Hide Details

runCmd: settings set symbols.enable-external-lookup false output:

Hide Details

runCmd: settings set target.inherit-tcc true output:

Hide Details

runCmd: settings set target.detach-on-error false output:

Hide Details

runCmd: settings set target.auto-apply-fixits false output:

Hide Details

runCmd: settings set plugin.process.gdb-remote.packet-timeout 60 output:

Hide Details

runCmd: settings set symbols.clang-modules-cache-path "/Users/buildslave/jenkins/workspace/lldb-cmake-matrix/lldb-build/lldb-test-build.noindex/module-cache-lldb/lldb-api" output:

Hide Details

runCmd: settings set use-color false output:

Hide Details

runCmd: setting set target.prefer-dynamic-value no-dynamic-values output:

Hide Details

runCmd: expr -l Objective-C++ -- @import Bar runCmd failed! error: expression failed to parse: error: Header search couldn't locate module Foo

Hide Details

error: while importing modules: error: Header search couldn't locate module Bar

Hide Details

Hide Details

Hide Details

FAIL: LLDB (/Users/buildslave/jenkins/workspace/lldb-cmake-matrix/clang_900_build/bin/clang-x86_64) :: test_expr_dsym (TestCXXModulesImport.CXXModulesImportTestCase) <bound method SBProcess.Kill of <lldb.SBProcess; proxy of <Swig Object of type 'lldb::SBProcess *' at 0x1149f9db0> >>: success

Hide Details

runCmd: settings clear -all output:

Hide Details

runCmd: settings set symbols.enable-external-lookup false output:

Hide Details

runCmd: settings set target.inherit-tcc true output:

Hide Details

runCmd: settings set target.detach-on-error false output:

Hide Details

runCmd: settings set target.auto-apply-fixits false output:

Hide Details

runCmd: settings set plugin.process.gdb-remote.packet-timeout 60 output:

Hide Details

runCmd: settings set symbols.clang-modules-cache-path "/Users/buildslave/jenkins/workspace/lldb-cmake-matrix/lldb-build/lldb-test-build.noindex/module-cache-lldb/lldb-api" output:

Hide Details

runCmd: settings set use-color false output:

Hide Details

runCmd: setting set target.prefer-dynamic-value no-dynamic-values output:

Hide Details

runCmd: expr -l Objective-C++ -- @import Bar runCmd failed! error: expression failed to parse: error: Header search couldn't locate module Foo

Hide Details

error: while importing modules: error: Header search couldn't locate module Bar

Hide Details

Hide Details

Hide Details

FAIL: LLDB (/Users/buildslave/jenkins/workspace/lldb-cmake-matrix/clang_900_build/bin/clang-x86_64) :: test_expr_dwarf (TestCXXModulesImport.CXXModulesImportTestCase) <bound method SBProcess.Kill of <lldb.SBProcess; proxy of <Swig Object of type 'lldb::SBProcess *' at 0x10eccbae0> >>: success

Hide Details

UNSUPPORTED: LLDB (/Users/buildslave/jenkins/workspace/lldb-cmake-matrix/clang_900_build/bin/clang-x86_64) :: test_expr_dwo (TestCXXModulesImport.CXXModulesImportTestCase) (test case does not fall in any category of interest for this run) runCmd: settings clear -all output:

Hide Details

runCmd: settings set symbols.enable-external-lookup false output:

Hide Details

runCmd: settings set target.inherit-tcc true output:

Hide Details

runCmd: settings set target.detach-on-error false output:

Hide Details

runCmd: settings set target.auto-apply-fixits false output:

Hide Details

runCmd: settings set plugin.process.gdb-remote.packet-timeout 60 output:

Hide Details

runCmd: settings set symbols.clang-modules-cache-path "/Users/buildslave/jenkins/workspace/lldb-cmake-matrix/lldb-build/lldb-test-build.noindex/module-cache-lldb/lldb-api" output:

Hide Details

runCmd: settings set use-color false output:

Hide Details

runCmd: setting set target.prefer-dynamic-value no-dynamic-values output:

Hide Details

runCmd: expr -l Objective-C++ -- @import Bar check of return status not required runCmd failed! error: expression failed to parse: error: Header search couldn't locate module Foo

Hide Details

error: while importing modules: error: Header search couldn't locate module Bar

Hide Details

Hide Details

Hide Details

Ran command: "expr -l Objective-C++ -- @import Bar"

Hide Details

Got output: error: expression failed to parse: error: Header search couldn't locate module Foo

Hide Details

error: while importing modules: error: Header search couldn't locate module Bar

Hide Details

Hide Details

Hide Details

<bound method SBProcess.Kill of <lldb.SBProcess; proxy of <Swig Object of type 'lldb::SBProcess *' at 0x1149f9ea0> >>: success

Hide Details

PASS: LLDB (/Users/buildslave/jenkins/workspace/lldb-cmake-matrix/clang_900_build/bin/clang-x86_64) :: test_expr_failing_import_dsym (TestCXXModulesImport.CXXModulesImportTestCase) runCmd: settings clear -all output:

Hide Details

runCmd: settings set symbols.enable-external-lookup false output:

Hide Details

runCmd: settings set target.inherit-tcc true output:

Hide Details

runCmd: settings set target.detach-on-error false output:

Hide Details

runCmd: settings set target.auto-apply-fixits false output:

Hide Details

runCmd: settings set plugin.process.gdb-remote.packet-timeout 60 output:

Hide Details

runCmd: settings set symbols.clang-modules-cache-path "/Users/buildslave/jenkins/workspace/lldb-cmake-matrix/lldb-build/lldb-test-build.noindex/module-cache-lldb/lldb-api" output:

Hide Details

runCmd: settings set use-color false output:

Hide Details

runCmd: setting set target.prefer-dynamic-value no-dynamic-values output:

Hide Details

runCmd: expr -l Objective-C++ -- @import Bar check of return status not required runCmd failed! error: expression failed to parse: error: Header search couldn't locate module Foo

Hide Details

error: while importing modules: error: Header search couldn't locate module Bar

Hide Details

Hide Details

Hide Details

Ran command: "expr -l Objective-C++ -- @import Bar"

Hide Details

Got output: error: expression failed to parse: error: Header search couldn't locate module Foo

Hide Details

error: while importing modules: error: Header search couldn't locate module Bar

Hide Details

Hide Details

Hide Details

<bound method SBProcess.Kill of <lldb.SBProcess; proxy of <Swig Object of type 'lldb::SBProcess *' at 0x10eccb9f0> >>: success

Hide Details

PASS: LLDB (/Users/buildslave/jenkins/workspace/lldb-cmake-matrix/clang_900_build/bin/clang-x86_64) :: test_expr_failing_import_dwarf (TestCXXModulesImport.CXXModulesImportTestCase) UNSUPPORTED: LLDB (/Users/buildslave/jenkins/workspace/lldb-cmake-matrix/clang_900_build/bin/clang-x86_64) :: test_expr_failing_import_dwo (TestCXXModulesImport.CXXModulesImportTestCase) (test case does not fall in any category of interest for this run) UNSUPPORTED: LLDB (/Users/buildslave/jenkins/workspace/lldb-cmake-matrix/clang_900_build/bin/clang-x86_64) :: test_expr_failing_import_gmodules (TestCXXModulesImport.CXXModulesImportTestCase) (test case does not fall in any category of interest for this run) UNSUPPORTED: LLDB (/Users/buildslave/jenkins/workspace/lldb-cmake-matrix/clang_900_build/bin/clang-x86_64) :: test_expr_gmodules (TestCXXModulesImport.CXXModulesImportTestCase) (test case does not fall in any category of interest for this run) Restore dir to: /Users/buildslave/jenkins/workspace/lldb-cmake-matrix/lldb-build/tools/lldb/test ====================================================================== FAIL: test_expr_dsym (TestCXXModulesImport.CXXModulesImportTestCase) ---------------------------------------------------------------------- Traceback (most recent call last): File "/Users/buildslave/jenkins/workspace/lldb-cmake-matrix/llvm-project/lldb/packages/Python/lldbsuite/test/lldbtest.py", line 1835, in test_method return attrvalue(self) File "/Users/buildslave/jenkins/workspace/lldb-cmake-matrix/llvm-project/lldb/packages/Python/lldbsuite/test/decorators.py", line 149, in wrapper return func(*args, **kwargs) File "/Users/buildslave/jenkins/workspace/lldb-cmake-matrix/llvm-project/lldb/test/API/lang/cpp/modules-import/TestCXXModulesImport.py", line 32, in test_expr self.expect("expr -l Objective-C++ -- @import Bar") File "/Users/buildslave/jenkins/workspace/lldb-cmake-matrix/llvm-project/lldb/packages/Python/lldbsuite/test/lldbtest.py", line 2468, in expect inHistory=inHistory) File "/Users/buildslave/jenkins/workspace/lldb-cmake-matrix/llvm-project/lldb/packages/Python/lldbsuite/test/lldbtest.py", line 2166, in runCmd msg if (msg) else CMD_MSG(cmd)) AssertionError: False is not True : Command 'expr -l Objective-C++ -- @import Bar Error output: error: expression failed to parse: error: Header search couldn't locate module Foo

Hide Details

error: while importing modules: error: Header search couldn't locate module Bar

Hide Details

' did not return successfully Config=x86_64-/Users/buildslave/jenkins/workspace/lldb-cmake-matrix/clang_900_build/bin/clang ====================================================================== FAIL: test_expr_dwarf (TestCXXModulesImport.CXXModulesImportTestCase) ---------------------------------------------------------------------- Traceback (most recent call last): File "/Users/buildslave/jenkins/workspace/lldb-cmake-matrix/llvm-project/lldb/packages/Python/lldbsuite/test/lldbtest.py", line 1835, in test_method return attrvalue(self) File "/Users/buildslave/jenkins/workspace/lldb-cmake-matrix/llvm-project/lldb/packages/Python/lldbsuite/test/decorators.py", line 149, in wrapper return func(*args, **kwargs) File "/Users/buildslave/jenkins/workspace/lldb-cmake-matrix/llvm-project/lldb/test/API/lang/cpp/modules-import/TestCXXModulesImport.py", line 32, in test_expr self.expect("expr -l Objective-C++ -- @import Bar") File "/Users/buildslave/jenkins/workspace/lldb-cmake-matrix/llvm-project/lldb/packages/Python/lldbsuite/test/lldbtest.py", line 2468, in expect inHistory=inHistory) File "/Users/buildslave/jenkins/workspace/lldb-cmake-matrix/llvm-project/lldb/packages/Python/lldbsuite/test/lldbtest.py", line 2166, in runCmd msg if (msg) else CMD_MSG(cmd)) AssertionError: False is not True : Command 'expr -l Objective-C++ -- @import Bar Error output: error: expression failed to parse: error: Header search couldn't locate module Foo

Hide Details

error: while importing modules: error: Header search couldn't locate module Bar

Hide Details

' did not return successfully Config=x86_64-/Users/buildslave/jenkins/workspace/lldb-cmake-matrix/clang_900_build/bin/clang ---------------------------------------------------------------------- Ran 8 tests in 5.558s

Hide Details

RESULT: FAILED (2 passes, 2 failures, 0 errors, 4 skipped, 0 expected failures, 0 unexpected successes)

Hide Details

--

Hide Details

******************** PASS: lldb-api :: functionalities/data-formatter/data-formatter-named-summaries/TestDataFormatterNamedSummaries.py (498 of 1406) UNSUPPORTED: lldb-api :: lang/objc/modules-hash-mismatch/TestClangModulesHashMismatch.py (499 of 1406) PASS: lldb-api :: commands/target/create-no-such-arch/TestNoSuchArch.py (500 of 1406) PASS: lldb-shell :: Register/Core/x86-64-freebsd-addr.test (501 of 1406) PASS: lldb-shell :: ObjectFile/PECOFF/basic-info-arm.yaml (502 of 1406) PASS: lldb-api :: commands/source/info/TestSourceInfo.py (503 of 1406) PASS: lldb-shell :: SymbolFile/DWARF/x86/parallel-indexing-stress.s (504 of 1406) UNSUPPORTED: lldb-api :: functionalities/tail_call_frames/thread_step_out_message/TestArtificialFrameStepOutMessage.py (505 of 1406) PASS: lldb-api :: functionalities/gdb_remote_client/TestGDBRemoteLoad.py (506 of 1406) UNSUPPORTED: lldb-shell :: Subprocess/vfork-follow-child-softbp.test (507 of 1406) PASS: lldb-shell :: ObjectFile/ELF/netbsd-exec-8.99.30-amd64.yaml (508 of 1406) PASS: lldb-api :: functionalities/data-formatter/data-formatter-objc/TestDataFormatterObjNSException.py (509 of 1406) UNSUPPORTED: lldb-api :: commands/command/script/TestCommandScript.py (510 of 1406) UNSUPPORTED: lldb-api :: commands/expression/import-std-module/shared_ptr-dbg-info-content/TestSharedPtrDbgInfoContentFromStdModule.py (511 of 1406) PASS: lldb-api :: commands/gui/viewlarge/TestGuiViewLarge.py (512 of 1406) PASS: lldb-api :: macosx/add-dsym/TestAddDsymMidExecutionCommand.py (513 of 1406) PASS: lldb-api :: lang/objc/objc-checker/TestObjCCheckers.py (514 of 1406) PASS: lldb-api :: lang/cpp/namespace_conflicts/TestNamespaceConflicts.py (515 of 1406) PASS: lldb-api :: commands/expression/anonymous-struct/TestCallUserAnonTypedef.py (516 of 1406) PASS: lldb-api :: commands/expression/regression-access-function-template-in-record/TestRegressionAccessFunctionTemplateInRecord.py (517 of 1406) UNSUPPORTED: lldb-shell :: Subprocess/clone-follow-parent-softbp.test (518 of 1406) UNSUPPORTED: lldb-api :: tools/lldb-vscode/console/TestVSCode_redirection_to_console.py (519 of 1406) PASS: lldb-shell :: Register/Core/x86-32-linux-gp.test (520 of 1406) PASS: lldb-api :: lang/cpp/nested-class-other-compilation-unit/TestNestedClassWithParentInAnotherCU.py (521 of 1406) PASS: lldb-api :: api/multiple-targets/TestMultipleTargets.py (522 of 1406) UNSUPPORTED: lldb-api :: commands/expression/issue_11588/Test11588.py (523 of 1406) PASS: lldb-api :: functionalities/breakpoint/address_breakpoints/TestAddressBreakpoints.py (524 of 1406) PASS: lldb-api :: types/TestCharTypeExpr.py (525 of 1406) PASS: lldb-api :: lang/cpp/chained-calls/TestCppChainedCalls.py (526 of 1406) PASS: lldb-api :: commands/breakpoint/set/func-regex/TestBreakpointRegexError.py (527 of 1406) UNSUPPORTED: lldb-shell :: SymbolFile/DWARF/x86/subprogram_ranges.test (528 of 1406) PASS: lldb-api :: functionalities/breakpoint/breakpoint_by_file_colon_line/TestBreakpointByFileColonLine.py (529 of 1406) PASS: lldb-api :: functionalities/data-formatter/data-formatter-proper-plurals/TestFormattersOneIsSingular.py (530 of 1406) PASS: lldb-api :: functionalities/unwind/sigtramp/TestSigtrampUnwind.py (531 of 1406) PASS: lldb-api :: commands/expression/unicode-in-variable/TestUnicodeInVariable.py (532 of 1406) UNSUPPORTED: lldb-shell :: Subprocess/fork-follow-parent-softbp.test (533 of 1406) PASS: lldb-api :: iohandler/autosuggestion/TestAutosuggestion.py (534 of 1406) PASS: lldb-api :: functionalities/thread/ignore_suspended/TestIgnoreSuspendedThread.py (535 of 1406) PASS: lldb-api :: functionalities/data-formatter/data-formatter-stl/libcxx/function/TestLibCxxFunction.py (536 of 1406) UNSUPPORTED: lldb-shell :: SymbolFile/DWARF/x86/dwarf5_locations.s (537 of 1406) PASS: lldb-api :: commands/target/stop-hooks/TestStopHooks.py (538 of 1406) UNSUPPORTED: lldb-api :: commands/expression/import-std-module/queue/TestQueueFromStdModule.py (539 of 1406) PASS: lldb-api :: commands/command/script/import/rdar-12586188/TestRdar12586188.py (540 of 1406) PASS: lldb-api :: tools/lldb-server/TestGdbRemoteSingleStep.py (541 of 1406) UNSUPPORTED: lldb-shell :: ExecControl/StopHook/stop-hook-threads.test (542 of 1406) UNSUPPORTED: lldb-api :: commands/expression/namespace_local_var_same_name_obj_c/TestNamespaceLocalVarSameNameObjC.py (543 of 1406) PASS: lldb-api :: tools/lldb-server/register-reading/TestGdbRemoteGPacket.py (544 of 1406) PASS: lldb-api :: lang/c/blocks/TestBlocks.py (545 of 1406) PASS: lldb-api :: commands/target/create-deps/TestTargetCreateDeps.py (546 of 1406) PASS: lldb-api :: functionalities/dynamic_value_child_count/TestDynamicValueChildCount.py (547 of 1406) PASS: lldb-api :: functionalities/memory/cache/TestMemoryCache.py (548 of 1406) UNSUPPORTED: lldb-api :: commands/trace/TestTraceExport.py (549 of 1406) UNSUPPORTED: lldb-shell :: SymbolFile/DWARF/x86/debug-types-dwo-cross-reference.cpp (550 of 1406) PASS: lldb-api :: tools/lldb-server/commandline/TestStubSetSID.py (551 of 1406) PASS: lldb-shell :: SymbolFile/symbol-binding.test (552 of 1406) PASS: lldb-api :: functionalities/data-formatter/refpointer-recursion/TestDataFormatterRefPtrRecursion.py (553 of 1406) UNSUPPORTED: lldb-api :: python_api/watchpoint/watchlocation/TestSetWatchlocation.py (554 of 1406) UNSUPPORTED: lldb-api :: commands/watchpoints/hello_watchpoint/TestMyFirstWatchpoint.py (555 of 1406) PASS: lldb-api :: macosx/indirect_symbol/TestIndirectSymbols.py (556 of 1406) PASS: lldb-api :: functionalities/data-formatter/data-formatter-stl/libcxx/map/TestDataFormatterLibccMap.py (557 of 1406) UNSUPPORTED: lldb-shell :: Unwind/eh-frame-small-fde.test (558 of 1406) PASS: lldb-api :: python_api/symbol-context/two-files/TestSymbolContextTwoFiles.py (559 of 1406) UNSUPPORTED: lldb-api :: benchmarks/startup/TestStartupDelays.py (560 of 1406) UNSUPPORTED: lldb-api :: python_api/symbol-context/TestSymbolContext.py (561 of 1406) UNSUPPORTED: lldb-api :: functionalities/data-formatter/data-formatter-stl/libstdcpp/unique_ptr/TestDataFormatterStdUniquePtr.py (562 of 1406) PASS: lldb-api :: commands/frame/diagnose/virtual-method-call/TestDiagnoseDereferenceVirtualMethodCall.py (563 of 1406) PASS: lldb-api :: lang/cpp/this_class_type_mixing/TestThisClassTypeMixing.py (564 of 1406) PASS: lldb-api :: commands/expression/top-level/TestTopLevelExprs.py (565 of 1406) PASS: lldb-api :: functionalities/breakpoint/breakpoint_callback_command_source/TestBreakpointCallbackCommandSource.py (566 of 1406) PASS: lldb-api :: functionalities/value_md5_crash/TestValueMD5Crash.py (567 of 1406) PASS: lldb-api :: functionalities/thread/thread_exit/TestThreadExit.py (568 of 1406) PASS: lldb-api :: types/TestIntegerType.py (569 of 1406) PASS: lldb-api :: macosx/add-dsym/TestAddDsymDownload.py (570 of 1406) PASS: lldb-api :: tools/lldb-server/TestGdbRemoteAttachWait.py (571 of 1406) UNSUPPORTED: lldb-api :: tools/lldb-server/vCont-threads/TestGdbRemote_vContThreads.py (572 of 1406) UNSUPPORTED: lldb-api :: arm/breakpoint-it/TestBreakpointIt.py (573 of 1406) PASS: lldb-shell :: Breakpoint/debug_rnglist_offset_pair.test (574 of 1406) UNSUPPORTED: lldb-api :: python_api/event/TestEvents.py (575 of 1406) UNSUPPORTED: lldb-api :: functionalities/signal/handle-segv/TestHandleSegv.py (576 of 1406) PASS: lldb-api :: functionalities/show_location/TestShowLocationDwarf5.py (577 of 1406) PASS: lldb-api :: functionalities/thread/create_after_attach/TestCreateAfterAttach.py (578 of 1406) PASS: lldb-api :: tools/lldb-server/TestGdbRemoteExitCode.py (579 of 1406) PASS: lldb-api :: lang/cpp/breakpoint-commands/TestCPPBreakpointCommands.py (580 of 1406) PASS: lldb-api :: functionalities/data-formatter/data-formatter-synth/TestDataFormatterSynth.py (581 of 1406) PASS: lldb-shell :: Breakpoint/jit-loader_rtdyld_elf.test (582 of 1406) PASS: lldb-api :: python_api/sbenvironment/TestSBEnvironment.py (583 of 1406) PASS: lldb-api :: commands/expression/xvalue/TestXValuePrinting.py (584 of 1406) UNSUPPORTED: lldb-shell :: SymbolFile/NativePDB/function-types-calling-conv.cpp (585 of 1406) PASS: lldb-shell :: SymbolFile/DWARF/x86/DW_AT_data_bit_offset-DW_OP_stack_value.s (586 of 1406) PASS: lldb-api :: functionalities/breakpoint/dummy_target_breakpoints/TestBreakpointsWithNoTargets.py (587 of 1406) PASS: lldb-api :: commands/expression/test/TestExprs.py (588 of 1406) PASS: lldb-shell :: Register/x86-64-gp-read.test (589 of 1406) PASS: lldb-api :: types/TestCharType.py (590 of 1406) PASS: lldb-api :: commands/expression/call-function/TestCallBuiltinFunction.py (591 of 1406) PASS: lldb-api :: python_api/formatters/TestFormattersSBAPI.py (592 of 1406) UNSUPPORTED: lldb-shell :: Reproducer/TestDSYM.test (593 of 1406) PASS: lldb-api :: functionalities/data-formatter/nsdictionarysynth/TestNSDictionarySynthetic.py (594 of 1406) UNSUPPORTED: lldb-api :: commands/expression/import-std-module/deque-basic/TestDequeFromStdModule.py (595 of 1406) PASS: lldb-api :: commands/frame/diagnose/dereference-function-return/TestDiagnoseDereferenceFunctionReturn.py (596 of 1406) PASS: lldb-api :: python_api/section/TestSectionAPI.py (597 of 1406) PASS: lldb-api :: commands/command/source/TestCommandSource.py (598 of 1406) PASS: lldb-api :: lang/objc/variadic_methods/TestVariadicMethods.py (599 of 1406) PASS: lldb-api :: macosx/safe-to-func-call/TestSafeFuncCalls.py (600 of 1406) PASS: lldb-api :: functionalities/inferior-crashing/recursive-inferior/TestRecursiveInferiorStep.py (601 of 1406) PASS: lldb-shell :: ObjectFile/ELF/aarch64-relocations.yaml (602 of 1406) PASS: lldb-shell :: Settings/TestDisableColor.test (603 of 1406) PASS: lldb-api :: lang/objc/objc-class-method/TestObjCClassMethod.py (604 of 1406) PASS: lldb-api :: functionalities/data-formatter/data-formatter-stl/libcxx/unordered/TestDataFormatterUnordered.py (605 of 1406) UNSUPPORTED: lldb-api :: functionalities/thread/concurrent_events/TestConcurrentSignalNWatchNBreak.py (606 of 1406) UNSUPPORTED: lldb-api :: functionalities/thread/concurrent_events/TestConcurrentNWatchNBreak.py (607 of 1406) PASS: lldb-api :: lang/cpp/scope/TestCppScope.py (608 of 1406) UNSUPPORTED: lldb-api :: tools/lldb-vscode/completions/TestVSCode_completions.py (609 of 1406) UNSUPPORTED: lldb-api :: commands/expression/import-std-module/sysroot/TestStdModuleSysroot.py (610 of 1406) UNSUPPORTED: lldb-api :: android/platform/TestDefaultCacheLineSize.py (611 of 1406) PASS: lldb-api :: lang/c/inlines/TestRedefinitionsInInlines.py (612 of 1406) PASS: lldb-api :: lang/cpp/stl/TestStdCXXDisassembly.py (613 of 1406) PASS: lldb-api :: lang/c/find_struct_type/TestFindStructTypes.py (614 of 1406) UNSUPPORTED: lldb-api :: commands/watchpoints/watchpoint_count/TestWatchpointCount.py (615 of 1406) UNSUPPORTED: lldb-api :: commands/expression/import-std-module/vector-dbg-info-content/TestDbgInfoContentVectorFromStdModule.py (616 of 1406) PASS: lldb-api :: commands/frame/recognizer/TestFrameRecognizer.py (617 of 1406) PASS: lldb-api :: lang/cpp/default-template-args/TestDefaultTemplateArgs.py (618 of 1406) PASS: lldb-api :: macosx/find-app-in-bundle/TestFindAppInBundle.py (619 of 1406) PASS: lldb-shell :: Register/Core/x86-32-linux-fp.test (620 of 1406) PASS: lldb-api :: lang/c/step_over_no_deadlock/TestStepOverDoesntBlock.py (621 of 1406) PASS: lldb-api :: lang/cpp/namespace/TestNamespace.py (622 of 1406) PASS: lldb-api :: functionalities/abbreviation/TestCommonShortSpellings.py (623 of 1406) PASS: lldb-api :: functionalities/gdb_remote_client/TestTargetXMLArch.py (624 of 1406) PASS: lldb-api :: lang/cpp/char1632_t/TestChar1632T.py (625 of 1406) PASS: lldb-api :: functionalities/breakpoint/serialize/TestBreakpointSerialization.py (626 of 1406) UNSUPPORTED: lldb-api :: commands/trace/TestTraceDumpInfo.py (627 of 1406) UNSUPPORTED: lldb-api :: python_api/watchpoint/condition/TestWatchpointConditionAPI.py (628 of 1406) PASS: lldb-api :: commands/platform/sdk/TestPlatformSDK.py (629 of 1406) PASS: lldb-api :: functionalities/gdb_remote_client/TestMultiprocess.py (630 of 1406) PASS: lldb-shell :: Commands/command-backtrace-parser-2.test (631 of 1406) PASS: lldb-api :: lang/objc/foundation/TestFoundationDisassembly.py (632 of 1406) PASS: lldb-api :: lang/objc/objc-dyn-sbtype/TestObjCDynamicSBType.py (633 of 1406) UNSUPPORTED: lldb-shell :: ScriptInterpreter/Lua/io.test (634 of 1406) UNSUPPORTED: lldb-shell :: SymbolFile/PDB/compilands.test (635 of 1406) PASS: lldb-api :: python_api/lldbutil/process/TestPrintStackTraces.py (636 of 1406) PASS: lldb-shell :: Register/Core/x86-32-freebsd-addr.test (637 of 1406) PASS: lldb-api :: lang/cpp/multiple-inheritance/TestCppMultipleInheritance.py (638 of 1406) PASS: lldb-shell :: Settings/TestFrameFormatColor.test (639 of 1406) UNSUPPORTED: lldb-api :: functionalities/thread/concurrent_events/TestConcurrentCrashWithWatchpoint.py (640 of 1406) PASS: lldb-api :: commands/expression/codegen-crash-typedefdecl-not-in_declcontext/TestCodegenCrashTypedefDeclNotInDeclContext.py (641 of 1406) PASS: lldb-shell :: Settings/TestDisassemblyFormat.test (642 of 1406) UNSUPPORTED: lldb-shell :: Register/x86-db-read.test (643 of 1406) UNSUPPORTED: lldb-api :: lang/objc/modules/TestObjCModules.py (644 of 1406) PASS: lldb-api :: functionalities/data-formatter/data-formatter-ptr-to-array/TestPtrToArrayFormatting.py (645 of 1406) PASS: lldb-shell :: Breakpoint/case-sensitive.test (646 of 1406) PASS: lldb-api :: lang/c/register_variables/TestRegisterVariables.py (647 of 1406) PASS: lldb-shell :: SymbolFile/DWARF/x86/DW_AT_low_pc-addrx.s (648 of 1406) UNSUPPORTED: lldb-shell :: Breakpoint/ppc64-localentry.test (649 of 1406) PASS: lldb-api :: lang/objc/bitfield_ivars/TestBitfieldIvars.py (650 of 1406) UNSUPPORTED: lldb-shell :: Subprocess/clone-follow-child.test (651 of 1406) PASS: lldb-api :: functionalities/gdb_remote_client/TestPlatformClient.py (652 of 1406) PASS: lldb-shell :: ObjectFile/ELF/build-id-case.yaml (653 of 1406) PASS: lldb-api :: lang/cpp/nsimport/TestCppNsImport.py (654 of 1406) PASS: lldb-api :: types/TestFloatTypesExpr.py (655 of 1406) PASS: lldb-api :: types/TestLongTypes.py (656 of 1406) UNSUPPORTED: lldb-shell :: SymbolFile/NativePDB/local-variables.cpp (657 of 1406) PASS: lldb-api :: commands/expression/test/TestExprs2.py (658 of 1406) UNSUPPORTED: lldb-api :: lang/cpp/function-template-parameter-pack/TestFunctionTemplateParameterPack.py (659 of 1406) PASS: lldb-api :: commands/expression/completion-in-lambda-and-unnamed-class/TestCompletionInLambdaAndUnnamedClass.py (660 of 1406) PASS: lldb-api :: functionalities/mtc/simple/TestMTCSimple.py (661 of 1406) PASS: lldb-api :: lang/c/offsetof/TestOffsetof.py (662 of 1406) PASS: lldb-api :: functionalities/data-formatter/data-formatter-objc/TestDataFormatterObjCNSData.py (663 of 1406) UNSUPPORTED: lldb-shell :: Register/arm-fp-read.test (664 of 1406) PASS: lldb-shell :: SymbolFile/Breakpad/symtab.test (665 of 1406) PASS: lldb-api :: lang/cpp/accelerator-table/TestCPPAccelerator.py (666 of 1406) PASS: lldb-api :: functionalities/breakpoint/breakpoint_ids/TestBreakpointIDs.py (667 of 1406) PASS: lldb-api :: commands/expression/multiline-navigation/TestMultilineNavigation.py (668 of 1406) UNSUPPORTED: lldb-shell :: ScriptInterpreter/Lua/lua.test (669 of 1406) PASS: lldb-api :: python_api/lldbutil/TestSwigVersion.py (670 of 1406) PASS: lldb-api :: functionalities/return-value/TestReturnValue.py (671 of 1406) PASS: lldb-shell :: ObjectFile/Breakpad/sections.test (672 of 1406) PASS: lldb-shell :: Heap/heap-cstr.test (673 of 1406) PASS: lldb-shell :: Minidump/fb-dump.test (674 of 1406) PASS: lldb-api :: functionalities/data-formatter/frameformat_smallstruct/TestFrameFormatSmallStruct.py (675 of 1406) PASS: lldb-api :: commands/expression/options/TestExprOptions.py (676 of 1406) UNSUPPORTED: lldb-api :: tools/lldb-vscode/breakpoint/TestVSCode_setBreakpoints.py (677 of 1406) PASS: lldb-shell :: SymbolFile/Breakpad/unwind-via-stack-cfi.test (678 of 1406) PASS: lldb-api :: functionalities/source-map/TestTargetSourceMap.py (679 of 1406) PASS: lldb-api :: functionalities/gdb_remote_client/TestNestedRegDefinitions.py (680 of 1406) UNSUPPORTED: lldb-api :: functionalities/reproducers/fs-case-sensitivity/TestReproducerFSCaseSensitivity.py (681 of 1406) PASS: lldb-api :: python_api/sbstructureddata/TestStructuredDataAPI.py (682 of 1406) PASS: lldb-api :: functionalities/postmortem/elf-core/TestLinuxCore.py (683 of 1406) UNSUPPORTED: lldb-api :: functionalities/process_save_core/TestProcessSaveCore.py (684 of 1406) PASS: lldb-api :: functionalities/data-formatter/synthcapping/TestSyntheticCapping.py (685 of 1406) PASS: lldb-shell :: ObjectFile/ELF/minidebuginfo-corrupt-xz.yaml (686 of 1406) PASS: lldb-api :: commands/expression/dont_allow_jit/TestAllowJIT.py (687 of 1406) PASS: lldb-api :: macosx/load-kext/TestLoadKext.py (688 of 1406) PASS: lldb-api :: lang/objc/rdar-10967107/TestRdar10967107.py (689 of 1406) PASS: lldb-shell :: BuildScript/compiler-full-path.test (690 of 1406) PASS: lldb-shell :: Register/Core/x86-32-netbsd-multithread.test (691 of 1406) UNSUPPORTED: lldb-api :: commands/expression/import-std-module/vector-bool/TestVectorBoolFromStdModule.py (692 of 1406) PASS: lldb-shell :: Driver/TestSingleQuote.test (693 of 1406) UNSUPPORTED: lldb-shell :: Subprocess/clone-follow-child-wp.test (694 of 1406) PASS: lldb-api :: lang/c/bitfields/TestBitfields.py (695 of 1406) UNSUPPORTED: lldb-api :: tools/lldb-vscode/attach/TestVSCode_attach.py (696 of 1406) PASS: lldb-api :: functionalities/data-formatter/data-formatter-stl/libcxx/list/loop/TestDataFormatterLibcxxListLoop.py (697 of 1406) PASS: lldb-shell :: ObjectFile/ELF/section-types.yaml (698 of 1406) PASS: lldb-api :: functionalities/data-formatter/type_summary_list_arg/TestTypeSummaryListArg.py (699 of 1406) UNSUPPORTED: lldb-api :: commands/watchpoints/watchpoint_size/TestWatchpointSizes.py (700 of 1406) PASS: lldb-api :: lang/objc/foundation/TestObjCMethodsNSError.py (701 of 1406) PASS: lldb-api :: commands/expression/pr35310/TestExprsBug35310.py (702 of 1406) PASS: lldb-api :: lang/c/modules/TestCModules.py (703 of 1406) PASS: lldb-api :: functionalities/breakpoint/hardware_breakpoints/require_hw_breakpoints/TestRequireHWBreakpoints.py (704 of 1406) PASS: lldb-api :: commands/session/history/TestSessionHistory.py (705 of 1406) PASS: lldb-shell :: Unwind/thread-step-out-ret-addr-check.test (706 of 1406) PASS: lldb-shell :: ObjectFile/ELF/PT_LOAD.yaml (707 of 1406) UNSUPPORTED: lldb-api :: functionalities/thread/multi_break/TestMultipleBreakpoints.py (708 of 1406) UNSUPPORTED: lldb-api :: commands/watchpoints/variable_out_of_scope/TestWatchedVarHitWhenInScope.py (709 of 1406) UNSUPPORTED: lldb-api :: functionalities/thread/concurrent_events/TestConcurrentDelayedCrashWithBreakpointWatchpoint.py (710 of 1406) UNSUPPORTED: lldb-shell :: Reproducer/TestGDBRemoteRepro.test (711 of 1406) PASS: lldb-api :: api/listeners/TestListener.py (712 of 1406) PASS: lldb-api :: functionalities/gdb_remote_client/TestFork.py (713 of 1406) UNSUPPORTED: lldb-shell :: SymbolFile/DWARF/x86/debug-line-basic.s (714 of 1406) UNSUPPORTED: lldb-shell :: Register/aarch64-fp-read.test (715 of 1406) UNSUPPORTED: lldb-api :: functionalities/thread/concurrent_events/TestConcurrentTwoWatchpointsOneSignal.py (716 of 1406) PASS: lldb-api :: lang/objc/objc-new-syntax/TestObjCNewSyntaxDictionary.py (717 of 1406) UNSUPPORTED: lldb-api :: lang/objc/modules-app-update/TestClangModulesAppUpdate.py (718 of 1406) UNSUPPORTED: lldb-api :: functionalities/ptrauth_diagnostics/brkC47x_x16_invalid/TestPtrauthBRKc47xX16Invalid.py (719 of 1406) PASS: lldb-shell :: Quit/TestQuitExitCodeImplicit0.test (720 of 1406) PASS: lldb-shell :: Breakpoint/jit-loader_jitlink_elf.test (721 of 1406) PASS: lldb-api :: types/TestDoubleTypes.py (722 of 1406) UNSUPPORTED: lldb-shell :: Register/x86-64-read.test (723 of 1406) UNSUPPORTED: lldb-shell :: SymbolFile/DWARF/x86/array-sizes.s (724 of 1406) UNSUPPORTED: lldb-shell :: Quit/TestQuitExitCodeHexA.test (725 of 1406) PASS: lldb-api :: functionalities/inferior-crashing/TestInferiorCrashing.py (726 of 1406) PASS: lldb-api :: tools/lldb-server/TestGdbRemoteRegisterState.py (727 of 1406) PASS: lldb-api :: functionalities/data-formatter/data-formatter-stl/libcxx/initializerlist/TestInitializerList.py (728 of 1406) PASS: lldb-api :: commands/target/modules/search-paths/insert/TestTargetModulesSearchpathsInsert.py (729 of 1406) UNSUPPORTED: lldb-api :: functionalities/data-formatter/data-formatter-stl/libstdcpp/list/TestDataFormatterStdList.py (730 of 1406) UNSUPPORTED: lldb-shell :: Reproducer/TestSynchronous.test (731 of 1406) UNSUPPORTED: lldb-shell :: SymbolFile/PDB/typedefs.test (732 of 1406) PASS: lldb-api :: functionalities/thread/concurrent_events/TestConcurrentTwoBreakpointThreads.py (733 of 1406) PASS: lldb-api :: lang/cpp/non-type-template-param/TestCppNonTypeTemplateParam.py (734 of 1406) PASS: lldb-api :: lang/objc/objc-super/TestObjCSuper.py (735 of 1406) PASS: lldb-shell :: Commands/command-disassemble-process.yaml (736 of 1406) UNSUPPORTED: lldb-shell :: SymbolFile/DWARF/x86/find-function-regex.cpp (737 of 1406) UNSUPPORTED: lldb-api :: python_api/watchpoint/watchlocation/TestTargetWatchAddress.py (738 of 1406) UNSUPPORTED: lldb-api :: commands/expression/import-std-module/empty-module/TestEmptyStdModule.py (739 of 1406) PASS: lldb-api :: functionalities/breakpoint/inlined_breakpoints/TestInlinedBreakpoints.py (740 of 1406) PASS: lldb-api :: functionalities/postmortem/minidump-new/TestMiniDumpNew.py (741 of 1406) UNSUPPORTED: lldb-shell :: Process/Windows/exception_access_violation.cpp (742 of 1406) UNSUPPORTED: lldb-api :: tools/lldb-server/TestGdbRemoteSaveCore.py (743 of 1406) UNSUPPORTED: lldb-shell :: SymbolFile/DWARF/x86/debug-types-basic.test (744 of 1406) UNSUPPORTED: lldb-api :: functionalities/gdb_remote_client/TestIOSSimulator.py (745 of 1406) PASS: lldb-api :: functionalities/dead-strip/TestDeadStrip.py (746 of 1406) UNSUPPORTED: lldb-api :: benchmarks/libcxxmap/TestBenchmarkLibcxxMap.py (747 of 1406) PASS: lldb-shell :: ObjectFile/MachO/lc_build_version.yaml (748 of 1406) UNSUPPORTED: lldb-shell :: SymbolFile/NativePDB/nested-types.cpp (749 of 1406) PASS: lldb-api :: functionalities/data-formatter/nsarraysynth/TestNSArraySynthetic.py (750 of 1406) PASS: lldb-shell :: SymbolFile/DWARF/x86/debug_loc-aslr.s (751 of 1406) PASS: lldb-api :: functionalities/dlopen_other_executable/TestDlopenOtherExecutable.py (752 of 1406) PASS: lldb-api :: functionalities/thread/state_after_expression/TestStateAfterExpression.py (753 of 1406) PASS: lldb-api :: lang/cpp/function-qualifiers/TestCppFunctionQualifiers.py (754 of 1406) UNSUPPORTED: lldb-api :: functionalities/data-formatter/data-formatter-stl/libstdcpp/iterator/TestDataFormatterStdIterator.py (755 of 1406) PASS: lldb-api :: functionalities/breakpoint/breakpoint_command/TestRegexpBreakCommand.py (756 of 1406) PASS: lldb-shell :: Register/Core/x86-64-freebsd-fp.test (757 of 1406) PASS: lldb-api :: functionalities/data-formatter/data-formatter-stl/libcxx/multimap/TestDataFormatterLibccMultiMap.py (758 of 1406) PASS: lldb-api :: python_api/class_members/TestSBTypeClassMembers.py (759 of 1406) UNSUPPORTED: lldb-api :: commands/expression/import-std-module/vector-of-vectors/TestVectorOfVectorsFromStdModule.py (760 of 1406) PASS: lldb-api :: python_api/type/TestTypeList.py (761 of 1406) PASS: lldb-shell :: Settings/TestModuleCacheSanity.test (762 of 1406) PASS: lldb-api :: lang/c/forward/TestForwardDeclaration.py (763 of 1406) PASS: lldb-api :: python_api/thread/TestThreadAPI.py (764 of 1406) PASS: lldb-shell :: SymbolFile/DWARF/clang-ast-from-dwarf-unamed-and-anon-structs.cpp (765 of 1406) PASS: lldb-api :: lang/objc/modules-cache/TestClangModulesCache.py (766 of 1406) PASS: lldb-shell :: Watchpoint/SetErrorCases.test (767 of 1406) PASS: lldb-api :: test_utils/TestPExpectTest.py (768 of 1406) PASS: lldb-shell :: Commands/command-script-import.test (769 of 1406) PASS: lldb-shell :: Commands/command-regex-delete.test (770 of 1406) UNSUPPORTED: lldb-api :: functionalities/gdb_remote_client/TestRestartBug.py (771 of 1406) PASS: lldb-shell :: SymbolFile/DWARF/x86/DW_AT_decl_file-DW_AT_specification-crosscu.s (772 of 1406) PASS: lldb-shell :: SymbolFile/DWARF/x86/debug-types-dwarf5.s (773 of 1406) PASS: lldb-api :: lang/objc/objc++/TestObjCXX.py (774 of 1406) UNSUPPORTED: lldb-shell :: ScriptInterpreter/Lua/convenience_variables.test (775 of 1406) PASS: lldb-api :: commands/expression/ir-interpreter-phi-nodes/TestIRInterpreterPHINodes.py (776 of 1406) PASS: lldb-api :: iohandler/resize/TestIOHandlerResize.py (777 of 1406) PASS: lldb-shell :: SymbolFile/DWARF/x86/debug_rnglists-dwp.s (778 of 1406) PASS: lldb-api :: tools/lldb-server/inferior-crash/TestGdbRemoteSegFault.py (779 of 1406) PASS: lldb-api :: commands/frame/diagnose/complicated-expression/TestComplicatedExpression.py (780 of 1406) UNSUPPORTED: lldb-shell :: Subprocess/vfork-follow-parent-wp.test (781 of 1406) UNSUPPORTED: lldb-shell :: SymbolFile/DWARF/x86/dir-separator-no-comp-dir.s (782 of 1406) UNSUPPORTED: lldb-api :: functionalities/thread/concurrent_events/TestConcurrentDelaySignalWatch.py (783 of 1406) PASS: lldb-shell :: ObjectFile/ELF/PT_LOAD-overlap-PT_INTERP.yaml (784 of 1406) PASS: lldb-api :: commands/expression/weak_symbols/TestWeakSymbols.py (785 of 1406) PASS: lldb-api :: lang/cpp/llvm-style/TestLLVMStyle.py (786 of 1406) PASS: lldb-api :: lang/cpp/pointer_to_member_type_depending_on_parent_size/TestPointerToMemberTypeDependingOnParentSize.py (787 of 1406) PASS: lldb-api :: functionalities/postmortem/wow64_minidump/TestWow64MiniDump.py (788 of 1406) UNSUPPORTED: lldb-shell :: SymbolFile/NativePDB/globals-fundamental.cpp (789 of 1406) UNSUPPORTED: lldb-shell :: ObjectFile/PECOFF/export-dllfunc.yaml (790 of 1406) PASS: lldb-shell :: SymbolFile/DWARF/x86/debug_rnglists-dwo.s (791 of 1406) PASS: lldb-shell :: SymbolFile/DWARF/x86/DW_AT_const_value.s (792 of 1406) PASS: lldb-shell :: Register/Core/x86-32-freebsd-fp.test (793 of 1406) PASS: lldb-shell :: ObjectFile/wasm/basic.yaml (794 of 1406) UNSUPPORTED: lldb-api :: macosx/posix_spawn/TestLaunchProcessPosixSpawn.py (795 of 1406) UNSUPPORTED: lldb-shell :: SymbolFile/PDB/function-level-linking.test (796 of 1406) UNSUPPORTED: lldb-shell :: SymbolFile/NativePDB/stack_unwinding01.cpp (797 of 1406) PASS: lldb-shell :: ObjectFile/ELF/PT_LOAD-overlap.yaml (798 of 1406) UNSUPPORTED: lldb-shell :: Driver/LocalLLDBInit.test (799 of 1406) UNSUPPORTED: lldb-api :: commands/expression/no-deadlock/TestExprDoesntBlock.py (800 of 1406) PASS: lldb-api :: functionalities/data-formatter/data-formatter-categories/TestDataFormatterCategories.py (801 of 1406) UNSUPPORTED: lldb-api :: functionalities/breakpoint/breakpoint_command/TestBreakpointCommandsFromPython.py (802 of 1406) UNSUPPORTED: lldb-api :: functionalities/breakpoint/breakpoint_in_delayslot/TestAvoidBreakpointInDelaySlot.py (803 of 1406) PASS: lldb-api :: functionalities/type_get_module/TestTypeGetModule.py (804 of 1406) UNSUPPORTED: lldb-api :: macosx/version_zero/TestGetVersionZeroVersion.py (805 of 1406) PASS: lldb-api :: functionalities/data-formatter/data-formatter-python-synth/TestDataFormatterPythonSynth.py (806 of 1406) PASS: lldb-api :: functionalities/data-formatter/stringprinter/TestStringPrinter.py (807 of 1406) PASS: lldb-api :: functionalities/data-formatter/data-formatter-caching/TestDataFormatterCaching.py (808 of 1406) PASS: lldb-api :: arm/emulation/TestEmulations.py (809 of 1406) UNSUPPORTED: lldb-shell :: ScriptInterpreter/Lua/breakpoint_callback.test (810 of 1406) PASS: lldb-api :: lang/objc/foundation/TestObjectDescriptionAPI.py (811 of 1406) PASS: lldb-api :: functionalities/load_lazy/TestLoadUsingLazyBind.py (812 of 1406) UNSUPPORTED: lldb-api :: commands/trace/TestTraceLoad.py (813 of 1406) PASS: lldb-api :: tools/lldb-server/inferior-crash/TestGdbRemoteAbort.py (814 of 1406) PASS: lldb-api :: commands/frame/diagnose/bad-reference/TestBadReference.py (815 of 1406) PASS: lldb-api :: lang/objcxx/objc-builtin-types/TestObjCBuiltinTypes.py (816 of 1406) UNSUPPORTED: lldb-shell :: Unwind/unwind-plan-dwarf-dump.test (817 of 1406) PASS: lldb-api :: lang/c/stepping/TestThreadStepping.py (818 of 1406) PASS: lldb-api :: functionalities/data-formatter/cstring-utf8-summary/TestCstringUnicode.py (819 of 1406) PASS: lldb-api :: commands/register/register/register_command/TestRegisters.py (820 of 1406) PASS: lldb-api :: commands/expression/import_base_class_when_class_has_derived_member/TestImportBaseClassWhenClassHasDerivedMember.py (821 of 1406) PASS: lldb-shell :: SymbolFile/DWARF/DW_AT_range-DW_FORM_sec_offset.s (822 of 1406) PASS: lldb-shell :: Register/Core/x86-64-netbsd-addr.test (823 of 1406) PASS: lldb-api :: functionalities/target_var/TestTargetVar.py (824 of 1406) PASS: lldb-shell :: ObjectFile/Breakpad/uuid-matching-mac.test (825 of 1406) PASS: lldb-api :: functionalities/tail_call_frames/ambiguous_tail_call_seq2/TestAmbiguousTailCallSeq2.py (826 of 1406) PASS: lldb-api :: lang/objc/unicode-string/TestUnicodeString.py (827 of 1406) UNSUPPORTED: lldb-shell :: ScriptInterpreter/Lua/watchpoint_callback.test (828 of 1406) PASS: lldb-shell :: Breakpoint/split-dwarf5-debug-stroffsets.test (829 of 1406) PASS: lldb-api :: functionalities/data-formatter/data-formatter-stl/libcxx/multiset/TestDataFormatterLibcxxMultiSet.py (830 of 1406) UNSUPPORTED: lldb-api :: linux/aarch64/mte_tag_access/TestAArch64LinuxMTEMemoryTagAccess.py (831 of 1406) PASS: lldb-api :: lang/cpp/symbols/TestSymbols.py (832 of 1406) PASS: lldb-api :: sanity/TestModuleCacheSanity.py (833 of 1406) PASS: lldb-api :: functionalities/multidebugger_commands/TestMultipleDebuggersCommands.py (834 of 1406) PASS: lldb-api :: commands/expression/char/TestExprsChar.py (835 of 1406) PASS: lldb-shell :: Settings/TestDefaultModuleCachePath.test (836 of 1406) UNSUPPORTED: lldb-shell :: Unwind/basic-block-sections.test (837 of 1406) PASS: lldb-api :: lang/cpp/call-function/TestCallCPPFunction.py (838 of 1406) UNSUPPORTED: lldb-api :: functionalities/longjmp/TestLongjmp.py (839 of 1406) PASS: lldb-api :: lang/cpp/rvalue-references/TestRvalueReferences.py (840 of 1406) UNSUPPORTED: lldb-api :: commands/expression/import-std-module/non-module-type-separation/TestNonModuleTypeSeparation.py (841 of 1406) UNSUPPORTED: lldb-api :: linux/aarch64/mte_tag_faults/TestAArch64LinuxMTEMemoryTagFaults.py (842 of 1406) PASS: lldb-api :: macosx/debugserver-exit-code/TestDebugServerExitCode.py (843 of 1406) PASS: lldb-api :: lang/cpp/member-and-local-vars-with-same-name/TestMembersAndLocalsWithSameName.py (844 of 1406) UNSUPPORTED: lldb-shell :: SymbolFile/NativePDB/load-pdb.cpp (845 of 1406) UNSUPPORTED: lldb-api :: lang/cpp/gmodules/TestWithModuleDebugging.py (846 of 1406) PASS: lldb-api :: lang/cpp/inlines/TestInlines.py (847 of 1406) UNSUPPORTED: lldb-shell :: Quit/TestQuitExitCode-30.test (848 of 1406) PASS: lldb-api :: python_api/value/empty_class/TestValueAPIEmptyClass.py (849 of 1406) UNSUPPORTED: lldb-shell :: Reproducer/TestRelativePath.test (850 of 1406) PASS: lldb-api :: commands/target/stop-hooks/TestStopHookScripted.py (851 of 1406) PASS: lldb-shell :: Unwind/trap_frame_sym_ctx.test (852 of 1406) UNSUPPORTED: lldb-api :: functionalities/data-formatter/data-formatter-stl/libstdcpp/vector/TestDataFormatterStdVector.py (853 of 1406) PASS: lldb-shell :: SymbolFile/DWARF/dwo-relative-path.s (854 of 1406) PASS: lldb-api :: functionalities/data-formatter/data-formatter-objc/TestDataFormatterObjCNSBundle.py (855 of 1406) UNSUPPORTED: lldb-api :: tools/lldb-server/TestAppleSimulatorOSType.py (856 of 1406) PASS: lldb-shell :: Commands/command-thread-select.test (857 of 1406) PASS: lldb-shell :: SymbolFile/Breakpad/line-table-edgecases.test (858 of 1406) PASS: lldb-api :: functionalities/breakpoint/step_over_breakpoint/TestStepOverBreakpoint.py (859 of 1406) UNSUPPORTED: lldb-shell :: SymbolFile/PDB/pointers.test (860 of 1406) PASS: lldb-api :: functionalities/gdb_remote_client/TestProcessConnect.py (861 of 1406) PASS: lldb-api :: functionalities/data-formatter/type_summary_list_script/TestTypeSummaryListScript.py (862 of 1406) PASS: lldb-api :: functionalities/data-formatter/dump_dynamic/TestDumpDynamic.py (863 of 1406) PASS: lldb-api :: functionalities/limit-debug-info/TestLimitDebugInfo.py (864 of 1406) UNSUPPORTED: lldb-api :: macosx/macCatalystAppMacOSFramework/TestMacCatalystAppWithMacOSFramework.py (865 of 1406) PASS: lldb-shell :: SymbolFile/DWARF/x86/debug-types-line-tables.s (866 of 1406) UNSUPPORTED: lldb-api :: benchmarks/turnaround/TestCompileRunToBreakpointTurnaround.py (867 of 1406) PASS: lldb-api :: commands/expression/cast_int_to_anonymous_enum/TestCastIntToAnonymousEnum.py (868 of 1406) UNSUPPORTED: lldb-api :: commands/trace/multiple-threads/TestTraceStartStopMultipleThreads.py (869 of 1406) PASS: lldb-api :: lang/cpp/trivial_abi/TestTrivialABI.py (870 of 1406) UNSUPPORTED: lldb-shell :: Register/x86-gp-write.test (871 of 1406) UNSUPPORTED: lldb-api :: functionalities/unwind/standard/TestStandardUnwind.py (872 of 1406) PASS: lldb-api :: functionalities/breakpoint/breakpoint_ignore_count/TestBreakpointIgnoreCount.py (873 of 1406) PASS: lldb-api :: lang/objc/direct-dispatch-step/TestObjCDirectDispatchStepping.py (874 of 1406) UNSUPPORTED: lldb-api :: functionalities/tsan/thread_leak/TestTsanThreadLeak.py (875 of 1406) PASS: lldb-shell :: ObjectFile/MachO/lc_build_version_notools.yaml (876 of 1406) PASS: lldb-api :: macosx/order/TestOrderFile.py (877 of 1406) PASS: lldb-api :: commands/help/TestHelp.py (878 of 1406) UNSUPPORTED: lldb-api :: benchmarks/continue/TestBenchmarkContinue.py (879 of 1406) PASS: lldb-shell :: ObjectFile/Breakpad/discontiguous-sections.test (880 of 1406) PASS: lldb-api :: macosx/thread_suspend/TestInternalThreadSuspension.py (881 of 1406) PASS: lldb-api :: functionalities/lazy-loading/TestLazyLoading.py (882 of 1406) PASS: lldb-api :: python_api/value/linked_list/TestValueAPILinkedList.py (883 of 1406) PASS: lldb-api :: lang/cpp/offsetof/TestOffsetofCpp.py (884 of 1406) UNSUPPORTED: lldb-api :: benchmarks/stepping/TestSteppingSpeed.py (885 of 1406) PASS: lldb-shell :: Minidump/Windows/broken-unwind.test (886 of 1406) PASS: lldb-shell :: SymbolFile/DWARF/x86/split-dwarf-multiple-cu.ll (887 of 1406) PASS: lldb-api :: functionalities/breakpoint/cpp/TestCPPBreakpointLocations.py (888 of 1406) PASS: lldb-api :: source-manager/TestSourceManager.py (889 of 1406) PASS: lldb-api :: tools/lldb-server/signal-filtering/TestGdbRemote_QPassSignals.py (890 of 1406) UNSUPPORTED: lldb-api :: linux/aarch64/mte_memory_region/TestAArch64LinuxMTEMemoryRegion.py (891 of 1406) UNSUPPORTED: lldb-shell :: ScriptInterpreter/Python/fail_breakpoint_oneline.test (892 of 1406) PASS: lldb-api :: functionalities/stats_api/TestStatisticsAPI.py (893 of 1406) PASS: lldb-shell :: Settings/TestStopCommandSourceOnError.test (894 of 1406) PASS: lldb-api :: functionalities/breakpoint/address_breakpoints/TestBadAddressBreakpoints.py (895 of 1406) UNSUPPORTED: lldb-shell :: SymbolFile/NativePDB/break-by-function.cpp (896 of 1406) PASS: lldb-shell :: ScriptInterpreter/Python/eof.test (897 of 1406) PASS: lldb-api :: commands/platform/process/list/TestProcessList.py (898 of 1406) PASS: lldb-api :: functionalities/avoids-fd-leak/TestFdLeak.py (899 of 1406) PASS: lldb-api :: terminal/TestSTTYBeforeAndAfter.py (900 of 1406) PASS: lldb-api :: tools/lldb-server/TestGdbRemoteAttachOrWait.py (901 of 1406) UNSUPPORTED: lldb-api :: commands/watchpoints/watchpoint_commands/TestWatchpointCommands.py (902 of 1406) UNSUPPORTED: lldb-api :: commands/trace/TestTraceStartStop.py (903 of 1406) PASS: lldb-shell :: SymbolFile/Breakpad/line-table.test (904 of 1406) PASS: lldb-shell :: Commands/command-target-modules-dump-sections.yaml (905 of 1406) PASS: lldb-api :: functionalities/data-formatter/data-formatter-objc/cmtime/TestDataFormatterCMTime.py (906 of 1406) UNSUPPORTED: lldb-api :: lang/objc/modules-update/TestClangModulesUpdate.py (907 of 1406) UNSUPPORTED: lldb-shell :: Register/x86-64-xmm16-write.test (908 of 1406) PASS: lldb-shell :: Driver/TestProcessAttach.test (909 of 1406) UNSUPPORTED: lldb-api :: commands/expression/import-std-module/weak_ptr-dbg-info-content/TestDbgInfoContentWeakPtrFromStdModule.py (910 of 1406) PASS: lldb-api :: lang/cpp/reference-to-outer-type/TestCppReferenceToOuterClass.py (911 of 1406) PASS: lldb-shell :: SymbolFile/DWARF/x86/debug_ranges.s (912 of 1406) PASS: lldb-api :: lang/cpp/char8_t/TestCxxChar8_t.py (913 of 1406) PASS: lldb-shell :: ObjectFile/wasm/stripped-debug-sections.yaml (914 of 1406) PASS: lldb-shell :: ObjectFile/ELF/duplicate-section.yaml (915 of 1406) UNSUPPORTED: lldb-api :: python_api/watchpoint/TestWatchpointIgnoreCount.py (916 of 1406) PASS: lldb-api :: functionalities/data-formatter/varscript_formatting/TestDataFormatterVarScriptFormatting.py (917 of 1406) UNSUPPORTED: lldb-api :: lang/objc/foundation/TestRuntimeTypes.py (918 of 1406) PASS: lldb-api :: functionalities/data-formatter/data-formatter-stl/libcxx/vbool/TestDataFormatterLibcxxVBool.py (919 of 1406) PASS: lldb-api :: commands/frame/select/TestFrameSelect.py (920 of 1406) UNSUPPORTED: lldb-api :: functionalities/reproducers/attach/TestReproducerAttach.py (921 of 1406) UNSUPPORTED: lldb-api :: functionalities/tail_call_frames/disambiguate_call_site/TestDisambiguateCallSite.py (922 of 1406) UNSUPPORTED: lldb-api :: functionalities/tsan/basic/TestTsanBasic.py (923 of 1406) UNSUPPORTED: lldb-api :: lang/objc/conflicting-class-list-function-from-user/TestObjCClassListFunctionFromUser.py (924 of 1406) PASS: lldb-api :: functionalities/jitloader_gdb/TestJITLoaderGDB.py (925 of 1406) PASS: lldb-api :: commands/expression/persistent_types/TestNestedPersistentTypes.py (926 of 1406) UNSUPPORTED: lldb-api :: functionalities/data-formatter/data-formatter-stl/libstdcpp/smart_ptr/TestDataFormatterStdSmartPtr.py (927 of 1406) PASS: lldb-api :: functionalities/data-formatter/data-formatter-stl/libcxx/iterator/TestDataFormatterLibccIterator.py (928 of 1406) PASS: lldb-shell :: Settings/TestFrameFormatNoColor.test (929 of 1406) PASS: lldb-shell :: Minidump/memory-region.yaml (930 of 1406) UNSUPPORTED: lldb-api :: functionalities/ptrauth_diagnostics/BRAA_error/TestPtrauthBRAADiagnostic.py (931 of 1406) UNSUPPORTED: lldb-api :: lang/cpp/breakpoint_in_member_func_w_non_primitive_params/TestBreakpointInMemberFuncWNonPrimitiveParams.py (932 of 1406) PASS: lldb-api :: commands/expression/po_verbosity/TestPoVerbosity.py (933 of 1406) UNSUPPORTED: lldb-shell :: SymbolFile/DWARF/x86/find-basic-type.cpp (934 of 1406) PASS: lldb-api :: commands/disassemble/basic/TestFrameDisassemble.py (935 of 1406) PASS: lldb-shell :: SymbolFile/DWARF/x86/debug_line-tombstone.s (936 of 1406) PASS: lldb-api :: lang/cpp/keywords_enabled/TestCppKeywordsEnabled.py (937 of 1406) UNSUPPORTED: lldb-api :: tools/lldb-vscode/breakpoint/TestVSCode_setFunctionBreakpoints.py (938 of 1406) PASS: lldb-api :: commands/log/basic/TestLogging.py (939 of 1406) UNSUPPORTED: lldb-api :: commands/expression/import-std-module/deque-dbg-info-content/TestDbgInfoContentDequeFromStdModule.py (940 of 1406) UNSUPPORTED: lldb-shell :: Subprocess/fork-follow-child-wp.test (941 of 1406) UNSUPPORTED: lldb-api :: commands/watchpoints/watchpoint_events/TestWatchpointEvents.py (942 of 1406) PASS: lldb-api :: commands/thread/select/TestThreadSelect.py (943 of 1406) UNSUPPORTED: lldb-shell :: Register/x86-64-ymm16-read.test (944 of 1406) PASS: lldb-shell :: ObjectFile/ELF/section-types-edgecases.yaml (945 of 1406) PASS: lldb-api :: lang/cpp/class_types/TestClassTypesDisassembly.py (946 of 1406) PASS: lldb-api :: commands/expression/calculator_mode/TestCalculatorMode.py (947 of 1406) UNSUPPORTED: lldb-shell :: Subprocess/vfork-follow-child.test (948 of 1406) PASS: lldb-api :: lang/objc/foundation/TestSymbolTable.py (949 of 1406) PASS: lldb-api :: macosx/DBGSourcePathRemapping/TestDSYMSourcePathRemapping.py (950 of 1406) UNSUPPORTED: lldb-shell :: ScriptInterpreter/Lua/breakpoint_oneline_callback.test (951 of 1406) UNSUPPORTED: lldb-api :: commands/expression/import-std-module/forward_list-dbg-info-content/TestDbgInfoContentForwardListFromStdModule.py (952 of 1406) UNSUPPORTED: lldb-shell :: Driver/TestCore.test (953 of 1406) PASS: lldb-api :: python_api/default-constructor/TestDefaultConstructorForAPIObjects.py (954 of 1406) PASS: lldb-api :: commands/frame/diagnose/dereference-this/TestDiagnoseDereferenceThis.py (955 of 1406) XFAIL: lldb-shell :: Register/x86-fp-write.test (956 of 1406) UNSUPPORTED: lldb-api :: functionalities/thread/concurrent_events/TestConcurrentSignalDelayWatch.py (957 of 1406) UNSUPPORTED: lldb-api :: python_api/sbdata/TestSBData.py (958 of 1406) PASS: lldb-api :: functionalities/postmortem/elf-core/thread_crash/TestLinuxCoreThreads.py (959 of 1406) PASS: lldb-shell :: Settings/TestSettingsWrite.test (960 of 1406) PASS: lldb-shell :: SymbolFile/DWARF/x86/compilercontext.ll (961 of 1406) UNSUPPORTED: lldb-shell :: SymbolFile/DWARF/x86/debug-names-compressed.cpp (962 of 1406) PASS: lldb-api :: functionalities/gdb_remote_client/TestGDBRemoteClient.py (963 of 1406) PASS: lldb-shell :: SymbolFile/DWARF/x86/DW_AT_declaration-with-children.s (964 of 1406) PASS: lldb-api :: lang/cpp/stl/TestSTL.py (965 of 1406) UNSUPPORTED: lldb-api :: linux/add-symbols/TestTargetSymbolsAddCommand.py (966 of 1406) PASS: lldb-api :: functionalities/breakpoint/breakpoint_locations/TestBreakpointLocations.py (967 of 1406) PASS: lldb-shell :: ObjectFile/Breakpad/sections-trailing-func.test (968 of 1406) PASS: lldb-api :: functionalities/thread/concurrent_events/TestConcurrentBreakpointDelayBreakpointOneSignal.py (969 of 1406) PASS: lldb-api :: tools/lldb-server/TestGdbRemoteHostInfo.py (970 of 1406) PASS: lldb-api :: lang/objc/modules-objc-property/TestModulesObjCProperty.py (971 of 1406) PASS: lldb-api :: lang/c/cpp_keyword_identifiers/TestCppKeywordsAsCIdentifiers.py (972 of 1406) UNSUPPORTED: lldb-shell :: ScriptInterpreter/Lua/fail_breakpoint_oneline.test (973 of 1406) PASS: lldb-api :: commands/expression/completion-crash-incomplete-record/TestCompletionCrashIncompleteRecord.py (974 of 1406) UNSUPPORTED: lldb-shell :: Register/x86-zmm-read.test (975 of 1406) PASS: lldb-shell :: ObjectFile/wasm/unified-debug-sections.yaml (976 of 1406) PASS: lldb-api :: functionalities/backticks/TestBackticksWithoutATarget.py (977 of 1406) PASS: lldb-api :: commands/target/stop-hook/disable/TestTargetStopHookDisable.py (978 of 1406) PASS: lldb-api :: lang/cpp/thread_local/TestThreadLocal.py (979 of 1406) PASS: lldb-shell :: Commands/command-image-lookup.yaml (980 of 1406) PASS: lldb-shell :: Minidump/memory-region-from-module.yaml (981 of 1406) PASS: lldb-shell :: SymbolFile/DWARF/x86/find-qualified-variable.cpp (982 of 1406) UNSUPPORTED: lldb-api :: commands/watchpoints/multi_watchpoint_slots/TestWatchpointMultipleSlots.py (983 of 1406) PASS: lldb-api :: lang/cpp/forward-declared-template-specialization/TestCppForwardDeclaredTemplateSpecialization.py (984 of 1406) PASS: lldb-shell :: Breakpoint/debug_rnglistx_rlex.test (985 of 1406) PASS: lldb-api :: functionalities/breakpoint/comp_dir_symlink/TestCompDirSymLink.py (986 of 1406) PASS: lldb-api :: functionalities/target_var/no_vars/TestTargetVarNoVars.py (987 of 1406) PASS: lldb-api :: python_api/name_lookup/TestNameLookup.py (988 of 1406) PASS: lldb-api :: functionalities/data-formatter/data-formatter-disabling/TestDataFormatterDisabling.py (989 of 1406) PASS: lldb-api :: lang/c/unions/TestUnionMembers.py (990 of 1406) PASS: lldb-shell :: Settings/TestFrameFormatMangling.test (991 of 1406) PASS: lldb-api :: functionalities/data-formatter/data-formatter-objc/TestDataFormatterObjCNSContainer.py (992 of 1406) PASS: lldb-api :: linux/builtin_trap/TestBuiltinTrap.py (993 of 1406) PASS: lldb-api :: lang/cpp/incomplete-types/TestCppIncompleteTypes.py (994 of 1406) PASS: lldb-api :: functionalities/type_completion/TestTypeCompletion.py (995 of 1406) PASS: lldb-api :: functionalities/gdb_remote_client/TestRecognizeBreakpoint.py (996 of 1406) PASS: lldb-api :: commands/expression/ir-interpreter/TestIRInterpreter.py (997 of 1406) PASS: lldb-api :: functionalities/memory/read/TestMemoryRead.py (998 of 1406) UNSUPPORTED: lldb-shell :: Register/x86-multithread-write.test (999 of 1406) PASS: lldb-api :: functionalities/data-formatter/user-format-vs-summary/TestUserFormatVsSummary.py (1000 of 1406) PASS: lldb-api :: commands/expression/persistent_variables/TestPersistentVariables.py (1001 of 1406) UNSUPPORTED: lldb-api :: commands/watchpoints/watch_tagged_addr/TestWatchTaggedAddress.py (1002 of 1406) PASS: lldb-api :: functionalities/gdb_remote_client/TestArmRegisterDefinition.py (1003 of 1406) PASS: lldb-api :: commands/expression/call-throws/TestCallThatThrows.py (1004 of 1406) UNSUPPORTED: lldb-shell :: Subprocess/vfork-follow-child-wp.test (1005 of 1406) PASS: lldb-api :: functionalities/data-formatter/data-formatter-objc/nsindexpath/TestDataFormatterNSIndexPath.py (1006 of 1406) PASS: lldb-api :: functionalities/find-line-entry/TestFindLineEntry.py (1007 of 1406) PASS: lldb-shell :: BuildScript/script-args.test (1008 of 1406) PASS: lldb-shell :: ObjectFile/PDB/object.test (1009 of 1406) PASS: lldb-api :: commands/expression/rdar42038760/TestScalarURem.py (1010 of 1406) UNSUPPORTED: lldb-api :: tools/lldb-vscode/console/TestVSCode_console.py (1011 of 1406) PASS: lldb-shell :: ObjectFile/PECOFF/basic-info.yaml (1012 of 1406) PASS: lldb-api :: functionalities/data-formatter/ostypeformatting/TestFormattersOsType.py (1013 of 1406) PASS: lldb-api :: commands/expression/two-files/TestObjCTypeQueryFromOtherCompileUnit.py (1014 of 1406) UNSUPPORTED: lldb-shell :: SymbolFile/NativePDB/function-types-classes.cpp (1015 of 1406) PASS: lldb-shell :: ObjectFile/MachO/symtab.yaml (1016 of 1406) UNSUPPORTED: lldb-api :: commands/trace/TestTraceSave.py (1017 of 1406) UNSUPPORTED: lldb-api :: commands/expression/import-std-module/shared_ptr/TestSharedPtrFromStdModule.py (1018 of 1406) PASS: lldb-api :: python_api/lldbutil/iter/TestRegistersIterator.py (1019 of 1406) PASS: lldb-api :: tools/lldb-server/TestGdbRemoteThreadsInStopReply.py (1020 of 1406) PASS: lldb-api :: lang/c/tls_globals/TestTlsGlobals.py (1021 of 1406) PASS: lldb-api :: lang/objc/objc-ivar-offsets/TestObjCIvarOffsets.py (1022 of 1406) PASS: lldb-api :: macosx/builtin-debugtrap/TestBuiltinDebugTrap.py (1023 of 1406) UNSUPPORTED: lldb-api :: macosx/simulator/TestSimulatorPlatform.py (1024 of 1406) PASS: lldb-api :: lang/cpp/operators/TestCppOperators.py (1025 of 1406) PASS: lldb-api :: functionalities/data-formatter/boolreference/TestFormattersBoolRefPtr.py (1026 of 1406) UNSUPPORTED: lldb-api :: functionalities/ptrauth_diagnostics/LDRAA_error/TestPtrauthLDRAADiagnostic.py (1027 of 1406) UNSUPPORTED: lldb-shell :: Subprocess/clone-follow-parent.test (1028 of 1406) PASS: lldb-api :: commands/target/auto-install-main-executable/TestAutoInstallMainExecutable.py (1029 of 1406) UNSUPPORTED: lldb-api :: commands/expression/call-restarts/TestCallThatRestarts.py (1030 of 1406) PASS: lldb-api :: lang/cpp/const_this/TestConstThis.py (1031 of 1406) PASS: lldb-api :: lang/objcxx/cpp_keywords_enabled/TestObjCppKeywordsEnabled.py (1032 of 1406) PASS: lldb-api :: lang/objc/real-definition/TestRealDefinition.py (1033 of 1406) PASS: lldb-shell :: ScriptInterpreter/Python/command_import.test (1034 of 1406) PASS: lldb-api :: commands/frame/var/TestFrameVar.py (1035 of 1406) UNSUPPORTED: lldb-api :: commands/watchpoints/watchpoint_set_command/TestWatchLocationWithWatchSet.py (1036 of 1406) UNSUPPORTED: lldb-shell :: Reproducer/TestFileRepro.test (1037 of 1406) PASS: lldb-api :: python_api/function_symbol/TestDisasmAPI.py (1038 of 1406) PASS: lldb-api :: functionalities/thread/concurrent_events/TestConcurrentCrashWithBreak.py (1039 of 1406) PASS: lldb-shell :: Breakpoint/breakpoint-command.test (1040 of 1406) UNSUPPORTED: lldb-api :: lang/c/typedef/Testtypedef.py (1041 of 1406) PASS: lldb-api :: python_api/frame/get-variables/TestGetVariables.py (1042 of 1406) PASS: lldb-api :: python_api/function_symbol/TestSymbolAPI.py (1043 of 1406) PASS: lldb-shell :: ObjectFile/ELF/PT_LOAD-overlap-section.yaml (1044 of 1406) PASS: lldb-api :: api/multiple-debuggers/TestMultipleDebuggers.py (1045 of 1406) PASS: lldb-api :: functionalities/thread/concurrent_events/TestConcurrentSignalDelayBreak.py (1046 of 1406) PASS: lldb-shell :: Host/TestCustomShell.test (1047 of 1406) PASS: lldb-api :: lang/cpp/type_lookup/TestCppTypeLookup.py (1048 of 1406) UNSUPPORTED: lldb-shell :: ScriptInterpreter/Python/Crashlog/parser_json.test (1049 of 1406) UNSUPPORTED: lldb-shell :: Driver/TestError.test (1050 of 1406) PASS: lldb-api :: python_api/sberror/TestSBError.py (1051 of 1406) PASS: lldb-shell :: Register/Core/x86-64-netbsd-multithread.test (1052 of 1406) PASS: lldb-api :: lang/cpp/wchar_t/TestCxxWCharT.py (1053 of 1406) PASS: lldb-api :: functionalities/data-formatter/hexcaps/TestDataFormatterHexCaps.py (1054 of 1406) UNSUPPORTED: lldb-shell :: Driver/TestPositionalArgs.test (1055 of 1406) UNSUPPORTED: lldb-shell :: SymbolFile/NativePDB/source-list.cpp (1056 of 1406) PASS: lldb-shell :: Driver/TestCommands.test (1057 of 1406) PASS: lldb-api :: commands/process/launch-with-shellexpand/TestLaunchWithShellExpand.py (1058 of 1406) UNSUPPORTED: lldb-shell :: SymbolFile/DWARF/x86/dwarf5-line-strp.s (1059 of 1406) PASS: lldb-shell :: Register/Core/x86-32-linux-addr.test (1060 of 1406) PASS: lldb-api :: functionalities/thread/concurrent_events/TestConcurrentDelayedCrashWithBreakpointSignal.py (1061 of 1406) UNSUPPORTED: lldb-api :: functionalities/postmortem/netbsd-core/TestNetBSDCore.py (1062 of 1406) PASS: lldb-api :: python_api/breakpoint/TestBreakpointAPI.py (1063 of 1406) PASS: lldb-api :: lang/c/stepping/TestStepAndBreakpoints.py (1064 of 1406) PASS: lldb-api :: functionalities/gdb_remote_client/TestGDBRemoteDiskFileCompletion.py (1065 of 1406) PASS: lldb-api :: lang/cpp/struct_with_keyword_name/TestStructWithKeywordName.py (1066 of 1406) PASS: lldb-api :: functionalities/conditional_break/TestConditionalBreak.py (1067 of 1406) UNSUPPORTED: lldb-shell :: SymbolFile/DWARF/x86/find-basic-variable.cpp (1068 of 1406) PASS: lldb-shell :: Breakpoint/debug_rnglist_rlestartend.test (1069 of 1406) PASS: lldb-api :: types/TestDoubleTypesExpr.py (1070 of 1406) PASS: lldb-api :: functionalities/thread/concurrent_events/TestConcurrentManyBreakpoints.py (1071 of 1406) PASS: lldb-api :: lang/cpp/dynamic-value-same-basename/TestDynamicValueSameBase.py (1072 of 1406) PASS: lldb-api :: lang/objc/objc-property/TestObjCProperty.py (1073 of 1406) PASS: lldb-shell :: Commands/command-disassemble.s (1074 of 1406) UNSUPPORTED: lldb-shell :: ScriptInterpreter/Lua/nested_sessions.test (1075 of 1406) PASS: lldb-shell :: Minidump/no-process-id.yaml (1076 of 1406) UNSUPPORTED: lldb-api :: tools/lldb-vscode/module/TestVSCode_module.py (1077 of 1406) UNSUPPORTED: lldb-api :: functionalities/ptrauth_diagnostics/BLRAA_error/TestPtrauthBLRAADiagnostic.py (1078 of 1406) PASS: lldb-api :: types/TestShortType.py (1079 of 1406) UNSUPPORTED: lldb-api :: tools/lldb-vscode/disconnect/TestVSCode_disconnect.py (1080 of 1406) PASS: lldb-api :: iohandler/unicode/TestUnicode.py (1081 of 1406) UNSUPPORTED: lldb-shell :: SymbolFile/PDB/variables.test (1082 of 1406) PASS: lldb-api :: functionalities/thread/concurrent_events/TestConcurrentTwoBreakpointsOneDelaySignal.py (1083 of 1406) PASS: lldb-shell :: Settings/TestLineMarkerColor.test (1084 of 1406) PASS: lldb-api :: lang/cpp/template/TestTemplateArgs.py (1085 of 1406) PASS: lldb-api :: sample_test/TestSampleInlineTest.py (1086 of 1406) PASS: lldb-api :: api/command-return-object/TestSBCommandReturnObject.py (1087 of 1406) UNSUPPORTED: lldb-api :: commands/watchpoints/watchpoint_on_vectors/TestValueOfVectorVariable.py (1088 of 1406) UNSUPPORTED: lldb-shell :: Reproducer/TestMultipleTargets.test (1089 of 1406) UNSUPPORTED: lldb-shell :: ScriptInterpreter/Lua/lua-python.test (1090 of 1406) PASS: lldb-api :: commands/gui/basic/TestGuiBasic.py (1091 of 1406) UNSUPPORTED: lldb-api :: tools/lldb-server/registers-target-xml-reading/TestGdbRemoteTargetXmlPacket.py (1092 of 1406) PASS: lldb-api :: macosx/stack-corefile/TestStackCorefile.py (1093 of 1406) UNSUPPORTED: lldb-api :: commands/register/register/intel_xtended_registers/TestMPXRegisters.py (1094 of 1406) PASS: lldb-api :: commands/expression/codegen-crash-import-def-arraytype-element/TestImportDefinitionArrayType.py (1095 of 1406) PASS: lldb-api :: lang/cpp/sizeof/TestCPPSizeof.py (1096 of 1406) UNSUPPORTED: lldb-shell :: SymbolFile/PDB/vbases.test (1097 of 1406) PASS: lldb-api :: functionalities/data-formatter/data-formatter-objc/nsstring/TestDataFormatterNSString.py (1098 of 1406) PASS: lldb-api :: commands/expression/persistent_types/TestPersistentTypes.py (1099 of 1406) UNSUPPORTED: lldb-api :: functionalities/tail_call_frames/inlining_and_tail_calls/TestInliningAndTailCalls.py (1100 of 1406) UNSUPPORTED: lldb-shell :: ObjectFile/PECOFF/uuid.yaml (1101 of 1406) PASS: lldb-shell :: Minidump/breakpad-symbols.test (1102 of 1406) PASS: lldb-api :: functionalities/data-formatter/data-formatter-enum-format/TestDataFormatterEnumFormat.py (1103 of 1406) PASS: lldb-api :: commands/expression/static-initializers/TestStaticInitializers.py (1104 of 1406) PASS: lldb-api :: functionalities/thread/concurrent_events/TestConcurrentBreakpointOneDelayBreakpointThreads.py (1105 of 1406) UNSUPPORTED: lldb-shell :: SymbolFile/NativePDB/tag-types.cpp (1106 of 1406) PASS: lldb-api :: functionalities/thread/concurrent_events/TestConcurrentDelaySignalBreak.py (1107 of 1406) PASS: lldb-api :: commands/expression/call-function/TestCallStdStringFunction.py (1108 of 1406) PASS: lldb-api :: macosx/dyld-trie-symbols/TestDyldTrieSymbols.py (1109 of 1406) UNSUPPORTED: lldb-shell :: Reproducer/Functionalities/TestDataFormatter.test (1110 of 1406) PASS: lldb-api :: functionalities/data-formatter/data-formatter-objc/TestDataFormatterObjCNSDate.py (1111 of 1406) UNSUPPORTED: lldb-shell :: SymbolFile/PDB/calling-conventions.test (1112 of 1406) PASS: lldb-api :: lang/objc/warnings-in-expr-parser/TestObjCWarningsInExprParser.py (1113 of 1406) UNSUPPORTED: lldb-api :: commands/expression/import-std-module/no-std-module/TestMissingStdModule.py (1114 of 1406) PASS: lldb-api :: lang/cpp/unique-types/TestUniqueTypes.py (1115 of 1406) PASS: lldb-shell :: SymbolFile/DWARF/x86/DW_OP_piece-struct.s (1116 of 1406) UNSUPPORTED: lldb-shell :: SymbolFile/NativePDB/global-classes.cpp (1117 of 1406) PASS: lldb-api :: lang/objc/hidden-ivars/TestHiddenIvars.py (1118 of 1406) PASS: lldb-api :: functionalities/breakpoint/breakpoint_names/TestBreakpointNames.py (1119 of 1406) PASS: lldb-shell :: Register/Core/x86-64-linux-multithread.test (1120 of 1406) PASS: lldb-api :: lang/cpp/operator-overload/TestOperatorOverload.py (1121 of 1406) PASS: lldb-shell :: SymbolFile/Breakpad/unwind-via-raSearch.test (1122 of 1406) PASS: lldb-api :: functionalities/optimized_code/TestNoASanExceptionAfterEvalOP_piece.py (1123 of 1406) UNSUPPORTED: lldb-api :: functionalities/thread/concurrent_events/TestConcurrentWatchpointDelayWatchpointOneBreakpoint.py (1124 of 1406) UNSUPPORTED: lldb-shell :: ScriptInterpreter/Lua/bindings.test (1125 of 1406) PASS: lldb-shell :: Breakpoint/debug_addrx.test (1126 of 1406) PASS: lldb-api :: lang/objc/objc-ivar-stripped/TestObjCIvarStripped.py (1127 of 1406) PASS: lldb-api :: sample_test/TestSampleTest.py (1128 of 1406) PASS: lldb-api :: lang/objc/orderedset/TestOrderedSet.py (1129 of 1406) UNSUPPORTED: lldb-api :: macosx/find-dsym/deep-bundle/TestDeepBundle.py (1130 of 1406) PASS: lldb-api :: python_api/objc_type/TestObjCType.py (1131 of 1406) UNSUPPORTED: lldb-api :: commands/expression/import_builtin_fileid/TestImportBuiltinFileID.py (1132 of 1406) PASS: lldb-shell :: ObjectFile/MachO/subsections.yaml (1133 of 1406) PASS: lldb-shell :: Commands/command-breakpoint-col.test (1134 of 1406) UNSUPPORTED: lldb-api :: functionalities/ubsan/basic/TestUbsanBasic.py (1135 of 1406) UNSUPPORTED: lldb-shell :: Process/TestEnvironment.test (1136 of 1406) PASS: lldb-api :: lang/cpp/printf/TestPrintf.py (1137 of 1406) UNSUPPORTED: lldb-shell :: SymbolFile/DWARF/x86/find-variable-dwo.cpp (1138 of 1406) PASS: lldb-api :: functionalities/data-formatter/poarray/TestPrintObjectArray.py (1139 of 1406) PASS: lldb-shell :: Driver/TestNoUseColor.test (1140 of 1406) UNSUPPORTED: lldb-shell :: SymbolFile/DWARF/x86/find-basic-function.cpp (1141 of 1406) PASS: lldb-api :: lang/c/local_variables/TestLocalVariables.py (1142 of 1406) UNSUPPORTED: lldb-api :: commands/watchpoints/watchpoint_commands/command/TestWatchpointCommandPython.py (1143 of 1406) PASS: lldb-shell :: BuildScript/toolchain-clang.test (1144 of 1406) UNSUPPORTED: lldb-shell :: SymbolFile/DWARF/x86/debug-types-address-ranges.s (1145 of 1406) PASS: lldb-api :: functionalities/data-formatter/data-formatter-stl/libcxx/list/TestDataFormatterLibcxxList.py (1146 of 1406) PASS: lldb-shell :: SymbolFile/Breakpad/unwind-via-stack-win.test (1147 of 1406) PASS: lldb-api :: lang/cpp/template-specialization-type/TestTemplateSpecializationType.py (1148 of 1406) UNSUPPORTED: lldb-shell :: ScriptInterpreter/Lua/independent_state.test (1149 of 1406) UNSUPPORTED: lldb-api :: functionalities/tail_call_frames/disambiguate_paths_to_common_sink/TestDisambiguatePathsToCommonSink.py (1150 of 1406) PASS: lldb-shell :: SymbolFile/DWARF/x86/static_scope.s (1151 of 1406) PASS: lldb-api :: functionalities/gdb_remote_client/TestMemoryRegionDirtyPages.py (1152 of 1406) PASS: lldb-shell :: Register/Core/x86-64-freebsd-gp.test (1153 of 1406) PASS: lldb-api :: functionalities/thread/backtrace_limit/TestBacktraceLimit.py (1154 of 1406) UNSUPPORTED: lldb-shell :: Reproducer/Modules/TestModuleCXX.test (1155 of 1406) PASS: lldb-shell :: Register/Core/x86-64-linux-fp.test (1156 of 1406) UNSUPPORTED: lldb-api :: functionalities/process_group/TestChangeProcessGroup.py (1157 of 1406) UNSUPPORTED: lldb-api :: tools/lldb-server/TestGdbRemoteAuxvSupport.py (1158 of 1406) UNSUPPORTED: lldb-api :: python_api/watchpoint/TestSetWatchpoint.py (1159 of 1406) PASS: lldb-api :: functionalities/thread/thread_specific_break/TestThreadSpecificBreakpoint.py (1160 of 1406) UNSUPPORTED: lldb-api :: lang/objc/print-obj/TestPrintObj.py (1161 of 1406) PASS: lldb-api :: commands/apropos/basic/TestApropos.py (1162 of 1406) PASS: lldb-api :: lang/cpp/unicode-literals/TestUnicodeLiterals.py (1163 of 1406) UNSUPPORTED: lldb-shell :: Register/x86-fp-read.test (1164 of 1406) UNSUPPORTED: lldb-shell :: SymbolFile/DWARF/find-type-in-function.cpp (1165 of 1406) UNSUPPORTED: lldb-api :: functionalities/signal/TestSendSignal.py (1166 of 1406) UNSUPPORTED: lldb-shell :: Reproducer/Functionalities/TestStepping.test (1167 of 1406) PASS: lldb-api :: functionalities/data-formatter/data-formatter-objc/TestDataFormatterObjCCF.py (1168 of 1406) PASS: lldb-api :: commands/expression/scoped_enums/TestScopedEnumType.py (1169 of 1406) XFAIL: lldb-shell :: Register/x86-64-fp-write.test (1170 of 1406) PASS: lldb-shell :: SymbolFile/DWARF/x86/childless-compile-unit.s (1171 of 1406) UNSUPPORTED: lldb-api :: functionalities/process_save_core_minidump/TestProcessSaveCoreMinidump.py (1172 of 1406) UNSUPPORTED: lldb-api :: commands/register/register/aarch64_sve_registers/rw_access_dynamic_resize/TestSVEThreadedDynamic.py (1173 of 1406) UNSUPPORTED: lldb-api :: functionalities/tail_call_frames/disambiguate_tail_call_seq/TestDisambiguateTailCallSeq.py (1174 of 1406) UNSUPPORTED: lldb-api :: commands/expression/import-std-module/stack/TestStackFromStdModule.py (1175 of 1406) UNSUPPORTED: lldb-api :: commands/watchpoints/watchpoint_commands/command/TestWatchpointCommandLLDB.py (1176 of 1406) PASS: lldb-api :: functionalities/data-formatter/data-formatter-stl/libcxx/unique_ptr/TestDataFormatterLibcxxUniquePtr.py (1177 of 1406) PASS: lldb-api :: functionalities/data-formatter/ptr_ref_typedef/TestPtrRef2Typedef.py (1178 of 1406) UNSUPPORTED: lldb-api :: python_api/disassemble-raw-data/TestDisassembleRawData.py (1179 of 1406) UNSUPPORTED: lldb-api :: commands/expression/completion-crash-invalid-iterator/TestInvalidIteratorCompletionCrash.py (1180 of 1406) PASS: lldb-shell :: SymbolFile/Breakpad/line-table-discontinuous-file-ids.test (1181 of 1406) PASS: lldb-api :: commands/expression/entry-bp/TestExprEntryBP.py (1182 of 1406) PASS: lldb-api :: tools/lldb-server/TestGdbRemoteExpeditedRegisters.py (1183 of 1406) PASS: lldb-api :: macosx/lc-note/firmware-corefile/TestFirmwareCorefiles.py (1184 of 1406) PASS: lldb-api :: functionalities/gdb_remote_client/TestNoGPacketSupported.py (1185 of 1406) PASS: lldb-api :: commands/expression/call-function/TestCallUserDefinedFunction.py (1186 of 1406) PASS: lldb-shell :: Driver/TestConvenienceVariables.test (1187 of 1406) PASS: lldb-shell :: SymbolFile/DWARF/x86/gnu-style-compression.cpp (1188 of 1406) UNSUPPORTED: lldb-shell :: ScriptInterpreter/Lua/print.test (1189 of 1406) PASS: lldb-api :: functionalities/data-formatter/data-formatter-objc/TestDataFormatterObjCKVO.py (1190 of 1406) PASS: lldb-api :: lang/cpp/namespace_definitions/TestNamespaceDefinitions.py (1191 of 1406) UNSUPPORTED: lldb-api :: tools/lldb-server/libraries-svr4/TestGdbRemoteLibrariesSvr4Support.py (1192 of 1406) UNSUPPORTED: lldb-api :: functionalities/ptrauth_diagnostics/brkC47x_code/TestPtrauthBRKc47xDiagnostic.py (1193 of 1406) UNSUPPORTED: lldb-api :: functionalities/thread/concurrent_events/TestConcurrentSignalWatch.py (1194 of 1406) PASS: lldb-api :: python_api/frame/TestFrames.py (1195 of 1406) PASS: lldb-api :: functionalities/data-formatter/data-formatter-objc/TestDataFormatterObjCNSURL.py (1196 of 1406) PASS: lldb-api :: commands/expression/radar_8638051/Test8638051.py (1197 of 1406) PASS: lldb-api :: lang/cpp/break-on-initializers/TestBreakOnCPP11Initializers.py (1198 of 1406) UNSUPPORTED: lldb-shell :: Register/x86-64-xmm16-read.test (1199 of 1406) PASS: lldb-api :: macosx/skinny-corefile/TestSkinnyCorefile.py (1200 of 1406) PASS: lldb-shell :: Driver/TestTarget.test (1201 of 1406) PASS: lldb-api :: lang/objc/global_ptrs/TestGlobalObjects.py (1202 of 1406) UNSUPPORTED: lldb-shell :: SymbolFile/DWARF/x86/find-inline-method.s (1203 of 1406) PASS: lldb-api :: commands/apropos/with-process/TestAproposWithProcess.py (1204 of 1406) UNSUPPORTED: lldb-api :: tools/lldb-vscode/runInTerminal/TestVSCode_runInTerminal.py (1205 of 1406) UNSUPPORTED: lldb-api :: functionalities/breakpoint/breakpoint_set_restart/TestBreakpointSetRestart.py (1206 of 1406) PASS: lldb-shell :: Register/Core/x86-32-netbsd-addr.test (1207 of 1406) UNSUPPORTED: lldb-shell :: Reproducer/TestCrash.test (1208 of 1406) UNSUPPORTED: lldb-shell :: SymbolFile/DWARF/dwarf5-lazy-dwo.c (1209 of 1406) UNSUPPORTED: lldb-api :: functionalities/asan/TestMemoryHistory.py (1210 of 1406) PASS: lldb-api :: functionalities/breakpoint/breakpoint_options/TestBreakpointOptions.py (1211 of 1406) PASS: lldb-api :: lang/cpp/namespace/TestNamespaceLookup.py (1212 of 1406) PASS: lldb-shell :: SymbolFile/DWARF/x86/DW_TAG_basic_type_DW_ATE_UTF_nonC.ll (1213 of 1406) PASS: lldb-api :: lang/objcxx/cxx-bridged-po/TestObjCXXBridgedPO.py (1214 of 1406) PASS: lldb-shell :: ObjectFile/ELF/many-sections.s (1215 of 1406) PASS: lldb-shell :: Register/Core/aarch64-freebsd-multithread.test (1216 of 1406) PASS: lldb-shell :: Commands/command-source.test (1217 of 1406) PASS: lldb-api :: functionalities/data-formatter/setvaluefromcstring/TestSetValueFromCString.py (1218 of 1406) UNSUPPORTED: lldb-api :: commands/watchpoints/multiple_hits/TestMultipleHits.py (1219 of 1406) PASS: lldb-shell :: SymbolFile/DWARF/x86/dwarf5_tu_index_abbrev_offset.s (1220 of 1406) UNSUPPORTED: lldb-shell :: SymbolFile/DWARF/x86/dir-separator-windows.s (1221 of 1406) PASS: lldb-api :: lang/cpp/diamond/TestDiamond.py (1222 of 1406) UNSUPPORTED: lldb-api :: tools/lldb-vscode/step/TestVSCode_step.py (1223 of 1406) PASS: lldb-api :: functionalities/tail_call_frames/ambiguous_tail_call_seq1/TestAmbiguousTailCallSeq1.py (1224 of 1406) UNSUPPORTED: lldb-api :: macosx/profile_vrs_detach/TestDetachVrsProfile.py (1225 of 1406) PASS: lldb-api :: lang/c/anonymous/TestAnonymous.py (1226 of 1406) UNSUPPORTED: lldb-api :: commands/process/attach/attach_denied/TestAttachDenied.py (1227 of 1406) PASS: lldb-api :: python_api/sbvalue_persist/TestSBValuePersist.py (1228 of 1406) PASS: lldb-api :: functionalities/type_lookup/TestTypeLookup.py (1229 of 1406) UNSUPPORTED: lldb-api :: functionalities/data-formatter/data-formatter-stl/libstdcpp/map/TestDataFormatterStdMap.py (1230 of 1406) PASS: lldb-api :: lang/c/set_values/TestSetValues.py (1231 of 1406) PASS: lldb-shell :: SymbolFile/Breakpad/symtab-macho.test (1232 of 1406) UNSUPPORTED: lldb-shell :: SymbolFile/NativePDB/ast-functions-msvc.cpp (1233 of 1406) PASS: lldb-api :: tools/lldb-server/memory-allocation/TestGdbRemoteMemoryAllocation.py (1234 of 1406) UNSUPPORTED: lldb-shell :: SymbolFile/DWARF/x86/debug_ranges_and_rnglists.test (1235 of 1406) PASS: lldb-api :: functionalities/breakpoint/global_constructor/TestBreakpointInGlobalConstructor.py (1236 of 1406) UNSUPPORTED: lldb-api :: commands/trace/TestTraceSchema.py (1237 of 1406) UNSUPPORTED: lldb-shell :: SymbolFile/NativePDB/ast-types.cpp (1238 of 1406) UNSUPPORTED: lldb-api :: commands/expression/import-std-module/basic/TestImportStdModule.py (1239 of 1406) PASS: lldb-shell :: Register/Core/x86-32-linux-multithread.test (1240 of 1406) PASS: lldb-api :: functionalities/process_crash_info/TestProcessCrashInfo.py (1241 of 1406) PASS: lldb-shell :: Register/Core/x86-32-netbsd-gp.test (1242 of 1406) UNSUPPORTED: lldb-shell :: SymbolFile/DWARF/x86/inline-function-address-shared.test (1243 of 1406) PASS: lldb-api :: types/TestRecursiveTypes.py (1244 of 1406) PASS: lldb-api :: lang/objc/foundation/TestConstStrings.py (1245 of 1406) UNSUPPORTED: lldb-shell :: Subprocess/fork-follow-parent.test (1246 of 1406) PASS: lldb-api :: functionalities/breakpoint/breakpoint_command/TestBreakpointCommand.py (1247 of 1406) UNSUPPORTED: lldb-api :: tools/lldb-server/TestGdbRemoteModuleInfo.py (1248 of 1406) UNSUPPORTED: lldb-api :: functionalities/inferior-changed/TestInferiorChanged.py (1249 of 1406) PASS: lldb-api :: functionalities/thread/step_out/TestThreadStepOut.py (1250 of 1406) PASS: lldb-api :: functionalities/wrong_commands/TestWrongCommands.py (1251 of 1406) UNSUPPORTED: lldb-shell :: SymbolFile/PDB/type-quals.test (1252 of 1406) PASS: lldb-api :: commands/target/stop-hook/enable/TestTargetStopHookEnable.py (1253 of 1406) PASS: lldb-api :: functionalities/thread/concurrent_events/TestConcurrentCrashWithSignal.py (1254 of 1406) PASS: lldb-api :: driver/batch_mode/TestBatchMode.py (1255 of 1406) PASS: lldb-api :: functionalities/gdb_remote_client/TestWasm.py (1256 of 1406) PASS: lldb-shell :: Recognizer/assert.test (1257 of 1406) UNSUPPORTED: lldb-api :: functionalities/ubsan/user-expression/TestUbsanUserExpression.py (1258 of 1406) UNSUPPORTED: lldb-api :: functionalities/thread/concurrent_events/TestConcurrentWatchBreakDelay.py (1259 of 1406) UNSUPPORTED: lldb-api :: commands/expression/import-std-module/retry-with-std-module/TestRetryWithStdModule.py (1260 of 1406) PASS: lldb-api :: commands/gui/invalid-args/TestInvalidArgsGui.py (1261 of 1406) PASS: lldb-api :: commands/gui/breakpoints/TestGuiBreakpoints.py (1262 of 1406) PASS: lldb-api :: functionalities/thread_plan/TestThreadPlanCommands.py (1263 of 1406) UNSUPPORTED: lldb-api :: functionalities/thread/break_after_join/TestBreakAfterJoin.py (1264 of 1406) PASS: lldb-shell :: SymbolFile/DWARF/clang-ast-from-dwarf-objc-property.m (1265 of 1406) UNSUPPORTED: lldb-api :: functionalities/thread/concurrent_events/TestConcurrentTwoWatchpointsOneDelayBreakpoint.py (1266 of 1406) PASS: lldb-shell :: SymbolFile/DWARF/x86/dwarf5-implicit-const.s (1267 of 1406) UNSUPPORTED: lldb-api :: python_api/process/read-mem-cstring/TestReadMemCString.py (1268 of 1406) PASS: lldb-api :: lang/objc/objc-foundation-dictionary-empty/TestNSDictionary0.py (1269 of 1406) PASS: lldb-api :: functionalities/memory/tag/TestMemoryTag.py (1270 of 1406) PASS: lldb-api :: commands/expression/radar_9531204/TestPrintfAfterUp.py (1271 of 1406) UNSUPPORTED: lldb-shell :: Reproducer/Functionalities/TestExpressionEvaluation.test (1272 of 1406) UNSUPPORTED: lldb-shell :: Driver/TestHelp.test (1273 of 1406) PASS: lldb-shell :: ObjectFile/ELF/gnu-debuglink.yaml (1274 of 1406) UNSUPPORTED: lldb-api :: functionalities/thread/concurrent_events/TestConcurrentManyWatchpoints.py (1275 of 1406) PASS: lldb-api :: lang/c/conflicting-symbol/TestConflictingSymbol.py (1276 of 1406) PASS: lldb-shell :: ObjectFile/PECOFF/section-types.yaml (1277 of 1406) UNSUPPORTED: lldb-shell :: SymbolFile/NativePDB/break-by-line.cpp (1278 of 1406) PASS: lldb-api :: lang/objc/objc-baseclass-sbtype/TestObjCBaseClassSBType.py (1279 of 1406) PASS: lldb-api :: lang/cpp/static_members/TestCPPStaticMembers.py (1280 of 1406) UNSUPPORTED: lldb-shell :: Quit/TestQuitExitCode30.test (1281 of 1406) PASS: lldb-api :: python_api/sbtype_typeclass/TestSBTypeTypeClass.py (1282 of 1406) PASS: lldb-api :: functionalities/data-formatter/pyobjsynthprovider/TestPyObjSynthProvider.py (1283 of 1406) PASS: lldb-api :: lang/cpp/std-function-step-into-callable/TestStdFunctionStepIntoCallable.py (1284 of 1406) PASS: lldb-api :: functionalities/memory-region/TestMemoryRegion.py (1285 of 1406) PASS: lldb-api :: functionalities/pre_run_dylibs/TestPreRunDylibs.py (1286 of 1406) PASS: lldb-shell :: SymbolFile/DWARF/x86/split-dwarf-inlining.cpp (1287 of 1406) UNSUPPORTED: lldb-shell :: Subprocess/vfork-follow-parent.test (1288 of 1406) PASS: lldb-shell :: SymbolFile/Breakpad/unwind-via-stack-win-no-memory-info.yaml (1289 of 1406) UNSUPPORTED: lldb-api :: tools/lldb-vscode/launch/TestVSCode_launch.py (1290 of 1406) PASS: lldb-shell :: ObjectFile/wasm/embedded-debug-sections.yaml (1291 of 1406) PASS: lldb-api :: lang/objc/self/TestObjCSelf.py (1292 of 1406) UNSUPPORTED: lldb-shell :: SymbolFile/Breakpad/stack-cfi-arm.yaml (1293 of 1406) UNSUPPORTED: lldb-api :: commands/expression/timeout/TestCallWithTimeout.py (1294 of 1406) PASS: lldb-api :: functionalities/data-formatter/nssetsynth/TestNSSetSynthetic.py (1295 of 1406) PASS: lldb-api :: lang/c/shared_lib_stripped_symbols/TestSharedLibStrippedSymbols.py (1296 of 1406) UNSUPPORTED: lldb-api :: commands/register/register/intel_xtended_registers/mpx_offset_intersection/TestMPXOffsetIntersection.py (1297 of 1406) UNSUPPORTED: lldb-shell :: Reproducer/TestWorkingDir.test (1298 of 1406) UNSUPPORTED: lldb-api :: commands/expression/import-std-module/unique_ptr/TestUniquePtrFromStdModule.py (1299 of 1406) PASS: lldb-api :: functionalities/data-formatter/format-propagation/TestFormatPropagation.py (1300 of 1406) UNSUPPORTED: lldb-api :: functionalities/thread/concurrent_events/TestConcurrentWatchBreak.py (1301 of 1406) UNSUPPORTED: lldb-api :: commands/platform/connect/TestPlatformConnect.py (1302 of 1406) UNSUPPORTED: lldb-shell :: Minidump/Windows/arm-fp-unwind.test (1303 of 1406) UNSUPPORTED: lldb-shell :: SymbolFile/DWARF/x86/find-basic-namespace.cpp (1304 of 1406) PASS: lldb-api :: python_api/interpreter/TestRunCommandInterpreterAPI.py (1305 of 1406) PASS: lldb-api :: lang/c/struct_types/TestStructTypes.py (1306 of 1406) UNSUPPORTED: lldb-shell :: SymbolFile/DWARF/x86/inline-function-address.ll (1307 of 1406) PASS: lldb-api :: lang/c/sizeof/TestCSizeof.py (1308 of 1406) PASS: lldb-api :: functionalities/unwind/noreturn/module-end/TestNoReturnModuleEnd.py (1309 of 1406) PASS: lldb-api :: lang/cpp/auto/TestCPPAuto.py (1310 of 1406) PASS: lldb-api :: functionalities/data-formatter/language_category_updates/TestDataFormatterLanguageCategoryUpdates.py (1311 of 1406) UNSUPPORTED: lldb-api :: commands/expression/macros/TestMacros.py (1312 of 1406) PASS: lldb-api :: functionalities/breakpoint/breakpoint_conditions/TestBreakpointConditions.py (1313 of 1406) UNSUPPORTED: lldb-shell :: BuildScript/toolchain-clang-cl.test (1314 of 1406) UNSUPPORTED: lldb-api :: tools/lldb-vscode/breakpoint/TestVSCode_setExceptionBreakpoints.py (1315 of 1406) PASS: lldb-api :: functionalities/thread/num_threads/TestNumThreads.py (1316 of 1406) PASS: lldb-api :: python_api/interpreter/TestCommandInterpreterAPI.py (1317 of 1406) PASS: lldb-api :: commands/expression/invalid-args/TestInvalidArgsExpression.py (1318 of 1406) UNSUPPORTED: lldb-api :: functionalities/thread/concurrent_events/TestConcurrentTwoWatchpointThreads.py (1319 of 1406) UNSUPPORTED: lldb-api :: macosx/find-dsym/bundle-with-dot-in-filename/TestBundleWithDotInFilename.py (1320 of 1406) PASS: lldb-shell :: SymbolFile/DWARF/x86/dwp-debug-types.s (1321 of 1406) PASS: lldb-api :: commands/expression/multiline-completion/TestMultilineCompletion.py (1322 of 1406) UNSUPPORTED: lldb-shell :: Register/x86-64-zmm-write.test (1323 of 1406) PASS: lldb-api :: lang/cpp/bitfields/TestCppBitfields.py (1324 of 1406) PASS: lldb-api :: lang/cpp/signed_types/TestSignedTypes.py (1325 of 1406) PASS: lldb-api :: lang/cpp/template-function/TestTemplateFunctions.py (1326 of 1406) UNSUPPORTED: lldb-shell :: SymbolFile/DWARF/x86/dwarf5-index-is-used.cpp (1327 of 1406) UNSUPPORTED: lldb-api :: functionalities/thread/exit_during_expression/TestExitDuringExpression.py (1328 of 1406) UNSUPPORTED: lldb-shell :: SymbolFile/PDB/ast-restore.test (1329 of 1406) PASS: lldb-api :: commands/expression/radar_9673664/TestExprHelpExamples.py (1330 of 1406) PASS: lldb-api :: macosx/queues/TestQueues.py (1331 of 1406) PASS: lldb-api :: lang/cpp/dynamic-value/TestDynamicValue.py (1332 of 1406) PASS: lldb-api :: functionalities/data-formatter/data-formatter-stl/libcxx/string/TestDataFormatterLibcxxString.py (1333 of 1406) PASS: lldb-api :: lang/objc/conflicting-definition/TestConflictingDefinition.py (1334 of 1406) PASS: lldb-shell :: ScriptInterpreter/None/none.test (1335 of 1406) UNSUPPORTED: lldb-shell :: SymbolFile/DWARF/x86/dwp-separate-debug-file.cpp (1336 of 1406) PASS: lldb-api :: python_api/exprpath_synthetic/TestExprPathSynthetic.py (1337 of 1406) PASS: lldb-api :: python_api/findvalue_duplist/TestSBFrameFindValue.py (1338 of 1406) UNSUPPORTED: lldb-api :: tools/lldb-server/TestGdbRemoteFork.py (1339 of 1406) PASS: lldb-api :: functionalities/object-file/TestImageListMultiArchitecture.py (1340 of 1406) PASS: lldb-api :: functionalities/data-formatter/array_typedef/TestArrayTypedef.py (1341 of 1406) PASS: lldb-shell :: Minidump/Windows/find-module.test (1342 of 1406) PASS: lldb-api :: commands/command/nested_alias/TestNestedAlias.py (1343 of 1406) UNSUPPORTED: lldb-shell :: Reproducer/TestDebugSymbols.test (1344 of 1406) PASS: lldb-api :: functionalities/testid/TestTestId.py (1345 of 1406) PASS: lldb-api :: functionalities/non-overlapping-index-variable-i/TestIndexVariable.py (1346 of 1406) PASS: lldb-shell :: ObjectFile/ELF/base-address.yaml (1347 of 1406) PASS: lldb-api :: functionalities/scripted_process/TestScriptedProcess.py (1348 of 1406) PASS: lldb-api :: commands/expression/function_template_specialization_temp_args/TestFunctionTemplateSpecializationTempArgs.py (1349 of 1406) PASS: lldb-api :: commands/expression/persistent_ptr_update/TestPersistentPtrUpdate.py (1350 of 1406) UNSUPPORTED: lldb-shell :: Subprocess/fork-follow-child.test (1351 of 1406) PASS: lldb-shell :: Process/Optimization.test (1352 of 1406) UNSUPPORTED: lldb-api :: commands/trace/TestTraceDumpInstructions.py (1353 of 1406) PASS: lldb-api :: lang/cpp/typedef/TestCppTypedef.py (1354 of 1406) UNSUPPORTED: lldb-shell :: SymbolFile/PDB/class-layout.test (1355 of 1406) PASS: lldb-api :: functionalities/breakpoint/debugbreak/TestDebugBreak.py (1356 of 1406) UNSUPPORTED: lldb-api :: functionalities/deleted-executable/TestDeletedExecutable.py (1357 of 1406) UNSUPPORTED: lldb-api :: benchmarks/expression/TestRepeatedExprs.py (1358 of 1406) PASS: lldb-api :: functionalities/data-formatter/data-formatter-advanced/TestDataFormatterAdv.py (1359 of 1406) PASS: lldb-api :: commands/expression/argument_passing_restrictions/TestArgumentPassingRestrictions.py (1360 of 1406) UNSUPPORTED: lldb-shell :: SymbolFile/DWARF/x86/DW_TAG_GNU_call_site-DW_AT_low_pc.s (1361 of 1406) PASS: lldb-api :: lang/objc/ptr_refs/TestPtrRefsObjC.py (1362 of 1406) PASS: lldb-shell :: Breakpoint/single-file-split-dwarf.test (1363 of 1406) PASS: lldb-api :: functionalities/completion/TestCompletion.py (1364 of 1406) PASS: lldb-api :: lang/cpp/gmodules-templates/TestGModules.py (1365 of 1406) PASS: lldb-api :: python_api/debugger/TestDebuggerAPI.py (1366 of 1406) PASS: lldb-api :: functionalities/data-formatter/synthupdate/TestSyntheticFilterRecompute.py (1367 of 1406) PASS: lldb-shell :: SymbolFile/DWARF/x86/DW_AT_location-DW_AT_const_value.s (1368 of 1406) UNSUPPORTED: lldb-shell :: SymbolFile/NativePDB/s_constant.cpp (1369 of 1406) UNSUPPORTED: lldb-shell :: Reproducer/TestDriverOptions.test (1370 of 1406) PASS: lldb-api :: functionalities/signal/handle-abrt/TestHandleAbort.py (1371 of 1406) PASS: lldb-api :: macosx/duplicate-archive-members/TestDuplicateMembers.py (1372 of 1406) PASS: lldb-shell :: ObjectFile/PECOFF/symbol.yaml (1373 of 1406) UNSUPPORTED: lldb-api :: functionalities/thread/concurrent_events/TestConcurrentTwoWatchpointsOneBreakpoint.py (1374 of 1406) UNSUPPORTED: lldb-shell :: Reproducer/TestLuaImport.test (1375 of 1406) PASS: lldb-shell :: SymbolFile/DWARF/x86/DW_AT_const_value-bitfields.s (1376 of 1406) PASS: lldb-shell :: SymbolFile/DWARF/x86/apple-index-is-used.cpp (1377 of 1406) PASS: lldb-api :: macosx/lc-note/kern-ver-str/TestKernVerStrLCNOTE.py (1378 of 1406) UNSUPPORTED: lldb-api :: macosx/thread-names/TestInterruptThreadNames.py (1379 of 1406) PASS: lldb-api :: commands/frame/diagnose/array/TestArray.py (1380 of 1406) PASS: lldb-api :: lang/c/vla/TestVLA.py (1381 of 1406) UNSUPPORTED: lldb-shell :: ScriptInterpreter/Lua/partial_statements.test (1382 of 1406) PASS: lldb-shell :: Settings/TestEchoCommands.test (1383 of 1406) PASS: lldb-api :: lang/cpp/static_member_type_depending_on_parent_size/TestStaticMemberTypeDependingOnParentSize.py (1384 of 1406) PASS: lldb-api :: functionalities/thread/concurrent_events/TestConcurrentTwoBreakpointsOneSignal.py (1385 of 1406) PASS: lldb-api :: commands/frame/var-scope/TestFrameVariableScope.py (1386 of 1406) PASS: lldb-api :: functionalities/data-formatter/data-formatter-stl/libcxx/deque/TestDataFormatterLibcxxDeque.py (1387 of 1406) PASS: lldb-api :: functionalities/gdb_remote_client/TestqOffsets.py (1388 of 1406) UNSUPPORTED: lldb-api :: commands/expression/import-std-module/pair/TestPairFromStdModule.py (1389 of 1406) UNSUPPORTED: lldb-api :: commands/process/launch/TestProcessLaunch.py (1390 of 1406) PASS: lldb-shell :: Process/UnsupportedLanguage.test (1391 of 1406) PASS: lldb-api :: lang/cpp/virtual-functions/TestCppVirtualFunctions.py (1392 of 1406) PASS: lldb-api :: functionalities/rerun/TestRerun.py (1393 of 1406) PASS: lldb-api :: commands/expression/inline-namespace/TestInlineNamespace.py (1394 of 1406) PASS: lldb-api :: functionalities/step-avoids-no-debug/TestStepNoDebug.py (1395 of 1406) PASS: lldb-api :: functionalities/inline-stepping/TestInlineStepping.py (1396 of 1406) PASS: lldb-api :: lang/objcxx/conflicting-names-class-update-utility-expr/TestObjCConflictingNamesForClassUpdateExpr.py (1397 of 1406) PASS: lldb-api :: functionalities/data-formatter/data-formatter-objc/TestDataFormatterObjCNSNumber.py (1398 of 1406) PASS: lldb-api :: python_api/target/TestTargetAPI.py (1399 of 1406) PASS: lldb-api :: python_api/lldbutil/iter/TestLLDBIterator.py (1400 of 1406) PASS: lldb-api :: tools/lldb-server/TestGdbRemoteProcessInfo.py (1401 of 1406) PASS: lldb-api :: lang/objc/foundation/TestObjCMethods.py (1402 of 1406) PASS: lldb-api :: functionalities/inferior-crashing/TestInferiorCrashingStep.py (1403 of 1406) PASS: lldb-api :: functionalities/load_unload/TestLoadUnload.py (1404 of 1406) PASS: lldb-api :: api/multithreaded/TestMultithreaded.py (1405 of 1406) FAIL: lldb-api :: tools/lldb-server/TestLldbGdbServer.py (1406 of 1406) ******************** TEST 'lldb-api :: tools/lldb-server/TestLldbGdbServer.py' FAILED ******************** Script: -- /usr/local/Frameworks/Python.framework/Versions/3.7/bin/python3.7 /Users/buildslave/jenkins/workspace/lldb-cmake-matrix/llvm-project/lldb/test/API/dotest.py -u CXXFLAGS -u CFLAGS --codesign-identity lldb_codesign --arch x86_64 --build-dir /Users/buildslave/jenkins/workspace/lldb-cmake-matrix/lldb-build/lldb-test-build.noindex -t --env TERM=vt100 --skip-category gmodules --skip-category watchpoint --arch=x86_64 --env LLVM_LIBS_DIR=/Users/buildslave/jenkins/workspace/lldb-cmake-matrix/lldb-build/./lib --arch x86_64 --build-dir /Users/buildslave/jenkins/workspace/lldb-cmake-matrix/lldb-build/lldb-test-build.noindex --lldb-module-cache-dir /Users/buildslave/jenkins/workspace/lldb-cmake-matrix/lldb-build/lldb-test-build.noindex/module-cache-lldb/lldb-api --clang-module-cache-dir /Users/buildslave/jenkins/workspace/lldb-cmake-matrix/lldb-build/lldb-test-build.noindex/module-cache-clang/lldb-api --executable /Users/buildslave/jenkins/workspace/lldb-cmake-matrix/lldb-build/./bin/lldb --compiler /Users/buildslave/jenkins/workspace/lldb-cmake-matrix/clang_900_build/bin/clang --dsymutil /Users/buildslave/jenkins/workspace/lldb-cmake-matrix/lldb-build/./bin/dsymutil --llvm-tools-dir /Users/buildslave/jenkins/workspace/lldb-cmake-matrix/lldb-build/./bin --lldb-libs-dir /Users/buildslave/jenkins/workspace/lldb-cmake-matrix/lldb-build/./lib --skip-category=lldb-vscode --skip-category=std-module /Users/buildslave/jenkins/workspace/lldb-cmake-matrix/llvm-project/lldb/test/API/tools/lldb-server -p TestLldbGdbServer.py --capture-path /Users/buildslave/jenkins/workspace/lldb-cmake-matrix/lldb-build/lldb-test-build.noindex/reproducers/TestLldbGdbServer.py -- Exit Code: 1

Hide Details

Command Output (stdout): -- lldb version 14.0.99 (http://labmaster3.local/git/llvm-project.git revision 9689c1b7bb77d65e8acc9a13e5e416803d38b02f) clang revision 9689c1b7bb77d65e8acc9a13e5e416803d38b02f llvm revision 9689c1b7bb77d65e8acc9a13e5e416803d38b02f Skipping the following test categories: ['gmodules', 'watchpoint', 'lldb-vscode', 'std-module', 'libstdcxx', 'dwo', 'llgs', 'fork']

Hide Details

-- Command Output (stderr): -- Change dir to: /Users/buildslave/jenkins/workspace/lldb-cmake-matrix/llvm-project/lldb/test/API/tools/lldb-server XFAIL: LLDB (/Users/buildslave/jenkins/workspace/lldb-cmake-matrix/clang_900_build/bin/clang-x86_64) :: test_Hc_then_Csignal_signals_correct_thread_launch_debugserver (TestLldbGdbServer.LldbGdbServerTestCase) UNSUPPORTED: LLDB (/Users/buildslave/jenkins/workspace/lldb-cmake-matrix/clang_900_build/bin/clang-x86_64) :: test_Hc_then_Csignal_signals_correct_thread_launch_llgs (TestLldbGdbServer.LldbGdbServerTestCase) (test case does not fall in any category of interest for this run) UNSUPPORTED: LLDB (/Users/buildslave/jenkins/workspace/lldb-cmake-matrix/clang_900_build/bin/clang-x86_64) :: test_Hg_fails_on_another_pid_llgs (TestLldbGdbServer.LldbGdbServerTestCase) (test case does not fall in any category of interest for this run) UNSUPPORTED: LLDB (/Users/buildslave/jenkins/workspace/lldb-cmake-matrix/clang_900_build/bin/clang-x86_64) :: test_Hg_fails_on_minus_one_pid_llgs (TestLldbGdbServer.LldbGdbServerTestCase) (test case does not fall in any category of interest for this run) UNSUPPORTED: LLDB (/Users/buildslave/jenkins/workspace/lldb-cmake-matrix/clang_900_build/bin/clang-x86_64) :: test_Hg_fails_on_zero_pid_llgs (TestLldbGdbServer.LldbGdbServerTestCase) (test case does not fall in any category of interest for this run) PASS: LLDB (/Users/buildslave/jenkins/workspace/lldb-cmake-matrix/clang_900_build/bin/clang-x86_64) :: test_Hg_switches_to_3_threads_attach_debugserver (TestLldbGdbServer.LldbGdbServerTestCase) UNSUPPORTED: LLDB (/Users/buildslave/jenkins/workspace/lldb-cmake-matrix/clang_900_build/bin/clang-x86_64) :: test_Hg_switches_to_3_threads_attach_llgs (TestLldbGdbServer.LldbGdbServerTestCase) (test case does not fall in any category of interest for this run) UNSUPPORTED: LLDB (/Users/buildslave/jenkins/workspace/lldb-cmake-matrix/clang_900_build/bin/clang-x86_64) :: test_Hg_switches_to_3_threads_attach_pass_correct_pid_llgs (TestLldbGdbServer.LldbGdbServerTestCase) (test case does not fall in any category of interest for this run) FAIL: LLDB (/Users/buildslave/jenkins/workspace/lldb-cmake-matrix/clang_900_build/bin/clang-x86_64) :: test_Hg_switches_to_3_threads_launch_debugserver (TestLldbGdbServer.LldbGdbServerTestCase) UNSUPPORTED: LLDB (/Users/buildslave/jenkins/workspace/lldb-cmake-matrix/clang_900_build/bin/clang-x86_64) :: test_Hg_switches_to_3_threads_launch_llgs (TestLldbGdbServer.LldbGdbServerTestCase) (test case does not fall in any category of interest for this run) PASS: LLDB (/Users/buildslave/jenkins/workspace/lldb-cmake-matrix/clang_900_build/bin/clang-x86_64) :: test_P_and_p_thread_suffix_work_debugserver (TestLldbGdbServer.LldbGdbServerTestCase) UNSUPPORTED: LLDB (/Users/buildslave/jenkins/workspace/lldb-cmake-matrix/clang_900_build/bin/clang-x86_64) :: test_P_and_p_thread_suffix_work_llgs (TestLldbGdbServer.LldbGdbServerTestCase) (test case does not fall in any category of interest for this run) successful writes: 7, failed writes: 11

Hide Details

PASS: LLDB (/Users/buildslave/jenkins/workspace/lldb-cmake-matrix/clang_900_build/bin/clang-x86_64) :: test_P_writes_all_gpr_registers_debugserver (TestLldbGdbServer.LldbGdbServerTestCase) UNSUPPORTED: LLDB (/Users/buildslave/jenkins/workspace/lldb-cmake-matrix/clang_900_build/bin/clang-x86_64) :: test_P_writes_all_gpr_registers_llgs (TestLldbGdbServer.LldbGdbServerTestCase) (test case does not fall in any category of interest for this run) UNSUPPORTED: LLDB (/Users/buildslave/jenkins/workspace/lldb-cmake-matrix/clang_900_build/bin/clang-x86_64) :: test_QEnvironmentHexEncoded_llgs (TestLldbGdbServer.LldbGdbServerTestCase) (test case does not fall in any category of interest for this run) UNSUPPORTED: LLDB (/Users/buildslave/jenkins/workspace/lldb-cmake-matrix/clang_900_build/bin/clang-x86_64) :: test_QEnvironment_llgs (TestLldbGdbServer.LldbGdbServerTestCase) (test case does not fall in any category of interest for this run) PASS: LLDB (/Users/buildslave/jenkins/workspace/lldb-cmake-matrix/clang_900_build/bin/clang-x86_64) :: test_attach_commandline_continue_app_exits_debugserver (TestLldbGdbServer.LldbGdbServerTestCase) UNSUPPORTED: LLDB (/Users/buildslave/jenkins/workspace/lldb-cmake-matrix/clang_900_build/bin/clang-x86_64) :: test_attach_commandline_continue_app_exits_llgs (TestLldbGdbServer.LldbGdbServerTestCase) (test case does not fall in any category of interest for this run) PASS: LLDB (/Users/buildslave/jenkins/workspace/lldb-cmake-matrix/clang_900_build/bin/clang-x86_64) :: test_c_packet_works_debugserver (TestLldbGdbServer.LldbGdbServerTestCase) UNSUPPORTED: LLDB (/Users/buildslave/jenkins/workspace/lldb-cmake-matrix/clang_900_build/bin/clang-x86_64) :: test_c_packet_works_llgs (TestLldbGdbServer.LldbGdbServerTestCase) (test case does not fall in any category of interest for this run) PASS: LLDB (/Users/buildslave/jenkins/workspace/lldb-cmake-matrix/clang_900_build/bin/clang-x86_64) :: test_first_launch_stop_reply_thread_matches_first_qC_debugserver (TestLldbGdbServer.LldbGdbServerTestCase) UNSUPPORTED: LLDB (/Users/buildslave/jenkins/workspace/lldb-cmake-matrix/clang_900_build/bin/clang-x86_64) :: test_first_launch_stop_reply_thread_matches_first_qC_llgs (TestLldbGdbServer.LldbGdbServerTestCase) (test case does not fall in any category of interest for this run) UNSUPPORTED: LLDB (/Users/buildslave/jenkins/workspace/lldb-cmake-matrix/clang_900_build/bin/clang-x86_64) :: test_hardware_breakpoint_set_and_remove_work_debugserver (TestLldbGdbServer.LldbGdbServerTestCase) (requires one of linux) UNSUPPORTED: LLDB (/Users/buildslave/jenkins/workspace/lldb-cmake-matrix/clang_900_build/bin/clang-x86_64) :: test_hardware_breakpoint_set_and_remove_work_llgs (TestLldbGdbServer.LldbGdbServerTestCase) (test case does not fall in any category of interest for this run) PASS: LLDB (/Users/buildslave/jenkins/workspace/lldb-cmake-matrix/clang_900_build/bin/clang-x86_64) :: test_inferior_print_exit_debugserver (TestLldbGdbServer.LldbGdbServerTestCase) UNSUPPORTED: LLDB (/Users/buildslave/jenkins/workspace/lldb-cmake-matrix/clang_900_build/bin/clang-x86_64) :: test_inferior_print_exit_llgs (TestLldbGdbServer.LldbGdbServerTestCase) (test case does not fall in any category of interest for this run) UNSUPPORTED: LLDB (/Users/buildslave/jenkins/workspace/lldb-cmake-matrix/clang_900_build/bin/clang-x86_64) :: test_launch_via_A_llgs (TestLldbGdbServer.LldbGdbServerTestCase) (test case does not fall in any category of interest for this run) UNSUPPORTED: LLDB (/Users/buildslave/jenkins/workspace/lldb-cmake-matrix/clang_900_build/bin/clang-x86_64) :: test_launch_via_vRun_llgs (TestLldbGdbServer.LldbGdbServerTestCase) (test case does not fall in any category of interest for this run) UNSUPPORTED: LLDB (/Users/buildslave/jenkins/workspace/lldb-cmake-matrix/clang_900_build/bin/clang-x86_64) :: test_launch_via_vRun_no_args_llgs (TestLldbGdbServer.LldbGdbServerTestCase) (test case does not fall in any category of interest for this run) PASS: LLDB (/Users/buildslave/jenkins/workspace/lldb-cmake-matrix/clang_900_build/bin/clang-x86_64) :: test_list_threads_in_stop_reply_supported_debugserver (TestLldbGdbServer.LldbGdbServerTestCase) UNSUPPORTED: LLDB (/Users/buildslave/jenkins/workspace/lldb-cmake-matrix/clang_900_build/bin/clang-x86_64) :: test_list_threads_in_stop_reply_supported_llgs (TestLldbGdbServer.LldbGdbServerTestCase) (test case does not fall in any category of interest for this run) PASS: LLDB (/Users/buildslave/jenkins/workspace/lldb-cmake-matrix/clang_900_build/bin/clang-x86_64) :: test_m_packet_reads_memory_debugserver (TestLldbGdbServer.LldbGdbServerTestCase) UNSUPPORTED: LLDB (/Users/buildslave/jenkins/workspace/lldb-cmake-matrix/clang_900_build/bin/clang-x86_64) :: test_m_packet_reads_memory_llgs (TestLldbGdbServer.LldbGdbServerTestCase) (test case does not fall in any category of interest for this run) PASS: LLDB (/Users/buildslave/jenkins/workspace/lldb-cmake-matrix/clang_900_build/bin/clang-x86_64) :: test_p_returns_correct_data_size_for_each_qRegisterInfo_launch_debugserver (TestLldbGdbServer.LldbGdbServerTestCase) UNSUPPORTED: LLDB (/Users/buildslave/jenkins/workspace/lldb-cmake-matrix/clang_900_build/bin/clang-x86_64) :: test_p_returns_correct_data_size_for_each_qRegisterInfo_launch_llgs (TestLldbGdbServer.LldbGdbServerTestCase) (test case does not fall in any category of interest for this run) PASS: LLDB (/Users/buildslave/jenkins/workspace/lldb-cmake-matrix/clang_900_build/bin/clang-x86_64) :: test_qMemoryRegionInfo_is_supported_debugserver (TestLldbGdbServer.LldbGdbServerTestCase) UNSUPPORTED: LLDB (/Users/buildslave/jenkins/workspace/lldb-cmake-matrix/clang_900_build/bin/clang-x86_64) :: test_qMemoryRegionInfo_is_supported_llgs (TestLldbGdbServer.LldbGdbServerTestCase) (test case does not fall in any category of interest for this run) PASS: LLDB (/Users/buildslave/jenkins/workspace/lldb-cmake-matrix/clang_900_build/bin/clang-x86_64) :: test_qMemoryRegionInfo_reports_code_address_as_executable_debugserver (TestLldbGdbServer.LldbGdbServerTestCase) UNSUPPORTED: LLDB (/Users/buildslave/jenkins/workspace/lldb-cmake-matrix/clang_900_build/bin/clang-x86_64) :: test_qMemoryRegionInfo_reports_code_address_as_executable_llgs (TestLldbGdbServer.LldbGdbServerTestCase) (test case does not fall in any category of interest for this run) PASS: LLDB (/Users/buildslave/jenkins/workspace/lldb-cmake-matrix/clang_900_build/bin/clang-x86_64) :: test_qMemoryRegionInfo_reports_heap_address_as_rw_debugserver (TestLldbGdbServer.LldbGdbServerTestCase) UNSUPPORTED: LLDB (/Users/buildslave/jenkins/workspace/lldb-cmake-matrix/clang_900_build/bin/clang-x86_64) :: test_qMemoryRegionInfo_reports_heap_address_as_rw_llgs (TestLldbGdbServer.LldbGdbServerTestCase) (test case does not fall in any category of interest for this run) PASS: LLDB (/Users/buildslave/jenkins/workspace/lldb-cmake-matrix/clang_900_build/bin/clang-x86_64) :: test_qMemoryRegionInfo_reports_stack_address_as_rw_debugserver (TestLldbGdbServer.LldbGdbServerTestCase) UNSUPPORTED: LLDB (/Users/buildslave/jenkins/workspace/lldb-cmake-matrix/clang_900_build/bin/clang-x86_64) :: test_qMemoryRegionInfo_reports_stack_address_as_rw_llgs (TestLldbGdbServer.LldbGdbServerTestCase) (test case does not fall in any category of interest for this run) PASS: LLDB (/Users/buildslave/jenkins/workspace/lldb-cmake-matrix/clang_900_build/bin/clang-x86_64) :: test_qRegisterInfo_contains_at_least_one_register_set_debugserver (TestLldbGdbServer.LldbGdbServerTestCase) UNSUPPORTED: LLDB (/Users/buildslave/jenkins/workspace/lldb-cmake-matrix/clang_900_build/bin/clang-x86_64) :: test_qRegisterInfo_contains_at_least_one_register_set_llgs (TestLldbGdbServer.LldbGdbServerTestCase) (test case does not fall in any category of interest for this run) UNSUPPORTED: LLDB (/Users/buildslave/jenkins/workspace/lldb-cmake-matrix/clang_900_build/bin/clang-x86_64) :: test_qRegisterInfo_contains_avx_registers_llgs (TestLldbGdbServer.LldbGdbServerTestCase) (test case does not fall in any category of interest for this run) PASS: LLDB (/Users/buildslave/jenkins/workspace/lldb-cmake-matrix/clang_900_build/bin/clang-x86_64) :: test_qRegisterInfo_contains_required_generics_debugserver_debugserver (TestLldbGdbServer.LldbGdbServerTestCase) UNSUPPORTED: LLDB (/Users/buildslave/jenkins/workspace/lldb-cmake-matrix/clang_900_build/bin/clang-x86_64) :: test_qRegisterInfo_contains_required_generics_debugserver_llgs (TestLldbGdbServer.LldbGdbServerTestCase) (test case does not fall in any category of interest for this run) PASS: LLDB (/Users/buildslave/jenkins/workspace/lldb-cmake-matrix/clang_900_build/bin/clang-x86_64) :: test_qRegisterInfo_returns_all_valid_results_debugserver (TestLldbGdbServer.LldbGdbServerTestCase) UNSUPPORTED: LLDB (/Users/buildslave/jenkins/workspace/lldb-cmake-matrix/clang_900_build/bin/clang-x86_64) :: test_qRegisterInfo_returns_all_valid_results_llgs (TestLldbGdbServer.LldbGdbServerTestCase) (test case does not fall in any category of interest for this run) PASS: LLDB (/Users/buildslave/jenkins/workspace/lldb-cmake-matrix/clang_900_build/bin/clang-x86_64) :: test_qRegisterInfo_returns_one_valid_result_debugserver (TestLldbGdbServer.LldbGdbServerTestCase) UNSUPPORTED: LLDB (/Users/buildslave/jenkins/workspace/lldb-cmake-matrix/clang_900_build/bin/clang-x86_64) :: test_qRegisterInfo_returns_one_valid_result_llgs (TestLldbGdbServer.LldbGdbServerTestCase) (test case does not fall in any category of interest for this run) PASS: LLDB (/Users/buildslave/jenkins/workspace/lldb-cmake-matrix/clang_900_build/bin/clang-x86_64) :: test_qSupported_QPassSignals_debugserver (TestLldbGdbServer.LldbGdbServerTestCase) UNSUPPORTED: LLDB (/Users/buildslave/jenkins/workspace/lldb-cmake-matrix/clang_900_build/bin/clang-x86_64) :: test_qSupported_QPassSignals_llgs (TestLldbGdbServer.LldbGdbServerTestCase) (test case does not fall in any category of interest for this run) PASS: LLDB (/Users/buildslave/jenkins/workspace/lldb-cmake-matrix/clang_900_build/bin/clang-x86_64) :: test_qSupported_auvx_debugserver (TestLldbGdbServer.LldbGdbServerTestCase) UNSUPPORTED: LLDB (/Users/buildslave/jenkins/workspace/lldb-cmake-matrix/clang_900_build/bin/clang-x86_64) :: test_qSupported_auvx_llgs (TestLldbGdbServer.LldbGdbServerTestCase) (test case does not fall in any category of interest for this run) UNSUPPORTED: LLDB (/Users/buildslave/jenkins/workspace/lldb-cmake-matrix/clang_900_build/bin/clang-x86_64) :: test_qSupported_fork_events_debugserver (TestLldbGdbServer.LldbGdbServerTestCase) (test case does not fall in any category of interest for this run) UNSUPPORTED: LLDB (/Users/buildslave/jenkins/workspace/lldb-cmake-matrix/clang_900_build/bin/clang-x86_64) :: test_qSupported_fork_events_llgs (TestLldbGdbServer.LldbGdbServerTestCase) (test case does not fall in any category of interest for this run) UNSUPPORTED: LLDB (/Users/buildslave/jenkins/workspace/lldb-cmake-matrix/clang_900_build/bin/clang-x86_64) :: test_qSupported_fork_events_without_multiprocess_debugserver (TestLldbGdbServer.LldbGdbServerTestCase) (test case does not fall in any category of interest for this run) UNSUPPORTED: LLDB (/Users/buildslave/jenkins/workspace/lldb-cmake-matrix/clang_900_build/bin/clang-x86_64) :: test_qSupported_fork_events_without_multiprocess_llgs (TestLldbGdbServer.LldbGdbServerTestCase) (test case does not fall in any category of interest for this run) PASS: LLDB (/Users/buildslave/jenkins/workspace/lldb-cmake-matrix/clang_900_build/bin/clang-x86_64) :: test_qSupported_libraries_svr4_debugserver (TestLldbGdbServer.LldbGdbServerTestCase) UNSUPPORTED: LLDB (/Users/buildslave/jenkins/workspace/lldb-cmake-matrix/clang_900_build/bin/clang-x86_64) :: test_qSupported_libraries_svr4_llgs (TestLldbGdbServer.LldbGdbServerTestCase) (test case does not fall in any category of interest for this run) PASS: LLDB (/Users/buildslave/jenkins/workspace/lldb-cmake-matrix/clang_900_build/bin/clang-x86_64) :: test_qSupported_memory_tagging_debugserver (TestLldbGdbServer.LldbGdbServerTestCase) UNSUPPORTED: LLDB (/Users/buildslave/jenkins/workspace/lldb-cmake-matrix/clang_900_build/bin/clang-x86_64) :: test_qSupported_memory_tagging_llgs (TestLldbGdbServer.LldbGdbServerTestCase) (test case does not fall in any category of interest for this run) PASS: LLDB (/Users/buildslave/jenkins/workspace/lldb-cmake-matrix/clang_900_build/bin/clang-x86_64) :: test_qSupported_returns_known_stub_features_debugserver (TestLldbGdbServer.LldbGdbServerTestCase) UNSUPPORTED: LLDB (/Users/buildslave/jenkins/workspace/lldb-cmake-matrix/clang_900_build/bin/clang-x86_64) :: test_qSupported_returns_known_stub_features_llgs (TestLldbGdbServer.LldbGdbServerTestCase) (test case does not fall in any category of interest for this run) UNSUPPORTED: LLDB (/Users/buildslave/jenkins/workspace/lldb-cmake-matrix/clang_900_build/bin/clang-x86_64) :: test_qSupported_vfork_events_debugserver (TestLldbGdbServer.LldbGdbServerTestCase) (test case does not fall in any category of interest for this run) UNSUPPORTED: LLDB (/Users/buildslave/jenkins/workspace/lldb-cmake-matrix/clang_900_build/bin/clang-x86_64) :: test_qSupported_vfork_events_llgs (TestLldbGdbServer.LldbGdbServerTestCase) (test case does not fall in any category of interest for this run) UNSUPPORTED: LLDB (/Users/buildslave/jenkins/workspace/lldb-cmake-matrix/clang_900_build/bin/clang-x86_64) :: test_qSupported_vfork_events_without_multiprocess_debugserver (TestLldbGdbServer.LldbGdbServerTestCase) (test case does not fall in any category of interest for this run) UNSUPPORTED: LLDB (/Users/buildslave/jenkins/workspace/lldb-cmake-matrix/clang_900_build/bin/clang-x86_64) :: test_qSupported_vfork_events_without_multiprocess_llgs (TestLldbGdbServer.LldbGdbServerTestCase) (test case does not fall in any category of interest for this run) PASS: LLDB (/Users/buildslave/jenkins/workspace/lldb-cmake-matrix/clang_900_build/bin/clang-x86_64) :: test_qThreadInfo_contains_thread_attach_debugserver (TestLldbGdbServer.LldbGdbServerTestCase) UNSUPPORTED: LLDB (/Users/buildslave/jenkins/workspace/lldb-cmake-matrix/clang_900_build/bin/clang-x86_64) :: test_qThreadInfo_contains_thread_attach_llgs (TestLldbGdbServer.LldbGdbServerTestCase) (test case does not fall in any category of interest for this run) PASS: LLDB (/Users/buildslave/jenkins/workspace/lldb-cmake-matrix/clang_900_build/bin/clang-x86_64) :: test_qThreadInfo_contains_thread_launch_debugserver (TestLldbGdbServer.LldbGdbServerTestCase) UNSUPPORTED: LLDB (/Users/buildslave/jenkins/workspace/lldb-cmake-matrix/clang_900_build/bin/clang-x86_64) :: test_qThreadInfo_contains_thread_launch_llgs (TestLldbGdbServer.LldbGdbServerTestCase) (test case does not fall in any category of interest for this run) PASS: LLDB (/Users/buildslave/jenkins/workspace/lldb-cmake-matrix/clang_900_build/bin/clang-x86_64) :: test_qThreadInfo_matches_qC_attach_debugserver (TestLldbGdbServer.LldbGdbServerTestCase) UNSUPPORTED: LLDB (/Users/buildslave/jenkins/workspace/lldb-cmake-matrix/clang_900_build/bin/clang-x86_64) :: test_qThreadInfo_matches_qC_attach_llgs (TestLldbGdbServer.LldbGdbServerTestCase) (test case does not fall in any category of interest for this run) PASS: LLDB (/Users/buildslave/jenkins/workspace/lldb-cmake-matrix/clang_900_build/bin/clang-x86_64) :: test_qThreadInfo_matches_qC_launch_debugserver (TestLldbGdbServer.LldbGdbServerTestCase) UNSUPPORTED: LLDB (/Users/buildslave/jenkins/workspace/lldb-cmake-matrix/clang_900_build/bin/clang-x86_64) :: test_qThreadInfo_matches_qC_launch_llgs (TestLldbGdbServer.LldbGdbServerTestCase) (test case does not fall in any category of interest for this run) PASS: LLDB (/Users/buildslave/jenkins/workspace/lldb-cmake-matrix/clang_900_build/bin/clang-x86_64) :: test_software_breakpoint_set_and_remove_work_debugserver (TestLldbGdbServer.LldbGdbServerTestCase) UNSUPPORTED: LLDB (/Users/buildslave/jenkins/workspace/lldb-cmake-matrix/clang_900_build/bin/clang-x86_64) :: test_software_breakpoint_set_and_remove_work_llgs (TestLldbGdbServer.LldbGdbServerTestCase) (test case does not fall in any category of interest for this run) PASS: LLDB (/Users/buildslave/jenkins/workspace/lldb-cmake-matrix/clang_900_build/bin/clang-x86_64) :: test_thread_suffix_supported_debugserver (TestLldbGdbServer.LldbGdbServerTestCase) UNSUPPORTED: LLDB (/Users/buildslave/jenkins/workspace/lldb-cmake-matrix/clang_900_build/bin/clang-x86_64) :: test_thread_suffix_supported_llgs (TestLldbGdbServer.LldbGdbServerTestCase) (test case does not fall in any category of interest for this run) PASS: LLDB (/Users/buildslave/jenkins/workspace/lldb-cmake-matrix/clang_900_build/bin/clang-x86_64) :: test_written_M_content_reads_back_correctly_debugserver (TestLldbGdbServer.LldbGdbServerTestCase) UNSUPPORTED: LLDB (/Users/buildslave/jenkins/workspace/lldb-cmake-matrix/clang_900_build/bin/clang-x86_64) :: test_written_M_content_reads_back_correctly_llgs (TestLldbGdbServer.LldbGdbServerTestCase) (test case does not fall in any category of interest for this run) Restore dir to: /Users/buildslave/jenkins/workspace/lldb-cmake-matrix/lldb-build/tools/lldb/test ====================================================================== ERROR: test_Hg_switches_to_3_threads_launch_debugserver (TestLldbGdbServer.LldbGdbServerTestCase) ---------------------------------------------------------------------- Traceback (most recent call last): File "/Users/buildslave/jenkins/workspace/lldb-cmake-matrix/llvm-project/lldb/packages/Python/lldbsuite/test/tools/lldb-server/gdbremote_testcase.py", line 52, in test_method return attrvalue(self) File "/Users/buildslave/jenkins/workspace/lldb-cmake-matrix/llvm-project/lldb/packages/Python/lldbsuite/test/decorators.py", line 119, in wrapper func(*args, **kwargs) File "/Users/buildslave/jenkins/workspace/lldb-cmake-matrix/llvm-project/lldb/test/API/tools/lldb-server/TestLldbGdbServer.py", line 396, in test_Hg_switches_to_3_threads_launch self.Hg_switches_to_3_threads() File "/Users/buildslave/jenkins/workspace/lldb-cmake-matrix/llvm-project/lldb/test/API/tools/lldb-server/TestLldbGdbServer.py", line 367, in Hg_switches_to_3_threads threads = self.wait_for_thread_count(3) File "/Users/buildslave/jenkins/workspace/lldb-cmake-matrix/llvm-project/lldb/packages/Python/lldbsuite/test/tools/lldb-server/gdbremote_testcase.py", line 798, in wait_for_thread_count self.DEFAULT_TIMEOUT, thread_count, actual_thread_count)) Exception: timed out after 20 seconds while waiting for theads: waiting for at least 3 threads, found 1 Config=x86_64-/Users/buildslave/jenkins/workspace/lldb-cmake-matrix/clang_900_build/bin/clang ---------------------------------------------------------------------- Ran 84 tests in 111.338s

Hide Details

RESULT: FAILED (30 passes, 0 failures, 1 errors, 52 skipped, 1 expected failures, 0 unexpected successes)

Hide Details

--

Hide Details

******************** Slowest Tests: -------------------------------------------------------------------------- 111.70s: lldb-api :: tools/lldb-server/TestLldbGdbServer.py 80.30s: lldb-api :: lang/objc/foundation/TestFoundationDisassembly.py 80.03s: lldb-api :: api/multithreaded/TestMultithreaded.py 42.68s: lldb-api :: types/TestLongTypesExpr.py 41.14s: lldb-api :: functionalities/completion/TestCompletion.py 40.62s: lldb-api :: lang/objc/exceptions/TestObjCExceptions.py 40.34s: lldb-api :: lang/cpp/namespace/TestNamespaceLookup.py 39.91s: lldb-api :: functionalities/limit-debug-info/TestLimitDebugInfo.py 36.51s: lldb-api :: tools/lldb-server/TestGdbRemoteThreadsInStopReply.py 33.82s: lldb-api :: types/TestLongTypes.py 33.19s: lldb-api :: lang/objc/objc-new-syntax/TestObjCNewSyntaxLiteral.py 28.44s: lldb-api :: commands/target/basic/TestTargetCommand.py 28.34s: lldb-api :: lang/c/anonymous/TestAnonymous.py 28.12s: lldb-api :: lang/objc/hidden-ivars/TestHiddenIvars.py 27.52s: lldb-api :: lang/objc/real-definition/TestRealDefinition.py 27.06s: lldb-api :: lang/objc/foundation/TestObjCMethods.py 26.46s: lldb-api :: commands/register/register/register_command/TestRegisters.py 26.43s: lldb-api :: functionalities/load_unload/TestLoadUnload.py 25.19s: lldb-api :: types/TestIntegerTypeExpr.py 24.25s: lldb-api :: lang/objc/objc-new-syntax/TestObjCNewSyntaxArray.py

Hide Details

Tests Times: -------------------------------------------------------------------------- [ Range ] :: [ Percentage ] :: [ Count ] -------------------------------------------------------------------------- [110s,120s) :: [ ] :: [ 1/1406] [100s,110s) :: [ ] :: [ 0/1406] [ 90s,100s) :: [ ] :: [ 0/1406] [ 80s, 90s) :: [ ] :: [ 2/1406] [ 70s, 80s) :: [ ] :: [ 0/1406] [ 60s, 70s) :: [ ] :: [ 0/1406] [ 50s, 60s) :: [ ] :: [ 0/1406] [ 40s, 50s) :: [ ] :: [ 5/1406] [ 30s, 40s) :: [ ] :: [ 6/1406] [ 20s, 30s) :: [ ] :: [ 17/1406] [ 10s, 20s) :: [** ] :: [ 83/1406] [ 0s, 10s) :: [************************************ ] :: [1292/1406] -------------------------------------------------------------------------- ******************** Failed Tests (4): lldb-api :: lang/cpp/modules-import/TestCXXModulesImport.py lldb-api :: lang/objc/modules-compile-error/TestModulesCompileError.py lldb-api :: python_api/process/TestProcessAPI.py lldb-api :: tools/lldb-server/TestLldbGdbServer.py

Hide Details

Hide Details

Testing Time: 325.89s Unsupported : 467 Passed : 926 Expectedly Failed: 9 Failed : 4 FAILED: tools/lldb/test/CMakeFiles/check-lldb-reproducers-capture cd /Users/buildslave/jenkins/workspace/lldb-cmake-matrix/lldb-build/tools/lldb/test && /usr/local/Frameworks/Python.framework/Versions/3.7/bin/python3.7 /Users/buildslave/jenkins/workspace/lldb-cmake-matrix/lldb-build/./bin/llvm-lit -v --time-tests --shuffle --xunit-xml-output=/Users/buildslave/jenkins/workspace/lldb-cmake-matrix/test/results.xml -v --param lldb-run-with-repro=capture /Users/buildslave/jenkins/workspace/lldb-cmake-matrix/lldb-build/tools/lldb/test/API /Users/buildslave/jenkins/workspace/lldb-cmake-matrix/lldb-build/tools/lldb/test/Shell ninja: build stopped: cannot make progress due to previous errors. Command failed: Command '['/usr/local/bin/ninja', '-k', '0', '-v', 'check-lldb-reproducers']' returned non-zero exit status 1. Command: ['/usr/local/bin/ninja', '-k', '0', '-v', 'check-lldb-reproducers'] + set -e [Pipeline] } [Pipeline] // timeout [Pipeline] } [Pipeline] // stage [Pipeline] } [Pipeline] // withEnv [Pipeline] } [Pipeline] // node [Pipeline] End of Pipeline Finished: UNSTABLE