Console Output

Skipping 112,663 KB.. Full Log
PASS: lldb-api :: functionalities/data-formatter/data-formatter-objc/TestDataFormatterObjNSException.py (301 of 1406)
PASS: lldb-shell :: BuildScript/compiler-full-path.test (302 of 1406)
UNSUPPORTED: lldb-api :: commands/expression/import-std-module/list-dbg-info-content/TestDbgInfoContentListFromStdModule.py (303 of 1406)
UNSUPPORTED: lldb-shell :: Reproducer/Modules/TestModuleCXX.test (304 of 1406)
PASS: lldb-shell :: ObjectFile/ELF/PT_LOAD-overlap-PT_INTERP.yaml (305 of 1406)
PASS: lldb-api :: functionalities/value_md5_crash/TestValueMD5Crash.py (306 of 1406)
PASS: lldb-shell :: Breakpoint/debug_rnglist_rlestartend.test (307 of 1406)
UNSUPPORTED: lldb-shell :: SymbolFile/PDB/udt-layout.test (308 of 1406)
UNSUPPORTED: lldb-shell :: ScriptInterpreter/Lua/breakpoint_callback.test (309 of 1406)
FAIL: lldb-api :: lang/cpp/modules-import/TestCXXModulesImport.py (310 of 1406)
******************** TEST 'lldb-api :: lang/cpp/modules-import/TestCXXModulesImport.py' FAILED ********************
Script:
--
/usr/local/Frameworks/Python.framework/Versions/3.7/bin/python3.7 /Users/buildslave/jenkins/workspace/lldb-cmake-matrix/llvm-project/lldb/test/API/dotest.py -u CXXFLAGS -u CFLAGS --codesign-identity lldb_codesign --arch x86_64 --build-dir /Users/buildslave/jenkins/workspace/lldb-cmake-matrix/lldb-build/lldb-test-build.noindex -t --env TERM=vt100 --skip-category gmodules --skip-category watchpoint --arch=x86_64 --env LLVM_LIBS_DIR=/Users/buildslave/jenkins/workspace/lldb-cmake-matrix/lldb-build/./lib --arch x86_64 --build-dir /Users/buildslave/jenkins/workspace/lldb-cmake-matrix/lldb-build/lldb-test-build.noindex --lldb-module-cache-dir /Users/buildslave/jenkins/workspace/lldb-cmake-matrix/lldb-build/lldb-test-build.noindex/module-cache-lldb/lldb-api --clang-module-cache-dir /Users/buildslave/jenkins/workspace/lldb-cmake-matrix/lldb-build/lldb-test-build.noindex/module-cache-clang/lldb-api --executable /Users/buildslave/jenkins/workspace/lldb-cmake-matrix/lldb-build/./bin/lldb --compiler /Users/buildslave/jenkins/workspace/lldb-cmake-matrix/clang_900_build/bin/clang --dsymutil /Users/buildslave/jenkins/workspace/lldb-cmake-matrix/lldb-build/./bin/dsymutil --llvm-tools-dir /Users/buildslave/jenkins/workspace/lldb-cmake-matrix/lldb-build/./bin --lldb-libs-dir /Users/buildslave/jenkins/workspace/lldb-cmake-matrix/lldb-build/./lib --skip-category=lldb-vscode --skip-category=std-module /Users/buildslave/jenkins/workspace/lldb-cmake-matrix/llvm-project/lldb/test/API/lang/cpp/modules-import -p TestCXXModulesImport.py --capture-path /Users/buildslave/jenkins/workspace/lldb-cmake-matrix/lldb-build/lldb-test-build.noindex/reproducers/TestCXXModulesImport.py
--
Exit Code: 1

Hide Details

Command Output (stdout): -- lldb version 14.0.99 (http://labmaster3.local/git/llvm-project.git revision e7249e4acf3cf9438d6d9e02edecebd5b622a4dc) clang revision e7249e4acf3cf9438d6d9e02edecebd5b622a4dc llvm revision e7249e4acf3cf9438d6d9e02edecebd5b622a4dc Skipping the following test categories: ['gmodules', 'watchpoint', 'lldb-vscode', 'std-module', 'libstdcxx', 'dwo', 'llgs', 'fork']

Hide Details

-- Command Output (stderr): -- Change dir to: /Users/buildslave/jenkins/workspace/lldb-cmake-matrix/llvm-project/lldb/test/API/lang/cpp/modules-import runCmd: settings clear -all output:

Hide Details

runCmd: settings set symbols.enable-external-lookup false output:

Hide Details

runCmd: settings set target.inherit-tcc true output:

Hide Details

runCmd: settings set target.detach-on-error false output:

Hide Details

runCmd: settings set target.auto-apply-fixits false output:

Hide Details

runCmd: settings set plugin.process.gdb-remote.packet-timeout 60 output:

Hide Details

runCmd: settings set symbols.clang-modules-cache-path "/Users/buildslave/jenkins/workspace/lldb-cmake-matrix/lldb-build/lldb-test-build.noindex/module-cache-lldb/lldb-api" output:

Hide Details

runCmd: settings set use-color false output:

Hide Details

runCmd: setting set target.prefer-dynamic-value no-dynamic-values output:

Hide Details

runCmd: expr -l Objective-C++ -- @import Bar runCmd failed! error: expression failed to parse: error: Header search couldn't locate module Foo

Hide Details

error: while importing modules: error: Header search couldn't locate module Bar

Hide Details

Hide Details

Hide Details

FAIL: LLDB (/Users/buildslave/jenkins/workspace/lldb-cmake-matrix/clang_900_build/bin/clang-x86_64) :: test_expr_dsym (TestCXXModulesImport.CXXModulesImportTestCase) <bound method SBProcess.Kill of <lldb.SBProcess; proxy of <Swig Object of type 'lldb::SBProcess *' at 0x10b4c2db0> >>: success

Hide Details

runCmd: settings clear -all output:

Hide Details

runCmd: settings set symbols.enable-external-lookup false output:

Hide Details

runCmd: settings set target.inherit-tcc true output:

Hide Details

runCmd: settings set target.detach-on-error false output:

Hide Details

runCmd: settings set target.auto-apply-fixits false output:

Hide Details

runCmd: settings set plugin.process.gdb-remote.packet-timeout 60 output:

Hide Details

runCmd: settings set symbols.clang-modules-cache-path "/Users/buildslave/jenkins/workspace/lldb-cmake-matrix/lldb-build/lldb-test-build.noindex/module-cache-lldb/lldb-api" output:

Hide Details

runCmd: settings set use-color false output:

Hide Details

runCmd: setting set target.prefer-dynamic-value no-dynamic-values output:

Hide Details

runCmd: expr -l Objective-C++ -- @import Bar runCmd failed! error: expression failed to parse: error: Header search couldn't locate module Foo

Hide Details

error: while importing modules: error: Header search couldn't locate module Bar

Hide Details

Hide Details

Hide Details

FAIL: LLDB (/Users/buildslave/jenkins/workspace/lldb-cmake-matrix/clang_900_build/bin/clang-x86_64) :: test_expr_dwarf (TestCXXModulesImport.CXXModulesImportTestCase) <bound method SBProcess.Kill of <lldb.SBProcess; proxy of <Swig Object of type 'lldb::SBProcess *' at 0x10acd3ae0> >>: success

Hide Details

UNSUPPORTED: LLDB (/Users/buildslave/jenkins/workspace/lldb-cmake-matrix/clang_900_build/bin/clang-x86_64) :: test_expr_dwo (TestCXXModulesImport.CXXModulesImportTestCase) (test case does not fall in any category of interest for this run) runCmd: settings clear -all output:

Hide Details

runCmd: settings set symbols.enable-external-lookup false output:

Hide Details

runCmd: settings set target.inherit-tcc true output:

Hide Details

runCmd: settings set target.detach-on-error false output:

Hide Details

runCmd: settings set target.auto-apply-fixits false output:

Hide Details

runCmd: settings set plugin.process.gdb-remote.packet-timeout 60 output:

Hide Details

runCmd: settings set symbols.clang-modules-cache-path "/Users/buildslave/jenkins/workspace/lldb-cmake-matrix/lldb-build/lldb-test-build.noindex/module-cache-lldb/lldb-api" output:

Hide Details

runCmd: settings set use-color false output:

Hide Details

runCmd: setting set target.prefer-dynamic-value no-dynamic-values output:

Hide Details

runCmd: expr -l Objective-C++ -- @import Bar check of return status not required runCmd failed! error: expression failed to parse: error: Header search couldn't locate module Foo

Hide Details

error: while importing modules: error: Header search couldn't locate module Bar

Hide Details

Hide Details

Hide Details

Ran command: "expr -l Objective-C++ -- @import Bar"

Hide Details

Got output: error: expression failed to parse: error: Header search couldn't locate module Foo

Hide Details

error: while importing modules: error: Header search couldn't locate module Bar

Hide Details

Hide Details

Hide Details

<bound method SBProcess.Kill of <lldb.SBProcess; proxy of <Swig Object of type 'lldb::SBProcess *' at 0x10b4c2ea0> >>: success

Hide Details

PASS: LLDB (/Users/buildslave/jenkins/workspace/lldb-cmake-matrix/clang_900_build/bin/clang-x86_64) :: test_expr_failing_import_dsym (TestCXXModulesImport.CXXModulesImportTestCase) runCmd: settings clear -all output:

Hide Details

runCmd: settings set symbols.enable-external-lookup false output:

Hide Details

runCmd: settings set target.inherit-tcc true output:

Hide Details

runCmd: settings set target.detach-on-error false output:

Hide Details

runCmd: settings set target.auto-apply-fixits false output:

Hide Details

runCmd: settings set plugin.process.gdb-remote.packet-timeout 60 output:

Hide Details

runCmd: settings set symbols.clang-modules-cache-path "/Users/buildslave/jenkins/workspace/lldb-cmake-matrix/lldb-build/lldb-test-build.noindex/module-cache-lldb/lldb-api" output:

Hide Details

runCmd: settings set use-color false output:

Hide Details

runCmd: setting set target.prefer-dynamic-value no-dynamic-values output:

Hide Details

runCmd: expr -l Objective-C++ -- @import Bar check of return status not required runCmd failed! error: expression failed to parse: error: Header search couldn't locate module Foo

Hide Details

error: while importing modules: error: Header search couldn't locate module Bar

Hide Details

Hide Details

Hide Details

Ran command: "expr -l Objective-C++ -- @import Bar"

Hide Details

Got output: error: expression failed to parse: error: Header search couldn't locate module Foo

Hide Details

error: while importing modules: error: Header search couldn't locate module Bar

Hide Details

Hide Details

Hide Details

<bound method SBProcess.Kill of <lldb.SBProcess; proxy of <Swig Object of type 'lldb::SBProcess *' at 0x10acd39f0> >>: success

Hide Details

PASS: LLDB (/Users/buildslave/jenkins/workspace/lldb-cmake-matrix/clang_900_build/bin/clang-x86_64) :: test_expr_failing_import_dwarf (TestCXXModulesImport.CXXModulesImportTestCase) UNSUPPORTED: LLDB (/Users/buildslave/jenkins/workspace/lldb-cmake-matrix/clang_900_build/bin/clang-x86_64) :: test_expr_failing_import_dwo (TestCXXModulesImport.CXXModulesImportTestCase) (test case does not fall in any category of interest for this run) UNSUPPORTED: LLDB (/Users/buildslave/jenkins/workspace/lldb-cmake-matrix/clang_900_build/bin/clang-x86_64) :: test_expr_failing_import_gmodules (TestCXXModulesImport.CXXModulesImportTestCase) (test case does not fall in any category of interest for this run) UNSUPPORTED: LLDB (/Users/buildslave/jenkins/workspace/lldb-cmake-matrix/clang_900_build/bin/clang-x86_64) :: test_expr_gmodules (TestCXXModulesImport.CXXModulesImportTestCase) (test case does not fall in any category of interest for this run) Restore dir to: /Users/buildslave/jenkins/workspace/lldb-cmake-matrix/lldb-build/tools/lldb/test ====================================================================== FAIL: test_expr_dsym (TestCXXModulesImport.CXXModulesImportTestCase) ---------------------------------------------------------------------- Traceback (most recent call last): File "/Users/buildslave/jenkins/workspace/lldb-cmake-matrix/llvm-project/lldb/packages/Python/lldbsuite/test/lldbtest.py", line 1835, in test_method return attrvalue(self) File "/Users/buildslave/jenkins/workspace/lldb-cmake-matrix/llvm-project/lldb/packages/Python/lldbsuite/test/decorators.py", line 149, in wrapper return func(*args, **kwargs) File "/Users/buildslave/jenkins/workspace/lldb-cmake-matrix/llvm-project/lldb/test/API/lang/cpp/modules-import/TestCXXModulesImport.py", line 32, in test_expr self.expect("expr -l Objective-C++ -- @import Bar") File "/Users/buildslave/jenkins/workspace/lldb-cmake-matrix/llvm-project/lldb/packages/Python/lldbsuite/test/lldbtest.py", line 2468, in expect inHistory=inHistory) File "/Users/buildslave/jenkins/workspace/lldb-cmake-matrix/llvm-project/lldb/packages/Python/lldbsuite/test/lldbtest.py", line 2166, in runCmd msg if (msg) else CMD_MSG(cmd)) AssertionError: False is not True : Command 'expr -l Objective-C++ -- @import Bar Error output: error: expression failed to parse: error: Header search couldn't locate module Foo

Hide Details

error: while importing modules: error: Header search couldn't locate module Bar

Hide Details

' did not return successfully Config=x86_64-/Users/buildslave/jenkins/workspace/lldb-cmake-matrix/clang_900_build/bin/clang ====================================================================== FAIL: test_expr_dwarf (TestCXXModulesImport.CXXModulesImportTestCase) ---------------------------------------------------------------------- Traceback (most recent call last): File "/Users/buildslave/jenkins/workspace/lldb-cmake-matrix/llvm-project/lldb/packages/Python/lldbsuite/test/lldbtest.py", line 1835, in test_method return attrvalue(self) File "/Users/buildslave/jenkins/workspace/lldb-cmake-matrix/llvm-project/lldb/packages/Python/lldbsuite/test/decorators.py", line 149, in wrapper return func(*args, **kwargs) File "/Users/buildslave/jenkins/workspace/lldb-cmake-matrix/llvm-project/lldb/test/API/lang/cpp/modules-import/TestCXXModulesImport.py", line 32, in test_expr self.expect("expr -l Objective-C++ -- @import Bar") File "/Users/buildslave/jenkins/workspace/lldb-cmake-matrix/llvm-project/lldb/packages/Python/lldbsuite/test/lldbtest.py", line 2468, in expect inHistory=inHistory) File "/Users/buildslave/jenkins/workspace/lldb-cmake-matrix/llvm-project/lldb/packages/Python/lldbsuite/test/lldbtest.py", line 2166, in runCmd msg if (msg) else CMD_MSG(cmd)) AssertionError: False is not True : Command 'expr -l Objective-C++ -- @import Bar Error output: error: expression failed to parse: error: Header search couldn't locate module Foo

Hide Details

error: while importing modules: error: Header search couldn't locate module Bar

Hide Details

' did not return successfully Config=x86_64-/Users/buildslave/jenkins/workspace/lldb-cmake-matrix/clang_900_build/bin/clang ---------------------------------------------------------------------- Ran 8 tests in 8.119s

Hide Details

RESULT: FAILED (2 passes, 2 failures, 0 errors, 4 skipped, 0 expected failures, 0 unexpected successes)

Hide Details

--

Hide Details

******************** PASS: lldb-api :: types/TestShortTypeExpr.py (311 of 1406) PASS: lldb-api :: commands/settings/use_source_cache/TestUseSourceCache.py (312 of 1406) UNSUPPORTED: lldb-shell :: SymbolFile/PDB/type-quals.test (313 of 1406) PASS: lldb-shell :: Driver/TestTarget.test (314 of 1406) UNSUPPORTED: lldb-api :: functionalities/gdb_remote_client/TestIOSSimulator.py (315 of 1406) PASS: lldb-api :: python_api/sblaunchinfo/TestSBLaunchInfo.py (316 of 1406) UNSUPPORTED: lldb-shell :: Reproducer/TestProcessList.test (317 of 1406) PASS: lldb-api :: commands/frame/var/TestFrameVar.py (318 of 1406) PASS: lldb-api :: lang/cpp/const_this/TestConstThis.py (319 of 1406) PASS: lldb-api :: functionalities/data-formatter/data-formatter-stl/libcxx/list/loop/TestDataFormatterLibcxxListLoop.py (320 of 1406) PASS: lldb-api :: lang/objc/objc-dyn-sbtype/TestObjCDynamicSBType.py (321 of 1406) PASS: lldb-api :: lang/cpp/char1632_t/TestChar1632T.py (322 of 1406) PASS: lldb-api :: lang/cpp/wchar_t/TestCxxWCharT.py (323 of 1406) PASS: lldb-api :: lang/cpp/function_refs/TestFunctionRefs.py (324 of 1406) UNSUPPORTED: lldb-api :: commands/watchpoints/hello_watchpoint/TestMyFirstWatchpoint.py (325 of 1406) UNSUPPORTED: lldb-shell :: BuildScript/toolchain-clang-cl.test (326 of 1406) PASS: lldb-shell :: Breakpoint/case-sensitive.test (327 of 1406) PASS: lldb-shell :: ObjectFile/ELF/section-permissions.yaml (328 of 1406) PASS: lldb-api :: commands/target/modules/search-paths/insert/TestTargetModulesSearchpathsInsert.py (329 of 1406) UNSUPPORTED: lldb-api :: functionalities/process_save_core/TestProcessSaveCore.py (330 of 1406) UNSUPPORTED: lldb-api :: functionalities/step_scripted/TestStepScripted.py (331 of 1406) UNSUPPORTED: lldb-api :: commands/expression/import-std-module/basic/TestImportStdModule.py (332 of 1406) PASS: lldb-api :: python_api/formatters/TestFormattersSBAPI.py (333 of 1406) PASS: lldb-api :: commands/expression/class_template_specialization_empty_pack/TestClassTemplateSpecializationParametersHandling.py (334 of 1406) PASS: lldb-api :: functionalities/data-formatter/builtin-formats/TestBuiltinFormats.py (335 of 1406) PASS: lldb-api :: lang/cpp/exceptions/TestCPPExceptionBreakpoints.py (336 of 1406) UNSUPPORTED: lldb-api :: commands/expression/import-std-module/vector/TestVectorFromStdModule.py (337 of 1406) UNSUPPORTED: lldb-api :: arm/breakpoint-thumb-codesection/TestBreakpointThumbCodesection.py (338 of 1406) PASS: lldb-api :: lang/cpp/non-type-template-param/TestCppNonTypeTemplateParam.py (339 of 1406) PASS: lldb-api :: functionalities/breakpoint/hardware_breakpoints/require_hw_breakpoints/TestRequireHWBreakpoints.py (340 of 1406) UNSUPPORTED: lldb-shell :: Reproducer/TestVersionCheck.test (341 of 1406) PASS: lldb-shell :: SymbolFile/DWARF/x86/debug_aranges-empty-section.s (342 of 1406) PASS: lldb-api :: lang/c/struct_types/TestStructTypes.py (343 of 1406) UNSUPPORTED: lldb-shell :: Register/x86-ymm-read.test (344 of 1406) PASS: lldb-api :: functionalities/breakpoint/breakpoint_command/TestBreakpointCommand.py (345 of 1406) PASS: lldb-api :: lang/c/conflicting-symbol/TestConflictingSymbol.py (346 of 1406) PASS: lldb-shell :: ObjectFile/Breakpad/sections.test (347 of 1406) UNSUPPORTED: lldb-shell :: SymbolFile/DWARF/x86/DW_TAG_variable-DW_AT_decl_file-DW_AT_abstract_origin-crosscu1.s (348 of 1406) PASS: lldb-shell :: SymbolFile/DWARF/x86/module-ownership.mm (349 of 1406) PASS: lldb-api :: lang/c/stepping/TestStepAndBreakpoints.py (350 of 1406) PASS: lldb-shell :: SymbolFile/DWARF/x86/debug-types-line-tables.s (351 of 1406) PASS: lldb-api :: functionalities/data-formatter/nsdictionarysynth/TestNSDictionarySynthetic.py (352 of 1406) PASS: lldb-api :: commands/expression/codegen-crash-import-def-arraytype-element/TestImportDefinitionArrayType.py (353 of 1406) PASS: lldb-api :: lang/c/sizeof/TestCSizeof.py (354 of 1406) PASS: lldb-api :: macosx/safe-to-func-call/TestSafeFuncCalls.py (355 of 1406) UNSUPPORTED: lldb-shell :: Register/x86-multithread-write.test (356 of 1406) PASS: lldb-shell :: Settings/TestSettingsSet.test (357 of 1406) PASS: lldb-api :: commands/frame/diagnose/dereference-argument/TestDiagnoseDereferenceArgument.py (358 of 1406) PASS: lldb-api :: lang/cpp/class-template-parameter-pack/TestClassTemplateParameterPack.py (359 of 1406) UNSUPPORTED: lldb-shell :: SymbolFile/PDB/class-layout.test (360 of 1406) UNSUPPORTED: lldb-shell :: Subprocess/fork-follow-parent-wp.test (361 of 1406) PASS: lldb-shell :: SymbolFile/DWARF/x86/dwp-debug-types.s (362 of 1406) PASS: lldb-api :: functionalities/data-formatter/refpointer-recursion/TestDataFormatterRefPtrRecursion.py (363 of 1406) PASS: lldb-api :: functionalities/data-formatter/typedef_array/TestTypedefArray.py (364 of 1406) UNSUPPORTED: lldb-api :: linux/aarch64/mte_memory_region/TestAArch64LinuxMTEMemoryRegion.py (365 of 1406) PASS: lldb-shell :: ObjectFile/ELF/netbsd-exec-8.99.30-amd64.yaml (366 of 1406) PASS: lldb-api :: python_api/sbvalue_persist/TestSBValuePersist.py (367 of 1406) UNSUPPORTED: lldb-api :: commands/expression/import-std-module/sysroot/TestStdModuleSysroot.py (368 of 1406) PASS: lldb-shell :: SymbolFile/Breakpad/line-table-edgecases.test (369 of 1406) PASS: lldb-api :: functionalities/data-formatter/format-propagation/TestFormatPropagation.py (370 of 1406) PASS: lldb-api :: lang/objc/orderedset/TestOrderedSet.py (371 of 1406) PASS: lldb-api :: lang/cpp/signed_types/TestSignedTypes.py (372 of 1406) UNSUPPORTED: lldb-shell :: Reproducer/TestPythonImport.test (373 of 1406) UNSUPPORTED: lldb-api :: functionalities/thread/thread_specific_break_plus_condition/TestThreadSpecificBpPlusCondition.py (374 of 1406) UNSUPPORTED: lldb-api :: functionalities/postmortem/minidump-new/TestMiniDumpUUID.py (375 of 1406) PASS: lldb-api :: commands/target/stop-hook/enable/TestTargetStopHookEnable.py (376 of 1406) UNSUPPORTED: lldb-api :: functionalities/thread/concurrent_events/TestConcurrentTwoWatchpointThreads.py (377 of 1406) UNSUPPORTED: lldb-api :: commands/watchpoints/watchpoint_events/TestWatchpointEvents.py (378 of 1406) PASS: lldb-api :: lang/c/unicode/TestUnicodeSymbols.py (379 of 1406) PASS: lldb-shell :: Settings/TestEchoCommands.test (380 of 1406) UNSUPPORTED: lldb-api :: iohandler/resize/TestIOHandlerResizeNoEditline.py (381 of 1406) PASS: lldb-shell :: SymbolFile/DWARF/x86/debug_line-relative_path.s (382 of 1406) UNSUPPORTED: lldb-shell :: Register/aarch64-gp-read.test (383 of 1406) PASS: lldb-api :: lang/c/offsetof/TestOffsetof.py (384 of 1406) UNSUPPORTED: lldb-shell :: Subprocess/clone-follow-parent-wp.test (385 of 1406) UNSUPPORTED: lldb-api :: functionalities/tsan/thread_leak/TestTsanThreadLeak.py (386 of 1406) XFAIL: lldb-shell :: Register/x86-64-fp-write.test (387 of 1406) PASS: lldb-api :: functionalities/data-formatter/data-formatter-stl/libcxx/multimap/TestDataFormatterLibccMultiMap.py (388 of 1406) PASS: lldb-shell :: Register/Core/x86-64-freebsd-addr.test (389 of 1406) PASS: lldb-api :: functionalities/data-formatter/data-formatter-named-summaries/TestDataFormatterNamedSummaries.py (390 of 1406) PASS: lldb-shell :: Commands/command-stop-hook-output.test (391 of 1406) PASS: lldb-api :: functionalities/gdb_remote_client/TestWasm.py (392 of 1406) PASS: lldb-api :: functionalities/signal/raise/TestRaise.py (393 of 1406) PASS: lldb-api :: lang/objc/objc-new-syntax/TestObjCNewSyntaxLiteral.py (394 of 1406) UNSUPPORTED: lldb-api :: tools/lldb-server/libraries-svr4/TestGdbRemoteLibrariesSvr4Support.py (395 of 1406) PASS: lldb-api :: lang/cpp/constructors/TestCppConstructors.py (396 of 1406) UNSUPPORTED: lldb-shell :: SymbolFile/DWARF/x86/debug-types-address-ranges.s (397 of 1406) PASS: lldb-api :: types/TestDoubleTypes.py (398 of 1406) PASS: lldb-api :: functionalities/show_location/TestShowLocationDwarf5.py (399 of 1406) PASS: lldb-shell :: Register/Core/x86-64-freebsd-multithread.test (400 of 1406) PASS: lldb-shell :: Breakpoint/single-file-split-dwarf.test (401 of 1406) PASS: lldb-api :: commands/breakpoint/set/func-regex/TestBreakpointRegexError.py (402 of 1406) PASS: lldb-api :: functionalities/type_get_module/TestTypeGetModule.py (403 of 1406) PASS: lldb-shell :: SymbolFile/DWARF/x86/DW_TAG_variable-invalid_location.s (404 of 1406) UNSUPPORTED: lldb-api :: commands/expression/namespace_local_var_same_name_obj_c/TestNamespaceLocalVarSameNameObjC.py (405 of 1406) PASS: lldb-shell :: SymbolFile/DWARF/x86/debug_rnglists-dwp.s (406 of 1406) UNSUPPORTED: lldb-shell :: Reproducer/Functionalities/TestImageList.test (407 of 1406) PASS: lldb-api :: lang/objc/objc-checker/TestObjCCheckers.py (408 of 1406) PASS: lldb-api :: lang/cpp/bool/TestCPPBool.py (409 of 1406) PASS: lldb-api :: macosx/skinny-corefile/TestSkinnyCorefile.py (410 of 1406) UNSUPPORTED: lldb-api :: commands/register/register/aarch64_dynamic_regset/TestArm64DynamicRegsets.py (411 of 1406) UNSUPPORTED: lldb-shell :: Reproducer/TestFileRepro.test (412 of 1406) PASS: lldb-shell :: Register/Core/x86-32-freebsd-multithread.test (413 of 1406) PASS: lldb-api :: commands/expression/context-object/TestContextObject.py (414 of 1406) UNSUPPORTED: lldb-api :: tools/lldb-vscode/coreFile/TestVSCode_coreFile.py (415 of 1406) UNSUPPORTED: lldb-shell :: Register/x86-gp-write.test (416 of 1406) PASS: lldb-api :: functionalities/thread/ignore_suspended/TestIgnoreSuspendedThread.py (417 of 1406) UNSUPPORTED: lldb-shell :: Driver/TestHelp.test (418 of 1406) PASS: lldb-api :: lang/objc/foundation/TestSymbolTable.py (419 of 1406) PASS: lldb-api :: macosx/universal/TestUniversal.py (420 of 1406) PASS: lldb-shell :: Breakpoint/debug_rnglistx_rlex.test (421 of 1406) UNSUPPORTED: lldb-api :: functionalities/data-formatter/data-formatter-stl/libstdcpp/unique_ptr/TestDataFormatterStdUniquePtr.py (422 of 1406) UNSUPPORTED: lldb-api :: functionalities/reproducers/fs-case-sensitivity/TestReproducerFSCaseSensitivity.py (423 of 1406) UNSUPPORTED: lldb-shell :: SymbolFile/DWARF/x86/debug_ranges_and_rnglists.test (424 of 1406) PASS: lldb-api :: functionalities/step-vrs-interrupt/TestStepVrsInterruptTimeout.py (425 of 1406) PASS: lldb-api :: functionalities/data-formatter/language_category_updates/TestDataFormatterLanguageCategoryUpdates.py (426 of 1406) PASS: lldb-shell :: Register/Core/x86-64-netbsd-addr.test (427 of 1406) PASS: lldb-shell :: VSCode/TestOptions.test (428 of 1406) PASS: lldb-shell :: ObjectFile/Breakpad/sections-trailing-func.test (429 of 1406) UNSUPPORTED: lldb-api :: functionalities/ubsan/basic/TestUbsanBasic.py (430 of 1406) UNSUPPORTED: lldb-api :: functionalities/gdb_remote_client/TestQemuAArch64TargetXml.py (431 of 1406) UNSUPPORTED: lldb-api :: commands/expression/namespace_local_var_same_name_cpp_and_c/TestNamespaceLocalVarSameNameCppAndC.py (432 of 1406) UNSUPPORTED: lldb-shell :: Reproducer/TestSynchronous.test (433 of 1406) PASS: lldb-api :: lang/cpp/covariant-return-types/TestCovariantReturnTypes.py (434 of 1406) PASS: lldb-api :: commands/command/script/import/rdar-12586188/TestRdar12586188.py (435 of 1406) UNSUPPORTED: lldb-api :: tools/lldb-server/TestGdbRemoteFork.py (436 of 1406) PASS: lldb-api :: functionalities/data-formatter/data-formatter-script/TestDataFormatterScript.py (437 of 1406) PASS: lldb-api :: lang/c/bitfields/TestBitfields.py (438 of 1406) PASS: lldb-api :: functionalities/data-formatter/data-formatter-caching/TestDataFormatterCaching.py (439 of 1406) UNSUPPORTED: lldb-shell :: SymbolFile/NativePDB/ast-functions.cpp (440 of 1406) UNSUPPORTED: lldb-shell :: Process/Windows/exception_access_violation.cpp (441 of 1406) PASS: lldb-api :: functionalities/data-formatter/data-formatter-synthval/TestDataFormatterSynthVal.py (442 of 1406) PASS: lldb-api :: lang/cpp/overloaded-functions/TestOverloadedFunctions.py (443 of 1406) PASS: lldb-api :: commands/log/basic/TestLogging.py (444 of 1406) UNSUPPORTED: lldb-shell :: Quit/TestQuitExitCode30.test (445 of 1406) PASS: lldb-shell :: Driver/TestProcessAttach.test (446 of 1406) PASS: lldb-api :: types/TestLongTypes.py (447 of 1406) UNSUPPORTED: lldb-api :: android/platform/TestDefaultCacheLineSize.py (448 of 1406) PASS: lldb-shell :: ObjectFile/PECOFF/section-types.yaml (449 of 1406) UNSUPPORTED: lldb-api :: tools/lldb-vscode/console/TestVSCode_redirection_to_console.py (450 of 1406) PASS: lldb-shell :: Register/x86-multithread-read.test (451 of 1406) PASS: lldb-api :: python_api/lldbutil/frame/TestFrameUtils.py (452 of 1406) PASS: lldb-api :: commands/expression/static-initializers/TestStaticInitializers.py (453 of 1406) PASS: lldb-shell :: Watchpoint/SetErrorCases.test (454 of 1406) PASS: lldb-api :: lang/cpp/unique-types/TestUniqueTypes.py (455 of 1406) UNSUPPORTED: lldb-api :: tools/lldb-server/memory-tagging/TestGdbRemoteMemoryTagging.py (456 of 1406) PASS: lldb-shell :: ObjectFile/MachO/symtab.yaml (457 of 1406) PASS: lldb-api :: tools/lldb-server/TestGdbRemoteSingleStep.py (458 of 1406) PASS: lldb-api :: functionalities/non-overlapping-index-variable-i/TestIndexVariable.py (459 of 1406) PASS: lldb-api :: functionalities/postmortem/elf-core/TestLinuxCore.py (460 of 1406) PASS: lldb-api :: functionalities/thread/backtrace_limit/TestBacktraceLimit.py (461 of 1406) PASS: lldb-api :: lang/c/blocks/TestBlocks.py (462 of 1406) PASS: lldb-shell :: Breakpoint/jit-loader_rtdyld_elf.test (463 of 1406) PASS: lldb-api :: lang/cpp/class_static/TestStaticVariables.py (464 of 1406) UNSUPPORTED: lldb-api :: functionalities/tsan/cpp_global_location/TestTsanCPPGlobalLocation.py (465 of 1406) PASS: lldb-api :: tools/lldb-server/TestGdbRemoteThreadsInStopReply.py (466 of 1406) UNSUPPORTED: lldb-shell :: Subprocess/clone-follow-parent.test (467 of 1406) PASS: lldb-shell :: Settings/TestDefaultModuleCachePath.test (468 of 1406) PASS: lldb-api :: functionalities/breakpoint/source_regexp/TestSourceRegexBreakpoints.py (469 of 1406) PASS: lldb-shell :: SymbolFile/DWARF/x86/DW_AT_decl_file-DW_AT_specification-crosscu.s (470 of 1406) UNSUPPORTED: lldb-shell :: Register/x86-64-ymm-read.test (471 of 1406) PASS: lldb-shell :: ObjectFile/ELF/PT_LOAD-overlap-PT_TLS.yaml (472 of 1406) UNSUPPORTED: lldb-shell :: Reproducer/TestHomeDir.test (473 of 1406) PASS: lldb-api :: functionalities/rerun/TestRerun.py (474 of 1406) PASS: lldb-api :: lang/objc/self/TestObjCSelf.py (475 of 1406) UNSUPPORTED: lldb-api :: functionalities/thread/concurrent_events/TestConcurrentTwoBreakpointsOneWatchpoint.py (476 of 1406) PASS: lldb-api :: lang/cpp/typeof/TestTypeOfDeclTypeExpr.py (477 of 1406) UNSUPPORTED: lldb-api :: lang/objc/modules-update/TestClangModulesUpdate.py (478 of 1406) PASS: lldb-api :: functionalities/data-formatter/data-formatter-enum-format/TestDataFormatterEnumFormat.py (479 of 1406) PASS: lldb-api :: functionalities/conditional_break/TestConditionalBreak.py (480 of 1406) PASS: lldb-api :: types/TestCharType.py (481 of 1406) UNSUPPORTED: lldb-api :: commands/frame/language/TestGuessLanguage.py (482 of 1406) UNSUPPORTED: lldb-shell :: Expr/TestIRMemoryMapWindows.test (483 of 1406) PASS: lldb-api :: lang/objc/objc-ivar-offsets/TestObjCIvarOffsets.py (484 of 1406) UNSUPPORTED: lldb-api :: benchmarks/frame_variable/TestFrameVariableResponse.py (485 of 1406) PASS: lldb-shell :: ObjectFile/wasm/embedded-debug-sections.yaml (486 of 1406) PASS: lldb-shell :: ObjectFile/ELF/minidebuginfo-find-symbols.yaml (487 of 1406) UNSUPPORTED: lldb-api :: functionalities/load_using_paths/TestLoadUsingPaths.py (488 of 1406) PASS: lldb-api :: functionalities/plugins/python_os_plugin/stepping_plugin_threads/TestOSPluginStepping.py (489 of 1406) PASS: lldb-api :: functionalities/thread/exit_during_break/TestExitDuringBreak.py (490 of 1406) PASS: lldb-shell :: ObjectFile/ELF/PT_LOAD-overlap.yaml (491 of 1406) PASS: lldb-shell :: SymbolFile/DWARF/anon_class_w_and_wo_export_symbols.ll (492 of 1406) UNSUPPORTED: lldb-api :: commands/expression/import-std-module/no-std-module/TestMissingStdModule.py (493 of 1406) PASS: lldb-api :: python_api/type/TestTypeList.py (494 of 1406) PASS: lldb-api :: commands/expression/rdar42038760/TestScalarURem.py (495 of 1406) PASS: lldb-api :: functionalities/breakpoint/address_breakpoints/TestBadAddressBreakpoints.py (496 of 1406) UNSUPPORTED: lldb-shell :: ScriptInterpreter/Lua/persistent_state.test (497 of 1406) UNSUPPORTED: lldb-shell :: SymbolFile/NativePDB/function-types-builtins.cpp (498 of 1406) UNSUPPORTED: lldb-api :: functionalities/thread/exit_during_expression/TestExitDuringExpression.py (499 of 1406) PASS: lldb-api :: lang/objcxx/class-name-clash/TestNameClash.py (500 of 1406) PASS: lldb-api :: functionalities/data-formatter/data-formatter-objc/TestDataFormatterObjCNSURL.py (501 of 1406) UNSUPPORTED: lldb-api :: functionalities/tail_call_frames/inlining_and_tail_calls/TestInliningAndTailCalls.py (502 of 1406) PASS: lldb-shell :: ObjectFile/Breakpad/discontiguous-sections.test (503 of 1406) UNSUPPORTED: lldb-api :: commands/expression/macros/TestMacros.py (504 of 1406) PASS: lldb-shell :: Commands/command-target-modules-dump-sections.yaml (505 of 1406) PASS: lldb-shell :: SymbolFile/Breakpad/unwind-via-raSearch.test (506 of 1406) PASS: lldb-api :: types/TestRecursiveTypes.py (507 of 1406) PASS: lldb-api :: functionalities/fat_archives/TestFatArchives.py (508 of 1406) UNSUPPORTED: lldb-shell :: Unwind/eh-frame-augment-noop.test (509 of 1406) PASS: lldb-api :: sample_test/TestSampleInlineTest.py (510 of 1406) UNSUPPORTED: lldb-shell :: SymbolFile/DWARF/x86/find-basic-function.cpp (511 of 1406) PASS: lldb-shell :: SymbolFile/DWARF/x86/compilercontext.ll (512 of 1406) UNSUPPORTED: lldb-api :: functionalities/thread/concurrent_events/TestConcurrentManySignals.py (513 of 1406) UNSUPPORTED: lldb-shell :: SymbolFile/DWARF/x86/debug-types-signature-loop.s (514 of 1406) PASS: lldb-shell :: ObjectFile/ELF/compressed-sections.yaml (515 of 1406) PASS: lldb-shell :: Quit/TestQuitExitCode0.test (516 of 1406) PASS: lldb-shell :: SymbolFile/DWARF/x86/dwarf5_tu_index_abbrev_offset.s (517 of 1406) PASS: lldb-api :: commands/platform/file/read/TestPlatformFileRead.py (518 of 1406) UNSUPPORTED: lldb-shell :: SymbolFile/PDB/pointers.test (519 of 1406) PASS: lldb-api :: commands/platform/sdk/TestPlatformSDK.py (520 of 1406) PASS: lldb-shell :: ObjectFile/ELF/minidebuginfo-corrupt-xz.yaml (521 of 1406) PASS: lldb-api :: python_api/debugger/TestDebuggerAPI.py (522 of 1406) PASS: lldb-shell :: Quit/TestQuitExitCodeNonInt.test (523 of 1406) PASS: lldb-api :: lang/cpp/gmodules-templates/TestGModules.py (524 of 1406) PASS: lldb-api :: macosx/duplicate-archive-members/TestDuplicateMembers.py (525 of 1406) UNSUPPORTED: lldb-api :: benchmarks/expression/TestRepeatedExprs.py (526 of 1406) PASS: lldb-api :: functionalities/jitloader_gdb/TestJITLoaderGDB.py (527 of 1406) PASS: lldb-shell :: Settings/TestFrameFormatNoColor.test (528 of 1406) PASS: lldb-shell :: SymbolFile/DWARF/x86/debug_loc-aslr.s (529 of 1406) PASS: lldb-api :: functionalities/data-formatter/data-formatter-stl/libcxx/optional/TestDataFormatterLibcxxOptional.py (530 of 1406) UNSUPPORTED: lldb-shell :: SymbolFile/DWARF/x86/find-method.cpp (531 of 1406) PASS: lldb-shell :: Commands/CommandScriptImmediateOutput/CommandScriptImmediateOutputConsole.test (532 of 1406) PASS: lldb-api :: functionalities/data-formatter/nssetsynth/TestNSSetSynthetic.py (533 of 1406) PASS: lldb-api :: functionalities/data-formatter/data-formatter-synthtype/TestDataFormatterSynthType.py (534 of 1406) PASS: lldb-api :: lang/cpp/accelerator-table/TestCPPAccelerator.py (535 of 1406) PASS: lldb-api :: commands/expression/pr35310/TestExprsBug35310.py (536 of 1406) PASS: lldb-api :: functionalities/data-formatter/data-formatter-objc/TestDataFormatterObjCCF.py (537 of 1406) PASS: lldb-api :: lang/objc/objc-class-method/TestObjCClassMethod.py (538 of 1406) UNSUPPORTED: lldb-shell :: Register/x86-64-xmm16-write.test (539 of 1406) PASS: lldb-api :: python_api/lldbutil/iter/TestLLDBIterator.py (540 of 1406) UNSUPPORTED: lldb-api :: functionalities/ptrauth_diagnostics/LDRAA_error/TestPtrauthLDRAADiagnostic.py (541 of 1406) UNSUPPORTED: lldb-shell :: Driver/TestFile.test (542 of 1406) UNSUPPORTED: lldb-shell :: ScriptInterpreter/Lua/lua-python.test (543 of 1406) PASS: lldb-api :: python_api/class_members/TestSBTypeClassMembers.py (544 of 1406) UNSUPPORTED: lldb-api :: functionalities/tail_call_frames/cross_dso/TestCrossDSOTailCalls.py (545 of 1406) PASS: lldb-api :: functionalities/data-formatter/data-formatter-objc/nsstring/TestDataFormatterNSString.py (546 of 1406) UNSUPPORTED: lldb-api :: commands/watchpoints/watchpoint_commands/condition/TestWatchpointConditionCmd.py (547 of 1406) PASS: lldb-api :: commands/expression/radar_9531204/TestPrintfAfterUp.py (548 of 1406) PASS: lldb-api :: commands/command/nested_alias/TestNestedAlias.py (549 of 1406) PASS: lldb-shell :: ScriptInterpreter/None/import_module.test (550 of 1406) PASS: lldb-api :: commands/frame/var-scope/TestFrameVariableScope.py (551 of 1406) UNSUPPORTED: lldb-shell :: SymbolFile/NativePDB/locate-pdb.cpp (552 of 1406) PASS: lldb-api :: functionalities/data-formatter/data-formatter-stl/libcxx/list/TestDataFormatterLibcxxList.py (553 of 1406) PASS: lldb-shell :: SymbolFile/Breakpad/unwind-via-stack-cfi.test (554 of 1406) PASS: lldb-api :: commands/expression/call-throws/TestCallThatThrows.py (555 of 1406) PASS: lldb-api :: commands/expression/dont_allow_jit/TestAllowJIT.py (556 of 1406) UNSUPPORTED: lldb-api :: tools/lldb-vscode/attach/TestVSCode_attach.py (557 of 1406) PASS: lldb-shell :: BuildScript/toolchain-clang.test (558 of 1406) PASS: lldb-api :: commands/add-dsym/uuid/TestAddDsymCommand.py (559 of 1406) PASS: lldb-api :: functionalities/dynamic_value_child_count/TestDynamicValueChildCount.py (560 of 1406) PASS: lldb-api :: lang/c/inlines/TestRedefinitionsInInlines.py (561 of 1406) PASS: lldb-api :: functionalities/data-formatter/var-in-aggregate-misuse/TestVarInAggregateMisuse.py (562 of 1406) PASS: lldb-shell :: ObjectFile/ELF/null-jmprel.yaml (563 of 1406) UNSUPPORTED: lldb-shell :: Register/x86-64-xmm16-read.test (564 of 1406) PASS: lldb-api :: lang/cpp/reference-to-outer-type/TestCppReferenceToOuterClass.py (565 of 1406) UNSUPPORTED: lldb-api :: tools/lldb-server/TestGdbRemoteModuleInfo.py (566 of 1406) PASS: lldb-api :: tools/lldb-server/TestGdbRemoteAttachOrWait.py (567 of 1406) UNSUPPORTED: lldb-shell :: Quit/TestQuitExitCodeHexA.test (568 of 1406) PASS: lldb-api :: lang/c/strings/TestCStrings.py (569 of 1406) UNSUPPORTED: lldb-shell :: ObjectFile/PECOFF/uuid.yaml (570 of 1406) PASS: lldb-api :: functionalities/data-formatter/parray/TestPrintArray.py (571 of 1406) PASS: lldb-api :: commands/settings/TestSettings.py (572 of 1406) UNSUPPORTED: lldb-shell :: Reproducer/TestRelativePath.test (573 of 1406) UNSUPPORTED: lldb-shell :: Register/x86-64-zmm-write.test (574 of 1406) PASS: lldb-shell :: SymbolFile/DWARF/x86/dwp.s (575 of 1406) PASS: lldb-api :: functionalities/data-formatter/data-formatter-stl/libcxx/iterator/TestDataFormatterLibccIterator.py (576 of 1406) UNSUPPORTED: lldb-shell :: ScriptInterpreter/Python/Crashlog/json.test (577 of 1406) PASS: lldb-api :: commands/frame/diagnose/local-variable/TestLocalVariable.py (578 of 1406) UNSUPPORTED: lldb-api :: lang/cpp/function-template-parameter-pack/TestFunctionTemplateParameterPack.py (579 of 1406) UNSUPPORTED: lldb-api :: macosx/thread-names/TestInterruptThreadNames.py (580 of 1406) PASS: lldb-api :: commands/frame/diagnose/inheritance/TestDiagnoseInheritance.py (581 of 1406) PASS: lldb-shell :: SymbolFile/DWARF/x86/DW_AT_location-DW_AT_const_value.s (582 of 1406) PASS: lldb-shell :: ObjectFile/ELF/section-overlap.yaml (583 of 1406) PASS: lldb-api :: functionalities/pre_run_dylibs/TestPreRunDylibs.py (584 of 1406) PASS: lldb-api :: tools/lldb-server/TestGdbRemoteKill.py (585 of 1406) PASS: lldb-shell :: Commands/command-regex-delete.test (586 of 1406) PASS: lldb-api :: functionalities/data-formatter/data-formatter-objc/TestDataFormatterObjCKVO.py (587 of 1406) PASS: lldb-api :: tools/lldb-server/TestGdbRemoteAttachWait.py (588 of 1406) PASS: lldb-api :: commands/expression/diagnostics/TestExprDiagnostics.py (589 of 1406) PASS: lldb-api :: lang/c/unions/TestUnionMembers.py (590 of 1406) PASS: lldb-api :: functionalities/data-formatter/data-formatter-python-synth/TestDataFormatterPythonSynth.py (591 of 1406) PASS: lldb-api :: lang/objc/radar-9691614/TestObjCMethodReturningBOOL.py (592 of 1406) PASS: lldb-shell :: ObjectFile/PECOFF/basic-info-arm64.yaml (593 of 1406) PASS: lldb-shell :: Settings/TestLineMarkerColor.test (594 of 1406) PASS: lldb-api :: functionalities/data-formatter/data-formatter-stl/libcxx/atomic/TestLibCxxAtomic.py (595 of 1406) PASS: lldb-api :: macosx/thread_suspend/TestInternalThreadSuspension.py (596 of 1406) PASS: lldb-shell :: ObjectFile/ELF/PT_TLS-overlap-PT_LOAD.yaml (597 of 1406) PASS: lldb-api :: functionalities/thread/step_until/TestStepUntil.py (598 of 1406) PASS: lldb-shell :: Driver/TestCommands.test (599 of 1406) PASS: lldb-api :: lang/cpp/stl/TestStdCXXDisassembly.py (600 of 1406) UNSUPPORTED: lldb-api :: commands/watchpoints/watchpoint_disable/TestWatchpointDisable.py (601 of 1406) PASS: lldb-shell :: SymbolFile/DWARF/x86/DW_OP_piece-struct.s (602 of 1406) UNSUPPORTED: lldb-api :: commands/register/register/aarch64_sve_registers/rw_access_dynamic_resize/TestSVEThreadedDynamic.py (603 of 1406) PASS: lldb-api :: types/TestIntegerType.py (604 of 1406) PASS: lldb-api :: functionalities/optimized_code/TestNoASanExceptionAfterEvalOP_piece.py (605 of 1406) PASS: lldb-shell :: Settings/TestDisableColor.test (606 of 1406) UNSUPPORTED: lldb-api :: functionalities/breakpoint/hardware_breakpoints/write_memory_with_hw_breakpoint/TestWriteMemoryWithHWBreakpoint.py (607 of 1406) PASS: lldb-api :: commands/target/stop-hooks/TestStopHooks.py (608 of 1406) UNSUPPORTED: lldb-api :: tools/lldb-server/TestGdbRemoteCompletion.py (609 of 1406) UNSUPPORTED: lldb-shell :: Subprocess/fork-follow-parent-softbp.test (610 of 1406) UNSUPPORTED: lldb-shell :: Register/x86-zmm-read.test (611 of 1406) PASS: lldb-api :: python_api/frame/inlines/TestInlinedFrame.py (612 of 1406) PASS: lldb-api :: python_api/frame/get-variables/TestGetVariables.py (613 of 1406) UNSUPPORTED: lldb-api :: commands/expression/import-std-module/vector-dbg-info-content/TestDbgInfoContentVectorFromStdModule.py (614 of 1406) PASS: lldb-api :: functionalities/unwind/sigtramp/TestSigtrampUnwind.py (615 of 1406) UNSUPPORTED: lldb-api :: commands/trace/TestTraceSave.py (616 of 1406) PASS: lldb-api :: lang/cpp/namespace_definitions/TestNamespaceDefinitions.py (617 of 1406) PASS: lldb-api :: lang/c/complex_int/TestComplexInt.py (618 of 1406) UNSUPPORTED: lldb-api :: functionalities/thread/state/TestThreadStates.py (619 of 1406) PASS: lldb-api :: functionalities/thread/concurrent_events/TestConcurrentManyCrash.py (620 of 1406) UNSUPPORTED: lldb-api :: commands/watchpoints/watch_tagged_addr/TestWatchTaggedAddress.py (621 of 1406) PASS: lldb-api :: functionalities/thread/state_after_expression/TestStateAfterExpression.py (622 of 1406) UNSUPPORTED: lldb-shell :: Subprocess/clone-follow-child.test (623 of 1406) PASS: lldb-shell :: SymbolFile/DWARF/x86/DW_TAG_basic_type_DW_ATE_UTF_nonC.ll (624 of 1406) UNSUPPORTED: lldb-shell :: SymbolFile/DWARF/x86/array-sizes.s (625 of 1406) PASS: lldb-api :: tools/lldb-server/inferior-crash/TestGdbRemoteAbort.py (626 of 1406) PASS: lldb-api :: python_api/value/TestValueAPI.py (627 of 1406) PASS: lldb-shell :: ExecControl/StopHook/stop-hook.test (628 of 1406) UNSUPPORTED: lldb-shell :: SymbolFile/DWARF/x86/win-i386-line-table.s (629 of 1406) PASS: lldb-api :: functionalities/data-formatter/pyobjsynthprovider/TestPyObjSynthProvider.py (630 of 1406) PASS: lldb-api :: functionalities/data-formatter/summary-string-onfail/Test-rdar-9974002.py (631 of 1406) UNSUPPORTED: lldb-api :: commands/expression/import-std-module/array/TestArrayFromStdModule.py (632 of 1406) UNSUPPORTED: lldb-shell :: Minidump/Windows/arm-fp-unwind.test (633 of 1406) UNSUPPORTED: lldb-api :: functionalities/ptrauth_diagnostics/brkC47x_code/TestPtrauthBRKc47xDiagnostic.py (634 of 1406) PASS: lldb-api :: functionalities/breakpoint/address_breakpoints/TestAddressBreakpoints.py (635 of 1406) UNSUPPORTED: lldb-api :: functionalities/ptrauth_diagnostics/BRAA_error/TestPtrauthBRAADiagnostic.py (636 of 1406) PASS: lldb-shell :: Register/Core/x86-32-linux-gp.test (637 of 1406) UNSUPPORTED: lldb-api :: linux/thread/create_during_instruction_step/TestCreateDuringInstructionStep.py (638 of 1406) PASS: lldb-api :: commands/disassemble/basic/TestFrameDisassemble.py (639 of 1406) PASS: lldb-api :: commands/expression/test/TestExprs2.py (640 of 1406) PASS: lldb-api :: functionalities/breakpoint/breakpoint_locations/TestBreakpointLocations.py (641 of 1406) UNSUPPORTED: lldb-shell :: Register/x86-64-ymm16-read.test (642 of 1406) PASS: lldb-api :: functionalities/history/TestHistoryRecall.py (643 of 1406) PASS: lldb-shell :: SymbolFile/DWARF/x86/dwarf5-debug_line-file-index.s (644 of 1406) PASS: lldb-api :: functionalities/data-formatter/data-formatter-stl/libcxx/map/TestDataFormatterLibccMap.py (645 of 1406) PASS: lldb-api :: commands/expression/anonymous-struct/TestCallUserAnonTypedef.py (646 of 1406) UNSUPPORTED: lldb-api :: commands/watchpoints/multi_watchpoint_slots/TestWatchpointMultipleSlots.py (647 of 1406) UNSUPPORTED: lldb-api :: commands/expression/import-std-module/forward_list/TestForwardListFromStdModule.py (648 of 1406) PASS: lldb-api :: commands/expression/dollar-in-variable/TestDollarInVariable.py (649 of 1406) PASS: lldb-api :: lang/objc/objc-ivar-stripped/TestObjCIvarStripped.py (650 of 1406) PASS: lldb-api :: tools/lldb-server/TestGdbRemoteRegisterState.py (651 of 1406) PASS: lldb-api :: functionalities/completion/TestCompletion.py (652 of 1406) PASS: lldb-api :: commands/expression/radar_8638051/Test8638051.py (653 of 1406) PASS: lldb-api :: functionalities/data-formatter/user-format-vs-summary/TestUserFormatVsSummary.py (654 of 1406) UNSUPPORTED: lldb-api :: commands/trace/TestTraceExport.py (655 of 1406) UNSUPPORTED: lldb-shell :: SymbolFile/NativePDB/tag-types.cpp (656 of 1406) UNSUPPORTED: lldb-api :: functionalities/thread/concurrent_events/TestConcurrentCrashWithWatchpoint.py (657 of 1406) PASS: lldb-api :: api/command-return-object/TestSBCommandReturnObject.py (658 of 1406) PASS: lldb-api :: lang/c/cpp_keyword_identifiers/TestCppKeywordsAsCIdentifiers.py (659 of 1406) UNSUPPORTED: lldb-shell :: ObjectFile/PECOFF/export-dllfunc.yaml (660 of 1406) PASS: lldb-api :: commands/gui/expand-threads-tree/TestGuiExpandThreadsTree.py (661 of 1406) PASS: lldb-api :: lang/objc/objc-super/TestObjCSuper.py (662 of 1406) PASS: lldb-api :: python_api/function_symbol/TestSymbolAPI.py (663 of 1406) PASS: lldb-api :: lang/c/local_types/TestUseClosestType.py (664 of 1406) PASS: lldb-api :: functionalities/data-formatter/data-formatter-objc/TestDataFormatterObjCExpr.py (665 of 1406) UNSUPPORTED: lldb-api :: commands/trace/TestTraceDumpInstructions.py (666 of 1406) UNSUPPORTED: lldb-shell :: ScriptInterpreter/Python/scripted_breakpoint.test (667 of 1406) PASS: lldb-api :: functionalities/data-formatter/data-formatter-stl/libcxx/multiset/TestDataFormatterLibcxxMultiSet.py (668 of 1406) PASS: lldb-shell :: ObjectFile/Breakpad/uuid-matching-mac.test (669 of 1406) PASS: lldb-api :: functionalities/breakpoint/scripted_bkpt/TestScriptedResolver.py (670 of 1406) PASS: lldb-shell :: SymbolFile/symbol-binding.test (671 of 1406) PASS: lldb-api :: lang/cpp/dynamic-value/TestDynamicValue.py (672 of 1406) PASS: lldb-api :: lang/cpp/template/TestTemplateArgs.py (673 of 1406) PASS: lldb-api :: functionalities/tail_call_frames/thread_step_out_or_return/TestSteppingOutWithArtificialFrames.py (674 of 1406) PASS: lldb-api :: lang/objc/objc-struct-return/TestObjCStructReturn.py (675 of 1406) PASS: lldb-api :: commands/expression/codegen-crash-typedefdecl-not-in_declcontext/TestCodegenCrashTypedefDeclNotInDeclContext.py (676 of 1406) PASS: lldb-api :: iohandler/completion/TestIOHandlerCompletion.py (677 of 1406) PASS: lldb-shell :: ObjectFile/MachO/lc_build_version.yaml (678 of 1406) PASS: lldb-api :: functionalities/breakpoint/debugbreak/TestDebugBreak.py (679 of 1406) PASS: lldb-api :: lang/cpp/alignas_base_class/TestAlignAsBaseClass.py (680 of 1406) UNSUPPORTED: lldb-shell :: SymbolFile/Breakpad/stack-cfi-arm.yaml (681 of 1406) PASS: lldb-api :: functionalities/thread_plan/TestThreadPlanCommands.py (682 of 1406) PASS: lldb-api :: lang/objcxx/cxx-bridged-po/TestObjCXXBridgedPO.py (683 of 1406) UNSUPPORTED: lldb-shell :: SymbolFile/NativePDB/source-list.cpp (684 of 1406) UNSUPPORTED: lldb-api :: commands/watchpoints/hello_watchlocation/TestWatchLocation.py (685 of 1406) PASS: lldb-api :: functionalities/data-formatter/data-formatter-proper-plurals/TestFormattersOneIsSingular.py (686 of 1406) PASS: lldb-api :: commands/command/invalid-args/TestInvalidArgsCommand.py (687 of 1406) PASS: lldb-shell :: Minidump/breakpad-symbols.test (688 of 1406) PASS: lldb-api :: commands/frame/select/TestFrameSelect.py (689 of 1406) PASS: lldb-api :: commands/expression/function_template_specialization_temp_args/TestFunctionTemplateSpecializationTempArgs.py (690 of 1406) UNSUPPORTED: lldb-shell :: Reproducer/TestDump.test (691 of 1406) PASS: lldb-api :: functionalities/target-new-solib-notifications/TestModuleLoadedNotifys.py (692 of 1406) PASS: lldb-api :: commands/expression/char/TestExprsChar.py (693 of 1406) PASS: lldb-api :: functionalities/inferior-crashing/TestInferiorCrashingStep.py (694 of 1406) PASS: lldb-api :: commands/register/register/register_command/TestRegisters.py (695 of 1406) PASS: lldb-api :: functionalities/memory/cache/TestMemoryCache.py (696 of 1406) UNSUPPORTED: lldb-api :: commands/expression/call-restarts/TestCallThatRestarts.py (697 of 1406) UNSUPPORTED: lldb-api :: commands/expression/import-std-module/weak_ptr-dbg-info-content/TestDbgInfoContentWeakPtrFromStdModule.py (698 of 1406) PASS: lldb-api :: source-manager/TestSourceManager.py (699 of 1406) PASS: lldb-api :: lang/objc/unicode-string/TestUnicodeString.py (700 of 1406) PASS: lldb-api :: commands/frame/diagnose/virtual-method-call/TestDiagnoseDereferenceVirtualMethodCall.py (701 of 1406) UNSUPPORTED: lldb-shell :: SymbolFile/DWARF/x86/dwp-separate-debug-file.cpp (702 of 1406) PASS: lldb-api :: tools/lldb-server/TestGdbRemote_qThreadStopInfo.py (703 of 1406) UNSUPPORTED: lldb-api :: commands/expression/import-std-module/missing-module-sources/TestStdModuleSourcesMissing.py (704 of 1406) PASS: lldb-api :: lang/objc/objc-static-method/TestObjCStaticMethod.py (705 of 1406) PASS: lldb-api :: lang/objcxx/objcxx-ivar-vector/TestIvarVector.py (706 of 1406) UNSUPPORTED: lldb-shell :: Unwind/unwind-plan-dwarf-dump.test (707 of 1406) PASS: lldb-api :: functionalities/var_path/TestVarPath.py (708 of 1406) PASS: lldb-api :: commands/expression/error-limit/TestExprErrorLimit.py (709 of 1406) PASS: lldb-api :: lang/objc/modules-auto-import/TestModulesAutoImport.py (710 of 1406) PASS: lldb-shell :: SymbolFile/DWARF/x86/debug_loclists-dwo.s (711 of 1406) PASS: lldb-api :: functionalities/data-formatter/data-formatter-stl/libcxx/function/TestLibCxxFunction.py (712 of 1406) PASS: lldb-api :: lang/cpp/chained-calls/TestCppChainedCalls.py (713 of 1406) PASS: lldb-api :: lang/objc/modules-inline-functions/TestModulesInlineFunctions.py (714 of 1406) PASS: lldb-api :: macosx/lc-note/firmware-corefile/TestFirmwareCorefiles.py (715 of 1406) UNSUPPORTED: lldb-api :: functionalities/tail_call_frames/cross_object/TestCrossObjectTailCalls.py (716 of 1406) UNSUPPORTED: lldb-api :: functionalities/data-formatter/data-formatter-stl/libstdcpp/list/TestDataFormatterStdList.py (717 of 1406) UNSUPPORTED: lldb-api :: functionalities/thread/create_during_step/TestCreateDuringStep.py (718 of 1406) PASS: lldb-api :: lang/objc/exceptions/TestObjCExceptions.py (719 of 1406) PASS: lldb-shell :: SymbolFile/DWARF/x86/split-dwarf-inlining.cpp (720 of 1406) UNSUPPORTED: lldb-api :: lang/objc/modules-incomplete/TestIncompleteModules.py (721 of 1406) UNSUPPORTED: lldb-api :: functionalities/unwind/aarch64_unwind_pac/TestAArch64UnwindPAC.py (722 of 1406) UNSUPPORTED: lldb-api :: functionalities/tail_call_frames/disambiguate_paths_to_common_sink/TestDisambiguatePathsToCommonSink.py (723 of 1406) UNSUPPORTED: lldb-shell :: Subprocess/vfork-follow-child-softbp.test (724 of 1406) UNSUPPORTED: lldb-api :: functionalities/thread/concurrent_events/TestConcurrentCrashWithWatchpointBreakpointSignal.py (725 of 1406) UNSUPPORTED: lldb-api :: macosx/find-dsym/deep-bundle/TestDeepBundle.py (726 of 1406) PASS: lldb-api :: macosx/nslog/TestDarwinNSLogOutput.py (727 of 1406) PASS: lldb-api :: tools/lldb-server/commandline/TestGdbRemoteConnection.py (728 of 1406) UNSUPPORTED: lldb-api :: macosx/posix_spawn/TestLaunchProcessPosixSpawn.py (729 of 1406) UNSUPPORTED: lldb-shell :: Watchpoint/netbsd-nouserdbregs.test (730 of 1406) PASS: lldb-api :: commands/target/dump-symtab-demangle/TestDumpSymtabDemangle.py (731 of 1406) UNSUPPORTED: lldb-api :: python_api/event/TestEvents.py (732 of 1406) UNSUPPORTED: lldb-api :: functionalities/tty/TestTerminal.py (733 of 1406) PASS: lldb-api :: functionalities/thread/jump/TestThreadJump.py (734 of 1406) UNSUPPORTED: lldb-shell :: Unwind/eh-frame-small-fde.test (735 of 1406) PASS: lldb-api :: functionalities/thread/concurrent_events/TestConcurrentDelayedCrashWithBreakpointSignal.py (736 of 1406) UNSUPPORTED: lldb-api :: python_api/process/io/TestProcessIO.py (737 of 1406) UNSUPPORTED: lldb-api :: commands/expression/import-std-module/conflicts/TestStdModuleWithConflicts.py (738 of 1406) PASS: lldb-api :: commands/expression/formatters/TestFormatters.py (739 of 1406) PASS: lldb-api :: lang/cpp/llvm-style/TestLLVMStyle.py (740 of 1406) UNSUPPORTED: lldb-shell :: Reproducer/TestMultipleTargets.test (741 of 1406) PASS: lldb-shell :: SymbolFile/DWARF/x86/split-dwarf-multiple-cu.ll (742 of 1406) PASS: lldb-api :: functionalities/data-formatter/data-formatter-stl/libstdcpp/unique_ptr/invalid/TestDataFormatterInvalidStdUniquePtr.py (743 of 1406) PASS: lldb-api :: commands/reproducer/invalid-args/TestInvalidArgsReproducer.py (744 of 1406) PASS: lldb-api :: tools/lldb-server/thread-name/TestGdbRemoteThreadName.py (745 of 1406) UNSUPPORTED: lldb-shell :: SymbolFile/NativePDB/typedefs.cpp (746 of 1406) PASS: lldb-api :: functionalities/breakpoint/cpp_exception/TestCPPExceptionBreakpoint.py (747 of 1406) PASS: lldb-api :: python_api/frame/TestFrames.py (748 of 1406) PASS: lldb-api :: python_api/objc_type/TestObjCType.py (749 of 1406) PASS: lldb-api :: lang/cpp/call-function/TestCallCPPFunction.py (750 of 1406) PASS: lldb-api :: functionalities/process_crash_info/TestProcessCrashInfo.py (751 of 1406) PASS: lldb-api :: functionalities/gdb_remote_client/TestPartialGPacket.py (752 of 1406) PASS: lldb-shell :: SymbolFile/DWARF/x86/debug_rnglists-dwo.s (753 of 1406) UNSUPPORTED: lldb-api :: functionalities/tail_call_frames/disambiguate_tail_call_seq/TestDisambiguateTailCallSeq.py (754 of 1406) UNSUPPORTED: lldb-shell :: ScriptInterpreter/Lua/command_script_import.test (755 of 1406) UNSUPPORTED: lldb-shell :: ScriptInterpreter/Lua/lua.test (756 of 1406) UNSUPPORTED: lldb-shell :: SymbolFile/NativePDB/load-pdb.cpp (757 of 1406) PASS: lldb-api :: lang/objcxx/conflicting-names-class-update-utility-expr/TestObjCConflictingNamesForClassUpdateExpr.py (758 of 1406) PASS: lldb-api :: functionalities/breakpoint/serialize/TestBreakpointSerialization.py (759 of 1406) UNSUPPORTED: lldb-shell :: SymbolFile/DWARF/x86/dir-separator-posix.s (760 of 1406) UNSUPPORTED: lldb-api :: functionalities/dyld-launch-linux/TestDyldLaunchLinux.py (761 of 1406) PASS: lldb-api :: commands/frame/recognizer/TestFrameRecognizer.py (762 of 1406) PASS: lldb-shell :: ObjectFile/ELF/PT_LOAD-empty.yaml (763 of 1406) PASS: lldb-api :: lang/objc/foundation/TestObjCMethods.py (764 of 1406) UNSUPPORTED: lldb-api :: commands/expression/import-std-module/vector-of-vectors/TestVectorOfVectorsFromStdModule.py (765 of 1406) UNSUPPORTED: lldb-api :: macosx/function-starts/TestFunctionStarts.py (766 of 1406) PASS: lldb-shell :: SymbolFile/DWARF/x86/childless-compile-unit.s (767 of 1406) PASS: lldb-api :: commands/apropos/with-process/TestAproposWithProcess.py (768 of 1406) PASS: lldb-api :: commands/expression/vector_of_enums/TestVectorOfEnums.py (769 of 1406) UNSUPPORTED: lldb-api :: commands/process/launch/TestProcessLaunch.py (770 of 1406) PASS: lldb-shell :: Breakpoint/split-dwarf5-debug-stroffsets.test (771 of 1406) PASS: lldb-api :: commands/platform/basic/TestPlatformPython.py (772 of 1406) PASS: lldb-shell :: ObjectFile/Breakpad/breakpad-identification.test (773 of 1406) PASS: lldb-api :: lang/c/step_over_no_deadlock/TestStepOverDoesntBlock.py (774 of 1406) PASS: lldb-api :: functionalities/data-formatter/data-formatter-stl/libcxx/queue/TestDataFormatterLibcxxQueue.py (775 of 1406) PASS: lldb-shell :: Minidump/Windows/broken-unwind.test (776 of 1406) UNSUPPORTED: lldb-shell :: SymbolFile/DWARF/x86/dwarf5_locations.s (777 of 1406) PASS: lldb-api :: commands/process/launch-with-shellexpand/TestLaunchWithShellExpand.py (778 of 1406) PASS: lldb-api :: functionalities/data-formatter/data-formatter-disabling/TestDataFormatterDisabling.py (779 of 1406) UNSUPPORTED: lldb-shell :: SymbolFile/NativePDB/bitfields.cpp (780 of 1406) PASS: lldb-api :: commands/expression/call-function/TestCallStopAndContinue.py (781 of 1406) UNSUPPORTED: lldb-shell :: SymbolFile/PDB/function-nested-block.test (782 of 1406) PASS: lldb-api :: functionalities/breakpoint/dummy_target_breakpoints/TestBreakpointsWithNoTargets.py (783 of 1406) PASS: lldb-api :: commands/expression/argument_passing_restrictions/TestArgumentPassingRestrictions.py (784 of 1406) UNSUPPORTED: lldb-shell :: SymbolFile/NativePDB/s_constant.cpp (785 of 1406) PASS: lldb-shell :: Register/Core/aarch64-freebsd-multithread.test (786 of 1406) PASS: lldb-api :: python_api/sbenvironment/TestSBEnvironment.py (787 of 1406) PASS: lldb-api :: api/log/TestAPILog.py (788 of 1406) UNSUPPORTED: lldb-api :: commands/process/attach-resume/TestAttachResume.py (789 of 1406) PASS: lldb-api :: lang/cpp/function-qualifiers/TestCppFunctionQualifiers.py (790 of 1406) PASS: lldb-shell :: SymbolFile/Breakpad/line-table-discontinuous-file-ids.test (791 of 1406) PASS: lldb-api :: sample_test/TestSampleTest.py (792 of 1406) PASS: lldb-api :: commands/breakpoint/command/list/TestBreakpointCommandList.py (793 of 1406) PASS: lldb-api :: python_api/sbtype_typeclass/TestSBTypeTypeClass.py (794 of 1406) PASS: lldb-shell :: Recognizer/assert.test (795 of 1406) UNSUPPORTED: lldb-api :: python_api/watchpoint/TestWatchpointIgnoreCount.py (796 of 1406) UNSUPPORTED: lldb-shell :: Subprocess/vfork-follow-child.test (797 of 1406) UNSUPPORTED: lldb-api :: commands/expression/import-std-module/retry-with-std-module/TestRetryWithStdModule.py (798 of 1406) PASS: lldb-shell :: Settings/TestModuleCacheSanity.test (799 of 1406) UNSUPPORTED: lldb-shell :: Register/aarch64-fp-read.test (800 of 1406) PASS: lldb-shell :: SymbolFile/Breakpad/line-table-mixed-path-styles.test (801 of 1406) PASS: lldb-shell :: ObjectFile/PECOFF/symbol.yaml (802 of 1406) PASS: lldb-api :: functionalities/paths/TestPaths.py (803 of 1406) UNSUPPORTED: lldb-shell :: Driver/TestRepl.test (804 of 1406) PASS: lldb-api :: functionalities/data-formatter/stringprinter/TestStringPrinter.py (805 of 1406) UNSUPPORTED: lldb-shell :: ObjectFile/ELF/basic-info.yaml (806 of 1406) PASS: lldb-api :: commands/version/TestVersion.py (807 of 1406) PASS: lldb-api :: functionalities/inferior-crashing/TestInferiorCrashing.py (808 of 1406) UNSUPPORTED: lldb-shell :: ScriptInterpreter/Python/Crashlog/text.test (809 of 1406) UNSUPPORTED: lldb-api :: commands/register/register/intel_xtended_registers/TestMPXRegisters.py (810 of 1406) PASS: lldb-api :: lang/objc/cpp_keyword_identifiers/TestCppKeywordsAsObjCIdentifiers.py (811 of 1406) UNSUPPORTED: lldb-shell :: ExecControl/StopHook/stop-hook-threads.test (812 of 1406) PASS: lldb-shell :: SymbolFile/DWARF/x86/dwarf5-implicit-const.s (813 of 1406) UNSUPPORTED: lldb-shell :: SymbolFile/DWARF/x86/dwarf5-index-is-used.cpp (814 of 1406) PASS: lldb-shell :: ObjectFile/ELF/section-types-edgecases.yaml (815 of 1406) PASS: lldb-api :: functionalities/data-formatter/dump_dynamic/TestDumpDynamic.py (816 of 1406) PASS: lldb-api :: lang/cpp/unsigned_types/TestUnsignedTypes.py (817 of 1406) PASS: lldb-api :: commands/command/script_alias/TestCommandScriptAlias.py (818 of 1406) PASS: lldb-api :: lang/objc/objc-stepping/TestObjCStepping.py (819 of 1406) PASS: lldb-api :: commands/expression/multiline-navigation/TestMultilineNavigation.py (820 of 1406) UNSUPPORTED: lldb-api :: commands/register/register/intel_xtended_registers/mpx_bound_violation/TestBoundViolation.py (821 of 1406) UNSUPPORTED: lldb-api :: functionalities/thread/concurrent_events/TestConcurrentNWatchNBreak.py (822 of 1406) UNSUPPORTED: lldb-api :: python_api/watchpoint/watchlocation/TestTargetWatchAddress.py (823 of 1406) UNSUPPORTED: lldb-shell :: SymbolFile/DWARF/x86/DW_TAG_GNU_call_site-DW_AT_low_pc.s (824 of 1406) PASS: lldb-shell :: SymbolFile/DWARF/x86/debug_ranges.s (825 of 1406) PASS: lldb-shell :: Register/x86-64-gp-read.test (826 of 1406) UNSUPPORTED: lldb-api :: functionalities/ptrauth_diagnostics/brkC47x_x16_invalid/TestPtrauthBRKc47xX16Invalid.py (827 of 1406) PASS: lldb-api :: lang/objc/objc-optimized/TestObjcOptimized.py (828 of 1406) UNSUPPORTED: lldb-api :: tools/lldb-vscode/breakpoint/TestVSCode_setFunctionBreakpoints.py (829 of 1406) PASS: lldb-shell :: Breakpoint/breakpoint-command.test (830 of 1406) PASS: lldb-api :: lang/cpp/trivial_abi/TestTrivialABI.py (831 of 1406) UNSUPPORTED: lldb-api :: functionalities/tail_call_frames/thread_step_out_message/TestArtificialFrameStepOutMessage.py (832 of 1406) PASS: lldb-api :: functionalities/pointer_num_children/TestPointerNumChildren.py (833 of 1406) UNSUPPORTED: lldb-shell :: SymbolFile/DWARF/dwarf5-lazy-dwo.c (834 of 1406) PASS: lldb-api :: functionalities/lazy-loading/TestLazyLoading.py (835 of 1406) PASS: lldb-api :: python_api/section/TestSectionAPI.py (836 of 1406) PASS: lldb-api :: lang/cpp/dynamic-value/TestCppValueCast.py (837 of 1406) UNSUPPORTED: lldb-api :: functionalities/thread/concurrent_events/TestConcurrentDelayWatchBreak.py (838 of 1406) PASS: lldb-shell :: Settings/TestFrameFormatColor.test (839 of 1406) PASS: lldb-shell :: SymbolFile/DWARF/x86/DW_TAG_variable-DW_AT_const_value.s (840 of 1406) UNSUPPORTED: lldb-shell :: SymbolFile/DWARF/x86/debug-names-compressed.cpp (841 of 1406) PASS: lldb-api :: lang/objc/objc_direct-methods/TestObjCDirectMethods.py (842 of 1406) PASS: lldb-shell :: Register/Core/x86-64-linux-fp.test (843 of 1406) PASS: lldb-api :: lang/cpp/incomplete-types/TestCppIncompleteTypes.py (844 of 1406) PASS: lldb-shell :: Minidump/Windows/find-module.test (845 of 1406) PASS: lldb-api :: commands/expression/test/TestExprs.py (846 of 1406) PASS: lldb-api :: functionalities/data-formatter/vector-types/TestVectorTypesFormatting.py (847 of 1406) PASS: lldb-shell :: SymbolFile/Breakpad/unwind-via-stack-win-no-memory-info.yaml (848 of 1406) PASS: lldb-api :: lang/objcxx/cpp_keywords_enabled/TestObjCppKeywordsEnabled.py (849 of 1406) PASS: lldb-api :: functionalities/postmortem/elf-core/gcore/TestGCore.py (850 of 1406) PASS: lldb-shell :: Commands/command-image-lookup.yaml (851 of 1406) UNSUPPORTED: lldb-api :: commands/expression/unwind_expression/TestUnwindExpression.py (852 of 1406) UNSUPPORTED: lldb-shell :: SymbolFile/PDB/enums-layout.test (853 of 1406) PASS: lldb-shell :: Host/TestCustomShell.test (854 of 1406) UNSUPPORTED: lldb-api :: commands/expression/import-std-module/stack/TestStackFromStdModule.py (855 of 1406) PASS: lldb-shell :: Driver/TestUseColor.test (856 of 1406) PASS: lldb-shell :: Register/Core/x86-32-netbsd-multithread.test (857 of 1406) PASS: lldb-api :: functionalities/object-file/TestImageListMultiArchitecture.py (858 of 1406) UNSUPPORTED: lldb-shell :: Reproducer/TestVerify.test (859 of 1406) UNSUPPORTED: lldb-api :: tools/lldb-vscode/variables/TestVSCode_variables.py (860 of 1406) PASS: lldb-api :: lang/mixed/TestMixedLanguages.py (861 of 1406) UNSUPPORTED: lldb-api :: tools/lldb-vscode/launch/TestVSCode_launch.py (862 of 1406) PASS: lldb-api :: functionalities/data-formatter/data-formatter-objc/TestDataFormatterObjCNSContainer.py (863 of 1406) PASS: lldb-api :: functionalities/postmortem/wow64_minidump/TestWow64MiniDump.py (864 of 1406) PASS: lldb-api :: commands/help/TestHelp.py (865 of 1406) PASS: lldb-api :: functionalities/data-formatter/data-formatter-objc/TestDataFormatterObjCNSNumber.py (866 of 1406) UNSUPPORTED: lldb-api :: functionalities/thread/concurrent_events/TestConcurrentDelayedCrashWithBreakpointWatchpoint.py (867 of 1406) PASS: lldb-api :: lang/cpp/subst_template_type_param/TestSubstTemplateTypeParam.py (868 of 1406) PASS: lldb-api :: functionalities/find-line-entry/TestFindLineEntry.py (869 of 1406) PASS: lldb-api :: commands/expression/fixits/TestFixIts.py (870 of 1406) PASS: lldb-shell :: Register/Core/x86-64-linux-multithread.test (871 of 1406) PASS: lldb-shell :: ObjectFile/ELF/riscv-arch.yaml (872 of 1406) UNSUPPORTED: lldb-api :: functionalities/tsan/multiple/TestTsanMultiple.py (873 of 1406) UNSUPPORTED: lldb-shell :: SymbolFile/NativePDB/ast-functions-msvc.cpp (874 of 1406) PASS: lldb-api :: lang/cpp/frame-var-anon-unions/TestFrameVariableAnonymousUnions.py (875 of 1406) PASS: lldb-api :: lang/cpp/default-template-args/TestDefaultTemplateArgs.py (876 of 1406) PASS: lldb-api :: commands/expression/top-level/TestTopLevelExprs.py (877 of 1406) PASS: lldb-api :: lang/cpp/function-local-class/TestCppFunctionLocalClass.py (878 of 1406) UNSUPPORTED: lldb-api :: functionalities/disassemble/aarch64-adrp-add/TestAArch64AdrpAdd.py (879 of 1406) UNSUPPORTED: lldb-api :: tools/lldb-vscode/module/TestVSCode_module.py (880 of 1406) PASS: lldb-api :: functionalities/inferior-crashing/recursive-inferior/TestRecursiveInferiorStep.py (881 of 1406) PASS: lldb-api :: functionalities/data-formatter/ostypeformatting/TestFormattersOsType.py (882 of 1406) PASS: lldb-shell :: Commands/command-source.test (883 of 1406) PASS: lldb-shell :: SymbolFile/DWARF/x86/DW_AT_const_value-bitfields.s (884 of 1406) PASS: lldb-api :: functionalities/inferior-crashing/recursive-inferior/TestRecursiveInferior.py (885 of 1406) PASS: lldb-api :: lang/cpp/dereferencing_references/TestCPPDereferencingReferences.py (886 of 1406) UNSUPPORTED: lldb-api :: functionalities/breakpoint/breakpoint_in_delayslot/TestAvoidBreakpointInDelaySlot.py (887 of 1406) FAIL: lldb-api :: lang/objc/modules-compile-error/TestModulesCompileError.py (888 of 1406) ******************** TEST 'lldb-api :: lang/objc/modules-compile-error/TestModulesCompileError.py' FAILED ******************** Script: -- /usr/local/Frameworks/Python.framework/Versions/3.7/bin/python3.7 /Users/buildslave/jenkins/workspace/lldb-cmake-matrix/llvm-project/lldb/test/API/dotest.py -u CXXFLAGS -u CFLAGS --codesign-identity lldb_codesign --arch x86_64 --build-dir /Users/buildslave/jenkins/workspace/lldb-cmake-matrix/lldb-build/lldb-test-build.noindex -t --env TERM=vt100 --skip-category gmodules --skip-category watchpoint --arch=x86_64 --env LLVM_LIBS_DIR=/Users/buildslave/jenkins/workspace/lldb-cmake-matrix/lldb-build/./lib --arch x86_64 --build-dir /Users/buildslave/jenkins/workspace/lldb-cmake-matrix/lldb-build/lldb-test-build.noindex --lldb-module-cache-dir /Users/buildslave/jenkins/workspace/lldb-cmake-matrix/lldb-build/lldb-test-build.noindex/module-cache-lldb/lldb-api --clang-module-cache-dir /Users/buildslave/jenkins/workspace/lldb-cmake-matrix/lldb-build/lldb-test-build.noindex/module-cache-clang/lldb-api --executable /Users/buildslave/jenkins/workspace/lldb-cmake-matrix/lldb-build/./bin/lldb --compiler /Users/buildslave/jenkins/workspace/lldb-cmake-matrix/clang_900_build/bin/clang --dsymutil /Users/buildslave/jenkins/workspace/lldb-cmake-matrix/lldb-build/./bin/dsymutil --llvm-tools-dir /Users/buildslave/jenkins/workspace/lldb-cmake-matrix/lldb-build/./bin --lldb-libs-dir /Users/buildslave/jenkins/workspace/lldb-cmake-matrix/lldb-build/./lib --skip-category=lldb-vscode --skip-category=std-module /Users/buildslave/jenkins/workspace/lldb-cmake-matrix/llvm-project/lldb/test/API/lang/objc/modules-compile-error -p TestModulesCompileError.py --capture-path /Users/buildslave/jenkins/workspace/lldb-cmake-matrix/lldb-build/lldb-test-build.noindex/reproducers/TestModulesCompileError.py -- Exit Code: 1

Hide Details

Command Output (stdout): -- lldb version 14.0.99 (http://labmaster3.local/git/llvm-project.git revision e7249e4acf3cf9438d6d9e02edecebd5b622a4dc) clang revision e7249e4acf3cf9438d6d9e02edecebd5b622a4dc llvm revision e7249e4acf3cf9438d6d9e02edecebd5b622a4dc Skipping the following test categories: ['gmodules', 'watchpoint', 'lldb-vscode', 'std-module', 'libstdcxx', 'dwo', 'llgs', 'fork']

Hide Details

-- Command Output (stderr): -- Change dir to: /Users/buildslave/jenkins/workspace/lldb-cmake-matrix/llvm-project/lldb/test/API/lang/objc/modules-compile-error runCmd: settings clear -all output:

Hide Details

runCmd: settings set symbols.enable-external-lookup false output:

Hide Details

runCmd: settings set target.inherit-tcc true output:

Hide Details

runCmd: settings set target.detach-on-error false output:

Hide Details

runCmd: settings set target.auto-apply-fixits false output:

Hide Details

runCmd: settings set plugin.process.gdb-remote.packet-timeout 60 output:

Hide Details

runCmd: settings set symbols.clang-modules-cache-path "/Users/buildslave/jenkins/workspace/lldb-cmake-matrix/lldb-build/lldb-test-build.noindex/module-cache-lldb/lldb-api" output:

Hide Details

runCmd: settings set use-color false output:

Hide Details

runCmd: setting set target.prefer-dynamic-value no-dynamic-values output:

Hide Details

runCmd: expr @import LLDBTestModule check of return status not required runCmd failed! error: expression failed to parse: error: Header search couldn't locate module LLDBTestModule

Hide Details

error: while importing modules: error: Header search couldn't locate module LLDBTestModule

Hide Details

Hide Details

Hide Details

Ran command: "expr @import LLDBTestModule"

Hide Details

Got output: error: expression failed to parse: error: Header search couldn't locate module LLDBTestModule

Hide Details

error: while importing modules: error: Header search couldn't locate module LLDBTestModule

Hide Details

Hide Details

Expecting sub string: "module.h:4:1: error: unknown type name 'syntax_error_for_lldb_to_find'" (was not found)

Hide Details

FAIL: LLDB (/Users/buildslave/jenkins/workspace/lldb-cmake-matrix/clang_900_build/bin/clang-x86_64) :: test_dsym (TestModulesCompileError.TestCase) <bound method SBProcess.Kill of <lldb.SBProcess; proxy of <Swig Object of type 'lldb::SBProcess *' at 0x105b375d0> >>: success

Hide Details

runCmd: settings clear -all output:

Hide Details

runCmd: settings set symbols.enable-external-lookup false output:

Hide Details

runCmd: settings set target.inherit-tcc true output:

Hide Details

runCmd: settings set target.detach-on-error false output:

Hide Details

runCmd: settings set target.auto-apply-fixits false output:

Hide Details

runCmd: settings set plugin.process.gdb-remote.packet-timeout 60 output:

Hide Details

runCmd: settings set symbols.clang-modules-cache-path "/Users/buildslave/jenkins/workspace/lldb-cmake-matrix/lldb-build/lldb-test-build.noindex/module-cache-lldb/lldb-api" output:

Hide Details

runCmd: settings set use-color false output:

Hide Details

runCmd: setting set target.prefer-dynamic-value no-dynamic-values output:

Hide Details

runCmd: expr @import LLDBTestModule check of return status not required runCmd failed! error: expression failed to parse: error: Header search couldn't locate module LLDBTestModule

Hide Details

error: while importing modules: error: Header search couldn't locate module LLDBTestModule

Hide Details

Hide Details

Hide Details

Ran command: "expr @import LLDBTestModule"

Hide Details

Got output: error: expression failed to parse: error: Header search couldn't locate module LLDBTestModule

Hide Details

error: while importing modules: error: Header search couldn't locate module LLDBTestModule

Hide Details

Hide Details

Expecting sub string: "module.h:4:1: error: unknown type name 'syntax_error_for_lldb_to_find'" (was not found)

Hide Details

FAIL: LLDB (/Users/buildslave/jenkins/workspace/lldb-cmake-matrix/clang_900_build/bin/clang-x86_64) :: test_dwarf (TestModulesCompileError.TestCase) <bound method SBProcess.Kill of <lldb.SBProcess; proxy of <Swig Object of type 'lldb::SBProcess *' at 0x105876ae0> >>: success

Hide Details

UNSUPPORTED: LLDB (/Users/buildslave/jenkins/workspace/lldb-cmake-matrix/clang_900_build/bin/clang-x86_64) :: test_dwo (TestModulesCompileError.TestCase) (test case does not fall in any category of interest for this run) UNSUPPORTED: LLDB (/Users/buildslave/jenkins/workspace/lldb-cmake-matrix/clang_900_build/bin/clang-x86_64) :: test_gmodules (TestModulesCompileError.TestCase) (test case does not fall in any category of interest for this run) Restore dir to: /Users/buildslave/jenkins/workspace/lldb-cmake-matrix/lldb-build/tools/lldb/test ====================================================================== FAIL: test_dsym (TestModulesCompileError.TestCase) ---------------------------------------------------------------------- Traceback (most recent call last): File "/Users/buildslave/jenkins/workspace/lldb-cmake-matrix/llvm-project/lldb/packages/Python/lldbsuite/test/lldbtest.py", line 1835, in test_method return attrvalue(self) File "/Users/buildslave/jenkins/workspace/lldb-cmake-matrix/llvm-project/lldb/test/API/lang/objc/modules-compile-error/TestModulesCompileError.py", line 22, in test "could not build module 'LLDBTestModule'"]) File "/Users/buildslave/jenkins/workspace/lldb-cmake-matrix/llvm-project/lldb/packages/Python/lldbsuite/test/lldbtest.py", line 2555, in expect self.fail(log_msg) AssertionError: Ran command: "expr @import LLDBTestModule"

Hide Details

Got output: error: expression failed to parse: error: Header search couldn't locate module LLDBTestModule

Hide Details

error: while importing modules: error: Header search couldn't locate module LLDBTestModule

Hide Details

Hide Details

Expecting sub string: "module.h:4:1: error: unknown type name 'syntax_error_for_lldb_to_find'" (was not found) Config=x86_64-/Users/buildslave/jenkins/workspace/lldb-cmake-matrix/clang_900_build/bin/clang ====================================================================== FAIL: test_dwarf (TestModulesCompileError.TestCase) ---------------------------------------------------------------------- Traceback (most recent call last): File "/Users/buildslave/jenkins/workspace/lldb-cmake-matrix/llvm-project/lldb/packages/Python/lldbsuite/test/lldbtest.py", line 1835, in test_method return attrvalue(self) File "/Users/buildslave/jenkins/workspace/lldb-cmake-matrix/llvm-project/lldb/test/API/lang/objc/modules-compile-error/TestModulesCompileError.py", line 22, in test "could not build module 'LLDBTestModule'"]) File "/Users/buildslave/jenkins/workspace/lldb-cmake-matrix/llvm-project/lldb/packages/Python/lldbsuite/test/lldbtest.py", line 2555, in expect self.fail(log_msg) AssertionError: Ran command: "expr @import LLDBTestModule"

Hide Details

Got output: error: expression failed to parse: error: Header search couldn't locate module LLDBTestModule

Hide Details

error: while importing modules: error: Header search couldn't locate module LLDBTestModule

Hide Details

Hide Details

Expecting sub string: "module.h:4:1: error: unknown type name 'syntax_error_for_lldb_to_find'" (was not found) Config=x86_64-/Users/buildslave/jenkins/workspace/lldb-cmake-matrix/clang_900_build/bin/clang ---------------------------------------------------------------------- Ran 4 tests in 2.921s

Hide Details

RESULT: FAILED (0 passes, 2 failures, 0 errors, 2 skipped, 0 expected failures, 0 unexpected successes)

Hide Details

--

Hide Details

******************** UNSUPPORTED: lldb-api :: macosx/profile_vrs_detach/TestDetachVrsProfile.py (889 of 1406) UNSUPPORTED: lldb-shell :: SymbolFile/NativePDB/local-variables.cpp (890 of 1406) PASS: lldb-api :: lang/objc/objc-new-syntax/TestObjCNewSyntaxArray.py (891 of 1406) PASS: lldb-api :: python_api/interpreter/TestCommandInterpreterAPI.py (892 of 1406) PASS: lldb-api :: tools/lldb-server/inferior-crash/TestGdbRemoteSegFault.py (893 of 1406) PASS: lldb-shell :: ScriptInterpreter/None/none.test (894 of 1406) PASS: lldb-api :: functionalities/data-formatter/varscript_formatting/TestDataFormatterVarScriptFormatting.py (895 of 1406) PASS: lldb-api :: functionalities/gdb_remote_client/TestGDBServerTargetXML.py (896 of 1406) UNSUPPORTED: lldb-api :: commands/trace/TestTraceTimestampCounters.py (897 of 1406) UNSUPPORTED: lldb-api :: macosx/simulator/TestSimulatorPlatform.py (898 of 1406) UNSUPPORTED: lldb-api :: tools/lldb-vscode/console/TestVSCode_console.py (899 of 1406) PASS: lldb-api :: python_api/name_lookup/TestNameLookup.py (900 of 1406) PASS: lldb-api :: lang/cpp/typedef/TestCppTypedef.py (901 of 1406) PASS: lldb-api :: lang/c/vla/TestVLA.py (902 of 1406) UNSUPPORTED: lldb-shell :: Reproducer/Functionalities/TestStepping.test (903 of 1406) PASS: lldb-shell :: ObjectFile/ELF/gnu-debuglink.yaml (904 of 1406) PASS: lldb-api :: functionalities/load_lazy/TestLoadUsingLazyBind.py (905 of 1406) UNSUPPORTED: lldb-api :: tools/lldb-vscode/completions/TestVSCode_completions.py (906 of 1406) PASS: lldb-api :: types/TestCharTypeExpr.py (907 of 1406) PASS: lldb-api :: lang/cpp/diamond/TestDiamond.py (908 of 1406) PASS: lldb-api :: lang/cpp/symbols/TestSymbols.py (909 of 1406) PASS: lldb-api :: commands/command/script/import/TestImport.py (910 of 1406) UNSUPPORTED: lldb-api :: commands/trace/TestTraceDumpInfo.py (911 of 1406) PASS: lldb-api :: lang/objc/objc-struct-argument/TestObjCStructArgument.py (912 of 1406) UNSUPPORTED: lldb-api :: functionalities/thread/concurrent_events/TestConcurrentBreakpointsDelayedBreakpointOneWatchpoint.py (913 of 1406) PASS: lldb-api :: functionalities/data-formatter/data-formatter-cpp/TestDataFormatterCpp.py (914 of 1406) UNSUPPORTED: lldb-shell :: Subprocess/fork-follow-parent.test (915 of 1406) PASS: lldb-shell :: SymbolFile/DWARF/x86/find-qualified-variable.cpp (916 of 1406) UNSUPPORTED: lldb-shell :: Reproducer/TestWorkingDir.test (917 of 1406) UNSUPPORTED: lldb-api :: functionalities/breakpoint/breakpoint_command/TestBreakpointCommandsFromPython.py (918 of 1406) PASS: lldb-api :: functionalities/thread/crash_during_step/TestCrashDuringStep.py (919 of 1406) PASS: lldb-api :: functionalities/gdb_remote_client/TestJLink6Armv7RegisterDefinition.py (920 of 1406) UNSUPPORTED: lldb-api :: functionalities/inferior-changed/TestInferiorChanged.py (921 of 1406) UNSUPPORTED: lldb-api :: commands/watchpoints/watchpoint_commands/command/TestWatchpointCommandLLDB.py (922 of 1406) UNSUPPORTED: lldb-shell :: SymbolFile/target-symbols-add-unwind.test (923 of 1406) PASS: lldb-api :: functionalities/unwind/noreturn/TestNoreturnUnwind.py (924 of 1406) PASS: lldb-api :: lang/c/find_struct_type/TestFindStructTypes.py (925 of 1406) UNSUPPORTED: lldb-shell :: Reproducer/Functionalities/TestDataFormatter.test (926 of 1406) PASS: lldb-api :: lang/objc/foundation/TestObjCMethodsNSArray.py (927 of 1406) PASS: lldb-api :: commands/target/stop-hooks/TestStopHookScripted.py (928 of 1406) UNSUPPORTED: lldb-api :: functionalities/thread/concurrent_events/TestConcurrentWatchpointWithDelayWatchpointThreads.py (929 of 1406) PASS: lldb-api :: python_api/exprpath_synthetic/TestExprPathSynthetic.py (930 of 1406) PASS: lldb-api :: driver/batch_mode/TestBatchMode.py (931 of 1406) PASS: lldb-api :: lang/cpp/dynamic-value-same-basename/TestDynamicValueSameBase.py (932 of 1406) PASS: lldb-api :: lang/c/set_values/TestSetValues.py (933 of 1406) PASS: lldb-api :: commands/target/select/TestTargetSelect.py (934 of 1406) UNSUPPORTED: lldb-shell :: Driver/LocalLLDBInit.test (935 of 1406) PASS: lldb-api :: functionalities/data-formatter/data-formatter-stl/libcxx/tuple/TestDataFormatterLibcxxTuple.py (936 of 1406) UNSUPPORTED: lldb-shell :: Register/x86-ymm-write.test (937 of 1406) UNSUPPORTED: lldb-api :: commands/expression/import-std-module/non-module-type-separation/TestNonModuleTypeSeparation.py (938 of 1406) UNSUPPORTED: lldb-api :: python_api/disassemble-raw-data/TestDisassemble_VST1_64.py (939 of 1406) UNSUPPORTED: lldb-shell :: Register/x86-gp-read.test (940 of 1406) PASS: lldb-api :: python_api/lldbutil/TestSwigVersion.py (941 of 1406) PASS: lldb-api :: functionalities/gdb_remote_client/TestNoGPacketSupported.py (942 of 1406) PASS: lldb-api :: tools/lldb-server/commandline/TestStubSetSID.py (943 of 1406) PASS: lldb-api :: macosx/indirect_symbol/TestIndirectSymbols.py (944 of 1406) PASS: lldb-api :: lang/cpp/limit-debug-info/TestWithLimitDebugInfo.py (945 of 1406) PASS: lldb-api :: functionalities/backticks/TestBackticksWithoutATarget.py (946 of 1406) PASS: lldb-api :: lang/objc/objc-new-syntax/TestObjCNewSyntaxDictionary.py (947 of 1406) PASS: lldb-api :: lang/cpp/type_lookup/TestCppTypeLookup.py (948 of 1406) UNSUPPORTED: lldb-shell :: SymbolFile/NativePDB/globals-fundamental.cpp (949 of 1406) PASS: lldb-api :: lang/c/shared_lib/TestSharedLib.py (950 of 1406) PASS: lldb-shell :: Expr/TestIRMemoryMap.test (951 of 1406) PASS: lldb-api :: python_api/breakpoint/TestBreakpointAPI.py (952 of 1406) UNSUPPORTED: lldb-api :: tools/lldb-vscode/stackTrace/TestVSCode_stackTrace.py (953 of 1406) PASS: lldb-api :: functionalities/return-value/TestReturnValue.py (954 of 1406) PASS: lldb-api :: macosx/find-app-in-bundle/TestFindAppInBundle.py (955 of 1406) PASS: lldb-api :: commands/expression/persistent_ptr_update/TestPersistentPtrUpdate.py (956 of 1406) PASS: lldb-shell :: Process/Optimization.test (957 of 1406) PASS: lldb-shell :: ScriptInterpreter/Python/silent_command_script_import.test (958 of 1406) UNSUPPORTED: lldb-shell :: ScriptInterpreter/Lua/nested_sessions.test (959 of 1406) PASS: lldb-api :: python_api/get-value-32bit-int/TestGetValue32BitInt.py (960 of 1406) PASS: lldb-shell :: Register/Core/x86-32-linux-fp.test (961 of 1406) PASS: lldb-shell :: Unwind/thread-step-out-ret-addr-check.test (962 of 1406) UNSUPPORTED: lldb-api :: tools/lldb-vscode/breakpoint/TestVSCode_setExceptionBreakpoints.py (963 of 1406) PASS: lldb-api :: functionalities/breakpoint/breakpoint_conditions/TestBreakpointConditions.py (964 of 1406) PASS: lldb-api :: lang/cpp/this_class_type_mixing/TestThisClassTypeMixing.py (965 of 1406) UNSUPPORTED: lldb-shell :: SymbolFile/NativePDB/ast-methods.cpp (966 of 1406) PASS: lldb-api :: macosx/builtin-debugtrap/TestBuiltinDebugTrap.py (967 of 1406) PASS: lldb-api :: functionalities/data-formatter/boolreference/TestFormattersBoolRefPtr.py (968 of 1406) UNSUPPORTED: lldb-api :: macosx/corefile-exception-reason/TestCorefileExceptionReason.py (969 of 1406) UNSUPPORTED: lldb-shell :: Subprocess/clone-follow-parent-softbp.test (970 of 1406) PASS: lldb-api :: commands/target/stop-hook/delete/TestTargetStopHookDelete.py (971 of 1406) UNSUPPORTED: lldb-api :: commands/expression/no-deadlock/TestExprDoesntBlock.py (972 of 1406) PASS: lldb-api :: functionalities/archives/TestBSDArchives.py (973 of 1406) UNSUPPORTED: lldb-api :: arm/breakpoint-it/TestBreakpointIt.py (974 of 1406) PASS: lldb-api :: functionalities/thread/exit_during_step/TestExitDuringStep.py (975 of 1406) PASS: lldb-shell :: Process/UnsupportedLanguage.test (976 of 1406) PASS: lldb-api :: lang/objc/ptr_refs/TestPtrRefsObjC.py (977 of 1406) PASS: lldb-api :: functionalities/dead-strip/TestDeadStrip.py (978 of 1406) PASS: lldb-api :: commands/expression/invalid-args/TestInvalidArgsExpression.py (979 of 1406) UNSUPPORTED: lldb-api :: functionalities/data-formatter/data-formatter-stl/libstdcpp/map/TestDataFormatterStdMap.py (980 of 1406) PASS: lldb-shell :: SymbolFile/DWARF/x86/dwarf5-debug_line.s (981 of 1406) UNSUPPORTED: lldb-api :: linux/sepdebugsymlink/TestTargetSymbolsSepDebugSymlink.py (982 of 1406) PASS: lldb-api :: functionalities/data-formatter/data-formatter-stl/libcxx/bitset/TestDataFormatterLibcxxBitset.py (983 of 1406) UNSUPPORTED: lldb-api :: functionalities/asan/TestMemoryHistory.py (984 of 1406) PASS: lldb-api :: commands/disassemble/basic/TestDisassembleBreakpoint.py (985 of 1406) PASS: lldb-api :: lang/objcxx/hide-runtime-values/TestObjCXXHideRuntimeValues.py (986 of 1406) UNSUPPORTED: lldb-api :: commands/register/register/aarch64_sve_registers/rw_access_static_config/TestSVERegisters.py (987 of 1406) PASS: lldb-shell :: SymbolFile/DWARF/x86/dwarf5-atomic.s (988 of 1406) PASS: lldb-api :: functionalities/thread/concurrent_events/TestConcurrentBreakpointOneDelayBreakpointThreads.py (989 of 1406) XFAIL: lldb-shell :: Register/x86-64-write.test (990 of 1406) UNSUPPORTED: lldb-api :: commands/expression/import-std-module/weak_ptr/TestWeakPtrFromStdModule.py (991 of 1406) PASS: lldb-shell :: SymbolFile/DWARF/x86/DW_AT_loclists_base.s (992 of 1406) PASS: lldb-shell :: SymbolFile/DWARF/x86/debug-types-missing-signature.test (993 of 1406) PASS: lldb-api :: lang/cpp/global_variables/TestCPPGlobalVariables.py (994 of 1406) UNSUPPORTED: lldb-api :: commands/platform/connect/TestPlatformConnect.py (995 of 1406) PASS: lldb-api :: python_api/value_var_update/TestValueVarUpdate.py (996 of 1406) PASS: lldb-api :: lang/cpp/inlines/TestInlines.py (997 of 1406) PASS: lldb-api :: lang/c/tls_globals/TestTlsGlobals.py (998 of 1406) UNSUPPORTED: lldb-shell :: Register/x86-fp-read.test (999 of 1406) PASS: lldb-shell :: Commands/command-thread-select.test (1000 of 1406) PASS: lldb-api :: commands/expression/unicode-in-variable/TestUnicodeInVariable.py (1001 of 1406) PASS: lldb-api :: lang/objc/objc-ivar-protocols/TestIvarProtocols.py (1002 of 1406) PASS: lldb-shell :: Commands/command-disassemble.s (1003 of 1406) UNSUPPORTED: lldb-shell :: Register/x86-zmm-write.test (1004 of 1406) UNSUPPORTED: lldb-shell :: SymbolFile/DWARF/x86/limit-debug-info.s (1005 of 1406) PASS: lldb-shell :: ObjectFile/ELF/build-id-case.yaml (1006 of 1406) UNSUPPORTED: lldb-api :: commands/watchpoints/watchpoint_on_vectors/TestValueOfVectorVariable.py (1007 of 1406) PASS: lldb-api :: functionalities/breakpoint/breakpoint_callback_command_source/TestBreakpointCallbackCommandSource.py (1008 of 1406) PASS: lldb-shell :: Settings/TestSettingsWrite.test (1009 of 1406) PASS: lldb-api :: lang/cpp/auto/TestCPPAuto.py (1010 of 1406) PASS: lldb-shell :: SymbolFile/Breakpad/symtab-macho.test (1011 of 1406) UNSUPPORTED: lldb-api :: lang/objc/foundation/TestRuntimeTypes.py (1012 of 1406) UNSUPPORTED: lldb-api :: commands/expression/import_builtin_fileid/TestImportBuiltinFileID.py (1013 of 1406) PASS: lldb-api :: functionalities/gdb_remote_client/TestNestedRegDefinitions.py (1014 of 1406) PASS: lldb-api :: api/multiple-targets/TestMultipleTargets.py (1015 of 1406) UNSUPPORTED: lldb-shell :: Subprocess/clone-follow-child-wp.test (1016 of 1406) PASS: lldb-api :: functionalities/memory/read/TestMemoryRead.py (1017 of 1406) PASS: lldb-shell :: lldb-server/TestGdbserverPort.test (1018 of 1406) UNSUPPORTED: lldb-shell :: Register/x86-64-read.test (1019 of 1406) PASS: lldb-shell :: SymbolFile/DWARF/x86/DW_OP_piece-smaller-than-struct.s (1020 of 1406) UNSUPPORTED: lldb-api :: functionalities/thread/concurrent_events/TestConcurrentTwoWatchpointsOneSignal.py (1021 of 1406) PASS: lldb-shell :: ObjectFile/wasm/stripped-debug-sections.yaml (1022 of 1406) PASS: lldb-shell :: Register/Core/x86-32-linux-addr.test (1023 of 1406) PASS: lldb-shell :: Error/assert.test (1024 of 1406) PASS: lldb-api :: commands/apropos/basic/TestApropos.py (1025 of 1406) PASS: lldb-api :: commands/expression/entry-bp/TestExprEntryBP.py (1026 of 1406) UNSUPPORTED: lldb-api :: functionalities/thread/concurrent_events/TestConcurrentWatchBreak.py (1027 of 1406) PASS: lldb-api :: commands/session/history/TestSessionHistory.py (1028 of 1406) PASS: lldb-shell :: Minidump/memory-region.yaml (1029 of 1406) UNSUPPORTED: lldb-shell :: SymbolFile/NativePDB/nested-types.cpp (1030 of 1406) PASS: lldb-shell :: BuildScript/modes.test (1031 of 1406) UNSUPPORTED: lldb-api :: functionalities/thread/concurrent_events/TestConcurrentSignalNWatchNBreak.py (1032 of 1406) PASS: lldb-api :: commands/expression/weak_symbols/TestWeakSymbols.py (1033 of 1406) UNSUPPORTED: lldb-shell :: Register/x86-64-ymm16-write.test (1034 of 1406) PASS: lldb-api :: commands/command/source/TestCommandSource.py (1035 of 1406) PASS: lldb-api :: commands/gui/basic/TestGuiBasic.py (1036 of 1406) PASS: lldb-api :: functionalities/avoids-fd-leak/TestFdLeak.py (1037 of 1406) PASS: lldb-api :: functionalities/data-formatter/array_typedef/TestArrayTypedef.py (1038 of 1406) PASS: lldb-shell :: SymbolFile/Breakpad/line-table.test (1039 of 1406) PASS: lldb-api :: commands/log/invalid-args/TestInvalidArgsLog.py (1040 of 1406) PASS: lldb-shell :: Register/Core/x86-64-freebsd-fp.test (1041 of 1406) UNSUPPORTED: lldb-api :: commands/trace/multiple-threads/TestTraceStartStopMultipleThreads.py (1042 of 1406) UNSUPPORTED: lldb-api :: commands/command/script/TestCommandScript.py (1043 of 1406) PASS: lldb-api :: commands/gui/invalid-args/TestInvalidArgsGui.py (1044 of 1406) PASS: lldb-shell :: SymbolFile/DWARF/x86/find-method-local-struct.cpp (1045 of 1406) UNSUPPORTED: lldb-api :: functionalities/thread/concurrent_events/TestConcurrentSignalDelayWatch.py (1046 of 1406) PASS: lldb-api :: lang/c/anonymous/TestAnonymous.py (1047 of 1406) UNSUPPORTED: lldb-api :: commands/expression/completion-crash-invalid-iterator/TestInvalidIteratorCompletionCrash.py (1048 of 1406) PASS: lldb-api :: functionalities/limit-debug-info/TestLimitDebugInfo.py (1049 of 1406) PASS: lldb-api :: functionalities/plugins/python_os_plugin/TestPythonOSPlugin.py (1050 of 1406) PASS: lldb-shell :: SymbolFile/DWARF/x86/dwarf5-split.s (1051 of 1406) PASS: lldb-shell :: Register/Core/x86-64-linux-gp.test (1052 of 1406) PASS: lldb-api :: commands/expression/po_verbosity/TestPoVerbosity.py (1053 of 1406) PASS: lldb-api :: commands/expression/regression-access-function-template-in-record/TestRegressionAccessFunctionTemplateInRecord.py (1054 of 1406) PASS: lldb-api :: functionalities/memory/tag/TestMemoryTag.py (1055 of 1406) UNSUPPORTED: lldb-api :: functionalities/reproducers/attach/TestReproducerAttach.py (1056 of 1406) PASS: lldb-api :: lang/cpp/multiple-inheritance/TestCppMultipleInheritance.py (1057 of 1406) PASS: lldb-api :: lang/objc/rdar-11355592/TestRdar11355592.py (1058 of 1406) PASS: lldb-api :: functionalities/data-formatter/type_summary_list_arg/TestTypeSummaryListArg.py (1059 of 1406) PASS: lldb-shell :: ObjectFile/ELF/short-build-id.yaml (1060 of 1406) UNSUPPORTED: lldb-api :: commands/expression/import-std-module/vector-bool/TestVectorBoolFromStdModule.py (1061 of 1406) PASS: lldb-api :: lang/c/record_decl_in_expr/TestRecordDeclInExpr.py (1062 of 1406) PASS: lldb-api :: types/TestLongTypesExpr.py (1063 of 1406) UNSUPPORTED: lldb-shell :: ScriptInterpreter/Lua/bindings.test (1064 of 1406) UNSUPPORTED: lldb-api :: commands/expression/import-std-module/deque-dbg-info-content/TestDbgInfoContentDequeFromStdModule.py (1065 of 1406) PASS: lldb-api :: commands/expression/two-files/TestObjCTypeQueryFromOtherCompileUnit.py (1066 of 1406) PASS: lldb-shell :: Register/Core/x86-32-netbsd-gp.test (1067 of 1406) PASS: lldb-api :: functionalities/data-formatter/hexcaps/TestDataFormatterHexCaps.py (1068 of 1406) PASS: lldb-api :: functionalities/data-formatter/data-formatter-stl/libcxx/vector/TestDataFormatterLibcxxVector.py (1069 of 1406) UNSUPPORTED: lldb-api :: commands/expression/import-std-module/pair/TestPairFromStdModule.py (1070 of 1406) PASS: lldb-api :: functionalities/abbreviation/TestCommonShortSpellings.py (1071 of 1406) PASS: lldb-api :: lang/objc/foundation/TestObjectDescriptionAPI.py (1072 of 1406) UNSUPPORTED: lldb-api :: lang/objc/print-obj/TestPrintObj.py (1073 of 1406) PASS: lldb-api :: python_api/sbvalue_const_addrof/TestSBValueConstAddrOf.py (1074 of 1406) PASS: lldb-api :: lang/cpp/char8_t/TestCxxChar8_t.py (1075 of 1406) UNSUPPORTED: lldb-api :: functionalities/data-formatter/data-formatter-stl/libstdcpp/tuple/TestDataFormatterStdTuple.py (1076 of 1406) UNSUPPORTED: lldb-api :: benchmarks/continue/TestBenchmarkContinue.py (1077 of 1406) UNSUPPORTED: lldb-api :: functionalities/thread/concurrent_events/TestConcurrentSignalWatch.py (1078 of 1406) UNSUPPORTED: lldb-shell :: ScriptInterpreter/Lua/fail_breakpoint_oneline.test (1079 of 1406) PASS: lldb-shell :: SymbolFile/DWARF/clang-ast-from-dwarf-unamed-and-anon-structs.cpp (1080 of 1406) PASS: lldb-api :: macosx/save_crashlog/TestSaveCrashlog.py (1081 of 1406) PASS: lldb-api :: commands/gui/viewlarge/TestGuiViewLarge.py (1082 of 1406) UNSUPPORTED: lldb-api :: linux/add-symbols/TestTargetSymbolsAddCommand.py (1083 of 1406) UNSUPPORTED: lldb-shell :: BuildScript/toolchain-msvc.test (1084 of 1406) PASS: lldb-api :: python_api/sbstructureddata/TestStructuredDataAPI.py (1085 of 1406) UNSUPPORTED: lldb-api :: functionalities/tail_call_frames/unambiguous_sequence/TestUnambiguousTailCalls.py (1086 of 1406) UNSUPPORTED: lldb-shell :: SymbolFile/DWARF/x86/find-basic-namespace.cpp (1087 of 1406) UNSUPPORTED: lldb-shell :: SymbolFile/DWARF/x86/inline-function-address.ll (1088 of 1406) PASS: lldb-api :: functionalities/breakpoint/move_nearest/TestMoveNearest.py (1089 of 1406) UNSUPPORTED: lldb-api :: functionalities/thread/multi_break/TestMultipleBreakpoints.py (1090 of 1406) XFAIL: lldb-shell :: Register/x86-64-ymm-write.test (1091 of 1406) PASS: lldb-api :: commands/expression/save_jit_objects/TestSaveJITObjects.py (1092 of 1406) PASS: lldb-api :: commands/process/signal/TestProcessSignal.py (1093 of 1406) PASS: lldb-api :: linux/builtin_trap/TestBuiltinTrap.py (1094 of 1406) PASS: lldb-api :: functionalities/data-formatter/data-formatter-objc/cmtime/TestDataFormatterCMTime.py (1095 of 1406) PASS: lldb-api :: functionalities/postmortem/minidump-new/TestMiniDumpNew.py (1096 of 1406) PASS: lldb-shell :: SymbolFile/DWARF/x86/debug_loclists-dwp.s (1097 of 1406) PASS: lldb-shell :: Minidump/memory-region-from-module.yaml (1098 of 1406) PASS: lldb-shell :: ObjectFile/MachO/subsections.yaml (1099 of 1406) PASS: lldb-shell :: Driver/TestSingleQuote.test (1100 of 1406) UNSUPPORTED: lldb-shell :: ObjectFile/ELF/minidebuginfo-no-lzma.yaml (1101 of 1406) PASS: lldb-shell :: Register/Core/x86-32-freebsd-gp.test (1102 of 1406) UNSUPPORTED: lldb-shell :: SymbolFile/DWARF/debug-types-expressions.test (1103 of 1406) PASS: lldb-shell :: ObjectFile/ELF/many-sections.s (1104 of 1406) PASS: lldb-api :: api/multiple-debuggers/TestMultipleDebuggers.py (1105 of 1406) UNSUPPORTED: lldb-shell :: SymbolFile/DWARF/x86/dir-separator-no-comp-dir.s (1106 of 1406) UNSUPPORTED: lldb-shell :: SymbolFile/DWARF/x86/subprogram_ranges.test (1107 of 1406) PASS: lldb-api :: lang/cpp/scope/TestCppScope.py (1108 of 1406) PASS: lldb-api :: python_api/target/TestTargetAPI.py (1109 of 1406) PASS: lldb-api :: lang/objc/foundation/TestFoundationDisassembly.py (1110 of 1406) UNSUPPORTED: lldb-shell :: ScriptInterpreter/Python/Crashlog/parser_text.test (1111 of 1406) UNSUPPORTED: lldb-api :: functionalities/tail_call_frames/disambiguate_call_site/TestDisambiguateCallSite.py (1112 of 1406) PASS: lldb-api :: functionalities/data-formatter/synthupdate/TestSyntheticFilterRecompute.py (1113 of 1406) PASS: lldb-api :: lang/objc/forward-decl/TestForwardDecl.py (1114 of 1406) PASS: lldb-api :: lang/cpp/operator-overload/TestOperatorOverload.py (1115 of 1406) UNSUPPORTED: lldb-api :: commands/gui/basicdebug/TestGuiBasicDebug.py (1116 of 1406) UNSUPPORTED: lldb-api :: functionalities/ptrauth_diagnostics/BLRAA_error/TestPtrauthBLRAADiagnostic.py (1117 of 1406) UNSUPPORTED: lldb-shell :: SymbolFile/DWARF/x86/dir-separator-windows.s (1118 of 1406) UNSUPPORTED: lldb-api :: lang/objc/modules-hash-mismatch/TestClangModulesHashMismatch.py (1119 of 1406) UNSUPPORTED: lldb-shell :: SymbolFile/NativePDB/break-by-function.cpp (1120 of 1406) PASS: lldb-api :: lang/c/shared_lib_stripped_symbols/TestSharedLibStrippedSymbols.py (1121 of 1406) PASS: lldb-shell :: SymbolFile/DWARF/x86/debug_rnglists.s (1122 of 1406) PASS: lldb-api :: functionalities/gdb_remote_client/TestMemoryRegionDirtyPages.py (1123 of 1406) UNSUPPORTED: lldb-shell :: ScriptInterpreter/Lua/convenience_variables.test (1124 of 1406) FAIL: lldb-api :: python_api/process/TestProcessAPI.py (1125 of 1406) ******************** TEST 'lldb-api :: python_api/process/TestProcessAPI.py' FAILED ******************** Script: -- /usr/local/Frameworks/Python.framework/Versions/3.7/bin/python3.7 /Users/buildslave/jenkins/workspace/lldb-cmake-matrix/llvm-project/lldb/test/API/dotest.py -u CXXFLAGS -u CFLAGS --codesign-identity lldb_codesign --arch x86_64 --build-dir /Users/buildslave/jenkins/workspace/lldb-cmake-matrix/lldb-build/lldb-test-build.noindex -t --env TERM=vt100 --skip-category gmodules --skip-category watchpoint --arch=x86_64 --env LLVM_LIBS_DIR=/Users/buildslave/jenkins/workspace/lldb-cmake-matrix/lldb-build/./lib --arch x86_64 --build-dir /Users/buildslave/jenkins/workspace/lldb-cmake-matrix/lldb-build/lldb-test-build.noindex --lldb-module-cache-dir /Users/buildslave/jenkins/workspace/lldb-cmake-matrix/lldb-build/lldb-test-build.noindex/module-cache-lldb/lldb-api --clang-module-cache-dir /Users/buildslave/jenkins/workspace/lldb-cmake-matrix/lldb-build/lldb-test-build.noindex/module-cache-clang/lldb-api --executable /Users/buildslave/jenkins/workspace/lldb-cmake-matrix/lldb-build/./bin/lldb --compiler /Users/buildslave/jenkins/workspace/lldb-cmake-matrix/clang_900_build/bin/clang --dsymutil /Users/buildslave/jenkins/workspace/lldb-cmake-matrix/lldb-build/./bin/dsymutil --llvm-tools-dir /Users/buildslave/jenkins/workspace/lldb-cmake-matrix/lldb-build/./bin --lldb-libs-dir /Users/buildslave/jenkins/workspace/lldb-cmake-matrix/lldb-build/./lib --skip-category=lldb-vscode --skip-category=std-module /Users/buildslave/jenkins/workspace/lldb-cmake-matrix/llvm-project/lldb/test/API/python_api/process -p TestProcessAPI.py --capture-path /Users/buildslave/jenkins/workspace/lldb-cmake-matrix/lldb-build/lldb-test-build.noindex/reproducers/TestProcessAPI.py -- Exit Code: -6

Hide Details

Command Output (stdout): -- lldb version 14.0.99 (http://labmaster3.local/git/llvm-project.git revision e7249e4acf3cf9438d6d9e02edecebd5b622a4dc) clang revision e7249e4acf3cf9438d6d9e02edecebd5b622a4dc llvm revision e7249e4acf3cf9438d6d9e02edecebd5b622a4dc

Hide Details

-- Command Output (stderr): -- Assertion failed: (m_result_recorded && "Did you forget LLDB_RECORD_RESULT?"), function ~Recorder, file /Users/buildslave/jenkins/workspace/lldb-cmake-matrix/llvm-project/lldb/source/Utility/ReproducerInstrumentation.cpp, line 221. Fatal Python error: Aborted

Hide Details

Current thread 0x000000010e309dc0 (most recent call first): File "/Users/buildslave/jenkins/workspace/lldb-cmake-matrix/lldb-build/lib/python3.7/site-packages/lldb/__init__.py", line 8799 in DeallocateMemory File "/Users/buildslave/jenkins/workspace/lldb-cmake-matrix/llvm-project/lldb/test/API/python_api/process/TestProcessAPI.py", line 453 in test_allocate_deallocate_memory File "/Users/buildslave/jenkins/workspace/lldb-cmake-matrix/llvm-project/lldb/packages/Python/lldbsuite/test/lldbtest.py", line 1835 in test_method File "/Users/buildslave/jenkins/workspace/lldb-cmake-matrix/llvm-project/lldb/third_party/Python/module/unittest2/unittest2/case.py", line 413 in runMethod File "/Users/buildslave/jenkins/workspace/lldb-cmake-matrix/llvm-project/lldb/third_party/Python/module/unittest2/unittest2/case.py", line 383 in run File "/Users/buildslave/jenkins/workspace/lldb-cmake-matrix/llvm-project/lldb/third_party/Python/module/unittest2/unittest2/case.py", line 458 in __call__ File "/Users/buildslave/jenkins/workspace/lldb-cmake-matrix/llvm-project/lldb/third_party/Python/module/unittest2/unittest2/suite.py", line 117 in _wrapped_run File "/Users/buildslave/jenkins/workspace/lldb-cmake-matrix/llvm-project/lldb/third_party/Python/module/unittest2/unittest2/suite.py", line 115 in _wrapped_run File "/Users/buildslave/jenkins/workspace/lldb-cmake-matrix/llvm-project/lldb/third_party/Python/module/unittest2/unittest2/suite.py", line 85 in run File "/Users/buildslave/jenkins/workspace/lldb-cmake-matrix/llvm-project/lldb/third_party/Python/module/unittest2/unittest2/suite.py", line 66 in __call__ File "/Users/buildslave/jenkins/workspace/lldb-cmake-matrix/llvm-project/lldb/third_party/Python/module/unittest2/unittest2/runner.py", line 165 in run File "/Users/buildslave/jenkins/workspace/lldb-cmake-matrix/llvm-project/lldb/packages/Python/lldbsuite/test/dotest.py", line 1017 in run_suite File "/Users/buildslave/jenkins/workspace/lldb-cmake-matrix/llvm-project/lldb/test/API/dotest.py", line 7 in <module>

Hide Details

--

Hide Details

******************** PASS: lldb-shell :: Breakpoint/split-dwarf-5-addrbase.test (1126 of 1406) PASS: lldb-shell :: Commands/command-backtrace-parser-2.test (1127 of 1406) PASS: lldb-api :: functionalities/gdb_remote_client/TestStopPCs.py (1128 of 1406) UNSUPPORTED: lldb-api :: functionalities/asan/TestReportData.py (1129 of 1406) UNSUPPORTED: lldb-shell :: SymbolFile/DWARF/x86/debug_loc.s (1130 of 1406) PASS: lldb-shell :: SymbolFile/DWARF/x86/static_scope.s (1131 of 1406) PASS: lldb-api :: tools/lldb-server/TestGdbRemoteExitCode.py (1132 of 1406) UNSUPPORTED: lldb-shell :: ScriptInterpreter/Lua/breakpoint_oneline_callback.test (1133 of 1406) UNSUPPORTED: lldb-api :: macosx/macCatalystAppMacOSFramework/TestMacCatalystAppWithMacOSFramework.py (1134 of 1406) PASS: lldb-api :: commands/platform/basic/TestPlatformCommand.py (1135 of 1406) UNSUPPORTED: lldb-api :: python_api/file_handle/TestFileHandle.py (1136 of 1406) UNSUPPORTED: lldb-api :: functionalities/unwind/standard/TestStandardUnwind.py (1137 of 1406) PASS: lldb-api :: lang/cpp/class-template-non-type-parameter-pack/TestClassTemplateNonTypeParameterPack.py (1138 of 1406) UNSUPPORTED: lldb-api :: tools/lldb-server/TestAppleSimulatorOSType.py (1139 of 1406) PASS: lldb-api :: commands/quit/TestQuit.py (1140 of 1406) PASS: lldb-api :: functionalities/gdb_remote_client/TestMultiprocess.py (1141 of 1406) UNSUPPORTED: lldb-api :: benchmarks/startup/TestStartupDelays.py (1142 of 1406) UNSUPPORTED: lldb-api :: macosx/find-dsym/bundle-with-dot-in-filename/TestBundleWithDotInFilename.py (1143 of 1406) UNSUPPORTED: lldb-shell :: Subprocess/vfork-follow-parent.test (1144 of 1406) PASS: lldb-shell :: Expr/TestMultilineExpr.test (1145 of 1406) XFAIL: lldb-shell :: Register/x86-64-fp-read.test (1146 of 1406) PASS: lldb-api :: tools/lldb-server/memory-allocation/TestGdbRemoteMemoryAllocation.py (1147 of 1406) PASS: lldb-api :: lang/cpp/operators/TestCppOperators.py (1148 of 1406) PASS: lldb-shell :: SymbolFile/DWARF/x86/dwo-type-in-main-file.s (1149 of 1406) UNSUPPORTED: lldb-api :: python_api/sbdata/TestSBData.py (1150 of 1406) PASS: lldb-shell :: ObjectFile/ELF/aarch64-relocations.yaml (1151 of 1406) PASS: lldb-api :: functionalities/gdb_remote_client/TestGDBRemoteClient.py (1152 of 1406) PASS: lldb-api :: functionalities/scripted_process/TestScriptedProcess.py (1153 of 1406) PASS: lldb-api :: lang/cpp/extern_c/TestExternCSymbols.py (1154 of 1406) PASS: lldb-api :: lang/c/stepping/TestThreadStepping.py (1155 of 1406) PASS: lldb-api :: functionalities/gdb_remote_client/TestProcessConnect.py (1156 of 1406) PASS: lldb-api :: python_api/function_symbol/TestDisasmAPI.py (1157 of 1406) PASS: lldb-shell :: Register/Core/x86-32-freebsd-addr.test (1158 of 1406) UNSUPPORTED: lldb-api :: python_api/watchpoint/watchlocation/TestSetWatchlocation.py (1159 of 1406) PASS: lldb-api :: api/multithreaded/TestMultithreaded.py (1160 of 1406) PASS: lldb-api :: tools/lldb-server/register-reading/TestGdbRemoteGPacket.py (1161 of 1406) UNSUPPORTED: lldb-shell :: SymbolFile/DWARF/find-type-in-function.cpp (1162 of 1406) PASS: lldb-shell :: ObjectFile/MachO/lc_version_min.yaml (1163 of 1406) UNSUPPORTED: lldb-shell :: SymbolFile/DWARF/x86/debug-types-basic.test (1164 of 1406) UNSUPPORTED: lldb-api :: commands/process/attach/attach_denied/TestAttachDenied.py (1165 of 1406) UNSUPPORTED: lldb-api :: commands/watchpoints/multiple_threads/TestWatchpointMultipleThreads.py (1166 of 1406) UNSUPPORTED: lldb-api :: commands/expression/timeout/TestCallWithTimeout.py (1167 of 1406) PASS: lldb-shell :: BuildScript/script-args.test (1168 of 1406) UNSUPPORTED: lldb-api :: functionalities/longjmp/TestLongjmp.py (1169 of 1406) UNSUPPORTED: lldb-api :: commands/expression/import-std-module/empty-module/TestEmptyStdModule.py (1170 of 1406) PASS: lldb-shell :: Minidump/Windows/Sigsegv/sigsegv.test (1171 of 1406) UNSUPPORTED: lldb-shell :: Reproducer/TestGDBRemoteRepro.test (1172 of 1406) PASS: lldb-api :: lang/cpp/thread_local/TestThreadLocal.py (1173 of 1406) UNSUPPORTED: lldb-shell :: Driver/TestCore.test (1174 of 1406) UNSUPPORTED: lldb-shell :: Process/TestEnvironment.test (1175 of 1406) PASS: lldb-api :: commands/expression/ignore-artificial-constructors/TestIgnoreArtificialConstructors.py (1176 of 1406) PASS: lldb-shell :: ObjectFile/MachO/lc_build_version_notools.yaml (1177 of 1406) PASS: lldb-api :: commands/expression/multiline-completion/TestMultilineCompletion.py (1178 of 1406) PASS: lldb-api :: functionalities/data-formatter/data-formatter-stl/libcxx/shared_ptr/TestDataFormatterLibcxxSharedPtr.py (1179 of 1406) PASS: lldb-api :: functionalities/load_unload/TestLoadUnload.py (1180 of 1406) PASS: lldb-api :: iohandler/unicode/TestUnicode.py (1181 of 1406) PASS: lldb-api :: tools/lldb-server/TestGdbRemoteAttach.py (1182 of 1406) UNSUPPORTED: lldb-api :: lang/objc/objc-dynamic-value/TestObjCDynamicValue.py (1183 of 1406) UNSUPPORTED: lldb-api :: linux/aarch64/mte_tag_access/TestAArch64LinuxMTEMemoryTagAccess.py (1184 of 1406) PASS: lldb-api :: functionalities/postmortem/mach-core/TestMachCore.py (1185 of 1406) PASS: lldb-shell :: Breakpoint/debug_addrx.test (1186 of 1406) UNSUPPORTED: lldb-api :: commands/watchpoints/watchpoint_set_command/TestWatchLocationWithWatchSet.py (1187 of 1406) PASS: lldb-api :: functionalities/thread/concurrent_events/TestConcurrentTwoBreakpointThreads.py (1188 of 1406) PASS: lldb-api :: functionalities/testid/TestTestId.py (1189 of 1406) PASS: lldb-api :: types/TestFloatTypesExpr.py (1190 of 1406) UNSUPPORTED: lldb-shell :: Reproducer/TestReuseDirectory.test (1191 of 1406) UNSUPPORTED: lldb-api :: functionalities/tsan/global_location/TestTsanGlobalLocation.py (1192 of 1406) PASS: lldb-api :: tools/lldb-server/TestGdbRemoteExpeditedRegisters.py (1193 of 1406) UNSUPPORTED: lldb-api :: commands/trace/TestTraceSchema.py (1194 of 1406) UNSUPPORTED: lldb-api :: benchmarks/libcxxlist/TestBenchmarkLibcxxList.py (1195 of 1406) PASS: lldb-api :: functionalities/gdb_remote_client/TestRecognizeBreakpoint.py (1196 of 1406) UNSUPPORTED: lldb-api :: functionalities/gdb_remote_client/TestRestartBug.py (1197 of 1406) UNSUPPORTED: lldb-api :: lang/objc/modules/TestObjCModules.py (1198 of 1406) PASS: lldb-api :: commands/expression/call-function/TestCallStdStringFunction.py (1199 of 1406) UNSUPPORTED: lldb-api :: python_api/disassemble-raw-data/TestDisassembleRawData.py (1200 of 1406) PASS: lldb-api :: functionalities/data-formatter/data-formatter-stl/libcxx/set/TestDataFormatterLibcxxSet.py (1201 of 1406) UNSUPPORTED: lldb-shell :: SymbolFile/NativePDB/ast-types.cpp (1202 of 1406) PASS: lldb-api :: lang/cpp/namespace/TestNamespaceLookup.py (1203 of 1406) PASS: lldb-shell :: ObjectFile/wasm/unified-debug-sections.yaml (1204 of 1406) PASS: lldb-api :: functionalities/breakpoint/global_constructor/TestBreakpointInGlobalConstructor.py (1205 of 1406) PASS: lldb-api :: functionalities/data-formatter/data-formatter-stl/libcxx/string/TestDataFormatterLibcxxString.py (1206 of 1406) UNSUPPORTED: lldb-api :: functionalities/ubsan/user-expression/TestUbsanUserExpression.py (1207 of 1406) PASS: lldb-api :: functionalities/breakpoint/breakpoint_by_file_colon_line/TestBreakpointByFileColonLine.py (1208 of 1406) PASS: lldb-shell :: ObjectFile/ELF/avr-basic-info.yaml (1209 of 1406) PASS: lldb-api :: functionalities/data-formatter/data-formatter-stl/libcxx/initializerlist/TestInitializerList.py (1210 of 1406) XFAIL: lldb-shell :: Register/x86-mm-xmm-write.test (1211 of 1406) UNSUPPORTED: lldb-api :: commands/expression/import-std-module/deque-basic/TestDequeFromStdModule.py (1212 of 1406) UNSUPPORTED: lldb-shell :: ScriptInterpreter/Python/fail_breakpoint_oneline.test (1213 of 1406) PASS: lldb-api :: lang/c/step-target/TestStepTarget.py (1214 of 1406) PASS: lldb-api :: lang/objc/objc++/TestObjCXX.py (1215 of 1406) PASS: lldb-api :: lang/objc/real-definition/TestRealDefinition.py (1216 of 1406) PASS: lldb-api :: macosx/queues/TestQueues.py (1217 of 1406) PASS: lldb-shell :: Driver/TestNoUseColor.test (1218 of 1406) PASS: lldb-api :: lang/cpp/class_types/TestClassTypes.py (1219 of 1406) XFAIL: lldb-shell :: Expr/nodefaultlib.cpp (1220 of 1406) PASS: lldb-api :: functionalities/data-formatter/poarray/TestPrintObjectArray.py (1221 of 1406) PASS: lldb-shell :: Driver/TestConvenienceVariables.test (1222 of 1406) PASS: lldb-api :: functionalities/breakpoint/breakpoint_language/TestBreakpointLanguage.py (1223 of 1406) PASS: lldb-api :: macosx/add-dsym/TestAddDsymMidExecutionCommand.py (1224 of 1406) UNSUPPORTED: lldb-shell :: SymbolFile/PDB/calling-conventions.test (1225 of 1406) PASS: lldb-api :: functionalities/data-formatter/data-formatter-objc/TestDataFormatterObjCNSDate.py (1226 of 1406) PASS: lldb-api :: lang/objc/foundation/TestObjCMethodsString.py (1227 of 1406) PASS: lldb-shell :: ObjectFile/ELF/base-address.yaml (1228 of 1406) UNSUPPORTED: lldb-api :: functionalities/breakpoint/hardware_breakpoints/hardware_breakpoint_on_multiple_threads/TestHWBreakMultiThread.py (1229 of 1406) PASS: lldb-shell :: Breakpoint/dummy-target.test (1230 of 1406) UNSUPPORTED: lldb-shell :: ScriptInterpreter/Lua/breakpoint_function_callback.test (1231 of 1406) PASS: lldb-api :: functionalities/gdb_remote_client/TestPlatformClient.py (1232 of 1406) UNSUPPORTED: lldb-shell :: Unwind/basic-block-sections.test (1233 of 1406) PASS: lldb-api :: commands/expression/result_numbering/TestResultNumbering.py (1234 of 1406) PASS: lldb-api :: functionalities/gdb_remote_client/TestTargetXMLArch.py (1235 of 1406) PASS: lldb-api :: commands/expression/context-object-objc/TestContextObjectObjc.py (1236 of 1406) PASS: lldb-api :: macosx/DBGSourcePathRemapping/TestDSYMSourcePathRemapping.py (1237 of 1406) UNSUPPORTED: lldb-shell :: Subprocess/vfork-follow-parent-softbp.test (1238 of 1406) PASS: lldb-api :: commands/expression/deleting-implicit-copy-constructor/TestDeletingImplicitCopyConstructor.py (1239 of 1406) PASS: lldb-api :: lang/objcxx/objc-builtin-types/TestObjCBuiltinTypes.py (1240 of 1406) UNSUPPORTED: lldb-shell :: Subprocess/fork-follow-child.test (1241 of 1406) UNSUPPORTED: lldb-shell :: SymbolFile/DWARF/split-dwarf-expression-eval-bug.cpp (1242 of 1406) PASS: lldb-api :: functionalities/gdb_remote_client/TestGDBRemotePlatformFile.py (1243 of 1406) PASS: lldb-api :: api/listeners/TestListener.py (1244 of 1406) PASS: lldb-api :: lang/objc/foundation/TestObjCMethods2.py (1245 of 1406) PASS: lldb-api :: lang/c/forward/TestForwardDeclaration.py (1246 of 1406) PASS: lldb-api :: functionalities/breakpoint/cpp/TestCPPBreakpointLocations.py (1247 of 1406) PASS: lldb-shell :: Commands/command-script-import.test (1248 of 1406) UNSUPPORTED: lldb-shell :: Register/x86-64-gp-write.test (1249 of 1406) PASS: lldb-shell :: SymbolFile/Breakpad/line-table-missing-file.test (1250 of 1406) PASS: lldb-api :: commands/target/create-deps/TestTargetCreateDeps.py (1251 of 1406) PASS: lldb-api :: commands/expression/call-function/TestCallBuiltinFunction.py (1252 of 1406) UNSUPPORTED: lldb-api :: tools/lldb-vscode/breakpoint-events/TestVSCode_breakpointEvents.py (1253 of 1406) PASS: lldb-api :: lang/c/function_types/TestFunctionTypes.py (1254 of 1406) PASS: lldb-api :: python_api/value/empty_class/TestValueAPIEmptyClass.py (1255 of 1406) PASS: lldb-shell :: ObjectFile/ELF/section-addresses.yaml (1256 of 1406) UNSUPPORTED: lldb-shell :: Subprocess/fork-follow-child-softbp.test (1257 of 1406) PASS: lldb-api :: functionalities/breakpoint/objc/TestObjCBreakpoints.py (1258 of 1406) UNSUPPORTED: lldb-api :: functionalities/process_group/TestChangeProcessGroup.py (1259 of 1406) PASS: lldb-api :: commands/platform/process/list/TestProcessList.py (1260 of 1406) PASS: lldb-api :: lang/c/const_variables/TestConstVariables.py (1261 of 1406) UNSUPPORTED: lldb-api :: functionalities/signal/TestSendSignal.py (1262 of 1406) UNSUPPORTED: lldb-api :: functionalities/data-formatter/data-formatter-stl/libstdcpp/iterator/TestDataFormatterStdIterator.py (1263 of 1406) PASS: lldb-api :: lang/cpp/incompatible-class-templates/TestCppIncompatibleClassTemplates.py (1264 of 1406) PASS: lldb-shell :: ObjectFile/PECOFF/sections.yaml (1265 of 1406) UNSUPPORTED: lldb-shell :: Subprocess/vfork-follow-child-wp.test (1266 of 1406) PASS: lldb-api :: functionalities/data-formatter/compactvectors/TestCompactVectors.py (1267 of 1406) UNSUPPORTED: lldb-shell :: SymbolFile/PDB/variables-locations.test (1268 of 1406) PASS: lldb-api :: functionalities/gdb_remote_client/TestGDBRemoteLoad.py (1269 of 1406) PASS: lldb-api :: functionalities/inferior-assert/TestInferiorAssert.py (1270 of 1406) PASS: lldb-shell :: SymbolFile/DWARF/x86/parallel-indexing-stress.s (1271 of 1406) UNSUPPORTED: lldb-shell :: ObjectFile/ELF/minidebuginfo-set-and-hit-breakpoint.test (1272 of 1406) UNSUPPORTED: lldb-api :: commands/watchpoints/watchpoint_count/TestWatchpointCount.py (1273 of 1406) PASS: lldb-api :: sanity/TestModuleCacheSanity.py (1274 of 1406) UNSUPPORTED: lldb-shell :: SymbolFile/NativePDB/function-types-calling-conv.cpp (1275 of 1406) PASS: lldb-shell :: Minidump/fb-dump.test (1276 of 1406) PASS: lldb-api :: functionalities/source-map/TestTargetSourceMap.py (1277 of 1406) UNSUPPORTED: lldb-api :: commands/watchpoints/multiple_hits/TestMultipleHits.py (1278 of 1406) UNSUPPORTED: lldb-shell :: Reproducer/TestDriverOptions.test (1279 of 1406) FAIL: lldb-api :: tools/lldb-server/TestLldbGdbServer.py (1280 of 1406) ******************** TEST 'lldb-api :: tools/lldb-server/TestLldbGdbServer.py' FAILED ******************** Script: -- /usr/local/Frameworks/Python.framework/Versions/3.7/bin/python3.7 /Users/buildslave/jenkins/workspace/lldb-cmake-matrix/llvm-project/lldb/test/API/dotest.py -u CXXFLAGS -u CFLAGS --codesign-identity lldb_codesign --arch x86_64 --build-dir /Users/buildslave/jenkins/workspace/lldb-cmake-matrix/lldb-build/lldb-test-build.noindex -t --env TERM=vt100 --skip-category gmodules --skip-category watchpoint --arch=x86_64 --env LLVM_LIBS_DIR=/Users/buildslave/jenkins/workspace/lldb-cmake-matrix/lldb-build/./lib --arch x86_64 --build-dir /Users/buildslave/jenkins/workspace/lldb-cmake-matrix/lldb-build/lldb-test-build.noindex --lldb-module-cache-dir /Users/buildslave/jenkins/workspace/lldb-cmake-matrix/lldb-build/lldb-test-build.noindex/module-cache-lldb/lldb-api --clang-module-cache-dir /Users/buildslave/jenkins/workspace/lldb-cmake-matrix/lldb-build/lldb-test-build.noindex/module-cache-clang/lldb-api --executable /Users/buildslave/jenkins/workspace/lldb-cmake-matrix/lldb-build/./bin/lldb --compiler /Users/buildslave/jenkins/workspace/lldb-cmake-matrix/clang_900_build/bin/clang --dsymutil /Users/buildslave/jenkins/workspace/lldb-cmake-matrix/lldb-build/./bin/dsymutil --llvm-tools-dir /Users/buildslave/jenkins/workspace/lldb-cmake-matrix/lldb-build/./bin --lldb-libs-dir /Users/buildslave/jenkins/workspace/lldb-cmake-matrix/lldb-build/./lib --skip-category=lldb-vscode --skip-category=std-module /Users/buildslave/jenkins/workspace/lldb-cmake-matrix/llvm-project/lldb/test/API/tools/lldb-server -p TestLldbGdbServer.py --capture-path /Users/buildslave/jenkins/workspace/lldb-cmake-matrix/lldb-build/lldb-test-build.noindex/reproducers/TestLldbGdbServer.py -- Exit Code: 1

Hide Details

Command Output (stdout): -- lldb version 14.0.99 (http://labmaster3.local/git/llvm-project.git revision e7249e4acf3cf9438d6d9e02edecebd5b622a4dc) clang revision e7249e4acf3cf9438d6d9e02edecebd5b622a4dc llvm revision e7249e4acf3cf9438d6d9e02edecebd5b622a4dc Skipping the following test categories: ['gmodules', 'watchpoint', 'lldb-vscode', 'std-module', 'libstdcxx', 'dwo', 'llgs', 'fork']

Hide Details

-- Command Output (stderr): -- Change dir to: /Users/buildslave/jenkins/workspace/lldb-cmake-matrix/llvm-project/lldb/test/API/tools/lldb-server XFAIL: LLDB (/Users/buildslave/jenkins/workspace/lldb-cmake-matrix/clang_900_build/bin/clang-x86_64) :: test_Hc_then_Csignal_signals_correct_thread_launch_debugserver (TestLldbGdbServer.LldbGdbServerTestCase) UNSUPPORTED: LLDB (/Users/buildslave/jenkins/workspace/lldb-cmake-matrix/clang_900_build/bin/clang-x86_64) :: test_Hc_then_Csignal_signals_correct_thread_launch_llgs (TestLldbGdbServer.LldbGdbServerTestCase) (test case does not fall in any category of interest for this run) UNSUPPORTED: LLDB (/Users/buildslave/jenkins/workspace/lldb-cmake-matrix/clang_900_build/bin/clang-x86_64) :: test_Hg_fails_on_another_pid_llgs (TestLldbGdbServer.LldbGdbServerTestCase) (test case does not fall in any category of interest for this run) UNSUPPORTED: LLDB (/Users/buildslave/jenkins/workspace/lldb-cmake-matrix/clang_900_build/bin/clang-x86_64) :: test_Hg_fails_on_minus_one_pid_llgs (TestLldbGdbServer.LldbGdbServerTestCase) (test case does not fall in any category of interest for this run) UNSUPPORTED: LLDB (/Users/buildslave/jenkins/workspace/lldb-cmake-matrix/clang_900_build/bin/clang-x86_64) :: test_Hg_fails_on_zero_pid_llgs (TestLldbGdbServer.LldbGdbServerTestCase) (test case does not fall in any category of interest for this run) PASS: LLDB (/Users/buildslave/jenkins/workspace/lldb-cmake-matrix/clang_900_build/bin/clang-x86_64) :: test_Hg_switches_to_3_threads_attach_debugserver (TestLldbGdbServer.LldbGdbServerTestCase) UNSUPPORTED: LLDB (/Users/buildslave/jenkins/workspace/lldb-cmake-matrix/clang_900_build/bin/clang-x86_64) :: test_Hg_switches_to_3_threads_attach_llgs (TestLldbGdbServer.LldbGdbServerTestCase) (test case does not fall in any category of interest for this run) UNSUPPORTED: LLDB (/Users/buildslave/jenkins/workspace/lldb-cmake-matrix/clang_900_build/bin/clang-x86_64) :: test_Hg_switches_to_3_threads_attach_pass_correct_pid_llgs (TestLldbGdbServer.LldbGdbServerTestCase) (test case does not fall in any category of interest for this run) FAIL: LLDB (/Users/buildslave/jenkins/workspace/lldb-cmake-matrix/clang_900_build/bin/clang-x86_64) :: test_Hg_switches_to_3_threads_launch_debugserver (TestLldbGdbServer.LldbGdbServerTestCase) UNSUPPORTED: LLDB (/Users/buildslave/jenkins/workspace/lldb-cmake-matrix/clang_900_build/bin/clang-x86_64) :: test_Hg_switches_to_3_threads_launch_llgs (TestLldbGdbServer.LldbGdbServerTestCase) (test case does not fall in any category of interest for this run) PASS: LLDB (/Users/buildslave/jenkins/workspace/lldb-cmake-matrix/clang_900_build/bin/clang-x86_64) :: test_P_and_p_thread_suffix_work_debugserver (TestLldbGdbServer.LldbGdbServerTestCase) UNSUPPORTED: LLDB (/Users/buildslave/jenkins/workspace/lldb-cmake-matrix/clang_900_build/bin/clang-x86_64) :: test_P_and_p_thread_suffix_work_llgs (TestLldbGdbServer.LldbGdbServerTestCase) (test case does not fall in any category of interest for this run) successful writes: 7, failed writes: 11

Hide Details

PASS: LLDB (/Users/buildslave/jenkins/workspace/lldb-cmake-matrix/clang_900_build/bin/clang-x86_64) :: test_P_writes_all_gpr_registers_debugserver (TestLldbGdbServer.LldbGdbServerTestCase) UNSUPPORTED: LLDB (/Users/buildslave/jenkins/workspace/lldb-cmake-matrix/clang_900_build/bin/clang-x86_64) :: test_P_writes_all_gpr_registers_llgs (TestLldbGdbServer.LldbGdbServerTestCase) (test case does not fall in any category of interest for this run) UNSUPPORTED: LLDB (/Users/buildslave/jenkins/workspace/lldb-cmake-matrix/clang_900_build/bin/clang-x86_64) :: test_QEnvironmentHexEncoded_llgs (TestLldbGdbServer.LldbGdbServerTestCase) (test case does not fall in any category of interest for this run) UNSUPPORTED: LLDB (/Users/buildslave/jenkins/workspace/lldb-cmake-matrix/clang_900_build/bin/clang-x86_64) :: test_QEnvironment_llgs (TestLldbGdbServer.LldbGdbServerTestCase) (test case does not fall in any category of interest for this run) PASS: LLDB (/Users/buildslave/jenkins/workspace/lldb-cmake-matrix/clang_900_build/bin/clang-x86_64) :: test_attach_commandline_continue_app_exits_debugserver (TestLldbGdbServer.LldbGdbServerTestCase) UNSUPPORTED: LLDB (/Users/buildslave/jenkins/workspace/lldb-cmake-matrix/clang_900_build/bin/clang-x86_64) :: test_attach_commandline_continue_app_exits_llgs (TestLldbGdbServer.LldbGdbServerTestCase) (test case does not fall in any category of interest for this run) PASS: LLDB (/Users/buildslave/jenkins/workspace/lldb-cmake-matrix/clang_900_build/bin/clang-x86_64) :: test_c_packet_works_debugserver (TestLldbGdbServer.LldbGdbServerTestCase) UNSUPPORTED: LLDB (/Users/buildslave/jenkins/workspace/lldb-cmake-matrix/clang_900_build/bin/clang-x86_64) :: test_c_packet_works_llgs (TestLldbGdbServer.LldbGdbServerTestCase) (test case does not fall in any category of interest for this run) PASS: LLDB (/Users/buildslave/jenkins/workspace/lldb-cmake-matrix/clang_900_build/bin/clang-x86_64) :: test_first_launch_stop_reply_thread_matches_first_qC_debugserver (TestLldbGdbServer.LldbGdbServerTestCase) UNSUPPORTED: LLDB (/Users/buildslave/jenkins/workspace/lldb-cmake-matrix/clang_900_build/bin/clang-x86_64) :: test_first_launch_stop_reply_thread_matches_first_qC_llgs (TestLldbGdbServer.LldbGdbServerTestCase) (test case does not fall in any category of interest for this run) UNSUPPORTED: LLDB (/Users/buildslave/jenkins/workspace/lldb-cmake-matrix/clang_900_build/bin/clang-x86_64) :: test_hardware_breakpoint_set_and_remove_work_debugserver (TestLldbGdbServer.LldbGdbServerTestCase) (requires one of linux) UNSUPPORTED: LLDB (/Users/buildslave/jenkins/workspace/lldb-cmake-matrix/clang_900_build/bin/clang-x86_64) :: test_hardware_breakpoint_set_and_remove_work_llgs (TestLldbGdbServer.LldbGdbServerTestCase) (test case does not fall in any category of interest for this run) PASS: LLDB (/Users/buildslave/jenkins/workspace/lldb-cmake-matrix/clang_900_build/bin/clang-x86_64) :: test_inferior_print_exit_debugserver (TestLldbGdbServer.LldbGdbServerTestCase) UNSUPPORTED: LLDB (/Users/buildslave/jenkins/workspace/lldb-cmake-matrix/clang_900_build/bin/clang-x86_64) :: test_inferior_print_exit_llgs (TestLldbGdbServer.LldbGdbServerTestCase) (test case does not fall in any category of interest for this run) UNSUPPORTED: LLDB (/Users/buildslave/jenkins/workspace/lldb-cmake-matrix/clang_900_build/bin/clang-x86_64) :: test_launch_via_A_llgs (TestLldbGdbServer.LldbGdbServerTestCase) (test case does not fall in any category of interest for this run) UNSUPPORTED: LLDB (/Users/buildslave/jenkins/workspace/lldb-cmake-matrix/clang_900_build/bin/clang-x86_64) :: test_launch_via_vRun_llgs (TestLldbGdbServer.LldbGdbServerTestCase) (test case does not fall in any category of interest for this run) UNSUPPORTED: LLDB (/Users/buildslave/jenkins/workspace/lldb-cmake-matrix/clang_900_build/bin/clang-x86_64) :: test_launch_via_vRun_no_args_llgs (TestLldbGdbServer.LldbGdbServerTestCase) (test case does not fall in any category of interest for this run) PASS: LLDB (/Users/buildslave/jenkins/workspace/lldb-cmake-matrix/clang_900_build/bin/clang-x86_64) :: test_list_threads_in_stop_reply_supported_debugserver (TestLldbGdbServer.LldbGdbServerTestCase) UNSUPPORTED: LLDB (/Users/buildslave/jenkins/workspace/lldb-cmake-matrix/clang_900_build/bin/clang-x86_64) :: test_list_threads_in_stop_reply_supported_llgs (TestLldbGdbServer.LldbGdbServerTestCase) (test case does not fall in any category of interest for this run) PASS: LLDB (/Users/buildslave/jenkins/workspace/lldb-cmake-matrix/clang_900_build/bin/clang-x86_64) :: test_m_packet_reads_memory_debugserver (TestLldbGdbServer.LldbGdbServerTestCase) UNSUPPORTED: LLDB (/Users/buildslave/jenkins/workspace/lldb-cmake-matrix/clang_900_build/bin/clang-x86_64) :: test_m_packet_reads_memory_llgs (TestLldbGdbServer.LldbGdbServerTestCase) (test case does not fall in any category of interest for this run) PASS: LLDB (/Users/buildslave/jenkins/workspace/lldb-cmake-matrix/clang_900_build/bin/clang-x86_64) :: test_p_returns_correct_data_size_for_each_qRegisterInfo_launch_debugserver (TestLldbGdbServer.LldbGdbServerTestCase) UNSUPPORTED: LLDB (/Users/buildslave/jenkins/workspace/lldb-cmake-matrix/clang_900_build/bin/clang-x86_64) :: test_p_returns_correct_data_size_for_each_qRegisterInfo_launch_llgs (TestLldbGdbServer.LldbGdbServerTestCase) (test case does not fall in any category of interest for this run) PASS: LLDB (/Users/buildslave/jenkins/workspace/lldb-cmake-matrix/clang_900_build/bin/clang-x86_64) :: test_qMemoryRegionInfo_is_supported_debugserver (TestLldbGdbServer.LldbGdbServerTestCase) UNSUPPORTED: LLDB (/Users/buildslave/jenkins/workspace/lldb-cmake-matrix/clang_900_build/bin/clang-x86_64) :: test_qMemoryRegionInfo_is_supported_llgs (TestLldbGdbServer.LldbGdbServerTestCase) (test case does not fall in any category of interest for this run) PASS: LLDB (/Users/buildslave/jenkins/workspace/lldb-cmake-matrix/clang_900_build/bin/clang-x86_64) :: test_qMemoryRegionInfo_reports_code_address_as_executable_debugserver (TestLldbGdbServer.LldbGdbServerTestCase) UNSUPPORTED: LLDB (/Users/buildslave/jenkins/workspace/lldb-cmake-matrix/clang_900_build/bin/clang-x86_64) :: test_qMemoryRegionInfo_reports_code_address_as_executable_llgs (TestLldbGdbServer.LldbGdbServerTestCase) (test case does not fall in any category of interest for this run) PASS: LLDB (/Users/buildslave/jenkins/workspace/lldb-cmake-matrix/clang_900_build/bin/clang-x86_64) :: test_qMemoryRegionInfo_reports_heap_address_as_rw_debugserver (TestLldbGdbServer.LldbGdbServerTestCase) UNSUPPORTED: LLDB (/Users/buildslave/jenkins/workspace/lldb-cmake-matrix/clang_900_build/bin/clang-x86_64) :: test_qMemoryRegionInfo_reports_heap_address_as_rw_llgs (TestLldbGdbServer.LldbGdbServerTestCase) (test case does not fall in any category of interest for this run) PASS: LLDB (/Users/buildslave/jenkins/workspace/lldb-cmake-matrix/clang_900_build/bin/clang-x86_64) :: test_qMemoryRegionInfo_reports_stack_address_as_rw_debugserver (TestLldbGdbServer.LldbGdbServerTestCase) UNSUPPORTED: LLDB (/Users/buildslave/jenkins/workspace/lldb-cmake-matrix/clang_900_build/bin/clang-x86_64) :: test_qMemoryRegionInfo_reports_stack_address_as_rw_llgs (TestLldbGdbServer.LldbGdbServerTestCase) (test case does not fall in any category of interest for this run) PASS: LLDB (/Users/buildslave/jenkins/workspace/lldb-cmake-matrix/clang_900_build/bin/clang-x86_64) :: test_qRegisterInfo_contains_at_least_one_register_set_debugserver (TestLldbGdbServer.LldbGdbServerTestCase) UNSUPPORTED: LLDB (/Users/buildslave/jenkins/workspace/lldb-cmake-matrix/clang_900_build/bin/clang-x86_64) :: test_qRegisterInfo_contains_at_least_one_register_set_llgs (TestLldbGdbServer.LldbGdbServerTestCase) (test case does not fall in any category of interest for this run) UNSUPPORTED: LLDB (/Users/buildslave/jenkins/workspace/lldb-cmake-matrix/clang_900_build/bin/clang-x86_64) :: test_qRegisterInfo_contains_avx_registers_llgs (TestLldbGdbServer.LldbGdbServerTestCase) (test case does not fall in any category of interest for this run) PASS: LLDB (/Users/buildslave/jenkins/workspace/lldb-cmake-matrix/clang_900_build/bin/clang-x86_64) :: test_qRegisterInfo_contains_required_generics_debugserver_debugserver (TestLldbGdbServer.LldbGdbServerTestCase) UNSUPPORTED: LLDB (/Users/buildslave/jenkins/workspace/lldb-cmake-matrix/clang_900_build/bin/clang-x86_64) :: test_qRegisterInfo_contains_required_generics_debugserver_llgs (TestLldbGdbServer.LldbGdbServerTestCase) (test case does not fall in any category of interest for this run) PASS: LLDB (/Users/buildslave/jenkins/workspace/lldb-cmake-matrix/clang_900_build/bin/clang-x86_64) :: test_qRegisterInfo_returns_all_valid_results_debugserver (TestLldbGdbServer.LldbGdbServerTestCase) UNSUPPORTED: LLDB (/Users/buildslave/jenkins/workspace/lldb-cmake-matrix/clang_900_build/bin/clang-x86_64) :: test_qRegisterInfo_returns_all_valid_results_llgs (TestLldbGdbServer.LldbGdbServerTestCase) (test case does not fall in any category of interest for this run) PASS: LLDB (/Users/buildslave/jenkins/workspace/lldb-cmake-matrix/clang_900_build/bin/clang-x86_64) :: test_qRegisterInfo_returns_one_valid_result_debugserver (TestLldbGdbServer.LldbGdbServerTestCase) UNSUPPORTED: LLDB (/Users/buildslave/jenkins/workspace/lldb-cmake-matrix/clang_900_build/bin/clang-x86_64) :: test_qRegisterInfo_returns_one_valid_result_llgs (TestLldbGdbServer.LldbGdbServerTestCase) (test case does not fall in any category of interest for this run) PASS: LLDB (/Users/buildslave/jenkins/workspace/lldb-cmake-matrix/clang_900_build/bin/clang-x86_64) :: test_qSupported_QPassSignals_debugserver (TestLldbGdbServer.LldbGdbServerTestCase) UNSUPPORTED: LLDB (/Users/buildslave/jenkins/workspace/lldb-cmake-matrix/clang_900_build/bin/clang-x86_64) :: test_qSupported_QPassSignals_llgs (TestLldbGdbServer.LldbGdbServerTestCase) (test case does not fall in any category of interest for this run) PASS: LLDB (/Users/buildslave/jenkins/workspace/lldb-cmake-matrix/clang_900_build/bin/clang-x86_64) :: test_qSupported_auvx_debugserver (TestLldbGdbServer.LldbGdbServerTestCase) UNSUPPORTED: LLDB (/Users/buildslave/jenkins/workspace/lldb-cmake-matrix/clang_900_build/bin/clang-x86_64) :: test_qSupported_auvx_llgs (TestLldbGdbServer.LldbGdbServerTestCase) (test case does not fall in any category of interest for this run) UNSUPPORTED: LLDB (/Users/buildslave/jenkins/workspace/lldb-cmake-matrix/clang_900_build/bin/clang-x86_64) :: test_qSupported_fork_events_debugserver (TestLldbGdbServer.LldbGdbServerTestCase) (test case does not fall in any category of interest for this run) UNSUPPORTED: LLDB (/Users/buildslave/jenkins/workspace/lldb-cmake-matrix/clang_900_build/bin/clang-x86_64) :: test_qSupported_fork_events_llgs (TestLldbGdbServer.LldbGdbServerTestCase) (test case does not fall in any category of interest for this run) UNSUPPORTED: LLDB (/Users/buildslave/jenkins/workspace/lldb-cmake-matrix/clang_900_build/bin/clang-x86_64) :: test_qSupported_fork_events_without_multiprocess_debugserver (TestLldbGdbServer.LldbGdbServerTestCase) (test case does not fall in any category of interest for this run) UNSUPPORTED: LLDB (/Users/buildslave/jenkins/workspace/lldb-cmake-matrix/clang_900_build/bin/clang-x86_64) :: test_qSupported_fork_events_without_multiprocess_llgs (TestLldbGdbServer.LldbGdbServerTestCase) (test case does not fall in any category of interest for this run) PASS: LLDB (/Users/buildslave/jenkins/workspace/lldb-cmake-matrix/clang_900_build/bin/clang-x86_64) :: test_qSupported_libraries_svr4_debugserver (TestLldbGdbServer.LldbGdbServerTestCase) UNSUPPORTED: LLDB (/Users/buildslave/jenkins/workspace/lldb-cmake-matrix/clang_900_build/bin/clang-x86_64) :: test_qSupported_libraries_svr4_llgs (TestLldbGdbServer.LldbGdbServerTestCase) (test case does not fall in any category of interest for this run) PASS: LLDB (/Users/buildslave/jenkins/workspace/lldb-cmake-matrix/clang_900_build/bin/clang-x86_64) :: test_qSupported_memory_tagging_debugserver (TestLldbGdbServer.LldbGdbServerTestCase) UNSUPPORTED: LLDB (/Users/buildslave/jenkins/workspace/lldb-cmake-matrix/clang_900_build/bin/clang-x86_64) :: test_qSupported_memory_tagging_llgs (TestLldbGdbServer.LldbGdbServerTestCase) (test case does not fall in any category of interest for this run) PASS: LLDB (/Users/buildslave/jenkins/workspace/lldb-cmake-matrix/clang_900_build/bin/clang-x86_64) :: test_qSupported_returns_known_stub_features_debugserver (TestLldbGdbServer.LldbGdbServerTestCase) UNSUPPORTED: LLDB (/Users/buildslave/jenkins/workspace/lldb-cmake-matrix/clang_900_build/bin/clang-x86_64) :: test_qSupported_returns_known_stub_features_llgs (TestLldbGdbServer.LldbGdbServerTestCase) (test case does not fall in any category of interest for this run) UNSUPPORTED: LLDB (/Users/buildslave/jenkins/workspace/lldb-cmake-matrix/clang_900_build/bin/clang-x86_64) :: test_qSupported_vfork_events_debugserver (TestLldbGdbServer.LldbGdbServerTestCase) (test case does not fall in any category of interest for this run) UNSUPPORTED: LLDB (/Users/buildslave/jenkins/workspace/lldb-cmake-matrix/clang_900_build/bin/clang-x86_64) :: test_qSupported_vfork_events_llgs (TestLldbGdbServer.LldbGdbServerTestCase) (test case does not fall in any category of interest for this run) UNSUPPORTED: LLDB (/Users/buildslave/jenkins/workspace/lldb-cmake-matrix/clang_900_build/bin/clang-x86_64) :: test_qSupported_vfork_events_without_multiprocess_debugserver (TestLldbGdbServer.LldbGdbServerTestCase) (test case does not fall in any category of interest for this run) UNSUPPORTED: LLDB (/Users/buildslave/jenkins/workspace/lldb-cmake-matrix/clang_900_build/bin/clang-x86_64) :: test_qSupported_vfork_events_without_multiprocess_llgs (TestLldbGdbServer.LldbGdbServerTestCase) (test case does not fall in any category of interest for this run) PASS: LLDB (/Users/buildslave/jenkins/workspace/lldb-cmake-matrix/clang_900_build/bin/clang-x86_64) :: test_qThreadInfo_contains_thread_attach_debugserver (TestLldbGdbServer.LldbGdbServerTestCase) UNSUPPORTED: LLDB (/Users/buildslave/jenkins/workspace/lldb-cmake-matrix/clang_900_build/bin/clang-x86_64) :: test_qThreadInfo_contains_thread_attach_llgs (TestLldbGdbServer.LldbGdbServerTestCase) (test case does not fall in any category of interest for this run) PASS: LLDB (/Users/buildslave/jenkins/workspace/lldb-cmake-matrix/clang_900_build/bin/clang-x86_64) :: test_qThreadInfo_contains_thread_launch_debugserver (TestLldbGdbServer.LldbGdbServerTestCase) UNSUPPORTED: LLDB (/Users/buildslave/jenkins/workspace/lldb-cmake-matrix/clang_900_build/bin/clang-x86_64) :: test_qThreadInfo_contains_thread_launch_llgs (TestLldbGdbServer.LldbGdbServerTestCase) (test case does not fall in any category of interest for this run) PASS: LLDB (/Users/buildslave/jenkins/workspace/lldb-cmake-matrix/clang_900_build/bin/clang-x86_64) :: test_qThreadInfo_matches_qC_attach_debugserver (TestLldbGdbServer.LldbGdbServerTestCase) UNSUPPORTED: LLDB (/Users/buildslave/jenkins/workspace/lldb-cmake-matrix/clang_900_build/bin/clang-x86_64) :: test_qThreadInfo_matches_qC_attach_llgs (TestLldbGdbServer.LldbGdbServerTestCase) (test case does not fall in any category of interest for this run) PASS: LLDB (/Users/buildslave/jenkins/workspace/lldb-cmake-matrix/clang_900_build/bin/clang-x86_64) :: test_qThreadInfo_matches_qC_launch_debugserver (TestLldbGdbServer.LldbGdbServerTestCase) UNSUPPORTED: LLDB (/Users/buildslave/jenkins/workspace/lldb-cmake-matrix/clang_900_build/bin/clang-x86_64) :: test_qThreadInfo_matches_qC_launch_llgs (TestLldbGdbServer.LldbGdbServerTestCase) (test case does not fall in any category of interest for this run) PASS: LLDB (/Users/buildslave/jenkins/workspace/lldb-cmake-matrix/clang_900_build/bin/clang-x86_64) :: test_software_breakpoint_set_and_remove_work_debugserver (TestLldbGdbServer.LldbGdbServerTestCase) UNSUPPORTED: LLDB (/Users/buildslave/jenkins/workspace/lldb-cmake-matrix/clang_900_build/bin/clang-x86_64) :: test_software_breakpoint_set_and_remove_work_llgs (TestLldbGdbServer.LldbGdbServerTestCase) (test case does not fall in any category of interest for this run) PASS: LLDB (/Users/buildslave/jenkins/workspace/lldb-cmake-matrix/clang_900_build/bin/clang-x86_64) :: test_thread_suffix_supported_debugserver (TestLldbGdbServer.LldbGdbServerTestCase) UNSUPPORTED: LLDB (/Users/buildslave/jenkins/workspace/lldb-cmake-matrix/clang_900_build/bin/clang-x86_64) :: test_thread_suffix_supported_llgs (TestLldbGdbServer.LldbGdbServerTestCase) (test case does not fall in any category of interest for this run) PASS: LLDB (/Users/buildslave/jenkins/workspace/lldb-cmake-matrix/clang_900_build/bin/clang-x86_64) :: test_written_M_content_reads_back_correctly_debugserver (TestLldbGdbServer.LldbGdbServerTestCase) UNSUPPORTED: LLDB (/Users/buildslave/jenkins/workspace/lldb-cmake-matrix/clang_900_build/bin/clang-x86_64) :: test_written_M_content_reads_back_correctly_llgs (TestLldbGdbServer.LldbGdbServerTestCase) (test case does not fall in any category of interest for this run) Restore dir to: /Users/buildslave/jenkins/workspace/lldb-cmake-matrix/lldb-build/tools/lldb/test ====================================================================== ERROR: test_Hg_switches_to_3_threads_launch_debugserver (TestLldbGdbServer.LldbGdbServerTestCase) ---------------------------------------------------------------------- Traceback (most recent call last): File "/Users/buildslave/jenkins/workspace/lldb-cmake-matrix/llvm-project/lldb/packages/Python/lldbsuite/test/tools/lldb-server/gdbremote_testcase.py", line 52, in test_method return attrvalue(self) File "/Users/buildslave/jenkins/workspace/lldb-cmake-matrix/llvm-project/lldb/packages/Python/lldbsuite/test/decorators.py", line 119, in wrapper func(*args, **kwargs) File "/Users/buildslave/jenkins/workspace/lldb-cmake-matrix/llvm-project/lldb/test/API/tools/lldb-server/TestLldbGdbServer.py", line 396, in test_Hg_switches_to_3_threads_launch self.Hg_switches_to_3_threads() File "/Users/buildslave/jenkins/workspace/lldb-cmake-matrix/llvm-project/lldb/test/API/tools/lldb-server/TestLldbGdbServer.py", line 367, in Hg_switches_to_3_threads threads = self.wait_for_thread_count(3) File "/Users/buildslave/jenkins/workspace/lldb-cmake-matrix/llvm-project/lldb/packages/Python/lldbsuite/test/tools/lldb-server/gdbremote_testcase.py", line 798, in wait_for_thread_count self.DEFAULT_TIMEOUT, thread_count, actual_thread_count)) Exception: timed out after 20 seconds while waiting for theads: waiting for at least 3 threads, found 1 Config=x86_64-/Users/buildslave/jenkins/workspace/lldb-cmake-matrix/clang_900_build/bin/clang ---------------------------------------------------------------------- Ran 84 tests in 137.797s

Hide Details

RESULT: FAILED (30 passes, 0 failures, 1 errors, 52 skipped, 1 expected failures, 0 unexpected successes)

Hide Details

--

Hide Details

******************** PASS: lldb-shell :: Minidump/dump-all.test (1281 of 1406) PASS: lldb-shell :: Register/Core/x86-32-netbsd-addr.test (1282 of 1406) PASS: lldb-shell :: Quit/TestQuitExitCodeTooManyArgs.test (1283 of 1406) PASS: lldb-api :: functionalities/target_var/TestTargetVar.py (1284 of 1406) UNSUPPORTED: lldb-shell :: SymbolFile/PDB/ast-restore.test (1285 of 1406) UNSUPPORTED: lldb-api :: macosx/lc-note/addrable-bits/TestAddrableBitsCorefile.py (1286 of 1406) PASS: lldb-shell :: Register/Core/x86-32-freebsd-fp.test (1287 of 1406) UNSUPPORTED: lldb-shell :: SymbolFile/PDB/func-symbols.test (1288 of 1406) PASS: lldb-api :: lang/objc/hidden-ivars/TestHiddenIvars.py (1289 of 1406) PASS: lldb-api :: functionalities/data-formatter/data-formatter-stl/libcxx/vbool/TestDataFormatterLibcxxVBool.py (1290 of 1406) PASS: lldb-api :: tools/lldb-server/TestGdbRemoteHostInfo.py (1291 of 1406) PASS: lldb-api :: types/TestIntegerTypeExpr.py (1292 of 1406) UNSUPPORTED: lldb-api :: python_api/watchpoint/condition/TestWatchpointConditionAPI.py (1293 of 1406) PASS: lldb-api :: functionalities/memory/find/TestMemoryFind.py (1294 of 1406) UNSUPPORTED: lldb-api :: benchmarks/turnaround/TestCompileRunToBreakpointTurnaround.py (1295 of 1406) PASS: lldb-shell :: SymbolFile/DWARF/x86/DW_AT_const_value.s (1296 of 1406) PASS: lldb-api :: commands/expression/completion-in-lambda-and-unnamed-class/TestCompletionInLambdaAndUnnamedClass.py (1297 of 1406) UNSUPPORTED: lldb-shell :: SymbolFile/NativePDB/disassembly.cpp (1298 of 1406) UNSUPPORTED: lldb-api :: functionalities/process_save_core_minidump/TestProcessSaveCoreMinidump.py (1299 of 1406) PASS: lldb-api :: functionalities/postmortem/minidump/TestMiniDump.py (1300 of 1406) PASS: lldb-shell :: SymbolFile/DWARF/x86/DW_AT_declaration-with-children.s (1301 of 1406) PASS: lldb-api :: terminal/TestSTTYBeforeAndAfter.py (1302 of 1406) PASS: lldb-api :: functionalities/type_completion/TestTypeCompletion.py (1303 of 1406) PASS: lldb-api :: functionalities/breakpoint/auto_continue/TestBreakpointAutoContinue.py (1304 of 1406) PASS: lldb-api :: lang/cpp/forward-declared-template-specialization/TestCppForwardDeclaredTemplateSpecialization.py (1305 of 1406) PASS: lldb-shell :: SymbolFile/DWARF/x86/debug-types-dwarf5.s (1306 of 1406) UNSUPPORTED: lldb-shell :: Register/arm-fp-read.test (1307 of 1406) PASS: lldb-shell :: Register/Core/x86-32-linux-multithread.test (1308 of 1406) PASS: lldb-api :: commands/frame/diagnose/dereference-this/TestDiagnoseDereferenceThis.py (1309 of 1406) PASS: lldb-api :: test_utils/TestPExpectTest.py (1310 of 1406) PASS: lldb-shell :: Commands/CommandScriptImmediateOutput/CommandScriptImmediateOutputFile.test (1311 of 1406) UNSUPPORTED: lldb-api :: commands/watchpoints/variable_out_of_scope/TestWatchedVarHitWhenInScope.py (1312 of 1406) PASS: lldb-api :: functionalities/unwind/noreturn/module-end/TestNoReturnModuleEnd.py (1313 of 1406) PASS: lldb-api :: lang/objc/objc-foundation-dictionary-empty/TestNSDictionary0.py (1314 of 1406) PASS: lldb-api :: macosx/debugserver-exit-code/TestDebugServerExitCode.py (1315 of 1406) PASS: lldb-api :: functionalities/data-formatter/data-formatter-stl/libcxx/deque/TestDataFormatterLibcxxDeque.py (1316 of 1406) PASS: lldb-shell :: ObjectFile/ELF/PT_LOAD.yaml (1317 of 1406) PASS: lldb-api :: lang/cpp/stl/TestSTL.py (1318 of 1406) PASS: lldb-api :: lang/cpp/static_member_type_depending_on_parent_size/TestStaticMemberTypeDependingOnParentSize.py (1319 of 1406) PASS: lldb-api :: commands/expression/rdar44436068/Test128BitsInteger.py (1320 of 1406) PASS: lldb-shell :: ObjectFile/PECOFF/basic-info.yaml (1321 of 1406) PASS: lldb-shell :: SymbolFile/DWARF/x86/debug_loc_and_loclists.s (1322 of 1406) UNSUPPORTED: lldb-shell :: SymbolFile/DWARF/x86/inline-function-address-shared.test (1323 of 1406) PASS: lldb-api :: functionalities/data-formatter/data-formatter-stl/libcxx/variant/TestDataFormatterLibcxxVariant.py (1324 of 1406) PASS: lldb-api :: lang/objc/warnings-in-expr-parser/TestObjCWarningsInExprParser.py (1325 of 1406) PASS: lldb-api :: lang/cpp/keywords_enabled/TestCppKeywordsEnabled.py (1326 of 1406) PASS: lldb-api :: functionalities/target_var/no_vars/TestTargetVarNoVars.py (1327 of 1406) PASS: lldb-api :: commands/expression/options/TestExprOptions.py (1328 of 1406) PASS: lldb-shell :: Register/Core/x86-64-netbsd-multithread.test (1329 of 1406) PASS: lldb-api :: python_api/module_section/TestModuleAndSection.py (1330 of 1406) UNSUPPORTED: lldb-api :: commands/register/register/intel_xtended_registers/mpx_offset_intersection/TestMPXOffsetIntersection.py (1331 of 1406) PASS: lldb-api :: lang/cpp/bitfields/TestCppBitfields.py (1332 of 1406) XFAIL: lldb-shell :: Register/x86-mm-xmm-read.test (1333 of 1406) UNSUPPORTED: lldb-shell :: ScriptInterpreter/Lua/partial_statements.test (1334 of 1406) PASS: lldb-api :: lang/cpp/class-template-type-parameter-pack/TestClassTemplateTypeParameterPack.py (1335 of 1406) PASS: lldb-api :: functionalities/data-formatter/data-formatter-ptr-to-array/TestPtrToArrayFormatting.py (1336 of 1406) PASS: lldb-api :: macosx/add-dsym/TestAddDsymDownload.py (1337 of 1406) PASS: lldb-api :: lang/cpp/template-arguments/TestCppTemplateArguments.py (1338 of 1406) PASS: lldb-api :: lang/cpp/enum_types/TestCPP11EnumTypes.py (1339 of 1406) PASS: lldb-api :: lang/cpp/static_methods/TestCPPStaticMethods.py (1340 of 1406) PASS: lldb-shell :: SymbolFile/Breakpad/stack-cfi-parsing.test (1341 of 1406) UNSUPPORTED: lldb-api :: commands/settings/quoting/TestQuoting.py (1342 of 1406) PASS: lldb-api :: commands/target/auto-install-main-executable/TestAutoInstallMainExecutable.py (1343 of 1406) PASS: lldb-api :: python_api/symbol-context/two-files/TestSymbolContextTwoFiles.py (1344 of 1406) PASS: lldb-api :: functionalities/thread/thread_specific_break/TestThreadSpecificBreakpoint.py (1345 of 1406) PASS: lldb-api :: lang/cpp/virtual-functions/TestCppVirtualFunctions.py (1346 of 1406) PASS: lldb-api :: functionalities/data-formatter/data-formatter-stl/libcxx/unique_ptr/TestDataFormatterLibcxxUniquePtr.py (1347 of 1406) PASS: lldb-shell :: Settings/TestFrameFormatMangling.test (1348 of 1406) PASS: lldb-api :: python_api/thread/TestThreadAPI.py (1349 of 1406) UNSUPPORTED: lldb-api :: functionalities/thread/concurrent_events/TestConcurrentTwoWatchpointsOneDelayBreakpoint.py (1350 of 1406) UNSUPPORTED: lldb-api :: functionalities/gdb_remote_client/TestAArch64XMLRegOffsets.py (1351 of 1406) UNSUPPORTED: lldb-api :: commands/expression/expr-in-syscall/TestExpressionInSyscall.py (1352 of 1406) UNSUPPORTED: lldb-shell :: Register/x86-64-zmm-read.test (1353 of 1406) PASS: lldb-api :: commands/frame/diagnose/complicated-expression/TestComplicatedExpression.py (1354 of 1406) UNSUPPORTED: lldb-shell :: Breakpoint/ppc64-localentry.test (1355 of 1406) UNSUPPORTED: lldb-api :: functionalities/unwind/ehframe/TestEhFrameUnwind.py (1356 of 1406) PASS: lldb-api :: commands/target/create-no-such-arch/TestNoSuchArch.py (1357 of 1406) PASS: lldb-api :: functionalities/postmortem/elf-core/thread_crash/TestLinuxCoreThreads.py (1358 of 1406) XFAIL: lldb-shell :: Register/x86-fp-write.test (1359 of 1406) PASS: lldb-api :: types/TestFloatTypes.py (1360 of 1406) PASS: lldb-api :: python_api/hello_world/TestHelloWorld.py (1361 of 1406) PASS: lldb-shell :: SymbolFile/Breakpad/symtab.test (1362 of 1406) UNSUPPORTED: lldb-api :: commands/expression/import-std-module/shared_ptr/TestSharedPtrFromStdModule.py (1363 of 1406) PASS: lldb-api :: commands/target/basic/TestTargetCommand.py (1364 of 1406) UNSUPPORTED: lldb-api :: lang/cpp/breakpoint_in_member_func_w_non_primitive_params/TestBreakpointInMemberFuncWNonPrimitiveParams.py (1365 of 1406) UNSUPPORTED: lldb-api :: commands/session/save/TestSessionSave.py (1366 of 1406) PASS: lldb-api :: lang/cpp/unicode-literals/TestUnicodeLiterals.py (1367 of 1406) UNSUPPORTED: lldb-api :: functionalities/thread/concurrent_events/TestConcurrentWatchpointDelayWatchpointOneBreakpoint.py (1368 of 1406) UNSUPPORTED: lldb-api :: benchmarks/libcxxmap/TestBenchmarkLibcxxMap.py (1369 of 1406) PASS: lldb-api :: functionalities/data-formatter/data-formatter-advanced/TestDataFormatterAdv.py (1370 of 1406) UNSUPPORTED: lldb-shell :: SymbolFile/DWARF/x86/dir-separator-no-comp-dir-relative-name.s (1371 of 1406) PASS: lldb-api :: lang/objc/objc-runtime-ivars/TestRuntimeIvars.py (1372 of 1406) UNSUPPORTED: lldb-shell :: ObjectFile/PECOFF/dep-modules.yaml (1373 of 1406) UNSUPPORTED: lldb-api :: functionalities/tail_call_frames/sbapi_support/TestTailCallFrameSBAPI.py (1374 of 1406) PASS: lldb-shell :: Commands/command-disassemble-process.yaml (1375 of 1406) UNSUPPORTED: lldb-api :: tools/lldb-server/vCont-threads/TestGdbRemote_vContThreads.py (1376 of 1406) PASS: lldb-api :: functionalities/gdb_remote_client/TestqOffsets.py (1377 of 1406) UNSUPPORTED: lldb-shell :: ScriptInterpreter/Lua/quit.test (1378 of 1406) PASS: lldb-api :: functionalities/multiword-commands/TestMultiWordCommands.py (1379 of 1406) PASS: lldb-api :: lang/cpp/rvalue-references/TestRvalueReferences.py (1380 of 1406) UNSUPPORTED: lldb-api :: tools/lldb-vscode/correct-thread/TestVSCode_correct_thread.py (1381 of 1406) PASS: lldb-api :: commands/expression/persistent_variables/TestPersistentVariables.py (1382 of 1406) PASS: lldb-api :: lang/cpp/sizeof/TestCPPSizeof.py (1383 of 1406) UNSUPPORTED: lldb-shell :: SymbolFile/NativePDB/break-by-line.cpp (1384 of 1406) UNSUPPORTED: lldb-shell :: SymbolFile/DWARF/x86/debug-line-basic.s (1385 of 1406) PASS: lldb-api :: assert_messages_test/TestAssertMessages.py (1386 of 1406) PASS: lldb-api :: functionalities/data-formatter/data-formatter-stl/libcxx/unordered/TestDataFormatterUnordered.py (1387 of 1406) PASS: lldb-api :: functionalities/data-formatter/data-formatter-globals/TestDataFormatterGlobals.py (1388 of 1406) UNSUPPORTED: lldb-api :: macosx/macCatalyst/TestMacCatalyst.py (1389 of 1406) PASS: lldb-shell :: ScriptInterpreter/Python/command_relative_import.test (1390 of 1406) UNSUPPORTED: lldb-shell :: SymbolFile/PDB/vbases.test (1391 of 1406) PASS: lldb-api :: functionalities/data-formatter/data-formatter-synth/TestDataFormatterSynth.py (1392 of 1406) PASS: lldb-api :: lang/cpp/this/TestCPPThis.py (1393 of 1406) PASS: lldb-api :: lang/c/stepping/TestThreadStepInAvoidRegexp.py (1394 of 1406) PASS: lldb-api :: python_api/lldbutil/iter/TestRegistersIterator.py (1395 of 1406) PASS: lldb-api :: functionalities/thread/num_threads/TestNumThreads.py (1396 of 1406) PASS: lldb-api :: lang/c/register_variables/TestRegisterVariables.py (1397 of 1406) PASS: lldb-api :: lang/objc/objc-static-method-stripped/TestObjCStaticMethodStripped.py (1398 of 1406) PASS: lldb-api :: functionalities/data-formatter/data-formatter-objc/TestDataFormatterObjCPlain.py (1399 of 1406) UNSUPPORTED: lldb-api :: tools/lldb-server/TestGdbRemoteAuxvSupport.py (1400 of 1406) PASS: lldb-api :: functionalities/thread/create_after_attach/TestCreateAfterAttach.py (1401 of 1406) PASS: lldb-api :: functionalities/gdb_remote_client/TestRegDefinitionInParts.py (1402 of 1406) PASS: lldb-api :: functionalities/set-data/TestSetData.py (1403 of 1406) PASS: lldb-api :: lang/cpp/global_operators/TestCppGlobalOperators.py (1404 of 1406) PASS: lldb-api :: tools/lldb-server/TestGdbRemoteProcessInfo.py (1405 of 1406) PASS: lldb-api :: functionalities/recursion/TestValueObjectRecursion.py (1406 of 1406) Slowest Tests: -------------------------------------------------------------------------- 138.21s: lldb-api :: tools/lldb-server/TestLldbGdbServer.py 86.55s: lldb-api :: api/multithreaded/TestMultithreaded.py 77.73s: lldb-api :: lang/objc/foundation/TestFoundationDisassembly.py 51.74s: lldb-api :: functionalities/stop-on-sharedlibrary-load/TestStopOnSharedlibraryEvents.py 44.58s: lldb-api :: functionalities/load_unload/TestLoadUnload.py 44.50s: lldb-api :: types/TestLongTypesExpr.py 41.43s: lldb-api :: types/TestLongTypes.py 40.97s: lldb-api :: lang/objc/exceptions/TestObjCExceptions.py 39.67s: lldb-api :: functionalities/completion/TestCompletion.py 39.05s: lldb-api :: lang/cpp/namespace/TestNamespaceLookup.py 38.07s: lldb-api :: types/TestShortType.py 36.83s: lldb-api :: tools/lldb-server/TestGdbRemoteThreadsInStopReply.py 35.61s: lldb-api :: types/TestShortTypeExpr.py 32.99s: lldb-api :: lang/objc/objc-new-syntax/TestObjCNewSyntaxLiteral.py 32.43s: lldb-api :: functionalities/limit-debug-info/TestLimitDebugInfo.py 31.60s: lldb-api :: tools/lldb-server/TestGdbRemote_vCont.py 30.66s: lldb-api :: commands/target/basic/TestTargetCommand.py 30.39s: lldb-api :: lang/c/anonymous/TestAnonymous.py 30.29s: lldb-api :: lang/objc/foundation/TestObjCMethods.py 29.37s: lldb-api :: lang/objc/hidden-ivars/TestHiddenIvars.py

Hide Details

Tests Times: -------------------------------------------------------------------------- [ Range ] :: [ Percentage ] :: [ Count ] -------------------------------------------------------------------------- [130s,140s) :: [ ] :: [ 1/1406] [120s,130s) :: [ ] :: [ 0/1406] [110s,120s) :: [ ] :: [ 0/1406] [100s,110s) :: [ ] :: [ 0/1406] [ 90s,100s) :: [ ] :: [ 0/1406] [ 80s, 90s) :: [ ] :: [ 1/1406] [ 70s, 80s) :: [ ] :: [ 1/1406] [ 60s, 70s) :: [ ] :: [ 0/1406] [ 50s, 60s) :: [ ] :: [ 1/1406] [ 40s, 50s) :: [ ] :: [ 5/1406] [ 30s, 40s) :: [ ] :: [ 10/1406] [ 20s, 30s) :: [ ] :: [ 22/1406] [ 10s, 20s) :: [** ] :: [ 89/1406] [ 0s, 10s) :: [************************************ ] :: [1276/1406] -------------------------------------------------------------------------- ******************** Failed Tests (4): lldb-api :: lang/cpp/modules-import/TestCXXModulesImport.py lldb-api :: lang/objc/modules-compile-error/TestModulesCompileError.py lldb-api :: python_api/process/TestProcessAPI.py lldb-api :: tools/lldb-server/TestLldbGdbServer.py

Hide Details

Hide Details

Testing Time: 340.45s Unsupported : 467 Passed : 926 Expectedly Failed: 9 Failed : 4 FAILED: tools/lldb/test/CMakeFiles/check-lldb-reproducers-capture cd /Users/buildslave/jenkins/workspace/lldb-cmake-matrix/lldb-build/tools/lldb/test && /usr/local/Frameworks/Python.framework/Versions/3.7/bin/python3.7 /Users/buildslave/jenkins/workspace/lldb-cmake-matrix/lldb-build/./bin/llvm-lit -v --time-tests --shuffle --xunit-xml-output=/Users/buildslave/jenkins/workspace/lldb-cmake-matrix/test/results.xml -v --param lldb-run-with-repro=capture /Users/buildslave/jenkins/workspace/lldb-cmake-matrix/lldb-build/tools/lldb/test/API /Users/buildslave/jenkins/workspace/lldb-cmake-matrix/lldb-build/tools/lldb/test/Shell ninja: build stopped: cannot make progress due to previous errors. Command failed: Command '['/usr/local/bin/ninja', '-k', '0', '-v', 'check-lldb-reproducers']' returned non-zero exit status 1. Command: ['/usr/local/bin/ninja', '-k', '0', '-v', 'check-lldb-reproducers'] + set -e [Pipeline] } [Pipeline] // timeout [Pipeline] } [Pipeline] // stage [Pipeline] } [Pipeline] // withEnv [Pipeline] } [Pipeline] // node [Pipeline] End of Pipeline Finished: UNSTABLE