Console Output

Skipping 119,306 KB.. Full Log
"/Users/buildslave/jenkins/workspace/lldb-cmake-matrix/clang_900_build/bin/clang"  main.o -g -O0 -fno-builtin -isysroot "/Applications/Xcode.app/Contents/Developer/Platforms/MacOSX.platform/Developer/SDKs/MacOSX10.15.sdk" -arch x86_64  -I/Users/buildslave/jenkins/workspace/lldb-cmake-matrix/llvm-project/lldb/packages/Python/lldbsuite/test/make/../../../../../include -I/Users/buildslave/jenkins/workspace/lldb-cmake-matrix/llvm-project/lldb/test/API/tools/lldb-vscode/launch -I/Users/buildslave/jenkins/workspace/lldb-cmake-matrix/llvm-project/lldb/packages/Python/lldbsuite/test/make -include /Users/buildslave/jenkins/workspace/lldb-cmake-matrix/llvm-project/lldb/packages/Python/lldbsuite/test/make/test_common.h  -fno-limit-debug-info     --driver-mode=g++ -o "a.out"
codesign -s - "a.out"
"/Users/buildslave/jenkins/workspace/lldb-cmake-matrix/lldb-build/./bin/dsymutil"  -o "a.out.dSYM" "a.out"

Hide Details

Hide Details

Adding tearDown hook: def cleanup(): if disconnectAutomatically: self.vscode.request_disconnect(terminateDebuggee=True) self.vscode.terminate()

Hide Details

Hide Details

Executing tearDown hook: def cleanup(): if disconnectAutomatically: self.vscode.request_disconnect(terminateDebuggee=True) self.vscode.terminate()

Hide Details

Hide Details

PASS: LLDB (/Users/buildslave/jenkins/workspace/lldb-cmake-matrix/clang_900_build/bin/clang-x86_64) :: test_commands (TestVSCode_launch.TestVSCode_launch) runCmd: settings clear -all output:

Hide Details

runCmd: settings set symbols.enable-external-lookup false output:

Hide Details

runCmd: settings set target.inherit-tcc true output:

Hide Details

runCmd: settings set target.detach-on-error false output:

Hide Details

runCmd: settings set target.auto-apply-fixits false output:

Hide Details

runCmd: settings set plugin.process.gdb-remote.packet-timeout 60 output:

Hide Details

runCmd: settings set symbols.clang-modules-cache-path "/Users/buildslave/jenkins/workspace/lldb-cmake-matrix/lldb-build/lldb-test-build.noindex/module-cache-lldb/lldb-api" output:

Hide Details

runCmd: settings set use-color false output:

Hide Details

runCmd: setting set target.prefer-dynamic-value no-dynamic-values output:

Hide Details

make VPATH=/Users/buildslave/jenkins/workspace/lldb-cmake-matrix/llvm-project/lldb/test/API/tools/lldb-vscode/launch -C /Users/buildslave/jenkins/workspace/lldb-cmake-matrix/lldb-build/lldb-test-build.noindex/tools/lldb-vscode/launch/TestVSCode_launch.test_cwd -I /Users/buildslave/jenkins/workspace/lldb-cmake-matrix/llvm-project/lldb/test/API/tools/lldb-vscode/launch -I /Users/buildslave/jenkins/workspace/lldb-cmake-matrix/llvm-project/lldb/packages/Python/lldbsuite/test/make -f /Users/buildslave/jenkins/workspace/lldb-cmake-matrix/llvm-project/lldb/test/API/tools/lldb-vscode/launch/Makefile all ARCH=x86_64 'CC="/Users/buildslave/jenkins/workspace/lldb-cmake-matrix/clang_900_build/bin/clang"' DSYMUTIL=/Users/buildslave/jenkins/workspace/lldb-cmake-matrix/lldb-build/./bin/dsymutil CODESIGN=codesign CLANG_MODULE_CACHE_DIR=/Users/buildslave/jenkins/workspace/lldb-cmake-matrix/lldb-build/lldb-test-build.noindex/module-cache-clang/lldb-api

Hide Details

"/Users/buildslave/jenkins/workspace/lldb-cmake-matrix/clang_900_build/bin/clang" -g -O0 -fno-builtin -isysroot "/Applications/Xcode.app/Contents/Developer/Platforms/MacOSX.platform/Developer/SDKs/MacOSX10.15.sdk" -arch x86_64 -I/Users/buildslave/jenkins/workspace/lldb-cmake-matrix/llvm-project/lldb/packages/Python/lldbsuite/test/make/../../../../../include -I/Users/buildslave/jenkins/workspace/lldb-cmake-matrix/llvm-project/lldb/test/API/tools/lldb-vscode/launch -I/Users/buildslave/jenkins/workspace/lldb-cmake-matrix/llvm-project/lldb/packages/Python/lldbsuite/test/make -include /Users/buildslave/jenkins/workspace/lldb-cmake-matrix/llvm-project/lldb/packages/Python/lldbsuite/test/make/test_common.h -fno-limit-debug-info -MT main.o -MD -MP -MF main.d -c -o main.o /Users/buildslave/jenkins/workspace/lldb-cmake-matrix/llvm-project/lldb/test/API/tools/lldb-vscode/launch/main.c "/Users/buildslave/jenkins/workspace/lldb-cmake-matrix/clang_900_build/bin/clang" main.o -g -O0 -fno-builtin -isysroot "/Applications/Xcode.app/Contents/Developer/Platforms/MacOSX.platform/Developer/SDKs/MacOSX10.15.sdk" -arch x86_64 -I/Users/buildslave/jenkins/workspace/lldb-cmake-matrix/llvm-project/lldb/packages/Python/lldbsuite/test/make/../../../../../include -I/Users/buildslave/jenkins/workspace/lldb-cmake-matrix/llvm-project/lldb/test/API/tools/lldb-vscode/launch -I/Users/buildslave/jenkins/workspace/lldb-cmake-matrix/llvm-project/lldb/packages/Python/lldbsuite/test/make -include /Users/buildslave/jenkins/workspace/lldb-cmake-matrix/llvm-project/lldb/packages/Python/lldbsuite/test/make/test_common.h -fno-limit-debug-info --driver-mode=g++ -o "a.out" codesign -s - "a.out" "/Users/buildslave/jenkins/workspace/lldb-cmake-matrix/lldb-build/./bin/dsymutil" -o "a.out.dSYM" "a.out"

Hide Details

Hide Details

Adding tearDown hook: def cleanup(): if disconnectAutomatically: self.vscode.request_disconnect(terminateDebuggee=True) self.vscode.terminate()

Hide Details

Hide Details

Executing tearDown hook: def cleanup(): if disconnectAutomatically: self.vscode.request_disconnect(terminateDebuggee=True) self.vscode.terminate()

Hide Details

Hide Details

PASS: LLDB (/Users/buildslave/jenkins/workspace/lldb-cmake-matrix/clang_900_build/bin/clang-x86_64) :: test_cwd (TestVSCode_launch.TestVSCode_launch) runCmd: settings clear -all output:

Hide Details

runCmd: settings set symbols.enable-external-lookup false output:

Hide Details

runCmd: settings set target.inherit-tcc true output:

Hide Details

runCmd: settings set target.detach-on-error false output:

Hide Details

runCmd: settings set target.auto-apply-fixits false output:

Hide Details

runCmd: settings set plugin.process.gdb-remote.packet-timeout 60 output:

Hide Details

runCmd: settings set symbols.clang-modules-cache-path "/Users/buildslave/jenkins/workspace/lldb-cmake-matrix/lldb-build/lldb-test-build.noindex/module-cache-lldb/lldb-api" output:

Hide Details

runCmd: settings set use-color false output:

Hide Details

runCmd: setting set target.prefer-dynamic-value no-dynamic-values output:

Hide Details

make VPATH=/Users/buildslave/jenkins/workspace/lldb-cmake-matrix/llvm-project/lldb/test/API/tools/lldb-vscode/launch -C /Users/buildslave/jenkins/workspace/lldb-cmake-matrix/lldb-build/lldb-test-build.noindex/tools/lldb-vscode/launch/TestVSCode_launch.test_debuggerRoot -I /Users/buildslave/jenkins/workspace/lldb-cmake-matrix/llvm-project/lldb/test/API/tools/lldb-vscode/launch -I /Users/buildslave/jenkins/workspace/lldb-cmake-matrix/llvm-project/lldb/packages/Python/lldbsuite/test/make -f /Users/buildslave/jenkins/workspace/lldb-cmake-matrix/llvm-project/lldb/test/API/tools/lldb-vscode/launch/Makefile all ARCH=x86_64 'CC="/Users/buildslave/jenkins/workspace/lldb-cmake-matrix/clang_900_build/bin/clang"' DSYMUTIL=/Users/buildslave/jenkins/workspace/lldb-cmake-matrix/lldb-build/./bin/dsymutil CODESIGN=codesign CLANG_MODULE_CACHE_DIR=/Users/buildslave/jenkins/workspace/lldb-cmake-matrix/lldb-build/lldb-test-build.noindex/module-cache-clang/lldb-api

Hide Details

"/Users/buildslave/jenkins/workspace/lldb-cmake-matrix/clang_900_build/bin/clang" -g -O0 -fno-builtin -isysroot "/Applications/Xcode.app/Contents/Developer/Platforms/MacOSX.platform/Developer/SDKs/MacOSX10.15.sdk" -arch x86_64 -I/Users/buildslave/jenkins/workspace/lldb-cmake-matrix/llvm-project/lldb/packages/Python/lldbsuite/test/make/../../../../../include -I/Users/buildslave/jenkins/workspace/lldb-cmake-matrix/llvm-project/lldb/test/API/tools/lldb-vscode/launch -I/Users/buildslave/jenkins/workspace/lldb-cmake-matrix/llvm-project/lldb/packages/Python/lldbsuite/test/make -include /Users/buildslave/jenkins/workspace/lldb-cmake-matrix/llvm-project/lldb/packages/Python/lldbsuite/test/make/test_common.h -fno-limit-debug-info -MT main.o -MD -MP -MF main.d -c -o main.o /Users/buildslave/jenkins/workspace/lldb-cmake-matrix/llvm-project/lldb/test/API/tools/lldb-vscode/launch/main.c "/Users/buildslave/jenkins/workspace/lldb-cmake-matrix/clang_900_build/bin/clang" main.o -g -O0 -fno-builtin -isysroot "/Applications/Xcode.app/Contents/Developer/Platforms/MacOSX.platform/Developer/SDKs/MacOSX10.15.sdk" -arch x86_64 -I/Users/buildslave/jenkins/workspace/lldb-cmake-matrix/llvm-project/lldb/packages/Python/lldbsuite/test/make/../../../../../include -I/Users/buildslave/jenkins/workspace/lldb-cmake-matrix/llvm-project/lldb/test/API/tools/lldb-vscode/launch -I/Users/buildslave/jenkins/workspace/lldb-cmake-matrix/llvm-project/lldb/packages/Python/lldbsuite/test/make -include /Users/buildslave/jenkins/workspace/lldb-cmake-matrix/llvm-project/lldb/packages/Python/lldbsuite/test/make/test_common.h -fno-limit-debug-info --driver-mode=g++ -o "a.out" codesign -s - "a.out" "/Users/buildslave/jenkins/workspace/lldb-cmake-matrix/lldb-build/./bin/dsymutil" -o "a.out.dSYM" "a.out"

Hide Details

Hide Details

Adding tearDown hook: def cleanup(): if disconnectAutomatically: self.vscode.request_disconnect(terminateDebuggee=True) self.vscode.terminate()

Hide Details

Hide Details

Executing tearDown hook: def cleanup(): if disconnectAutomatically: self.vscode.request_disconnect(terminateDebuggee=True) self.vscode.terminate()

Hide Details

Hide Details

PASS: LLDB (/Users/buildslave/jenkins/workspace/lldb-cmake-matrix/clang_900_build/bin/clang-x86_64) :: test_debuggerRoot (TestVSCode_launch.TestVSCode_launch) UNSUPPORTED: LLDB (/Users/buildslave/jenkins/workspace/lldb-cmake-matrix/clang_900_build/bin/clang-x86_64) :: test_default (TestVSCode_launch.TestVSCode_launch) (skip on macosx, darwin, ios, tvos, watchos, bridgeos, iphonesimulator, watchsimulator, appletvsimulator) runCmd: settings clear -all output:

Hide Details

runCmd: settings set symbols.enable-external-lookup false output:

Hide Details

runCmd: settings set target.inherit-tcc true output:

Hide Details

runCmd: settings set target.detach-on-error false output:

Hide Details

runCmd: settings set target.auto-apply-fixits false output:

Hide Details

runCmd: settings set plugin.process.gdb-remote.packet-timeout 60 output:

Hide Details

runCmd: settings set symbols.clang-modules-cache-path "/Users/buildslave/jenkins/workspace/lldb-cmake-matrix/lldb-build/lldb-test-build.noindex/module-cache-lldb/lldb-api" output:

Hide Details

runCmd: settings set use-color false output:

Hide Details

runCmd: setting set target.prefer-dynamic-value no-dynamic-values output:

Hide Details

make VPATH=/Users/buildslave/jenkins/workspace/lldb-cmake-matrix/llvm-project/lldb/test/API/tools/lldb-vscode/launch -C /Users/buildslave/jenkins/workspace/lldb-cmake-matrix/lldb-build/lldb-test-build.noindex/tools/lldb-vscode/launch/TestVSCode_launch.test_disableSTDIO -I /Users/buildslave/jenkins/workspace/lldb-cmake-matrix/llvm-project/lldb/test/API/tools/lldb-vscode/launch -I /Users/buildslave/jenkins/workspace/lldb-cmake-matrix/llvm-project/lldb/packages/Python/lldbsuite/test/make -f /Users/buildslave/jenkins/workspace/lldb-cmake-matrix/llvm-project/lldb/test/API/tools/lldb-vscode/launch/Makefile all ARCH=x86_64 'CC="/Users/buildslave/jenkins/workspace/lldb-cmake-matrix/clang_900_build/bin/clang"' DSYMUTIL=/Users/buildslave/jenkins/workspace/lldb-cmake-matrix/lldb-build/./bin/dsymutil CODESIGN=codesign CLANG_MODULE_CACHE_DIR=/Users/buildslave/jenkins/workspace/lldb-cmake-matrix/lldb-build/lldb-test-build.noindex/module-cache-clang/lldb-api

Hide Details

"/Users/buildslave/jenkins/workspace/lldb-cmake-matrix/clang_900_build/bin/clang" -g -O0 -fno-builtin -isysroot "/Applications/Xcode.app/Contents/Developer/Platforms/MacOSX.platform/Developer/SDKs/MacOSX10.15.sdk" -arch x86_64 -I/Users/buildslave/jenkins/workspace/lldb-cmake-matrix/llvm-project/lldb/packages/Python/lldbsuite/test/make/../../../../../include -I/Users/buildslave/jenkins/workspace/lldb-cmake-matrix/llvm-project/lldb/test/API/tools/lldb-vscode/launch -I/Users/buildslave/jenkins/workspace/lldb-cmake-matrix/llvm-project/lldb/packages/Python/lldbsuite/test/make -include /Users/buildslave/jenkins/workspace/lldb-cmake-matrix/llvm-project/lldb/packages/Python/lldbsuite/test/make/test_common.h -fno-limit-debug-info -MT main.o -MD -MP -MF main.d -c -o main.o /Users/buildslave/jenkins/workspace/lldb-cmake-matrix/llvm-project/lldb/test/API/tools/lldb-vscode/launch/main.c "/Users/buildslave/jenkins/workspace/lldb-cmake-matrix/clang_900_build/bin/clang" main.o -g -O0 -fno-builtin -isysroot "/Applications/Xcode.app/Contents/Developer/Platforms/MacOSX.platform/Developer/SDKs/MacOSX10.15.sdk" -arch x86_64 -I/Users/buildslave/jenkins/workspace/lldb-cmake-matrix/llvm-project/lldb/packages/Python/lldbsuite/test/make/../../../../../include -I/Users/buildslave/jenkins/workspace/lldb-cmake-matrix/llvm-project/lldb/test/API/tools/lldb-vscode/launch -I/Users/buildslave/jenkins/workspace/lldb-cmake-matrix/llvm-project/lldb/packages/Python/lldbsuite/test/make -include /Users/buildslave/jenkins/workspace/lldb-cmake-matrix/llvm-project/lldb/packages/Python/lldbsuite/test/make/test_common.h -fno-limit-debug-info --driver-mode=g++ -o "a.out" codesign -s - "a.out" "/Users/buildslave/jenkins/workspace/lldb-cmake-matrix/lldb-build/./bin/dsymutil" -o "a.out.dSYM" "a.out"

Hide Details

Hide Details

Adding tearDown hook: def cleanup(): if disconnectAutomatically: self.vscode.request_disconnect(terminateDebuggee=True) self.vscode.terminate()

Hide Details

Hide Details

Executing tearDown hook: def cleanup(): if disconnectAutomatically: self.vscode.request_disconnect(terminateDebuggee=True) self.vscode.terminate()

Hide Details

Hide Details

PASS: LLDB (/Users/buildslave/jenkins/workspace/lldb-cmake-matrix/clang_900_build/bin/clang-x86_64) :: test_disableSTDIO (TestVSCode_launch.TestVSCode_launch) runCmd: settings clear -all output:

Hide Details

runCmd: settings set symbols.enable-external-lookup false output:

Hide Details

runCmd: settings set target.inherit-tcc true output:

Hide Details

runCmd: settings set target.detach-on-error false output:

Hide Details

runCmd: settings set target.auto-apply-fixits false output:

Hide Details

runCmd: settings set plugin.process.gdb-remote.packet-timeout 60 output:

Hide Details

runCmd: settings set symbols.clang-modules-cache-path "/Users/buildslave/jenkins/workspace/lldb-cmake-matrix/lldb-build/lldb-test-build.noindex/module-cache-lldb/lldb-api" output:

Hide Details

runCmd: settings set use-color false output:

Hide Details

runCmd: setting set target.prefer-dynamic-value no-dynamic-values output:

Hide Details

make VPATH=/Users/buildslave/jenkins/workspace/lldb-cmake-matrix/llvm-project/lldb/test/API/tools/lldb-vscode/launch -C /Users/buildslave/jenkins/workspace/lldb-cmake-matrix/lldb-build/lldb-test-build.noindex/tools/lldb-vscode/launch/TestVSCode_launch.test_environment -I /Users/buildslave/jenkins/workspace/lldb-cmake-matrix/llvm-project/lldb/test/API/tools/lldb-vscode/launch -I /Users/buildslave/jenkins/workspace/lldb-cmake-matrix/llvm-project/lldb/packages/Python/lldbsuite/test/make -f /Users/buildslave/jenkins/workspace/lldb-cmake-matrix/llvm-project/lldb/test/API/tools/lldb-vscode/launch/Makefile all ARCH=x86_64 'CC="/Users/buildslave/jenkins/workspace/lldb-cmake-matrix/clang_900_build/bin/clang"' DSYMUTIL=/Users/buildslave/jenkins/workspace/lldb-cmake-matrix/lldb-build/./bin/dsymutil CODESIGN=codesign CLANG_MODULE_CACHE_DIR=/Users/buildslave/jenkins/workspace/lldb-cmake-matrix/lldb-build/lldb-test-build.noindex/module-cache-clang/lldb-api

Hide Details

"/Users/buildslave/jenkins/workspace/lldb-cmake-matrix/clang_900_build/bin/clang" -g -O0 -fno-builtin -isysroot "/Applications/Xcode.app/Contents/Developer/Platforms/MacOSX.platform/Developer/SDKs/MacOSX10.15.sdk" -arch x86_64 -I/Users/buildslave/jenkins/workspace/lldb-cmake-matrix/llvm-project/lldb/packages/Python/lldbsuite/test/make/../../../../../include -I/Users/buildslave/jenkins/workspace/lldb-cmake-matrix/llvm-project/lldb/test/API/tools/lldb-vscode/launch -I/Users/buildslave/jenkins/workspace/lldb-cmake-matrix/llvm-project/lldb/packages/Python/lldbsuite/test/make -include /Users/buildslave/jenkins/workspace/lldb-cmake-matrix/llvm-project/lldb/packages/Python/lldbsuite/test/make/test_common.h -fno-limit-debug-info -MT main.o -MD -MP -MF main.d -c -o main.o /Users/buildslave/jenkins/workspace/lldb-cmake-matrix/llvm-project/lldb/test/API/tools/lldb-vscode/launch/main.c "/Users/buildslave/jenkins/workspace/lldb-cmake-matrix/clang_900_build/bin/clang" main.o -g -O0 -fno-builtin -isysroot "/Applications/Xcode.app/Contents/Developer/Platforms/MacOSX.platform/Developer/SDKs/MacOSX10.15.sdk" -arch x86_64 -I/Users/buildslave/jenkins/workspace/lldb-cmake-matrix/llvm-project/lldb/packages/Python/lldbsuite/test/make/../../../../../include -I/Users/buildslave/jenkins/workspace/lldb-cmake-matrix/llvm-project/lldb/test/API/tools/lldb-vscode/launch -I/Users/buildslave/jenkins/workspace/lldb-cmake-matrix/llvm-project/lldb/packages/Python/lldbsuite/test/make -include /Users/buildslave/jenkins/workspace/lldb-cmake-matrix/llvm-project/lldb/packages/Python/lldbsuite/test/make/test_common.h -fno-limit-debug-info --driver-mode=g++ -o "a.out" codesign -s - "a.out" "/Users/buildslave/jenkins/workspace/lldb-cmake-matrix/lldb-build/./bin/dsymutil" -o "a.out.dSYM" "a.out"

Hide Details

Hide Details

Adding tearDown hook: def cleanup(): if disconnectAutomatically: self.vscode.request_disconnect(terminateDebuggee=True) self.vscode.terminate()

Hide Details

Hide Details

Executing tearDown hook: def cleanup(): if disconnectAutomatically: self.vscode.request_disconnect(terminateDebuggee=True) self.vscode.terminate()

Hide Details

Hide Details

PASS: LLDB (/Users/buildslave/jenkins/workspace/lldb-cmake-matrix/clang_900_build/bin/clang-x86_64) :: test_environment (TestVSCode_launch.TestVSCode_launch) runCmd: settings clear -all output:

Hide Details

runCmd: settings set symbols.enable-external-lookup false output:

Hide Details

runCmd: settings set target.inherit-tcc true output:

Hide Details

runCmd: settings set target.detach-on-error false output:

Hide Details

runCmd: settings set target.auto-apply-fixits false output:

Hide Details

runCmd: settings set plugin.process.gdb-remote.packet-timeout 60 output:

Hide Details

runCmd: settings set symbols.clang-modules-cache-path "/Users/buildslave/jenkins/workspace/lldb-cmake-matrix/lldb-build/lldb-test-build.noindex/module-cache-lldb/lldb-api" output:

Hide Details

runCmd: settings set use-color false output:

Hide Details

runCmd: setting set target.prefer-dynamic-value no-dynamic-values output:

Hide Details

make VPATH=/Users/buildslave/jenkins/workspace/lldb-cmake-matrix/llvm-project/lldb/test/API/tools/lldb-vscode/launch -C /Users/buildslave/jenkins/workspace/lldb-cmake-matrix/lldb-build/lldb-test-build.noindex/tools/lldb-vscode/launch/TestVSCode_launch.test_extra_launch_commands -I /Users/buildslave/jenkins/workspace/lldb-cmake-matrix/llvm-project/lldb/test/API/tools/lldb-vscode/launch -I /Users/buildslave/jenkins/workspace/lldb-cmake-matrix/llvm-project/lldb/packages/Python/lldbsuite/test/make -f /Users/buildslave/jenkins/workspace/lldb-cmake-matrix/llvm-project/lldb/test/API/tools/lldb-vscode/launch/Makefile all ARCH=x86_64 'CC="/Users/buildslave/jenkins/workspace/lldb-cmake-matrix/clang_900_build/bin/clang"' DSYMUTIL=/Users/buildslave/jenkins/workspace/lldb-cmake-matrix/lldb-build/./bin/dsymutil CODESIGN=codesign CLANG_MODULE_CACHE_DIR=/Users/buildslave/jenkins/workspace/lldb-cmake-matrix/lldb-build/lldb-test-build.noindex/module-cache-clang/lldb-api

Hide Details

"/Users/buildslave/jenkins/workspace/lldb-cmake-matrix/clang_900_build/bin/clang" -g -O0 -fno-builtin -isysroot "/Applications/Xcode.app/Contents/Developer/Platforms/MacOSX.platform/Developer/SDKs/MacOSX10.15.sdk" -arch x86_64 -I/Users/buildslave/jenkins/workspace/lldb-cmake-matrix/llvm-project/lldb/packages/Python/lldbsuite/test/make/../../../../../include -I/Users/buildslave/jenkins/workspace/lldb-cmake-matrix/llvm-project/lldb/test/API/tools/lldb-vscode/launch -I/Users/buildslave/jenkins/workspace/lldb-cmake-matrix/llvm-project/lldb/packages/Python/lldbsuite/test/make -include /Users/buildslave/jenkins/workspace/lldb-cmake-matrix/llvm-project/lldb/packages/Python/lldbsuite/test/make/test_common.h -fno-limit-debug-info -MT main.o -MD -MP -MF main.d -c -o main.o /Users/buildslave/jenkins/workspace/lldb-cmake-matrix/llvm-project/lldb/test/API/tools/lldb-vscode/launch/main.c "/Users/buildslave/jenkins/workspace/lldb-cmake-matrix/clang_900_build/bin/clang" main.o -g -O0 -fno-builtin -isysroot "/Applications/Xcode.app/Contents/Developer/Platforms/MacOSX.platform/Developer/SDKs/MacOSX10.15.sdk" -arch x86_64 -I/Users/buildslave/jenkins/workspace/lldb-cmake-matrix/llvm-project/lldb/packages/Python/lldbsuite/test/make/../../../../../include -I/Users/buildslave/jenkins/workspace/lldb-cmake-matrix/llvm-project/lldb/test/API/tools/lldb-vscode/launch -I/Users/buildslave/jenkins/workspace/lldb-cmake-matrix/llvm-project/lldb/packages/Python/lldbsuite/test/make -include /Users/buildslave/jenkins/workspace/lldb-cmake-matrix/llvm-project/lldb/packages/Python/lldbsuite/test/make/test_common.h -fno-limit-debug-info --driver-mode=g++ -o "a.out" codesign -s - "a.out" "/Users/buildslave/jenkins/workspace/lldb-cmake-matrix/lldb-build/./bin/dsymutil" -o "a.out.dSYM" "a.out"

Hide Details

Hide Details

Adding tearDown hook: def cleanup(): if disconnectAutomatically: self.vscode.request_disconnect(terminateDebuggee=True) self.vscode.terminate()

Hide Details

Hide Details

FAIL: LLDB (/Users/buildslave/jenkins/workspace/lldb-cmake-matrix/clang_900_build/bin/clang-x86_64) :: test_extra_launch_commands (TestVSCode_launch.TestVSCode_launch) Executing tearDown hook: def cleanup(): if disconnectAutomatically: self.vscode.request_disconnect(terminateDebuggee=True) self.vscode.terminate()

Hide Details

Hide Details

runCmd: settings clear -all output:

Hide Details

runCmd: settings set symbols.enable-external-lookup false output:

Hide Details

runCmd: settings set target.inherit-tcc true output:

Hide Details

runCmd: settings set target.detach-on-error false output:

Hide Details

runCmd: settings set target.auto-apply-fixits false output:

Hide Details

runCmd: settings set plugin.process.gdb-remote.packet-timeout 60 output:

Hide Details

runCmd: settings set symbols.clang-modules-cache-path "/Users/buildslave/jenkins/workspace/lldb-cmake-matrix/lldb-build/lldb-test-build.noindex/module-cache-lldb/lldb-api" output:

Hide Details

runCmd: settings set use-color false output:

Hide Details

runCmd: setting set target.prefer-dynamic-value no-dynamic-values output:

Hide Details

make VPATH=/Users/buildslave/jenkins/workspace/lldb-cmake-matrix/llvm-project/lldb/test/API/tools/lldb-vscode/launch -C /Users/buildslave/jenkins/workspace/lldb-cmake-matrix/lldb-build/lldb-test-build.noindex/tools/lldb-vscode/launch/TestVSCode_launch.test_shellExpandArguments_disabled -I /Users/buildslave/jenkins/workspace/lldb-cmake-matrix/llvm-project/lldb/test/API/tools/lldb-vscode/launch -I /Users/buildslave/jenkins/workspace/lldb-cmake-matrix/llvm-project/lldb/packages/Python/lldbsuite/test/make -f /Users/buildslave/jenkins/workspace/lldb-cmake-matrix/llvm-project/lldb/test/API/tools/lldb-vscode/launch/Makefile all ARCH=x86_64 'CC="/Users/buildslave/jenkins/workspace/lldb-cmake-matrix/clang_900_build/bin/clang"' DSYMUTIL=/Users/buildslave/jenkins/workspace/lldb-cmake-matrix/lldb-build/./bin/dsymutil CODESIGN=codesign CLANG_MODULE_CACHE_DIR=/Users/buildslave/jenkins/workspace/lldb-cmake-matrix/lldb-build/lldb-test-build.noindex/module-cache-clang/lldb-api

Hide Details

"/Users/buildslave/jenkins/workspace/lldb-cmake-matrix/clang_900_build/bin/clang" -g -O0 -fno-builtin -isysroot "/Applications/Xcode.app/Contents/Developer/Platforms/MacOSX.platform/Developer/SDKs/MacOSX10.15.sdk" -arch x86_64 -I/Users/buildslave/jenkins/workspace/lldb-cmake-matrix/llvm-project/lldb/packages/Python/lldbsuite/test/make/../../../../../include -I/Users/buildslave/jenkins/workspace/lldb-cmake-matrix/llvm-project/lldb/test/API/tools/lldb-vscode/launch -I/Users/buildslave/jenkins/workspace/lldb-cmake-matrix/llvm-project/lldb/packages/Python/lldbsuite/test/make -include /Users/buildslave/jenkins/workspace/lldb-cmake-matrix/llvm-project/lldb/packages/Python/lldbsuite/test/make/test_common.h -fno-limit-debug-info -MT main.o -MD -MP -MF main.d -c -o main.o /Users/buildslave/jenkins/workspace/lldb-cmake-matrix/llvm-project/lldb/test/API/tools/lldb-vscode/launch/main.c "/Users/buildslave/jenkins/workspace/lldb-cmake-matrix/clang_900_build/bin/clang" main.o -g -O0 -fno-builtin -isysroot "/Applications/Xcode.app/Contents/Developer/Platforms/MacOSX.platform/Developer/SDKs/MacOSX10.15.sdk" -arch x86_64 -I/Users/buildslave/jenkins/workspace/lldb-cmake-matrix/llvm-project/lldb/packages/Python/lldbsuite/test/make/../../../../../include -I/Users/buildslave/jenkins/workspace/lldb-cmake-matrix/llvm-project/lldb/test/API/tools/lldb-vscode/launch -I/Users/buildslave/jenkins/workspace/lldb-cmake-matrix/llvm-project/lldb/packages/Python/lldbsuite/test/make -include /Users/buildslave/jenkins/workspace/lldb-cmake-matrix/llvm-project/lldb/packages/Python/lldbsuite/test/make/test_common.h -fno-limit-debug-info --driver-mode=g++ -o "a.out" codesign -s - "a.out" "/Users/buildslave/jenkins/workspace/lldb-cmake-matrix/lldb-build/./bin/dsymutil" -o "a.out.dSYM" "a.out"

Hide Details

Hide Details

Adding tearDown hook: def cleanup(): if disconnectAutomatically: self.vscode.request_disconnect(terminateDebuggee=True) self.vscode.terminate()

Hide Details

Hide Details

Executing tearDown hook: def cleanup(): if disconnectAutomatically: self.vscode.request_disconnect(terminateDebuggee=True) self.vscode.terminate()

Hide Details

Hide Details

PASS: LLDB (/Users/buildslave/jenkins/workspace/lldb-cmake-matrix/clang_900_build/bin/clang-x86_64) :: test_shellExpandArguments_disabled (TestVSCode_launch.TestVSCode_launch) runCmd: settings clear -all output:

Hide Details

runCmd: settings set symbols.enable-external-lookup false output:

Hide Details

runCmd: settings set target.inherit-tcc true output:

Hide Details

runCmd: settings set target.detach-on-error false output:

Hide Details

runCmd: settings set target.auto-apply-fixits false output:

Hide Details

runCmd: settings set plugin.process.gdb-remote.packet-timeout 60 output:

Hide Details

runCmd: settings set symbols.clang-modules-cache-path "/Users/buildslave/jenkins/workspace/lldb-cmake-matrix/lldb-build/lldb-test-build.noindex/module-cache-lldb/lldb-api" output:

Hide Details

runCmd: settings set use-color false output:

Hide Details

runCmd: setting set target.prefer-dynamic-value no-dynamic-values output:

Hide Details

make VPATH=/Users/buildslave/jenkins/workspace/lldb-cmake-matrix/llvm-project/lldb/test/API/tools/lldb-vscode/launch -C /Users/buildslave/jenkins/workspace/lldb-cmake-matrix/lldb-build/lldb-test-build.noindex/tools/lldb-vscode/launch/TestVSCode_launch.test_shellExpandArguments_enabled -I /Users/buildslave/jenkins/workspace/lldb-cmake-matrix/llvm-project/lldb/test/API/tools/lldb-vscode/launch -I /Users/buildslave/jenkins/workspace/lldb-cmake-matrix/llvm-project/lldb/packages/Python/lldbsuite/test/make -f /Users/buildslave/jenkins/workspace/lldb-cmake-matrix/llvm-project/lldb/test/API/tools/lldb-vscode/launch/Makefile all ARCH=x86_64 'CC="/Users/buildslave/jenkins/workspace/lldb-cmake-matrix/clang_900_build/bin/clang"' DSYMUTIL=/Users/buildslave/jenkins/workspace/lldb-cmake-matrix/lldb-build/./bin/dsymutil CODESIGN=codesign CLANG_MODULE_CACHE_DIR=/Users/buildslave/jenkins/workspace/lldb-cmake-matrix/lldb-build/lldb-test-build.noindex/module-cache-clang/lldb-api

Hide Details

"/Users/buildslave/jenkins/workspace/lldb-cmake-matrix/clang_900_build/bin/clang" -g -O0 -fno-builtin -isysroot "/Applications/Xcode.app/Contents/Developer/Platforms/MacOSX.platform/Developer/SDKs/MacOSX10.15.sdk" -arch x86_64 -I/Users/buildslave/jenkins/workspace/lldb-cmake-matrix/llvm-project/lldb/packages/Python/lldbsuite/test/make/../../../../../include -I/Users/buildslave/jenkins/workspace/lldb-cmake-matrix/llvm-project/lldb/test/API/tools/lldb-vscode/launch -I/Users/buildslave/jenkins/workspace/lldb-cmake-matrix/llvm-project/lldb/packages/Python/lldbsuite/test/make -include /Users/buildslave/jenkins/workspace/lldb-cmake-matrix/llvm-project/lldb/packages/Python/lldbsuite/test/make/test_common.h -fno-limit-debug-info -MT main.o -MD -MP -MF main.d -c -o main.o /Users/buildslave/jenkins/workspace/lldb-cmake-matrix/llvm-project/lldb/test/API/tools/lldb-vscode/launch/main.c "/Users/buildslave/jenkins/workspace/lldb-cmake-matrix/clang_900_build/bin/clang" main.o -g -O0 -fno-builtin -isysroot "/Applications/Xcode.app/Contents/Developer/Platforms/MacOSX.platform/Developer/SDKs/MacOSX10.15.sdk" -arch x86_64 -I/Users/buildslave/jenkins/workspace/lldb-cmake-matrix/llvm-project/lldb/packages/Python/lldbsuite/test/make/../../../../../include -I/Users/buildslave/jenkins/workspace/lldb-cmake-matrix/llvm-project/lldb/test/API/tools/lldb-vscode/launch -I/Users/buildslave/jenkins/workspace/lldb-cmake-matrix/llvm-project/lldb/packages/Python/lldbsuite/test/make -include /Users/buildslave/jenkins/workspace/lldb-cmake-matrix/llvm-project/lldb/packages/Python/lldbsuite/test/make/test_common.h -fno-limit-debug-info --driver-mode=g++ -o "a.out" codesign -s - "a.out" "/Users/buildslave/jenkins/workspace/lldb-cmake-matrix/lldb-build/./bin/dsymutil" -o "a.out.dSYM" "a.out"

Hide Details

Hide Details

Adding tearDown hook: def cleanup(): if disconnectAutomatically: self.vscode.request_disconnect(terminateDebuggee=True) self.vscode.terminate()

Hide Details

Hide Details

Executing tearDown hook: def cleanup(): if disconnectAutomatically: self.vscode.request_disconnect(terminateDebuggee=True) self.vscode.terminate()

Hide Details

Hide Details

PASS: LLDB (/Users/buildslave/jenkins/workspace/lldb-cmake-matrix/clang_900_build/bin/clang-x86_64) :: test_shellExpandArguments_enabled (TestVSCode_launch.TestVSCode_launch) runCmd: settings clear -all output:

Hide Details

runCmd: settings set symbols.enable-external-lookup false output:

Hide Details

runCmd: settings set target.inherit-tcc true output:

Hide Details

runCmd: settings set target.detach-on-error false output:

Hide Details

runCmd: settings set target.auto-apply-fixits false output:

Hide Details

runCmd: settings set plugin.process.gdb-remote.packet-timeout 60 output:

Hide Details

runCmd: settings set symbols.clang-modules-cache-path "/Users/buildslave/jenkins/workspace/lldb-cmake-matrix/lldb-build/lldb-test-build.noindex/module-cache-lldb/lldb-api" output:

Hide Details

runCmd: settings set use-color false output:

Hide Details

runCmd: setting set target.prefer-dynamic-value no-dynamic-values output:

Hide Details

make VPATH=/Users/buildslave/jenkins/workspace/lldb-cmake-matrix/llvm-project/lldb/test/API/tools/lldb-vscode/launch -C /Users/buildslave/jenkins/workspace/lldb-cmake-matrix/lldb-build/lldb-test-build.noindex/tools/lldb-vscode/launch/TestVSCode_launch.test_sourcePath -I /Users/buildslave/jenkins/workspace/lldb-cmake-matrix/llvm-project/lldb/test/API/tools/lldb-vscode/launch -I /Users/buildslave/jenkins/workspace/lldb-cmake-matrix/llvm-project/lldb/packages/Python/lldbsuite/test/make -f /Users/buildslave/jenkins/workspace/lldb-cmake-matrix/llvm-project/lldb/test/API/tools/lldb-vscode/launch/Makefile all ARCH=x86_64 'CC="/Users/buildslave/jenkins/workspace/lldb-cmake-matrix/clang_900_build/bin/clang"' DSYMUTIL=/Users/buildslave/jenkins/workspace/lldb-cmake-matrix/lldb-build/./bin/dsymutil CODESIGN=codesign CLANG_MODULE_CACHE_DIR=/Users/buildslave/jenkins/workspace/lldb-cmake-matrix/lldb-build/lldb-test-build.noindex/module-cache-clang/lldb-api

Hide Details

"/Users/buildslave/jenkins/workspace/lldb-cmake-matrix/clang_900_build/bin/clang" -g -O0 -fno-builtin -isysroot "/Applications/Xcode.app/Contents/Developer/Platforms/MacOSX.platform/Developer/SDKs/MacOSX10.15.sdk" -arch x86_64 -I/Users/buildslave/jenkins/workspace/lldb-cmake-matrix/llvm-project/lldb/packages/Python/lldbsuite/test/make/../../../../../include -I/Users/buildslave/jenkins/workspace/lldb-cmake-matrix/llvm-project/lldb/test/API/tools/lldb-vscode/launch -I/Users/buildslave/jenkins/workspace/lldb-cmake-matrix/llvm-project/lldb/packages/Python/lldbsuite/test/make -include /Users/buildslave/jenkins/workspace/lldb-cmake-matrix/llvm-project/lldb/packages/Python/lldbsuite/test/make/test_common.h -fno-limit-debug-info -MT main.o -MD -MP -MF main.d -c -o main.o /Users/buildslave/jenkins/workspace/lldb-cmake-matrix/llvm-project/lldb/test/API/tools/lldb-vscode/launch/main.c "/Users/buildslave/jenkins/workspace/lldb-cmake-matrix/clang_900_build/bin/clang" main.o -g -O0 -fno-builtin -isysroot "/Applications/Xcode.app/Contents/Developer/Platforms/MacOSX.platform/Developer/SDKs/MacOSX10.15.sdk" -arch x86_64 -I/Users/buildslave/jenkins/workspace/lldb-cmake-matrix/llvm-project/lldb/packages/Python/lldbsuite/test/make/../../../../../include -I/Users/buildslave/jenkins/workspace/lldb-cmake-matrix/llvm-project/lldb/test/API/tools/lldb-vscode/launch -I/Users/buildslave/jenkins/workspace/lldb-cmake-matrix/llvm-project/lldb/packages/Python/lldbsuite/test/make -include /Users/buildslave/jenkins/workspace/lldb-cmake-matrix/llvm-project/lldb/packages/Python/lldbsuite/test/make/test_common.h -fno-limit-debug-info --driver-mode=g++ -o "a.out" codesign -s - "a.out" "/Users/buildslave/jenkins/workspace/lldb-cmake-matrix/lldb-build/./bin/dsymutil" -o "a.out.dSYM" "a.out"

Hide Details

Hide Details

Adding tearDown hook: def cleanup(): if disconnectAutomatically: self.vscode.request_disconnect(terminateDebuggee=True) self.vscode.terminate()

Hide Details

Hide Details

Executing tearDown hook: def cleanup(): if disconnectAutomatically: self.vscode.request_disconnect(terminateDebuggee=True) self.vscode.terminate()

Hide Details

Hide Details

PASS: LLDB (/Users/buildslave/jenkins/workspace/lldb-cmake-matrix/clang_900_build/bin/clang-x86_64) :: test_sourcePath (TestVSCode_launch.TestVSCode_launch) runCmd: settings clear -all output:

Hide Details

runCmd: settings set symbols.enable-external-lookup false output:

Hide Details

runCmd: settings set target.inherit-tcc true output:

Hide Details

runCmd: settings set target.detach-on-error false output:

Hide Details

runCmd: settings set target.auto-apply-fixits false output:

Hide Details

runCmd: settings set plugin.process.gdb-remote.packet-timeout 60 output:

Hide Details

runCmd: settings set symbols.clang-modules-cache-path "/Users/buildslave/jenkins/workspace/lldb-cmake-matrix/lldb-build/lldb-test-build.noindex/module-cache-lldb/lldb-api" output:

Hide Details

runCmd: settings set use-color false output:

Hide Details

runCmd: setting set target.prefer-dynamic-value no-dynamic-values output:

Hide Details

make VPATH=/Users/buildslave/jenkins/workspace/lldb-cmake-matrix/llvm-project/lldb/test/API/tools/lldb-vscode/launch -C /Users/buildslave/jenkins/workspace/lldb-cmake-matrix/lldb-build/lldb-test-build.noindex/tools/lldb-vscode/launch/TestVSCode_launch.test_stopOnEntry -I /Users/buildslave/jenkins/workspace/lldb-cmake-matrix/llvm-project/lldb/test/API/tools/lldb-vscode/launch -I /Users/buildslave/jenkins/workspace/lldb-cmake-matrix/llvm-project/lldb/packages/Python/lldbsuite/test/make -f /Users/buildslave/jenkins/workspace/lldb-cmake-matrix/llvm-project/lldb/test/API/tools/lldb-vscode/launch/Makefile all ARCH=x86_64 'CC="/Users/buildslave/jenkins/workspace/lldb-cmake-matrix/clang_900_build/bin/clang"' DSYMUTIL=/Users/buildslave/jenkins/workspace/lldb-cmake-matrix/lldb-build/./bin/dsymutil CODESIGN=codesign CLANG_MODULE_CACHE_DIR=/Users/buildslave/jenkins/workspace/lldb-cmake-matrix/lldb-build/lldb-test-build.noindex/module-cache-clang/lldb-api

Hide Details

"/Users/buildslave/jenkins/workspace/lldb-cmake-matrix/clang_900_build/bin/clang" -g -O0 -fno-builtin -isysroot "/Applications/Xcode.app/Contents/Developer/Platforms/MacOSX.platform/Developer/SDKs/MacOSX10.15.sdk" -arch x86_64 -I/Users/buildslave/jenkins/workspace/lldb-cmake-matrix/llvm-project/lldb/packages/Python/lldbsuite/test/make/../../../../../include -I/Users/buildslave/jenkins/workspace/lldb-cmake-matrix/llvm-project/lldb/test/API/tools/lldb-vscode/launch -I/Users/buildslave/jenkins/workspace/lldb-cmake-matrix/llvm-project/lldb/packages/Python/lldbsuite/test/make -include /Users/buildslave/jenkins/workspace/lldb-cmake-matrix/llvm-project/lldb/packages/Python/lldbsuite/test/make/test_common.h -fno-limit-debug-info -MT main.o -MD -MP -MF main.d -c -o main.o /Users/buildslave/jenkins/workspace/lldb-cmake-matrix/llvm-project/lldb/test/API/tools/lldb-vscode/launch/main.c "/Users/buildslave/jenkins/workspace/lldb-cmake-matrix/clang_900_build/bin/clang" main.o -g -O0 -fno-builtin -isysroot "/Applications/Xcode.app/Contents/Developer/Platforms/MacOSX.platform/Developer/SDKs/MacOSX10.15.sdk" -arch x86_64 -I/Users/buildslave/jenkins/workspace/lldb-cmake-matrix/llvm-project/lldb/packages/Python/lldbsuite/test/make/../../../../../include -I/Users/buildslave/jenkins/workspace/lldb-cmake-matrix/llvm-project/lldb/test/API/tools/lldb-vscode/launch -I/Users/buildslave/jenkins/workspace/lldb-cmake-matrix/llvm-project/lldb/packages/Python/lldbsuite/test/make -include /Users/buildslave/jenkins/workspace/lldb-cmake-matrix/llvm-project/lldb/packages/Python/lldbsuite/test/make/test_common.h -fno-limit-debug-info --driver-mode=g++ -o "a.out" codesign -s - "a.out" "/Users/buildslave/jenkins/workspace/lldb-cmake-matrix/lldb-build/./bin/dsymutil" -o "a.out.dSYM" "a.out"

Hide Details

Hide Details

Adding tearDown hook: def cleanup(): if disconnectAutomatically: self.vscode.request_disconnect(terminateDebuggee=True) self.vscode.terminate()

Hide Details

Hide Details

Executing tearDown hook: def cleanup(): if disconnectAutomatically: self.vscode.request_disconnect(terminateDebuggee=True) self.vscode.terminate()

Hide Details

Hide Details

PASS: LLDB (/Users/buildslave/jenkins/workspace/lldb-cmake-matrix/clang_900_build/bin/clang-x86_64) :: test_stopOnEntry (TestVSCode_launch.TestVSCode_launch) UNSUPPORTED: LLDB (/Users/buildslave/jenkins/workspace/lldb-cmake-matrix/clang_900_build/bin/clang-x86_64) :: test_terminate_commands (TestVSCode_launch.TestVSCode_launch) (skip on macosx, darwin, ios, tvos, watchos, bridgeos, iphonesimulator, watchsimulator, appletvsimulator) runCmd: settings clear -all output:

Hide Details

runCmd: settings set symbols.enable-external-lookup false output:

Hide Details

runCmd: settings set target.inherit-tcc true output:

Hide Details

runCmd: settings set target.detach-on-error false output:

Hide Details

runCmd: settings set target.auto-apply-fixits false output:

Hide Details

runCmd: settings set plugin.process.gdb-remote.packet-timeout 60 output:

Hide Details

runCmd: settings set symbols.clang-modules-cache-path "/Users/buildslave/jenkins/workspace/lldb-cmake-matrix/lldb-build/lldb-test-build.noindex/module-cache-lldb/lldb-api" output:

Hide Details

runCmd: settings set use-color false output:

Hide Details

runCmd: setting set target.prefer-dynamic-value no-dynamic-values output:

Hide Details

PASS: LLDB (/Users/buildslave/jenkins/workspace/lldb-cmake-matrix/clang_900_build/bin/clang-x86_64) :: test_termination (TestVSCode_launch.TestVSCode_launch) Restore dir to: /Users/buildslave/jenkins/workspace/lldb-cmake-matrix/lldb-build/tools/lldb/test ====================================================================== FAIL: test_extra_launch_commands (TestVSCode_launch.TestVSCode_launch) ---------------------------------------------------------------------- Traceback (most recent call last): File "/Users/buildslave/jenkins/workspace/lldb-cmake-matrix/llvm-project/lldb/test/API/tools/lldb-vscode/launch/TestVSCode_launch.py", line 431, in test_extra_launch_commands self.continue_to_exit() File "/Users/buildslave/jenkins/workspace/lldb-cmake-matrix/llvm-project/lldb/packages/Python/lldbsuite/test/tools/lldb-vscode/lldbvscode_testcase.py", line 246, in continue_to_exit 'make sure program ran to completion') AssertionError: 'stopped' != 'exited' - stopped+ exited : make sure program ran to completion Config=x86_64-/Users/buildslave/jenkins/workspace/lldb-cmake-matrix/clang_900_build/bin/clang ---------------------------------------------------------------------- Ran 14 tests in 25.694s

Hide Details

RESULT: FAILED (11 passes, 1 failures, 0 errors, 2 skipped, 0 expected failures, 0 unexpected successes)

Hide Details

--

Hide Details

******************** PASS: lldb-unit :: UnwindAssembly/x86/./UnwindAssemblyx86Tests/Testx86AssemblyInspectionEngine.TestReturnDetect (1505 of 2472) PASS: lldb-unit :: ScriptInterpreter/Python/./ScriptInterpreterPythonTests/PythonDataObjectsTest.TestCallable (1506 of 2472) PASS: lldb-unit :: Utility/./UtilityTests/ArgsTest.DoubleQuotedItem (1507 of 2472) UNSUPPORTED: lldb-shell :: SymbolFile/NativePDB/typedefs.cpp (1508 of 2472) PASS: lldb-api :: lang/cpp/unique-types/TestUniqueTypes.py (1509 of 2472) PASS: lldb-unit :: Expression/./ExpressionTests/DWARFExpression.DW_OP_const (1510 of 2472) UNSUPPORTED: lldb-shell :: Subprocess/fork-follow-parent-softbp.test (1511 of 2472) PASS: lldb-api :: functionalities/breakpoint/debugbreak/TestDebugBreak.py (1512 of 2472) PASS: lldb-unit :: Process/minidump/./LLDBMinidumpTests/RegisterContextMinidump.ConvertMinidumpContext_x86_64 (1513 of 2472) PASS: lldb-unit :: Symbol/./SymbolTests/DWARFCallFrameInfoTest.Basic_dwarf3 (1514 of 2472) PASS: lldb-unit :: Utility/./UtilityTests/UUIDTest.Validity (1515 of 2472) UNSUPPORTED: lldb-shell :: ObjectFile/PECOFF/disassemble-thumb.yaml (1516 of 2472) PASS: lldb-api :: functionalities/data-formatter/data-formatter-skip-summary/TestDataFormatterSkipSummary.py (1517 of 2472) PASS: lldb-api :: functionalities/data-formatter/data-formatter-objc/TestDataFormatterObjCExpr.py (1518 of 2472) PASS: lldb-shell :: Breakpoint/split-dwarf5-debug-stroffsets.test (1519 of 2472) PASS: lldb-api :: python_api/get-value-32bit-int/TestGetValue32BitInt.py (1520 of 2472) PASS: lldb-shell :: Settings/TestSettingsSet.test (1521 of 2472) PASS: lldb-api :: lang/cpp/covariant-return-types/TestCovariantReturnTypes.py (1522 of 2472) PASS: lldb-unit :: Platform/./LLDBPlatformTests/PlatformDarwinTest.TestParseVersionBuildDir (1523 of 2472) PASS: lldb-unit :: Utility/./UtilityTests/Flags.IsClear (1524 of 2472) PASS: lldb-unit :: Utility/./UtilityTests/TimerTest.CategoryTimes (1525 of 2472) PASS: lldb-api :: commands/expression/context-object/TestContextObject.py (1526 of 2472) PASS: lldb-unit :: ObjectFile/Breakpad/./ObjectFileBreakpadTests/PublicRecord.parse (1527 of 2472) PASS: lldb-api :: functionalities/data-formatter/data-formatter-objc/cmtime/TestDataFormatterCMTime.py (1528 of 2472) PASS: lldb-api :: functionalities/thread/crash_during_step/TestCrashDuringStep.py (1529 of 2472) PASS: lldb-api :: functionalities/gdb_remote_client/TestFork.py (1530 of 2472) PASS: lldb-unit :: UnwindAssembly/x86/./UnwindAssemblyx86Tests/Testx86AssemblyInspectionEngine.Test32bitFramelessBigStackFrame (1531 of 2472) UNSUPPORTED: lldb-api :: tools/lldb-server/TestGdbRemoteAuxvSupport.py (1532 of 2472) PASS: lldb-unit :: Utility/./UtilityTests/StringListTest.AppendStringStdString (1533 of 2472) PASS: lldb-shell :: Register/x86-multithread-read.test (1534 of 2472) PASS: lldb-unit :: UnwindAssembly/x86/./UnwindAssemblyx86Tests/Testx86AssemblyInspectionEngine.TestPushRBPWithREX (1535 of 2472) PASS: lldb-api :: macosx/thread_suspend/TestInternalThreadSuspension.py (1536 of 2472) PASS: lldb-unit :: Utility/./UtilityTests/ArgsTest.TestQuotedTrailingBackslash (1537 of 2472) UNSUPPORTED: lldb-shell :: SymbolFile/DWARF/x86/DW_TAG_variable-DW_AT_decl_file-DW_AT_abstract_origin-crosscu1.s (1538 of 2472) PASS: lldb-unit :: Utility/./UtilityTests/RangeDataVector.FindEntryThatContains_Overlap (1539 of 2472) PASS: lldb-api :: tools/lldb-server/TestGdbRemoteAttachOrWait.py (1540 of 2472) PASS: lldb-api :: functionalities/thread/step_out/TestThreadStepOut.py (1541 of 2472) PASS: lldb-api :: functionalities/gdb_remote_client/TestGDBRemoteDiskFileCompletion.py (1542 of 2472) PASS: lldb-unit :: Utility/./UtilityTests/ScalarTest.ExtractBitfield (1543 of 2472) PASS: lldb-unit :: Host/./HostTests/SocketTests/SocketTest.TCPGetConnectURI/ipv6 (1544 of 2472) PASS: lldb-unit :: Language/Highlighting/./HighlighterTests/HighlighterTest.Colons (1545 of 2472) PASS: lldb-api :: functionalities/data-formatter/data-formatter-synth/TestDataFormatterSynth.py (1546 of 2472) PASS: lldb-unit :: Utility/./UtilityTests/ScalarTest.APIntConstructor (1547 of 2472) PASS: lldb-unit :: Utility/./UtilityTests/PassiveReplayTest.InstrumentedFooInvalid (1548 of 2472) PASS: lldb-api :: repl/clang/TestClangREPL.py (1549 of 2472) PASS: lldb-api :: python_api/thread/TestThreadAPI.py (1550 of 2472) PASS: lldb-unit :: Core/./LLDBCoreTests/RichManglingContextTest.FromCxxMethodName (1551 of 2472) PASS: lldb-api :: functionalities/memory/find/TestMemoryFind.py (1552 of 2472) PASS: lldb-unit :: Utility/./UtilityTests/StringExtractorGDBRemoteTest.GetPidTid (1553 of 2472) PASS: lldb-shell :: ObjectFile/MachO/lc_version_min.yaml (1554 of 2472) XFAIL: lldb-shell :: Register/x86-64-ymm-write.test (1555 of 2472) PASS: lldb-unit :: UnwindAssembly/x86/./UnwindAssemblyx86Tests/Testx86AssemblyInspectionEngine.TestPushECX (1556 of 2472) PASS: lldb-unit :: Signals/./SignalsTests/UnixSignalsTest.GetInfo (1557 of 2472) PASS: lldb-api :: functionalities/gdb_remote_client/TestMultiprocess.py (1558 of 2472) PASS: lldb-api :: commands/expression/import-std-module/forward_decl_from_module/TestForwardDeclFromStdModule.py (1559 of 2472) PASS: lldb-unit :: Process/Utility/./ProcessUtilityTests/ProcMapTests/LinuxProcMapsTestFixture.ParseMapRegions/8 (1560 of 2472) UNSUPPORTED: lldb-shell :: SymbolFile/PDB/compilands.test (1561 of 2472) PASS: lldb-api :: python_api/exprpath_synthetic/TestExprPathSynthetic.py (1562 of 2472) PASS: lldb-api :: tools/lldb-vscode/evaluate/TestVSCode_evaluate.py (1563 of 2472) PASS: lldb-shell :: SymbolFile/DWARF/x86/DW_OP_piece-struct.s (1564 of 2472) UNSUPPORTED: lldb-api :: benchmarks/continue/TestBenchmarkContinue.py (1565 of 2472) PASS: lldb-api :: commands/expression/rdar42038760/TestScalarURem.py (1566 of 2472) PASS: lldb-api :: tools/lldb-server/TestGdbRemoteAttachWait.py (1567 of 2472) PASS: lldb-api :: python_api/target/TestTargetAPI.py (1568 of 2472) PASS: lldb-api :: commands/expression/completion/TestExprCompletion.py (1569 of 2472) PASS: lldb-unit :: Utility/./UtilityTests/GeneratorTest.GetOrCreate (1570 of 2472) PASS: lldb-api :: macosx/DBGSourcePathRemapping/TestDSYMSourcePathRemapping.py (1571 of 2472) PASS: lldb-api :: functionalities/data-formatter/data-formatter-python-synth/TestDataFormatterPythonSynth.py (1572 of 2472) PASS: lldb-unit :: Target/./TargetTests/MemoryRegionInfoTest.Formatv (1573 of 2472) PASS: lldb-api :: functionalities/thread/concurrent_events/TestConcurrentTwoBreakpointThreads.py (1574 of 2472) PASS: lldb-unit :: Utility/./UtilityTests/ArgsTest.TestInsertArg (1575 of 2472) PASS: lldb-api :: functionalities/data-formatter/pyobjsynthprovider/TestPyObjSynthProvider.py (1576 of 2472) UNSUPPORTED: lldb-api :: commands/trace/TestTraceDumpInfo.py (1577 of 2472) UNSUPPORTED: lldb-api :: functionalities/thread/state/TestThreadStates.py (1578 of 2472) UNSUPPORTED: lldb-shell :: SymbolFile/NativePDB/tag-types.cpp (1579 of 2472) PASS: lldb-unit :: Host/./HostTests/SocketTests/SocketTest.TCPListen0ConnectAccept/ipv6 (1580 of 2472) PASS: lldb-unit :: Expression/./ExpressionTests/DiagnosticManagerTest.PutString (1581 of 2472) PASS: lldb-api :: commands/expression/static-initializers/TestStaticInitializers.py (1582 of 2472) PASS: lldb-unit :: Thread/./ThreadTests/ThreadTest.SetStopInfo (1583 of 2472) PASS: lldb-api :: commands/expression/codegen-crash-import-def-arraytype-element/TestImportDefinitionArrayType.py (1584 of 2472) PASS: lldb-unit :: SymbolFile/DWARF/./SymbolFileDWARFTests/DWARFUnitTest.MissingSentinel (1585 of 2472) PASS: lldb-unit :: Utility/./UtilityTests/VASprintfTest.BufferResize (1586 of 2472) PASS: lldb-api :: functionalities/data-formatter/array_typedef/TestArrayTypedef.py (1587 of 2472) UNSUPPORTED: lldb-shell :: Register/x86-64-zmm-write.test (1588 of 2472) PASS: lldb-api :: functionalities/step-avoids-no-debug/TestStepNoDebug.py (1589 of 2472) PASS: lldb-unit :: Utility/./UtilityTests/UriParserTest.BracketedHostnameWithColon (1590 of 2472) PASS: lldb-shell :: SymbolFile/DWARF/x86/split-dwarf-multiple-cu.ll (1591 of 2472) PASS: lldb-unit :: UnwindAssembly/x86/./UnwindAssemblyx86Tests/Testx86AssemblyInspectionEngine.Test32bitFramelessSmallStackFrame (1592 of 2472) UNSUPPORTED: lldb-shell :: SymbolFile/NativePDB/global-classes.cpp (1593 of 2472) PASS: lldb-unit :: Utility/./UtilityTests/DataExtractorTest.GetCStrAtEnd (1594 of 2472) PASS: lldb-unit :: Host/./HostTests/SocketTests/SocketTest.TCPGetAddress/ipv4 (1595 of 2472) PASS: lldb-unit :: Platform/./LLDBPlatformTests/PlatformDarwinTest.GetCompatibleArchARMv7f (1596 of 2472) UNSUPPORTED: lldb-api :: functionalities/tsan/global_location/TestTsanGlobalLocation.py (1597 of 2472) PASS: lldb-unit :: Core/./LLDBCoreTests/DumpDataExtractorTest.StartOffset (1598 of 2472) UNSUPPORTED: lldb-api :: tools/lldb-server/TestGdbRemoteSaveCore.py (1599 of 2472) UNSUPPORTED: lldb-shell :: SymbolFile/DWARF/x86/find-method.cpp (1600 of 2472) PASS: lldb-unit :: Core/./LLDBCoreTests/MangledTest.EmptyForInvalidDLangName (1601 of 2472) PASS: lldb-unit :: DataFormatter/./LLDBFormatterTests/TypeMatcherTests.RegexMatchPart (1602 of 2472) PASS: lldb-shell :: Settings/TestLineMarkerColor.test (1603 of 2472) PASS: lldb-unit :: Utility/./UtilityTests/FileSpecTest.PrependPathComponent (1604 of 2472) PASS: lldb-unit :: UnwindAssembly/x86/./UnwindAssemblyx86Tests/Testx86AssemblyInspectionEngine.TestPushEBP (1605 of 2472) PASS: lldb-unit :: Utility/./UtilityTests/BinaryStreamTest.PutSLEB128SevenBytes (1606 of 2472) PASS: lldb-unit :: ObjectFile/Breakpad/./ObjectFileBreakpadTests/StackWinRecord.parse (1607 of 2472) PASS: lldb-api :: python_api/lldbutil/iter/TestLLDBIterator.py (1608 of 2472) PASS: lldb-unit :: Utility/./UtilityTests/UriParserTest.MinimalPortPath (1609 of 2472) PASS: lldb-unit :: DataFormatter/./LLDBFormatterTests/StringPrinterTests.CxxASCII (1610 of 2472) PASS: lldb-unit :: Platform/Android/./AdbClientTests/AdbClientTest.CreateByDeviceId_ByEnvVar (1611 of 2472) PASS: lldb-unit :: Host/./HostTests/FileSystemTest.Exists (1612 of 2472) PASS: lldb-unit :: Utility/./UtilityTests/StringListTest.DefaultConstructor (1613 of 2472) PASS: lldb-unit :: Utility/./UtilityTests/UriParserTest.BadPort (1614 of 2472) PASS: lldb-unit :: debugserver/./debugserverTests/RNBSocket.LoopBackListenIPv6 (1615 of 2472) PASS: lldb-unit :: Utility/./UtilityTests/RangeTest.ContainsEndInclusiveInvalid (1616 of 2472) PASS: lldb-api :: macosx/lc-note/kern-ver-str/TestKernVerStrLCNOTE.py (1617 of 2472) PASS: lldb-api :: functionalities/set-data/TestSetData.py (1618 of 2472) UNSUPPORTED: lldb-shell :: ScriptInterpreter/Lua/independent_state.test (1619 of 2472) PASS: lldb-api :: functionalities/load_after_attach/TestLoadAfterAttach.py (1620 of 2472) PASS: lldb-api :: lang/cpp/type_lookup/TestCppTypeLookup.py (1621 of 2472) PASS: lldb-api :: lang/objc/objc-foundation-dictionary-empty/TestNSDictionary0.py (1622 of 2472) PASS: lldb-unit :: Language/Highlighting/./HighlighterTests/HighlighterTest.ClangPreserveNewLine (1623 of 2472) PASS: lldb-unit :: Host/./HostTests/MainLoopTest.DetectsEOF (1624 of 2472) PASS: lldb-unit :: Utility/./UtilityTests/SerializationRountripTest.SerializeDeserializeCString (1625 of 2472) PASS: lldb-api :: commands/gui/expand-threads-tree/TestGuiExpandThreadsTree.py (1626 of 2472) PASS: lldb-api :: test_utils/base/TestBaseTest.py (1627 of 2472) PASS: lldb-api :: functionalities/data-formatter/data-formatter-objc/TestDataFormatterObjCNSNumber.py (1628 of 2472) UNSUPPORTED: lldb-api :: macosx/corefile-exception-reason/TestCorefileExceptionReason.py (1629 of 2472) PASS: lldb-unit :: tools/lldb-server/tests/./LLDBServerTests/TestBase.LaunchModePreservesEnvironment (1630 of 2472) PASS: lldb-unit :: Host/./HostTests/SocketAddressTest.GetAddressInfo (1631 of 2472) PASS: lldb-unit :: Utility/./UtilityTests/BroadcasterTest.BroadcastEvent (1632 of 2472) PASS: lldb-unit :: Utility/./UtilityTests/StringListTest.ForRange (1633 of 2472) PASS: lldb-api :: python_api/value/empty_class/TestValueAPIEmptyClass.py (1634 of 2472) PASS: lldb-unit :: Utility/./UtilityTests/RecordReplayTest.ValidSequence (1635 of 2472) PASS: lldb-api :: functionalities/inferior-crashing/TestInferiorCrashingStep.py (1636 of 2472) PASS: lldb-unit :: Utility/./UtilityTests/LogChannelTest.List (1637 of 2472) PASS: lldb-unit :: Utility/./UtilityTests/GeneratorTest.Get (1638 of 2472) PASS: lldb-shell :: Process/UnsupportedLanguage.test (1639 of 2472) PASS: lldb-api :: types/TestLongTypesExpr.py (1640 of 2472) UNSUPPORTED: lldb-api :: lang/objc/modules-incomplete/TestIncompleteModules.py (1641 of 2472) PASS: lldb-api :: functionalities/data-formatter/data-formatter-enum-format/TestDataFormatterEnumFormat.py (1642 of 2472) PASS: lldb-unit :: Process/minidump/./LLDBMinidumpTests/MinidumpParserTest.GetLinuxProcStatus (1643 of 2472) UNSUPPORTED: lldb-api :: android/platform/TestDefaultCacheLineSize.py (1644 of 2472) PASS: lldb-shell :: SymbolFile/DWARF/x86/dwarf5-atomic.s (1645 of 2472) UNSUPPORTED: lldb-shell :: SymbolFile/DWARF/x86/debug-names-compressed.cpp (1646 of 2472) PASS: lldb-api :: tools/lldb-server/TestGdbRemoteAttach.py (1647 of 2472) PASS: lldb-api :: lang/objc/objc-runtime-ivars/TestRuntimeIvars.py (1648 of 2472) PASS: lldb-unit :: Utility/./UtilityTests/StreamTest.ShiftOperatorStrings (1649 of 2472) UNSUPPORTED: lldb-api :: functionalities/data-formatter/data-formatter-stl/libstdcpp/unique_ptr/TestDataFormatterStdUniquePtr.py (1650 of 2472) PASS: lldb-api :: lang/c/sizeof/TestCSizeof.py (1651 of 2472) PASS: lldb-unit :: Host/./HostTests/SocketTests/SocketTest.DomainGetConnectURI/ipv4 (1652 of 2472) PASS: lldb-api :: tools/lldb-server/commandline/TestGdbRemoteConnection.py (1653 of 2472) PASS: lldb-api :: functionalities/breakpoint/breakpoint_language/TestBreakpointLanguage.py (1654 of 2472) PASS: lldb-api :: python_api/frame/inlines/TestInlinedFrame.py (1655 of 2472) PASS: lldb-shell :: ObjectFile/PECOFF/sections.yaml (1656 of 2472) PASS: lldb-shell :: SymbolFile/DWARF/x86/debug_line-relative_path.s (1657 of 2472) PASS: lldb-shell :: Register/Core/x86-64-linux-gp.test (1658 of 2472) PASS: lldb-api :: lang/cpp/pointer_to_member_type_depending_on_parent_size/TestPointerToMemberTypeDependingOnParentSize.py (1659 of 2472) PASS: lldb-shell :: SymbolFile/DWARF/x86/dwp.s (1660 of 2472) PASS: lldb-unit :: Breakpoint/./LLDBBreakpointTests/BreakpointIDTest.StringIsBreakpointName (1661 of 2472) PASS: lldb-unit :: UnwindAssembly/x86/./UnwindAssemblyx86Tests/Testx86AssemblyInspectionEngine.TestSimplex86_64Augmented (1662 of 2472) UNSUPPORTED: lldb-api :: functionalities/data-formatter/data-formatter-stl/libstdcpp/iterator/TestDataFormatterStdIterator.py (1663 of 2472) PASS: lldb-unit :: Utility/./UtilityTests/StringListTest.Clear (1664 of 2472) PASS: lldb-api :: functionalities/data-formatter/data-formatter-stl/libcxx/vbool/TestDataFormatterLibcxxVBool.py (1665 of 2472) PASS: lldb-shell :: Reproducer/TestWorkingDir.test (1666 of 2472) PASS: lldb-unit :: Utility/./UtilityTests/FileSpecTest.OperatorBool (1667 of 2472) PASS: lldb-shell :: ObjectFile/ELF/base-address.yaml (1668 of 2472) PASS: lldb-unit :: ObjectFile/Breakpad/./ObjectFileBreakpadTests/InlineRecord.parse (1669 of 2472) UNSUPPORTED: lldb-api :: functionalities/asan/TestReportData.py (1670 of 2472) UNSUPPORTED: lldb-shell :: Unwind/unwind-plan-dwarf-dump.test (1671 of 2472) PASS: lldb-shell :: Register/Core/aarch64-freebsd-multithread.test (1672 of 2472) PASS: lldb-unit :: Utility/./UtilityTests/LogChannelEnabledTest.log_options (1673 of 2472) PASS: lldb-unit :: Utility/./UtilityTests/StreamTest.ShiftOperatorPtr (1674 of 2472) PASS: lldb-unit :: Utility/./UtilityTests/StringExtractorTest.DecodeHexU8_Extra (1675 of 2472) UNSUPPORTED: lldb-shell :: ScriptInterpreter/Lua/watchpoint_callback.test (1676 of 2472) PASS: lldb-unit :: Core/./LLDBCoreTests/ModuleSpecTest.TestMachOFile (1677 of 2472) PASS: lldb-api :: commands/target/create-deps/TestTargetCreateDeps.py (1678 of 2472) PASS: lldb-api :: commands/frame/diagnose/bad-reference/TestBadReference.py (1679 of 2472) PASS: lldb-unit :: API/./APITests/SBCommandInterpreterTest.SingleWordCommand (1680 of 2472) PASS: lldb-api :: functionalities/unwind/noreturn/TestNoreturnUnwind.py (1681 of 2472) PASS: lldb-shell :: Reproducer/TestDSYM.test (1682 of 2472) PASS: lldb-unit :: Utility/./UtilityTests/ConstStringTest.CompareStringRef (1683 of 2472) PASS: lldb-unit :: Utility/./UtilityTests/FileSpecTest.EqualSeparator (1684 of 2472) PASS: lldb-unit :: Platform/./LLDBPlatformTests/PlatformAppleSimulatorTest.TestSimHasSimEnvionament (1685 of 2472) PASS: lldb-unit :: Language/Highlighting/./HighlighterTests/HighlighterTest.Keywords (1686 of 2472) UNSUPPORTED: lldb-shell :: SymbolFile/DWARF/dwarf5-lazy-dwo.c (1687 of 2472) UNSUPPORTED: lldb-shell :: Subprocess/fork-follow-child-wp.test (1688 of 2472) PASS: lldb-unit :: Core/./LLDBCoreTests/RichManglingContextTest.SwitchProvider (1689 of 2472) PASS: lldb-unit :: Core/./LLDBCoreTests/SourceLocationSpecTest.FileLineColumnComponents (1690 of 2472) PASS: lldb-unit :: Interpreter/./InterpreterTests/CompletionTest.FileCompletionAbsolute (1691 of 2472) PASS: lldb-unit :: Utility/./UtilityTests/FileSpecTest.FileAndDirectoryComponents (1692 of 2472) PASS: lldb-unit :: ObjectFile/MachO/./ObjectFileMachOTests/ObjectFileMachOTest.ModuleFromSharedCacheInfo (1693 of 2472) PASS: lldb-unit :: Host/./HostTests/Host.GetEnvironment (1694 of 2472) PASS: lldb-unit :: ScriptInterpreter/Python/./ScriptInterpreterPythonTests/PythonDataObjectsTest.TestTypeNameResolutionNoDot (1695 of 2472) PASS: lldb-unit :: Utility/./UtilityTests/ProcessInstanceInfoMatch.Name (1696 of 2472) UNSUPPORTED: lldb-shell :: SymbolFile/NativePDB/load-pdb.cpp (1697 of 2472) PASS: lldb-unit :: Utility/./UtilityTests/StringListTest.CopyList (1698 of 2472) UNSUPPORTED: lldb-api :: functionalities/tail_call_frames/sbapi_support/TestTailCallFrameSBAPI.py (1699 of 2472) PASS: lldb-api :: commands/log/basic/TestLogging.py (1700 of 2472) PASS: lldb-api :: lang/objc/complete-type-check/TestObjCIsTypeComplete.py (1701 of 2472) UNSUPPORTED: lldb-api :: functionalities/thread/concurrent_events/TestConcurrentManyWatchpoints.py (1702 of 2472) PASS: lldb-unit :: UnwindAssembly/x86/./UnwindAssemblyx86Tests/Testx86AssemblyInspectionEngine.TestMovRSPtoRBP (1703 of 2472) PASS: lldb-api :: functionalities/breakpoint/breakpoint_command/TestBreakpointCommandsFromPython.py (1704 of 2472) UNSUPPORTED: lldb-api :: commands/expression/import-std-module/pair/TestPairFromStdModule.py (1705 of 2472) UNSUPPORTED: lldb-api :: python_api/watchpoint/TestWatchpointIgnoreCount.py (1706 of 2472) PASS: lldb-api :: commands/expression/class_template_specialization_empty_pack/TestClassTemplateSpecializationParametersHandling.py (1707 of 2472) PASS: lldb-unit :: Expression/./ExpressionTests/DiagnosticManagerTest.HasFixits (1708 of 2472) PASS: lldb-api :: lang/c/const_variables/TestConstVariables.py (1709 of 2472) UNSUPPORTED: lldb-shell :: Subprocess/fork-follow-child.test (1710 of 2472) PASS: lldb-unit :: Expression/./ExpressionTests/CppModuleConfigurationTest.Sysroot (1711 of 2472) PASS: lldb-api :: functionalities/breakpoint/breakpoint_conditions/TestBreakpointConditions.py (1712 of 2472) PASS: lldb-unit :: Symbol/./SymbolTests/TestTypeSystemClang.TestGetTypeClassNested (1713 of 2472) PASS: lldb-unit :: ScriptInterpreter/Python/./ScriptInterpreterPythonTests/PythonDataObjectsTest.TestPythonListManipulation (1714 of 2472) PASS: lldb-api :: commands/process/attach/attach_denied/TestAttachDenied.py (1715 of 2472) PASS: lldb-unit :: DataFormatter/./LLDBFormatterTests/StringPrinterTests.CxxUTF8 (1716 of 2472) PASS: lldb-api :: commands/expression/call-throws/TestCallThatThrows.py (1717 of 2472) UNSUPPORTED: lldb-api :: commands/expression/namespace_local_var_same_name_cpp_and_c/TestNamespaceLocalVarSameNameCppAndC.py (1718 of 2472) PASS: lldb-api :: functionalities/data-formatter/data-formatter-stl/libcxx/variant/TestDataFormatterLibcxxVariant.py (1719 of 2472) PASS: lldb-unit :: Utility/./UtilityTests/ArgsTest.ReplaceArgumentAtIndexLonger (1720 of 2472) PASS: lldb-api :: tools/lldb-server/TestGdbRemoteRegisterState.py (1721 of 2472) PASS: lldb-unit :: Utility/./UtilityTests/ArgsTest.TestQuotedUnknownEscape (1722 of 2472) PASS: lldb-unit :: Utility/./UtilityTests/NameMatchesTest.Equals (1723 of 2472) PASS: lldb-api :: iohandler/unicode/TestUnicode.py (1724 of 2472) PASS: lldb-shell :: Register/Core/x86-64-linux-fp.test (1725 of 2472) UNSUPPORTED: lldb-api :: commands/watchpoints/multiple_hits/TestMultipleHits.py (1726 of 2472) PASS: lldb-api :: commands/expression/test/TestExprs2.py (1727 of 2472) PASS: lldb-unit :: DataFormatter/./LLDBFormatterTests/TypeMatcherTests.CreatedBySameMatchString (1728 of 2472) PASS: lldb-api :: lang/cpp/class-loading-via-member-typedef/TestClassLoadingViaMemberTypedef.py (1729 of 2472) PASS: lldb-api :: functionalities/unused-inlined-parameters/TestUnusedInlinedParameters.py (1730 of 2472) PASS: lldb-unit :: Utility/./UtilityTests/ListenerTest.GetEventImmediate (1731 of 2472) PASS: lldb-api :: functionalities/type_lookup/TestTypeLookup.py (1732 of 2472) UNSUPPORTED: lldb-shell :: SymbolFile/DWARF/debug-types-expressions.test (1733 of 2472) PASS: lldb-api :: types/TestShortType.py (1734 of 2472) UNSUPPORTED: lldb-api :: functionalities/tail_call_frames/unambiguous_sequence/TestUnambiguousTailCalls.py (1735 of 2472) PASS: lldb-unit :: UnwindAssembly/x86/./UnwindAssemblyx86Tests/Testx86AssemblyInspectionEngine.TestDisassemblyJunkBytes (1736 of 2472) UNSUPPORTED: lldb-api :: functionalities/ptrauth_diagnostics/brkC47x_code/TestPtrauthBRKc47xDiagnostic.py (1737 of 2472) PASS: lldb-api :: commands/expression/persistent_types/TestPersistentTypes.py (1738 of 2472) PASS: lldb-shell :: Breakpoint/split-dwarf-5-addrbase.test (1739 of 2472) PASS: lldb-unit :: Utility/./UtilityTests/LogTest.Unregister (1740 of 2472) PASS: lldb-shell :: ObjectFile/wasm/basic.yaml (1741 of 2472) PASS: lldb-unit :: Utility/./UtilityTests/GeneratorTest.Create (1742 of 2472) FAIL: lldb-api :: lang/objc/modules-compile-error/TestModulesCompileError.py (1743 of 2472) ******************** TEST 'lldb-api :: lang/objc/modules-compile-error/TestModulesCompileError.py' FAILED ******************** Script: -- /usr/local/Frameworks/Python.framework/Versions/3.7/bin/python3.7 /Users/buildslave/jenkins/workspace/lldb-cmake-matrix/llvm-project/lldb/test/API/dotest.py -u CXXFLAGS -u CFLAGS --codesign-identity lldb_codesign --arch x86_64 --build-dir /Users/buildslave/jenkins/workspace/lldb-cmake-matrix/lldb-build/lldb-test-build.noindex -t --env TERM=vt100 --skip-category gmodules --skip-category watchpoint --arch=x86_64 --env LLVM_LIBS_DIR=/Users/buildslave/jenkins/workspace/lldb-cmake-matrix/lldb-build/./lib --arch x86_64 --build-dir /Users/buildslave/jenkins/workspace/lldb-cmake-matrix/lldb-build/lldb-test-build.noindex --lldb-module-cache-dir /Users/buildslave/jenkins/workspace/lldb-cmake-matrix/lldb-build/lldb-test-build.noindex/module-cache-lldb/lldb-api --clang-module-cache-dir /Users/buildslave/jenkins/workspace/lldb-cmake-matrix/lldb-build/lldb-test-build.noindex/module-cache-clang/lldb-api --executable /Users/buildslave/jenkins/workspace/lldb-cmake-matrix/lldb-build/./bin/lldb --compiler /Users/buildslave/jenkins/workspace/lldb-cmake-matrix/clang_900_build/bin/clang --dsymutil /Users/buildslave/jenkins/workspace/lldb-cmake-matrix/lldb-build/./bin/dsymutil --llvm-tools-dir /Users/buildslave/jenkins/workspace/lldb-cmake-matrix/lldb-build/./bin --lldb-libs-dir /Users/buildslave/jenkins/workspace/lldb-cmake-matrix/lldb-build/./lib /Users/buildslave/jenkins/workspace/lldb-cmake-matrix/llvm-project/lldb/test/API/lang/objc/modules-compile-error -p TestModulesCompileError.py -- Exit Code: 1

Hide Details

Command Output (stdout): -- lldb version 14.0.99 (http://labmaster3.local/git/llvm-project.git revision f86b57e37cc69d84a71500e27c294b3dca222f70) clang revision f86b57e37cc69d84a71500e27c294b3dca222f70 llvm revision f86b57e37cc69d84a71500e27c294b3dca222f70 Skipping the following test categories: ['gmodules', 'watchpoint', 'libstdcxx', 'dwo', 'llgs', 'fork']

Hide Details

-- Command Output (stderr): -- Change dir to: /Users/buildslave/jenkins/workspace/lldb-cmake-matrix/llvm-project/lldb/test/API/lang/objc/modules-compile-error runCmd: settings clear -all output:

Hide Details

runCmd: settings set symbols.enable-external-lookup false output:

Hide Details

runCmd: settings set target.inherit-tcc true output:

Hide Details

runCmd: settings set target.detach-on-error false output:

Hide Details

runCmd: settings set target.auto-apply-fixits false output:

Hide Details

runCmd: settings set plugin.process.gdb-remote.packet-timeout 60 output:

Hide Details

runCmd: settings set symbols.clang-modules-cache-path "/Users/buildslave/jenkins/workspace/lldb-cmake-matrix/lldb-build/lldb-test-build.noindex/module-cache-lldb/lldb-api" output:

Hide Details

runCmd: settings set use-color false output:

Hide Details

runCmd: setting set target.prefer-dynamic-value no-dynamic-values output:

Hide Details

make VPATH=/Users/buildslave/jenkins/workspace/lldb-cmake-matrix/llvm-project/lldb/test/API/lang/objc/modules-compile-error -C /Users/buildslave/jenkins/workspace/lldb-cmake-matrix/lldb-build/lldb-test-build.noindex/lang/objc/modules-compile-error/TestModulesCompileError.test_dsym -I /Users/buildslave/jenkins/workspace/lldb-cmake-matrix/llvm-project/lldb/test/API/lang/objc/modules-compile-error -I /Users/buildslave/jenkins/workspace/lldb-cmake-matrix/llvm-project/lldb/packages/Python/lldbsuite/test/make -f /Users/buildslave/jenkins/workspace/lldb-cmake-matrix/llvm-project/lldb/test/API/lang/objc/modules-compile-error/Makefile MAKE_DSYM=YES all ARCH=x86_64 'CC="/Users/buildslave/jenkins/workspace/lldb-cmake-matrix/clang_900_build/bin/clang"' DSYMUTIL=/Users/buildslave/jenkins/workspace/lldb-cmake-matrix/lldb-build/./bin/dsymutil CODESIGN=codesign CLANG_MODULE_CACHE_DIR=/Users/buildslave/jenkins/workspace/lldb-cmake-matrix/lldb-build/lldb-test-build.noindex/module-cache-clang/lldb-api

Hide Details

"/Users/buildslave/jenkins/workspace/lldb-cmake-matrix/clang_900_build/bin/clang" -g -O0 -fno-builtin -isysroot "/Applications/Xcode.app/Contents/Developer/Platforms/MacOSX.platform/Developer/SDKs/MacOSX10.15.sdk" -arch x86_64 -I/Users/buildslave/jenkins/workspace/lldb-cmake-matrix/llvm-project/lldb/packages/Python/lldbsuite/test/make/../../../../../include -I/Users/buildslave/jenkins/workspace/lldb-cmake-matrix/llvm-project/lldb/test/API/lang/objc/modules-compile-error -I/Users/buildslave/jenkins/workspace/lldb-cmake-matrix/llvm-project/lldb/packages/Python/lldbsuite/test/make -include /Users/buildslave/jenkins/workspace/lldb-cmake-matrix/llvm-project/lldb/packages/Python/lldbsuite/test/make/test_common.h -fno-limit-debug-info -fmodules -gmodules -fmodules-cache-path=/Users/buildslave/jenkins/workspace/lldb-cmake-matrix/lldb-build/lldb-test-build.noindex/module-cache-clang/lldb-api -gmodules -fcxx-modules -I/Users/buildslave/jenkins/workspace/lldb-cmake-matrix/lldb-build/lldb-test-build.noindex/lang/objc/modules-compile-error/TestModulesCompileError.test_dsym -DONLY_CLANG=1 -MT main.o -MD -MP -MF main.d -c -o main.o /Users/buildslave/jenkins/workspace/lldb-cmake-matrix/llvm-project/lldb/test/API/lang/objc/modules-compile-error/main.m "/Users/buildslave/jenkins/workspace/lldb-cmake-matrix/clang_900_build/bin/clang" main.o -g -O0 -fno-builtin -isysroot "/Applications/Xcode.app/Contents/Developer/Platforms/MacOSX.platform/Developer/SDKs/MacOSX10.15.sdk" -arch x86_64 -I/Users/buildslave/jenkins/workspace/lldb-cmake-matrix/llvm-project/lldb/packages/Python/lldbsuite/test/make/../../../../../include -I/Users/buildslave/jenkins/workspace/lldb-cmake-matrix/llvm-project/lldb/test/API/lang/objc/modules-compile-error -I/Users/buildslave/jenkins/workspace/lldb-cmake-matrix/llvm-project/lldb/packages/Python/lldbsuite/test/make -include /Users/buildslave/jenkins/workspace/lldb-cmake-matrix/llvm-project/lldb/packages/Python/lldbsuite/test/make/test_common.h -fno-limit-debug-info -fmodules -gmodules -fmodules-cache-path=/Users/buildslave/jenkins/workspace/lldb-cmake-matrix/lldb-build/lldb-test-build.noindex/module-cache-clang/lldb-api -gmodules -fcxx-modules -I/Users/buildslave/jenkins/workspace/lldb-cmake-matrix/lldb-build/lldb-test-build.noindex/lang/objc/modules-compile-error/TestModulesCompileError.test_dsym -DONLY_CLANG=1 -lobjc --driver-mode=g++ -o "a.out" codesign -s - "a.out" "/Users/buildslave/jenkins/workspace/lldb-cmake-matrix/lldb-build/./bin/dsymutil" -o "a.out.dSYM" "a.out"

Hide Details

Hide Details

runCmd: expr @import LLDBTestModule check of return status not required runCmd failed! error: expression failed to parse: error: Header search couldn't locate module LLDBTestModule

Hide Details

error: while importing modules: error: Header search couldn't locate module LLDBTestModule

Hide Details

Hide Details

Hide Details

Ran command: "expr @import LLDBTestModule"

Hide Details

Got output: error: expression failed to parse: error: Header search couldn't locate module LLDBTestModule

Hide Details

error: while importing modules: error: Header search couldn't locate module LLDBTestModule

Hide Details

Hide Details

Expecting sub string: "module.h:4:1: error: unknown type name 'syntax_error_for_lldb_to_find'" (was not found)

Hide Details

FAIL: LLDB (/Users/buildslave/jenkins/workspace/lldb-cmake-matrix/clang_900_build/bin/clang-x86_64) :: test_dsym (TestModulesCompileError.TestCase) <bound method SBProcess.Kill of <lldb.SBProcess; proxy of <Swig Object of type 'lldb::SBProcess *' at 0x10e3977e0> >>: success

Hide Details

runCmd: settings clear -all output:

Hide Details

runCmd: settings set symbols.enable-external-lookup false output:

Hide Details

runCmd: settings set target.inherit-tcc true output:

Hide Details

runCmd: settings set target.detach-on-error false output:

Hide Details

runCmd: settings set target.auto-apply-fixits false output:

Hide Details

runCmd: settings set plugin.process.gdb-remote.packet-timeout 60 output:

Hide Details

runCmd: settings set symbols.clang-modules-cache-path "/Users/buildslave/jenkins/workspace/lldb-cmake-matrix/lldb-build/lldb-test-build.noindex/module-cache-lldb/lldb-api" output:

Hide Details

runCmd: settings set use-color false output:

Hide Details

runCmd: setting set target.prefer-dynamic-value no-dynamic-values output:

Hide Details

make VPATH=/Users/buildslave/jenkins/workspace/lldb-cmake-matrix/llvm-project/lldb/test/API/lang/objc/modules-compile-error -C /Users/buildslave/jenkins/workspace/lldb-cmake-matrix/lldb-build/lldb-test-build.noindex/lang/objc/modules-compile-error/TestModulesCompileError.test_dwarf -I /Users/buildslave/jenkins/workspace/lldb-cmake-matrix/llvm-project/lldb/test/API/lang/objc/modules-compile-error -I /Users/buildslave/jenkins/workspace/lldb-cmake-matrix/llvm-project/lldb/packages/Python/lldbsuite/test/make -f /Users/buildslave/jenkins/workspace/lldb-cmake-matrix/llvm-project/lldb/test/API/lang/objc/modules-compile-error/Makefile MAKE_DSYM=NO all ARCH=x86_64 'CC="/Users/buildslave/jenkins/workspace/lldb-cmake-matrix/clang_900_build/bin/clang"' DSYMUTIL=/Users/buildslave/jenkins/workspace/lldb-cmake-matrix/lldb-build/./bin/dsymutil CODESIGN=codesign CLANG_MODULE_CACHE_DIR=/Users/buildslave/jenkins/workspace/lldb-cmake-matrix/lldb-build/lldb-test-build.noindex/module-cache-clang/lldb-api

Hide Details

"/Users/buildslave/jenkins/workspace/lldb-cmake-matrix/clang_900_build/bin/clang" -g -O0 -fno-builtin -isysroot "/Applications/Xcode.app/Contents/Developer/Platforms/MacOSX.platform/Developer/SDKs/MacOSX10.15.sdk" -arch x86_64 -I/Users/buildslave/jenkins/workspace/lldb-cmake-matrix/llvm-project/lldb/packages/Python/lldbsuite/test/make/../../../../../include -I/Users/buildslave/jenkins/workspace/lldb-cmake-matrix/llvm-project/lldb/test/API/lang/objc/modules-compile-error -I/Users/buildslave/jenkins/workspace/lldb-cmake-matrix/llvm-project/lldb/packages/Python/lldbsuite/test/make -include /Users/buildslave/jenkins/workspace/lldb-cmake-matrix/llvm-project/lldb/packages/Python/lldbsuite/test/make/test_common.h -fno-limit-debug-info -fmodules -gmodules -fmodules-cache-path=/Users/buildslave/jenkins/workspace/lldb-cmake-matrix/lldb-build/lldb-test-build.noindex/module-cache-clang/lldb-api -gmodules -fcxx-modules -I/Users/buildslave/jenkins/workspace/lldb-cmake-matrix/lldb-build/lldb-test-build.noindex/lang/objc/modules-compile-error/TestModulesCompileError.test_dwarf -DONLY_CLANG=1 -MT main.o -MD -MP -MF main.d -c -o main.o /Users/buildslave/jenkins/workspace/lldb-cmake-matrix/llvm-project/lldb/test/API/lang/objc/modules-compile-error/main.m "/Users/buildslave/jenkins/workspace/lldb-cmake-matrix/clang_900_build/bin/clang" main.o -g -O0 -fno-builtin -isysroot "/Applications/Xcode.app/Contents/Developer/Platforms/MacOSX.platform/Developer/SDKs/MacOSX10.15.sdk" -arch x86_64 -I/Users/buildslave/jenkins/workspace/lldb-cmake-matrix/llvm-project/lldb/packages/Python/lldbsuite/test/make/../../../../../include -I/Users/buildslave/jenkins/workspace/lldb-cmake-matrix/llvm-project/lldb/test/API/lang/objc/modules-compile-error -I/Users/buildslave/jenkins/workspace/lldb-cmake-matrix/llvm-project/lldb/packages/Python/lldbsuite/test/make -include /Users/buildslave/jenkins/workspace/lldb-cmake-matrix/llvm-project/lldb/packages/Python/lldbsuite/test/make/test_common.h -fno-limit-debug-info -fmodules -gmodules -fmodules-cache-path=/Users/buildslave/jenkins/workspace/lldb-cmake-matrix/lldb-build/lldb-test-build.noindex/module-cache-clang/lldb-api -gmodules -fcxx-modules -I/Users/buildslave/jenkins/workspace/lldb-cmake-matrix/lldb-build/lldb-test-build.noindex/lang/objc/modules-compile-error/TestModulesCompileError.test_dwarf -DONLY_CLANG=1 -lobjc --driver-mode=g++ -o "a.out" codesign -s - "a.out"

Hide Details

Hide Details

runCmd: expr @import LLDBTestModule check of return status not required runCmd failed! error: expression failed to parse: error: Header search couldn't locate module LLDBTestModule

Hide Details

error: while importing modules: error: Header search couldn't locate module LLDBTestModule

Hide Details

Hide Details

Hide Details

Ran command: "expr @import LLDBTestModule"

Hide Details

Got output: error: expression failed to parse: error: Header search couldn't locate module LLDBTestModule

Hide Details

error: while importing modules: error: Header search couldn't locate module LLDBTestModule

Hide Details

Hide Details

Expecting sub string: "module.h:4:1: error: unknown type name 'syntax_error_for_lldb_to_find'" (was not found)

Hide Details

FAIL: LLDB (/Users/buildslave/jenkins/workspace/lldb-cmake-matrix/clang_900_build/bin/clang-x86_64) :: test_dwarf (TestModulesCompileError.TestCase) <bound method SBProcess.Kill of <lldb.SBProcess; proxy of <Swig Object of type 'lldb::SBProcess *' at 0x10dc31c30> >>: success

Hide Details

UNSUPPORTED: LLDB (/Users/buildslave/jenkins/workspace/lldb-cmake-matrix/clang_900_build/bin/clang-x86_64) :: test_dwo (TestModulesCompileError.TestCase) (test case does not fall in any category of interest for this run) UNSUPPORTED: LLDB (/Users/buildslave/jenkins/workspace/lldb-cmake-matrix/clang_900_build/bin/clang-x86_64) :: test_gmodules (TestModulesCompileError.TestCase) (test case does not fall in any category of interest for this run) Restore dir to: /Users/buildslave/jenkins/workspace/lldb-cmake-matrix/lldb-build/tools/lldb/test ====================================================================== FAIL: test_dsym (TestModulesCompileError.TestCase) ---------------------------------------------------------------------- Traceback (most recent call last): File "/Users/buildslave/jenkins/workspace/lldb-cmake-matrix/llvm-project/lldb/packages/Python/lldbsuite/test/lldbtest.py", line 1715, in test_method return attrvalue(self) File "/Users/buildslave/jenkins/workspace/lldb-cmake-matrix/llvm-project/lldb/test/API/lang/objc/modules-compile-error/TestModulesCompileError.py", line 22, in test "could not build module 'LLDBTestModule'"]) File "/Users/buildslave/jenkins/workspace/lldb-cmake-matrix/llvm-project/lldb/packages/Python/lldbsuite/test/lldbtest.py", line 2434, in expect self.fail(log_msg) AssertionError: Ran command: "expr @import LLDBTestModule"

Hide Details

Got output: error: expression failed to parse: error: Header search couldn't locate module LLDBTestModule

Hide Details

error: while importing modules: error: Header search couldn't locate module LLDBTestModule

Hide Details

Hide Details

Expecting sub string: "module.h:4:1: error: unknown type name 'syntax_error_for_lldb_to_find'" (was not found) Config=x86_64-/Users/buildslave/jenkins/workspace/lldb-cmake-matrix/clang_900_build/bin/clang ====================================================================== FAIL: test_dwarf (TestModulesCompileError.TestCase) ---------------------------------------------------------------------- Traceback (most recent call last): File "/Users/buildslave/jenkins/workspace/lldb-cmake-matrix/llvm-project/lldb/packages/Python/lldbsuite/test/lldbtest.py", line 1715, in test_method return attrvalue(self) File "/Users/buildslave/jenkins/workspace/lldb-cmake-matrix/llvm-project/lldb/test/API/lang/objc/modules-compile-error/TestModulesCompileError.py", line 22, in test "could not build module 'LLDBTestModule'"]) File "/Users/buildslave/jenkins/workspace/lldb-cmake-matrix/llvm-project/lldb/packages/Python/lldbsuite/test/lldbtest.py", line 2434, in expect self.fail(log_msg) AssertionError: Ran command: "expr @import LLDBTestModule"

Hide Details

Got output: error: expression failed to parse: error: Header search couldn't locate module LLDBTestModule

Hide Details

error: while importing modules: error: Header search couldn't locate module LLDBTestModule

Hide Details

Hide Details

Expecting sub string: "module.h:4:1: error: unknown type name 'syntax_error_for_lldb_to_find'" (was not found) Config=x86_64-/Users/buildslave/jenkins/workspace/lldb-cmake-matrix/clang_900_build/bin/clang ---------------------------------------------------------------------- Ran 4 tests in 2.638s

Hide Details

RESULT: FAILED (0 passes, 2 failures, 0 errors, 2 skipped, 0 expected failures, 0 unexpected successes)

Hide Details

--

Hide Details

******************** UNSUPPORTED: lldb-shell :: SymbolFile/PDB/variables-locations.test (1744 of 2472) UNSUPPORTED: lldb-api :: lang/objc/objc-dynamic-value/TestObjCDynamicValue.py (1745 of 2472) PASS: lldb-unit :: Language/Highlighting/./HighlighterTests/HighlighterTest.ClangTrailingBackslashWithWhitespace (1746 of 2472) PASS: lldb-unit :: Utility/./UtilityTests/XcodeSDKTest.FindXcodeContentsDirectoryInPath (1747 of 2472) UNSUPPORTED: lldb-shell :: Unwind/eh-frame-small-fde.test (1748 of 2472) PASS: lldb-unit :: Utility/./UtilityTests/SubsystemRAIITest.NormalSubsystem (1749 of 2472) PASS: lldb-unit :: UnwindAssembly/x86/./UnwindAssemblyx86Tests/Testx86AssemblyInspectionEngine.TestStackRealign32BitDisp_x86_64 (1750 of 2472) PASS: lldb-api :: python_api/lldbutil/process/TestPrintStackTraces.py (1751 of 2472) PASS: lldb-api :: commands/expression/import-std-module/shared_ptr/TestSharedPtrFromStdModule.py (1752 of 2472) PASS: lldb-api :: functionalities/inferior-assert/TestInferiorAssert.py (1753 of 2472) PASS: lldb-unit :: Host/./HostTests/FileSystemTest.FileAndDirectoryComponents (1754 of 2472) PASS: lldb-shell :: Register/Core/x86-32-linux-gp.test (1755 of 2472) PASS: lldb-api :: functionalities/thread/num_threads/TestNumThreads.py (1756 of 2472) PASS: lldb-unit :: Symbol/./SymbolTests/LineEntryTest.GetAllExactLineColumnMatches (1757 of 2472) PASS: lldb-api :: lang/cpp/class_static/TestStaticVariables.py (1758 of 2472) UNSUPPORTED: lldb-api :: functionalities/data-formatter/data-formatter-stl/libstdcpp/vbool/TestDataFormatterStdVBool.py (1759 of 2472) PASS: lldb-api :: functionalities/pre_run_dylibs/TestPreRunDylibs.py (1760 of 2472) PASS: lldb-shell :: SymbolFile/DWARF/x86/DW_TAG_basic_type_DW_ATE_UTF_nonC.ll (1761 of 2472) PASS: lldb-shell :: SymbolFile/DWARF/clang-ast-from-dwarf-unamed-and-anon-structs.cpp (1762 of 2472) PASS: lldb-unit :: Host/./HostTests/SocketTests/SocketTest.DecodeHostAndPort/ipv6 (1763 of 2472) PASS: lldb-api :: lang/objc/modules-non-objc-target/TestObjCModulesNonObjCTarget.py (1764 of 2472) PASS: lldb-unit :: Utility/./UtilityTests/ArgsTest.TestAppendArg (1765 of 2472) PASS: lldb-api :: functionalities/data-formatter/data-formatter-script/TestDataFormatterScript.py (1766 of 2472) PASS: lldb-unit :: Symbol/./SymbolTests/TestClangASTImporter.MetadataPropagation (1767 of 2472) UNSUPPORTED: lldb-shell :: SymbolFile/PDB/ast-restore.test (1768 of 2472) PASS: lldb-api :: functionalities/data-formatter/data-formatter-objc/TestDataFormatterObjCNSError.py (1769 of 2472) PASS: lldb-unit :: UnwindAssembly/x86/./UnwindAssemblyx86Tests/Testx86AssemblyInspectionEngine.TestSimple64bitFrameFunction (1770 of 2472) PASS: lldb-api :: tools/lldb-server/TestGdbRemote_vCont.py (1771 of 2472) PASS: lldb-shell :: Settings/TestFrameFormatMangling.test (1772 of 2472) UNSUPPORTED: lldb-shell :: SymbolFile/DWARF/x86/find-basic-type.cpp (1773 of 2472) PASS: lldb-api :: functionalities/postmortem/wow64_minidump/TestWow64MiniDump.py (1774 of 2472) PASS: lldb-shell :: ObjectFile/PECOFF/basic-info-arm.yaml (1775 of 2472) PASS: lldb-unit :: Process/Utility/./ProcessUtilityTests/ProcMapTests/LinuxProcMapsTestFixture.ParseMapRegions/6 (1776 of 2472) PASS: lldb-unit :: Signals/./SignalsTests/UnixSignalsTest.GetFilteredSignals (1777 of 2472) PASS: lldb-api :: test_utils/TestInlineTest.py (1778 of 2472) PASS: lldb-unit :: Utility/./UtilityTests/StringExtractorTest.DecodeHexU8_InvalidHex2 (1779 of 2472) PASS: lldb-api :: lang/cpp/namespace/TestNamespace.py (1780 of 2472) PASS: lldb-api :: lang/objcxx/cpp_keywords_enabled/TestObjCppKeywordsEnabled.py (1781 of 2472) PASS: lldb-unit :: Utility/./UtilityTests/StreamTest.AddressPrefix (1782 of 2472) PASS: lldb-api :: lang/cpp/extern_c/TestExternCSymbols.py (1783 of 2472) PASS: lldb-api :: functionalities/plugins/command_plugin/TestPluginCommands.py (1784 of 2472) PASS: lldb-shell :: Breakpoint/debug_rnglist_basic.test (1785 of 2472) PASS: lldb-unit :: Process/gdb-remote/./ProcessGdbRemoteTests/PortMapTest.FreePortForProcess (1786 of 2472) PASS: lldb-unit :: Utility/./UtilityTests/StreamTest.AddressRangeInvalidRange (1787 of 2472) PASS: lldb-shell :: Expr/TestMultilineExpr.test (1788 of 2472) PASS: lldb-api :: functionalities/data-formatter/poarray/TestPrintObjectArray.py (1789 of 2472) PASS: lldb-api :: python_api/sbplatform/TestSBPlatform.py (1790 of 2472) PASS: lldb-unit :: Utility/./UtilityTests/StatusTest.ErrorConstructor (1791 of 2472) PASS: lldb-unit :: Symbol/./SymbolTests/TestClangASTImporter.RecordLayout (1792 of 2472) PASS: lldb-api :: lang/cpp/inlines/TestInlines.py (1793 of 2472) PASS: lldb-unit :: Symbol/./SymbolTests/TestClangASTImporter.CopyTypeTagDecl (1794 of 2472) UNSUPPORTED: lldb-shell :: SymbolFile/DWARF/x86/DW_TAG_GNU_call_site-DW_AT_low_pc.s (1795 of 2472) PASS: lldb-api :: commands/platform/basic/TestPlatformCommand.py (1796 of 2472) UNSUPPORTED: lldb-shell :: SymbolFile/DWARF/x86/dir-separator-no-comp-dir.s (1797 of 2472) PASS: lldb-shell :: Breakpoint/debug_rnglist_rlestartend.test (1798 of 2472) PASS: lldb-unit :: UnwindAssembly/x86/./UnwindAssemblyx86Tests/Testx86AssemblyInspectionEngine.TestLEAVE (1799 of 2472) PASS: lldb-unit :: Process/gdb-remote/./ProcessGdbRemoteTests/GDBRemoteCommunicationClientTest.SyncThreadState (1800 of 2472) PASS: lldb-unit :: Utility/./UtilityTests/OptionsWithRawTest.SingleWordSuffix (1801 of 2472) PASS: lldb-shell :: Reproducer/TestMultipleTargets.test (1802 of 2472) PASS: lldb-unit :: Core/./LLDBCoreTests/MangledTest.ResultForValidName (1803 of 2472) PASS: lldb-api :: tools/lldb-server/TestGdbRemoteKill.py (1804 of 2472) PASS: lldb-shell :: VSCode/TestOptions.test (1805 of 2472) PASS: lldb-unit :: Utility/./UtilityTests/BinaryStreamTest.PutSLEB128MaxValue (1806 of 2472) PASS: lldb-api :: lang/c/stepping/TestThreadStepInAvoidRegexp.py (1807 of 2472) PASS: lldb-unit :: Utility/./UtilityTests/UriParserTest.BracketedHostnameWithPortIPv6 (1808 of 2472) PASS: lldb-shell :: SymbolFile/DWARF/x86/debug_loc-aslr.s (1809 of 2472) PASS: lldb-unit :: Utility/./UtilityTests/StreamTest.PutHex64ByteOrderBig (1810 of 2472) PASS: lldb-unit :: SymbolFile/DWARF/./SymbolFileDWARFTests/SymbolFileDWARFTests.ParseArangesNonzeroSegmentSize (1811 of 2472) PASS: lldb-unit :: SymbolFile/DWARF/./SymbolFileDWARFTests/DWARFDIETest.ChildIteration (1812 of 2472) PASS: lldb-api :: functionalities/data-formatter/data-formatter-stl/libcxx/initializerlist/TestInitializerList.py (1813 of 2472) PASS: lldb-api :: commands/frame/diagnose/virtual-method-call/TestDiagnoseDereferenceVirtualMethodCall.py (1814 of 2472) PASS: lldb-api :: python_api/module_section/TestModuleAndSection.py (1815 of 2472) PASS: lldb-shell :: Settings/TestSettingsWrite.test (1816 of 2472) PASS: lldb-api :: lang/cpp/thread_local/TestThreadLocal.py (1817 of 2472) PASS: lldb-unit :: Host/./HostTests/NativeProcessProtocolTest.SetBreakpointFailWrite (1818 of 2472) UNSUPPORTED: lldb-shell :: SymbolFile/PDB/type-quals.test (1819 of 2472) PASS: lldb-unit :: ObjectFile/ELF/./ObjectFileELFTests/ObjectFileELFTest.SectionsResolveConsistently (1820 of 2472) PASS: lldb-unit :: Utility/./UtilityTests/RangeDataVector.FindEntryIndexesThatContain_Overlap (1821 of 2472) UNSUPPORTED: lldb-api :: benchmarks/expression/TestExpressionCmd.py (1822 of 2472) PASS: lldb-api :: python_api/lldbutil/iter/TestRegistersIterator.py (1823 of 2472) PASS: lldb-unit :: Utility/./UtilityTests/ArgsTest.EscapeLLDBCommandArgument (1824 of 2472) PASS: lldb-api :: commands/expression/save_jit_objects/TestSaveJITObjects.py (1825 of 2472) PASS: lldb-api :: functionalities/breakpoint/source_regexp/TestSourceRegexBreakpoints.py (1826 of 2472) UNSUPPORTED: lldb-api :: functionalities/ptrauth_diagnostics/BRAA_error/TestPtrauthBRAADiagnostic.py (1827 of 2472) PASS: lldb-unit :: Utility/./UtilityTests/StreamTeeTest.Constructor1Stream (1828 of 2472) PASS: lldb-api :: sanity/TestSettingSkipping.py (1829 of 2472) UNSUPPORTED: lldb-api :: python_api/watchpoint/TestSetWatchpoint.py (1830 of 2472) PASS: lldb-api :: lang/c/vla/TestVLA.py (1831 of 2472) PASS: lldb-unit :: SymbolFile/NativePDB/./SymbolFileNativePDBTests/PDBFPOProgramToDWARFExpressionTests.MultipleIndependentAssignments (1832 of 2472) PASS: lldb-api :: macosx/find-app-in-bundle/TestFindAppInBundle.py (1833 of 2472) PASS: lldb-unit :: Host/./HostTests/MainLoopTest.ReadObject (1834 of 2472) PASS: lldb-unit :: Host/./HostTests/NativeProcessProtocolTest.SetBreakpointFailVerify (1835 of 2472) UNSUPPORTED: lldb-api :: commands/watchpoints/watchpoint_events/TestWatchpointEvents.py (1836 of 2472) PASS: lldb-shell :: ObjectFile/ELF/aarch64-relocations.yaml (1837 of 2472) PASS: lldb-api :: commands/target/create-no-such-arch/TestNoSuchArch.py (1838 of 2472) PASS: lldb-api :: python_api/process/io/TestProcessIO.py (1839 of 2472) PASS: lldb-unit :: Utility/./UtilityTests/VASprintfTest.NoBufferResize (1840 of 2472) PASS: lldb-api :: lang/objc/objc-stepping/TestObjCStepping.py (1841 of 2472) PASS: lldb-api :: macosx/profile_vrs_detach/TestDetachVrsProfile.py (1842 of 2472) PASS: lldb-api :: functionalities/optimized_code/TestNoASanExceptionAfterEvalOP_piece.py (1843 of 2472) PASS: lldb-api :: functionalities/breakpoint/address_breakpoints/TestBadAddressBreakpoints.py (1844 of 2472) UNSUPPORTED: lldb-shell :: Subprocess/clone-follow-parent-wp.test (1845 of 2472) PASS: lldb-api :: functionalities/thread/concurrent_events/TestConcurrentDelayedCrashWithBreakpointSignal.py (1846 of 2472) PASS: lldb-unit :: Utility/./UtilityTests/DataExtractorTest.PeekData (1847 of 2472) PASS: lldb-api :: commands/expression/call-function/TestCallBuiltinFunction.py (1848 of 2472) PASS: lldb-shell :: SymbolFile/DWARF/x86/DW_AT_data_bit_offset-DW_OP_stack_value.s (1849 of 2472) PASS: lldb-unit :: Utility/./UtilityTests/StreamTest.Indent (1850 of 2472) UNSUPPORTED: lldb-shell :: SymbolFile/PDB/function-nested-block.test (1851 of 2472) PASS: lldb-api :: macosx/thread-names/TestInterruptThreadNames.py (1852 of 2472) PASS: lldb-unit :: Process/gdb-remote/./ProcessGdbRemoteTests/GDBRemoteClientBaseTest.InterruptNoResponse (1853 of 2472) PASS: lldb-unit :: Utility/./UtilityTests/SerializationRountripTest.SerializeDeserializeCStringNull (1854 of 2472) PASS: lldb-unit :: ScriptInterpreter/Python/./ScriptInterpreterPythonTests/PythonDataObjectsTest.TestPythonCallableCheck (1855 of 2472) UNSUPPORTED: lldb-shell :: SymbolFile/DWARF/x86/subprogram_ranges.test (1856 of 2472) UNSUPPORTED: lldb-shell :: SymbolFile/DWARF/x86/debug-types-address-ranges.s (1857 of 2472) PASS: lldb-unit :: Utility/./UtilityTests/ArgsTest.ReplaceArgumentAtIndexEqual (1858 of 2472) PASS: lldb-unit :: tools/lldb-server/tests/./LLDBServerTests/TestBase.DebugserverEnv (1859 of 2472) PASS: lldb-unit :: Utility/./UtilityTests/StringExtractorTest.GetHexBytes_FullString (1860 of 2472) PASS: lldb-api :: functionalities/avoids-fd-leak/TestFdLeak.py (1861 of 2472) PASS: lldb-unit :: Host/./HostTests/SocketTests/SocketTest.UDPConnect/ipv6 (1862 of 2472) UNSUPPORTED: lldb-shell :: SymbolFile/DWARF/x86/find-basic-function.cpp (1863 of 2472) PASS: lldb-shell :: ScriptInterpreter/Python/silent_command_script_import.test (1864 of 2472) PASS: lldb-api :: lang/objc/objc-optimized/TestObjcOptimized.py (1865 of 2472) PASS: lldb-api :: tools/lldb-vscode/breakpoint-events/TestVSCode_breakpointEvents.py (1866 of 2472) UNSUPPORTED: lldb-shell :: SymbolFile/NativePDB/break-by-line.cpp (1867 of 2472) PASS: lldb-shell :: Reproducer/TestVersionCheck.test (1868 of 2472) PASS: lldb-api :: commands/process/attach/TestProcessAttach.py (1869 of 2472) PASS: lldb-shell :: ObjectFile/ELF/section-addresses.yaml (1870 of 2472) PASS: lldb-unit :: Utility/./UtilityTests/StringListTest.LongestCommonPrefixNoPrefix (1871 of 2472) PASS: lldb-api :: python_api/name_lookup/TestNameLookup.py (1872 of 2472) PASS: lldb-api :: functionalities/thread/exit_during_break/TestExitDuringBreak.py (1873 of 2472) UNSUPPORTED: lldb-api :: macosx/simulator/TestSimulatorPlatform.py (1874 of 2472) PASS: lldb-unit :: UnwindAssembly/x86/./UnwindAssemblyx86Tests/Testx86AssemblyInspectionEngine.TestPushR13 (1875 of 2472) UNSUPPORTED: lldb-shell :: SymbolFile/PDB/variables.test (1876 of 2472) PASS: lldb-api :: functionalities/data-formatter/data-formatter-smart-array/TestDataFormatterSmartArray.py (1877 of 2472) PASS: lldb-unit :: ObjectFile/ELF/./ObjectFileELFTests/ObjectFileELFTest.GetModuleSpecifications_EarlySectionHeaders (1878 of 2472) PASS: lldb-api :: lang/c/tls_globals/TestTlsGlobals.py (1879 of 2472) UNSUPPORTED: lldb-shell :: SymbolFile/PDB/expressions.test (1880 of 2472) PASS: lldb-unit :: Utility/./UtilityTests/PassiveReplayTest.InstrumentedFoo (1881 of 2472) UNSUPPORTED: lldb-api :: functionalities/thread/create_during_step/TestCreateDuringStep.py (1882 of 2472) UNSUPPORTED: lldb-api :: functionalities/signal/handle-segv/TestHandleSegv.py (1883 of 2472) PASS: lldb-unit :: SymbolFile/DWARF/./SymbolFileDWARFTests/DWARFASTParserClangTests.TestCallingConventionParsing (1884 of 2472) PASS: lldb-unit :: Utility/./UtilityTests/StringListTest.JoinEmpty (1885 of 2472) PASS: lldb-unit :: ObjectFile/Breakpad/./ObjectFileBreakpadTests/InlineOriginRecord.parse (1886 of 2472) UNSUPPORTED: lldb-shell :: Breakpoint/case-insensitive.test (1887 of 2472) UNSUPPORTED: lldb-api :: functionalities/data-formatter/data-formatter-stl/libstdcpp/smart_ptr/TestDataFormatterStdSmartPtr.py (1888 of 2472) PASS: lldb-api :: functionalities/thread/concurrent_events/TestConcurrentBreakpointOneDelayBreakpointThreads.py (1889 of 2472) PASS: lldb-api :: python_api/value/change_values/TestChangeValueAPI.py (1890 of 2472) PASS: lldb-api :: lang/cpp/member-and-local-vars-with-same-name/TestMembersAndLocalsWithSameName.py (1891 of 2472) PASS: lldb-unit :: Utility/./UtilityTests/AnsiTerminal.WhiteSpace (1892 of 2472) PASS: lldb-unit :: Utility/./UtilityTests/StringExtractorTest.GetU32LittleEndian (1893 of 2472) UNSUPPORTED: lldb-api :: functionalities/tsan/thread_numbers/TestTsanThreadNumbers.py (1894 of 2472) PASS: lldb-unit :: ScriptInterpreter/Python/./ScriptInterpreterPythonTests/PythonDataObjectsTest.TestPythonTupleToStructuredList (1895 of 2472) PASS: lldb-shell :: ScriptInterpreter/Python/sb_address_exception.test (1896 of 2472) PASS: lldb-unit :: Symbol/./SymbolTests/Type.GetTypeScopeAndBasename (1897 of 2472) PASS: lldb-unit :: Process/minidump/./LLDBMinidumpTests/MinidumpParserTest.GetThreadContext_x86_64 (1898 of 2472) PASS: lldb-api :: functionalities/data-formatter/builtin-formats/TestBuiltinFormats.py (1899 of 2472) PASS: lldb-api :: commands/frame/diagnose/local-variable/TestLocalVariable.py (1900 of 2472) UNSUPPORTED: lldb-api :: python_api/watchpoint/condition/TestWatchpointConditionAPI.py (1901 of 2472) PASS: lldb-api :: commands/expression/persist_objc_pointeetype/TestPersistObjCPointeeType.py (1902 of 2472) PASS: lldb-unit :: Process/Utility/./ProcessUtilityTests/MemoryTagManagerAArch64MTETest.UnpackTagsData (1903 of 2472) PASS: lldb-unit :: Core/./LLDBCoreTests/DumpDataExtractorTest.ItemByteSizeErrors (1904 of 2472) UNSUPPORTED: lldb-shell :: ScriptInterpreter/Lua/persistent_state.test (1905 of 2472) PASS: lldb-unit :: Utility/./UtilityTests/StringLexerTest.NextIfList (1906 of 2472) PASS: lldb-unit :: Language/Highlighting/./HighlighterTests/HighlighterTest.ClangTrailingBackslashBeforeNewline (1907 of 2472) PASS: lldb-shell :: Reproducer/TestVerify.test (1908 of 2472) PASS: lldb-api :: functionalities/data-formatter/setvaluefromcstring/TestSetValueFromCString.py (1909 of 2472) PASS: lldb-unit :: Utility/./UtilityTests/ScalarTest.GetValue (1910 of 2472) PASS: lldb-unit :: ScriptInterpreter/Python/./ScriptInterpreterPythonTests/PythonDataObjectsTest.TestDictionaryResolutionWithDot (1911 of 2472) PASS: lldb-api :: commands/breakpoint/command/list/TestBreakpointCommandList.py (1912 of 2472) PASS: lldb-api :: commands/expression/dollar-in-variable/TestDollarInVariable.py (1913 of 2472) PASS: lldb-api :: python_api/signals/TestSignalsAPI.py (1914 of 2472) PASS: lldb-unit :: Utility/./UtilityTests/BinaryStreamTest.PutSLEB128FourBytes (1915 of 2472) PASS: lldb-unit :: Utility/./UtilityTests/StringListTest.PopBack (1916 of 2472) PASS: lldb-api :: commands/expression/import-std-module/empty-module/TestEmptyStdModule.py (1917 of 2472) PASS: lldb-api :: functionalities/plugins/python_os_plugin/TestPythonOSPlugin.py (1918 of 2472) PASS: lldb-unit :: Host/./HostTests/NativeProcessProtocolTest.ReadCStringFromMemory_CrossPageBoundary (1919 of 2472) PASS: lldb-unit :: Utility/./UtilityTests/StringListTest.GetSize (1920 of 2472) PASS: lldb-unit :: Utility/./UtilityTests/StreamTeeTest.Write (1921 of 2472) UNSUPPORTED: lldb-api :: functionalities/thread/concurrent_events/TestConcurrentTwoWatchpointThreads.py (1922 of 2472) PASS: lldb-unit :: Utility/./UtilityTests/StringExtractorTest.GetHexU8_Underflow (1923 of 2472) PASS: lldb-api :: api/check_public_api_headers/TestPublicAPIHeaders.py (1924 of 2472) PASS: lldb-unit :: Target/./TargetTests/FindFileTest.FindFileTests (1925 of 2472) PASS: lldb-unit :: Utility/./UtilityTests/StringExtractorTest.DecodeHexU8_InvalidHex (1926 of 2472) PASS: lldb-unit :: Utility/./UtilityTests/StringListTest.SetSize (1927 of 2472) PASS: lldb-shell :: ExecControl/StopHook/stop-hook.test (1928 of 2472) PASS: lldb-api :: functionalities/data-formatter/data-formatter-stl/libcxx/optional/TestDataFormatterLibcxxOptional.py (1929 of 2472) PASS: lldb-api :: commands/expression/import-std-module/iterator/TestIteratorFromStdModule.py (1930 of 2472) PASS: lldb-api :: functionalities/data-formatter/data-formatter-synthval/TestDataFormatterSynthVal.py (1931 of 2472) UNSUPPORTED: lldb-api :: linux/aarch64/unwind_signal/TestUnwindSignal.py (1932 of 2472) PASS: lldb-api :: functionalities/gdb_remote_client/TestTargetXMLArch.py (1933 of 2472) PASS: lldb-api :: lang/cpp/keywords_enabled/TestCppKeywordsEnabled.py (1934 of 2472) PASS: lldb-unit :: UnwindAssembly/x86/./UnwindAssemblyx86Tests/Testx86AssemblyInspectionEngine.TestPopRBP (1935 of 2472) UNSUPPORTED: lldb-api :: functionalities/longjmp/TestLongjmp.py (1936 of 2472) PASS: lldb-api :: types/TestIntegerTypeExpr.py (1937 of 2472) UNSUPPORTED: lldb-api :: functionalities/thread/concurrent_events/TestConcurrentTwoWatchpointsOneSignal.py (1938 of 2472) PASS: lldb-unit :: Process/Utility/./ProcessUtilityTests/MemoryTagManagerAArch64MTETest.GetLogicalTag (1939 of 2472) PASS: lldb-api :: functionalities/data-formatter/data-formatter-objc/TestDataFormatterObjCNSURL.py (1940 of 2472) PASS: lldb-api :: commands/expression/regression-access-function-template-in-record/TestRegressionAccessFunctionTemplateInRecord.py (1941 of 2472) PASS: lldb-unit :: Utility/./UtilityTests/FileSpecTest.RemoveLastPathComponent (1942 of 2472) PASS: lldb-unit :: Expression/./ExpressionTests/CppModuleConfigurationTest.LibCppV2 (1943 of 2472) UNSUPPORTED: lldb-api :: commands/watchpoints/watchpoint_commands/command/TestWatchpointCommandPython.py (1944 of 2472) PASS: lldb-shell :: SymbolFile/DWARF/x86/debug_loclists-dwo.s (1945 of 2472) PASS: lldb-api :: functionalities/breakpoint/scripted_bkpt/TestScriptedResolver.py (1946 of 2472) PASS: lldb-api :: commands/expression/call-function/TestCallStdStringFunction.py (1947 of 2472) PASS: lldb-unit :: Expression/./ExpressionTests/DiagnosticManagerTest.GetStringPreserveOrder (1948 of 2472) PASS: lldb-unit :: Expression/./ExpressionTests/DiagnosticManagerTest.PutStringSeverities (1949 of 2472) PASS: lldb-shell :: SymbolFile/DWARF/x86/debug-types-dwarf5.s (1950 of 2472) UNSUPPORTED: lldb-api :: lang/cpp/breakpoint_in_member_func_w_non_primitive_params/TestBreakpointInMemberFuncWNonPrimitiveParams.py (1951 of 2472) PASS: lldb-unit :: Utility/./UtilityTests/ScalarTest.Promotion (1952 of 2472) PASS: lldb-api :: functionalities/data-formatter/hexcaps/TestDataFormatterHexCaps.py (1953 of 2472) PASS: lldb-api :: functionalities/data-formatter/cstring-utf8-summary/TestCstringUnicode.py (1954 of 2472) PASS: lldb-shell :: Register/Core/x86-32-netbsd-multithread.test (1955 of 2472) PASS: lldb-unit :: Utility/./UtilityTests/UriParserTest.SchemeHostSeparator2 (1956 of 2472) UNSUPPORTED: lldb-api :: commands/expression/import_builtin_fileid/TestImportBuiltinFileID.py (1957 of 2472) PASS: lldb-api :: lang/c/unions/TestUnionMembers.py (1958 of 2472) PASS: lldb-shell :: SymbolFile/DWARF/x86/debug_aranges-empty-section.s (1959 of 2472) UNSUPPORTED: lldb-api :: tools/lldb-vscode/completions/TestVSCode_completions.py (1960 of 2472) PASS: lldb-unit :: Utility/./UtilityTests/StreamTest.PutRawBytesToLittleEndian (1961 of 2472) PASS: lldb-unit :: Utility/./UtilityTests/GeneratorTest.YamlMultiProvider (1962 of 2472) PASS: lldb-unit :: Utility/./UtilityTests/BinaryStreamTest.PutULEB128ThreeBytes (1963 of 2472) PASS: lldb-unit :: Utility/./UtilityTests/SerializationRountripTest.SerializeDeserializeCStringArrayNullptr (1964 of 2472) PASS: lldb-unit :: Core/./LLDBCoreTests/DumpDataExtractorTest.FormatCharArray (1965 of 2472) PASS: lldb-unit :: Utility/./UtilityTests/UriParserTest.BadPort2 (1966 of 2472) PASS: lldb-unit :: Host/./HostTests/TerminalTest.SetRaw (1967 of 2472) PASS: lldb-unit :: UnwindAssembly/x86/./UnwindAssemblyx86Tests/Testx86AssemblyInspectionEngine.TestPush0 (1968 of 2472) PASS: lldb-unit :: Host/./HostTests/XML.GetAs (1969 of 2472) PASS: lldb-unit :: Process/gdb-remote/./ProcessGdbRemoteTests/GDBRemoteClientBaseTest.SendContinueAndInterrupt2PacketBug (1970 of 2472) UNSUPPORTED: lldb-api :: functionalities/ptrauth_diagnostics/BLRAA_error/TestPtrauthBLRAADiagnostic.py (1971 of 2472) PASS: lldb-unit :: Utility/./UtilityTests/OptionsWithRawTest.EmptySuffix (1972 of 2472) PASS: lldb-api :: lang/cpp/char8_t/TestCxxChar8_t.py (1973 of 2472) PASS: lldb-api :: commands/expression/import-std-module/unique_ptr-dbg-info-content/TestUniquePtrDbgInfoContent.py (1974 of 2472) PASS: lldb-api :: commands/process/launch-with-shellexpand/TestLaunchWithShellExpand.py (1975 of 2472) PASS: lldb-unit :: Utility/./UtilityTests/SerializationRountripTest.SerializeDeserializeObjectReference (1976 of 2472) PASS: lldb-unit :: Utility/./UtilityTests/StringExtractorTest.DecodeHexU8_Underflow (1977 of 2472) PASS: lldb-unit :: Utility/./UtilityTests/VASprintfTest.EncodingError (1978 of 2472) UNSUPPORTED: lldb-api :: benchmarks/startup/TestStartupDelays.py (1979 of 2472) PASS: lldb-api :: lang/objc/foundation/TestObjCMethodsNSArray.py (1980 of 2472) PASS: lldb-api :: functionalities/data-formatter/data-formatter-categories/TestDataFormatterCategories.py (1981 of 2472) XFAIL: lldb-shell :: Register/x86-mm-xmm-read.test (1982 of 2472) PASS: lldb-api :: commands/frame/diagnose/complicated-expression/TestComplicatedExpression.py (1983 of 2472) PASS: lldb-unit :: Target/./TargetTests/PathMappingListTest.RelativeTests (1984 of 2472) PASS: lldb-unit :: Utility/./UtilityTests/RecordReplayTest.InstrumentedBar (1985 of 2472) PASS: lldb-unit :: Process/Utility/./ProcessUtilityTests/RegisterContext_x86Test.FullToAbridgedTagWord (1986 of 2472) PASS: lldb-shell :: Breakpoint/debug_rnglistx_rlex.test (1987 of 2472) PASS: lldb-unit :: Expression/./ExpressionTests/DiagnosticManagerTest.GetStringSeverityLabels (1988 of 2472) PASS: lldb-unit :: Utility/./UtilityTests/ArchSpecTest.TestParseMachCPUDashSubtypeTripleSimple (1989 of 2472) PASS: lldb-unit :: DataFormatter/./LLDBFormatterTests/TypeMatcherTests.ExactName (1990 of 2472) PASS: lldb-shell :: Settings/TestDisableColor.test (1991 of 2472) UNSUPPORTED: lldb-api :: commands/expression/completion-crash-invalid-iterator/TestInvalidIteratorCompletionCrash.py (1992 of 2472) UNSUPPORTED: lldb-api :: functionalities/tail_call_frames/disambiguate_call_site/TestDisambiguateCallSite.py (1993 of 2472) PASS: lldb-unit :: Utility/./UtilityTests/NameMatchesTest.RegularExpression (1994 of 2472) PASS: lldb-api :: lang/cpp/nsimport/TestCppNsImport.py (1995 of 2472) PASS: lldb-unit :: Host/./HostTests/File.GetWaitableHandleFileno (1996 of 2472) PASS: lldb-unit :: Host/./HostTests/Host.WaitStatusFormat (1997 of 2472) PASS: lldb-shell :: Register/x86-64-ymm-read.test (1998 of 2472) PASS: lldb-unit :: Utility/./UtilityTests/StringListTest.LongestCommonPrefixDuplicateElement (1999 of 2472) PASS: lldb-api :: lang/cpp/bitfields/TestCppBitfields.py (2000 of 2472) PASS: lldb-unit :: Language/Highlighting/./HighlighterTests/HighlighterTest.ClangOperators (2001 of 2472) PASS: lldb-unit :: Symbol/./SymbolTests/TestTypeSystemClang.TestNotDeletingUserCopyCstrDueToMoveCStr (2002 of 2472) PASS: lldb-shell :: ScriptInterpreter/Python/fail_breakpoint_oneline.test (2003 of 2472) PASS: lldb-api :: functionalities/breakpoint/breakpoint_hit_count/TestBreakpointHitCount.py (2004 of 2472) PASS: lldb-unit :: Utility/./UtilityTests/OptionsWithRawTest.WhitespaceInput (2005 of 2472) PASS: lldb-shell :: Settings/TestEchoCommands.test (2006 of 2472) PASS: lldb-shell :: Reproducer/TestGDBRemoteRepro.test (2007 of 2472) PASS: lldb-unit :: Utility/./UtilityTests/BinaryStreamTest.PutSLEB128Zero (2008 of 2472) PASS: lldb-unit :: Utility/./UtilityTests/StreamTest.PutCharWhitespace (2009 of 2472) PASS: lldb-api :: macosx/add-dsym/TestAddDsymMidExecutionCommand.py (2010 of 2472) PASS: lldb-unit :: Language/CPlusPlus/./LanguageCPlusPlusTests/CPlusPlusLanguage.GenerateAlternateFunctionManglings (2011 of 2472) PASS: lldb-unit :: Utility/./UtilityTests/StringLexerTest.HasAtLeast (2012 of 2472) PASS: lldb-unit :: Symbol/./SymbolTests/TestTypeSystemClang.TestIsClangType (2013 of 2472) PASS: lldb-api :: commands/platform/sdk/TestPlatformSDK.py (2014 of 2472) PASS: lldb-api :: lang/c/builtin-types/TestCBuiltinTypes.py (2015 of 2472) PASS: lldb-shell :: Minidump/breakpad-symbols.test (2016 of 2472) UNSUPPORTED: lldb-api :: commands/trace/multiple-threads/TestTraceStartStopMultipleThreads.py (2017 of 2472) UNSUPPORTED: lldb-shell :: SymbolFile/NativePDB/stack_unwinding01.cpp (2018 of 2472) PASS: lldb-api :: lang/objc/objc-dyn-sbtype/TestObjCDynamicSBType.py (2019 of 2472) PASS: lldb-unit :: Utility/./UtilityTests/ProcessInstanceInfo.DumpTable_invalidUID (2020 of 2472) PASS: lldb-unit :: Host/./HostTests/SocketTests/SocketTest.UDPGetConnectURI/ipv6 (2021 of 2472) PASS: lldb-unit :: Target/./TargetTests/PathMappingListTest.RemapRoot (2022 of 2472) PASS: lldb-api :: commands/disassemble/basic/TestFrameDisassemble.py (2023 of 2472) UNSUPPORTED: lldb-api :: commands/watchpoints/multiple_threads/TestWatchpointMultipleThreads.py (2024 of 2472) PASS: lldb-unit :: Expression/./ExpressionTests/ClangHostTest.ComputeClangResourceDirectory (2025 of 2472) PASS: lldb-api :: lang/objc/foundation/TestObjCMethods.py (2026 of 2472) UNSUPPORTED: lldb-shell :: SymbolFile/NativePDB/function-types-calling-conv.cpp (2027 of 2472) PASS: lldb-api :: commands/expression/import-std-module/vector-dbg-info-content/TestDbgInfoContentVectorFromStdModule.py (2028 of 2472) UNSUPPORTED: lldb-shell :: Expr/TestIRMemoryMapWindows.test (2029 of 2472) UNSUPPORTED: lldb-api :: commands/watchpoints/watchpoint_disable/TestWatchpointDisable.py (2030 of 2472) PASS: lldb-unit :: Utility/./UtilityTests/ScalarTest.GetBytes (2031 of 2472) PASS: lldb-unit :: Utility/./UtilityTests/UriParserTest.SchemeHostSeparator (2032 of 2472) PASS: lldb-shell :: Register/Core/x86-32-linux-multithread.test (2033 of 2472) PASS: lldb-unit :: Utility/./UtilityTests/BinaryStreamTest.PutSLEB128One (2034 of 2472) PASS: lldb-unit :: Host/./HostTests/SocketTests/SocketTest.TCPGetConnectURI/ipv4 (2035 of 2472) PASS: lldb-unit :: Process/gdb-remote/./ProcessGdbRemoteTests/GDBRemoteCommunicationClientTest.GetMemoryRegionInfo (2036 of 2472) PASS: lldb-api :: lang/cpp/char1632_t/TestChar1632T.py (2037 of 2472) PASS: lldb-shell :: Unwind/trap_frame_sym_ctx.test (2038 of 2472) PASS: lldb-unit :: Process/./ProcessEventDataTests/ProcessEventDataTest.ShouldStop (2039 of 2472) PASS: lldb-unit :: UnwindAssembly/x86/./UnwindAssemblyx86Tests/Testx86AssemblyInspectionEngine.TestPopR13 (2040 of 2472) UNSUPPORTED: lldb-shell :: SymbolFile/DWARF/x86/array-sizes.s (2041 of 2472) PASS: lldb-shell :: ObjectFile/PECOFF/basic-info.yaml (2042 of 2472) PASS: lldb-unit :: Utility/./UtilityTests/RangeTest.NotEqualInvalid (2043 of 2472) PASS: lldb-unit :: Utility/./UtilityTests/StringListTest.AppendList (2044 of 2472) UNSUPPORTED: lldb-shell :: SymbolFile/NativePDB/function-types-classes.cpp (2045 of 2472) PASS: lldb-unit :: Utility/./UtilityTests/StringListTest.InsertStringAtIndexOutOfBounds (2046 of 2472) PASS: lldb-unit :: Process/gdb-remote/./ProcessGdbRemoteTests/GDBRemoteCommunicationClientTest.SendSignalsToIgnore (2047 of 2472) PASS: lldb-unit :: Utility/./UtilityTests/OptionsWithRawTest.WhitespaceSuffix (2048 of 2472) UNSUPPORTED: lldb-shell :: SymbolFile/DWARF/x86/debug-types-basic.test (2049 of 2472) PASS: lldb-unit :: Utility/./UtilityTests/ArchSpecTest.MergeFromMachOUnknown (2050 of 2472) PASS: lldb-unit :: Host/./HostTests/SocketTests/SocketTest.TCPGetAddress/ipv6 (2051 of 2472) XFAIL: lldb-shell :: Register/x86-64-fp-read.test (2052 of 2472) PASS: lldb-api :: functionalities/dlopen_other_executable/TestDlopenOtherExecutable.py (2053 of 2472) PASS: lldb-unit :: Utility/./UtilityTests/ArgsTest.ReplaceArgumentAtIndexFarOutOfRange (2054 of 2472) PASS: lldb-unit :: Symbol/./SymbolTests/TestTypeSystemClang.GetFullyUnqualifiedType (2055 of 2472) PASS: lldb-api :: commands/gui/basic/TestGuiBasic.py (2056 of 2472) PASS: lldb-api :: commands/session/save/TestSessionSave.py (2057 of 2472) PASS: lldb-unit :: Language/CPlusPlus/./LanguageCPlusPlusTests/CPlusPlusLanguage.CPlusPlusNameParser (2058 of 2472) PASS: lldb-api :: functionalities/breakpoint/inlined_breakpoints/TestInlinedBreakpoints.py (2059 of 2472) PASS: lldb-api :: api/multithreaded/TestMultithreaded.py (2060 of 2472) PASS: lldb-api :: commands/target/stop-hook/delete/TestTargetStopHookDelete.py (2061 of 2472) PASS: lldb-shell :: ObjectFile/ELF/PT_LOAD-overlap.yaml (2062 of 2472) PASS: lldb-api :: functionalities/data-formatter/data-formatter-stl/libcxx/queue/TestDataFormatterLibcxxQueue.py (2063 of 2472) PASS: lldb-unit :: ObjectFile/Breakpad/./ObjectFileBreakpadTests/StackCFIRecord.parse (2064 of 2472) PASS: lldb-api :: lang/cpp/llvm-style/TestLLVMStyle.py (2065 of 2472) UNSUPPORTED: lldb-api :: functionalities/tsan/basic/TestTsanBasic.py (2066 of 2472) PASS: lldb-api :: python_api/hello_world/TestHelloWorld.py (2067 of 2472) PASS: lldb-api :: lang/objc/modules-inline-functions/TestModulesInlineFunctions.py (2068 of 2472) PASS: lldb-shell :: SymbolFile/Breakpad/unwind-via-stack-cfi.test (2069 of 2472) PASS: lldb-api :: lang/c/enum_types/TestEnumTypes.py (2070 of 2472) PASS: lldb-api :: commands/expression/import_base_class_when_class_has_derived_member/TestImportBaseClassWhenClassHasDerivedMember.py (2071 of 2472) PASS: lldb-api :: lang/objcxx/hide-runtime-values/TestObjCXXHideRuntimeValues.py (2072 of 2472) PASS: lldb-unit :: Host/./HostTests/MainLoopTest.TerminatesImmediately (2073 of 2472) PASS: lldb-unit :: Utility/./UtilityTests/Flags.AllSet (2074 of 2472) PASS: lldb-api :: lang/cpp/constructors/TestCppConstructors.py (2075 of 2472) PASS: lldb-unit :: Utility/./UtilityTests/StreamTest.PutRawBytesToMixedEndian (2076 of 2472) PASS: lldb-shell :: Minidump/Windows/broken-unwind.test (2077 of 2472) PASS: lldb-api :: sample_test/TestSampleInlineTest.py (2078 of 2472) UNSUPPORTED: lldb-shell :: SymbolFile/DWARF/split-optimized.c (2079 of 2472) UNSUPPORTED: lldb-shell :: SymbolFile/NativePDB/bitfields.cpp (2080 of 2472) PASS: lldb-unit :: Process/minidump/./LLDBMinidumpTests/MinidumpParserTest.GetMemoryRegionInfoFromMemory64List (2081 of 2472) PASS: lldb-shell :: SymbolFile/Breakpad/symtab.test (2082 of 2472) PASS: lldb-unit :: Utility/./UtilityTests/StringExtractorTest.GetNameColonValueNoColon (2083 of 2472) PASS: lldb-unit :: ObjectFile/Breakpad/./ObjectFileBreakpadTests/FuncRecord.parse (2084 of 2472) PASS: lldb-unit :: Utility/./UtilityTests/StringExtractorTest.GetHexU8_Extra (2085 of 2472) PASS: lldb-shell :: BuildScript/compiler-full-path.test (2086 of 2472) UNSUPPORTED: lldb-api :: functionalities/breakpoint/hardware_breakpoints/write_memory_with_hw_breakpoint/TestWriteMemoryWithHWBreakpoint.py (2087 of 2472) PASS: lldb-unit :: ObjectFile/Breakpad/./ObjectFileBreakpadTests/InfoRecord.parse (2088 of 2472) UNSUPPORTED: lldb-api :: functionalities/thread/concurrent_events/TestConcurrentBreakpointsDelayedBreakpointOneWatchpoint.py (2089 of 2472) PASS: lldb-api :: commands/expression/options/TestExprOptions.py (2090 of 2472) PASS: lldb-unit :: Expression/./ExpressionTests/DWARFExpression.DW_OP_pick (2091 of 2472) PASS: lldb-unit :: Utility/./UtilityTests/StreamTeeTest.GetStreamAtIndexOutOfBoundsEmpty (2092 of 2472) UNSUPPORTED: lldb-api :: linux/thread/create_during_instruction_step/TestCreateDuringInstructionStep.py (2093 of 2472) PASS: lldb-unit :: Utility/./UtilityTests/StringListTest.AppendStringCString (2094 of 2472) PASS: lldb-api :: commands/expression/import-std-module/deque-basic/TestDequeFromStdModule.py (2095 of 2472) UNSUPPORTED: lldb-api :: linux/aarch64/tagged_memory_region/TestAArch64LinuxTaggedMemoryRegion.py (2096 of 2472) PASS: lldb-unit :: Symbol/./SymbolTests/LineEntryTest.GetSameLineContiguousAddressRangeOneInline (2097 of 2472) PASS: lldb-unit :: UnwindAssembly/x86/./UnwindAssemblyx86Tests/Testx86AssemblyInspectionEngine.TestAddESP (2098 of 2472) PASS: lldb-unit :: ScriptInterpreter/Python/./ScriptInterpreterPythonTests/PythonDataObjectsTest.TestPythonDictionaryToStructuredDictionary (2099 of 2472) UNSUPPORTED: lldb-shell :: SymbolFile/PDB/calling-conventions.test (2100 of 2472) PASS: lldb-api :: functionalities/var_path/TestVarPath.py (2101 of 2472) PASS: lldb-api :: macosx/macCatalyst/TestMacCatalyst.py (2102 of 2472) PASS: lldb-unit :: Symbol/./SymbolTests/TestClangASTImporter.CompleteFwdDeclWithOtherOrigin (2103 of 2472) PASS: lldb-shell :: ObjectFile/ELF/section-types.yaml (2104 of 2472) PASS: lldb-shell :: Reproducer/Functionalities/TestImageList.test (2105 of 2472) PASS: lldb-api :: commands/settings/TestSettings.py (2106 of 2472) PASS: lldb-shell :: Reproducer/TestDebugSymbols.test (2107 of 2472) PASS: lldb-api :: functionalities/postmortem/elf-core/gcore/TestGCore.py (2108 of 2472) PASS: lldb-api :: functionalities/breakpoint/serialize/TestBreakpointSerialization.py (2109 of 2472) PASS: lldb-api :: lang/c/inlines/TestRedefinitionsInInlines.py (2110 of 2472) UNSUPPORTED: lldb-api :: commands/gui/basicdebug/TestGuiBasicDebug.py (2111 of 2472) PASS: lldb-unit :: Utility/./UtilityTests/ProcessInfoTest.Constructor (2112 of 2472) PASS: lldb-unit :: Core/./LLDBCoreTests/RichManglingContextTest.IPDRealloc (2113 of 2472) UNSUPPORTED: lldb-api :: functionalities/thread/concurrent_events/TestConcurrentTwoWatchpointsOneDelayBreakpoint.py (2114 of 2472) PASS: lldb-unit :: Process/gdb-remote/./ProcessGdbRemoteTests/GDBRemoteCommunicationClientTest.TestPacketSpeedJSON (2115 of 2472) PASS: lldb-api :: functionalities/data-formatter/data-formatter-stl/libcxx/map/TestDataFormatterLibccMap.py (2116 of 2472) PASS: lldb-api :: lang/cpp/virtual-overload/TestVirtualOverload.py (2117 of 2472) UNSUPPORTED: lldb-shell :: SymbolFile/DWARF/split-dwarf-expression-eval-bug.cpp (2118 of 2472) PASS: lldb-unit :: debugserver/./debugserverTests/RNBSocket.LoopBackListenIPv4 (2119 of 2472) PASS: lldb-unit :: Utility/./UtilityTests/StringExtractorTest.DecodeHexU8_Exact (2120 of 2472) UNSUPPORTED: lldb-shell :: Unwind/eh-frame-augment-noop.test (2121 of 2472) PASS: lldb-api :: lang/cpp/forward-declared-template-specialization/TestCppForwardDeclaredTemplateSpecialization.py (2122 of 2472) UNSUPPORTED: lldb-api :: functionalities/thread/concurrent_events/TestConcurrentCrashWithWatchpoint.py (2123 of 2472) PASS: lldb-unit :: Utility/./UtilityTests/StringExtractorTest.GetNameColonValueNoSemicolon (2124 of 2472) PASS: lldb-api :: tools/lldb-vscode/module/TestVSCode_module.py (2125 of 2472) UNSUPPORTED: lldb-api :: functionalities/thread/concurrent_events/TestConcurrentSignalWatch.py (2126 of 2472) PASS: lldb-shell :: Reproducer/TestHomeDir.test (2127 of 2472) PASS: lldb-shell :: ObjectFile/ELF/PT_LOAD-empty.yaml (2128 of 2472) PASS: lldb-api :: lang/c/local_variables/TestLocalVariables.py (2129 of 2472) PASS: lldb-unit :: Utility/./UtilityTests/ScalarTest.Scalar_512 (2130 of 2472) PASS: lldb-unit :: Utility/./UtilityTests/ScalarTest.LongLongAssigmentOperator (2131 of 2472) PASS: lldb-unit :: Core/./LLDBCoreTests/SourceFileCache.FindSourceFileFound (2132 of 2472) PASS: lldb-unit :: Host/./HostTests/ConnectionFileDescriptorTest.TCPGetURIv4 (2133 of 2472) UNSUPPORTED: lldb-api :: commands/watchpoints/watchpoint_size/TestWatchpointSizes.py (2134 of 2472) UNSUPPORTED: lldb-shell :: SymbolFile/NativePDB/ast-functions.cpp (2135 of 2472) PASS: lldb-unit :: Platform/./LLDBPlatformTests/PlatformDarwinTest.GetCompatibleArchARMv4 (2136 of 2472) UNSUPPORTED: lldb-shell :: Register/x86-64-gp-write.test (2137 of 2472) PASS: lldb-api :: tools/lldb-server/TestGdbRemoteExpeditedRegisters.py (2138 of 2472) UNSUPPORTED: lldb-api :: lang/objc/modules-update/TestClangModulesUpdate.py (2139 of 2472) PASS: lldb-unit :: Symbol/./SymbolTests/DWARFCallFrameInfoTest.Basic_dwarf4 (2140 of 2472) PASS: lldb-api :: python_api/sberror/TestSBError.py (2141 of 2472) PASS: lldb-api :: api/log/TestAPILog.py (2142 of 2472) PASS: lldb-api :: commands/command/script/import/TestImport.py (2143 of 2472) PASS: lldb-api :: lang/objc/ivar-IMP/TestObjCiVarIMP.py (2144 of 2472) PASS: lldb-api :: functionalities/data-formatter/data-formatter-objc/TestDataFormatterObjCNSContainer.py (2145 of 2472) UNSUPPORTED: lldb-shell :: ScriptInterpreter/Lua/breakpoint_oneline_callback.test (2146 of 2472) PASS: lldb-unit :: Utility/./UtilityTests/BinaryStreamTest.PutULEB128MaxValue (2147 of 2472) PASS: lldb-unit :: Utility/./UtilityTests/StringListTest.JoinThree (2148 of 2472) PASS: lldb-unit :: Utility/./UtilityTests/StringLexerTest.NextIf (2149 of 2472) PASS: lldb-unit :: Process/gdb-remote/./ProcessGdbRemoteTests/GDBRemoteCommunicationClientTest.WriteRegisterNoSuffix (2150 of 2472) PASS: lldb-api :: lang/objc/objc-struct-return/TestObjCStructReturn.py (2151 of 2472) PASS: lldb-api :: lang/c/stepping/TestThreadStepping.py (2152 of 2472) PASS: lldb-unit :: Utility/./UtilityTests/UriParserTest.Empty (2153 of 2472) PASS: lldb-api :: commands/expression/argument_passing_restrictions/TestArgumentPassingRestrictions.py (2154 of 2472) PASS: lldb-unit :: Utility/./UtilityTests/ProcessInstanceInfo.DumpTable (2155 of 2472) PASS: lldb-api :: commands/expression/calculator_mode/TestCalculatorMode.py (2156 of 2472) PASS: lldb-api :: functionalities/data-formatter/frameformat_smallstruct/TestFrameFormatSmallStruct.py (2157 of 2472) PASS: lldb-api :: commands/help/TestHelp.py (2158 of 2472) PASS: lldb-unit :: UnwindAssembly/x86/./UnwindAssemblyx86Tests/Testx86AssemblyInspectionEngine.TestSubESP (2159 of 2472) PASS: lldb-unit :: Expression/./ExpressionTests/DiagnosticManagerTest.PutStringMultiple (2160 of 2472) PASS: lldb-unit :: Utility/./UtilityTests/RecordReplayTest.InstrumentedFoo (2161 of 2472) PASS: lldb-unit :: Symbol/./SymbolTests/TestTypeSystemClang.TestGetTypeClassDeclType (2162 of 2472) PASS: lldb-unit :: Host/./HostTests/FileSystemTest.GetByteSize (2163 of 2472) PASS: lldb-api :: functionalities/breakpoint/dummy_target_breakpoints/TestBreakpointsWithNoTargets.py (2164 of 2472) PASS: lldb-api :: functionalities/breakpoint/global_constructor/TestBreakpointInGlobalConstructor.py (2165 of 2472) PASS: lldb-unit :: Utility/./UtilityTests/StringExtractorTest.GetHexBytesAvail_FullString (2166 of 2472) UNSUPPORTED: lldb-api :: functionalities/tsan/multiple/TestTsanMultiple.py (2167 of 2472) PASS: lldb-unit :: Core/./LLDBCoreTests/CommunicationTest.WriteAll (2168 of 2472) UNSUPPORTED: lldb-api :: functionalities/thread/concurrent_events/TestConcurrentWatchpointWithDelayWatchpointThreads.py (2169 of 2472) PASS: lldb-unit :: Utility/./UtilityTests/ConstStringTest.MangledCounterpart (2170 of 2472) PASS: lldb-api :: functionalities/data-formatter/data-formatter-stl/libcxx/list/loop/TestDataFormatterLibcxxListLoop.py (2171 of 2472) PASS: lldb-api :: lang/cpp/wchar_t/TestCxxWCharT.py (2172 of 2472) PASS: lldb-unit :: Utility/./UtilityTests/Flags.AnySet (2173 of 2472) PASS: lldb-api :: functionalities/step_scripted/TestStepScripted.py (2174 of 2472) PASS: lldb-api :: commands/platform/process/list/TestProcessList.py (2175 of 2472) PASS: lldb-unit :: Utility/./UtilityTests/FileSpecTest.Yaml (2176 of 2472) PASS: lldb-unit :: Utility/./UtilityTests/BinaryStreamTest.PutULEB128OneByte (2177 of 2472) PASS: lldb-api :: functionalities/target-new-solib-notifications/TestModuleLoadedNotifys.py (2178 of 2472) PASS: lldb-shell :: ObjectFile/MachO/lc_build_version_notools.yaml (2179 of 2472) PASS: lldb-shell :: SymbolFile/DWARF/x86/compilercontext.ll (2180 of 2472) PASS: lldb-shell :: Minidump/Windows/find-module.test (2181 of 2472) PASS: lldb-api :: lang/objc/radar-9691614/TestObjCMethodReturningBOOL.py (2182 of 2472) PASS: lldb-unit :: Utility/./UtilityTests/StringListTest.CopyListSingle (2183 of 2472) PASS: lldb-unit :: Utility/./UtilityTests/StreamTest.PutHex64ByteOrderLittle (2184 of 2472) UNSUPPORTED: lldb-api :: functionalities/thread/concurrent_events/TestConcurrentSignalNWatchNBreak.py (2185 of 2472) PASS: lldb-api :: commands/expression/unicode-in-variable/TestUnicodeInVariable.py (2186 of 2472) PASS: lldb-unit :: Utility/./UtilityTests/RangeDataVector.FindEntryIndexesThatContain (2187 of 2472) PASS: lldb-api :: tools/lldb-vscode/attach/TestVSCode_attach.py (2188 of 2472) PASS: lldb-unit :: Expression/./ExpressionTests/CppModuleConfigurationTest.MissingLibCpp (2189 of 2472) PASS: lldb-unit :: Utility/./UtilityTests/StreamTest.PutHex16ByteOrderLittle (2190 of 2472) PASS: lldb-api :: functionalities/data-formatter/data-formatter-stl/libcxx/iterator/TestDataFormatterLibccIterator.py (2191 of 2472) PASS: lldb-unit :: UnwindAssembly/x86/./UnwindAssemblyx86Tests/Testx86AssemblyInspectionEngine.TestPopESI (2192 of 2472) PASS: lldb-shell :: ObjectFile/PECOFF/section-types.yaml (2193 of 2472) PASS: lldb-api :: python_api/type/TestTypeList.py (2194 of 2472) PASS: lldb-unit :: Utility/./UtilityTests/StringListTest.InsertStringAtIndexStdString (2195 of 2472) PASS: lldb-api :: functionalities/gdb_remote_client/TestRemoteRegNums.py (2196 of 2472) PASS: lldb-shell :: ObjectFile/ELF/section-overlap.yaml (2197 of 2472) PASS: lldb-unit :: Utility/./UtilityTests/StreamTeeTest.Flush (2198 of 2472) PASS: lldb-unit :: Utility/./UtilityTests/RangeTest.DoesAdjoinOrIntersect (2199 of 2472) PASS: lldb-api :: functionalities/data-formatter/data-formatter-stl/libcxx/tuple/TestDataFormatterLibcxxTuple.py (2200 of 2472) UNSUPPORTED: lldb-api :: tools/lldb-server/registers-target-xml-reading/TestGdbRemoteTargetXmlPacket.py (2201 of 2472) PASS: lldb-api :: functionalities/data-formatter/data-formatter-stl/libcxx/string/TestDataFormatterLibcxxString.py (2202 of 2472) PASS: lldb-api :: functionalities/data-formatter/user-format-vs-summary/TestUserFormatVsSummary.py (2203 of 2472) PASS: lldb-unit :: Utility/./UtilityTests/StringExtractorTest.GetHexBytesAvail_OddPair2 (2204 of 2472) PASS: lldb-shell :: ObjectFile/PECOFF/sections-names.yaml (2205 of 2472) PASS: lldb-unit :: ScriptInterpreter/Python/./ScriptInterpreterPythonTests/PythonDataObjectsTest.TestPythonIntegerToStructuredInteger (2206 of 2472) PASS: lldb-unit :: Utility/./UtilityTests/UriParserTest.LongPath (2207 of 2472) PASS: lldb-unit :: Process/Utility/./ProcessUtilityTests/ProcSMapTests/LinuxProcSMapsTestFixture.ParseSMapRegions/7 (2208 of 2472) UNSUPPORTED: lldb-api :: functionalities/param_entry_vals/basic_entry_values/TestBasicEntryValues.py (2209 of 2472) PASS: lldb-unit :: Utility/./UtilityTests/BinaryStreamTest.PutULEB128Zero (2210 of 2472) PASS: lldb-unit :: SymbolFile/NativePDB/./SymbolFileNativePDBTests/PDBFPOProgramToDWARFExpressionTests.UnresolvedCyclicRegisterAssignmentReference (2211 of 2472) PASS: lldb-api :: lang/objc/objc-super/TestObjCSuper.py (2212 of 2472) PASS: lldb-unit :: Utility/./UtilityTests/OptionsWithRawTest.TerminatedQuote (2213 of 2472) PASS: lldb-unit :: Process/minidump/./LLDBMinidumpTests/MinidumpParserTest.GetMiscInfo_no_stream (2214 of 2472) PASS: lldb-api :: lang/cpp/class-template-type-parameter-pack/TestClassTemplateTypeParameterPack.py (2215 of 2472) PASS: lldb-unit :: Utility/./UtilityTests/StringListTest.InsertStringAtIndexMove (2216 of 2472) PASS: lldb-unit :: Utility/./UtilityTests/OptionsWithRawTest.SingleWhitespaceInput (2217 of 2472) PASS: lldb-api :: arm/emulation/TestEmulations.py (2218 of 2472) PASS: lldb-unit :: Platform/./LLDBPlatformTests/PlatformDarwinTest.GetCompatibleArchARM64 (2219 of 2472) PASS: lldb-unit :: Utility/./UtilityTests/VMRange.CollectionContains (2220 of 2472) PASS: lldb-unit :: ObjectFile/ELF/./ObjectFileELFTests/ObjectFileELFTest.GetSymtab_NoSymEntryPointArmAddressClass (2221 of 2472) PASS: lldb-shell :: ObjectFile/ELF/eh_frame-symbols.yaml (2222 of 2472) PASS: lldb-unit :: Utility/./UtilityTests/ProcessInstanceInfo.Dump (2223 of 2472) PASS: lldb-unit :: UnwindAssembly/x86/./UnwindAssemblyx86Tests/Testx86AssemblyInspectionEngine.TestPushEBX (2224 of 2472) PASS: lldb-unit :: Core/./LLDBCoreTests/ModuleSpecTest.TestCOFFFile (2225 of 2472) PASS: lldb-unit :: Utility/./UtilityTests/Flags.Reset (2226 of 2472) PASS: lldb-unit :: Process/gdb-remote/./ProcessGdbRemoteTests/GDBRemoteClientBaseTest.SendContinueDelegateStructuredDataReceipt (2227 of 2472) PASS: lldb-unit :: Host/./HostTests/FileSystemTest.EmptyTest (2228 of 2472) PASS: lldb-api :: lang/objc/foundation/TestObjCMethodsNSError.py (2229 of 2472) PASS: lldb-api :: functionalities/lazy-loading/TestLazyLoading.py (2230 of 2472) PASS: lldb-shell :: Driver/TestHelp.test (2231 of 2472) PASS: lldb-unit :: Utility/./UtilityTests/StreamTeeTest.Constructor2Streams (2232 of 2472) PASS: lldb-api :: commands/breakpoint/set/func-regex/TestBreakpointRegexError.py (2233 of 2472) UNSUPPORTED: lldb-api :: tools/lldb-server/memory-tagging/TestGdbRemoteMemoryTagging.py (2234 of 2472) PASS: lldb-api :: commands/expression/invalid-args/TestInvalidArgsExpression.py (2235 of 2472) PASS: lldb-unit :: Utility/./UtilityTests/StringLexerTest.GetUnlexed (2236 of 2472) PASS: lldb-unit :: Utility/./UtilityTests/RangeTest.SetRangeBase (2237 of 2472) PASS: lldb-unit :: Utility/./UtilityTests/BinaryStreamTest.PutSLEB128TwoBytes (2238 of 2472) PASS: lldb-api :: python_api/interpreter/TestCommandInterpreterAPI.py (2239 of 2472) PASS: lldb-unit :: Utility/./UtilityTests/RangeTest.ContainsAddr (2240 of 2472) PASS: lldb-unit :: Process/minidump/./LLDBMinidumpTests/MinidumpParserTest.GetMemoryRegionInfo (2241 of 2472) PASS: lldb-unit :: Utility/./UtilityTests/DataExtractorTest.GetULEB128_bit63 (2242 of 2472) PASS: lldb-unit :: Expression/./ExpressionTests/DWARFExpression.DW_OP_stack_value (2243 of 2472) PASS: lldb-unit :: Utility/./UtilityTests/DataExtractorTest.GetMaxU64 (2244 of 2472) PASS: lldb-shell :: SymbolFile/DWARF/x86/debug_ranges.s (2245 of 2472) PASS: lldb-unit :: Utility/./UtilityTests/BinaryStreamTest.PutULEB128FourBytes (2246 of 2472) PASS: lldb-unit :: Utility/./UtilityTests/ScalarTest.Getters (2247 of 2472) PASS: lldb-shell :: Settings/TestFrameFormatNoColor.test (2248 of 2472) PASS: lldb-unit :: Utility/./UtilityTests/CompletionRequest.FakeLastArg (2249 of 2472) PASS: lldb-unit :: Utility/./UtilityTests/VMRange.SetEndAddress (2250 of 2472) PASS: lldb-api :: commands/frame/recognizer/TestFrameRecognizer.py (2251 of 2472) PASS: lldb-unit :: Process/gdb-remote/./ProcessGdbRemoteTests/GDBRemoteClientBaseTest.SendContinueAndAsyncPacket (2252 of 2472) PASS: lldb-api :: lang/objc/variadic_methods/TestVariadicMethods.py (2253 of 2472) PASS: lldb-unit :: UnwindAssembly/x86/./UnwindAssemblyx86Tests/Testx86AssemblyInspectionEngine.TestSubRSP (2254 of 2472) PASS: lldb-shell :: SymbolFile/DWARF/x86/DW_AT_decl_file-DW_AT_specification-crosscu.s (2255 of 2472) PASS: lldb-api :: tools/lldb-vscode/runInTerminal/TestVSCode_runInTerminal.py (2256 of 2472) PASS: lldb-unit :: SymbolFile/NativePDB/./SymbolFileNativePDBTests/PDBFPOProgramToDWARFExpressionTests.SingleAssignmentRegisterRef (2257 of 2472) PASS: lldb-api :: macosx/debugserver-exit-code/TestDebugServerExitCode.py (2258 of 2472) PASS: lldb-unit :: Utility/./UtilityTests/StreamTest.PutCString (2259 of 2472) PASS: lldb-shell :: SymbolFile/DWARF/x86/DW_AT_location-DW_AT_const_value.s (2260 of 2472) PASS: lldb-api :: lang/c/find_struct_type/TestFindStructTypes.py (2261 of 2472) PASS: lldb-api :: functionalities/data-formatter/format-propagation/TestFormatPropagation.py (2262 of 2472) PASS: lldb-unit :: Core/./LLDBCoreTests/DumpDataExtractorTest.MultiLine (2263 of 2472) PASS: lldb-unit :: UnwindAssembly/x86/./UnwindAssemblyx86Tests/Testx86AssemblyInspectionEngine.TestPushR14 (2264 of 2472) PASS: lldb-unit :: Utility/./UtilityTests/StringListTest.JoinNonSpace (2265 of 2472) PASS: lldb-api :: lang/objc/ptr_refs/TestPtrRefsObjC.py (2266 of 2472) PASS: lldb-unit :: Utility/./UtilityTests/StringExtractorTest.GetHexU8_Underflow2 (2267 of 2472) UNSUPPORTED: lldb-api :: commands/watchpoints/variable_out_of_scope/TestWatchedVarHitWhenInScope.py (2268 of 2472) PASS: lldb-unit :: Symbol/./SymbolTests/TestTypeSystemClang.TestUnifyAccessSpecifiers (2269 of 2472) PASS: lldb-api :: functionalities/thread/exit_during_expression/TestExitDuringExpression.py (2270 of 2472) PASS: lldb-shell :: SymbolFile/DWARF/x86/DW_AT_low_pc-addrx.s (2271 of 2472) UNSUPPORTED: lldb-api :: functionalities/process_save_core/TestProcessSaveCore.py (2272 of 2472) PASS: lldb-api :: lang/cpp/std-function-step-into-callable/TestStdFunctionStepIntoCallable.py (2273 of 2472) PASS: lldb-unit :: Process/Utility/./ProcessUtilityTests/ProcMapTests/LinuxProcMapsTestFixture.ParseMapRegions/5 (2274 of 2472) PASS: lldb-unit :: Language/Highlighting/./HighlighterTests/HighlighterTest.ClangTrailingBackslashMissingNewLine (2275 of 2472) PASS: lldb-api :: lang/cpp/template-specialization-type/TestTemplateSpecializationType.py (2276 of 2472) PASS: lldb-api :: python_api/lldbutil/frame/TestFrameUtils.py (2277 of 2472) PASS: lldb-unit :: Core/./LLDBCoreTests/CommunicationTest.SynchronizeWhileClosing (2278 of 2472) PASS: lldb-unit :: Utility/./UtilityTests/LogTest.Register (2279 of 2472) PASS: lldb-api :: lang/objcxx/objc-builtin-types/TestObjCBuiltinTypes.py (2280 of 2472) PASS: lldb-shell :: Driver/TestSingleQuote.test (2281 of 2472) PASS: lldb-api :: commands/expression/import-std-module/no-std-module/TestMissingStdModule.py (2282 of 2472) PASS: lldb-unit :: Language/CLanguages/./LanguageCLanguagesTests/CLanguages.LookupCLanguagesByLanguageType (2283 of 2472) PASS: lldb-unit :: Utility/./UtilityTests/LogChannelEnabledTest.LogThread (2284 of 2472) PASS: lldb-api :: lang/cpp/incompatible-class-templates/TestCppIncompatibleClassTemplates.py (2285 of 2472) UNSUPPORTED: lldb-api :: functionalities/gdb_remote_client/TestAArch64XMLRegOffsets.py (2286 of 2472) PASS: lldb-shell :: ObjectFile/ELF/section-permissions.yaml (2287 of 2472) PASS: lldb-unit :: Utility/./UtilityTests/StatusTest.Formatv (2288 of 2472) PASS: lldb-api :: lang/objc/objc-new-syntax/TestObjCNewSyntaxDictionary.py (2289 of 2472) PASS: lldb-api :: iohandler/resize/TestIOHandlerResizeNoEditline.py (2290 of 2472) PASS: lldb-unit :: Host/./HostTests/TerminalTest.PipeIsNotATerminal (2291 of 2472) PASS: lldb-unit :: Utility/./UtilityTests/UriParserTest.MinimalPath (2292 of 2472) PASS: lldb-shell :: SymbolFile/Breakpad/line-table-mixed-path-styles.test (2293 of 2472) PASS: lldb-api :: functionalities/data-formatter/synthupdate/TestSyntheticFilterRecompute.py (2294 of 2472) UNSUPPORTED: lldb-shell :: Subprocess/clone-follow-child.test (2295 of 2472) PASS: lldb-shell :: Register/Core/x86-32-freebsd-gp.test (2296 of 2472) UNSUPPORTED: lldb-api :: lang/cpp/function-template-parameter-pack/TestFunctionTemplateParameterPack.py (2297 of 2472) PASS: lldb-unit :: Utility/./UtilityTests/StreamTest.PutSLEB128 (2298 of 2472) PASS: lldb-api :: functionalities/thread/backtrace_limit/TestBacktraceLimit.py (2299 of 2472) PASS: lldb-unit :: Utility/./UtilityTests/DataExtractorTest.GetCStrUnterminated (2300 of 2472) PASS: lldb-api :: functionalities/data-formatter/data-formatter-stl/generic/multiset/TestDataFormatterGenericMultiSet.py (2301 of 2472) UNSUPPORTED: lldb-api :: python_api/watchpoint/watchlocation/TestSetWatchlocation.py (2302 of 2472) PASS: lldb-unit :: Process/gdb-remote/./ProcessGdbRemoteTests/GDBRemoteClientBaseTest.SendContinueAndWait (2303 of 2472) PASS: lldb-api :: functionalities/gdb_remote_client/TestGDBRemotePlatformFile.py (2304 of 2472) PASS: lldb-api :: lang/cpp/this/TestCPPThis.py (2305 of 2472) PASS: lldb-shell :: Quit/TestQuitExitCodeHex0.test (2306 of 2472) PASS: lldb-api :: lang/cpp/static_methods/TestCPPStaticMethods.py (2307 of 2472) PASS: lldb-api :: functionalities/thread/exit_during_step/TestExitDuringStep.py (2308 of 2472) PASS: lldb-shell :: Subprocess/fork-follow-parent.test (2309 of 2472) UNSUPPORTED: lldb-api :: lang/objc/rdar-12408181/TestRdar12408181.py (2310 of 2472) PASS: lldb-unit :: Symbol/./SymbolTests/TestClangASTImporter.MetadataPropagationAfterCopying (2311 of 2472) PASS: lldb-api :: lang/c/step-target/TestStepTarget.py (2312 of 2472) XFAIL: lldb-shell :: Unwind/prefer-debug-over-eh-frame.test (2313 of 2472) UNSUPPORTED: lldb-shell :: SymbolFile/NativePDB/globals-bss.cpp (2314 of 2472) PASS: lldb-shell :: Heap/heap-cstr.test (2315 of 2472) PASS: lldb-unit :: UnwindAssembly/x86/./UnwindAssemblyx86Tests/Testx86AssemblyInspectionEngine.TestPopR14 (2316 of 2472) PASS: lldb-unit :: Utility/./UtilityTests/StringListTest.InsertStringAtIndexEnd (2317 of 2472) PASS: lldb-api :: lang/c/complex_int/TestComplexInt.py (2318 of 2472) PASS: lldb-shell :: Breakpoint/debug_rnglist_offset_pair.test (2319 of 2472) PASS: lldb-unit :: Utility/./UtilityTests/StringExtractorTest.GetHexBytesAvail_Partial (2320 of 2472) PASS: lldb-api :: functionalities/conditional_break/TestConditionalBreak.py (2321 of 2472) PASS: lldb-unit :: Core/./LLDBCoreTests/ModuleSpecTest.InvalidInMemoryBufferValidFile (2322 of 2472) PASS: lldb-api :: commands/expression/scoped_enums/TestScopedEnumType.py (2323 of 2472) UNSUPPORTED: lldb-shell :: ScriptInterpreter/Lua/partial_statements.test (2324 of 2472) PASS: lldb-shell :: Register/Core/x86-32-freebsd-fp.test (2325 of 2472) UNSUPPORTED: lldb-api :: commands/watchpoints/multi_watchpoint_slots/TestWatchpointMultipleSlots.py (2326 of 2472) PASS: lldb-unit :: Utility/./UtilityTests/StringListTest.JoinMultiCharSeparator (2327 of 2472) PASS: lldb-shell :: Minidump/memory-region.yaml (2328 of 2472) PASS: lldb-unit :: Utility/./UtilityTests/ArgsTest.GetArgumentArrayRef (2329 of 2472) PASS: lldb-api :: python_api/disassemble-raw-data/TestDisassembleRawData.py (2330 of 2472) PASS: lldb-unit :: Utility/./UtilityTests/AnsiTerminal.Unknown (2331 of 2472) PASS: lldb-shell :: ScriptInterpreter/None/none.test (2332 of 2472) PASS: lldb-api :: lang/c/complex/TestComplexC99.py (2333 of 2472) PASS: lldb-unit :: Host/./HostTests/HostInfoTest.GetHostname (2334 of 2472) PASS: lldb-unit :: Utility/./UtilityTests/OptionsWithRawTest.EmptyArgsOnlySuffix (2335 of 2472) PASS: lldb-unit :: Host/./HostTests/PipeTest.CreateWithUniqueName (2336 of 2472) PASS: lldb-api :: functionalities/data-formatter/data-formatter-stl/libcxx/unordered/TestDataFormatterUnordered.py (2337 of 2472) PASS: lldb-unit :: Utility/./UtilityTests/StringListTest.AppendListCStringArrayEmpty (2338 of 2472) PASS: lldb-shell :: Reproducer/TestCrash.test (2339 of 2472) PASS: lldb-api :: lang/c/forward/TestForwardDeclaration.py (2340 of 2472) PASS: lldb-unit :: Utility/./UtilityTests/DataExtractorTest.GetSLEB128_bit63 (2341 of 2472) PASS: lldb-shell :: Breakpoint/dummy-target.test (2342 of 2472) PASS: lldb-shell :: ObjectFile/wasm/stripped-debug-sections.yaml (2343 of 2472) PASS: lldb-unit :: Language/Highlighting/./HighlighterTests/HighlighterTest.ClangSquareBrackets (2344 of 2472) PASS: lldb-shell :: Reproducer/TestSynchronous.test (2345 of 2472) PASS: lldb-unit :: Process/Utility/./ProcessUtilityTests/MemoryTagManagerAArch64MTETest.ExpandToGranule (2346 of 2472) PASS: lldb-shell :: SymbolFile/DWARF/DW_AT_range-DW_FORM_sec_offset.s (2347 of 2472) PASS: lldb-api :: lang/cpp/break-on-initializers/TestBreakOnCPP11Initializers.py (2348 of 2472) PASS: lldb-api :: lang/c/bitfields/TestBitfields.py (2349 of 2472) PASS: lldb-unit :: Utility/./UtilityTests/StringListTest.LongestCommonPrefixSingleElement (2350 of 2472) PASS: lldb-api :: functionalities/breakpoint/objc/TestObjCBreakpoints.py (2351 of 2472) PASS: lldb-unit :: Symbol/./SymbolTests/TestClangASTImporter.ImportInvalidType (2352 of 2472) PASS: lldb-api :: commands/command/regex/TestRegexCommand.py (2353 of 2472) UNSUPPORTED: lldb-api :: functionalities/thread/concurrent_events/TestConcurrentCrashWithWatchpointBreakpointSignal.py (2354 of 2472) PASS: lldb-api :: functionalities/inferior-crashing/recursive-inferior/TestRecursiveInferiorStep.py (2355 of 2472) PASS: lldb-api :: functionalities/data-formatter/data-formatter-objc/TestDataFormatterObjCNSDate.py (2356 of 2472) PASS: lldb-unit :: Utility/./UtilityTests/ArgsTest.TestSingleArg (2357 of 2472) PASS: lldb-shell :: Driver/TestTarget.test (2358 of 2472) PASS: lldb-unit :: Core/./LLDBCoreTests/RichManglingContextTest.Basic (2359 of 2472) PASS: lldb-shell :: ObjectFile/PECOFF/invalid-export-table.yaml (2360 of 2472) PASS: lldb-unit :: Utility/./UtilityTests/AnsiTerminal.Empty (2361 of 2472) PASS: lldb-api :: commands/settings/use_source_cache/TestUseSourceCache.py (2362 of 2472) PASS: lldb-unit :: Utility/./UtilityTests/RegularExpression.Valid (2363 of 2472) UNSUPPORTED: lldb-shell :: Subprocess/fork-follow-child-softbp.test (2364 of 2472) UNSUPPORTED: lldb-shell :: SymbolFile/NativePDB/ast-functions-msvc.cpp (2365 of 2472) PASS: lldb-api :: macosx/queues/TestQueues.py (2366 of 2472) PASS: lldb-unit :: ObjectFile/PECOFF/./ObjectFilePECOFFTests/PECallFrameInfoTest.Chained_eh (2367 of 2472) PASS: lldb-unit :: Utility/./UtilityTests/StreamTest.AddressPrefixAndSuffix (2368 of 2472) PASS: lldb-unit :: Utility/./UtilityTests/StreamTest.ChangingByteOrder (2369 of 2472) PASS: lldb-unit :: Symbol/./SymbolTests/PostfixExpression.ParseOneExpression (2370 of 2472) UNSUPPORTED: lldb-api :: functionalities/data-formatter/data-formatter-stl/libstdcpp/tuple/TestDataFormatterStdTuple.py (2371 of 2472) PASS: lldb-shell :: ScriptInterpreter/Python/python.test (2372 of 2472) PASS: lldb-api :: functionalities/postmortem/elf-core/thread_crash/TestLinuxCoreThreads.py (2373 of 2472) PASS: lldb-api :: functionalities/data-formatter/parray/TestPrintArray.py (2374 of 2472) UNSUPPORTED: lldb-shell :: ObjectFile/PECOFF/uuid.yaml (2375 of 2472) PASS: lldb-api :: functionalities/data-formatter/data-formatter-stl/libstdcpp/unique_ptr/invalid/TestDataFormatterInvalidStdUniquePtr.py (2376 of 2472) PASS: lldb-api :: lang/objc/objc-static-method/TestObjCStaticMethod.py (2377 of 2472) UNSUPPORTED: lldb-api :: lang/objc/conflicting-class-list-function-from-user/TestObjCClassListFunctionFromUser.py (2378 of 2472) PASS: lldb-api :: commands/command/container/TestContainerCommands.py (2379 of 2472) PASS: lldb-unit :: Utility/./UtilityTests/StreamTest.PutHex16ByteOrderBig (2380 of 2472) PASS: lldb-api :: lang/cpp/stl/TestSTL.py (2381 of 2472) PASS: lldb-shell :: Process/TestEnvironment.test (2382 of 2472) PASS: lldb-api :: functionalities/postmortem/minidump-new/TestMiniDumpNew.py (2383 of 2472) PASS: lldb-api :: functionalities/data-formatter/data-formatter-stl/generic/multimap/TestDataFormatterGenericMultiMap.py (2384 of 2472) PASS: lldb-shell :: Register/Core/x86-64-freebsd-fp.test (2385 of 2472) PASS: lldb-api :: functionalities/gdb_remote_client/TestThreadSelectionBug.py (2386 of 2472) PASS: lldb-shell :: SymbolFile/DWARF/x86/gnu-style-compression.cpp (2387 of 2472) PASS: lldb-shell :: Commands/command-stop-hook-output.test (2388 of 2472) PASS: lldb-unit :: Core/./LLDBCoreTests/FormatEntityTest.DefinitionConstructionNameAndType (2389 of 2472) PASS: lldb-unit :: Host/./HostTests/MainLoopTest.UnmonitoredSignal (2390 of 2472) UNSUPPORTED: lldb-shell :: ObjectFile/ELF/minidebuginfo-no-lzma.yaml (2391 of 2472) PASS: lldb-unit :: Process/minidump/./LLDBMinidumpTests/MinidumpParserTest.GetMiscInfoWindows (2392 of 2472) PASS: lldb-api :: commands/expression/dont_allow_jit/TestAllowJIT.py (2393 of 2472) PASS: lldb-api :: functionalities/data-formatter/typedef_array/TestTypedefArray.py (2394 of 2472) UNSUPPORTED: lldb-shell :: Process/Windows/exception_access_violation.cpp (2395 of 2472) PASS: lldb-unit :: Utility/./UtilityTests/StreamTest.PutHex32ByteOrderBig (2396 of 2472) PASS: lldb-shell :: ScriptInterpreter/Python/scripted_breakpoint_lua.test (2397 of 2472) PASS: lldb-api :: tools/lldb-server/TestGdbRemoteSingleStep.py (2398 of 2472) PASS: lldb-unit :: Process/Utility/./ProcessUtilityTests/MemoryTagManagerAArch64MTETest.RemoveNonAddressBits (2399 of 2472) PASS: lldb-unit :: Symbol/./SymbolTests/TestTypeSystemMap.GetTypeSystemForLanguageWithInvalidModule (2400 of 2472) PASS: lldb-api :: tools/lldb-vscode/console/TestVSCode_redirection_to_console.py (2401 of 2472) PASS: lldb-unit :: Utility/./UtilityTests/BinaryStreamTest.PutULEB128TwoBytes (2402 of 2472) PASS: lldb-shell :: ScriptInterpreter/Python/Crashlog/no_threadState.test (2403 of 2472) PASS: lldb-unit :: Utility/./UtilityTests/StringListTest.GetMaxStringLengthEqualSize (2404 of 2472) PASS: lldb-api :: macosx/builtin-debugtrap/TestBuiltinDebugTrap.py (2405 of 2472) PASS: lldb-api :: functionalities/float-display/TestFloatDisplay.py (2406 of 2472) PASS: lldb-unit :: Expression/./ExpressionTests/CppModuleConfigurationTest.AmbiguousLibCpp (2407 of 2472) PASS: lldb-shell :: ObjectFile/Breakpad/uuid-matching-mac.test (2408 of 2472) PASS: lldb-unit :: Utility/./UtilityTests/UUIDTest.SetFromStringRef (2409 of 2472) PASS: lldb-unit :: Utility/./UtilityTests/StringExtractorTest.GetHexU8_InvalidHex (2410 of 2472) PASS: lldb-unit :: Process/minidump/./LLDBMinidumpTests/RegisterContextMinidump.CheckRegisterContextMinidump_ARM (2411 of 2472) PASS: lldb-shell :: Commands/command-image-lookup.yaml (2412 of 2472) UNSUPPORTED: lldb-api :: commands/watchpoints/hello_watchlocation/TestWatchLocation.py (2413 of 2472) PASS: lldb-api :: functionalities/data-formatter/ostypeformatting/TestFormattersOsType.py (2414 of 2472) UNSUPPORTED: lldb-shell :: ScriptInterpreter/Lua/breakpoint_function_callback.test (2415 of 2472) PASS: lldb-api :: commands/expression/ir-interpreter-phi-nodes/TestIRInterpreterPHINodes.py (2416 of 2472) PASS: lldb-shell :: Reproducer/TestFileRepro.test (2417 of 2472) PASS: lldb-api :: lang/cpp/namespace_definitions/TestNamespaceDefinitions.py (2418 of 2472) PASS: lldb-shell :: SymbolFile/DWARF/x86/debug_ranges-missing-section.s (2419 of 2472) PASS: lldb-api :: terminal/TestEditline.py (2420 of 2472) PASS: lldb-api :: functionalities/testid/TestTestId.py (2421 of 2472) UNSUPPORTED: lldb-shell :: Register/x86-64-xmm16-write.test (2422 of 2472) PASS: lldb-api :: commands/target/dump/TestTargetDumpTypeSystem.py (2423 of 2472) PASS: lldb-unit :: SymbolFile/DWARF/./SymbolFileDWARFTests/DWARFUnitTest.ClangProducer (2424 of 2472) PASS: lldb-unit :: ScriptInterpreter/Python/./ScriptInterpreterPythonTests/PythonDataObjectsTest.TestPythonBoolean (2425 of 2472) PASS: lldb-unit :: UnwindAssembly/x86/./UnwindAssemblyx86Tests/Testx86AssemblyInspectionEngine.TestStackRealignMSVC_i386 (2426 of 2472) PASS: lldb-unit :: Utility/./UtilityTests/AnsiTerminal.AtStart (2427 of 2472) PASS: lldb-unit :: Utility/./UtilityTests/ArgsTest.TestSingleQuotedArgWithSpace (2428 of 2472) PASS: lldb-api :: functionalities/gdb_remote_client/TestArmRegisterDefinition.py (2429 of 2472) PASS: lldb-unit :: Target/./TargetTests/DynamicRegisterInfoRegisterTest.SetRegisterInfo (2430 of 2472) PASS: lldb-unit :: ScriptInterpreter/Python/./ScriptInterpreterPythonTests/PythonDataObjectsTest.TestPythonDictionaryManipulation (2431 of 2472) PASS: lldb-api :: lang/objc/objc-property/TestObjCProperty.py (2432 of 2472) UNSUPPORTED: lldb-shell :: Unwind/split-machine-functions.test (2433 of 2472) PASS: lldb-unit :: Utility/./UtilityTests/UriParserTest.BracketedHostnameWithPortIPv4 (2434 of 2472) PASS: lldb-unit :: Utility/./UtilityTests/StringListTest.SplitIntoLinesEmpty (2435 of 2472) PASS: lldb-unit :: Utility/./UtilityTests/ScalarTest.Equality (2436 of 2472) PASS: lldb-api :: commands/process/attach-resume/TestAttachResume.py (2437 of 2472) UNSUPPORTED: lldb-shell :: SymbolFile/NativePDB/ast-types.cpp (2438 of 2472) PASS: lldb-api :: commands/expression/import-std-module/vector-bool/TestVectorBoolFromStdModule.py (2439 of 2472) PASS: lldb-api :: lang/objc/objc-new-syntax/TestObjCNewSyntaxArray.py (2440 of 2472) PASS: lldb-unit :: Utility/./UtilityTests/BinaryStreamTest.PutSLEB128EightBytes (2441 of 2472) UNSUPPORTED: lldb-api :: lang/objc/modules-hash-mismatch/TestClangModulesHashMismatch.py (2442 of 2472) PASS: lldb-unit :: Platform/./LLDBPlatformTests/PlatformAppleSimulatorTest.TestHostPlatformToSim (2443 of 2472) PASS: lldb-api :: lang/objc/objc-struct-argument/TestObjCStructArgument.py (2444 of 2472) UNSUPPORTED: lldb-shell :: SymbolFile/PDB/function-level-linking.test (2445 of 2472) PASS: lldb-api :: commands/expression/pr35310/TestExprsBug35310.py (2446 of 2472) PASS: lldb-api :: lang/c/calling-conventions/TestCCallingConventions.py (2447 of 2472) PASS: lldb-unit :: Symbol/./SymbolTests/LineEntryTest.GetSameLineContiguousAddressRangeNestedInline (2448 of 2472) PASS: lldb-shell :: SymbolFile/DWARF/x86/dead-code-filtering.yaml (2449 of 2472) PASS: lldb-api :: macosx/lc-note/firmware-corefile/TestFirmwareCorefiles.py (2450 of 2472) UNSUPPORTED: lldb-api :: linux/sepdebugsymlink/TestTargetSymbolsSepDebugSymlink.py (2451 of 2472) PASS: lldb-api :: functionalities/breakpoint/step_over_breakpoint/TestStepOverBreakpoint.py (2452 of 2472) PASS: lldb-unit :: Utility/./UtilityTests/StringExtractorTest.GetU32BigEndian (2453 of 2472) PASS: lldb-shell :: SymbolFile/DWARF/x86/split-dwarf-inlining.cpp (2454 of 2472) PASS: lldb-unit :: Process/gdb-remote/./ProcessGdbRemoteTests/GDBRemoteCommunicationServerLLGSTest.LLGSArgToURL (2455 of 2472) PASS: lldb-api :: functionalities/gdb_remote_client/TestGDBRemoteLoad.py (2456 of 2472) PASS: lldb-unit :: Host/./HostTests/SocketTests/SocketTest.TCPListen0GetPort/ipv6 (2457 of 2472) UNSUPPORTED: lldb-api :: linux/aarch64/mte_tag_faults/TestAArch64LinuxMTEMemoryTagFaults.py (2458 of 2472) PASS: lldb-api :: functionalities/breakpoint/breakpoint_locations/TestBreakpointLocations.py (2459 of 2472) PASS: lldb-api :: functionalities/tail_call_frames/ambiguous_tail_call_seq2/TestAmbiguousTailCallSeq2.py (2460 of 2472) PASS: lldb-api :: commands/frame/var-scope/TestFrameVariableScope.py (2461 of 2472) PASS: lldb-api :: lang/objc/modules/TestObjCModules.py (2462 of 2472) PASS: lldb-api :: commands/expression/persistent_types/TestNestedPersistentTypes.py (2463 of 2472) PASS: lldb-api :: tools/lldb-server/TestGdbRemoteProcessInfo.py (2464 of 2472) PASS: lldb-api :: functionalities/data-formatter/data-formatter-stl/generic/bitset/TestDataFormatterGenericBitset.py (2465 of 2472) PASS: lldb-api :: lang/c/shared_lib_stripped_symbols/TestSharedLibStrippedSymbols.py (2466 of 2472) PASS: lldb-api :: lang/cpp/template/TestTemplateArgs.py (2467 of 2472) PASS: lldb-api :: functionalities/completion/TestCompletion.py (2468 of 2472) PASS: lldb-api :: types/TestCharTypeExpr.py (2469 of 2472) PASS: lldb-api :: types/TestIntegerType.py (2470 of 2472) PASS: lldb-api :: lang/cpp/virtual-functions/TestCppVirtualFunctions.py (2471 of 2472) PASS: lldb-api :: tools/lldb-server/TestLldbGdbServer.py (2472 of 2472) Slowest Tests: -------------------------------------------------------------------------- 83.04s: lldb-api :: tools/lldb-server/TestLldbGdbServer.py 82.87s: lldb-api :: api/multithreaded/TestMultithreaded.py 71.46s: lldb-api :: commands/process/attach/TestProcessAttach.py 68.21s: lldb-api :: lang/objc/foundation/TestFoundationDisassembly.py 58.02s: lldb-api :: functionalities/load_unload/TestLoadUnload.py 54.26s: lldb-api :: functionalities/completion/TestCompletion.py 47.52s: lldb-api :: lang/objc/hidden-ivars/TestHiddenIvars.py 46.48s: lldb-api :: lang/c/step-target/TestStepTarget.py 42.61s: lldb-api :: types/TestLongTypesExpr.py 40.71s: lldb-api :: lang/cpp/namespace/TestNamespaceLookup.py 40.13s: lldb-api :: lang/objc/exceptions/TestObjCExceptions.py 39.54s: lldb-api :: python_api/target/TestTargetAPI.py 38.60s: lldb-api :: types/TestLongTypes.py 38.35s: lldb-api :: lang/objc/objc-new-syntax/TestObjCNewSyntaxDictionary.py 37.01s: lldb-api :: tools/lldb-vscode/module/TestVSCode_module.py 35.85s: lldb-api :: commands/settings/TestSettings.py 35.62s: lldb-api :: tools/lldb-server/TestGdbRemoteThreadsInStopReply.py 35.62s: lldb-api :: lang/objc/foundation/TestObjCMethods.py 35.12s: lldb-api :: lang/objc/objc-new-syntax/TestObjCNewSyntaxArray.py 33.47s: lldb-api :: functionalities/limit-debug-info/TestLimitDebugInfo.py

Hide Details

Tests Times: -------------------------------------------------------------------------- [ Range ] :: [ Percentage ] :: [ Count ] -------------------------------------------------------------------------- [80.0s,85.0s) :: [ ] :: [ 2/2472] [75.0s,80.0s) :: [ ] :: [ 0/2472] [70.0s,75.0s) :: [ ] :: [ 1/2472] [65.0s,70.0s) :: [ ] :: [ 1/2472] [60.0s,65.0s) :: [ ] :: [ 0/2472] [55.0s,60.0s) :: [ ] :: [ 2/2472] [50.0s,55.0s) :: [ ] :: [ 0/2472] [45.0s,50.0s) :: [ ] :: [ 2/2472] [40.0s,45.0s) :: [ ] :: [ 4/2472] [35.0s,40.0s) :: [ ] :: [ 7/2472] [30.0s,35.0s) :: [ ] :: [ 6/2472] [25.0s,30.0s) :: [ ] :: [ 12/2472] [20.0s,25.0s) :: [ ] :: [ 14/2472] [15.0s,20.0s) :: [ ] :: [ 35/2472] [10.0s,15.0s) :: [* ] :: [ 111/2472] [ 5.0s,10.0s) :: [*** ] :: [ 232/2472] [ 0.0s, 5.0s) :: [********************************* ] :: [2043/2472] -------------------------------------------------------------------------- ******************** Failed Tests (5): lldb-api :: commands/expression/import-std-module/vector-of-vectors/TestVectorOfVectorsFromStdModule.py lldb-api :: commands/expression/import-std-module/vector/TestVectorFromStdModule.py lldb-api :: lang/cpp/modules-import/TestCXXModulesImport.py lldb-api :: lang/objc/modules-compile-error/TestModulesCompileError.py lldb-api :: tools/lldb-vscode/launch/TestVSCode_launch.py

Hide Details

Hide Details

Testing Time: 466.08s Unsupported : 328 Passed : 2130 Expectedly Failed: 9 Failed : 5 FAILED: tools/lldb/test/CMakeFiles/check-lldb cd /Users/buildslave/jenkins/workspace/lldb-cmake-matrix/lldb-build/tools/lldb/test && /usr/local/Frameworks/Python.framework/Versions/3.7/bin/python3.7 /Users/buildslave/jenkins/workspace/lldb-cmake-matrix/lldb-build/./bin/llvm-lit -v --time-tests --shuffle --xunit-xml-output=/Users/buildslave/jenkins/workspace/lldb-cmake-matrix/test/results.xml -v /Users/buildslave/jenkins/workspace/lldb-cmake-matrix/lldb-build/tools/lldb/test ninja: build stopped: subcommand failed. Command failed: Command '['/usr/bin/env', 'TERM=vt100', '/usr/local/bin/ninja', '-v', 'check-lldb']' returned non-zero exit status 1. Command: ['/usr/bin/env', 'TERM=vt100', '/usr/local/bin/ninja', '-v', 'check-lldb'] + set -e [Pipeline] } [Pipeline] // timeout [Pipeline] junit Recording test results [Checks API] No suitable checks publisher found. [Pipeline] } [Pipeline] // stage [Pipeline] } [Pipeline] // withEnv [Pipeline] } [Pipeline] // node [Pipeline] End of Pipeline Finished: UNSTABLE