Console Output

Skipping 183,835 KB.. Full Log
PASS: lldb-unit :: UnwindAssembly/x86/./UnwindAssemblyx86Tests/Testx86AssemblyInspectionEngine.TestPushEDX (2064 of 2487)
PASS: lldb-api :: functionalities/data-formatter/data-formatter-synth/TestDataFormatterSynth.py (2065 of 2487)
PASS: lldb-unit :: Utility/./UtilityTests/StringListTest.JoinThree (2066 of 2487)
UNSUPPORTED: lldb-api :: functionalities/data-formatter/data-formatter-stl/libstdcpp/unique_ptr/TestDataFormatterStdUniquePtr.py (2067 of 2487)
UNSUPPORTED: lldb-shell :: Subprocess/vfork-follow-child-softbp.test (2068 of 2487)
PASS: lldb-unit :: Utility/./UtilityTests/StreamTest.PutHex32ByteOrderLittle (2069 of 2487)
UNSUPPORTED: lldb-shell :: SymbolFile/PDB/expressions.test (2070 of 2487)
PASS: lldb-unit :: Utility/./UtilityTests/EventTest.DumpEventDataBytes (2071 of 2487)
PASS: lldb-api :: functionalities/breakpoint/cpp/TestCPPBreakpointLocations.py (2072 of 2487)
PASS: lldb-api :: lang/cpp/scratch-context-merging/structs/TestCppScratchContextMergingStructs.py (2073 of 2487)
PASS: lldb-api :: commands/expression/import-std-module/basic/TestImportStdModule.py (2074 of 2487)
PASS: lldb-unit :: debugserver/./debugserverTests/RNBSocket.LoopBackListenIPv4 (2075 of 2487)
PASS: lldb-unit :: Expression/./ExpressionTests/CppModuleConfigurationTest.LibCppV2 (2076 of 2487)
PASS: lldb-api :: lang/objc/forward-decl/TestForwardDecl.py (2077 of 2487)
UNSUPPORTED: lldb-api :: functionalities/thread/multi_break/TestMultipleBreakpoints.py (2078 of 2487)
PASS: lldb-unit :: Utility/./UtilityTests/ProcessInstanceInfo.Dump (2079 of 2487)
PASS: lldb-api :: functionalities/data-formatter/data-formatter-stl/libcxx/atomic/TestLibCxxAtomic.py (2080 of 2487)
PASS: lldb-api :: tools/lldb-server/thread-name/TestGdbRemoteThreadName.py (2081 of 2487)
PASS: lldb-unit :: Utility/./UtilityTests/StringExtractorTest.DecodeHexU8_Extra (2082 of 2487)
PASS: lldb-api :: python_api/value/empty_class/TestValueAPIEmptyClass.py (2083 of 2487)
PASS: lldb-unit :: UnwindAssembly/x86/./UnwindAssemblyx86Tests/Testx86AssemblyInspectionEngine.TestPushR13 (2084 of 2487)
PASS: lldb-api :: lang/objc/modules-auto-import/TestModulesAutoImport.py (2085 of 2487)
PASS: lldb-api :: functionalities/thread/exit_during_expression/TestExitDuringExpression.py (2086 of 2487)
PASS: lldb-api :: commands/command/nested_alias/TestNestedAlias.py (2087 of 2487)
PASS: lldb-unit :: Host/./HostTests/TerminalTest.SetCanonical (2088 of 2487)
PASS: lldb-unit :: Disassembler/./DisassemblerTests/TestArmv7Disassembly.TestCortexFPDisass (2089 of 2487)
PASS: lldb-shell :: ObjectFile/MachO/symtab.yaml (2090 of 2487)
PASS: lldb-api :: commands/reproducer/invalid-args/TestInvalidArgsReproducer.py (2091 of 2487)
PASS: lldb-shell :: ObjectFile/PECOFF/basic-info-arm64.yaml (2092 of 2487)
PASS: lldb-api :: functionalities/lazy-loading/TestLazyLoading.py (2093 of 2487)
PASS: lldb-unit :: Expression/./ExpressionTests/DiagnosticManagerTest.GetStringMultipleDiags (2094 of 2487)
UNSUPPORTED: lldb-shell :: Subprocess/vfork-follow-child-wp.test (2095 of 2487)
PASS: lldb-api :: lang/cpp/limit-debug-info/TestWithLimitDebugInfo.py (2096 of 2487)
PASS: lldb-api :: lang/objc/modules-compile-error/TestModulesCompileError.py (2097 of 2487)
PASS: lldb-unit :: Host/./HostTests/TerminalTest.SetHardwareFlowControl (2098 of 2487)
PASS: lldb-api :: lang/objc/complete-type-check/TestObjCIsTypeComplete.py (2099 of 2487)
UNSUPPORTED: lldb-shell :: SymbolFile/NativePDB/ast-methods.cpp (2100 of 2487)
PASS: lldb-unit :: Host/./HostTests/MainLoopTest.UnmonitoredSignal (2101 of 2487)
PASS: lldb-api :: lang/objc/objc-struct-argument/TestObjCStructArgument.py (2102 of 2487)
PASS: lldb-unit :: UnwindAssembly/x86/./UnwindAssemblyx86Tests/Testx86AssemblyInspectionEngine.TestDisassemblyMidFunctionEpilogues (2103 of 2487)
PASS: lldb-unit :: Utility/./UtilityTests/Flags.Test (2104 of 2487)
PASS: lldb-unit :: Utility/./UtilityTests/ArchSpecTest.TripleComponentsWereSpecified (2105 of 2487)
UNSUPPORTED: lldb-api :: functionalities/thread/concurrent_events/TestConcurrentBreakpointsDelayedBreakpointOneWatchpoint.py (2106 of 2487)
PASS: lldb-unit :: UnwindAssembly/x86/./UnwindAssemblyx86Tests/Testx86AssemblyInspectionEngine.TestPopRBP (2107 of 2487)
PASS: lldb-unit :: Utility/./UtilityTests/RangeTest.Slide (2108 of 2487)
PASS: lldb-unit :: Utility/./UtilityTests/UriParserTest.SchemeHostSeparator (2109 of 2487)
PASS: lldb-unit :: UnwindAssembly/x86/./UnwindAssemblyx86Tests/Testx86AssemblyInspectionEngine.TestPushRBPWithREX (2110 of 2487)
UNSUPPORTED: lldb-api :: functionalities/process_save_core/TestProcessSaveCore.py (2111 of 2487)
PASS: lldb-shell :: SymbolFile/DWARF/x86/debug-types-line-tables.s (2112 of 2487)
PASS: lldb-unit :: Symbol/./SymbolTests/TestClangASTImporter.RecordLayout (2113 of 2487)
PASS: lldb-api :: functionalities/data-formatter/array_typedef/TestArrayTypedef.py (2114 of 2487)
PASS: lldb-unit :: Utility/./UtilityTests/SerializationRountripTest.SerializeDeserializeCStringArrayNullptrElem (2115 of 2487)
PASS: lldb-api :: functionalities/data-formatter/data-formatter-smart-array/TestDataFormatterSmartArray.py (2116 of 2487)
PASS: lldb-api :: lang/c/cpp_keyword_identifiers/TestCppKeywordsAsCIdentifiers.py (2117 of 2487)
PASS: lldb-api :: functionalities/gdb_remote_client/TestPartialGPacket.py (2118 of 2487)
PASS: lldb-unit :: Utility/./UtilityTests/AnsiTerminal.Empty (2119 of 2487)
PASS: lldb-unit :: Utility/./UtilityTests/StreamTest.PutHex32ByteOrderBig (2120 of 2487)
PASS: lldb-unit :: Utility/./UtilityTests/BinaryStreamTest.PutSLEB128TwoBytes (2121 of 2487)
PASS: lldb-unit :: ObjectFile/MachO/./ObjectFileMachOTests/ObjectFileMachOTest.ModuleFromSharedCacheInfo (2122 of 2487)
PASS: lldb-shell :: SymbolFile/DWARF/clang-ast-from-dwarf-objc-property.m (2123 of 2487)
PASS: lldb-shell :: Register/Core/x86-64-freebsd-addr.test (2124 of 2487)
PASS: lldb-api :: types/TestFloatTypes.py (2125 of 2487)
PASS: lldb-api :: types/TestFloatTypesExpr.py (2126 of 2487)
PASS: lldb-api :: tools/lldb-vscode/launch/TestVSCode_launch.py (2127 of 2487)
PASS: lldb-unit :: Utility/./UtilityTests/StringListTest.InsertStringAtIndexEnd (2128 of 2487)
PASS: lldb-unit :: Host/./HostTests/TerminalTest.SetParity (2129 of 2487)
PASS: lldb-api :: assert_messages_test/TestAssertMessages.py (2130 of 2487)
PASS: lldb-api :: lang/cpp/default-template-args/TestDefaultTemplateArgs.py (2131 of 2487)
PASS: lldb-unit :: SymbolFile/NativePDB/./SymbolFileNativePDBTests/PDBFPOProgramToDWARFExpressionTests.UnsupportedRASearch (2132 of 2487)
PASS: lldb-unit :: Symbol/./SymbolTests/TestTypeSystemClang.TestGetEnumIntegerTypeUnexpectedType (2133 of 2487)
PASS: lldb-api :: functionalities/breakpoint/breakpoint_command/TestBreakpointCommand.py (2134 of 2487)
PASS: lldb-unit :: Host/./HostTests/FileSystemTest.MakeAbsolute (2135 of 2487)
PASS: lldb-api :: commands/target/stop-hook/enable/TestTargetStopHookEnable.py (2136 of 2487)
PASS: lldb-unit :: Utility/./UtilityTests/StreamTeeTest.Constructor2Streams (2137 of 2487)
PASS: lldb-unit :: Utility/./UtilityTests/ArgsTest.TestUnknownEscape (2138 of 2487)
UNSUPPORTED: lldb-shell :: SymbolFile/NativePDB/locate-pdb.cpp (2139 of 2487)
PASS: lldb-shell :: Minidump/memory-region-from-module.yaml (2140 of 2487)
PASS: lldb-unit :: Editline/./EditlineTests/EditlineTestFixture.EditlineReceivesMultiLineText (2141 of 2487)
UNSUPPORTED: lldb-api :: commands/expression/completion-crash-invalid-iterator/TestInvalidIteratorCompletionCrash.py (2142 of 2487)
PASS: lldb-unit :: Utility/./UtilityTests/ArgsTest.ReplaceArgumentAtIndexFarOutOfRange (2143 of 2487)
PASS: lldb-unit :: Utility/./UtilityTests/StreamTeeTest.SetStreamAtIndexOutOfBounds (2144 of 2487)
UNSUPPORTED: lldb-api :: lang/objc/modules-update/TestClangModulesUpdate.py (2145 of 2487)
PASS: lldb-api :: functionalities/data-formatter/data-formatter-stl/libcxx/initializerlist/TestInitializerList.py (2146 of 2487)
PASS: lldb-unit :: Symbol/./SymbolTests/TestCreateClassTemplateDecl.FindExistingTemplatesWithParameterPack (2147 of 2487)
UNSUPPORTED: lldb-api :: linux/aarch64/unwind_signal/TestUnwindSignal.py (2148 of 2487)
PASS: lldb-unit :: Process/minidump/./LLDBMinidumpTests/MinidumpParserTest.GetMemoryRegionInfoFromMemory64List (2149 of 2487)
PASS: lldb-shell :: ObjectFile/Breakpad/sections.test (2150 of 2487)
PASS: lldb-unit :: Utility/./UtilityTests/BinaryStreamTest.PutSLEB128OneByte (2151 of 2487)
PASS: lldb-unit :: Utility/./UtilityTests/EnvironmentTest.EnvpConversion (2152 of 2487)
UNSUPPORTED: lldb-api :: python_api/watchpoint/TestSetWatchpoint.py (2153 of 2487)
PASS: lldb-api :: lang/cpp/break-on-initializers/TestBreakOnCPP11Initializers.py (2154 of 2487)
UNSUPPORTED: lldb-api :: functionalities/asan/TestReportData.py (2155 of 2487)
PASS: lldb-api :: commands/breakpoint/set/func-regex/TestBreakpointRegexError.py (2156 of 2487)
PASS: lldb-shell :: Register/Core/x86-64-netbsd-fp.test (2157 of 2487)
PASS: lldb-api :: commands/process/signal/TestProcessSignal.py (2158 of 2487)
PASS: lldb-unit :: Process/minidump/./LLDBMinidumpTests/MinidumpParserTest.MinidumpDuplicateModuleMappedSecond (2159 of 2487)
PASS: lldb-unit :: UnwindAssembly/ARM64/./Arm64InstEmulationTests/TestArm64InstEmulation.TestMediumDarwinFunction (2160 of 2487)
PASS: lldb-api :: lang/cpp/this_class_type_mixing/TestThisClassTypeMixing.py (2161 of 2487)
UNSUPPORTED: lldb-api :: macosx/posix_spawn/TestLaunchProcessPosixSpawn.py (2162 of 2487)
PASS: lldb-api :: functionalities/postmortem/wow64_minidump/TestWow64MiniDump.py (2163 of 2487)
PASS: lldb-api :: functionalities/unwind/noreturn/TestNoreturnUnwind.py (2164 of 2487)
PASS: lldb-api :: lang/objc/objc-new-syntax/TestObjCNewSyntaxArray.py (2165 of 2487)
UNSUPPORTED: lldb-shell :: Subprocess/fork-follow-child-softbp.test (2166 of 2487)
UNSUPPORTED: lldb-api :: functionalities/ptrauth_diagnostics/LDRAA_error/TestPtrauthLDRAADiagnostic.py (2167 of 2487)
PASS: lldb-api :: lang/cpp/function-local-class/TestCppFunctionLocalClass.py (2168 of 2487)
PASS: lldb-unit :: SymbolFile/NativePDB/./SymbolFileNativePDBTests/PDBFPOProgramToDWARFExpressionTests.UnresolvedRegisterAssignmentReference (2169 of 2487)
PASS: lldb-api :: functionalities/gdb_remote_client/TestFork.py (2170 of 2487)
PASS: lldb-unit :: Utility/./UtilityTests/StreamTest.PutRawBytesToMixedEndian (2171 of 2487)
PASS: lldb-unit :: Utility/./UtilityTests/GeneratorTest.Get (2172 of 2487)
UNSUPPORTED: lldb-api :: functionalities/unwind/ehframe/TestEhFrameUnwind.py (2173 of 2487)
PASS: lldb-unit :: Utility/./UtilityTests/Flags.GetBitSize (2174 of 2487)
PASS: lldb-unit :: Process/minidump/./LLDBMinidumpTests/MinidumpParserTest.FindMemoryRangeWithFullMemoryMinidump (2175 of 2487)
PASS: lldb-api :: commands/expression/call-function/TestCallUserDefinedFunction.py (2176 of 2487)
PASS: lldb-unit :: Utility/./UtilityTests/NameMatchesTest.EndsWith (2177 of 2487)
PASS: lldb-shell :: Register/Core/x86-32-freebsd-fp.test (2178 of 2487)
PASS: lldb-shell :: ObjectFile/PECOFF/invalid-export-table.yaml (2179 of 2487)
PASS: lldb-api :: functionalities/data-formatter/poarray/TestPrintObjectArray.py (2180 of 2487)
PASS: lldb-unit :: Utility/./UtilityTests/ArgsTest.TestArgv (2181 of 2487)
PASS: lldb-api :: lang/cpp/overloaded-functions/TestOverloadedFunctions.py (2182 of 2487)
PASS: lldb-unit :: Utility/./UtilityTests/UriParserTest.SchemeHostSeparator4 (2183 of 2487)
PASS: lldb-api :: functionalities/postmortem/elf-core/TestLinuxCore.py (2184 of 2487)
PASS: lldb-shell :: Driver/TestTarget.test (2185 of 2487)
PASS: lldb-api :: functionalities/step_scripted/TestStepScripted.py (2186 of 2487)
PASS: lldb-unit :: Process/minidump/./LLDBMinidumpTests/MinidumpParserTest.GetThreadContext_x86_32 (2187 of 2487)
PASS: lldb-api :: commands/expression/test/TestExprs.py (2188 of 2487)
PASS: lldb-api :: commands/gui/invalid-args/TestInvalidArgsGui.py (2189 of 2487)
PASS: lldb-unit :: Process/gdb-remote/./ProcessGdbRemoteTests/PortMapTest.AllowPort (2190 of 2487)
PASS: lldb-unit :: Process/minidump/./LLDBMinidumpTests/MinidumpParserTest.GetLinuxProcStatus_no_stream (2191 of 2487)
PASS: lldb-api :: functionalities/breakpoint/debugbreak/TestDebugBreak.py (2192 of 2487)
PASS: lldb-api :: functionalities/tail_call_frames/cross_object/TestCrossObjectTailCalls.py (2193 of 2487)
PASS: lldb-unit :: SymbolFile/NativePDB/./SymbolFileNativePDBTests/PDBFPOProgramToDWARFExpressionTests.InvalidAssignmentSingle (2194 of 2487)
PASS: lldb-unit :: Utility/./UtilityTests/StringExtractorTest.GetNameColonValueNoColon (2195 of 2487)
PASS: lldb-unit :: ScriptInterpreter/Python/./ScriptInterpreterPythonTests/PythonDataObjectsTest.TestOwnedReferences (2196 of 2487)
PASS: lldb-unit :: Disassembler/./DisassemblerTests/TestArm64Disassembly.TestArmv81Instruction (2197 of 2487)
PASS: lldb-api :: commands/frame/diagnose/dereference-this/TestDiagnoseDereferenceThis.py (2198 of 2487)
PASS: lldb-unit :: ScriptInterpreter/Python/./ScriptInterpreterPythonTests/PythonDataObjectsTest.TestPythonDictionaryManipulation (2199 of 2487)
UNSUPPORTED: lldb-api :: linux/sepdebugsymlink/TestTargetSymbolsSepDebugSymlink.py (2200 of 2487)
PASS: lldb-api :: functionalities/gdb_remote_client/TestGDBRemotePlatformFile.py (2201 of 2487)
PASS: lldb-unit :: Core/./LLDBCoreTests/FormatEntityTest.DefinitionConstructionNameAndString (2202 of 2487)
PASS: lldb-unit :: ObjectFile/Breakpad/./ObjectFileBreakpadTests/LineRecord.parse (2203 of 2487)
PASS: lldb-unit :: Utility/./UtilityTests/AnsiTerminal.Incomplete (2204 of 2487)
PASS: lldb-unit :: Utility/./UtilityTests/FileSpecTest.Yaml (2205 of 2487)
PASS: lldb-shell :: SymbolFile/DWARF/x86/gnu-style-compression.cpp (2206 of 2487)
PASS: lldb-shell :: ObjectFile/ELF/PT_LOAD-overlap-section.yaml (2207 of 2487)
PASS: lldb-unit :: UnwindAssembly/x86/./UnwindAssemblyx86Tests/Testx86AssemblyInspectionEngine.Test32BitOnlyInstruction (2208 of 2487)
PASS: lldb-unit :: Host/./HostTests/NativeProcessProtocolTest.SetBreakpointFailVerify (2209 of 2487)
PASS: lldb-api :: commands/expression/ignore-artificial-constructors/TestIgnoreArtificialConstructors.py (2210 of 2487)
PASS: lldb-shell :: ScriptInterpreter/Python/command_relative_import.test (2211 of 2487)
PASS: lldb-unit :: Utility/./UtilityTests/StringExtractorTest.GetNameColonValueNoSemicolon (2212 of 2487)
PASS: lldb-unit :: Utility/./UtilityTests/StringExtractorGDBRemoteTest.GetPidTid (2213 of 2487)
PASS: lldb-unit :: Utility/./UtilityTests/StreamTest.AddressSuffix (2214 of 2487)
PASS: lldb-shell :: Commands/command-script-import.test (2215 of 2487)
PASS: lldb-unit :: Symbol/./SymbolTests/TestTypeSystemClang.TestGetTypeClassTypeOf (2216 of 2487)
PASS: lldb-unit :: Process/gdb-remote/./ProcessGdbRemoteTests/PortMapTest.FreePort (2217 of 2487)
UNSUPPORTED: lldb-api :: functionalities/ptrauth_diagnostics/BRAA_error/TestPtrauthBRAADiagnostic.py (2218 of 2487)
PASS: lldb-unit :: Utility/./UtilityTests/SerializationRountripTest.SerializeDeserializeObjectReference (2219 of 2487)
PASS: lldb-unit :: Host/./HostTests/SocketTests/SocketTest.TCPGetAddress/ipv6 (2220 of 2487)
UNSUPPORTED: lldb-api :: functionalities/thread/concurrent_events/TestConcurrentDelayedCrashWithBreakpointWatchpoint.py (2221 of 2487)
PASS: lldb-unit :: Utility/./UtilityTests/OptionsWithRawTest.WhitespaceInput (2222 of 2487)
PASS: lldb-unit :: Language/Highlighting/./HighlighterTests/HighlighterTest.ClangCursorPosAfterOtherToken (2223 of 2487)
PASS: lldb-unit :: Expression/./ExpressionTests/ClangExpressionDeclMapTest.TestUnknownIdentifierLookup (2224 of 2487)
PASS: lldb-api :: functionalities/float-display/TestFloatDisplay.py (2225 of 2487)
PASS: lldb-unit :: Utility/./UtilityTests/StringExtractorTest.GetHexBytesAvail_OddPair2 (2226 of 2487)
PASS: lldb-unit :: Utility/./UtilityTests/FileSpecTest.EqualDotsPosixRoot (2227 of 2487)
PASS: lldb-shell :: ScriptInterpreter/None/import_module.test (2228 of 2487)
UNSUPPORTED: lldb-shell :: SymbolFile/DWARF/debug-types-expressions.test (2229 of 2487)
UNSUPPORTED: lldb-shell :: Subprocess/clone-follow-parent-wp.test (2230 of 2487)
PASS: lldb-unit :: Utility/./UtilityTests/StreamTest.AddressRange (2231 of 2487)
PASS: lldb-unit :: debugserver/./debugserverTests/RNBSocket.LoopBackConnectIPv6 (2232 of 2487)
PASS: lldb-unit :: Utility/./UtilityTests/RecordReplayTest.InvalidSequence (2233 of 2487)
UNSUPPORTED: lldb-api :: functionalities/tsan/thread_leak/TestTsanThreadLeak.py (2234 of 2487)
PASS: lldb-unit :: Process/./ProcessEventDataTests/ProcessEventDataTest.DoOnRemoval (2235 of 2487)
UNSUPPORTED: lldb-api :: python_api/event/TestEvents.py (2236 of 2487)
PASS: lldb-api :: python_api/function_symbol/TestDisasmAPI.py (2237 of 2487)
PASS: lldb-api :: functionalities/optimized_code/TestNoASanExceptionAfterEvalOP_piece.py (2238 of 2487)
PASS: lldb-unit :: Utility/./UtilityTests/LogChannelTest.Disable (2239 of 2487)
PASS: lldb-unit :: UnwindAssembly/x86/./UnwindAssemblyx86Tests/Testx86AssemblyInspectionEngine.TestPopR15 (2240 of 2487)
PASS: lldb-api :: lang/objc/foundation/TestSymbolTable.py (2241 of 2487)
PASS: lldb-api :: python_api/function_symbol/TestSymbolAPI.py (2242 of 2487)
PASS: lldb-api :: functionalities/launch_stop_at_entry/TestStopAtEntry.py (2243 of 2487)
PASS: lldb-unit :: Host/./HostTests/FileSystemTest.Resolve (2244 of 2487)
PASS: lldb-shell :: SymbolFile/Breakpad/unwind-via-stack-win.test (2245 of 2487)
PASS: lldb-api :: functionalities/breakpoint/objc/TestObjCBreakpoints.py (2246 of 2487)
XFAIL: lldb-shell :: Register/x86-mm-xmm-write.test (2247 of 2487)
PASS: lldb-api :: lang/objc/foundation/TestObjCMethods.py (2248 of 2487)
PASS: lldb-unit :: Utility/./UtilityTests/StringListTest.SplitIntoLinesSingleTrailingCR (2249 of 2487)
PASS: lldb-unit :: UnwindAssembly/x86/./UnwindAssemblyx86Tests/Testx86AssemblyInspectionEngine.TestLEAVE (2250 of 2487)
PASS: lldb-shell :: ObjectFile/Breakpad/sections-trailing-func.test (2251 of 2487)
PASS: lldb-api :: lang/cpp/accelerator-table/TestCPPAccelerator.py (2252 of 2487)
PASS: lldb-api :: python_api/value/linked_list/TestValueAPILinkedList.py (2253 of 2487)
PASS: lldb-api :: functionalities/recursion/TestValueObjectRecursion.py (2254 of 2487)
PASS: lldb-unit :: Utility/./UtilityTests/UUIDTest.RelationalOperators (2255 of 2487)
PASS: lldb-unit :: SymbolFile/DWARF/./SymbolFileDWARFTests/SymbolFileDWARFTests.ParseArangesSkipErrors (2256 of 2487)
PASS: lldb-unit :: Utility/./UtilityTests/PassiveReplayTest.InstrumentedFoo (2257 of 2487)
PASS: lldb-api :: lang/c/complex/TestComplexC99.py (2258 of 2487)
PASS: lldb-api :: functionalities/inferior-crashing/TestInferiorCrashingStep.py (2259 of 2487)
PASS: lldb-shell :: Register/Core/x86-32-linux-gp.test (2260 of 2487)
PASS: lldb-api :: functionalities/data-formatter/nsdictionarysynth/TestNSDictionarySynthetic.py (2261 of 2487)
PASS: lldb-shell :: ObjectFile/wasm/basic.yaml (2262 of 2487)
PASS: lldb-api :: tools/lldb-vscode/coreFile/TestVSCode_coreFile.py (2263 of 2487)
PASS: lldb-unit :: Utility/./UtilityTests/StringExtractorTest.InitEmpty (2264 of 2487)
PASS: lldb-api :: functionalities/object-file/TestImageListMultiArchitecture.py (2265 of 2487)
PASS: lldb-unit :: Signals/./SignalsTests/UnixSignalsTest.GetFilteredSignals (2266 of 2487)
PASS: lldb-unit :: Utility/./UtilityTests/UriParserTest.BracketedHostnameWithPortIPv6 (2267 of 2487)
PASS: lldb-api :: commands/expression/two-files/TestObjCTypeQueryFromOtherCompileUnit.py (2268 of 2487)
PASS: lldb-api :: functionalities/data-formatter/data-formatter-script/TestDataFormatterScript.py (2269 of 2487)
PASS: lldb-api :: lang/cpp/global_operators/TestCppGlobalOperators.py (2270 of 2487)
UNSUPPORTED: lldb-api :: lang/objc/modules-incomplete/TestIncompleteModules.py (2271 of 2487)
PASS: lldb-unit :: Core/./LLDBCoreTests/DumpDataExtractorTest.NullStream (2272 of 2487)
UNSUPPORTED: lldb-shell :: ScriptInterpreter/Lua/breakpoint_function_callback.test (2273 of 2487)
PASS: lldb-unit :: Utility/./UtilityTests/StringExtractorTest.GetHexU8_Underflow2_NoEof (2274 of 2487)
UNSUPPORTED: lldb-shell :: SymbolFile/NativePDB/s_constant.cpp (2275 of 2487)
PASS: lldb-unit :: Utility/./UtilityTests/DataExtractorTest.GetULEB128_bit63 (2276 of 2487)
PASS: lldb-api :: lang/objc/objc-runtime-ivars/TestRuntimeIvars.py (2277 of 2487)
PASS: lldb-api :: lang/objc/direct-dispatch-step/TestObjCDirectDispatchStepping.py (2278 of 2487)
PASS: lldb-api :: macosx/dyld-trie-symbols/TestDyldTrieSymbols.py (2279 of 2487)
PASS: lldb-shell :: Minidump/Windows/Sigsegv/sigsegv.test (2280 of 2487)
PASS: lldb-unit :: Utility/./UtilityTests/RecordReplayTest.InstrumentedBarPtr (2281 of 2487)
PASS: lldb-shell :: Reproducer/TestPythonImport.test (2282 of 2487)
PASS: lldb-unit :: Utility/./UtilityTests/RangeVector.CombineConsecutiveRanges (2283 of 2487)
PASS: lldb-unit :: Platform/./LLDBPlatformTests/PlatformDarwinTest.GetCompatibleArchARMv7k (2284 of 2487)
PASS: lldb-api :: python_api/process/io/TestProcessIO.py (2285 of 2487)
PASS: lldb-api :: functionalities/breakpoint/breakpoint_by_file_colon_line/TestBreakpointByFileColonLine.py (2286 of 2487)
PASS: lldb-shell :: ObjectFile/ELF/PT_TLS-overlap-PT_LOAD.yaml (2287 of 2487)
PASS: lldb-unit :: Process/minidump/./LLDBMinidumpTests/MinidumpParserTest.GetLinuxProcStatus (2288 of 2487)
PASS: lldb-api :: functionalities/data-formatter/parray/TestPrintArray.py (2289 of 2487)
UNSUPPORTED: lldb-shell :: Register/x86-64-xmm16-write.test (2290 of 2487)
PASS: lldb-api :: functionalities/data-formatter/format-propagation/TestFormatPropagation.py (2291 of 2487)
PASS: lldb-unit :: Utility/./UtilityTests/UriParserTest.BracketedHostnameWithPortIPv4 (2292 of 2487)
PASS: lldb-api :: python_api/get-value-32bit-int/TestGetValue32BitInt.py (2293 of 2487)
PASS: lldb-unit :: Utility/./UtilityTests/StringExtractorTest.GetU32BigEndian (2294 of 2487)
PASS: lldb-unit :: Utility/./UtilityTests/DataExtractorTest.PeekData (2295 of 2487)
PASS: lldb-unit :: Utility/./UtilityTests/TimeoutTest.Construction (2296 of 2487)
UNSUPPORTED: lldb-shell :: Register/x86-ymm-write.test (2297 of 2487)
UNSUPPORTED: lldb-shell :: SymbolFile/NativePDB/global-classes.cpp (2298 of 2487)
PASS: lldb-api :: functionalities/data-formatter/data-formatter-categories/TestDataFormatterCategories.py (2299 of 2487)
PASS: lldb-api :: lang/c/local_variables/TestLocalVariables.py (2300 of 2487)
PASS: lldb-api :: python_api/class_members/TestSBTypeClassMembers.py (2301 of 2487)
PASS: lldb-unit :: Utility/./UtilityTests/ScalarTest.CastOperations (2302 of 2487)
PASS: lldb-shell :: SymbolFile/DWARF/x86/find-qualified-variable.cpp (2303 of 2487)
PASS: lldb-api :: functionalities/breakpoint/breakpoint_locations/TestBreakpointLocations.py (2304 of 2487)
PASS: lldb-api :: commands/expression/po_verbosity/TestPoVerbosity.py (2305 of 2487)
PASS: lldb-unit :: Utility/./UtilityTests/XcodeSDKTest.FindXcodeContentsDirectoryInPath (2306 of 2487)
PASS: lldb-unit :: Utility/./UtilityTests/LogTest.Register (2307 of 2487)
UNSUPPORTED: lldb-api :: functionalities/thread/concurrent_events/TestConcurrentSignalNWatchNBreak.py (2308 of 2487)
PASS: lldb-api :: functionalities/data-formatter/data-formatter-stl/libcxx/queue/TestDataFormatterLibcxxQueue.py (2309 of 2487)
PASS: lldb-api :: commands/expression/context-object/TestContextObject.py (2310 of 2487)
PASS: lldb-unit :: Language/Highlighting/./HighlighterTests/HighlighterTest.ClangStringLiterals (2311 of 2487)
UNSUPPORTED: lldb-api :: functionalities/thread/concurrent_events/TestConcurrentCrashWithWatchpointBreakpointSignal.py (2312 of 2487)
PASS: lldb-unit :: Utility/./UtilityTests/RangeTest.ClearWithStarAddress (2313 of 2487)
PASS: lldb-unit :: Utility/./UtilityTests/StreamTest.PutMaxHex64ByteOrderLittle (2314 of 2487)
PASS: lldb-api :: functionalities/breakpoint/scripted_bkpt/TestScriptedResolver.py (2315 of 2487)
PASS: lldb-api :: functionalities/thread/ignore_suspended/TestIgnoreSuspendedThread.py (2316 of 2487)
PASS: lldb-api :: commands/frame/diagnose/local-variable/TestLocalVariable.py (2317 of 2487)
PASS: lldb-api :: functionalities/data-formatter/data-formatter-objc/TestDataFormatterObjCNSData.py (2318 of 2487)
PASS: lldb-unit :: Symbol/./SymbolTests/TestTypeSystemClang.TestGetBasicTypeFromName (2319 of 2487)
PASS: lldb-api :: commands/expression/import-std-module/forward_decl_from_module/TestForwardDeclFromStdModule.py (2320 of 2487)
PASS: lldb-unit :: Utility/./UtilityTests/ListenerTest.GetEventWait (2321 of 2487)
PASS: lldb-api :: lang/cpp/static_members/TestCPPStaticMembers.py (2322 of 2487)
UNSUPPORTED: lldb-api :: functionalities/tsan/multiple/TestTsanMultiple.py (2323 of 2487)
UNSUPPORTED: lldb-shell :: SymbolFile/PDB/ast-restore.test (2324 of 2487)
PASS: lldb-unit :: UnwindAssembly/x86/./UnwindAssemblyx86Tests/Testx86AssemblyInspectionEngine.TestReturnDetect (2325 of 2487)
PASS: lldb-unit :: Expression/./ExpressionTests/DWARFExpression.DW_OP_pick (2326 of 2487)
PASS: lldb-unit :: Utility/./UtilityTests/UriParserTest.PortOverflow (2327 of 2487)
PASS: lldb-unit :: Utility/./UtilityTests/ScalarTest.GetValue (2328 of 2487)
PASS: lldb-unit :: Utility/./UtilityTests/GeneratorTest.YamlMultiProvider (2329 of 2487)
UNSUPPORTED: lldb-shell :: SymbolFile/DWARF/x86/find-basic-type.cpp (2330 of 2487)
PASS: lldb-unit :: Signals/./SignalsTests/UnixSignalsTest.GetInfo (2331 of 2487)
UNSUPPORTED: lldb-api :: python_api/watchpoint/TestWatchpointIter.py (2332 of 2487)
PASS: lldb-unit :: Utility/./UtilityTests/RangeDataVector.FindEntryThatContains_Overlap (2333 of 2487)
PASS: lldb-api :: functionalities/gdb_remote_client/TestAArch64XMLRegOffsets.py (2334 of 2487)
PASS: lldb-api :: lang/objcxx/hide-runtime-values/TestObjCXXHideRuntimeValues.py (2335 of 2487)
PASS: lldb-unit :: ObjectFile/Breakpad/./ObjectFileBreakpadTests/FuncRecord.parse (2336 of 2487)
PASS: lldb-unit :: Target/./TargetTests/PathMappingListTest.AbsoluteTests (2337 of 2487)
PASS: lldb-unit :: Utility/./UtilityTests/RegisterValueTest.GetSet8 (2338 of 2487)
UNSUPPORTED: lldb-api :: functionalities/thread/thread_specific_break_plus_condition/TestThreadSpecificBpPlusCondition.py (2339 of 2487)
PASS: lldb-unit :: Utility/./UtilityTests/LogChannelEnabledTest.LogGetLogThread (2340 of 2487)
PASS: lldb-unit :: Utility/./UtilityTests/StreamTest.AddressRangeEmptyRange (2341 of 2487)
PASS: lldb-unit :: Language/Highlighting/./HighlighterTests/HighlighterTest.ClangTrailingBackslashBeforeNewline (2342 of 2487)
PASS: lldb-api :: commands/expression/timeout/TestCallWithTimeout.py (2343 of 2487)
PASS: lldb-unit :: Utility/./UtilityTests/SubsystemRAIITest.SubsystemWithErrorSuccess (2344 of 2487)
PASS: lldb-unit :: Utility/./UtilityTests/ProcessInstanceInfo.DumpTable (2345 of 2487)
XFAIL: lldb-shell :: Register/x86-64-ymm-write.test (2346 of 2487)
PASS: lldb-unit :: Utility/./UtilityTests/SerializationRountripTest.SerializeDeserializeObjectPointer (2347 of 2487)
PASS: lldb-shell :: Breakpoint/jit-loader_jitlink_elf.test (2348 of 2487)
PASS: lldb-api :: commands/thread/select/TestThreadSelect.py (2349 of 2487)
PASS: lldb-unit :: Process/Utility/./ProcessUtilityTests/ProcMapTests/LinuxProcMapsTestFixture.ParseMapRegions/6 (2350 of 2487)
PASS: lldb-unit :: Utility/./UtilityTests/Flags.AnyClear (2351 of 2487)
PASS: lldb-shell :: ObjectFile/ELF/section-permissions.yaml (2352 of 2487)
PASS: lldb-api :: lang/cpp/namespace/TestNamespace.py (2353 of 2487)
PASS: lldb-api :: commands/command/script/TestCommandScript.py (2354 of 2487)
PASS: lldb-api :: tools/lldb-vscode/correct-thread/TestVSCode_correct_thread.py (2355 of 2487)
PASS: lldb-api :: functionalities/rerun/TestRerun.py (2356 of 2487)
PASS: lldb-api :: commands/settings/TestSettings.py (2357 of 2487)
PASS: lldb-shell :: SymbolFile/Breakpad/stack-cfi-parsing.test (2358 of 2487)
PASS: lldb-unit :: Symbol/./SymbolTests/DWARFCallFrameInfoTest.Basic_eh (2359 of 2487)
PASS: lldb-api :: source-manager/TestSourceManager.py (2360 of 2487)
PASS: lldb-unit :: DataFormatter/./LLDBFormatterTests/TypeMatcherTests.CreatedBySameMatchStringExactNamePrefixes (2361 of 2487)
PASS: lldb-unit :: tools/lldb-server/tests/./LLDBServerTests/TestBase.LaunchModePreservesEnvironment (2362 of 2487)
PASS: lldb-unit :: Utility/./UtilityTests/RangeTest.LessThan (2363 of 2487)
UNSUPPORTED: lldb-shell :: Unwind/unwind-plan-dwarf-dump.test (2364 of 2487)
PASS: lldb-unit :: Utility/./UtilityTests/VMRange.Reset (2365 of 2487)
PASS: lldb-api :: commands/expression/entry-bp/TestExprEntryBP.py (2366 of 2487)
PASS: lldb-api :: python_api/lldbutil/iter/TestLLDBIterator.py (2367 of 2487)
PASS: lldb-api :: lang/cpp/incomplete-types/TestCppIncompleteTypes.py (2368 of 2487)
PASS: lldb-api :: functionalities/gdb_remote_client/TestNoGPacketSupported.py (2369 of 2487)
PASS: lldb-api :: commands/expression/import-std-module/forward_list/TestForwardListFromStdModule.py (2370 of 2487)
PASS: lldb-unit :: DataFormatter/./LLDBFormatterTests/StringPrinterTests.SwiftUTF8 (2371 of 2487)
UNSUPPORTED: lldb-shell :: ObjectFile/PECOFF/export-dllfunc.yaml (2372 of 2487)
PASS: lldb-api :: commands/expression/completion-crash-incomplete-record/TestCompletionCrashIncompleteRecord.py (2373 of 2487)
PASS: lldb-unit :: Utility/./UtilityTests/DataExtractorTest.GetBitfield (2374 of 2487)
PASS: lldb-unit :: UnwindAssembly/x86/./UnwindAssemblyx86Tests/Testx86AssemblyInspectionEngine.TestPushEBX (2375 of 2487)
PASS: lldb-unit :: Utility/./UtilityTests/ArchSpecTest.MergeFromMachOUnknown (2376 of 2487)
PASS: lldb-api :: commands/expression/ir-interpreter-phi-nodes/TestIRInterpreterPHINodes.py (2377 of 2487)
PASS: lldb-unit :: Language/Highlighting/./HighlighterTests/HighlighterTest.ClangCommas (2378 of 2487)
PASS: lldb-api :: functionalities/data-formatter/frameformat_smallstruct/TestFrameFormatSmallStruct.py (2379 of 2487)
PASS: lldb-api :: functionalities/breakpoint/breakpoint_ids/TestBreakpointIDs.py (2380 of 2487)
PASS: lldb-unit :: UnwindAssembly/ARM64/./Arm64InstEmulationTests/TestArm64InstEmulation.TestFramelessThreeEpilogueFunction (2381 of 2487)
PASS: lldb-unit :: Utility/./UtilityTests/StreamTest.ShiftOperatorChars (2382 of 2487)
UNSUPPORTED: lldb-shell :: SymbolFile/NativePDB/ast-functions-msvc.cpp (2383 of 2487)
PASS: lldb-unit :: Utility/./UtilityTests/RangeTest.ContainsRange (2384 of 2487)
PASS: lldb-unit :: Utility/./UtilityTests/PassiveReplayTest.InstrumentedBarPtr (2385 of 2487)
PASS: lldb-unit :: SymbolFile/NativePDB/./SymbolFileNativePDBTests/PDBFPOProgramToDWARFExpressionTests.MissingTargetRegister (2386 of 2487)
PASS: lldb-api :: commands/expression/import-std-module/forward_list-dbg-info-content/TestDbgInfoContentForwardListFromStdModule.py (2387 of 2487)
PASS: lldb-unit :: Utility/./UtilityTests/AnsiTerminal.WhiteSpace (2388 of 2487)
PASS: lldb-unit :: Utility/./UtilityTests/UriParserTest.BracketedHostnameWithColon (2389 of 2487)
PASS: lldb-api :: lang/cpp/global_variables/TestCPPGlobalVariables.py (2390 of 2487)
PASS: lldb-api :: lang/c/strings/TestCStrings.py (2391 of 2487)
PASS: lldb-api :: commands/gui/expand-threads-tree/TestGuiExpandThreadsTree.py (2392 of 2487)
PASS: lldb-unit :: Utility/./UtilityTests/XcodeSDKTest.ParseTest (2393 of 2487)
PASS: lldb-unit :: Utility/./UtilityTests/StringListTest.GetMaxStringLengthEmpty (2394 of 2487)
PASS: lldb-unit :: Host/./HostTests/ProcessLaunchInfoTest.Constructor (2395 of 2487)
PASS: lldb-api :: tools/lldb-server/inferior-crash/TestGdbRemoteSegFault.py (2396 of 2487)
UNSUPPORTED: lldb-shell :: SymbolFile/DWARF/x86/win-i386-line-table.s (2397 of 2487)
PASS: lldb-api :: commands/help/TestHelp.py (2398 of 2487)
PASS: lldb-unit :: Language/Highlighting/./HighlighterTests/HighlighterTest.ClangEmptyInput (2399 of 2487)
PASS: lldb-unit :: Utility/./UtilityTests/StringListTest.LongestCommonPrefixNoPrefix (2400 of 2487)
PASS: lldb-unit :: Utility/./UtilityTests/RangeTest.ContainsAddrInvalid (2401 of 2487)
PASS: lldb-unit :: Utility/./UtilityTests/UriParserTest.BracketedHostnamePort (2402 of 2487)
PASS: lldb-shell :: Register/x86-64-gp-read.test (2403 of 2487)
PASS: lldb-api :: lang/cpp/diamond/TestCppDiamond.py (2404 of 2487)
PASS: lldb-api :: tools/lldb-server/TestGdbRemote_qThreadStopInfo.py (2405 of 2487)
UNSUPPORTED: lldb-shell :: Subprocess/clone-follow-child-wp.test (2406 of 2487)
PASS: lldb-api :: commands/platform/sdk/TestPlatformSDK.py (2407 of 2487)
PASS: lldb-unit :: Utility/./UtilityTests/BinaryStreamTest.PutSLEB128SixBytes (2408 of 2487)
PASS: lldb-unit :: Utility/./UtilityTests/StatusTest.Formatv (2409 of 2487)
PASS: lldb-unit :: ObjectFile/Breakpad/./ObjectFileBreakpadTests/ModuleRecord.parse (2410 of 2487)
PASS: lldb-unit :: Utility/./UtilityTests/ArgsTest.ReplaceArgumentAtIndexEqual (2411 of 2487)
PASS: lldb-api :: lang/cpp/unicode-literals/TestUnicodeLiterals.py (2412 of 2487)
PASS: lldb-api :: lang/cpp/function-qualifiers/TestCppFunctionQualifiers.py (2413 of 2487)
PASS: lldb-api :: functionalities/gdb_remote_client/TestRegDefinitionInParts.py (2414 of 2487)
PASS: lldb-unit :: Utility/./UtilityTests/UriParserTest.MinimalPort (2415 of 2487)
UNSUPPORTED: lldb-api :: commands/expression/import_builtin_fileid/TestImportBuiltinFileID.py (2416 of 2487)
PASS: lldb-unit :: Symbol/./SymbolTests/TestCreateClassTemplateDecl.FindExistingTemplates (2417 of 2487)
PASS: lldb-api :: lang/cpp/chained-calls/TestCppChainedCalls.py (2418 of 2487)
PASS: lldb-api :: lang/cpp/trivial_abi/TestTrivialABI.py (2419 of 2487)
PASS: lldb-unit :: Utility/./UtilityTests/VMRange.ContainsAddr (2420 of 2487)
PASS: lldb-api :: functionalities/data-formatter/synthupdate/TestSyntheticFilterRecompute.py (2421 of 2487)
PASS: lldb-unit :: Utility/./UtilityTests/OptionsWithRawTest.ArgsButNoLeadingDash (2422 of 2487)
PASS: lldb-unit :: Utility/./UtilityTests/StringListTest.AppendListCStringArray (2423 of 2487)
PASS: lldb-unit :: Utility/./UtilityTests/OptionsWithRawTest.EmptySuffix (2424 of 2487)
UNSUPPORTED: lldb-shell :: SymbolFile/PDB/type-quals.test (2425 of 2487)
UNSUPPORTED: lldb-api :: tools/lldb-server/registers-target-xml-reading/TestGdbRemoteTargetXmlPacket.py (2426 of 2487)
PASS: lldb-shell :: Quit/TestQuitExitCodeTooManyArgs.test (2427 of 2487)
PASS: lldb-api :: commands/expression/import-std-module/vector/TestVectorFromStdModule.py (2428 of 2487)
PASS: lldb-api :: commands/expression/import_base_class_when_class_has_derived_member/TestImportBaseClassWhenClassHasDerivedMember.py (2429 of 2487)
PASS: lldb-unit :: Expression/./ExpressionTests/CppModuleConfigurationTest.LinuxTargetSpecificInclude (2430 of 2487)
PASS: lldb-unit :: Utility/./UtilityTests/ArgsTest.GetArgumentArrayRef (2431 of 2487)
UNSUPPORTED: lldb-shell :: SymbolFile/target-symbols-add-unwind.test (2432 of 2487)
PASS: lldb-unit :: debugserver/./debugserverTests/RNBSocket.LoopBackConnectIPv4 (2433 of 2487)
PASS: lldb-unit :: Expression/./ExpressionTests/DiagnosticManagerTest.AppendMessageNoDiag (2434 of 2487)
PASS: lldb-unit :: Utility/./UtilityTests/Predicate.WaitForValueEqualTo (2435 of 2487)
UNSUPPORTED: lldb-shell :: Subprocess/clone-follow-parent-softbp.test (2436 of 2487)
PASS: lldb-unit :: Utility/./UtilityTests/BroadcasterTest.EventTypeHasListeners (2437 of 2487)
PASS: lldb-unit :: Utility/./UtilityTests/RangeTest.DoesIntersect (2438 of 2487)
PASS: lldb-api :: commands/expression/call-throws/TestCallThatThrows.py (2439 of 2487)
PASS: lldb-api :: lang/cpp/char1632_t/TestChar1632T.py (2440 of 2487)
UNSUPPORTED: lldb-api :: benchmarks/continue/TestBenchmarkContinue.py (2441 of 2487)
PASS: lldb-api :: functionalities/breakpoint/breakpoint_options/TestBreakpointOptions.py (2442 of 2487)
PASS: lldb-unit :: Thread/./ThreadTests/ThreadTest.SetStopInfo (2443 of 2487)
UNSUPPORTED: lldb-api :: linux/aarch64/mte_memory_region/TestAArch64LinuxMTEMemoryRegion.py (2444 of 2487)
PASS: lldb-api :: api/multiple-debuggers/TestMultipleDebuggers.py (2445 of 2487)
PASS: lldb-api :: functionalities/gdb_remote_client/TestProcessConnect.py (2446 of 2487)
UNSUPPORTED: lldb-api :: commands/watchpoints/watchpoint_on_vectors/TestValueOfVectorVariable.py (2447 of 2487)
PASS: lldb-unit :: UnwindAssembly/x86/./UnwindAssemblyx86Tests/Testx86AssemblyInspectionEngine.TestAddESP (2448 of 2487)
PASS: lldb-unit :: Platform/Android/./AdbClientTests/AdbClientTest.CreateByDeviceId (2449 of 2487)
PASS: lldb-unit :: Utility/./UtilityTests/OptionsWithRawTest.EmptyArgsOnlySuffix (2450 of 2487)
UNSUPPORTED: lldb-api :: functionalities/breakpoint/breakpoint_in_delayslot/TestAvoidBreakpointInDelaySlot.py (2451 of 2487)
PASS: lldb-api :: functionalities/breakpoint/breakpoint_hit_count/TestBreakpointHitCount.py (2452 of 2487)
PASS: lldb-unit :: Expression/./ExpressionTests/CppModuleConfigurationTest.AmbiguousCLib (2453 of 2487)
PASS: lldb-api :: functionalities/gdb_remote_client/TestStopPCs.py (2454 of 2487)
PASS: lldb-unit :: Utility/./UtilityTests/RangeTest.Copy (2455 of 2487)
PASS: lldb-api :: lang/cpp/typeof/TestTypeOfDeclTypeExpr.py (2456 of 2487)
PASS: lldb-api :: macosx/debugserver-exit-code/TestDebugServerExitCode.py (2457 of 2487)
PASS: lldb-api :: functionalities/data-formatter/cstring-utf8-summary/TestCstringUnicode.py (2458 of 2487)
PASS: lldb-api :: functionalities/thread/concurrent_events/TestConcurrentDelayedCrashWithBreakpointSignal.py (2459 of 2487)
PASS: lldb-unit :: UnwindAssembly/x86/./UnwindAssemblyx86Tests/Testx86AssemblyInspectionEngine.TestSimple64bitFrameFunction (2460 of 2487)
PASS: lldb-unit :: Utility/./UtilityTests/BinaryStreamTest.PutULEB128TwoBytes (2461 of 2487)
PASS: lldb-unit :: Symbol/./SymbolTests/DWARFCallFrameInfoTest.Basic_dwarf3 (2462 of 2487)
PASS: lldb-unit :: DataFormatter/./LLDBFormatterTests/TypeMatcherTests.ExactName (2463 of 2487)
PASS: lldb-unit :: Utility/./UtilityTests/RangeTest.SizeTypes (2464 of 2487)
PASS: lldb-shell :: Minidump/memory-region.yaml (2465 of 2487)
PASS: lldb-api :: functionalities/data-formatter/data-formatter-objc/TestDataFormatterObjCPlain.py (2466 of 2487)
UNSUPPORTED: lldb-api :: functionalities/thread/concurrent_events/TestConcurrentSignalWatch.py (2467 of 2487)
PASS: lldb-shell :: ObjectFile/wasm/unified-debug-sections.yaml (2468 of 2487)
PASS: lldb-api :: functionalities/dlopen_other_executable/TestDlopenOtherExecutable.py (2469 of 2487)
PASS: lldb-unit :: Utility/./UtilityTests/LogChannelTest.EnableOptions (2470 of 2487)
PASS: lldb-unit :: Symbol/./SymbolTests/TestTypeSystemClang.GetExeModuleWhenMissingSymbolFile (2471 of 2487)
PASS: lldb-unit :: Host/./HostTests/TerminalTest.SetRaw (2472 of 2487)
PASS: lldb-api :: api/check_public_api_headers/TestPublicAPIHeaders.py (2473 of 2487)
PASS: lldb-api :: commands/expression/radar_9531204/TestPrintfAfterUp.py (2474 of 2487)
PASS: lldb-api :: commands/expression/persistent_types/TestNestedPersistentTypes.py (2475 of 2487)
PASS: lldb-api :: functionalities/tail_call_frames/cross_dso/TestCrossDSOTailCalls.py (2476 of 2487)
PASS: lldb-api :: commands/expression/import-std-module/module-build-errors/TestStdModuleBuildErrors.py (2477 of 2487)
PASS: lldb-api :: commands/expression/rdar44436068/Test128BitsInteger.py (2478 of 2487)
PASS: lldb-api :: functionalities/tail_call_frames/disambiguate_tail_call_seq/TestDisambiguateTailCallSeq.py (2479 of 2487)
PASS: lldb-api :: functionalities/data-formatter/data-formatter-stl/libcxx/vbool/TestDataFormatterLibcxxVBool.py (2480 of 2487)
PASS: lldb-api :: functionalities/data-formatter/data-formatter-stl/generic/list/TestDataFormatterGenericList.py (2481 of 2487)
PASS: lldb-api :: python_api/exprpath_synthetic/TestExprPathSynthetic.py (2482 of 2487)
PASS: lldb-api :: python_api/thread/TestThreadAPI.py (2483 of 2487)
PASS: lldb-api :: commands/expression/import-std-module/queue/TestQueueFromStdModule.py (2484 of 2487)
PASS: lldb-api :: types/TestIntegerTypeExpr.py (2485 of 2487)
PASS: lldb-api :: lang/objc/objc-new-syntax/TestObjCNewSyntaxLiteral.py (2486 of 2487)
FAIL: lldb-api :: tools/lldb-server/TestLldbGdbServer.py (2487 of 2487)
******************** TEST 'lldb-api :: tools/lldb-server/TestLldbGdbServer.py' FAILED ********************
Script:
--
/usr/local/Frameworks/Python.framework/Versions/3.7/bin/python3.7 /Users/buildslave/jenkins/workspace/lldb-cmake-matrix/llvm-project/lldb/test/API/dotest.py -u CXXFLAGS -u CFLAGS --codesign-identity lldb_codesign --arch x86_64 --build-dir /Users/buildslave/jenkins/workspace/lldb-cmake-matrix/lldb-build/lldb-test-build.noindex -t --env TERM=vt100 --skip-category gmodules --skip-category watchpoint --arch=x86_64 --env LLVM_LIBS_DIR=/Users/buildslave/jenkins/workspace/lldb-cmake-matrix/lldb-build/./lib --arch x86_64 --build-dir /Users/buildslave/jenkins/workspace/lldb-cmake-matrix/lldb-build/lldb-test-build.noindex --lldb-module-cache-dir /Users/buildslave/jenkins/workspace/lldb-cmake-matrix/lldb-build/lldb-test-build.noindex/module-cache-lldb/lldb-api --clang-module-cache-dir /Users/buildslave/jenkins/workspace/lldb-cmake-matrix/lldb-build/lldb-test-build.noindex/module-cache-clang/lldb-api --executable /Users/buildslave/jenkins/workspace/lldb-cmake-matrix/lldb-build/./bin/lldb --compiler /Users/buildslave/jenkins/workspace/lldb-cmake-matrix/clang_1300_build/bin/clang --dsymutil /Users/buildslave/jenkins/workspace/lldb-cmake-matrix/lldb-build/./bin/dsymutil --llvm-tools-dir /Users/buildslave/jenkins/workspace/lldb-cmake-matrix/lldb-build/./bin --lldb-libs-dir /Users/buildslave/jenkins/workspace/lldb-cmake-matrix/lldb-build/./lib /Users/buildslave/jenkins/workspace/lldb-cmake-matrix/llvm-project/lldb/test/API/tools/lldb-server -p TestLldbGdbServer.py
--
Exit Code: 1

Hide Details

Command Output (stdout): -- lldb version 14.0.99 (http://labmaster3.local/git/llvm-project.git revision 13278efd0c95a8b589bbd7dbbf17680a03b6eb77) clang revision 13278efd0c95a8b589bbd7dbbf17680a03b6eb77 llvm revision 13278efd0c95a8b589bbd7dbbf17680a03b6eb77 Skipping the following test categories: ['gmodules', 'watchpoint', 'libstdcxx', 'dwo', 'llgs', 'fork']

Hide Details

-- Command Output (stderr): -- Change dir to: /Users/buildslave/jenkins/workspace/lldb-cmake-matrix/llvm-project/lldb/test/API/tools/lldb-server make VPATH=/Users/buildslave/jenkins/workspace/lldb-cmake-matrix/llvm-project/lldb/test/API/tools/lldb-server -C /Users/buildslave/jenkins/workspace/lldb-cmake-matrix/lldb-build/lldb-test-build.noindex/tools/lldb-server/TestLldbGdbServer.test_Hc_then_Csignal_signals_correct_thread_launch_debugserver -I /Users/buildslave/jenkins/workspace/lldb-cmake-matrix/llvm-project/lldb/test/API/tools/lldb-server -I /Users/buildslave/jenkins/workspace/lldb-cmake-matrix/llvm-project/lldb/packages/Python/lldbsuite/test/make -f /Users/buildslave/jenkins/workspace/lldb-cmake-matrix/llvm-project/lldb/test/API/tools/lldb-server/Makefile all ARCH=x86_64 'CC="/Users/buildslave/jenkins/workspace/lldb-cmake-matrix/clang_1300_build/bin/clang"' DSYMUTIL=/Users/buildslave/jenkins/workspace/lldb-cmake-matrix/lldb-build/./bin/dsymutil CODESIGN=codesign CLANG_MODULE_CACHE_DIR=/Users/buildslave/jenkins/workspace/lldb-cmake-matrix/lldb-build/lldb-test-build.noindex/module-cache-clang/lldb-api

Hide Details

"/Users/buildslave/jenkins/workspace/lldb-cmake-matrix/clang_1300_build/bin/clang" -std=c++11 -g -O0 -fno-builtin -isysroot "/Applications/Xcode.app/Contents/Developer/Platforms/MacOSX.platform/Developer/SDKs/MacOSX10.15.sdk" -arch x86_64 -I/Users/buildslave/jenkins/workspace/lldb-cmake-matrix/llvm-project/lldb/packages/Python/lldbsuite/test/make/../../../../../include -I/Users/buildslave/jenkins/workspace/lldb-cmake-matrix/llvm-project/lldb/test/API/tools/lldb-server -I/Users/buildslave/jenkins/workspace/lldb-cmake-matrix/llvm-project/lldb/packages/Python/lldbsuite/test/make -include /Users/buildslave/jenkins/workspace/lldb-cmake-matrix/llvm-project/lldb/packages/Python/lldbsuite/test/make/test_common.h -fno-limit-debug-info -D__STDC_LIMIT_MACROS -D__STDC_FORMAT_MACROS --driver-mode=g++ -MT main.o -MD -MP -MF main.d -c -o main.o /Users/buildslave/jenkins/workspace/lldb-cmake-matrix/llvm-project/lldb/test/API/tools/lldb-server/main.cpp "/Users/buildslave/jenkins/workspace/lldb-cmake-matrix/clang_1300_build/bin/clang" main.o -g -O0 -fno-builtin -isysroot "/Applications/Xcode.app/Contents/Developer/Platforms/MacOSX.platform/Developer/SDKs/MacOSX10.15.sdk" -arch x86_64 -I/Users/buildslave/jenkins/workspace/lldb-cmake-matrix/llvm-project/lldb/packages/Python/lldbsuite/test/make/../../../../../include -I/Users/buildslave/jenkins/workspace/lldb-cmake-matrix/llvm-project/lldb/test/API/tools/lldb-server -I/Users/buildslave/jenkins/workspace/lldb-cmake-matrix/llvm-project/lldb/packages/Python/lldbsuite/test/make -include /Users/buildslave/jenkins/workspace/lldb-cmake-matrix/llvm-project/lldb/packages/Python/lldbsuite/test/make/test_common.h -fno-limit-debug-info -D__STDC_LIMIT_MACROS -D__STDC_FORMAT_MACROS --driver-mode=g++ -o "a.out" codesign -s - "a.out"

Hide Details

Hide Details

XFAIL: LLDB (/Users/buildslave/jenkins/workspace/lldb-cmake-matrix/clang_1300_build/bin/clang-x86_64) :: test_Hc_then_Csignal_signals_correct_thread_launch_debugserver (TestLldbGdbServer.LldbGdbServerTestCase) UNSUPPORTED: LLDB (/Users/buildslave/jenkins/workspace/lldb-cmake-matrix/clang_1300_build/bin/clang-x86_64) :: test_Hc_then_Csignal_signals_correct_thread_launch_llgs (TestLldbGdbServer.LldbGdbServerTestCase) (test case does not fall in any category of interest for this run) UNSUPPORTED: LLDB (/Users/buildslave/jenkins/workspace/lldb-cmake-matrix/clang_1300_build/bin/clang-x86_64) :: test_Hg_fails_on_another_pid_llgs (TestLldbGdbServer.LldbGdbServerTestCase) (test case does not fall in any category of interest for this run) UNSUPPORTED: LLDB (/Users/buildslave/jenkins/workspace/lldb-cmake-matrix/clang_1300_build/bin/clang-x86_64) :: test_Hg_fails_on_minus_one_pid_llgs (TestLldbGdbServer.LldbGdbServerTestCase) (test case does not fall in any category of interest for this run) UNSUPPORTED: LLDB (/Users/buildslave/jenkins/workspace/lldb-cmake-matrix/clang_1300_build/bin/clang-x86_64) :: test_Hg_fails_on_zero_pid_llgs (TestLldbGdbServer.LldbGdbServerTestCase) (test case does not fall in any category of interest for this run) make VPATH=/Users/buildslave/jenkins/workspace/lldb-cmake-matrix/llvm-project/lldb/test/API/tools/lldb-server -C /Users/buildslave/jenkins/workspace/lldb-cmake-matrix/lldb-build/lldb-test-build.noindex/tools/lldb-server/TestLldbGdbServer.test_Hg_switches_to_3_threads_attach_debugserver -I /Users/buildslave/jenkins/workspace/lldb-cmake-matrix/llvm-project/lldb/test/API/tools/lldb-server -I /Users/buildslave/jenkins/workspace/lldb-cmake-matrix/llvm-project/lldb/packages/Python/lldbsuite/test/make -f /Users/buildslave/jenkins/workspace/lldb-cmake-matrix/llvm-project/lldb/test/API/tools/lldb-server/Makefile all ARCH=x86_64 'CC="/Users/buildslave/jenkins/workspace/lldb-cmake-matrix/clang_1300_build/bin/clang"' DSYMUTIL=/Users/buildslave/jenkins/workspace/lldb-cmake-matrix/lldb-build/./bin/dsymutil CODESIGN=codesign CLANG_MODULE_CACHE_DIR=/Users/buildslave/jenkins/workspace/lldb-cmake-matrix/lldb-build/lldb-test-build.noindex/module-cache-clang/lldb-api

Hide Details

"/Users/buildslave/jenkins/workspace/lldb-cmake-matrix/clang_1300_build/bin/clang" -std=c++11 -g -O0 -fno-builtin -isysroot "/Applications/Xcode.app/Contents/Developer/Platforms/MacOSX.platform/Developer/SDKs/MacOSX10.15.sdk" -arch x86_64 -I/Users/buildslave/jenkins/workspace/lldb-cmake-matrix/llvm-project/lldb/packages/Python/lldbsuite/test/make/../../../../../include -I/Users/buildslave/jenkins/workspace/lldb-cmake-matrix/llvm-project/lldb/test/API/tools/lldb-server -I/Users/buildslave/jenkins/workspace/lldb-cmake-matrix/llvm-project/lldb/packages/Python/lldbsuite/test/make -include /Users/buildslave/jenkins/workspace/lldb-cmake-matrix/llvm-project/lldb/packages/Python/lldbsuite/test/make/test_common.h -fno-limit-debug-info -D__STDC_LIMIT_MACROS -D__STDC_FORMAT_MACROS --driver-mode=g++ -MT main.o -MD -MP -MF main.d -c -o main.o /Users/buildslave/jenkins/workspace/lldb-cmake-matrix/llvm-project/lldb/test/API/tools/lldb-server/main.cpp "/Users/buildslave/jenkins/workspace/lldb-cmake-matrix/clang_1300_build/bin/clang" main.o -g -O0 -fno-builtin -isysroot "/Applications/Xcode.app/Contents/Developer/Platforms/MacOSX.platform/Developer/SDKs/MacOSX10.15.sdk" -arch x86_64 -I/Users/buildslave/jenkins/workspace/lldb-cmake-matrix/llvm-project/lldb/packages/Python/lldbsuite/test/make/../../../../../include -I/Users/buildslave/jenkins/workspace/lldb-cmake-matrix/llvm-project/lldb/test/API/tools/lldb-server -I/Users/buildslave/jenkins/workspace/lldb-cmake-matrix/llvm-project/lldb/packages/Python/lldbsuite/test/make -include /Users/buildslave/jenkins/workspace/lldb-cmake-matrix/llvm-project/lldb/packages/Python/lldbsuite/test/make/test_common.h -fno-limit-debug-info -D__STDC_LIMIT_MACROS -D__STDC_FORMAT_MACROS --driver-mode=g++ -o "a.out" codesign -s - "a.out"

Hide Details

Hide Details

PASS: LLDB (/Users/buildslave/jenkins/workspace/lldb-cmake-matrix/clang_1300_build/bin/clang-x86_64) :: test_Hg_switches_to_3_threads_attach_debugserver (TestLldbGdbServer.LldbGdbServerTestCase) UNSUPPORTED: LLDB (/Users/buildslave/jenkins/workspace/lldb-cmake-matrix/clang_1300_build/bin/clang-x86_64) :: test_Hg_switches_to_3_threads_attach_llgs (TestLldbGdbServer.LldbGdbServerTestCase) (test case does not fall in any category of interest for this run) UNSUPPORTED: LLDB (/Users/buildslave/jenkins/workspace/lldb-cmake-matrix/clang_1300_build/bin/clang-x86_64) :: test_Hg_switches_to_3_threads_attach_pass_correct_pid_llgs (TestLldbGdbServer.LldbGdbServerTestCase) (test case does not fall in any category of interest for this run) make VPATH=/Users/buildslave/jenkins/workspace/lldb-cmake-matrix/llvm-project/lldb/test/API/tools/lldb-server -C /Users/buildslave/jenkins/workspace/lldb-cmake-matrix/lldb-build/lldb-test-build.noindex/tools/lldb-server/TestLldbGdbServer.test_Hg_switches_to_3_threads_launch_debugserver -I /Users/buildslave/jenkins/workspace/lldb-cmake-matrix/llvm-project/lldb/test/API/tools/lldb-server -I /Users/buildslave/jenkins/workspace/lldb-cmake-matrix/llvm-project/lldb/packages/Python/lldbsuite/test/make -f /Users/buildslave/jenkins/workspace/lldb-cmake-matrix/llvm-project/lldb/test/API/tools/lldb-server/Makefile all ARCH=x86_64 'CC="/Users/buildslave/jenkins/workspace/lldb-cmake-matrix/clang_1300_build/bin/clang"' DSYMUTIL=/Users/buildslave/jenkins/workspace/lldb-cmake-matrix/lldb-build/./bin/dsymutil CODESIGN=codesign CLANG_MODULE_CACHE_DIR=/Users/buildslave/jenkins/workspace/lldb-cmake-matrix/lldb-build/lldb-test-build.noindex/module-cache-clang/lldb-api

Hide Details

"/Users/buildslave/jenkins/workspace/lldb-cmake-matrix/clang_1300_build/bin/clang" -std=c++11 -g -O0 -fno-builtin -isysroot "/Applications/Xcode.app/Contents/Developer/Platforms/MacOSX.platform/Developer/SDKs/MacOSX10.15.sdk" -arch x86_64 -I/Users/buildslave/jenkins/workspace/lldb-cmake-matrix/llvm-project/lldb/packages/Python/lldbsuite/test/make/../../../../../include -I/Users/buildslave/jenkins/workspace/lldb-cmake-matrix/llvm-project/lldb/test/API/tools/lldb-server -I/Users/buildslave/jenkins/workspace/lldb-cmake-matrix/llvm-project/lldb/packages/Python/lldbsuite/test/make -include /Users/buildslave/jenkins/workspace/lldb-cmake-matrix/llvm-project/lldb/packages/Python/lldbsuite/test/make/test_common.h -fno-limit-debug-info -D__STDC_LIMIT_MACROS -D__STDC_FORMAT_MACROS --driver-mode=g++ -MT main.o -MD -MP -MF main.d -c -o main.o /Users/buildslave/jenkins/workspace/lldb-cmake-matrix/llvm-project/lldb/test/API/tools/lldb-server/main.cpp "/Users/buildslave/jenkins/workspace/lldb-cmake-matrix/clang_1300_build/bin/clang" main.o -g -O0 -fno-builtin -isysroot "/Applications/Xcode.app/Contents/Developer/Platforms/MacOSX.platform/Developer/SDKs/MacOSX10.15.sdk" -arch x86_64 -I/Users/buildslave/jenkins/workspace/lldb-cmake-matrix/llvm-project/lldb/packages/Python/lldbsuite/test/make/../../../../../include -I/Users/buildslave/jenkins/workspace/lldb-cmake-matrix/llvm-project/lldb/test/API/tools/lldb-server -I/Users/buildslave/jenkins/workspace/lldb-cmake-matrix/llvm-project/lldb/packages/Python/lldbsuite/test/make -include /Users/buildslave/jenkins/workspace/lldb-cmake-matrix/llvm-project/lldb/packages/Python/lldbsuite/test/make/test_common.h -fno-limit-debug-info -D__STDC_LIMIT_MACROS -D__STDC_FORMAT_MACROS --driver-mode=g++ -o "a.out" codesign -s - "a.out"

Hide Details

Hide Details

FAIL: LLDB (/Users/buildslave/jenkins/workspace/lldb-cmake-matrix/clang_1300_build/bin/clang-x86_64) :: test_Hg_switches_to_3_threads_launch_debugserver (TestLldbGdbServer.LldbGdbServerTestCase) UNSUPPORTED: LLDB (/Users/buildslave/jenkins/workspace/lldb-cmake-matrix/clang_1300_build/bin/clang-x86_64) :: test_Hg_switches_to_3_threads_launch_llgs (TestLldbGdbServer.LldbGdbServerTestCase) (test case does not fall in any category of interest for this run) make VPATH=/Users/buildslave/jenkins/workspace/lldb-cmake-matrix/llvm-project/lldb/test/API/tools/lldb-server -C /Users/buildslave/jenkins/workspace/lldb-cmake-matrix/lldb-build/lldb-test-build.noindex/tools/lldb-server/TestLldbGdbServer.test_P_and_p_thread_suffix_work_debugserver -I /Users/buildslave/jenkins/workspace/lldb-cmake-matrix/llvm-project/lldb/test/API/tools/lldb-server -I /Users/buildslave/jenkins/workspace/lldb-cmake-matrix/llvm-project/lldb/packages/Python/lldbsuite/test/make -f /Users/buildslave/jenkins/workspace/lldb-cmake-matrix/llvm-project/lldb/test/API/tools/lldb-server/Makefile all ARCH=x86_64 'CC="/Users/buildslave/jenkins/workspace/lldb-cmake-matrix/clang_1300_build/bin/clang"' DSYMUTIL=/Users/buildslave/jenkins/workspace/lldb-cmake-matrix/lldb-build/./bin/dsymutil CODESIGN=codesign CLANG_MODULE_CACHE_DIR=/Users/buildslave/jenkins/workspace/lldb-cmake-matrix/lldb-build/lldb-test-build.noindex/module-cache-clang/lldb-api

Hide Details

"/Users/buildslave/jenkins/workspace/lldb-cmake-matrix/clang_1300_build/bin/clang" -std=c++11 -g -O0 -fno-builtin -isysroot "/Applications/Xcode.app/Contents/Developer/Platforms/MacOSX.platform/Developer/SDKs/MacOSX10.15.sdk" -arch x86_64 -I/Users/buildslave/jenkins/workspace/lldb-cmake-matrix/llvm-project/lldb/packages/Python/lldbsuite/test/make/../../../../../include -I/Users/buildslave/jenkins/workspace/lldb-cmake-matrix/llvm-project/lldb/test/API/tools/lldb-server -I/Users/buildslave/jenkins/workspace/lldb-cmake-matrix/llvm-project/lldb/packages/Python/lldbsuite/test/make -include /Users/buildslave/jenkins/workspace/lldb-cmake-matrix/llvm-project/lldb/packages/Python/lldbsuite/test/make/test_common.h -fno-limit-debug-info -D__STDC_LIMIT_MACROS -D__STDC_FORMAT_MACROS --driver-mode=g++ -MT main.o -MD -MP -MF main.d -c -o main.o /Users/buildslave/jenkins/workspace/lldb-cmake-matrix/llvm-project/lldb/test/API/tools/lldb-server/main.cpp "/Users/buildslave/jenkins/workspace/lldb-cmake-matrix/clang_1300_build/bin/clang" main.o -g -O0 -fno-builtin -isysroot "/Applications/Xcode.app/Contents/Developer/Platforms/MacOSX.platform/Developer/SDKs/MacOSX10.15.sdk" -arch x86_64 -I/Users/buildslave/jenkins/workspace/lldb-cmake-matrix/llvm-project/lldb/packages/Python/lldbsuite/test/make/../../../../../include -I/Users/buildslave/jenkins/workspace/lldb-cmake-matrix/llvm-project/lldb/test/API/tools/lldb-server -I/Users/buildslave/jenkins/workspace/lldb-cmake-matrix/llvm-project/lldb/packages/Python/lldbsuite/test/make -include /Users/buildslave/jenkins/workspace/lldb-cmake-matrix/llvm-project/lldb/packages/Python/lldbsuite/test/make/test_common.h -fno-limit-debug-info -D__STDC_LIMIT_MACROS -D__STDC_FORMAT_MACROS --driver-mode=g++ -o "a.out" codesign -s - "a.out"

Hide Details

Hide Details

PASS: LLDB (/Users/buildslave/jenkins/workspace/lldb-cmake-matrix/clang_1300_build/bin/clang-x86_64) :: test_P_and_p_thread_suffix_work_debugserver (TestLldbGdbServer.LldbGdbServerTestCase) UNSUPPORTED: LLDB (/Users/buildslave/jenkins/workspace/lldb-cmake-matrix/clang_1300_build/bin/clang-x86_64) :: test_P_and_p_thread_suffix_work_llgs (TestLldbGdbServer.LldbGdbServerTestCase) (test case does not fall in any category of interest for this run) make VPATH=/Users/buildslave/jenkins/workspace/lldb-cmake-matrix/llvm-project/lldb/test/API/tools/lldb-server -C /Users/buildslave/jenkins/workspace/lldb-cmake-matrix/lldb-build/lldb-test-build.noindex/tools/lldb-server/TestLldbGdbServer.test_P_writes_all_gpr_registers_debugserver -I /Users/buildslave/jenkins/workspace/lldb-cmake-matrix/llvm-project/lldb/test/API/tools/lldb-server -I /Users/buildslave/jenkins/workspace/lldb-cmake-matrix/llvm-project/lldb/packages/Python/lldbsuite/test/make -f /Users/buildslave/jenkins/workspace/lldb-cmake-matrix/llvm-project/lldb/test/API/tools/lldb-server/Makefile all ARCH=x86_64 'CC="/Users/buildslave/jenkins/workspace/lldb-cmake-matrix/clang_1300_build/bin/clang"' DSYMUTIL=/Users/buildslave/jenkins/workspace/lldb-cmake-matrix/lldb-build/./bin/dsymutil CODESIGN=codesign CLANG_MODULE_CACHE_DIR=/Users/buildslave/jenkins/workspace/lldb-cmake-matrix/lldb-build/lldb-test-build.noindex/module-cache-clang/lldb-api

Hide Details

"/Users/buildslave/jenkins/workspace/lldb-cmake-matrix/clang_1300_build/bin/clang" -std=c++11 -g -O0 -fno-builtin -isysroot "/Applications/Xcode.app/Contents/Developer/Platforms/MacOSX.platform/Developer/SDKs/MacOSX10.15.sdk" -arch x86_64 -I/Users/buildslave/jenkins/workspace/lldb-cmake-matrix/llvm-project/lldb/packages/Python/lldbsuite/test/make/../../../../../include -I/Users/buildslave/jenkins/workspace/lldb-cmake-matrix/llvm-project/lldb/test/API/tools/lldb-server -I/Users/buildslave/jenkins/workspace/lldb-cmake-matrix/llvm-project/lldb/packages/Python/lldbsuite/test/make -include /Users/buildslave/jenkins/workspace/lldb-cmake-matrix/llvm-project/lldb/packages/Python/lldbsuite/test/make/test_common.h -fno-limit-debug-info -D__STDC_LIMIT_MACROS -D__STDC_FORMAT_MACROS --driver-mode=g++ -MT main.o -MD -MP -MF main.d -c -o main.o /Users/buildslave/jenkins/workspace/lldb-cmake-matrix/llvm-project/lldb/test/API/tools/lldb-server/main.cpp "/Users/buildslave/jenkins/workspace/lldb-cmake-matrix/clang_1300_build/bin/clang" main.o -g -O0 -fno-builtin -isysroot "/Applications/Xcode.app/Contents/Developer/Platforms/MacOSX.platform/Developer/SDKs/MacOSX10.15.sdk" -arch x86_64 -I/Users/buildslave/jenkins/workspace/lldb-cmake-matrix/llvm-project/lldb/packages/Python/lldbsuite/test/make/../../../../../include -I/Users/buildslave/jenkins/workspace/lldb-cmake-matrix/llvm-project/lldb/test/API/tools/lldb-server -I/Users/buildslave/jenkins/workspace/lldb-cmake-matrix/llvm-project/lldb/packages/Python/lldbsuite/test/make -include /Users/buildslave/jenkins/workspace/lldb-cmake-matrix/llvm-project/lldb/packages/Python/lldbsuite/test/make/test_common.h -fno-limit-debug-info -D__STDC_LIMIT_MACROS -D__STDC_FORMAT_MACROS --driver-mode=g++ -o "a.out" codesign -s - "a.out"

Hide Details

Hide Details

successful writes: 7, failed writes: 11

Hide Details

PASS: LLDB (/Users/buildslave/jenkins/workspace/lldb-cmake-matrix/clang_1300_build/bin/clang-x86_64) :: test_P_writes_all_gpr_registers_debugserver (TestLldbGdbServer.LldbGdbServerTestCase) UNSUPPORTED: LLDB (/Users/buildslave/jenkins/workspace/lldb-cmake-matrix/clang_1300_build/bin/clang-x86_64) :: test_P_writes_all_gpr_registers_llgs (TestLldbGdbServer.LldbGdbServerTestCase) (test case does not fall in any category of interest for this run) UNSUPPORTED: LLDB (/Users/buildslave/jenkins/workspace/lldb-cmake-matrix/clang_1300_build/bin/clang-x86_64) :: test_QEnvironmentHexEncoded_llgs (TestLldbGdbServer.LldbGdbServerTestCase) (test case does not fall in any category of interest for this run) UNSUPPORTED: LLDB (/Users/buildslave/jenkins/workspace/lldb-cmake-matrix/clang_1300_build/bin/clang-x86_64) :: test_QEnvironment_llgs (TestLldbGdbServer.LldbGdbServerTestCase) (test case does not fall in any category of interest for this run) make VPATH=/Users/buildslave/jenkins/workspace/lldb-cmake-matrix/llvm-project/lldb/test/API/tools/lldb-server -C /Users/buildslave/jenkins/workspace/lldb-cmake-matrix/lldb-build/lldb-test-build.noindex/tools/lldb-server/TestLldbGdbServer.test_attach_commandline_continue_app_exits_debugserver -I /Users/buildslave/jenkins/workspace/lldb-cmake-matrix/llvm-project/lldb/test/API/tools/lldb-server -I /Users/buildslave/jenkins/workspace/lldb-cmake-matrix/llvm-project/lldb/packages/Python/lldbsuite/test/make -f /Users/buildslave/jenkins/workspace/lldb-cmake-matrix/llvm-project/lldb/test/API/tools/lldb-server/Makefile all ARCH=x86_64 'CC="/Users/buildslave/jenkins/workspace/lldb-cmake-matrix/clang_1300_build/bin/clang"' DSYMUTIL=/Users/buildslave/jenkins/workspace/lldb-cmake-matrix/lldb-build/./bin/dsymutil CODESIGN=codesign CLANG_MODULE_CACHE_DIR=/Users/buildslave/jenkins/workspace/lldb-cmake-matrix/lldb-build/lldb-test-build.noindex/module-cache-clang/lldb-api

Hide Details

"/Users/buildslave/jenkins/workspace/lldb-cmake-matrix/clang_1300_build/bin/clang" -std=c++11 -g -O0 -fno-builtin -isysroot "/Applications/Xcode.app/Contents/Developer/Platforms/MacOSX.platform/Developer/SDKs/MacOSX10.15.sdk" -arch x86_64 -I/Users/buildslave/jenkins/workspace/lldb-cmake-matrix/llvm-project/lldb/packages/Python/lldbsuite/test/make/../../../../../include -I/Users/buildslave/jenkins/workspace/lldb-cmake-matrix/llvm-project/lldb/test/API/tools/lldb-server -I/Users/buildslave/jenkins/workspace/lldb-cmake-matrix/llvm-project/lldb/packages/Python/lldbsuite/test/make -include /Users/buildslave/jenkins/workspace/lldb-cmake-matrix/llvm-project/lldb/packages/Python/lldbsuite/test/make/test_common.h -fno-limit-debug-info -D__STDC_LIMIT_MACROS -D__STDC_FORMAT_MACROS --driver-mode=g++ -MT main.o -MD -MP -MF main.d -c -o main.o /Users/buildslave/jenkins/workspace/lldb-cmake-matrix/llvm-project/lldb/test/API/tools/lldb-server/main.cpp "/Users/buildslave/jenkins/workspace/lldb-cmake-matrix/clang_1300_build/bin/clang" main.o -g -O0 -fno-builtin -isysroot "/Applications/Xcode.app/Contents/Developer/Platforms/MacOSX.platform/Developer/SDKs/MacOSX10.15.sdk" -arch x86_64 -I/Users/buildslave/jenkins/workspace/lldb-cmake-matrix/llvm-project/lldb/packages/Python/lldbsuite/test/make/../../../../../include -I/Users/buildslave/jenkins/workspace/lldb-cmake-matrix/llvm-project/lldb/test/API/tools/lldb-server -I/Users/buildslave/jenkins/workspace/lldb-cmake-matrix/llvm-project/lldb/packages/Python/lldbsuite/test/make -include /Users/buildslave/jenkins/workspace/lldb-cmake-matrix/llvm-project/lldb/packages/Python/lldbsuite/test/make/test_common.h -fno-limit-debug-info -D__STDC_LIMIT_MACROS -D__STDC_FORMAT_MACROS --driver-mode=g++ -o "a.out" codesign -s - "a.out"

Hide Details

Hide Details

PASS: LLDB (/Users/buildslave/jenkins/workspace/lldb-cmake-matrix/clang_1300_build/bin/clang-x86_64) :: test_attach_commandline_continue_app_exits_debugserver (TestLldbGdbServer.LldbGdbServerTestCase) UNSUPPORTED: LLDB (/Users/buildslave/jenkins/workspace/lldb-cmake-matrix/clang_1300_build/bin/clang-x86_64) :: test_attach_commandline_continue_app_exits_llgs (TestLldbGdbServer.LldbGdbServerTestCase) (test case does not fall in any category of interest for this run) make VPATH=/Users/buildslave/jenkins/workspace/lldb-cmake-matrix/llvm-project/lldb/test/API/tools/lldb-server -C /Users/buildslave/jenkins/workspace/lldb-cmake-matrix/lldb-build/lldb-test-build.noindex/tools/lldb-server/TestLldbGdbServer.test_c_packet_works_debugserver -I /Users/buildslave/jenkins/workspace/lldb-cmake-matrix/llvm-project/lldb/test/API/tools/lldb-server -I /Users/buildslave/jenkins/workspace/lldb-cmake-matrix/llvm-project/lldb/packages/Python/lldbsuite/test/make -f /Users/buildslave/jenkins/workspace/lldb-cmake-matrix/llvm-project/lldb/test/API/tools/lldb-server/Makefile all ARCH=x86_64 'CC="/Users/buildslave/jenkins/workspace/lldb-cmake-matrix/clang_1300_build/bin/clang"' DSYMUTIL=/Users/buildslave/jenkins/workspace/lldb-cmake-matrix/lldb-build/./bin/dsymutil CODESIGN=codesign CLANG_MODULE_CACHE_DIR=/Users/buildslave/jenkins/workspace/lldb-cmake-matrix/lldb-build/lldb-test-build.noindex/module-cache-clang/lldb-api

Hide Details

"/Users/buildslave/jenkins/workspace/lldb-cmake-matrix/clang_1300_build/bin/clang" -std=c++11 -g -O0 -fno-builtin -isysroot "/Applications/Xcode.app/Contents/Developer/Platforms/MacOSX.platform/Developer/SDKs/MacOSX10.15.sdk" -arch x86_64 -I/Users/buildslave/jenkins/workspace/lldb-cmake-matrix/llvm-project/lldb/packages/Python/lldbsuite/test/make/../../../../../include -I/Users/buildslave/jenkins/workspace/lldb-cmake-matrix/llvm-project/lldb/test/API/tools/lldb-server -I/Users/buildslave/jenkins/workspace/lldb-cmake-matrix/llvm-project/lldb/packages/Python/lldbsuite/test/make -include /Users/buildslave/jenkins/workspace/lldb-cmake-matrix/llvm-project/lldb/packages/Python/lldbsuite/test/make/test_common.h -fno-limit-debug-info -D__STDC_LIMIT_MACROS -D__STDC_FORMAT_MACROS --driver-mode=g++ -MT main.o -MD -MP -MF main.d -c -o main.o /Users/buildslave/jenkins/workspace/lldb-cmake-matrix/llvm-project/lldb/test/API/tools/lldb-server/main.cpp "/Users/buildslave/jenkins/workspace/lldb-cmake-matrix/clang_1300_build/bin/clang" main.o -g -O0 -fno-builtin -isysroot "/Applications/Xcode.app/Contents/Developer/Platforms/MacOSX.platform/Developer/SDKs/MacOSX10.15.sdk" -arch x86_64 -I/Users/buildslave/jenkins/workspace/lldb-cmake-matrix/llvm-project/lldb/packages/Python/lldbsuite/test/make/../../../../../include -I/Users/buildslave/jenkins/workspace/lldb-cmake-matrix/llvm-project/lldb/test/API/tools/lldb-server -I/Users/buildslave/jenkins/workspace/lldb-cmake-matrix/llvm-project/lldb/packages/Python/lldbsuite/test/make -include /Users/buildslave/jenkins/workspace/lldb-cmake-matrix/llvm-project/lldb/packages/Python/lldbsuite/test/make/test_common.h -fno-limit-debug-info -D__STDC_LIMIT_MACROS -D__STDC_FORMAT_MACROS --driver-mode=g++ -o "a.out" codesign -s - "a.out"

Hide Details

Hide Details

PASS: LLDB (/Users/buildslave/jenkins/workspace/lldb-cmake-matrix/clang_1300_build/bin/clang-x86_64) :: test_c_packet_works_debugserver (TestLldbGdbServer.LldbGdbServerTestCase) UNSUPPORTED: LLDB (/Users/buildslave/jenkins/workspace/lldb-cmake-matrix/clang_1300_build/bin/clang-x86_64) :: test_c_packet_works_llgs (TestLldbGdbServer.LldbGdbServerTestCase) (test case does not fall in any category of interest for this run) make VPATH=/Users/buildslave/jenkins/workspace/lldb-cmake-matrix/llvm-project/lldb/test/API/tools/lldb-server -C /Users/buildslave/jenkins/workspace/lldb-cmake-matrix/lldb-build/lldb-test-build.noindex/tools/lldb-server/TestLldbGdbServer.test_first_launch_stop_reply_thread_matches_first_qC_debugserver -I /Users/buildslave/jenkins/workspace/lldb-cmake-matrix/llvm-project/lldb/test/API/tools/lldb-server -I /Users/buildslave/jenkins/workspace/lldb-cmake-matrix/llvm-project/lldb/packages/Python/lldbsuite/test/make -f /Users/buildslave/jenkins/workspace/lldb-cmake-matrix/llvm-project/lldb/test/API/tools/lldb-server/Makefile all ARCH=x86_64 'CC="/Users/buildslave/jenkins/workspace/lldb-cmake-matrix/clang_1300_build/bin/clang"' DSYMUTIL=/Users/buildslave/jenkins/workspace/lldb-cmake-matrix/lldb-build/./bin/dsymutil CODESIGN=codesign CLANG_MODULE_CACHE_DIR=/Users/buildslave/jenkins/workspace/lldb-cmake-matrix/lldb-build/lldb-test-build.noindex/module-cache-clang/lldb-api

Hide Details

"/Users/buildslave/jenkins/workspace/lldb-cmake-matrix/clang_1300_build/bin/clang" -std=c++11 -g -O0 -fno-builtin -isysroot "/Applications/Xcode.app/Contents/Developer/Platforms/MacOSX.platform/Developer/SDKs/MacOSX10.15.sdk" -arch x86_64 -I/Users/buildslave/jenkins/workspace/lldb-cmake-matrix/llvm-project/lldb/packages/Python/lldbsuite/test/make/../../../../../include -I/Users/buildslave/jenkins/workspace/lldb-cmake-matrix/llvm-project/lldb/test/API/tools/lldb-server -I/Users/buildslave/jenkins/workspace/lldb-cmake-matrix/llvm-project/lldb/packages/Python/lldbsuite/test/make -include /Users/buildslave/jenkins/workspace/lldb-cmake-matrix/llvm-project/lldb/packages/Python/lldbsuite/test/make/test_common.h -fno-limit-debug-info -D__STDC_LIMIT_MACROS -D__STDC_FORMAT_MACROS --driver-mode=g++ -MT main.o -MD -MP -MF main.d -c -o main.o /Users/buildslave/jenkins/workspace/lldb-cmake-matrix/llvm-project/lldb/test/API/tools/lldb-server/main.cpp "/Users/buildslave/jenkins/workspace/lldb-cmake-matrix/clang_1300_build/bin/clang" main.o -g -O0 -fno-builtin -isysroot "/Applications/Xcode.app/Contents/Developer/Platforms/MacOSX.platform/Developer/SDKs/MacOSX10.15.sdk" -arch x86_64 -I/Users/buildslave/jenkins/workspace/lldb-cmake-matrix/llvm-project/lldb/packages/Python/lldbsuite/test/make/../../../../../include -I/Users/buildslave/jenkins/workspace/lldb-cmake-matrix/llvm-project/lldb/test/API/tools/lldb-server -I/Users/buildslave/jenkins/workspace/lldb-cmake-matrix/llvm-project/lldb/packages/Python/lldbsuite/test/make -include /Users/buildslave/jenkins/workspace/lldb-cmake-matrix/llvm-project/lldb/packages/Python/lldbsuite/test/make/test_common.h -fno-limit-debug-info -D__STDC_LIMIT_MACROS -D__STDC_FORMAT_MACROS --driver-mode=g++ -o "a.out" codesign -s - "a.out"

Hide Details

Hide Details

PASS: LLDB (/Users/buildslave/jenkins/workspace/lldb-cmake-matrix/clang_1300_build/bin/clang-x86_64) :: test_first_launch_stop_reply_thread_matches_first_qC_debugserver (TestLldbGdbServer.LldbGdbServerTestCase) UNSUPPORTED: LLDB (/Users/buildslave/jenkins/workspace/lldb-cmake-matrix/clang_1300_build/bin/clang-x86_64) :: test_first_launch_stop_reply_thread_matches_first_qC_llgs (TestLldbGdbServer.LldbGdbServerTestCase) (test case does not fall in any category of interest for this run) UNSUPPORTED: LLDB (/Users/buildslave/jenkins/workspace/lldb-cmake-matrix/clang_1300_build/bin/clang-x86_64) :: test_hardware_breakpoint_set_and_remove_work_debugserver (TestLldbGdbServer.LldbGdbServerTestCase) (requires one of linux) UNSUPPORTED: LLDB (/Users/buildslave/jenkins/workspace/lldb-cmake-matrix/clang_1300_build/bin/clang-x86_64) :: test_hardware_breakpoint_set_and_remove_work_llgs (TestLldbGdbServer.LldbGdbServerTestCase) (test case does not fall in any category of interest for this run) make VPATH=/Users/buildslave/jenkins/workspace/lldb-cmake-matrix/llvm-project/lldb/test/API/tools/lldb-server -C /Users/buildslave/jenkins/workspace/lldb-cmake-matrix/lldb-build/lldb-test-build.noindex/tools/lldb-server/TestLldbGdbServer.test_inferior_print_exit_debugserver -I /Users/buildslave/jenkins/workspace/lldb-cmake-matrix/llvm-project/lldb/test/API/tools/lldb-server -I /Users/buildslave/jenkins/workspace/lldb-cmake-matrix/llvm-project/lldb/packages/Python/lldbsuite/test/make -f /Users/buildslave/jenkins/workspace/lldb-cmake-matrix/llvm-project/lldb/test/API/tools/lldb-server/Makefile all ARCH=x86_64 'CC="/Users/buildslave/jenkins/workspace/lldb-cmake-matrix/clang_1300_build/bin/clang"' DSYMUTIL=/Users/buildslave/jenkins/workspace/lldb-cmake-matrix/lldb-build/./bin/dsymutil CODESIGN=codesign CLANG_MODULE_CACHE_DIR=/Users/buildslave/jenkins/workspace/lldb-cmake-matrix/lldb-build/lldb-test-build.noindex/module-cache-clang/lldb-api

Hide Details

"/Users/buildslave/jenkins/workspace/lldb-cmake-matrix/clang_1300_build/bin/clang" -std=c++11 -g -O0 -fno-builtin -isysroot "/Applications/Xcode.app/Contents/Developer/Platforms/MacOSX.platform/Developer/SDKs/MacOSX10.15.sdk" -arch x86_64 -I/Users/buildslave/jenkins/workspace/lldb-cmake-matrix/llvm-project/lldb/packages/Python/lldbsuite/test/make/../../../../../include -I/Users/buildslave/jenkins/workspace/lldb-cmake-matrix/llvm-project/lldb/test/API/tools/lldb-server -I/Users/buildslave/jenkins/workspace/lldb-cmake-matrix/llvm-project/lldb/packages/Python/lldbsuite/test/make -include /Users/buildslave/jenkins/workspace/lldb-cmake-matrix/llvm-project/lldb/packages/Python/lldbsuite/test/make/test_common.h -fno-limit-debug-info -D__STDC_LIMIT_MACROS -D__STDC_FORMAT_MACROS --driver-mode=g++ -MT main.o -MD -MP -MF main.d -c -o main.o /Users/buildslave/jenkins/workspace/lldb-cmake-matrix/llvm-project/lldb/test/API/tools/lldb-server/main.cpp "/Users/buildslave/jenkins/workspace/lldb-cmake-matrix/clang_1300_build/bin/clang" main.o -g -O0 -fno-builtin -isysroot "/Applications/Xcode.app/Contents/Developer/Platforms/MacOSX.platform/Developer/SDKs/MacOSX10.15.sdk" -arch x86_64 -I/Users/buildslave/jenkins/workspace/lldb-cmake-matrix/llvm-project/lldb/packages/Python/lldbsuite/test/make/../../../../../include -I/Users/buildslave/jenkins/workspace/lldb-cmake-matrix/llvm-project/lldb/test/API/tools/lldb-server -I/Users/buildslave/jenkins/workspace/lldb-cmake-matrix/llvm-project/lldb/packages/Python/lldbsuite/test/make -include /Users/buildslave/jenkins/workspace/lldb-cmake-matrix/llvm-project/lldb/packages/Python/lldbsuite/test/make/test_common.h -fno-limit-debug-info -D__STDC_LIMIT_MACROS -D__STDC_FORMAT_MACROS --driver-mode=g++ -o "a.out" codesign -s - "a.out"

Hide Details

Hide Details

PASS: LLDB (/Users/buildslave/jenkins/workspace/lldb-cmake-matrix/clang_1300_build/bin/clang-x86_64) :: test_inferior_print_exit_debugserver (TestLldbGdbServer.LldbGdbServerTestCase) UNSUPPORTED: LLDB (/Users/buildslave/jenkins/workspace/lldb-cmake-matrix/clang_1300_build/bin/clang-x86_64) :: test_inferior_print_exit_llgs (TestLldbGdbServer.LldbGdbServerTestCase) (test case does not fall in any category of interest for this run) UNSUPPORTED: LLDB (/Users/buildslave/jenkins/workspace/lldb-cmake-matrix/clang_1300_build/bin/clang-x86_64) :: test_launch_via_A_llgs (TestLldbGdbServer.LldbGdbServerTestCase) (test case does not fall in any category of interest for this run) UNSUPPORTED: LLDB (/Users/buildslave/jenkins/workspace/lldb-cmake-matrix/clang_1300_build/bin/clang-x86_64) :: test_launch_via_vRun_llgs (TestLldbGdbServer.LldbGdbServerTestCase) (test case does not fall in any category of interest for this run) UNSUPPORTED: LLDB (/Users/buildslave/jenkins/workspace/lldb-cmake-matrix/clang_1300_build/bin/clang-x86_64) :: test_launch_via_vRun_no_args_llgs (TestLldbGdbServer.LldbGdbServerTestCase) (test case does not fall in any category of interest for this run) PASS: LLDB (/Users/buildslave/jenkins/workspace/lldb-cmake-matrix/clang_1300_build/bin/clang-x86_64) :: test_list_threads_in_stop_reply_supported_debugserver (TestLldbGdbServer.LldbGdbServerTestCase) UNSUPPORTED: LLDB (/Users/buildslave/jenkins/workspace/lldb-cmake-matrix/clang_1300_build/bin/clang-x86_64) :: test_list_threads_in_stop_reply_supported_llgs (TestLldbGdbServer.LldbGdbServerTestCase) (test case does not fall in any category of interest for this run) make VPATH=/Users/buildslave/jenkins/workspace/lldb-cmake-matrix/llvm-project/lldb/test/API/tools/lldb-server -C /Users/buildslave/jenkins/workspace/lldb-cmake-matrix/lldb-build/lldb-test-build.noindex/tools/lldb-server/TestLldbGdbServer.test_m_packet_reads_memory_debugserver -I /Users/buildslave/jenkins/workspace/lldb-cmake-matrix/llvm-project/lldb/test/API/tools/lldb-server -I /Users/buildslave/jenkins/workspace/lldb-cmake-matrix/llvm-project/lldb/packages/Python/lldbsuite/test/make -f /Users/buildslave/jenkins/workspace/lldb-cmake-matrix/llvm-project/lldb/test/API/tools/lldb-server/Makefile all ARCH=x86_64 'CC="/Users/buildslave/jenkins/workspace/lldb-cmake-matrix/clang_1300_build/bin/clang"' DSYMUTIL=/Users/buildslave/jenkins/workspace/lldb-cmake-matrix/lldb-build/./bin/dsymutil CODESIGN=codesign CLANG_MODULE_CACHE_DIR=/Users/buildslave/jenkins/workspace/lldb-cmake-matrix/lldb-build/lldb-test-build.noindex/module-cache-clang/lldb-api

Hide Details

"/Users/buildslave/jenkins/workspace/lldb-cmake-matrix/clang_1300_build/bin/clang" -std=c++11 -g -O0 -fno-builtin -isysroot "/Applications/Xcode.app/Contents/Developer/Platforms/MacOSX.platform/Developer/SDKs/MacOSX10.15.sdk" -arch x86_64 -I/Users/buildslave/jenkins/workspace/lldb-cmake-matrix/llvm-project/lldb/packages/Python/lldbsuite/test/make/../../../../../include -I/Users/buildslave/jenkins/workspace/lldb-cmake-matrix/llvm-project/lldb/test/API/tools/lldb-server -I/Users/buildslave/jenkins/workspace/lldb-cmake-matrix/llvm-project/lldb/packages/Python/lldbsuite/test/make -include /Users/buildslave/jenkins/workspace/lldb-cmake-matrix/llvm-project/lldb/packages/Python/lldbsuite/test/make/test_common.h -fno-limit-debug-info -D__STDC_LIMIT_MACROS -D__STDC_FORMAT_MACROS --driver-mode=g++ -MT main.o -MD -MP -MF main.d -c -o main.o /Users/buildslave/jenkins/workspace/lldb-cmake-matrix/llvm-project/lldb/test/API/tools/lldb-server/main.cpp "/Users/buildslave/jenkins/workspace/lldb-cmake-matrix/clang_1300_build/bin/clang" main.o -g -O0 -fno-builtin -isysroot "/Applications/Xcode.app/Contents/Developer/Platforms/MacOSX.platform/Developer/SDKs/MacOSX10.15.sdk" -arch x86_64 -I/Users/buildslave/jenkins/workspace/lldb-cmake-matrix/llvm-project/lldb/packages/Python/lldbsuite/test/make/../../../../../include -I/Users/buildslave/jenkins/workspace/lldb-cmake-matrix/llvm-project/lldb/test/API/tools/lldb-server -I/Users/buildslave/jenkins/workspace/lldb-cmake-matrix/llvm-project/lldb/packages/Python/lldbsuite/test/make -include /Users/buildslave/jenkins/workspace/lldb-cmake-matrix/llvm-project/lldb/packages/Python/lldbsuite/test/make/test_common.h -fno-limit-debug-info -D__STDC_LIMIT_MACROS -D__STDC_FORMAT_MACROS --driver-mode=g++ -o "a.out" codesign -s - "a.out"

Hide Details

Hide Details

PASS: LLDB (/Users/buildslave/jenkins/workspace/lldb-cmake-matrix/clang_1300_build/bin/clang-x86_64) :: test_m_packet_reads_memory_debugserver (TestLldbGdbServer.LldbGdbServerTestCase) UNSUPPORTED: LLDB (/Users/buildslave/jenkins/workspace/lldb-cmake-matrix/clang_1300_build/bin/clang-x86_64) :: test_m_packet_reads_memory_llgs (TestLldbGdbServer.LldbGdbServerTestCase) (test case does not fall in any category of interest for this run) make VPATH=/Users/buildslave/jenkins/workspace/lldb-cmake-matrix/llvm-project/lldb/test/API/tools/lldb-server -C /Users/buildslave/jenkins/workspace/lldb-cmake-matrix/lldb-build/lldb-test-build.noindex/tools/lldb-server/TestLldbGdbServer.test_p_returns_correct_data_size_for_each_qRegisterInfo_launch_debugserver -I /Users/buildslave/jenkins/workspace/lldb-cmake-matrix/llvm-project/lldb/test/API/tools/lldb-server -I /Users/buildslave/jenkins/workspace/lldb-cmake-matrix/llvm-project/lldb/packages/Python/lldbsuite/test/make -f /Users/buildslave/jenkins/workspace/lldb-cmake-matrix/llvm-project/lldb/test/API/tools/lldb-server/Makefile all ARCH=x86_64 'CC="/Users/buildslave/jenkins/workspace/lldb-cmake-matrix/clang_1300_build/bin/clang"' DSYMUTIL=/Users/buildslave/jenkins/workspace/lldb-cmake-matrix/lldb-build/./bin/dsymutil CODESIGN=codesign CLANG_MODULE_CACHE_DIR=/Users/buildslave/jenkins/workspace/lldb-cmake-matrix/lldb-build/lldb-test-build.noindex/module-cache-clang/lldb-api

Hide Details

"/Users/buildslave/jenkins/workspace/lldb-cmake-matrix/clang_1300_build/bin/clang" -std=c++11 -g -O0 -fno-builtin -isysroot "/Applications/Xcode.app/Contents/Developer/Platforms/MacOSX.platform/Developer/SDKs/MacOSX10.15.sdk" -arch x86_64 -I/Users/buildslave/jenkins/workspace/lldb-cmake-matrix/llvm-project/lldb/packages/Python/lldbsuite/test/make/../../../../../include -I/Users/buildslave/jenkins/workspace/lldb-cmake-matrix/llvm-project/lldb/test/API/tools/lldb-server -I/Users/buildslave/jenkins/workspace/lldb-cmake-matrix/llvm-project/lldb/packages/Python/lldbsuite/test/make -include /Users/buildslave/jenkins/workspace/lldb-cmake-matrix/llvm-project/lldb/packages/Python/lldbsuite/test/make/test_common.h -fno-limit-debug-info -D__STDC_LIMIT_MACROS -D__STDC_FORMAT_MACROS --driver-mode=g++ -MT main.o -MD -MP -MF main.d -c -o main.o /Users/buildslave/jenkins/workspace/lldb-cmake-matrix/llvm-project/lldb/test/API/tools/lldb-server/main.cpp "/Users/buildslave/jenkins/workspace/lldb-cmake-matrix/clang_1300_build/bin/clang" main.o -g -O0 -fno-builtin -isysroot "/Applications/Xcode.app/Contents/Developer/Platforms/MacOSX.platform/Developer/SDKs/MacOSX10.15.sdk" -arch x86_64 -I/Users/buildslave/jenkins/workspace/lldb-cmake-matrix/llvm-project/lldb/packages/Python/lldbsuite/test/make/../../../../../include -I/Users/buildslave/jenkins/workspace/lldb-cmake-matrix/llvm-project/lldb/test/API/tools/lldb-server -I/Users/buildslave/jenkins/workspace/lldb-cmake-matrix/llvm-project/lldb/packages/Python/lldbsuite/test/make -include /Users/buildslave/jenkins/workspace/lldb-cmake-matrix/llvm-project/lldb/packages/Python/lldbsuite/test/make/test_common.h -fno-limit-debug-info -D__STDC_LIMIT_MACROS -D__STDC_FORMAT_MACROS --driver-mode=g++ -o "a.out" codesign -s - "a.out"

Hide Details

Hide Details

PASS: LLDB (/Users/buildslave/jenkins/workspace/lldb-cmake-matrix/clang_1300_build/bin/clang-x86_64) :: test_p_returns_correct_data_size_for_each_qRegisterInfo_launch_debugserver (TestLldbGdbServer.LldbGdbServerTestCase) UNSUPPORTED: LLDB (/Users/buildslave/jenkins/workspace/lldb-cmake-matrix/clang_1300_build/bin/clang-x86_64) :: test_p_returns_correct_data_size_for_each_qRegisterInfo_launch_llgs (TestLldbGdbServer.LldbGdbServerTestCase) (test case does not fall in any category of interest for this run) make VPATH=/Users/buildslave/jenkins/workspace/lldb-cmake-matrix/llvm-project/lldb/test/API/tools/lldb-server -C /Users/buildslave/jenkins/workspace/lldb-cmake-matrix/lldb-build/lldb-test-build.noindex/tools/lldb-server/TestLldbGdbServer.test_qMemoryRegionInfo_is_supported_debugserver -I /Users/buildslave/jenkins/workspace/lldb-cmake-matrix/llvm-project/lldb/test/API/tools/lldb-server -I /Users/buildslave/jenkins/workspace/lldb-cmake-matrix/llvm-project/lldb/packages/Python/lldbsuite/test/make -f /Users/buildslave/jenkins/workspace/lldb-cmake-matrix/llvm-project/lldb/test/API/tools/lldb-server/Makefile all ARCH=x86_64 'CC="/Users/buildslave/jenkins/workspace/lldb-cmake-matrix/clang_1300_build/bin/clang"' DSYMUTIL=/Users/buildslave/jenkins/workspace/lldb-cmake-matrix/lldb-build/./bin/dsymutil CODESIGN=codesign CLANG_MODULE_CACHE_DIR=/Users/buildslave/jenkins/workspace/lldb-cmake-matrix/lldb-build/lldb-test-build.noindex/module-cache-clang/lldb-api

Hide Details

"/Users/buildslave/jenkins/workspace/lldb-cmake-matrix/clang_1300_build/bin/clang" -std=c++11 -g -O0 -fno-builtin -isysroot "/Applications/Xcode.app/Contents/Developer/Platforms/MacOSX.platform/Developer/SDKs/MacOSX10.15.sdk" -arch x86_64 -I/Users/buildslave/jenkins/workspace/lldb-cmake-matrix/llvm-project/lldb/packages/Python/lldbsuite/test/make/../../../../../include -I/Users/buildslave/jenkins/workspace/lldb-cmake-matrix/llvm-project/lldb/test/API/tools/lldb-server -I/Users/buildslave/jenkins/workspace/lldb-cmake-matrix/llvm-project/lldb/packages/Python/lldbsuite/test/make -include /Users/buildslave/jenkins/workspace/lldb-cmake-matrix/llvm-project/lldb/packages/Python/lldbsuite/test/make/test_common.h -fno-limit-debug-info -D__STDC_LIMIT_MACROS -D__STDC_FORMAT_MACROS --driver-mode=g++ -MT main.o -MD -MP -MF main.d -c -o main.o /Users/buildslave/jenkins/workspace/lldb-cmake-matrix/llvm-project/lldb/test/API/tools/lldb-server/main.cpp "/Users/buildslave/jenkins/workspace/lldb-cmake-matrix/clang_1300_build/bin/clang" main.o -g -O0 -fno-builtin -isysroot "/Applications/Xcode.app/Contents/Developer/Platforms/MacOSX.platform/Developer/SDKs/MacOSX10.15.sdk" -arch x86_64 -I/Users/buildslave/jenkins/workspace/lldb-cmake-matrix/llvm-project/lldb/packages/Python/lldbsuite/test/make/../../../../../include -I/Users/buildslave/jenkins/workspace/lldb-cmake-matrix/llvm-project/lldb/test/API/tools/lldb-server -I/Users/buildslave/jenkins/workspace/lldb-cmake-matrix/llvm-project/lldb/packages/Python/lldbsuite/test/make -include /Users/buildslave/jenkins/workspace/lldb-cmake-matrix/llvm-project/lldb/packages/Python/lldbsuite/test/make/test_common.h -fno-limit-debug-info -D__STDC_LIMIT_MACROS -D__STDC_FORMAT_MACROS --driver-mode=g++ -o "a.out" codesign -s - "a.out"

Hide Details

Hide Details

PASS: LLDB (/Users/buildslave/jenkins/workspace/lldb-cmake-matrix/clang_1300_build/bin/clang-x86_64) :: test_qMemoryRegionInfo_is_supported_debugserver (TestLldbGdbServer.LldbGdbServerTestCase) UNSUPPORTED: LLDB (/Users/buildslave/jenkins/workspace/lldb-cmake-matrix/clang_1300_build/bin/clang-x86_64) :: test_qMemoryRegionInfo_is_supported_llgs (TestLldbGdbServer.LldbGdbServerTestCase) (test case does not fall in any category of interest for this run) make VPATH=/Users/buildslave/jenkins/workspace/lldb-cmake-matrix/llvm-project/lldb/test/API/tools/lldb-server -C /Users/buildslave/jenkins/workspace/lldb-cmake-matrix/lldb-build/lldb-test-build.noindex/tools/lldb-server/TestLldbGdbServer.test_qMemoryRegionInfo_reports_code_address_as_executable_debugserver -I /Users/buildslave/jenkins/workspace/lldb-cmake-matrix/llvm-project/lldb/test/API/tools/lldb-server -I /Users/buildslave/jenkins/workspace/lldb-cmake-matrix/llvm-project/lldb/packages/Python/lldbsuite/test/make -f /Users/buildslave/jenkins/workspace/lldb-cmake-matrix/llvm-project/lldb/test/API/tools/lldb-server/Makefile all ARCH=x86_64 'CC="/Users/buildslave/jenkins/workspace/lldb-cmake-matrix/clang_1300_build/bin/clang"' DSYMUTIL=/Users/buildslave/jenkins/workspace/lldb-cmake-matrix/lldb-build/./bin/dsymutil CODESIGN=codesign CLANG_MODULE_CACHE_DIR=/Users/buildslave/jenkins/workspace/lldb-cmake-matrix/lldb-build/lldb-test-build.noindex/module-cache-clang/lldb-api

Hide Details

"/Users/buildslave/jenkins/workspace/lldb-cmake-matrix/clang_1300_build/bin/clang" -std=c++11 -g -O0 -fno-builtin -isysroot "/Applications/Xcode.app/Contents/Developer/Platforms/MacOSX.platform/Developer/SDKs/MacOSX10.15.sdk" -arch x86_64 -I/Users/buildslave/jenkins/workspace/lldb-cmake-matrix/llvm-project/lldb/packages/Python/lldbsuite/test/make/../../../../../include -I/Users/buildslave/jenkins/workspace/lldb-cmake-matrix/llvm-project/lldb/test/API/tools/lldb-server -I/Users/buildslave/jenkins/workspace/lldb-cmake-matrix/llvm-project/lldb/packages/Python/lldbsuite/test/make -include /Users/buildslave/jenkins/workspace/lldb-cmake-matrix/llvm-project/lldb/packages/Python/lldbsuite/test/make/test_common.h -fno-limit-debug-info -D__STDC_LIMIT_MACROS -D__STDC_FORMAT_MACROS --driver-mode=g++ -MT main.o -MD -MP -MF main.d -c -o main.o /Users/buildslave/jenkins/workspace/lldb-cmake-matrix/llvm-project/lldb/test/API/tools/lldb-server/main.cpp "/Users/buildslave/jenkins/workspace/lldb-cmake-matrix/clang_1300_build/bin/clang" main.o -g -O0 -fno-builtin -isysroot "/Applications/Xcode.app/Contents/Developer/Platforms/MacOSX.platform/Developer/SDKs/MacOSX10.15.sdk" -arch x86_64 -I/Users/buildslave/jenkins/workspace/lldb-cmake-matrix/llvm-project/lldb/packages/Python/lldbsuite/test/make/../../../../../include -I/Users/buildslave/jenkins/workspace/lldb-cmake-matrix/llvm-project/lldb/test/API/tools/lldb-server -I/Users/buildslave/jenkins/workspace/lldb-cmake-matrix/llvm-project/lldb/packages/Python/lldbsuite/test/make -include /Users/buildslave/jenkins/workspace/lldb-cmake-matrix/llvm-project/lldb/packages/Python/lldbsuite/test/make/test_common.h -fno-limit-debug-info -D__STDC_LIMIT_MACROS -D__STDC_FORMAT_MACROS --driver-mode=g++ -o "a.out" codesign -s - "a.out"

Hide Details

Hide Details

PASS: LLDB (/Users/buildslave/jenkins/workspace/lldb-cmake-matrix/clang_1300_build/bin/clang-x86_64) :: test_qMemoryRegionInfo_reports_code_address_as_executable_debugserver (TestLldbGdbServer.LldbGdbServerTestCase) UNSUPPORTED: LLDB (/Users/buildslave/jenkins/workspace/lldb-cmake-matrix/clang_1300_build/bin/clang-x86_64) :: test_qMemoryRegionInfo_reports_code_address_as_executable_llgs (TestLldbGdbServer.LldbGdbServerTestCase) (test case does not fall in any category of interest for this run) make VPATH=/Users/buildslave/jenkins/workspace/lldb-cmake-matrix/llvm-project/lldb/test/API/tools/lldb-server -C /Users/buildslave/jenkins/workspace/lldb-cmake-matrix/lldb-build/lldb-test-build.noindex/tools/lldb-server/TestLldbGdbServer.test_qMemoryRegionInfo_reports_heap_address_as_rw_debugserver -I /Users/buildslave/jenkins/workspace/lldb-cmake-matrix/llvm-project/lldb/test/API/tools/lldb-server -I /Users/buildslave/jenkins/workspace/lldb-cmake-matrix/llvm-project/lldb/packages/Python/lldbsuite/test/make -f /Users/buildslave/jenkins/workspace/lldb-cmake-matrix/llvm-project/lldb/test/API/tools/lldb-server/Makefile all ARCH=x86_64 'CC="/Users/buildslave/jenkins/workspace/lldb-cmake-matrix/clang_1300_build/bin/clang"' DSYMUTIL=/Users/buildslave/jenkins/workspace/lldb-cmake-matrix/lldb-build/./bin/dsymutil CODESIGN=codesign CLANG_MODULE_CACHE_DIR=/Users/buildslave/jenkins/workspace/lldb-cmake-matrix/lldb-build/lldb-test-build.noindex/module-cache-clang/lldb-api

Hide Details

"/Users/buildslave/jenkins/workspace/lldb-cmake-matrix/clang_1300_build/bin/clang" -std=c++11 -g -O0 -fno-builtin -isysroot "/Applications/Xcode.app/Contents/Developer/Platforms/MacOSX.platform/Developer/SDKs/MacOSX10.15.sdk" -arch x86_64 -I/Users/buildslave/jenkins/workspace/lldb-cmake-matrix/llvm-project/lldb/packages/Python/lldbsuite/test/make/../../../../../include -I/Users/buildslave/jenkins/workspace/lldb-cmake-matrix/llvm-project/lldb/test/API/tools/lldb-server -I/Users/buildslave/jenkins/workspace/lldb-cmake-matrix/llvm-project/lldb/packages/Python/lldbsuite/test/make -include /Users/buildslave/jenkins/workspace/lldb-cmake-matrix/llvm-project/lldb/packages/Python/lldbsuite/test/make/test_common.h -fno-limit-debug-info -D__STDC_LIMIT_MACROS -D__STDC_FORMAT_MACROS --driver-mode=g++ -MT main.o -MD -MP -MF main.d -c -o main.o /Users/buildslave/jenkins/workspace/lldb-cmake-matrix/llvm-project/lldb/test/API/tools/lldb-server/main.cpp "/Users/buildslave/jenkins/workspace/lldb-cmake-matrix/clang_1300_build/bin/clang" main.o -g -O0 -fno-builtin -isysroot "/Applications/Xcode.app/Contents/Developer/Platforms/MacOSX.platform/Developer/SDKs/MacOSX10.15.sdk" -arch x86_64 -I/Users/buildslave/jenkins/workspace/lldb-cmake-matrix/llvm-project/lldb/packages/Python/lldbsuite/test/make/../../../../../include -I/Users/buildslave/jenkins/workspace/lldb-cmake-matrix/llvm-project/lldb/test/API/tools/lldb-server -I/Users/buildslave/jenkins/workspace/lldb-cmake-matrix/llvm-project/lldb/packages/Python/lldbsuite/test/make -include /Users/buildslave/jenkins/workspace/lldb-cmake-matrix/llvm-project/lldb/packages/Python/lldbsuite/test/make/test_common.h -fno-limit-debug-info -D__STDC_LIMIT_MACROS -D__STDC_FORMAT_MACROS --driver-mode=g++ -o "a.out" codesign -s - "a.out"

Hide Details

Hide Details

PASS: LLDB (/Users/buildslave/jenkins/workspace/lldb-cmake-matrix/clang_1300_build/bin/clang-x86_64) :: test_qMemoryRegionInfo_reports_heap_address_as_rw_debugserver (TestLldbGdbServer.LldbGdbServerTestCase) UNSUPPORTED: LLDB (/Users/buildslave/jenkins/workspace/lldb-cmake-matrix/clang_1300_build/bin/clang-x86_64) :: test_qMemoryRegionInfo_reports_heap_address_as_rw_llgs (TestLldbGdbServer.LldbGdbServerTestCase) (test case does not fall in any category of interest for this run) make VPATH=/Users/buildslave/jenkins/workspace/lldb-cmake-matrix/llvm-project/lldb/test/API/tools/lldb-server -C /Users/buildslave/jenkins/workspace/lldb-cmake-matrix/lldb-build/lldb-test-build.noindex/tools/lldb-server/TestLldbGdbServer.test_qMemoryRegionInfo_reports_stack_address_as_rw_debugserver -I /Users/buildslave/jenkins/workspace/lldb-cmake-matrix/llvm-project/lldb/test/API/tools/lldb-server -I /Users/buildslave/jenkins/workspace/lldb-cmake-matrix/llvm-project/lldb/packages/Python/lldbsuite/test/make -f /Users/buildslave/jenkins/workspace/lldb-cmake-matrix/llvm-project/lldb/test/API/tools/lldb-server/Makefile all ARCH=x86_64 'CC="/Users/buildslave/jenkins/workspace/lldb-cmake-matrix/clang_1300_build/bin/clang"' DSYMUTIL=/Users/buildslave/jenkins/workspace/lldb-cmake-matrix/lldb-build/./bin/dsymutil CODESIGN=codesign CLANG_MODULE_CACHE_DIR=/Users/buildslave/jenkins/workspace/lldb-cmake-matrix/lldb-build/lldb-test-build.noindex/module-cache-clang/lldb-api

Hide Details

"/Users/buildslave/jenkins/workspace/lldb-cmake-matrix/clang_1300_build/bin/clang" -std=c++11 -g -O0 -fno-builtin -isysroot "/Applications/Xcode.app/Contents/Developer/Platforms/MacOSX.platform/Developer/SDKs/MacOSX10.15.sdk" -arch x86_64 -I/Users/buildslave/jenkins/workspace/lldb-cmake-matrix/llvm-project/lldb/packages/Python/lldbsuite/test/make/../../../../../include -I/Users/buildslave/jenkins/workspace/lldb-cmake-matrix/llvm-project/lldb/test/API/tools/lldb-server -I/Users/buildslave/jenkins/workspace/lldb-cmake-matrix/llvm-project/lldb/packages/Python/lldbsuite/test/make -include /Users/buildslave/jenkins/workspace/lldb-cmake-matrix/llvm-project/lldb/packages/Python/lldbsuite/test/make/test_common.h -fno-limit-debug-info -D__STDC_LIMIT_MACROS -D__STDC_FORMAT_MACROS --driver-mode=g++ -MT main.o -MD -MP -MF main.d -c -o main.o /Users/buildslave/jenkins/workspace/lldb-cmake-matrix/llvm-project/lldb/test/API/tools/lldb-server/main.cpp "/Users/buildslave/jenkins/workspace/lldb-cmake-matrix/clang_1300_build/bin/clang" main.o -g -O0 -fno-builtin -isysroot "/Applications/Xcode.app/Contents/Developer/Platforms/MacOSX.platform/Developer/SDKs/MacOSX10.15.sdk" -arch x86_64 -I/Users/buildslave/jenkins/workspace/lldb-cmake-matrix/llvm-project/lldb/packages/Python/lldbsuite/test/make/../../../../../include -I/Users/buildslave/jenkins/workspace/lldb-cmake-matrix/llvm-project/lldb/test/API/tools/lldb-server -I/Users/buildslave/jenkins/workspace/lldb-cmake-matrix/llvm-project/lldb/packages/Python/lldbsuite/test/make -include /Users/buildslave/jenkins/workspace/lldb-cmake-matrix/llvm-project/lldb/packages/Python/lldbsuite/test/make/test_common.h -fno-limit-debug-info -D__STDC_LIMIT_MACROS -D__STDC_FORMAT_MACROS --driver-mode=g++ -o "a.out" codesign -s - "a.out"

Hide Details

Hide Details

PASS: LLDB (/Users/buildslave/jenkins/workspace/lldb-cmake-matrix/clang_1300_build/bin/clang-x86_64) :: test_qMemoryRegionInfo_reports_stack_address_as_rw_debugserver (TestLldbGdbServer.LldbGdbServerTestCase) UNSUPPORTED: LLDB (/Users/buildslave/jenkins/workspace/lldb-cmake-matrix/clang_1300_build/bin/clang-x86_64) :: test_qMemoryRegionInfo_reports_stack_address_as_rw_llgs (TestLldbGdbServer.LldbGdbServerTestCase) (test case does not fall in any category of interest for this run) make VPATH=/Users/buildslave/jenkins/workspace/lldb-cmake-matrix/llvm-project/lldb/test/API/tools/lldb-server -C /Users/buildslave/jenkins/workspace/lldb-cmake-matrix/lldb-build/lldb-test-build.noindex/tools/lldb-server/TestLldbGdbServer.test_qRegisterInfo_contains_at_least_one_register_set_debugserver -I /Users/buildslave/jenkins/workspace/lldb-cmake-matrix/llvm-project/lldb/test/API/tools/lldb-server -I /Users/buildslave/jenkins/workspace/lldb-cmake-matrix/llvm-project/lldb/packages/Python/lldbsuite/test/make -f /Users/buildslave/jenkins/workspace/lldb-cmake-matrix/llvm-project/lldb/test/API/tools/lldb-server/Makefile all ARCH=x86_64 'CC="/Users/buildslave/jenkins/workspace/lldb-cmake-matrix/clang_1300_build/bin/clang"' DSYMUTIL=/Users/buildslave/jenkins/workspace/lldb-cmake-matrix/lldb-build/./bin/dsymutil CODESIGN=codesign CLANG_MODULE_CACHE_DIR=/Users/buildslave/jenkins/workspace/lldb-cmake-matrix/lldb-build/lldb-test-build.noindex/module-cache-clang/lldb-api

Hide Details

"/Users/buildslave/jenkins/workspace/lldb-cmake-matrix/clang_1300_build/bin/clang" -std=c++11 -g -O0 -fno-builtin -isysroot "/Applications/Xcode.app/Contents/Developer/Platforms/MacOSX.platform/Developer/SDKs/MacOSX10.15.sdk" -arch x86_64 -I/Users/buildslave/jenkins/workspace/lldb-cmake-matrix/llvm-project/lldb/packages/Python/lldbsuite/test/make/../../../../../include -I/Users/buildslave/jenkins/workspace/lldb-cmake-matrix/llvm-project/lldb/test/API/tools/lldb-server -I/Users/buildslave/jenkins/workspace/lldb-cmake-matrix/llvm-project/lldb/packages/Python/lldbsuite/test/make -include /Users/buildslave/jenkins/workspace/lldb-cmake-matrix/llvm-project/lldb/packages/Python/lldbsuite/test/make/test_common.h -fno-limit-debug-info -D__STDC_LIMIT_MACROS -D__STDC_FORMAT_MACROS --driver-mode=g++ -MT main.o -MD -MP -MF main.d -c -o main.o /Users/buildslave/jenkins/workspace/lldb-cmake-matrix/llvm-project/lldb/test/API/tools/lldb-server/main.cpp "/Users/buildslave/jenkins/workspace/lldb-cmake-matrix/clang_1300_build/bin/clang" main.o -g -O0 -fno-builtin -isysroot "/Applications/Xcode.app/Contents/Developer/Platforms/MacOSX.platform/Developer/SDKs/MacOSX10.15.sdk" -arch x86_64 -I/Users/buildslave/jenkins/workspace/lldb-cmake-matrix/llvm-project/lldb/packages/Python/lldbsuite/test/make/../../../../../include -I/Users/buildslave/jenkins/workspace/lldb-cmake-matrix/llvm-project/lldb/test/API/tools/lldb-server -I/Users/buildslave/jenkins/workspace/lldb-cmake-matrix/llvm-project/lldb/packages/Python/lldbsuite/test/make -include /Users/buildslave/jenkins/workspace/lldb-cmake-matrix/llvm-project/lldb/packages/Python/lldbsuite/test/make/test_common.h -fno-limit-debug-info -D__STDC_LIMIT_MACROS -D__STDC_FORMAT_MACROS --driver-mode=g++ -o "a.out" codesign -s - "a.out"

Hide Details

Hide Details

PASS: LLDB (/Users/buildslave/jenkins/workspace/lldb-cmake-matrix/clang_1300_build/bin/clang-x86_64) :: test_qRegisterInfo_contains_at_least_one_register_set_debugserver (TestLldbGdbServer.LldbGdbServerTestCase) UNSUPPORTED: LLDB (/Users/buildslave/jenkins/workspace/lldb-cmake-matrix/clang_1300_build/bin/clang-x86_64) :: test_qRegisterInfo_contains_at_least_one_register_set_llgs (TestLldbGdbServer.LldbGdbServerTestCase) (test case does not fall in any category of interest for this run) UNSUPPORTED: LLDB (/Users/buildslave/jenkins/workspace/lldb-cmake-matrix/clang_1300_build/bin/clang-x86_64) :: test_qRegisterInfo_contains_avx_registers_llgs (TestLldbGdbServer.LldbGdbServerTestCase) (test case does not fall in any category of interest for this run) make VPATH=/Users/buildslave/jenkins/workspace/lldb-cmake-matrix/llvm-project/lldb/test/API/tools/lldb-server -C /Users/buildslave/jenkins/workspace/lldb-cmake-matrix/lldb-build/lldb-test-build.noindex/tools/lldb-server/TestLldbGdbServer.test_qRegisterInfo_contains_required_generics_debugserver_debugserver -I /Users/buildslave/jenkins/workspace/lldb-cmake-matrix/llvm-project/lldb/test/API/tools/lldb-server -I /Users/buildslave/jenkins/workspace/lldb-cmake-matrix/llvm-project/lldb/packages/Python/lldbsuite/test/make -f /Users/buildslave/jenkins/workspace/lldb-cmake-matrix/llvm-project/lldb/test/API/tools/lldb-server/Makefile all ARCH=x86_64 'CC="/Users/buildslave/jenkins/workspace/lldb-cmake-matrix/clang_1300_build/bin/clang"' DSYMUTIL=/Users/buildslave/jenkins/workspace/lldb-cmake-matrix/lldb-build/./bin/dsymutil CODESIGN=codesign CLANG_MODULE_CACHE_DIR=/Users/buildslave/jenkins/workspace/lldb-cmake-matrix/lldb-build/lldb-test-build.noindex/module-cache-clang/lldb-api

Hide Details

"/Users/buildslave/jenkins/workspace/lldb-cmake-matrix/clang_1300_build/bin/clang" -std=c++11 -g -O0 -fno-builtin -isysroot "/Applications/Xcode.app/Contents/Developer/Platforms/MacOSX.platform/Developer/SDKs/MacOSX10.15.sdk" -arch x86_64 -I/Users/buildslave/jenkins/workspace/lldb-cmake-matrix/llvm-project/lldb/packages/Python/lldbsuite/test/make/../../../../../include -I/Users/buildslave/jenkins/workspace/lldb-cmake-matrix/llvm-project/lldb/test/API/tools/lldb-server -I/Users/buildslave/jenkins/workspace/lldb-cmake-matrix/llvm-project/lldb/packages/Python/lldbsuite/test/make -include /Users/buildslave/jenkins/workspace/lldb-cmake-matrix/llvm-project/lldb/packages/Python/lldbsuite/test/make/test_common.h -fno-limit-debug-info -D__STDC_LIMIT_MACROS -D__STDC_FORMAT_MACROS --driver-mode=g++ -MT main.o -MD -MP -MF main.d -c -o main.o /Users/buildslave/jenkins/workspace/lldb-cmake-matrix/llvm-project/lldb/test/API/tools/lldb-server/main.cpp "/Users/buildslave/jenkins/workspace/lldb-cmake-matrix/clang_1300_build/bin/clang" main.o -g -O0 -fno-builtin -isysroot "/Applications/Xcode.app/Contents/Developer/Platforms/MacOSX.platform/Developer/SDKs/MacOSX10.15.sdk" -arch x86_64 -I/Users/buildslave/jenkins/workspace/lldb-cmake-matrix/llvm-project/lldb/packages/Python/lldbsuite/test/make/../../../../../include -I/Users/buildslave/jenkins/workspace/lldb-cmake-matrix/llvm-project/lldb/test/API/tools/lldb-server -I/Users/buildslave/jenkins/workspace/lldb-cmake-matrix/llvm-project/lldb/packages/Python/lldbsuite/test/make -include /Users/buildslave/jenkins/workspace/lldb-cmake-matrix/llvm-project/lldb/packages/Python/lldbsuite/test/make/test_common.h -fno-limit-debug-info -D__STDC_LIMIT_MACROS -D__STDC_FORMAT_MACROS --driver-mode=g++ -o "a.out" codesign -s - "a.out"

Hide Details

Hide Details

PASS: LLDB (/Users/buildslave/jenkins/workspace/lldb-cmake-matrix/clang_1300_build/bin/clang-x86_64) :: test_qRegisterInfo_contains_required_generics_debugserver_debugserver (TestLldbGdbServer.LldbGdbServerTestCase) UNSUPPORTED: LLDB (/Users/buildslave/jenkins/workspace/lldb-cmake-matrix/clang_1300_build/bin/clang-x86_64) :: test_qRegisterInfo_contains_required_generics_debugserver_llgs (TestLldbGdbServer.LldbGdbServerTestCase) (test case does not fall in any category of interest for this run) make VPATH=/Users/buildslave/jenkins/workspace/lldb-cmake-matrix/llvm-project/lldb/test/API/tools/lldb-server -C /Users/buildslave/jenkins/workspace/lldb-cmake-matrix/lldb-build/lldb-test-build.noindex/tools/lldb-server/TestLldbGdbServer.test_qRegisterInfo_returns_all_valid_results_debugserver -I /Users/buildslave/jenkins/workspace/lldb-cmake-matrix/llvm-project/lldb/test/API/tools/lldb-server -I /Users/buildslave/jenkins/workspace/lldb-cmake-matrix/llvm-project/lldb/packages/Python/lldbsuite/test/make -f /Users/buildslave/jenkins/workspace/lldb-cmake-matrix/llvm-project/lldb/test/API/tools/lldb-server/Makefile all ARCH=x86_64 'CC="/Users/buildslave/jenkins/workspace/lldb-cmake-matrix/clang_1300_build/bin/clang"' DSYMUTIL=/Users/buildslave/jenkins/workspace/lldb-cmake-matrix/lldb-build/./bin/dsymutil CODESIGN=codesign CLANG_MODULE_CACHE_DIR=/Users/buildslave/jenkins/workspace/lldb-cmake-matrix/lldb-build/lldb-test-build.noindex/module-cache-clang/lldb-api

Hide Details

"/Users/buildslave/jenkins/workspace/lldb-cmake-matrix/clang_1300_build/bin/clang" -std=c++11 -g -O0 -fno-builtin -isysroot "/Applications/Xcode.app/Contents/Developer/Platforms/MacOSX.platform/Developer/SDKs/MacOSX10.15.sdk" -arch x86_64 -I/Users/buildslave/jenkins/workspace/lldb-cmake-matrix/llvm-project/lldb/packages/Python/lldbsuite/test/make/../../../../../include -I/Users/buildslave/jenkins/workspace/lldb-cmake-matrix/llvm-project/lldb/test/API/tools/lldb-server -I/Users/buildslave/jenkins/workspace/lldb-cmake-matrix/llvm-project/lldb/packages/Python/lldbsuite/test/make -include /Users/buildslave/jenkins/workspace/lldb-cmake-matrix/llvm-project/lldb/packages/Python/lldbsuite/test/make/test_common.h -fno-limit-debug-info -D__STDC_LIMIT_MACROS -D__STDC_FORMAT_MACROS --driver-mode=g++ -MT main.o -MD -MP -MF main.d -c -o main.o /Users/buildslave/jenkins/workspace/lldb-cmake-matrix/llvm-project/lldb/test/API/tools/lldb-server/main.cpp "/Users/buildslave/jenkins/workspace/lldb-cmake-matrix/clang_1300_build/bin/clang" main.o -g -O0 -fno-builtin -isysroot "/Applications/Xcode.app/Contents/Developer/Platforms/MacOSX.platform/Developer/SDKs/MacOSX10.15.sdk" -arch x86_64 -I/Users/buildslave/jenkins/workspace/lldb-cmake-matrix/llvm-project/lldb/packages/Python/lldbsuite/test/make/../../../../../include -I/Users/buildslave/jenkins/workspace/lldb-cmake-matrix/llvm-project/lldb/test/API/tools/lldb-server -I/Users/buildslave/jenkins/workspace/lldb-cmake-matrix/llvm-project/lldb/packages/Python/lldbsuite/test/make -include /Users/buildslave/jenkins/workspace/lldb-cmake-matrix/llvm-project/lldb/packages/Python/lldbsuite/test/make/test_common.h -fno-limit-debug-info -D__STDC_LIMIT_MACROS -D__STDC_FORMAT_MACROS --driver-mode=g++ -o "a.out" codesign -s - "a.out"

Hide Details

Hide Details

PASS: LLDB (/Users/buildslave/jenkins/workspace/lldb-cmake-matrix/clang_1300_build/bin/clang-x86_64) :: test_qRegisterInfo_returns_all_valid_results_debugserver (TestLldbGdbServer.LldbGdbServerTestCase) UNSUPPORTED: LLDB (/Users/buildslave/jenkins/workspace/lldb-cmake-matrix/clang_1300_build/bin/clang-x86_64) :: test_qRegisterInfo_returns_all_valid_results_llgs (TestLldbGdbServer.LldbGdbServerTestCase) (test case does not fall in any category of interest for this run) make VPATH=/Users/buildslave/jenkins/workspace/lldb-cmake-matrix/llvm-project/lldb/test/API/tools/lldb-server -C /Users/buildslave/jenkins/workspace/lldb-cmake-matrix/lldb-build/lldb-test-build.noindex/tools/lldb-server/TestLldbGdbServer.test_qRegisterInfo_returns_one_valid_result_debugserver -I /Users/buildslave/jenkins/workspace/lldb-cmake-matrix/llvm-project/lldb/test/API/tools/lldb-server -I /Users/buildslave/jenkins/workspace/lldb-cmake-matrix/llvm-project/lldb/packages/Python/lldbsuite/test/make -f /Users/buildslave/jenkins/workspace/lldb-cmake-matrix/llvm-project/lldb/test/API/tools/lldb-server/Makefile all ARCH=x86_64 'CC="/Users/buildslave/jenkins/workspace/lldb-cmake-matrix/clang_1300_build/bin/clang"' DSYMUTIL=/Users/buildslave/jenkins/workspace/lldb-cmake-matrix/lldb-build/./bin/dsymutil CODESIGN=codesign CLANG_MODULE_CACHE_DIR=/Users/buildslave/jenkins/workspace/lldb-cmake-matrix/lldb-build/lldb-test-build.noindex/module-cache-clang/lldb-api

Hide Details

"/Users/buildslave/jenkins/workspace/lldb-cmake-matrix/clang_1300_build/bin/clang" -std=c++11 -g -O0 -fno-builtin -isysroot "/Applications/Xcode.app/Contents/Developer/Platforms/MacOSX.platform/Developer/SDKs/MacOSX10.15.sdk" -arch x86_64 -I/Users/buildslave/jenkins/workspace/lldb-cmake-matrix/llvm-project/lldb/packages/Python/lldbsuite/test/make/../../../../../include -I/Users/buildslave/jenkins/workspace/lldb-cmake-matrix/llvm-project/lldb/test/API/tools/lldb-server -I/Users/buildslave/jenkins/workspace/lldb-cmake-matrix/llvm-project/lldb/packages/Python/lldbsuite/test/make -include /Users/buildslave/jenkins/workspace/lldb-cmake-matrix/llvm-project/lldb/packages/Python/lldbsuite/test/make/test_common.h -fno-limit-debug-info -D__STDC_LIMIT_MACROS -D__STDC_FORMAT_MACROS --driver-mode=g++ -MT main.o -MD -MP -MF main.d -c -o main.o /Users/buildslave/jenkins/workspace/lldb-cmake-matrix/llvm-project/lldb/test/API/tools/lldb-server/main.cpp "/Users/buildslave/jenkins/workspace/lldb-cmake-matrix/clang_1300_build/bin/clang" main.o -g -O0 -fno-builtin -isysroot "/Applications/Xcode.app/Contents/Developer/Platforms/MacOSX.platform/Developer/SDKs/MacOSX10.15.sdk" -arch x86_64 -I/Users/buildslave/jenkins/workspace/lldb-cmake-matrix/llvm-project/lldb/packages/Python/lldbsuite/test/make/../../../../../include -I/Users/buildslave/jenkins/workspace/lldb-cmake-matrix/llvm-project/lldb/test/API/tools/lldb-server -I/Users/buildslave/jenkins/workspace/lldb-cmake-matrix/llvm-project/lldb/packages/Python/lldbsuite/test/make -include /Users/buildslave/jenkins/workspace/lldb-cmake-matrix/llvm-project/lldb/packages/Python/lldbsuite/test/make/test_common.h -fno-limit-debug-info -D__STDC_LIMIT_MACROS -D__STDC_FORMAT_MACROS --driver-mode=g++ -o "a.out" codesign -s - "a.out"

Hide Details

Hide Details

PASS: LLDB (/Users/buildslave/jenkins/workspace/lldb-cmake-matrix/clang_1300_build/bin/clang-x86_64) :: test_qRegisterInfo_returns_one_valid_result_debugserver (TestLldbGdbServer.LldbGdbServerTestCase) UNSUPPORTED: LLDB (/Users/buildslave/jenkins/workspace/lldb-cmake-matrix/clang_1300_build/bin/clang-x86_64) :: test_qRegisterInfo_returns_one_valid_result_llgs (TestLldbGdbServer.LldbGdbServerTestCase) (test case does not fall in any category of interest for this run) make VPATH=/Users/buildslave/jenkins/workspace/lldb-cmake-matrix/llvm-project/lldb/test/API/tools/lldb-server -C /Users/buildslave/jenkins/workspace/lldb-cmake-matrix/lldb-build/lldb-test-build.noindex/tools/lldb-server/TestLldbGdbServer.test_qSupported_QPassSignals_debugserver -I /Users/buildslave/jenkins/workspace/lldb-cmake-matrix/llvm-project/lldb/test/API/tools/lldb-server -I /Users/buildslave/jenkins/workspace/lldb-cmake-matrix/llvm-project/lldb/packages/Python/lldbsuite/test/make -f /Users/buildslave/jenkins/workspace/lldb-cmake-matrix/llvm-project/lldb/test/API/tools/lldb-server/Makefile all ARCH=x86_64 'CC="/Users/buildslave/jenkins/workspace/lldb-cmake-matrix/clang_1300_build/bin/clang"' DSYMUTIL=/Users/buildslave/jenkins/workspace/lldb-cmake-matrix/lldb-build/./bin/dsymutil CODESIGN=codesign CLANG_MODULE_CACHE_DIR=/Users/buildslave/jenkins/workspace/lldb-cmake-matrix/lldb-build/lldb-test-build.noindex/module-cache-clang/lldb-api

Hide Details

"/Users/buildslave/jenkins/workspace/lldb-cmake-matrix/clang_1300_build/bin/clang" -std=c++11 -g -O0 -fno-builtin -isysroot "/Applications/Xcode.app/Contents/Developer/Platforms/MacOSX.platform/Developer/SDKs/MacOSX10.15.sdk" -arch x86_64 -I/Users/buildslave/jenkins/workspace/lldb-cmake-matrix/llvm-project/lldb/packages/Python/lldbsuite/test/make/../../../../../include -I/Users/buildslave/jenkins/workspace/lldb-cmake-matrix/llvm-project/lldb/test/API/tools/lldb-server -I/Users/buildslave/jenkins/workspace/lldb-cmake-matrix/llvm-project/lldb/packages/Python/lldbsuite/test/make -include /Users/buildslave/jenkins/workspace/lldb-cmake-matrix/llvm-project/lldb/packages/Python/lldbsuite/test/make/test_common.h -fno-limit-debug-info -D__STDC_LIMIT_MACROS -D__STDC_FORMAT_MACROS --driver-mode=g++ -MT main.o -MD -MP -MF main.d -c -o main.o /Users/buildslave/jenkins/workspace/lldb-cmake-matrix/llvm-project/lldb/test/API/tools/lldb-server/main.cpp "/Users/buildslave/jenkins/workspace/lldb-cmake-matrix/clang_1300_build/bin/clang" main.o -g -O0 -fno-builtin -isysroot "/Applications/Xcode.app/Contents/Developer/Platforms/MacOSX.platform/Developer/SDKs/MacOSX10.15.sdk" -arch x86_64 -I/Users/buildslave/jenkins/workspace/lldb-cmake-matrix/llvm-project/lldb/packages/Python/lldbsuite/test/make/../../../../../include -I/Users/buildslave/jenkins/workspace/lldb-cmake-matrix/llvm-project/lldb/test/API/tools/lldb-server -I/Users/buildslave/jenkins/workspace/lldb-cmake-matrix/llvm-project/lldb/packages/Python/lldbsuite/test/make -include /Users/buildslave/jenkins/workspace/lldb-cmake-matrix/llvm-project/lldb/packages/Python/lldbsuite/test/make/test_common.h -fno-limit-debug-info -D__STDC_LIMIT_MACROS -D__STDC_FORMAT_MACROS --driver-mode=g++ -o "a.out" codesign -s - "a.out"

Hide Details

Hide Details

PASS: LLDB (/Users/buildslave/jenkins/workspace/lldb-cmake-matrix/clang_1300_build/bin/clang-x86_64) :: test_qSupported_QPassSignals_debugserver (TestLldbGdbServer.LldbGdbServerTestCase) UNSUPPORTED: LLDB (/Users/buildslave/jenkins/workspace/lldb-cmake-matrix/clang_1300_build/bin/clang-x86_64) :: test_qSupported_QPassSignals_llgs (TestLldbGdbServer.LldbGdbServerTestCase) (test case does not fall in any category of interest for this run) make VPATH=/Users/buildslave/jenkins/workspace/lldb-cmake-matrix/llvm-project/lldb/test/API/tools/lldb-server -C /Users/buildslave/jenkins/workspace/lldb-cmake-matrix/lldb-build/lldb-test-build.noindex/tools/lldb-server/TestLldbGdbServer.test_qSupported_auvx_debugserver -I /Users/buildslave/jenkins/workspace/lldb-cmake-matrix/llvm-project/lldb/test/API/tools/lldb-server -I /Users/buildslave/jenkins/workspace/lldb-cmake-matrix/llvm-project/lldb/packages/Python/lldbsuite/test/make -f /Users/buildslave/jenkins/workspace/lldb-cmake-matrix/llvm-project/lldb/test/API/tools/lldb-server/Makefile all ARCH=x86_64 'CC="/Users/buildslave/jenkins/workspace/lldb-cmake-matrix/clang_1300_build/bin/clang"' DSYMUTIL=/Users/buildslave/jenkins/workspace/lldb-cmake-matrix/lldb-build/./bin/dsymutil CODESIGN=codesign CLANG_MODULE_CACHE_DIR=/Users/buildslave/jenkins/workspace/lldb-cmake-matrix/lldb-build/lldb-test-build.noindex/module-cache-clang/lldb-api

Hide Details

"/Users/buildslave/jenkins/workspace/lldb-cmake-matrix/clang_1300_build/bin/clang" -std=c++11 -g -O0 -fno-builtin -isysroot "/Applications/Xcode.app/Contents/Developer/Platforms/MacOSX.platform/Developer/SDKs/MacOSX10.15.sdk" -arch x86_64 -I/Users/buildslave/jenkins/workspace/lldb-cmake-matrix/llvm-project/lldb/packages/Python/lldbsuite/test/make/../../../../../include -I/Users/buildslave/jenkins/workspace/lldb-cmake-matrix/llvm-project/lldb/test/API/tools/lldb-server -I/Users/buildslave/jenkins/workspace/lldb-cmake-matrix/llvm-project/lldb/packages/Python/lldbsuite/test/make -include /Users/buildslave/jenkins/workspace/lldb-cmake-matrix/llvm-project/lldb/packages/Python/lldbsuite/test/make/test_common.h -fno-limit-debug-info -D__STDC_LIMIT_MACROS -D__STDC_FORMAT_MACROS --driver-mode=g++ -MT main.o -MD -MP -MF main.d -c -o main.o /Users/buildslave/jenkins/workspace/lldb-cmake-matrix/llvm-project/lldb/test/API/tools/lldb-server/main.cpp "/Users/buildslave/jenkins/workspace/lldb-cmake-matrix/clang_1300_build/bin/clang" main.o -g -O0 -fno-builtin -isysroot "/Applications/Xcode.app/Contents/Developer/Platforms/MacOSX.platform/Developer/SDKs/MacOSX10.15.sdk" -arch x86_64 -I/Users/buildslave/jenkins/workspace/lldb-cmake-matrix/llvm-project/lldb/packages/Python/lldbsuite/test/make/../../../../../include -I/Users/buildslave/jenkins/workspace/lldb-cmake-matrix/llvm-project/lldb/test/API/tools/lldb-server -I/Users/buildslave/jenkins/workspace/lldb-cmake-matrix/llvm-project/lldb/packages/Python/lldbsuite/test/make -include /Users/buildslave/jenkins/workspace/lldb-cmake-matrix/llvm-project/lldb/packages/Python/lldbsuite/test/make/test_common.h -fno-limit-debug-info -D__STDC_LIMIT_MACROS -D__STDC_FORMAT_MACROS --driver-mode=g++ -o "a.out" codesign -s - "a.out"

Hide Details

Hide Details

PASS: LLDB (/Users/buildslave/jenkins/workspace/lldb-cmake-matrix/clang_1300_build/bin/clang-x86_64) :: test_qSupported_auvx_debugserver (TestLldbGdbServer.LldbGdbServerTestCase) UNSUPPORTED: LLDB (/Users/buildslave/jenkins/workspace/lldb-cmake-matrix/clang_1300_build/bin/clang-x86_64) :: test_qSupported_auvx_llgs (TestLldbGdbServer.LldbGdbServerTestCase) (test case does not fall in any category of interest for this run) UNSUPPORTED: LLDB (/Users/buildslave/jenkins/workspace/lldb-cmake-matrix/clang_1300_build/bin/clang-x86_64) :: test_qSupported_fork_events_debugserver (TestLldbGdbServer.LldbGdbServerTestCase) (test case does not fall in any category of interest for this run) UNSUPPORTED: LLDB (/Users/buildslave/jenkins/workspace/lldb-cmake-matrix/clang_1300_build/bin/clang-x86_64) :: test_qSupported_fork_events_llgs (TestLldbGdbServer.LldbGdbServerTestCase) (test case does not fall in any category of interest for this run) UNSUPPORTED: LLDB (/Users/buildslave/jenkins/workspace/lldb-cmake-matrix/clang_1300_build/bin/clang-x86_64) :: test_qSupported_fork_events_without_multiprocess_debugserver (TestLldbGdbServer.LldbGdbServerTestCase) (test case does not fall in any category of interest for this run) UNSUPPORTED: LLDB (/Users/buildslave/jenkins/workspace/lldb-cmake-matrix/clang_1300_build/bin/clang-x86_64) :: test_qSupported_fork_events_without_multiprocess_llgs (TestLldbGdbServer.LldbGdbServerTestCase) (test case does not fall in any category of interest for this run) make VPATH=/Users/buildslave/jenkins/workspace/lldb-cmake-matrix/llvm-project/lldb/test/API/tools/lldb-server -C /Users/buildslave/jenkins/workspace/lldb-cmake-matrix/lldb-build/lldb-test-build.noindex/tools/lldb-server/TestLldbGdbServer.test_qSupported_libraries_svr4_debugserver -I /Users/buildslave/jenkins/workspace/lldb-cmake-matrix/llvm-project/lldb/test/API/tools/lldb-server -I /Users/buildslave/jenkins/workspace/lldb-cmake-matrix/llvm-project/lldb/packages/Python/lldbsuite/test/make -f /Users/buildslave/jenkins/workspace/lldb-cmake-matrix/llvm-project/lldb/test/API/tools/lldb-server/Makefile all ARCH=x86_64 'CC="/Users/buildslave/jenkins/workspace/lldb-cmake-matrix/clang_1300_build/bin/clang"' DSYMUTIL=/Users/buildslave/jenkins/workspace/lldb-cmake-matrix/lldb-build/./bin/dsymutil CODESIGN=codesign CLANG_MODULE_CACHE_DIR=/Users/buildslave/jenkins/workspace/lldb-cmake-matrix/lldb-build/lldb-test-build.noindex/module-cache-clang/lldb-api

Hide Details

"/Users/buildslave/jenkins/workspace/lldb-cmake-matrix/clang_1300_build/bin/clang" -std=c++11 -g -O0 -fno-builtin -isysroot "/Applications/Xcode.app/Contents/Developer/Platforms/MacOSX.platform/Developer/SDKs/MacOSX10.15.sdk" -arch x86_64 -I/Users/buildslave/jenkins/workspace/lldb-cmake-matrix/llvm-project/lldb/packages/Python/lldbsuite/test/make/../../../../../include -I/Users/buildslave/jenkins/workspace/lldb-cmake-matrix/llvm-project/lldb/test/API/tools/lldb-server -I/Users/buildslave/jenkins/workspace/lldb-cmake-matrix/llvm-project/lldb/packages/Python/lldbsuite/test/make -include /Users/buildslave/jenkins/workspace/lldb-cmake-matrix/llvm-project/lldb/packages/Python/lldbsuite/test/make/test_common.h -fno-limit-debug-info -D__STDC_LIMIT_MACROS -D__STDC_FORMAT_MACROS --driver-mode=g++ -MT main.o -MD -MP -MF main.d -c -o main.o /Users/buildslave/jenkins/workspace/lldb-cmake-matrix/llvm-project/lldb/test/API/tools/lldb-server/main.cpp "/Users/buildslave/jenkins/workspace/lldb-cmake-matrix/clang_1300_build/bin/clang" main.o -g -O0 -fno-builtin -isysroot "/Applications/Xcode.app/Contents/Developer/Platforms/MacOSX.platform/Developer/SDKs/MacOSX10.15.sdk" -arch x86_64 -I/Users/buildslave/jenkins/workspace/lldb-cmake-matrix/llvm-project/lldb/packages/Python/lldbsuite/test/make/../../../../../include -I/Users/buildslave/jenkins/workspace/lldb-cmake-matrix/llvm-project/lldb/test/API/tools/lldb-server -I/Users/buildslave/jenkins/workspace/lldb-cmake-matrix/llvm-project/lldb/packages/Python/lldbsuite/test/make -include /Users/buildslave/jenkins/workspace/lldb-cmake-matrix/llvm-project/lldb/packages/Python/lldbsuite/test/make/test_common.h -fno-limit-debug-info -D__STDC_LIMIT_MACROS -D__STDC_FORMAT_MACROS --driver-mode=g++ -o "a.out" codesign -s - "a.out"

Hide Details

Hide Details

PASS: LLDB (/Users/buildslave/jenkins/workspace/lldb-cmake-matrix/clang_1300_build/bin/clang-x86_64) :: test_qSupported_libraries_svr4_debugserver (TestLldbGdbServer.LldbGdbServerTestCase) UNSUPPORTED: LLDB (/Users/buildslave/jenkins/workspace/lldb-cmake-matrix/clang_1300_build/bin/clang-x86_64) :: test_qSupported_libraries_svr4_llgs (TestLldbGdbServer.LldbGdbServerTestCase) (test case does not fall in any category of interest for this run) make VPATH=/Users/buildslave/jenkins/workspace/lldb-cmake-matrix/llvm-project/lldb/test/API/tools/lldb-server -C /Users/buildslave/jenkins/workspace/lldb-cmake-matrix/lldb-build/lldb-test-build.noindex/tools/lldb-server/TestLldbGdbServer.test_qSupported_memory_tagging_debugserver -I /Users/buildslave/jenkins/workspace/lldb-cmake-matrix/llvm-project/lldb/test/API/tools/lldb-server -I /Users/buildslave/jenkins/workspace/lldb-cmake-matrix/llvm-project/lldb/packages/Python/lldbsuite/test/make -f /Users/buildslave/jenkins/workspace/lldb-cmake-matrix/llvm-project/lldb/test/API/tools/lldb-server/Makefile all ARCH=x86_64 'CC="/Users/buildslave/jenkins/workspace/lldb-cmake-matrix/clang_1300_build/bin/clang"' DSYMUTIL=/Users/buildslave/jenkins/workspace/lldb-cmake-matrix/lldb-build/./bin/dsymutil CODESIGN=codesign CLANG_MODULE_CACHE_DIR=/Users/buildslave/jenkins/workspace/lldb-cmake-matrix/lldb-build/lldb-test-build.noindex/module-cache-clang/lldb-api

Hide Details

"/Users/buildslave/jenkins/workspace/lldb-cmake-matrix/clang_1300_build/bin/clang" -std=c++11 -g -O0 -fno-builtin -isysroot "/Applications/Xcode.app/Contents/Developer/Platforms/MacOSX.platform/Developer/SDKs/MacOSX10.15.sdk" -arch x86_64 -I/Users/buildslave/jenkins/workspace/lldb-cmake-matrix/llvm-project/lldb/packages/Python/lldbsuite/test/make/../../../../../include -I/Users/buildslave/jenkins/workspace/lldb-cmake-matrix/llvm-project/lldb/test/API/tools/lldb-server -I/Users/buildslave/jenkins/workspace/lldb-cmake-matrix/llvm-project/lldb/packages/Python/lldbsuite/test/make -include /Users/buildslave/jenkins/workspace/lldb-cmake-matrix/llvm-project/lldb/packages/Python/lldbsuite/test/make/test_common.h -fno-limit-debug-info -D__STDC_LIMIT_MACROS -D__STDC_FORMAT_MACROS --driver-mode=g++ -MT main.o -MD -MP -MF main.d -c -o main.o /Users/buildslave/jenkins/workspace/lldb-cmake-matrix/llvm-project/lldb/test/API/tools/lldb-server/main.cpp "/Users/buildslave/jenkins/workspace/lldb-cmake-matrix/clang_1300_build/bin/clang" main.o -g -O0 -fno-builtin -isysroot "/Applications/Xcode.app/Contents/Developer/Platforms/MacOSX.platform/Developer/SDKs/MacOSX10.15.sdk" -arch x86_64 -I/Users/buildslave/jenkins/workspace/lldb-cmake-matrix/llvm-project/lldb/packages/Python/lldbsuite/test/make/../../../../../include -I/Users/buildslave/jenkins/workspace/lldb-cmake-matrix/llvm-project/lldb/test/API/tools/lldb-server -I/Users/buildslave/jenkins/workspace/lldb-cmake-matrix/llvm-project/lldb/packages/Python/lldbsuite/test/make -include /Users/buildslave/jenkins/workspace/lldb-cmake-matrix/llvm-project/lldb/packages/Python/lldbsuite/test/make/test_common.h -fno-limit-debug-info -D__STDC_LIMIT_MACROS -D__STDC_FORMAT_MACROS --driver-mode=g++ -o "a.out" codesign -s - "a.out"

Hide Details

Hide Details

PASS: LLDB (/Users/buildslave/jenkins/workspace/lldb-cmake-matrix/clang_1300_build/bin/clang-x86_64) :: test_qSupported_memory_tagging_debugserver (TestLldbGdbServer.LldbGdbServerTestCase) UNSUPPORTED: LLDB (/Users/buildslave/jenkins/workspace/lldb-cmake-matrix/clang_1300_build/bin/clang-x86_64) :: test_qSupported_memory_tagging_llgs (TestLldbGdbServer.LldbGdbServerTestCase) (test case does not fall in any category of interest for this run) make VPATH=/Users/buildslave/jenkins/workspace/lldb-cmake-matrix/llvm-project/lldb/test/API/tools/lldb-server -C /Users/buildslave/jenkins/workspace/lldb-cmake-matrix/lldb-build/lldb-test-build.noindex/tools/lldb-server/TestLldbGdbServer.test_qSupported_returns_known_stub_features_debugserver -I /Users/buildslave/jenkins/workspace/lldb-cmake-matrix/llvm-project/lldb/test/API/tools/lldb-server -I /Users/buildslave/jenkins/workspace/lldb-cmake-matrix/llvm-project/lldb/packages/Python/lldbsuite/test/make -f /Users/buildslave/jenkins/workspace/lldb-cmake-matrix/llvm-project/lldb/test/API/tools/lldb-server/Makefile all ARCH=x86_64 'CC="/Users/buildslave/jenkins/workspace/lldb-cmake-matrix/clang_1300_build/bin/clang"' DSYMUTIL=/Users/buildslave/jenkins/workspace/lldb-cmake-matrix/lldb-build/./bin/dsymutil CODESIGN=codesign CLANG_MODULE_CACHE_DIR=/Users/buildslave/jenkins/workspace/lldb-cmake-matrix/lldb-build/lldb-test-build.noindex/module-cache-clang/lldb-api

Hide Details

"/Users/buildslave/jenkins/workspace/lldb-cmake-matrix/clang_1300_build/bin/clang" -std=c++11 -g -O0 -fno-builtin -isysroot "/Applications/Xcode.app/Contents/Developer/Platforms/MacOSX.platform/Developer/SDKs/MacOSX10.15.sdk" -arch x86_64 -I/Users/buildslave/jenkins/workspace/lldb-cmake-matrix/llvm-project/lldb/packages/Python/lldbsuite/test/make/../../../../../include -I/Users/buildslave/jenkins/workspace/lldb-cmake-matrix/llvm-project/lldb/test/API/tools/lldb-server -I/Users/buildslave/jenkins/workspace/lldb-cmake-matrix/llvm-project/lldb/packages/Python/lldbsuite/test/make -include /Users/buildslave/jenkins/workspace/lldb-cmake-matrix/llvm-project/lldb/packages/Python/lldbsuite/test/make/test_common.h -fno-limit-debug-info -D__STDC_LIMIT_MACROS -D__STDC_FORMAT_MACROS --driver-mode=g++ -MT main.o -MD -MP -MF main.d -c -o main.o /Users/buildslave/jenkins/workspace/lldb-cmake-matrix/llvm-project/lldb/test/API/tools/lldb-server/main.cpp "/Users/buildslave/jenkins/workspace/lldb-cmake-matrix/clang_1300_build/bin/clang" main.o -g -O0 -fno-builtin -isysroot "/Applications/Xcode.app/Contents/Developer/Platforms/MacOSX.platform/Developer/SDKs/MacOSX10.15.sdk" -arch x86_64 -I/Users/buildslave/jenkins/workspace/lldb-cmake-matrix/llvm-project/lldb/packages/Python/lldbsuite/test/make/../../../../../include -I/Users/buildslave/jenkins/workspace/lldb-cmake-matrix/llvm-project/lldb/test/API/tools/lldb-server -I/Users/buildslave/jenkins/workspace/lldb-cmake-matrix/llvm-project/lldb/packages/Python/lldbsuite/test/make -include /Users/buildslave/jenkins/workspace/lldb-cmake-matrix/llvm-project/lldb/packages/Python/lldbsuite/test/make/test_common.h -fno-limit-debug-info -D__STDC_LIMIT_MACROS -D__STDC_FORMAT_MACROS --driver-mode=g++ -o "a.out" codesign -s - "a.out"

Hide Details

Hide Details

PASS: LLDB (/Users/buildslave/jenkins/workspace/lldb-cmake-matrix/clang_1300_build/bin/clang-x86_64) :: test_qSupported_returns_known_stub_features_debugserver (TestLldbGdbServer.LldbGdbServerTestCase) UNSUPPORTED: LLDB (/Users/buildslave/jenkins/workspace/lldb-cmake-matrix/clang_1300_build/bin/clang-x86_64) :: test_qSupported_returns_known_stub_features_llgs (TestLldbGdbServer.LldbGdbServerTestCase) (test case does not fall in any category of interest for this run) UNSUPPORTED: LLDB (/Users/buildslave/jenkins/workspace/lldb-cmake-matrix/clang_1300_build/bin/clang-x86_64) :: test_qSupported_vfork_events_debugserver (TestLldbGdbServer.LldbGdbServerTestCase) (test case does not fall in any category of interest for this run) UNSUPPORTED: LLDB (/Users/buildslave/jenkins/workspace/lldb-cmake-matrix/clang_1300_build/bin/clang-x86_64) :: test_qSupported_vfork_events_llgs (TestLldbGdbServer.LldbGdbServerTestCase) (test case does not fall in any category of interest for this run) UNSUPPORTED: LLDB (/Users/buildslave/jenkins/workspace/lldb-cmake-matrix/clang_1300_build/bin/clang-x86_64) :: test_qSupported_vfork_events_without_multiprocess_debugserver (TestLldbGdbServer.LldbGdbServerTestCase) (test case does not fall in any category of interest for this run) UNSUPPORTED: LLDB (/Users/buildslave/jenkins/workspace/lldb-cmake-matrix/clang_1300_build/bin/clang-x86_64) :: test_qSupported_vfork_events_without_multiprocess_llgs (TestLldbGdbServer.LldbGdbServerTestCase) (test case does not fall in any category of interest for this run) make VPATH=/Users/buildslave/jenkins/workspace/lldb-cmake-matrix/llvm-project/lldb/test/API/tools/lldb-server -C /Users/buildslave/jenkins/workspace/lldb-cmake-matrix/lldb-build/lldb-test-build.noindex/tools/lldb-server/TestLldbGdbServer.test_qThreadInfo_contains_thread_attach_debugserver -I /Users/buildslave/jenkins/workspace/lldb-cmake-matrix/llvm-project/lldb/test/API/tools/lldb-server -I /Users/buildslave/jenkins/workspace/lldb-cmake-matrix/llvm-project/lldb/packages/Python/lldbsuite/test/make -f /Users/buildslave/jenkins/workspace/lldb-cmake-matrix/llvm-project/lldb/test/API/tools/lldb-server/Makefile all ARCH=x86_64 'CC="/Users/buildslave/jenkins/workspace/lldb-cmake-matrix/clang_1300_build/bin/clang"' DSYMUTIL=/Users/buildslave/jenkins/workspace/lldb-cmake-matrix/lldb-build/./bin/dsymutil CODESIGN=codesign CLANG_MODULE_CACHE_DIR=/Users/buildslave/jenkins/workspace/lldb-cmake-matrix/lldb-build/lldb-test-build.noindex/module-cache-clang/lldb-api

Hide Details

"/Users/buildslave/jenkins/workspace/lldb-cmake-matrix/clang_1300_build/bin/clang" -std=c++11 -g -O0 -fno-builtin -isysroot "/Applications/Xcode.app/Contents/Developer/Platforms/MacOSX.platform/Developer/SDKs/MacOSX10.15.sdk" -arch x86_64 -I/Users/buildslave/jenkins/workspace/lldb-cmake-matrix/llvm-project/lldb/packages/Python/lldbsuite/test/make/../../../../../include -I/Users/buildslave/jenkins/workspace/lldb-cmake-matrix/llvm-project/lldb/test/API/tools/lldb-server -I/Users/buildslave/jenkins/workspace/lldb-cmake-matrix/llvm-project/lldb/packages/Python/lldbsuite/test/make -include /Users/buildslave/jenkins/workspace/lldb-cmake-matrix/llvm-project/lldb/packages/Python/lldbsuite/test/make/test_common.h -fno-limit-debug-info -D__STDC_LIMIT_MACROS -D__STDC_FORMAT_MACROS --driver-mode=g++ -MT main.o -MD -MP -MF main.d -c -o main.o /Users/buildslave/jenkins/workspace/lldb-cmake-matrix/llvm-project/lldb/test/API/tools/lldb-server/main.cpp "/Users/buildslave/jenkins/workspace/lldb-cmake-matrix/clang_1300_build/bin/clang" main.o -g -O0 -fno-builtin -isysroot "/Applications/Xcode.app/Contents/Developer/Platforms/MacOSX.platform/Developer/SDKs/MacOSX10.15.sdk" -arch x86_64 -I/Users/buildslave/jenkins/workspace/lldb-cmake-matrix/llvm-project/lldb/packages/Python/lldbsuite/test/make/../../../../../include -I/Users/buildslave/jenkins/workspace/lldb-cmake-matrix/llvm-project/lldb/test/API/tools/lldb-server -I/Users/buildslave/jenkins/workspace/lldb-cmake-matrix/llvm-project/lldb/packages/Python/lldbsuite/test/make -include /Users/buildslave/jenkins/workspace/lldb-cmake-matrix/llvm-project/lldb/packages/Python/lldbsuite/test/make/test_common.h -fno-limit-debug-info -D__STDC_LIMIT_MACROS -D__STDC_FORMAT_MACROS --driver-mode=g++ -o "a.out" codesign -s - "a.out"

Hide Details

Hide Details

PASS: LLDB (/Users/buildslave/jenkins/workspace/lldb-cmake-matrix/clang_1300_build/bin/clang-x86_64) :: test_qThreadInfo_contains_thread_attach_debugserver (TestLldbGdbServer.LldbGdbServerTestCase) UNSUPPORTED: LLDB (/Users/buildslave/jenkins/workspace/lldb-cmake-matrix/clang_1300_build/bin/clang-x86_64) :: test_qThreadInfo_contains_thread_attach_llgs (TestLldbGdbServer.LldbGdbServerTestCase) (test case does not fall in any category of interest for this run) make VPATH=/Users/buildslave/jenkins/workspace/lldb-cmake-matrix/llvm-project/lldb/test/API/tools/lldb-server -C /Users/buildslave/jenkins/workspace/lldb-cmake-matrix/lldb-build/lldb-test-build.noindex/tools/lldb-server/TestLldbGdbServer.test_qThreadInfo_contains_thread_launch_debugserver -I /Users/buildslave/jenkins/workspace/lldb-cmake-matrix/llvm-project/lldb/test/API/tools/lldb-server -I /Users/buildslave/jenkins/workspace/lldb-cmake-matrix/llvm-project/lldb/packages/Python/lldbsuite/test/make -f /Users/buildslave/jenkins/workspace/lldb-cmake-matrix/llvm-project/lldb/test/API/tools/lldb-server/Makefile all ARCH=x86_64 'CC="/Users/buildslave/jenkins/workspace/lldb-cmake-matrix/clang_1300_build/bin/clang"' DSYMUTIL=/Users/buildslave/jenkins/workspace/lldb-cmake-matrix/lldb-build/./bin/dsymutil CODESIGN=codesign CLANG_MODULE_CACHE_DIR=/Users/buildslave/jenkins/workspace/lldb-cmake-matrix/lldb-build/lldb-test-build.noindex/module-cache-clang/lldb-api

Hide Details

"/Users/buildslave/jenkins/workspace/lldb-cmake-matrix/clang_1300_build/bin/clang" -std=c++11 -g -O0 -fno-builtin -isysroot "/Applications/Xcode.app/Contents/Developer/Platforms/MacOSX.platform/Developer/SDKs/MacOSX10.15.sdk" -arch x86_64 -I/Users/buildslave/jenkins/workspace/lldb-cmake-matrix/llvm-project/lldb/packages/Python/lldbsuite/test/make/../../../../../include -I/Users/buildslave/jenkins/workspace/lldb-cmake-matrix/llvm-project/lldb/test/API/tools/lldb-server -I/Users/buildslave/jenkins/workspace/lldb-cmake-matrix/llvm-project/lldb/packages/Python/lldbsuite/test/make -include /Users/buildslave/jenkins/workspace/lldb-cmake-matrix/llvm-project/lldb/packages/Python/lldbsuite/test/make/test_common.h -fno-limit-debug-info -D__STDC_LIMIT_MACROS -D__STDC_FORMAT_MACROS --driver-mode=g++ -MT main.o -MD -MP -MF main.d -c -o main.o /Users/buildslave/jenkins/workspace/lldb-cmake-matrix/llvm-project/lldb/test/API/tools/lldb-server/main.cpp "/Users/buildslave/jenkins/workspace/lldb-cmake-matrix/clang_1300_build/bin/clang" main.o -g -O0 -fno-builtin -isysroot "/Applications/Xcode.app/Contents/Developer/Platforms/MacOSX.platform/Developer/SDKs/MacOSX10.15.sdk" -arch x86_64 -I/Users/buildslave/jenkins/workspace/lldb-cmake-matrix/llvm-project/lldb/packages/Python/lldbsuite/test/make/../../../../../include -I/Users/buildslave/jenkins/workspace/lldb-cmake-matrix/llvm-project/lldb/test/API/tools/lldb-server -I/Users/buildslave/jenkins/workspace/lldb-cmake-matrix/llvm-project/lldb/packages/Python/lldbsuite/test/make -include /Users/buildslave/jenkins/workspace/lldb-cmake-matrix/llvm-project/lldb/packages/Python/lldbsuite/test/make/test_common.h -fno-limit-debug-info -D__STDC_LIMIT_MACROS -D__STDC_FORMAT_MACROS --driver-mode=g++ -o "a.out" codesign -s - "a.out"

Hide Details

Hide Details

PASS: LLDB (/Users/buildslave/jenkins/workspace/lldb-cmake-matrix/clang_1300_build/bin/clang-x86_64) :: test_qThreadInfo_contains_thread_launch_debugserver (TestLldbGdbServer.LldbGdbServerTestCase) UNSUPPORTED: LLDB (/Users/buildslave/jenkins/workspace/lldb-cmake-matrix/clang_1300_build/bin/clang-x86_64) :: test_qThreadInfo_contains_thread_launch_llgs (TestLldbGdbServer.LldbGdbServerTestCase) (test case does not fall in any category of interest for this run) make VPATH=/Users/buildslave/jenkins/workspace/lldb-cmake-matrix/llvm-project/lldb/test/API/tools/lldb-server -C /Users/buildslave/jenkins/workspace/lldb-cmake-matrix/lldb-build/lldb-test-build.noindex/tools/lldb-server/TestLldbGdbServer.test_qThreadInfo_matches_qC_attach_debugserver -I /Users/buildslave/jenkins/workspace/lldb-cmake-matrix/llvm-project/lldb/test/API/tools/lldb-server -I /Users/buildslave/jenkins/workspace/lldb-cmake-matrix/llvm-project/lldb/packages/Python/lldbsuite/test/make -f /Users/buildslave/jenkins/workspace/lldb-cmake-matrix/llvm-project/lldb/test/API/tools/lldb-server/Makefile all ARCH=x86_64 'CC="/Users/buildslave/jenkins/workspace/lldb-cmake-matrix/clang_1300_build/bin/clang"' DSYMUTIL=/Users/buildslave/jenkins/workspace/lldb-cmake-matrix/lldb-build/./bin/dsymutil CODESIGN=codesign CLANG_MODULE_CACHE_DIR=/Users/buildslave/jenkins/workspace/lldb-cmake-matrix/lldb-build/lldb-test-build.noindex/module-cache-clang/lldb-api

Hide Details

"/Users/buildslave/jenkins/workspace/lldb-cmake-matrix/clang_1300_build/bin/clang" -std=c++11 -g -O0 -fno-builtin -isysroot "/Applications/Xcode.app/Contents/Developer/Platforms/MacOSX.platform/Developer/SDKs/MacOSX10.15.sdk" -arch x86_64 -I/Users/buildslave/jenkins/workspace/lldb-cmake-matrix/llvm-project/lldb/packages/Python/lldbsuite/test/make/../../../../../include -I/Users/buildslave/jenkins/workspace/lldb-cmake-matrix/llvm-project/lldb/test/API/tools/lldb-server -I/Users/buildslave/jenkins/workspace/lldb-cmake-matrix/llvm-project/lldb/packages/Python/lldbsuite/test/make -include /Users/buildslave/jenkins/workspace/lldb-cmake-matrix/llvm-project/lldb/packages/Python/lldbsuite/test/make/test_common.h -fno-limit-debug-info -D__STDC_LIMIT_MACROS -D__STDC_FORMAT_MACROS --driver-mode=g++ -MT main.o -MD -MP -MF main.d -c -o main.o /Users/buildslave/jenkins/workspace/lldb-cmake-matrix/llvm-project/lldb/test/API/tools/lldb-server/main.cpp "/Users/buildslave/jenkins/workspace/lldb-cmake-matrix/clang_1300_build/bin/clang" main.o -g -O0 -fno-builtin -isysroot "/Applications/Xcode.app/Contents/Developer/Platforms/MacOSX.platform/Developer/SDKs/MacOSX10.15.sdk" -arch x86_64 -I/Users/buildslave/jenkins/workspace/lldb-cmake-matrix/llvm-project/lldb/packages/Python/lldbsuite/test/make/../../../../../include -I/Users/buildslave/jenkins/workspace/lldb-cmake-matrix/llvm-project/lldb/test/API/tools/lldb-server -I/Users/buildslave/jenkins/workspace/lldb-cmake-matrix/llvm-project/lldb/packages/Python/lldbsuite/test/make -include /Users/buildslave/jenkins/workspace/lldb-cmake-matrix/llvm-project/lldb/packages/Python/lldbsuite/test/make/test_common.h -fno-limit-debug-info -D__STDC_LIMIT_MACROS -D__STDC_FORMAT_MACROS --driver-mode=g++ -o "a.out" codesign -s - "a.out"

Hide Details

Hide Details

PASS: LLDB (/Users/buildslave/jenkins/workspace/lldb-cmake-matrix/clang_1300_build/bin/clang-x86_64) :: test_qThreadInfo_matches_qC_attach_debugserver (TestLldbGdbServer.LldbGdbServerTestCase) UNSUPPORTED: LLDB (/Users/buildslave/jenkins/workspace/lldb-cmake-matrix/clang_1300_build/bin/clang-x86_64) :: test_qThreadInfo_matches_qC_attach_llgs (TestLldbGdbServer.LldbGdbServerTestCase) (test case does not fall in any category of interest for this run) make VPATH=/Users/buildslave/jenkins/workspace/lldb-cmake-matrix/llvm-project/lldb/test/API/tools/lldb-server -C /Users/buildslave/jenkins/workspace/lldb-cmake-matrix/lldb-build/lldb-test-build.noindex/tools/lldb-server/TestLldbGdbServer.test_qThreadInfo_matches_qC_launch_debugserver -I /Users/buildslave/jenkins/workspace/lldb-cmake-matrix/llvm-project/lldb/test/API/tools/lldb-server -I /Users/buildslave/jenkins/workspace/lldb-cmake-matrix/llvm-project/lldb/packages/Python/lldbsuite/test/make -f /Users/buildslave/jenkins/workspace/lldb-cmake-matrix/llvm-project/lldb/test/API/tools/lldb-server/Makefile all ARCH=x86_64 'CC="/Users/buildslave/jenkins/workspace/lldb-cmake-matrix/clang_1300_build/bin/clang"' DSYMUTIL=/Users/buildslave/jenkins/workspace/lldb-cmake-matrix/lldb-build/./bin/dsymutil CODESIGN=codesign CLANG_MODULE_CACHE_DIR=/Users/buildslave/jenkins/workspace/lldb-cmake-matrix/lldb-build/lldb-test-build.noindex/module-cache-clang/lldb-api

Hide Details

"/Users/buildslave/jenkins/workspace/lldb-cmake-matrix/clang_1300_build/bin/clang" -std=c++11 -g -O0 -fno-builtin -isysroot "/Applications/Xcode.app/Contents/Developer/Platforms/MacOSX.platform/Developer/SDKs/MacOSX10.15.sdk" -arch x86_64 -I/Users/buildslave/jenkins/workspace/lldb-cmake-matrix/llvm-project/lldb/packages/Python/lldbsuite/test/make/../../../../../include -I/Users/buildslave/jenkins/workspace/lldb-cmake-matrix/llvm-project/lldb/test/API/tools/lldb-server -I/Users/buildslave/jenkins/workspace/lldb-cmake-matrix/llvm-project/lldb/packages/Python/lldbsuite/test/make -include /Users/buildslave/jenkins/workspace/lldb-cmake-matrix/llvm-project/lldb/packages/Python/lldbsuite/test/make/test_common.h -fno-limit-debug-info -D__STDC_LIMIT_MACROS -D__STDC_FORMAT_MACROS --driver-mode=g++ -MT main.o -MD -MP -MF main.d -c -o main.o /Users/buildslave/jenkins/workspace/lldb-cmake-matrix/llvm-project/lldb/test/API/tools/lldb-server/main.cpp "/Users/buildslave/jenkins/workspace/lldb-cmake-matrix/clang_1300_build/bin/clang" main.o -g -O0 -fno-builtin -isysroot "/Applications/Xcode.app/Contents/Developer/Platforms/MacOSX.platform/Developer/SDKs/MacOSX10.15.sdk" -arch x86_64 -I/Users/buildslave/jenkins/workspace/lldb-cmake-matrix/llvm-project/lldb/packages/Python/lldbsuite/test/make/../../../../../include -I/Users/buildslave/jenkins/workspace/lldb-cmake-matrix/llvm-project/lldb/test/API/tools/lldb-server -I/Users/buildslave/jenkins/workspace/lldb-cmake-matrix/llvm-project/lldb/packages/Python/lldbsuite/test/make -include /Users/buildslave/jenkins/workspace/lldb-cmake-matrix/llvm-project/lldb/packages/Python/lldbsuite/test/make/test_common.h -fno-limit-debug-info -D__STDC_LIMIT_MACROS -D__STDC_FORMAT_MACROS --driver-mode=g++ -o "a.out" codesign -s - "a.out"

Hide Details

Hide Details

PASS: LLDB (/Users/buildslave/jenkins/workspace/lldb-cmake-matrix/clang_1300_build/bin/clang-x86_64) :: test_qThreadInfo_matches_qC_launch_debugserver (TestLldbGdbServer.LldbGdbServerTestCase) UNSUPPORTED: LLDB (/Users/buildslave/jenkins/workspace/lldb-cmake-matrix/clang_1300_build/bin/clang-x86_64) :: test_qThreadInfo_matches_qC_launch_llgs (TestLldbGdbServer.LldbGdbServerTestCase) (test case does not fall in any category of interest for this run) make VPATH=/Users/buildslave/jenkins/workspace/lldb-cmake-matrix/llvm-project/lldb/test/API/tools/lldb-server -C /Users/buildslave/jenkins/workspace/lldb-cmake-matrix/lldb-build/lldb-test-build.noindex/tools/lldb-server/TestLldbGdbServer.test_software_breakpoint_set_and_remove_work_debugserver -I /Users/buildslave/jenkins/workspace/lldb-cmake-matrix/llvm-project/lldb/test/API/tools/lldb-server -I /Users/buildslave/jenkins/workspace/lldb-cmake-matrix/llvm-project/lldb/packages/Python/lldbsuite/test/make -f /Users/buildslave/jenkins/workspace/lldb-cmake-matrix/llvm-project/lldb/test/API/tools/lldb-server/Makefile all ARCH=x86_64 'CC="/Users/buildslave/jenkins/workspace/lldb-cmake-matrix/clang_1300_build/bin/clang"' DSYMUTIL=/Users/buildslave/jenkins/workspace/lldb-cmake-matrix/lldb-build/./bin/dsymutil CODESIGN=codesign CLANG_MODULE_CACHE_DIR=/Users/buildslave/jenkins/workspace/lldb-cmake-matrix/lldb-build/lldb-test-build.noindex/module-cache-clang/lldb-api

Hide Details

"/Users/buildslave/jenkins/workspace/lldb-cmake-matrix/clang_1300_build/bin/clang" -std=c++11 -g -O0 -fno-builtin -isysroot "/Applications/Xcode.app/Contents/Developer/Platforms/MacOSX.platform/Developer/SDKs/MacOSX10.15.sdk" -arch x86_64 -I/Users/buildslave/jenkins/workspace/lldb-cmake-matrix/llvm-project/lldb/packages/Python/lldbsuite/test/make/../../../../../include -I/Users/buildslave/jenkins/workspace/lldb-cmake-matrix/llvm-project/lldb/test/API/tools/lldb-server -I/Users/buildslave/jenkins/workspace/lldb-cmake-matrix/llvm-project/lldb/packages/Python/lldbsuite/test/make -include /Users/buildslave/jenkins/workspace/lldb-cmake-matrix/llvm-project/lldb/packages/Python/lldbsuite/test/make/test_common.h -fno-limit-debug-info -D__STDC_LIMIT_MACROS -D__STDC_FORMAT_MACROS --driver-mode=g++ -MT main.o -MD -MP -MF main.d -c -o main.o /Users/buildslave/jenkins/workspace/lldb-cmake-matrix/llvm-project/lldb/test/API/tools/lldb-server/main.cpp "/Users/buildslave/jenkins/workspace/lldb-cmake-matrix/clang_1300_build/bin/clang" main.o -g -O0 -fno-builtin -isysroot "/Applications/Xcode.app/Contents/Developer/Platforms/MacOSX.platform/Developer/SDKs/MacOSX10.15.sdk" -arch x86_64 -I/Users/buildslave/jenkins/workspace/lldb-cmake-matrix/llvm-project/lldb/packages/Python/lldbsuite/test/make/../../../../../include -I/Users/buildslave/jenkins/workspace/lldb-cmake-matrix/llvm-project/lldb/test/API/tools/lldb-server -I/Users/buildslave/jenkins/workspace/lldb-cmake-matrix/llvm-project/lldb/packages/Python/lldbsuite/test/make -include /Users/buildslave/jenkins/workspace/lldb-cmake-matrix/llvm-project/lldb/packages/Python/lldbsuite/test/make/test_common.h -fno-limit-debug-info -D__STDC_LIMIT_MACROS -D__STDC_FORMAT_MACROS --driver-mode=g++ -o "a.out" codesign -s - "a.out"

Hide Details

Hide Details

PASS: LLDB (/Users/buildslave/jenkins/workspace/lldb-cmake-matrix/clang_1300_build/bin/clang-x86_64) :: test_software_breakpoint_set_and_remove_work_debugserver (TestLldbGdbServer.LldbGdbServerTestCase) UNSUPPORTED: LLDB (/Users/buildslave/jenkins/workspace/lldb-cmake-matrix/clang_1300_build/bin/clang-x86_64) :: test_software_breakpoint_set_and_remove_work_llgs (TestLldbGdbServer.LldbGdbServerTestCase) (test case does not fall in any category of interest for this run) PASS: LLDB (/Users/buildslave/jenkins/workspace/lldb-cmake-matrix/clang_1300_build/bin/clang-x86_64) :: test_thread_suffix_supported_debugserver (TestLldbGdbServer.LldbGdbServerTestCase) UNSUPPORTED: LLDB (/Users/buildslave/jenkins/workspace/lldb-cmake-matrix/clang_1300_build/bin/clang-x86_64) :: test_thread_suffix_supported_llgs (TestLldbGdbServer.LldbGdbServerTestCase) (test case does not fall in any category of interest for this run) make VPATH=/Users/buildslave/jenkins/workspace/lldb-cmake-matrix/llvm-project/lldb/test/API/tools/lldb-server -C /Users/buildslave/jenkins/workspace/lldb-cmake-matrix/lldb-build/lldb-test-build.noindex/tools/lldb-server/TestLldbGdbServer.test_written_M_content_reads_back_correctly_debugserver -I /Users/buildslave/jenkins/workspace/lldb-cmake-matrix/llvm-project/lldb/test/API/tools/lldb-server -I /Users/buildslave/jenkins/workspace/lldb-cmake-matrix/llvm-project/lldb/packages/Python/lldbsuite/test/make -f /Users/buildslave/jenkins/workspace/lldb-cmake-matrix/llvm-project/lldb/test/API/tools/lldb-server/Makefile all ARCH=x86_64 'CC="/Users/buildslave/jenkins/workspace/lldb-cmake-matrix/clang_1300_build/bin/clang"' DSYMUTIL=/Users/buildslave/jenkins/workspace/lldb-cmake-matrix/lldb-build/./bin/dsymutil CODESIGN=codesign CLANG_MODULE_CACHE_DIR=/Users/buildslave/jenkins/workspace/lldb-cmake-matrix/lldb-build/lldb-test-build.noindex/module-cache-clang/lldb-api

Hide Details

"/Users/buildslave/jenkins/workspace/lldb-cmake-matrix/clang_1300_build/bin/clang" -std=c++11 -g -O0 -fno-builtin -isysroot "/Applications/Xcode.app/Contents/Developer/Platforms/MacOSX.platform/Developer/SDKs/MacOSX10.15.sdk" -arch x86_64 -I/Users/buildslave/jenkins/workspace/lldb-cmake-matrix/llvm-project/lldb/packages/Python/lldbsuite/test/make/../../../../../include -I/Users/buildslave/jenkins/workspace/lldb-cmake-matrix/llvm-project/lldb/test/API/tools/lldb-server -I/Users/buildslave/jenkins/workspace/lldb-cmake-matrix/llvm-project/lldb/packages/Python/lldbsuite/test/make -include /Users/buildslave/jenkins/workspace/lldb-cmake-matrix/llvm-project/lldb/packages/Python/lldbsuite/test/make/test_common.h -fno-limit-debug-info -D__STDC_LIMIT_MACROS -D__STDC_FORMAT_MACROS --driver-mode=g++ -MT main.o -MD -MP -MF main.d -c -o main.o /Users/buildslave/jenkins/workspace/lldb-cmake-matrix/llvm-project/lldb/test/API/tools/lldb-server/main.cpp "/Users/buildslave/jenkins/workspace/lldb-cmake-matrix/clang_1300_build/bin/clang" main.o -g -O0 -fno-builtin -isysroot "/Applications/Xcode.app/Contents/Developer/Platforms/MacOSX.platform/Developer/SDKs/MacOSX10.15.sdk" -arch x86_64 -I/Users/buildslave/jenkins/workspace/lldb-cmake-matrix/llvm-project/lldb/packages/Python/lldbsuite/test/make/../../../../../include -I/Users/buildslave/jenkins/workspace/lldb-cmake-matrix/llvm-project/lldb/test/API/tools/lldb-server -I/Users/buildslave/jenkins/workspace/lldb-cmake-matrix/llvm-project/lldb/packages/Python/lldbsuite/test/make -include /Users/buildslave/jenkins/workspace/lldb-cmake-matrix/llvm-project/lldb/packages/Python/lldbsuite/test/make/test_common.h -fno-limit-debug-info -D__STDC_LIMIT_MACROS -D__STDC_FORMAT_MACROS --driver-mode=g++ -o "a.out" codesign -s - "a.out"

Hide Details

Hide Details

PASS: LLDB (/Users/buildslave/jenkins/workspace/lldb-cmake-matrix/clang_1300_build/bin/clang-x86_64) :: test_written_M_content_reads_back_correctly_debugserver (TestLldbGdbServer.LldbGdbServerTestCase) UNSUPPORTED: LLDB (/Users/buildslave/jenkins/workspace/lldb-cmake-matrix/clang_1300_build/bin/clang-x86_64) :: test_written_M_content_reads_back_correctly_llgs (TestLldbGdbServer.LldbGdbServerTestCase) (test case does not fall in any category of interest for this run) Restore dir to: /Users/buildslave/jenkins/workspace/lldb-cmake-matrix/lldb-build/tools/lldb/test ====================================================================== ERROR: test_Hg_switches_to_3_threads_launch_debugserver (TestLldbGdbServer.LldbGdbServerTestCase) ---------------------------------------------------------------------- Traceback (most recent call last): File "/Users/buildslave/jenkins/workspace/lldb-cmake-matrix/llvm-project/lldb/packages/Python/lldbsuite/test/tools/lldb-server/gdbremote_testcase.py", line 52, in test_method return attrvalue(self) File "/Users/buildslave/jenkins/workspace/lldb-cmake-matrix/llvm-project/lldb/packages/Python/lldbsuite/test/decorators.py", line 122, in wrapper func(*args, **kwargs) File "/Users/buildslave/jenkins/workspace/lldb-cmake-matrix/llvm-project/lldb/packages/Python/lldbsuite/test/decorators.py", line 152, in wrapper return func(*args, **kwargs) File "/Users/buildslave/jenkins/workspace/lldb-cmake-matrix/llvm-project/lldb/test/API/tools/lldb-server/TestLldbGdbServer.py", line 397, in test_Hg_switches_to_3_threads_launch self.Hg_switches_to_3_threads() File "/Users/buildslave/jenkins/workspace/lldb-cmake-matrix/llvm-project/lldb/test/API/tools/lldb-server/TestLldbGdbServer.py", line 367, in Hg_switches_to_3_threads threads = self.wait_for_thread_count(3) File "/Users/buildslave/jenkins/workspace/lldb-cmake-matrix/llvm-project/lldb/packages/Python/lldbsuite/test/tools/lldb-server/gdbremote_testcase.py", line 795, in wait_for_thread_count self.DEFAULT_TIMEOUT, thread_count, actual_thread_count)) Exception: timed out after 20 seconds while waiting for threads: waiting for at least 3 threads, found 1 Config=x86_64-/Users/buildslave/jenkins/workspace/lldb-cmake-matrix/clang_1300_build/bin/clang ---------------------------------------------------------------------- Ran 84 tests in 128.380s

Hide Details

RESULT: FAILED (30 passes, 0 failures, 1 errors, 52 skipped, 1 expected failures, 0 unexpected successes)

Hide Details

--

Hide Details

******************** Slowest Tests: -------------------------------------------------------------------------- 128.88s: lldb-api :: tools/lldb-server/TestLldbGdbServer.py 88.20s: lldb-api :: api/multithreaded/TestMultithreaded.py 72.65s: lldb-api :: commands/process/attach/TestProcessAttach.py 54.32s: lldb-api :: lang/objc/foundation/TestFoundationDisassembly.py 53.61s: lldb-api :: functionalities/load_unload/TestLoadUnload.py 48.19s: lldb-api :: lang/objc/hidden-ivars/TestHiddenIvars.py 47.34s: lldb-api :: tools/lldb-server/vCont-threads/TestGdbRemote_vContThreads.py 44.29s: lldb-api :: functionalities/completion/TestCompletion.py 40.31s: lldb-api :: lang/objc/exceptions/TestObjCExceptions.py 38.59s: lldb-api :: python_api/target/TestTargetAPI.py 37.78s: lldb-api :: types/TestLongTypesExpr.py 36.83s: lldb-api :: lang/cpp/namespace/TestNamespaceLookup.py 36.12s: lldb-api :: tools/lldb-server/TestGdbRemoteThreadsInStopReply.py 34.41s: lldb-api :: functionalities/limit-debug-info/TestLimitDebugInfo.py 31.13s: lldb-api :: lang/objc/foundation/TestObjCMethods.py 30.55s: lldb-api :: types/TestLongTypes.py 26.43s: lldb-api :: functionalities/inferior-crashing/TestInferiorCrashingStep.py 26.10s: lldb-api :: lang/objc/real-definition/TestRealDefinition.py 25.95s: lldb-api :: commands/target/basic/TestTargetCommand.py 25.21s: lldb-api :: tools/lldb-vscode/launch/TestVSCode_launch.py

Hide Details

Tests Times: -------------------------------------------------------------------------- [ Range ] :: [ Percentage ] :: [ Count ] -------------------------------------------------------------------------- [120s,130s) :: [ ] :: [ 1/2487] [110s,120s) :: [ ] :: [ 0/2487] [100s,110s) :: [ ] :: [ 0/2487] [ 90s,100s) :: [ ] :: [ 0/2487] [ 80s, 90s) :: [ ] :: [ 1/2487] [ 70s, 80s) :: [ ] :: [ 1/2487] [ 60s, 70s) :: [ ] :: [ 0/2487] [ 50s, 60s) :: [ ] :: [ 2/2487] [ 40s, 50s) :: [ ] :: [ 4/2487] [ 30s, 40s) :: [ ] :: [ 7/2487] [ 20s, 30s) :: [ ] :: [ 19/2487] [ 10s, 20s) :: [* ] :: [ 96/2487] [ 0s, 10s) :: [************************************* ] :: [2356/2487] -------------------------------------------------------------------------- ******************** Failed Tests (1): lldb-api :: tools/lldb-server/TestLldbGdbServer.py

Hide Details

Hide Details

Testing Time: 378.09s Unsupported : 312 Passed : 2165 Expectedly Failed: 9 Failed : 1 FAILED: tools/lldb/test/CMakeFiles/check-lldb cd /Users/buildslave/jenkins/workspace/lldb-cmake-matrix/lldb-build/tools/lldb/test && /usr/local/Frameworks/Python.framework/Versions/3.7/bin/python3.7 /Users/buildslave/jenkins/workspace/lldb-cmake-matrix/lldb-build/./bin/llvm-lit -v --time-tests --shuffle --xunit-xml-output=/Users/buildslave/jenkins/workspace/lldb-cmake-matrix/test/results.xml -v /Users/buildslave/jenkins/workspace/lldb-cmake-matrix/lldb-build/tools/lldb/test ninja: build stopped: subcommand failed. Command failed: Command '['/usr/bin/env', 'TERM=vt100', '/usr/local/bin/ninja', '-v', 'check-lldb']' returned non-zero exit status 1. Command: ['/usr/bin/env', 'TERM=vt100', '/usr/local/bin/ninja', '-v', 'check-lldb'] + set -e [Pipeline] } [Pipeline] // timeout [Pipeline] junit Recording test results [Checks API] No suitable checks publisher found. [Pipeline] } [Pipeline] // stage [Pipeline] } [Pipeline] // withEnv [Pipeline] } [Pipeline] // node [Pipeline] End of Pipeline Finished: UNSTABLE