FailedConsole Output

Skipping 6,765 KB.. Full Log
output: 

Hide Details

runCmd: settings set target.auto-apply-fixits false output:

Hide Details

runCmd: settings set plugin.process.gdb-remote.packet-timeout 60 output:

Hide Details

runCmd: settings set symbols.clang-modules-cache-path "/Users/buildslave/jenkins/workspace/lldb-cmake-sanitized/lldb-build/lldb-test-build.noindex/module-cache-lldb/lldb-api" output:

Hide Details

runCmd: settings set use-color false output:

Hide Details

runCmd: setting set target.prefer-dynamic-value no-dynamic-values output:

Hide Details

runCmd: settings set target.env-vars ASAN_OPTIONS=detect_stack_use_after_return=1 DYLD_INSERT_LIBRARIES=/Users/buildslave/jenkins/workspace/lldb-cmake-sanitized/host-compiler/lib/clang/11.0.0/lib/darwin/libclang_rt.asan_osx_dynamic.dylib output:

Hide Details

FAIL: LLDB (/Users/buildslave/jenkins/workspace/lldb-cmake-sanitized/lldb-build/bin/clang-11-x86_64) :: test_step_out_of_malloc_into_function_b_gmodules (TestThreadAPI.ThreadAPITestCase) <bound method SBProcess.Kill of <lldb.SBProcess; proxy of <Swig Object of type 'lldb::SBProcess *' at 0x1122e56c0> >>: success

Hide Details

runCmd: settings clear -all output:

Hide Details

runCmd: settings set symbols.enable-external-lookup false output:

Hide Details

runCmd: settings set target.auto-apply-fixits false output:

Hide Details

runCmd: settings set plugin.process.gdb-remote.packet-timeout 60 output:

Hide Details

runCmd: settings set symbols.clang-modules-cache-path "/Users/buildslave/jenkins/workspace/lldb-cmake-sanitized/lldb-build/lldb-test-build.noindex/module-cache-lldb/lldb-api" output:

Hide Details

runCmd: settings set use-color false output:

Hide Details

runCmd: setting set target.prefer-dynamic-value no-dynamic-values output:

Hide Details

runCmd: settings set target.env-vars ASAN_OPTIONS=detect_stack_use_after_return=1 DYLD_INSERT_LIBRARIES=/Users/buildslave/jenkins/workspace/lldb-cmake-sanitized/host-compiler/lib/clang/11.0.0/lib/darwin/libclang_rt.asan_osx_dynamic.dylib output:

Hide Details

runCmd: breakpoint list output: Current breakpoints: 1: file = 'main2.cpp', line = 21, exact_match = 0, locations = 1 1.1: where = test_step_over_3_times_dsym`b(int) + 22 at main2.cpp:21:17, address = test_step_over_3_times_dsym[0x0000000100000e66], unresolved, hit count = 0

Hide Details

Hide Details

Hide Details

runCmd: thread backtrace output: * thread #1, queue = 'com.apple.main-thread', stop reason = breakpoint 1.1 * frame #0: 0x00000001091ffe66 test_step_over_3_times_dsym`b(val=1) at main2.cpp:21:17 frame #1: 0x00000001091ffe0d test_step_over_3_times_dsym`a(val=1) at main2.cpp:11:16 frame #2: 0x00000001091ffee0 test_step_over_3_times_dsym`main(argc=1, argv=0x00007ffee6a00468) at main2.cpp:36:14 frame #3: 0x00007fff79bb7085 libdyld.dylib`start + 1 frame #4: 0x00007fff79bb7085 libdyld.dylib`start + 1

Hide Details

Hide Details

runCmd: thread backtrace output: * thread #1, queue = 'com.apple.main-thread', stop reason = step over * frame #0: 0x00000001091ffe9d test_step_over_3_times_dsym`b(val=1) at main2.cpp:26:12 frame #1: 0x00000001091ffe0d test_step_over_3_times_dsym`a(val=1) at main2.cpp:11:16 frame #2: 0x00000001091ffee0 test_step_over_3_times_dsym`main(argc=1, argv=0x00007ffee6a00468) at main2.cpp:36:14 frame #3: 0x00007fff79bb7085 libdyld.dylib`start + 1 frame #4: 0x00007fff79bb7085 libdyld.dylib`start + 1

Hide Details

Hide Details

<bound method SBProcess.Kill of <lldb.SBProcess; proxy of <Swig Object of type 'lldb::SBProcess *' at 0x112853030> >>: success

Hide Details

PASS: LLDB (/Users/buildslave/jenkins/workspace/lldb-cmake-sanitized/lldb-build/bin/clang-11-x86_64) :: test_step_over_3_times_dsym (TestThreadAPI.ThreadAPITestCase) runCmd: settings clear -all output:

Hide Details

runCmd: settings set symbols.enable-external-lookup false output:

Hide Details

runCmd: settings set target.auto-apply-fixits false output:

Hide Details

runCmd: settings set plugin.process.gdb-remote.packet-timeout 60 output:

Hide Details

runCmd: settings set symbols.clang-modules-cache-path "/Users/buildslave/jenkins/workspace/lldb-cmake-sanitized/lldb-build/lldb-test-build.noindex/module-cache-lldb/lldb-api" output:

Hide Details

runCmd: settings set use-color false output:

Hide Details

runCmd: setting set target.prefer-dynamic-value no-dynamic-values output:

Hide Details

runCmd: settings set target.env-vars ASAN_OPTIONS=detect_stack_use_after_return=1 DYLD_INSERT_LIBRARIES=/Users/buildslave/jenkins/workspace/lldb-cmake-sanitized/host-compiler/lib/clang/11.0.0/lib/darwin/libclang_rt.asan_osx_dynamic.dylib output:

Hide Details

runCmd: breakpoint list output: Current breakpoints: 1: file = 'main2.cpp', line = 21, exact_match = 0, locations = 1 1.1: where = test_step_over_3_times_dwarf`b(int) + 22 at main2.cpp:21:17, address = test_step_over_3_times_dwarf[0x0000000100000e66], unresolved, hit count = 0

Hide Details

Hide Details

Hide Details

runCmd: thread backtrace output: * thread #1, queue = 'com.apple.main-thread', stop reason = breakpoint 1.1 * frame #0: 0x0000000101f04e66 test_step_over_3_times_dwarf`b(val=1) at main2.cpp:21:17 frame #1: 0x0000000101f04e0d test_step_over_3_times_dwarf`a(val=1) at main2.cpp:11:16 frame #2: 0x0000000101f04ee0 test_step_over_3_times_dwarf`main(argc=1, argv=0x00007ffeedcfb460) at main2.cpp:36:14 frame #3: 0x00007fff79bb7085 libdyld.dylib`start + 1

Hide Details

Hide Details

runCmd: thread backtrace output: * thread #1, queue = 'com.apple.main-thread', stop reason = step over * frame #0: 0x0000000101f04e9d test_step_over_3_times_dwarf`b(val=1) at main2.cpp:26:12 frame #1: 0x0000000101f04e0d test_step_over_3_times_dwarf`a(val=1) at main2.cpp:11:16 frame #2: 0x0000000101f04ee0 test_step_over_3_times_dwarf`main(argc=1, argv=0x00007ffeedcfb460) at main2.cpp:36:14 frame #3: 0x00007fff79bb7085 libdyld.dylib`start + 1

Hide Details

Hide Details

<bound method SBProcess.Kill of <lldb.SBProcess; proxy of <Swig Object of type 'lldb::SBProcess *' at 0x1122e56c0> >>: success

Hide Details

PASS: LLDB (/Users/buildslave/jenkins/workspace/lldb-cmake-sanitized/lldb-build/bin/clang-11-x86_64) :: test_step_over_3_times_dwarf (TestThreadAPI.ThreadAPITestCase) UNSUPPORTED: LLDB (/Users/buildslave/jenkins/workspace/lldb-cmake-sanitized/lldb-build/bin/clang-11-x86_64) :: test_step_over_3_times_dwo (TestThreadAPI.ThreadAPITestCase) (test case does not fall in any category of interest for this run) runCmd: settings clear -all output:

Hide Details

runCmd: settings set symbols.enable-external-lookup false output:

Hide Details

runCmd: settings set target.auto-apply-fixits false output:

Hide Details

runCmd: settings set plugin.process.gdb-remote.packet-timeout 60 output:

Hide Details

runCmd: settings set symbols.clang-modules-cache-path "/Users/buildslave/jenkins/workspace/lldb-cmake-sanitized/lldb-build/lldb-test-build.noindex/module-cache-lldb/lldb-api" output:

Hide Details

runCmd: settings set use-color false output:

Hide Details

runCmd: setting set target.prefer-dynamic-value no-dynamic-values output:

Hide Details

runCmd: settings set target.env-vars ASAN_OPTIONS=detect_stack_use_after_return=1 DYLD_INSERT_LIBRARIES=/Users/buildslave/jenkins/workspace/lldb-cmake-sanitized/host-compiler/lib/clang/11.0.0/lib/darwin/libclang_rt.asan_osx_dynamic.dylib output:

Hide Details

runCmd: breakpoint list output: Current breakpoints: 1: file = 'main2.cpp', line = 21, exact_match = 0, locations = 1 1.1: where = test_step_over_3_times_gmodules`b(int) + 22 at main2.cpp:21:17, address = test_step_over_3_times_gmodules[0x0000000100000e66], unresolved, hit count = 0

Hide Details

Hide Details

Hide Details

runCmd: thread backtrace output: * thread #1, queue = 'com.apple.main-thread', stop reason = breakpoint 1.1 * frame #0: 0x000000010aaa3e66 test_step_over_3_times_gmodules`b(val=1) at main2.cpp:21:17 frame #1: 0x000000010aaa3e0d test_step_over_3_times_gmodules`a(val=1) at main2.cpp:11:16 frame #2: 0x000000010aaa3ee0 test_step_over_3_times_gmodules`main(argc=1, argv=0x00007ffee515c458) at main2.cpp:36:14 frame #3: 0x00007fff79bb7085 libdyld.dylib`start + 1 frame #4: 0x00007fff79bb7085 libdyld.dylib`start + 1

Hide Details

Hide Details

runCmd: thread backtrace output: * thread #1, queue = 'com.apple.main-thread', stop reason = step over * frame #0: 0x000000010aaa3e9d test_step_over_3_times_gmodules`b(val=1) at main2.cpp:26:12 frame #1: 0x000000010aaa3e0d test_step_over_3_times_gmodules`a(val=1) at main2.cpp:11:16 frame #2: 0x000000010aaa3ee0 test_step_over_3_times_gmodules`main(argc=1, argv=0x00007ffee515c458) at main2.cpp:36:14 frame #3: 0x00007fff79bb7085 libdyld.dylib`start + 1 frame #4: 0x00007fff79bb7085 libdyld.dylib`start + 1

Hide Details

Hide Details

<bound method SBProcess.Kill of <lldb.SBProcess; proxy of <Swig Object of type 'lldb::SBProcess *' at 0x1127f0ae0> >>: success

Hide Details

PASS: LLDB (/Users/buildslave/jenkins/workspace/lldb-cmake-sanitized/lldb-build/bin/clang-11-x86_64) :: test_step_over_3_times_gmodules (TestThreadAPI.ThreadAPITestCase) Restore dir to: /Users/buildslave/jenkins/workspace/lldb-cmake-sanitized/lldb-build/tools/lldb/test ====================================================================== ERROR: test_step_out_of_malloc_into_function_b_dsym (TestThreadAPI.ThreadAPITestCase) Test Python SBThread.StepOut() API to step out of a malloc call where the call site is at function b(). ---------------------------------------------------------------------- Traceback (most recent call last): File "/Users/buildslave/jenkins/workspace/lldb-cmake-sanitized/llvm-project/lldb/packages/Python/lldbsuite/test/lldbtest.py", line 1751, in test_method return attrvalue(self) File "/Users/buildslave/jenkins/workspace/lldb-cmake-sanitized/llvm-project/lldb/packages/Python/lldbsuite/test/decorators.py", line 110, in wrapper func(*args, **kwargs) File "/Users/buildslave/jenkins/workspace/lldb-cmake-sanitized/llvm-project/lldb/packages/Python/lldbsuite/test/decorators.py", line 110, in wrapper func(*args, **kwargs) File "/Users/buildslave/jenkins/workspace/lldb-cmake-sanitized/llvm-project/lldb/packages/Python/lldbsuite/test/decorators.py", line 110, in wrapper func(*args, **kwargs) File "/Users/buildslave/jenkins/workspace/lldb-cmake-sanitized/llvm-project/lldb/test/API/python_api/thread/TestThreadAPI.py", line 50, in test_step_out_of_malloc_into_function_b self.step_out_of_malloc_into_function_b(self.exe_name) File "/Users/buildslave/jenkins/workspace/lldb-cmake-sanitized/llvm-project/lldb/test/API/python_api/thread/TestThreadAPI.py", line 157, in step_out_of_malloc_into_function_b thread.IsValid(), AttributeError: 'NoneType' object has no attribute 'IsValid' Config=x86_64-/Users/buildslave/jenkins/workspace/lldb-cmake-sanitized/lldb-build/bin/clang-11 ====================================================================== ERROR: test_step_out_of_malloc_into_function_b_dwarf (TestThreadAPI.ThreadAPITestCase) Test Python SBThread.StepOut() API to step out of a malloc call where the call site is at function b(). ---------------------------------------------------------------------- Traceback (most recent call last): File "/Users/buildslave/jenkins/workspace/lldb-cmake-sanitized/llvm-project/lldb/packages/Python/lldbsuite/test/lldbtest.py", line 1751, in test_method return attrvalue(self) File "/Users/buildslave/jenkins/workspace/lldb-cmake-sanitized/llvm-project/lldb/packages/Python/lldbsuite/test/decorators.py", line 110, in wrapper func(*args, **kwargs) File "/Users/buildslave/jenkins/workspace/lldb-cmake-sanitized/llvm-project/lldb/packages/Python/lldbsuite/test/decorators.py", line 110, in wrapper func(*args, **kwargs) File "/Users/buildslave/jenkins/workspace/lldb-cmake-sanitized/llvm-project/lldb/packages/Python/lldbsuite/test/decorators.py", line 110, in wrapper func(*args, **kwargs) File "/Users/buildslave/jenkins/workspace/lldb-cmake-sanitized/llvm-project/lldb/test/API/python_api/thread/TestThreadAPI.py", line 50, in test_step_out_of_malloc_into_function_b self.step_out_of_malloc_into_function_b(self.exe_name) File "/Users/buildslave/jenkins/workspace/lldb-cmake-sanitized/llvm-project/lldb/test/API/python_api/thread/TestThreadAPI.py", line 157, in step_out_of_malloc_into_function_b thread.IsValid(), AttributeError: 'NoneType' object has no attribute 'IsValid' Config=x86_64-/Users/buildslave/jenkins/workspace/lldb-cmake-sanitized/lldb-build/bin/clang-11 ====================================================================== ERROR: test_step_out_of_malloc_into_function_b_gmodules (TestThreadAPI.ThreadAPITestCase) Test Python SBThread.StepOut() API to step out of a malloc call where the call site is at function b(). ---------------------------------------------------------------------- Traceback (most recent call last): File "/Users/buildslave/jenkins/workspace/lldb-cmake-sanitized/llvm-project/lldb/packages/Python/lldbsuite/test/lldbtest.py", line 1751, in test_method return attrvalue(self) File "/Users/buildslave/jenkins/workspace/lldb-cmake-sanitized/llvm-project/lldb/packages/Python/lldbsuite/test/decorators.py", line 110, in wrapper func(*args, **kwargs) File "/Users/buildslave/jenkins/workspace/lldb-cmake-sanitized/llvm-project/lldb/packages/Python/lldbsuite/test/decorators.py", line 110, in wrapper func(*args, **kwargs) File "/Users/buildslave/jenkins/workspace/lldb-cmake-sanitized/llvm-project/lldb/packages/Python/lldbsuite/test/decorators.py", line 110, in wrapper func(*args, **kwargs) File "/Users/buildslave/jenkins/workspace/lldb-cmake-sanitized/llvm-project/lldb/test/API/python_api/thread/TestThreadAPI.py", line 50, in test_step_out_of_malloc_into_function_b self.step_out_of_malloc_into_function_b(self.exe_name) File "/Users/buildslave/jenkins/workspace/lldb-cmake-sanitized/llvm-project/lldb/test/API/python_api/thread/TestThreadAPI.py", line 157, in step_out_of_malloc_into_function_b thread.IsValid(), AttributeError: 'NoneType' object has no attribute 'IsValid' Config=x86_64-/Users/buildslave/jenkins/workspace/lldb-cmake-sanitized/lldb-build/bin/clang-11 ---------------------------------------------------------------------- Ran 20 tests in 39.808s

Hide Details

RESULT: FAILED (12 passes, 0 failures, 3 errors, 5 skipped, 0 expected failures, 0 unexpected successes)

Hide Details

--

Hide Details

******************** PASS: lldb-unit :: Utility/./UtilityTests/StatusTest.ErrorConstructor (696 of 1966) PASS: lldb-api :: lang/objc/modules-inline-functions/TestModulesInlineFunctions.py (697 of 1966) PASS: lldb-api :: functionalities/tail_call_frames/thread_step_out_or_return/TestSteppingOutWithArtificialFrames.py (698 of 1966) PASS: lldb-shell :: Minidump/Windows/broken-unwind.test (699 of 1966) PASS: lldb-shell :: Driver/TestConvenienceVariables.test (700 of 1966) PASS: lldb-unit :: Utility/./UtilityTests/LogTest.Unregister (701 of 1966) PASS: lldb-unit :: Utility/./UtilityTests/StreamTest.AddressRangeEmptyRange (702 of 1966) PASS: lldb-api :: commands/frame/diagnose/inheritance/TestDiagnoseInheritance.py (703 of 1966) PASS: lldb-shell :: SymbolFile/DWARF/dwp-debug-types.s (704 of 1966) PASS: lldb-api :: functionalities/breakpoint/breakpoint_command/TestBreakpointCommandsFromPython.py (705 of 1966) PASS: lldb-api :: commands/expression/import-std-module/vector-bool/TestVectorBoolFromStdModule.py (706 of 1966) PASS: lldb-api :: functionalities/backticks/TestBackticksWithoutATarget.py (707 of 1966) PASS: lldb-api :: functionalities/data-formatter/data-formatter-stl/libcxx/multiset/TestDataFormatterLibcxxMultiSet.py (708 of 1966) PASS: lldb-unit :: Utility/./UtilityTests/BinaryStreamTest.PutSLEB128EightBytes (709 of 1966) PASS: lldb-api :: functionalities/avoids-fd-leak/TestFdLeak.py (710 of 1966) PASS: lldb-unit :: Utility/./UtilityTests/StringListTest.RemoveBlankLines (711 of 1966) PASS: lldb-unit :: Utility/./UtilityTests/VMRange.Reset (712 of 1966) PASS: lldb-api :: commands/expression/function_template_specialization_temp_args/TestFunctionTemplateSpecializationTempArgs.py (713 of 1966) PASS: lldb-api :: python_api/value/TestValueAPI.py (714 of 1966) PASS: lldb-unit :: SymbolFile/NativePDB/./SymbolFileNativePDBTests/PDBFPOProgramToDWARFExpressionTests.MissingTargetRegister (715 of 1966) UNSUPPORTED: lldb-api :: terminal/TestEditline.py (716 of 1966) PASS: lldb-shell :: Reproducer/TestCrash.test (717 of 1966) PASS: lldb-api :: functionalities/archives/TestBSDArchives.py (718 of 1966) PASS: lldb-unit :: Utility/./UtilityTests/SerializationRountripTest.SerializeDeserializeCStringArray (719 of 1966) PASS: lldb-api :: functionalities/signal/raise/TestRaise.py (720 of 1966) PASS: lldb-unit :: Utility/./UtilityTests/ArgsTest.ReplaceArgumentAtIndexLonger (721 of 1966) UNSUPPORTED: lldb-shell :: ObjectFile/ELF/minidebuginfo-set-and-hit-breakpoint.test (722 of 1966) PASS: lldb-unit :: Utility/./UtilityTests/FileSpecTest.CopyByAppendingPathComponent (723 of 1966) PASS: lldb-api :: commands/expression/completion-crash-incomplete-record/TestCompletionCrashIncompleteRecord.py (724 of 1966) PASS: lldb-unit :: UnwindAssembly/x86/./UnwindAssemblyx86Tests/Testx86AssemblyInspectionEngine.TestPushEDX (725 of 1966) UNSUPPORTED: lldb-api :: commands/target/auto-install-main-executable/TestAutoInstallMainExecutable.py (726 of 1966) PASS: lldb-api :: macosx/DBGSourcePathRemapping/TestDSYMSourcePathRemapping.py (727 of 1966) PASS: lldb-unit :: Utility/./UtilityTests/VMRange.IsValid (728 of 1966) PASS: lldb-unit :: Utility/./UtilityTests/DataExtractorTest.GetCStrAtNullOffset (729 of 1966) PASS: lldb-api :: functionalities/thread/exit_during_break/TestExitDuringBreak.py (730 of 1966) PASS: lldb-unit :: UnwindAssembly/x86/./UnwindAssemblyx86Tests/Testx86AssemblyInspectionEngine.TestStackRealignMSVC_i386 (731 of 1966) PASS: lldb-unit :: Expression/./ExpressionTests/DWARFExpression.DW_OP_convert (732 of 1966) PASS: lldb-api :: lang/c/register_variables/TestRegisterVariables.py (733 of 1966) PASS: lldb-unit :: Expression/./ExpressionTests/CppModuleConfigurationTest.Xcode (734 of 1966) PASS: lldb-api :: functionalities/memory/find/TestMemoryFind.py (735 of 1966) UNSUPPORTED: lldb-shell :: BuildScript/toolchain-msvc.test (736 of 1966) PASS: lldb-unit :: Utility/./UtilityTests/RecordReplayTest.InstrumentedFooSameThis (737 of 1966) PASS: lldb-api :: macosx/safe-to-func-call/TestSafeFuncCalls.py (738 of 1966) PASS: lldb-shell :: Reproducer/TestFileRepro.test (739 of 1966) PASS: lldb-unit :: Symbol/./SymbolTests/TestTypeSystemClang.TestIsClangType (740 of 1966) PASS: lldb-shell :: Reproducer/TestGDBRemoteRepro.test (741 of 1966) UNSUPPORTED: lldb-shell :: Minidump/Windows/arm-fp-unwind.test (742 of 1966) PASS: lldb-unit :: ObjectFile/Breakpad/./ObjectFileBreakpadTests/StackWinRecord.parse (743 of 1966) PASS: lldb-api :: lang/c/shared_lib/TestSharedLib.py (744 of 1966) PASS: lldb-unit :: Utility/./UtilityTests/SerializationRountripTest.SerializeDeserializeObjectPointer (745 of 1966) PASS: lldb-unit :: Language/Highlighting/./HighlighterTests/HighlighterTest.ClangComments (746 of 1966) UNSUPPORTED: lldb-api :: functionalities/darwin_log/basic/TestDarwinLogBasic.py (747 of 1966) PASS: lldb-api :: functionalities/data-formatter/data-formatter-stl/libcxx/map/TestDataFormatterLibccMap.py (748 of 1966) PASS: lldb-api :: functionalities/breakpoint/debugbreak/TestDebugBreak.py (749 of 1966) PASS: lldb-unit :: Expression/./ExpressionTests/CppModuleConfigurationTest.UnknownLibCppFile (750 of 1966) PASS: lldb-api :: python_api/watchpoint/TestSetWatchpoint.py (751 of 1966) PASS: lldb-api :: macosx/nslog/TestDarwinNSLogOutput.py (752 of 1966) PASS: lldb-api :: functionalities/load_unload/TestLoadUnload.py (753 of 1966) PASS: lldb-api :: macosx/queues/TestQueues.py (754 of 1966) PASS: lldb-unit :: Utility/./UtilityTests/ArgsTest.AppendArguments (755 of 1966) UNSUPPORTED: lldb-api :: benchmarks/startup/TestStartupDelays.py (756 of 1966) PASS: lldb-shell :: SymbolFile/NativePDB/globals-fundamental.cpp (757 of 1966) PASS: lldb-api :: functionalities/thread/create_after_attach/TestCreateAfterAttach.py (758 of 1966) PASS: lldb-unit :: ObjectFile/PECOFF/./ObjectFilePECOFFTests/PECallFrameInfoTest.Frame_reg_eh (759 of 1966) PASS: lldb-unit :: SymbolFile/NativePDB/./SymbolFileNativePDBTests/PDBFPOProgramToDWARFExpressionTests.UnresolvedRegisterAssignmentReference (760 of 1966) PASS: lldb-unit :: Utility/./UtilityTests/RangeTest.ContainsRange (761 of 1966) PASS: lldb-unit :: Language/Highlighting/./HighlighterTests/HighlighterTest.ClangCursorPosBeforeOtherToken (762 of 1966) PASS: lldb-unit :: Host/./HostTests/SocketTest.TCPListen0ConnectAccept (763 of 1966) PASS: lldb-unit :: SymbolFile/DWARF/./SymbolFileDWARFTests/SymbolFileDWARFTests.TestAbbrevOrder1Start5 (764 of 1966) PASS: lldb-unit :: Utility/./UtilityTests/OptionsWithRawTest.MultiWordSuffix (765 of 1966) PASS: lldb-unit :: Utility/./UtilityTests/StringListTest.JoinEmpty (766 of 1966) PASS: lldb-unit :: Utility/./UtilityTests/StringListTest.AppendStringMove (767 of 1966) PASS: lldb-api :: lang/c/step-target/TestStepTarget.py (768 of 1966) PASS: lldb-api :: commands/expression/context-object/TestContextObject.py (769 of 1966) PASS: lldb-unit :: Utility/./UtilityTests/ArgsTest.TestOverwriteArgs (770 of 1966) PASS: lldb-unit :: Utility/./UtilityTests/StringListTest.InsertStringAtIndexStdString (771 of 1966) PASS: lldb-unit :: Host/./HostTests/FileSystemTest.Exists (772 of 1966) UNSUPPORTED: lldb-shell :: SymbolFile/NativePDB/stack_unwinding01.cpp (773 of 1966) PASS: lldb-api :: functionalities/thread/concurrent_events/TestConcurrentDelaySignalBreak.py (774 of 1966) PASS: lldb-api :: functionalities/data-formatter/data-formatter-script/TestDataFormatterScript.py (775 of 1966) PASS: lldb-unit :: Language/Highlighting/./HighlighterTests/HighlighterTest.DefaultHighlighterWithCursor (776 of 1966) PASS: lldb-api :: commands/expression/import-std-module/queue/TestQueueFromStdModule.py (777 of 1966) UNSUPPORTED: lldb-api :: commands/expression/multiline-completion/TestMultilineCompletion.py (778 of 1966) PASS: lldb-api :: functionalities/data-formatter/data-formatter-stl/libcxx/list/TestDataFormatterLibcxxList.py (779 of 1966) PASS: lldb-unit :: Utility/./UtilityTests/StringExtractorTest.GetHexBytes_Partial (780 of 1966) PASS: lldb-unit :: tools/lldb-server/tests/./LLDBServerTests/TestBase.DebugserverEnv (781 of 1966) PASS: lldb-api :: commands/expression/persistent_types/TestNestedPersistentTypes.py (782 of 1966) PASS: lldb-unit :: Utility/./UtilityTests/StringListTest.JoinThree (783 of 1966) PASS: lldb-unit :: Utility/./UtilityTests/StringListTest.DefaultConstructor (784 of 1966) UNSUPPORTED: lldb-api :: functionalities/darwin_log/filter/regex/activity/TestDarwinLogFilterRegexActivity.py (785 of 1966) PASS: lldb-unit :: Core/./LLDBCoreTests/StreamCallbackTest.Callback (786 of 1966) PASS: lldb-api :: functionalities/thread/concurrent_events/TestConcurrentWatchpointWithDelayWatchpointThreads.py (787 of 1966) PASS: lldb-shell :: SymbolFile/DWARF/find-basic-type.cpp (788 of 1966) PASS: lldb-shell :: SymbolFile/DWARF/array-sizes.s (789 of 1966) PASS: lldb-unit :: Utility/./UtilityTests/StreamTest.PutMaxHex64ByteOrderBig (790 of 1966) PASS: lldb-api :: functionalities/gdb_remote_client/TestJLink6Armv7RegisterDefinition.py (791 of 1966) PASS: lldb-shell :: ObjectFile/PECOFF/basic-info-arm.yaml (792 of 1966) PASS: lldb-shell :: ObjectFile/PECOFF/dep-modules.yaml (793 of 1966) UNSUPPORTED: lldb-api :: functionalities/darwin_log/filter/exact_match/message/TestDarwinLogFilterMatchMessage.py (794 of 1966) PASS: lldb-unit :: Utility/./UtilityTests/StreamTest.PutHex32ByteOrderBig (795 of 1966) PASS: lldb-shell :: ObjectFile/PECOFF/basic-info.yaml (796 of 1966) PASS: lldb-unit :: Core/./LLDBCoreTests/MangledTest.ResultForBlockInvocation (797 of 1966) PASS: lldb-unit :: Utility/./UtilityTests/Flags.AnySet (798 of 1966) PASS: lldb-unit :: Expression/./ExpressionTests/DiagnosticManagerTest.AddDiagnostic (799 of 1966) PASS: lldb-unit :: Utility/./UtilityTests/RangeTest.DoesIntersect (800 of 1966) PASS: lldb-unit :: Utility/./UtilityTests/ArchSpecTest.TestParseMachCPUDashSubtypeTripleSimple (801 of 1966) PASS: lldb-unit :: Platform/./LLDBPlatformTests/PlatformDarwinTest.FindXcodeContentsDirectoryInPath (802 of 1966) PASS: lldb-unit :: Utility/./UtilityTests/RangeDataVector.FindEntryIndexesThatContain (803 of 1966) UNSUPPORTED: lldb-api :: macosx/macabi/TestMacABImacOSFramework.py (804 of 1966) PASS: lldb-unit :: Target/./TargetTests/ExecutionContextTest.GetByteOrderProcess (805 of 1966) PASS: lldb-api :: commands/expression/expr-in-syscall/TestExpressionInSyscall.py (806 of 1966) PASS: lldb-unit :: Utility/./UtilityTests/StringExtractorTest.GetHexBytes_OddPair (807 of 1966) PASS: lldb-unit :: Utility/./UtilityTests/ScalarTest.Comparison (808 of 1966) PASS: lldb-api :: functionalities/tail_call_frames/disambiguate_paths_to_common_sink/TestDisambiguatePathsToCommonSink.py (809 of 1966) PASS: lldb-unit :: Process/gdb-remote/./ProcessGdbRemoteTests/GDBRemoteClientBaseTest.SendContinueAndAsyncPacket (810 of 1966) PASS: lldb-api :: python_api/get-value-32bit-int/TestGetValue32BitInt.py (811 of 1966) PASS: lldb-unit :: Host/./HostTests/SocketAddressTest.Set (812 of 1966) PASS: lldb-shell :: SymbolFile/NativePDB/global-classes.cpp (813 of 1966) PASS: lldb-shell :: Reproducer/Functionalities/TestExpressionEvaluation.test (814 of 1966) PASS: lldb-unit :: Utility/./UtilityTests/StringExtractorTest.GetHexBytes (815 of 1966) PASS: lldb-unit :: Utility/./UtilityTests/BinaryStreamTest.PutULEB128NineBytes (816 of 1966) PASS: lldb-api :: commands/watchpoints/watchpoint_commands/command/TestWatchpointCommandLLDB.py (817 of 1966) PASS: lldb-unit :: Utility/./UtilityTests/RangeTest.LessThan (818 of 1966) PASS: lldb-shell :: SymbolFile/DWARF/dir-separator-no-comp-dir.s (819 of 1966) PASS: lldb-unit :: UnwindAssembly/x86/./UnwindAssemblyx86Tests/Testx86AssemblyInspectionEngine.TestSpillRegToStackViaMOVi386 (820 of 1966) PASS: lldb-unit :: Utility/./UtilityTests/StringListTest.JoinMultiCharSeparator (821 of 1966) PASS: lldb-shell :: ObjectFile/ELF/section-addresses.yaml (822 of 1966) PASS: lldb-unit :: Host/./HostTests/SocketTest.TCPListen0GetPort (823 of 1966) PASS: lldb-unit :: Symbol/./SymbolTests/TestTypeSystemClang.TestNotDeletingUserCopyCstrDueToMoveCStr (824 of 1966) PASS: lldb-unit :: Utility/./UtilityTests/RegularExpression.Valid (825 of 1966) PASS: lldb-unit :: Target/./TargetTests/PathMappingListTest.RelativeTests (826 of 1966) PASS: lldb-unit :: Utility/./UtilityTests/UriParserTest.Empty (827 of 1966) UNSUPPORTED: lldb-shell :: ScriptInterpreter/Lua/command_script_import.test (828 of 1966) PASS: lldb-unit :: Expression/./ExpressionTests/ClangExpressionDeclMapTest.TestPersistentDeclLookup (829 of 1966) PASS: lldb-unit :: Symbol/./SymbolTests/TestTypeSystemClang.TestDeletingImplicitCopyCstrDueToMoveCStr (830 of 1966) PASS: lldb-shell :: ObjectFile/ELF/basic-info.yaml (831 of 1966) UNSUPPORTED: lldb-api :: functionalities/data-formatter/data-formatter-stl/libstdcpp/iterator/TestDataFormatterStdIterator.py (832 of 1966) PASS: lldb-shell :: ObjectFile/ELF/section-types.yaml (833 of 1966) UNSUPPORTED: lldb-shell :: ScriptInterpreter/Lua/independent_state.test (834 of 1966) PASS: lldb-api :: lang/objc/orderedset/TestOrderedSet.py (835 of 1966) UNSUPPORTED: lldb-shell :: ObjectFile/PECOFF/disassemble-thumb.yaml (836 of 1966) PASS: lldb-shell :: SymbolFile/DWARF/inline-function-address-shared.test (837 of 1966) PASS: lldb-unit :: Utility/./UtilityTests/TimerTest.CategoryTimes2 (838 of 1966) PASS: lldb-unit :: Host/./HostTests/Host.WaitStatusFormat (839 of 1966) PASS: lldb-unit :: Utility/./UtilityTests/StringExtractorTest.DecodeHexU8_Underflow (840 of 1966) PASS: lldb-unit :: Host/./HostTests/MainLoopTest.Signal (841 of 1966) PASS: lldb-unit :: Utility/./UtilityTests/ListenerTest.GetEventWait (842 of 1966) PASS: lldb-unit :: Target/./TargetTests/ExecutionContextTest.GetByteOrder (843 of 1966) PASS: lldb-api :: functionalities/thread/concurrent_events/TestConcurrentCrashWithWatchpointBreakpointSignal.py (844 of 1966) PASS: lldb-unit :: ScriptInterpreter/Python/./ScriptInterpreterPythonTests/PythonDataObjectsTest.TestPythonCallableInvoke (845 of 1966) PASS: lldb-api :: commands/frame/var/TestFrameVar.py (846 of 1966) PASS: lldb-api :: python_api/signals/TestSignalsAPI.py (847 of 1966) PASS: lldb-unit :: Process/minidump/./LLDBMinidumpTests/MinidumpParserTest.GetLinuxProcStatus_no_stream (848 of 1966) PASS: lldb-shell :: SymbolFile/DWARF/dwarf5_locations.s (849 of 1966) PASS: lldb-shell :: SymbolFile/Breakpad/line-table-edgecases.test (850 of 1966) PASS: lldb-api :: commands/breakpoint/command/list/TestBreakpointCommandList.py (851 of 1966) PASS: lldb-unit :: Utility/./UtilityTests/VMRange.ContainsRange (852 of 1966) PASS: lldb-unit :: Target/./TargetTests/PathMappingListTest.AbsoluteTests (853 of 1966) PASS: lldb-unit :: Utility/./UtilityTests/ArchSpecTest.Compatibility (854 of 1966) PASS: lldb-unit :: Process/gdb-remote/./ProcessGdbRemoteTests/GDBRemoteCommunicationClientTest.SendSignalsToIgnore (855 of 1966) PASS: lldb-unit :: Utility/./UtilityTests/RecordReplayTest.InstrumentedBar (856 of 1966) PASS: lldb-api :: functionalities/dead-strip/TestDeadStrip.py (857 of 1966) PASS: lldb-api :: functionalities/data-formatter/type_summary_list_arg/TestTypeSummaryListArg.py (858 of 1966) PASS: lldb-api :: lang/objc/modules-auto-import/TestModulesAutoImport.py (859 of 1966) PASS: lldb-unit :: Utility/./UtilityTests/LogChannelTest.List (860 of 1966) PASS: lldb-unit :: Host/./HostTests/FileSystemTest.MakeAbsolute (861 of 1966) UNSUPPORTED: lldb-api :: lang/objc/foundation/TestFoundationDisassembly.py (862 of 1966) PASS: lldb-shell :: Settings/TestFrameFormatNoColor.test (863 of 1966) PASS: lldb-shell :: SymbolFile/DWARF/apple-index-is-used.cpp (864 of 1966) PASS: lldb-api :: lang/cpp/lambdas/TestLambdas.py (865 of 1966) PASS: lldb-shell :: SymbolFile/DWARF/debug_loc.s (866 of 1966) PASS: lldb-unit :: Utility/./UtilityTests/StringExtractorTest.GetU32LittleEndian (867 of 1966) PASS: lldb-unit :: Host/./HostTests/NativeProcessProtocolTest.ReadMemoryWithoutTrap (868 of 1966) PASS: lldb-api :: lang/objc/rdar-11355592/TestRdar11355592.py (869 of 1966) PASS: lldb-unit :: Utility/./UtilityTests/StringListTest.LongestCommonPrefixEmpty (870 of 1966) PASS: lldb-api :: functionalities/memory/read/TestMemoryRead.py (871 of 1966) UNSUPPORTED: lldb-shell :: Breakpoint/ppc64-localentry.test (872 of 1966) PASS: lldb-unit :: Utility/./UtilityTests/StreamTest.Indent (873 of 1966) PASS: lldb-api :: types/TestFloatTypes.py (874 of 1966) PASS: lldb-api :: functionalities/thread/concurrent_events/TestConcurrentManyCrash.py (875 of 1966) PASS: lldb-unit :: Utility/./UtilityTests/RangeTest.Constructor (876 of 1966) PASS: lldb-unit :: UnwindAssembly/x86/./UnwindAssemblyx86Tests/Testx86AssemblyInspectionEngine.TestMovRSPtoRBP (877 of 1966) PASS: lldb-api :: lang/cpp/static_methods/TestCPPStaticMethods.py (878 of 1966) PASS: lldb-unit :: Utility/./UtilityTests/ScalarTest.GetValue (879 of 1966) PASS: lldb-api :: functionalities/data-formatter/pyobjsynthprovider/TestPyObjSynthProvider.py (880 of 1966) PASS: lldb-shell :: Minidump/memory-region-from-module.yaml (881 of 1966) PASS: lldb-unit :: Utility/./UtilityTests/SerializationRountripTest.SerializeDeserializePodReferences (882 of 1966) PASS: lldb-api :: functionalities/data-formatter/dump_dynamic/TestDumpDynamic.py (883 of 1966) PASS: lldb-api :: functionalities/data-formatter/data-formatter-stl/libcxx/bitset/TestDataFormatterLibcxxBitset.py (884 of 1966) PASS: lldb-unit :: Utility/./UtilityTests/StreamTeeTest.SetStreamAtIndexOutOfBounds (885 of 1966) PASS: lldb-shell :: Settings/TestLineMarkerColor.test (886 of 1966) PASS: lldb-unit :: Utility/./UtilityTests/StreamTest.PutHex8 (887 of 1966) PASS: lldb-unit :: Utility/./UtilityTests/SerializationRountripTest.SerializeDeserializeCString (888 of 1966) PASS: lldb-shell :: ObjectFile/PECOFF/basic-info-arm64.yaml (889 of 1966) PASS: lldb-shell :: SymbolFile/DWARF/dir-separator-posix.s (890 of 1966) PASS: lldb-api :: tools/lldb-server/TestGdbRemoteRegisterState.py (891 of 1966) PASS: lldb-unit :: Utility/./UtilityTests/LogChannelEnabledTest.LogThread (892 of 1966) PASS: lldb-api :: functionalities/unwind/zeroth_frame/TestZerothFrame.py (893 of 1966) PASS: lldb-unit :: Utility/./UtilityTests/NameMatchesTest.Contains (894 of 1966) PASS: lldb-api :: commands/expression/call-function/TestCallStdStringFunction.py (895 of 1966) PASS: lldb-shell :: ObjectFile/ELF/section-permissions.yaml (896 of 1966) PASS: lldb-unit :: Utility/./UtilityTests/StringExtractorTest.DecodeHexU8_Underflow2 (897 of 1966) PASS: lldb-unit :: Symbol/./SymbolTests/DWARFCallFrameInfoTest.Basic_dwarf3 (898 of 1966) PASS: lldb-api :: functionalities/breakpoint/cpp_exception/TestCPPExceptionBreakpoint.py (899 of 1966) PASS: lldb-unit :: Editline/./EditlineTests/EditlineTestFixture.EditlineReceivesMultiLineText (900 of 1966) UNSUPPORTED: lldb-api :: arm/breakpoint-it/TestBreakpointIt.py (901 of 1966) PASS: lldb-unit :: Interpreter/./InterpreterTests/OptionArgParserTest.toBoolean (902 of 1966) PASS: lldb-shell :: SymbolFile/DWARF/find-qualified-variable.cpp (903 of 1966) PASS: lldb-api :: macosx/thread_suspend/TestInternalThreadSuspension.py (904 of 1966) PASS: lldb-unit :: Utility/./UtilityTests/CompletionRequest.TryCompleteCurrentArgBad (905 of 1966) PASS: lldb-unit :: UnwindAssembly/x86/./UnwindAssemblyx86Tests/Testx86AssemblyInspectionEngine.Testi386IgnoredRegisters (906 of 1966) PASS: lldb-api :: python_api/function_symbol/TestDisasmAPI.py (907 of 1966) PASS: lldb-shell :: SymbolFile/Breakpad/symtab.test (908 of 1966) PASS: lldb-unit :: Utility/./UtilityTests/RegularExpression.CopyAssignment (909 of 1966) PASS: lldb-api :: functionalities/thread/concurrent_events/TestConcurrentTwoBreakpointThreads.py (910 of 1966) PASS: lldb-unit :: SymbolFile/NativePDB/./SymbolFileNativePDBTests/PDBFPOProgramToDWARFExpressionTests.UnresolvedRegisterReference (911 of 1966) PASS: lldb-unit :: Process/gdb-remote/./ProcessGdbRemoteTests/GDBRemoteCommunicationClientTest.WriteRegister (912 of 1966) PASS: lldb-api :: tools/lldb-vscode/step/TestVSCode_step.py (913 of 1966) PASS: lldb-api :: commands/expression/persistent_ptr_update/TestPersistentPtrUpdate.py (914 of 1966) PASS: lldb-unit :: Utility/./UtilityTests/ArchSpecTest.MergeFrom (915 of 1966) PASS: lldb-api :: python_api/class_members/TestSBTypeClassMembers.py (916 of 1966) PASS: lldb-api :: commands/expression/import_builtin_fileid/TestImportBuiltinFileID.py (917 of 1966) UNSUPPORTED: lldb-shell :: SymbolFile/PDB/calling-conventions.test (918 of 1966) PASS: lldb-unit :: UnwindAssembly/x86/./UnwindAssemblyx86Tests/Testx86AssemblyInspectionEngine.TestPushImm (919 of 1966) PASS: lldb-shell :: SymbolFile/DWARF/inline-function-address.ll (920 of 1966) PASS: lldb-shell :: SymbolFile/DWARF/debug-types-basic.test (921 of 1966) PASS: lldb-api :: commands/expression/no-deadlock/TestExprDoesntBlock.py (922 of 1966) PASS: lldb-unit :: Utility/./UtilityTests/StringLexerTest.NextIf (923 of 1966) PASS: lldb-api :: functionalities/postmortem/elf-core/thread_crash/TestLinuxCoreThreads.py (924 of 1966) PASS: lldb-unit :: Utility/./UtilityTests/ConstStringTest.CompareConstString (925 of 1966) UNSUPPORTED: lldb-api :: functionalities/data-formatter/data-formatter-stl/libstdcpp/unique_ptr/TestDataFormatterStdUniquePtr.py (926 of 1966) PASS: lldb-unit :: Utility/./UtilityTests/VMRange.SetEndAddress (927 of 1966) PASS: lldb-api :: functionalities/target_var/TestTargetVar.py (928 of 1966) PASS: lldb-unit :: Utility/./UtilityTests/RangeTest.DefaultConstructor (929 of 1966) UNSUPPORTED: lldb-shell :: SymbolFile/dissassemble-entry-point.s (930 of 1966) PASS: lldb-api :: lang/c/shared_lib_stripped_symbols/TestSharedLibStrippedSymbols.py (931 of 1966) PASS: lldb-api :: commands/expression/namespace_local_var_same_name_obj_c/TestNamespaceLocalVarSameNameObjC.py (932 of 1966) PASS: lldb-api :: types/TestCharTypeExpr.py (933 of 1966) PASS: lldb-unit :: UnwindAssembly/x86/./UnwindAssemblyx86Tests/Testx86AssemblyInspectionEngine.TestPopRBPWithREX (934 of 1966) UNSUPPORTED: lldb-api :: functionalities/darwin_log/filter/exact_match/subsystem/TestDarwinLogFilterMatchSubsystem.py (935 of 1966) PASS: lldb-unit :: Utility/./UtilityTests/RangeTest.LessThanInvalid (936 of 1966) PASS: lldb-unit :: ObjectFile/Breakpad/./ObjectFileBreakpadTests/ModuleRecord.parse (937 of 1966) PASS: lldb-api :: functionalities/breakpoint/auto_continue/TestBreakpointAutoContinue.py (938 of 1966) PASS: lldb-unit :: Utility/./UtilityTests/ArgsTest.TestQuotedUnknownEscape (939 of 1966) PASS: lldb-unit :: Symbol/./SymbolTests/TestTypeSystemClang.TestGetEnumIntegerTypeInvalid (940 of 1966) PASS: lldb-unit :: ScriptInterpreter/Python/./ScriptInterpreterPythonTests/PythonDataObjectsTest.TestGlobalNameResolutionWithDot (941 of 1966) PASS: lldb-api :: commands/add-dsym/uuid/TestAddDsymCommand.py (942 of 1966) PASS: lldb-api :: commands/watchpoints/watchpoint_disable/TestWatchpointDisable.py (943 of 1966) PASS: lldb-unit :: Host/./HostTests/TaskPoolTest.RunTasks (944 of 1966) PASS: lldb-unit :: Utility/./UtilityTests/StreamTest.PutMaxHex64ByteOrderLittle (945 of 1966) PASS: lldb-shell :: Reproducer/Modules/TestModuleCXX.test (946 of 1966) PASS: lldb-unit :: Utility/./UtilityTests/ArgsTest.TestArgv (947 of 1966) PASS: lldb-shell :: Expr/TestMultilineExpr.test (948 of 1966) PASS: lldb-api :: lang/objc/objc-runtime-ivars/TestRuntimeIvars.py (949 of 1966) PASS: lldb-shell :: SymbolFile/DWARF/compilercontext.ll (950 of 1966) PASS: lldb-unit :: ObjectFile/Breakpad/./ObjectFileBreakpadTests/FileRecord.parse (951 of 1966) PASS: lldb-api :: functionalities/data-formatter/synthupdate/TestSyntheticFilterRecompute.py (952 of 1966) PASS: lldb-api :: python_api/lldbutil/process/TestPrintStackTraces.py (953 of 1966) UNSUPPORTED: lldb-shell :: SymbolFile/PDB/function-nested-block.test (954 of 1966) PASS: lldb-api :: commands/expression/import-std-module/stack/TestStackFromStdModule.py (955 of 1966) PASS: lldb-api :: lang/cpp/accelerator-table/TestCPPAccelerator.py (956 of 1966) PASS: lldb-shell :: SymbolFile/DWARF/DW_AT_loclists_base.s (957 of 1966) PASS: lldb-shell :: SymbolFile/DWARF/find-basic-variable.cpp (958 of 1966) PASS: lldb-shell :: Reproducer/TestMultipleTargets.test (959 of 1966) PASS: lldb-unit :: Breakpoint/./LLDBBreakpointTests/BreakpointIDTest.StringIsBreakpointName (960 of 1966) UNSUPPORTED: lldb-api :: functionalities/data-formatter/data-formatter-stl/libstdcpp/string/TestDataFormatterStdString.py (961 of 1966) PASS: lldb-api :: commands/expression/import-std-module/deque-basic/TestDequeFromStdModule.py (962 of 1966) PASS: lldb-unit :: Utility/./UtilityTests/OptionsWithRawTest.ArgsButNoLeadingDash (963 of 1966) PASS: lldb-shell :: SymbolFile/DWARF/parallel-indexing-stress.s (964 of 1966) UNSUPPORTED: lldb-api :: functionalities/asan/TestReportData.py (965 of 1966) PASS: lldb-api :: functionalities/data-formatter/data-formatter-stl/libcxx/initializerlist/TestInitializerList.py (966 of 1966) UNSUPPORTED: lldb-api :: functionalities/tsan/cpp_global_location/TestTsanCPPGlobalLocation.py (967 of 1966) PASS: lldb-unit :: Utility/./UtilityTests/StringListTest.AppendList (968 of 1966) PASS: lldb-unit :: Utility/./UtilityTests/StringExtractorTest.GetHexBytes_OddPair2 (969 of 1966) PASS: lldb-shell :: Driver/TestFile.test (970 of 1966) UNSUPPORTED: lldb-api :: python_api/event/TestEvents.py (971 of 1966) PASS: lldb-api :: python_api/value/change_values/TestChangeValueAPI.py (972 of 1966) PASS: lldb-shell :: Breakpoint/debug_addrx.test (973 of 1966) PASS: lldb-shell :: ObjectFile/ELF/section-overlap.yaml (974 of 1966) PASS: lldb-shell :: Reproducer/TestSynchronous.test (975 of 1966) PASS: lldb-api :: functionalities/data-formatter/data-formatter-synthval/TestDataFormatterSynthVal.py (976 of 1966) PASS: lldb-unit :: Process/gdb-remote/./ProcessGdbRemoteTests/GDBRemoteCommunicationServerTest.SendErrorResponse_UnimplementedError (977 of 1966) PASS: lldb-unit :: Host/./HostTests/NativeProcessProtocolTest.ReadCStringFromMemory (978 of 1966) PASS: lldb-api :: functionalities/inferior-changed/TestInferiorChanged.py (979 of 1966) PASS: lldb-unit :: Utility/./UtilityTests/ProcessInfoTest.Constructor (980 of 1966) PASS: lldb-unit :: Utility/./UtilityTests/RangeDataVector.CustomSort (981 of 1966) PASS: lldb-api :: sanity/TestModuleCacheSanity.py (982 of 1966) PASS: lldb-api :: functionalities/data-formatter/hexcaps/TestDataFormatterHexCaps.py (983 of 1966) PASS: lldb-api :: functionalities/data-formatter/nsdictionarysynth/TestNSDictionarySynthetic.py (984 of 1966) PASS: lldb-api :: source-manager/TestSourceManager.py (985 of 1966) PASS: lldb-api :: functionalities/data-formatter/data-formatter-objc/TestDataFormatterObjCNSBundle.py (986 of 1966) UNSUPPORTED: lldb-api :: functionalities/data-formatter/data-formatter-stl/libstdcpp/list/TestDataFormatterStdList.py (987 of 1966) PASS: lldb-api :: functionalities/thread/step_out/TestThreadStepOut.py (988 of 1966) PASS: lldb-unit :: Utility/./UtilityTests/TimerTest.CategoryTimesNested (989 of 1966) PASS: lldb-shell :: Breakpoint/split-dwarf5-debug-stroffsets.test (990 of 1966) PASS: lldb-shell :: SymbolFile/DWARF/find-method.cpp (991 of 1966) PASS: lldb-unit :: Host/./HostTests/NativeProcessProtocolTest.SetBreakpoint (992 of 1966) UNSUPPORTED: lldb-shell :: ScriptInterpreter/Lua/bindings.test (993 of 1966) PASS: lldb-unit :: Utility/./UtilityTests/VASprintfTest.EncodingError (994 of 1966) PASS: lldb-unit :: Host/./HostTests/ProcessLaunchInfoTest.Constructor (995 of 1966) PASS: lldb-unit :: Utility/./UtilityTests/StringExtractorTest.GetU32BigEndian (996 of 1966) PASS: lldb-unit :: Utility/./UtilityTests/CompletionRequest.Constructor (997 of 1966) PASS: lldb-unit :: Host/./HostTests/FileSystemTest.Resolve (998 of 1966) PASS: lldb-unit :: Utility/./UtilityTests/StringExtractorTest.GetHexU8_InvalidHex_NoEof (999 of 1966) PASS: lldb-api :: lang/cpp/template-function/TestTemplateFunctions.py (1000 of 1966) PASS: lldb-api :: lang/c/anonymous/TestAnonymous.py (1001 of 1966) PASS: lldb-shell :: SymbolFile/NativePDB/break-by-line.cpp (1002 of 1966) PASS: lldb-api :: api/multithreaded/TestMultithreaded.py (1003 of 1966) PASS: lldb-shell :: BuildScript/toolchain-clang.test (1004 of 1966) PASS: lldb-unit :: Utility/./UtilityTests/VMRange.CollectionContains (1005 of 1966) PASS: lldb-unit :: Expression/./ExpressionTests/DiagnosticManagerTest.PutString (1006 of 1966) PASS: lldb-api :: python_api/lldbutil/frame/TestFrameUtils.py (1007 of 1966) PASS: lldb-api :: tools/lldb-server/commandline/TestStubReverseConnect.py (1008 of 1966) PASS: lldb-api :: functionalities/breakpoint/move_nearest/TestMoveNearest.py (1009 of 1966) PASS: lldb-api :: functionalities/signal/TestSendSignal.py (1010 of 1966) PASS: lldb-unit :: ScriptInterpreter/Python/./ScriptInterpreterPythonTests/PythonDataObjectsTest.TestGlobalNameResolutionNoDot (1011 of 1966) PASS: lldb-api :: lang/cpp/std-function-step-into-callable/TestStdFunctionStepIntoCallable.py (1012 of 1966) PASS: lldb-unit :: Process/gdb-remote/./ProcessGdbRemoteTests/GDBRemoteClientBaseTest.SendContinueAndLateInterrupt (1013 of 1966) UNSUPPORTED: lldb-shell :: Register/x86-64-ymm16-write.test (1014 of 1966) PASS: lldb-unit :: Utility/./UtilityTests/ScalarTest.ExtractBitfield (1015 of 1966) PASS: lldb-unit :: Process/minidump/./LLDBMinidumpTests/MinidumpParserTest.InvalidMinidump (1016 of 1966) PASS: lldb-unit :: SymbolFile/NativePDB/./SymbolFileNativePDBTests/PDBFPOProgramToDWARFExpressionTests.UnresolvedDependentCyclicRegisterAssignmentReference (1017 of 1966) PASS: lldb-unit :: SymbolFile/DWARF/./SymbolFileDWARFTests/SymbolFileDWARFTests.TestAbbrevMissingTerminator (1018 of 1966) PASS: lldb-api :: functionalities/breakpoint/address_breakpoints/TestBadAddressBreakpoints.py (1019 of 1966) PASS: lldb-api :: lang/cpp/gmodules/TestWithModuleDebugging.py (1020 of 1966) PASS: lldb-api :: commands/version/TestVersion.py (1021 of 1966) PASS: lldb-api :: functionalities/jitloader_gdb/TestJITLoaderGDB.py (1022 of 1966) PASS: lldb-api :: lang/c/tls_globals/TestTlsGlobals.py (1023 of 1966) PASS: lldb-unit :: ObjectFile/ELF/./ObjectFileELFTests/ObjectFileELFTest.GetModuleSpecifications_EarlySectionHeaders (1024 of 1966) PASS: lldb-unit :: Utility/./UtilityTests/StringExtractorTest.GetHexU8_Underflow_NoEof (1025 of 1966) PASS: lldb-shell :: ObjectFile/ELF/base-address.yaml (1026 of 1966) PASS: lldb-unit :: Utility/./UtilityTests/RangeTest.SetRangeBase (1027 of 1966) PASS: lldb-api :: lang/cpp/char1632_t/TestChar1632T.py (1028 of 1966) PASS: lldb-api :: functionalities/data-formatter/data-formatter-objc/TestDataFormatterObjCNSURL.py (1029 of 1966) PASS: lldb-api :: functionalities/postmortem/minidump-new/TestMiniDumpNew.py (1030 of 1966) PASS: lldb-unit :: SymbolFile/DWARF/./SymbolFileDWARFTests/SymbolFileDWARFTests.TestAbbrevValidAttrNullForm (1031 of 1966) UNSUPPORTED: lldb-api :: commands/register/register/intel_xtended_registers/TestMPXRegisters.py (1032 of 1966) PASS: lldb-unit :: Utility/./UtilityTests/CompletionRequest.DuplicateFiltering (1033 of 1966) PASS: lldb-unit :: Utility/./UtilityTests/StringListTest.GetMaxStringLengthEqualSize (1034 of 1966) PASS: lldb-api :: functionalities/breakpoint/breakpoint_hit_count/TestBreakpointHitCount.py (1035 of 1966) PASS: lldb-api :: functionalities/breakpoint/breakpoint_ignore_count/TestBreakpointIgnoreCount.py (1036 of 1966) PASS: lldb-unit :: Utility/./UtilityTests/FileSpecTest.FormatFileSpec (1037 of 1966) PASS: lldb-shell :: ObjectFile/ELF/duplicate-section.yaml (1038 of 1966) PASS: lldb-api :: commands/watchpoints/watchpoint_commands/command/TestWatchpointCommandPython.py (1039 of 1966) PASS: lldb-api :: functionalities/target-new-solib-notifications/TestModuleLoadedNotifys.py (1040 of 1966) PASS: lldb-api :: lang/objc/modules-cache/TestClangModulesCache.py (1041 of 1966) PASS: lldb-shell :: ScriptInterpreter/Python/scripted_breakpoint.test (1042 of 1966) PASS: lldb-shell :: SymbolFile/DWARF/gnu-style-compression.cpp (1043 of 1966) PASS: lldb-unit :: Utility/./UtilityTests/RangeTest.EqualInvalid (1044 of 1966) PASS: lldb-api :: functionalities/object-file/TestImageListMultiArchitecture.py (1045 of 1966) PASS: lldb-api :: functionalities/data-formatter/format-propagation/TestFormatPropagation.py (1046 of 1966) PASS: lldb-unit :: Utility/./UtilityTests/RangeTest.Slide (1047 of 1966) PASS: lldb-shell :: Commands/command-regex-unalias.test (1048 of 1966) PASS: lldb-unit :: Language/Highlighting/./HighlighterTests/HighlighterTest.ClangUnterminatedString (1049 of 1966) PASS: lldb-api :: commands/frame/var-scope/TestFrameVariableScope.py (1050 of 1966) PASS: lldb-shell :: ObjectFile/wasm/embedded-debug-sections.yaml (1051 of 1966) PASS: lldb-unit :: Utility/./UtilityTests/DataExtractorTest.GetCStrEmpty (1052 of 1966) PASS: lldb-unit :: UnwindAssembly/x86/./UnwindAssemblyx86Tests/Testx86AssemblyInspectionEngine.TestPopRBX (1053 of 1966) UNSUPPORTED: lldb-api :: functionalities/param_entry_vals/basic_entry_values_x86_64/TestBasicEntryValuesX86_64.py (1054 of 1966) PASS: lldb-api :: tools/lldb-vscode/breakpoint-events/TestVSCode_breakpointEvents.py (1055 of 1966) PASS: lldb-api :: types/TestLongTypesExpr.py (1056 of 1966) PASS: lldb-api :: functionalities/data-formatter/data-formatter-synthtype/TestDataFormatterSynthType.py (1057 of 1966) PASS: lldb-unit :: Process/gdb-remote/./ProcessGdbRemoteTests/GDBRemoteClientBaseTest.InterruptNoResponse (1058 of 1966) PASS: lldb-unit :: ObjectFile/PECOFF/./ObjectFilePECOFFTests/PECallFrameInfoTest.Basic_eh (1059 of 1966) PASS: lldb-api :: lang/objc/objc-ivar-protocols/TestIvarProtocols.py (1060 of 1966) PASS: lldb-unit :: UnwindAssembly/x86/./UnwindAssemblyx86Tests/Testx86AssemblyInspectionEngine.TestPopEDI (1061 of 1966) PASS: lldb-api :: lang/objc/modules-app-update/TestClangModulesAppUpdate.py (1062 of 1966) UNSUPPORTED: lldb-api :: commands/watchpoints/multi_watchpoint_slots/TestWatchpointMultipleSlots.py (1063 of 1966) PASS: lldb-api :: lang/cpp/operators/TestCppOperators.py (1064 of 1966) PASS: lldb-unit :: UnwindAssembly/x86/./UnwindAssemblyx86Tests/Testx86AssemblyInspectionEngine.TestAddESP (1065 of 1966) PASS: lldb-shell :: Quit/TestQuitExitCodeNonInt.test (1066 of 1966) PASS: lldb-api :: commands/expression/import-std-module/vector/TestVectorFromStdModule.py (1067 of 1966) PASS: lldb-unit :: UnwindAssembly/x86/./UnwindAssemblyx86Tests/Testx86AssemblyInspectionEngine.Test64bitFramelessSmallStackFrame (1068 of 1966) PASS: lldb-unit :: UnwindAssembly/x86/./UnwindAssemblyx86Tests/Testx86AssemblyInspectionEngine.TestSpArithx86_64Augmented (1069 of 1966) PASS: lldb-api :: lang/cpp/const_this/TestConstThis.py (1070 of 1966) PASS: lldb-unit :: Symbol/./SymbolTests/TestTypeSystemClang.TestBuiltinTypeForEncodingAndBitSize (1071 of 1966) PASS: lldb-api :: commands/command/history/TestCommandHistory.py (1072 of 1966) PASS: lldb-unit :: Process/minidump/./LLDBMinidumpTests/MinidumpParserTest.GetPidWindows (1073 of 1966) PASS: lldb-unit :: Process/gdb-remote/./ProcessGdbRemoteTests/GDBRemoteClientBaseTest.SendContinueAndInterrupt (1074 of 1966) PASS: lldb-unit :: Platform/./LLDBPlatformTests/PlatformDarwinTest.GetSDKNameForType (1075 of 1966) PASS: lldb-unit :: Utility/./UtilityTests/StringExtractorTest.GetU64BigEndian (1076 of 1966) PASS: lldb-api :: commands/apropos/with-process/TestAproposWithProcess.py (1077 of 1966) PASS: lldb-unit :: Utility/./UtilityTests/BinaryStreamTest.PutULEB128One (1078 of 1966) PASS: lldb-unit :: ScriptInterpreter/Python/./ScriptInterpreterPythonTests/PythonDataObjectsTest.TestOwnedReferences (1079 of 1966) PASS: lldb-api :: lang/objc/ivar-IMP/TestObjCiVarIMP.py (1080 of 1966) PASS: lldb-unit :: Utility/./UtilityTests/CompletionRequest.ShiftArguments (1081 of 1966) PASS: lldb-api :: commands/target/dump-symtab-demangle/TestDumpSymtabDemangle.py (1082 of 1966) PASS: lldb-unit :: ScriptInterpreter/Python/./ScriptInterpreterPythonTests/PythonDataObjectsTest.TestPythonStringToStr (1083 of 1966) PASS: lldb-api :: api/multiple-targets/TestMultipleTargets.py (1084 of 1966) PASS: lldb-unit :: Expression/./ExpressionTests/DiagnosticManagerTest.GetStringNoDiags (1085 of 1966) PASS: lldb-unit :: Process/gdb-remote/./ProcessGdbRemoteTests/GDBRemoteCommunicationClientTest.SendGetMetaDataPacket (1086 of 1966) PASS: lldb-unit :: Utility/./UtilityTests/StringListTest.PopBack (1087 of 1966) PASS: lldb-unit :: Symbol/./SymbolTests/TestTypeSystemClang.TestDisplayName (1088 of 1966) PASS: lldb-unit :: Utility/./UtilityTests/StringExtractorTest.GetNameColonValueContainsColon (1089 of 1966) PASS: lldb-api :: commands/expression/pr35310/TestExprsBug35310.py (1090 of 1966) PASS: lldb-shell :: Reproducer/TestDriverOptions.test (1091 of 1966) PASS: lldb-unit :: Utility/./UtilityTests/StringListTest.LongestCommonPrefixNoPrefix (1092 of 1966) UNSUPPORTED: lldb-shell :: Register/aarch64-gp-read.test (1093 of 1966) PASS: lldb-api :: functionalities/data-formatter/data-formatter-globals/TestDataFormatterGlobals.py (1094 of 1966) PASS: lldb-unit :: debugserver/./debugserverTests/RNBSocket.LoopBackConnectIPv4 (1095 of 1966) PASS: lldb-unit :: Utility/./UtilityTests/BinaryStreamTest.PutULEB128FourBytes (1096 of 1966) PASS: lldb-unit :: Process/minidump/./LLDBMinidumpTests/MinidumpParserTest.GetArchitectureWindows (1097 of 1966) PASS: lldb-api :: lang/objc/objc-new-syntax/TestObjCNewSyntaxArray.py (1098 of 1966) XFAIL: lldb-shell :: Register/x86-mm-xmm-write.test (1099 of 1966) PASS: lldb-api :: functionalities/data-formatter/data-formatter-advanced/TestDataFormatterAdv.py (1100 of 1966) PASS: lldb-api :: types/TestCharType.py (1101 of 1966) PASS: lldb-api :: commands/process/attach/attach_denied/TestAttachDenied.py (1102 of 1966) PASS: lldb-unit :: Utility/./UtilityTests/Flags.Clear (1103 of 1966) PASS: lldb-api :: python_api/file_handle/TestFileHandle.py (1104 of 1966) PASS: lldb-unit :: Expression/./ExpressionTests/CppModuleConfigurationTest.MissingLibCpp (1105 of 1966) PASS: lldb-shell :: SymbolFile/DWARF/dir-separator-windows.s (1106 of 1966) PASS: lldb-api :: tools/lldb-vscode/breakpoint/TestVSCode_setExceptionBreakpoints.py (1107 of 1966) PASS: lldb-unit :: Utility/./UtilityTests/VASprintfTest.BufferResize (1108 of 1966) PASS: lldb-api :: functionalities/non-overlapping-index-variable-i/TestIndexVariable.py (1109 of 1966) PASS: lldb-unit :: Utility/./UtilityTests/StructuredDataTest.StringDump (1110 of 1966) PASS: lldb-api :: lang/objc/objc-ivar-offsets/TestObjCIvarOffsets.py (1111 of 1966) FAIL: lldb-api :: lang/objc/ptr_refs/TestPtrRefsObjC.py (1112 of 1966) ******************** TEST 'lldb-api :: lang/objc/ptr_refs/TestPtrRefsObjC.py' FAILED ******************** Script: -- /usr/local/bin/python /Users/buildslave/jenkins/workspace/lldb-cmake-sanitized/llvm-project/lldb/test/API/dotest.py --arch x86_64 -s /Users/buildslave/jenkins/workspace/lldb-cmake-sanitized/lldb-build/lldb-test-traces -S nm -u CXXFLAGS -u CFLAGS --codesign-identity lldb_codesign --server /Users/buildslave/jenkins/workspace/lldb-cmake-sanitized/lldb-build/./bin/debugserver --arch x86_64 --build-dir /Users/buildslave/jenkins/workspace/lldb-cmake-sanitized/lldb-build/lldb-test-build.noindex -s=/Users/buildslave/jenkins/workspace/lldb-cmake-sanitized/test/logs -t --env TERM=vt100 --env LLVM_LIBS_DIR=/Users/buildslave/jenkins/workspace/lldb-cmake-sanitized/lldb-build/./lib --inferior-env ASAN_OPTIONS=detect_stack_use_after_return=1 --inferior-env DYLD_INSERT_LIBRARIES=/Users/buildslave/jenkins/workspace/lldb-cmake-sanitized/host-compiler/lib/clang/11.0.0/lib/darwin/libclang_rt.asan_osx_dynamic.dylib --build-dir /Users/buildslave/jenkins/workspace/lldb-cmake-sanitized/lldb-build/lldb-test-build.noindex --lldb-module-cache-dir /Users/buildslave/jenkins/workspace/lldb-cmake-sanitized/lldb-build/lldb-test-build.noindex/module-cache-lldb/lldb-api --clang-module-cache-dir /Users/buildslave/jenkins/workspace/lldb-cmake-sanitized/lldb-build/lldb-test-build.noindex/module-cache-clang/lldb-api --executable /Users/buildslave/jenkins/workspace/lldb-cmake-sanitized/lldb-build/./bin/lldb --compiler /Users/buildslave/jenkins/workspace/lldb-cmake-sanitized/lldb-build/./bin/clang --dsymutil /Users/buildslave/jenkins/workspace/lldb-cmake-sanitized/lldb-build/./bin/dsymutil --filecheck /Users/buildslave/jenkins/workspace/lldb-cmake-sanitized/lldb-build/./bin/FileCheck --lldb-libs-dir /Users/buildslave/jenkins/workspace/lldb-cmake-sanitized/lldb-build/./lib /Users/buildslave/jenkins/workspace/lldb-cmake-sanitized/llvm-project/lldb/test/API/lang/objc/ptr_refs -p TestPtrRefsObjC.py -- Exit Code: 1

Hide Details

Command Output (stdout): -- lldb version 11.0.99 clang revision 43d98a0ecfec7882419206673f04a9632c746057 llvm revision 43d98a0ecfec7882419206673f04a9632c746057 "crashlog" and "save_crashlog" command installed, use the "--help" option for detailed help "malloc_info", "ptr_refs", "cstr_refs", "find_variable", and "objc_refs" commands have been installed, use the "--help" options on these commands for detailed help. LLDB library dir: /Users/buildslave/jenkins/workspace/lldb-cmake-sanitized/lldb-build/bin LLDB import library dir: /Users/buildslave/jenkins/workspace/lldb-cmake-sanitized/lldb-build/./lib libstdcxx tests will not be run because: Don't know how to build with libstdcxx on macosx Skipping following debug info categories: ['dwo'] 0x00007ffeee45b468: stack in frame #0 of thread #1: tid 0x2fe3b in variable at 0x7ffeee45b468: (MyClass *) self = 0x00006020000000d0 0x00007ffeee45b3e0: stack (red zone)

Hide Details

-- Command Output (stderr): -- error: 'ptr_refs' is not a valid command. error: 'ptr_refs' is not a valid command.

Hide Details

Session logs for test failures/errors/unexpected successes will go into directory '/Users/buildslave/jenkins/workspace/lldb-cmake-sanitized/test/logs' Command invoked: /Users/buildslave/jenkins/workspace/lldb-cmake-sanitized/llvm-project/lldb/test/API/dotest.py --arch x86_64 -s /Users/buildslave/jenkins/workspace/lldb-cmake-sanitized/lldb-build/lldb-test-traces -S nm -u CXXFLAGS -u CFLAGS --codesign-identity lldb_codesign --server /Users/buildslave/jenkins/workspace/lldb-cmake-sanitized/lldb-build/./bin/debugserver --arch x86_64 --build-dir /Users/buildslave/jenkins/workspace/lldb-cmake-sanitized/lldb-build/lldb-test-build.noindex -s=/Users/buildslave/jenkins/workspace/lldb-cmake-sanitized/test/logs -t --env TERM=vt100 --env LLVM_LIBS_DIR=/Users/buildslave/jenkins/workspace/lldb-cmake-sanitized/lldb-build/./lib --inferior-env ASAN_OPTIONS=detect_stack_use_after_return=1 --inferior-env DYLD_INSERT_LIBRARIES=/Users/buildslave/jenkins/workspace/lldb-cmake-sanitized/host-compiler/lib/clang/11.0.0/lib/darwin/libclang_rt.asan_osx_dynamic.dylib --build-dir /Users/buildslave/jenkins/workspace/lldb-cmake-sanitized/lldb-build/lldb-test-build.noindex --lldb-module-cache-dir /Users/buildslave/jenkins/workspace/lldb-cmake-sanitized/lldb-build/lldb-test-build.noindex/module-cache-lldb/lldb-api --clang-module-cache-dir /Users/buildslave/jenkins/workspace/lldb-cmake-sanitized/lldb-build/lldb-test-build.noindex/module-cache-clang/lldb-api --executable /Users/buildslave/jenkins/workspace/lldb-cmake-sanitized/lldb-build/./bin/lldb --compiler /Users/buildslave/jenkins/workspace/lldb-cmake-sanitized/lldb-build/./bin/clang --dsymutil /Users/buildslave/jenkins/workspace/lldb-cmake-sanitized/lldb-build/./bin/dsymutil --filecheck /Users/buildslave/jenkins/workspace/lldb-cmake-sanitized/lldb-build/./bin/FileCheck --lldb-libs-dir /Users/buildslave/jenkins/workspace/lldb-cmake-sanitized/lldb-build/./lib /Users/buildslave/jenkins/workspace/lldb-cmake-sanitized/llvm-project/lldb/test/API/lang/objc/ptr_refs -p TestPtrRefsObjC.py Change dir to: /Users/buildslave/jenkins/workspace/lldb-cmake-sanitized/llvm-project/lldb/test/API/lang/objc/ptr_refs runCmd: settings clear -all output:

Hide Details

runCmd: settings set symbols.enable-external-lookup false output:

Hide Details

runCmd: settings set target.auto-apply-fixits false output:

Hide Details

runCmd: settings set plugin.process.gdb-remote.packet-timeout 60 output:

Hide Details

runCmd: settings set symbols.clang-modules-cache-path "/Users/buildslave/jenkins/workspace/lldb-cmake-sanitized/lldb-build/lldb-test-build.noindex/module-cache-lldb/lldb-api" output:

Hide Details

runCmd: settings set use-color false output:

Hide Details

runCmd: setting set target.prefer-dynamic-value no-dynamic-values output:

Hide Details

runCmd: settings set target.env-vars ASAN_OPTIONS=detect_stack_use_after_return=1 DYLD_INSERT_LIBRARIES=/Users/buildslave/jenkins/workspace/lldb-cmake-sanitized/host-compiler/lib/clang/11.0.0/lib/darwin/libclang_rt.asan_osx_dynamic.dylib output:

Hide Details

runCmd: script import lldb.macosx.heap output: "crashlog" and "save_crashlog" command installed, use the "--help" option for detailed help "malloc_info", "ptr_refs", "cstr_refs", "find_variable", and "objc_refs" commands have been installed, use the "--help" options on these commands for detailed help.

Hide Details

Hide Details

runCmd: ptr_refs self output: 0x00007ffeee45b468: stack in frame #0 of thread #1: tid 0x2fe3b in variable at 0x7ffeee45b468: (MyClass *) self = 0x00006020000000d0 0x00007ffeee45b3e0: stack (red zone)

Hide Details

Hide Details

Expecting sub string: malloc Not matched

Hide Details

FAIL: LLDB (/Users/buildslave/jenkins/workspace/lldb-cmake-sanitized/lldb-build/bin/clang-11-x86_64) :: test_ptr_refs_dsym (TestPtrRefsObjC.TestPtrRefsObjC) <bound method SBProcess.Kill of <lldb.SBProcess; proxy of <Swig Object of type 'lldb::SBProcess *' at 0x106b6a8d0> >>: success

Hide Details

runCmd: settings clear -all output:

Hide Details

runCmd: settings set symbols.enable-external-lookup false output:

Hide Details

runCmd: settings set target.auto-apply-fixits false output:

Hide Details

runCmd: settings set plugin.process.gdb-remote.packet-timeout 60 output:

Hide Details

runCmd: settings set symbols.clang-modules-cache-path "/Users/buildslave/jenkins/workspace/lldb-cmake-sanitized/lldb-build/lldb-test-build.noindex/module-cache-lldb/lldb-api" output:

Hide Details

runCmd: settings set use-color false output:

Hide Details

runCmd: setting set target.prefer-dynamic-value no-dynamic-values output:

Hide Details

runCmd: settings set target.env-vars ASAN_OPTIONS=detect_stack_use_after_return=1 DYLD_INSERT_LIBRARIES=/Users/buildslave/jenkins/workspace/lldb-cmake-sanitized/host-compiler/lib/clang/11.0.0/lib/darwin/libclang_rt.asan_osx_dynamic.dylib output:

Hide Details

runCmd: script import lldb.macosx.heap output:

Hide Details

runCmd: ptr_refs self runCmd failed! error: 'ptr_refs' is not a valid command.

Hide Details

Hide Details

XFAIL: LLDB (/Users/buildslave/jenkins/workspace/lldb-cmake-sanitized/lldb-build/bin/clang-11-x86_64) :: test_ptr_refs_dwarf (TestPtrRefsObjC.TestPtrRefsObjC) <bound method SBProcess.Kill of <lldb.SBProcess; proxy of <Swig Object of type 'lldb::SBProcess *' at 0x1066506c0> >>: success

Hide Details

UNSUPPORTED: LLDB (/Users/buildslave/jenkins/workspace/lldb-cmake-sanitized/lldb-build/bin/clang-11-x86_64) :: test_ptr_refs_dwo (TestPtrRefsObjC.TestPtrRefsObjC) (test case does not fall in any category of interest for this run) runCmd: settings clear -all output:

Hide Details

runCmd: settings set symbols.enable-external-lookup false output:

Hide Details

runCmd: settings set target.auto-apply-fixits false output:

Hide Details

runCmd: settings set plugin.process.gdb-remote.packet-timeout 60 output:

Hide Details

runCmd: settings set symbols.clang-modules-cache-path "/Users/buildslave/jenkins/workspace/lldb-cmake-sanitized/lldb-build/lldb-test-build.noindex/module-cache-lldb/lldb-api" output:

Hide Details

runCmd: settings set use-color false output:

Hide Details

runCmd: setting set target.prefer-dynamic-value no-dynamic-values output:

Hide Details

runCmd: settings set target.env-vars ASAN_OPTIONS=detect_stack_use_after_return=1 DYLD_INSERT_LIBRARIES=/Users/buildslave/jenkins/workspace/lldb-cmake-sanitized/host-compiler/lib/clang/11.0.0/lib/darwin/libclang_rt.asan_osx_dynamic.dylib output:

Hide Details

runCmd: script import lldb.macosx.heap output:

Hide Details

runCmd: ptr_refs self runCmd failed! error: 'ptr_refs' is not a valid command.

Hide Details

Hide Details

XFAIL: LLDB (/Users/buildslave/jenkins/workspace/lldb-cmake-sanitized/lldb-build/bin/clang-11-x86_64) :: test_ptr_refs_gmodules (TestPtrRefsObjC.TestPtrRefsObjC) <bound method SBProcess.Kill of <lldb.SBProcess; proxy of <Swig Object of type 'lldb::SBProcess *' at 0x106b6a420> >>: success

Hide Details

Restore dir to: /Users/buildslave/jenkins/workspace/lldb-cmake-sanitized/lldb-build/tools/lldb/test ====================================================================== FAIL: test_ptr_refs_dsym (TestPtrRefsObjC.TestPtrRefsObjC) Test the ptr_refs tool on Darwin with Objective-C ---------------------------------------------------------------------- Traceback (most recent call last): File "/Users/buildslave/jenkins/workspace/lldb-cmake-sanitized/llvm-project/lldb/packages/Python/lldbsuite/test/lldbtest.py", line 1751, in test_method return attrvalue(self) File "/Users/buildslave/jenkins/workspace/lldb-cmake-sanitized/llvm-project/lldb/packages/Python/lldbsuite/test/decorators.py", line 110, in wrapper func(*args, **kwargs) File "/Users/buildslave/jenkins/workspace/lldb-cmake-sanitized/llvm-project/lldb/test/API/lang/objc/ptr_refs/TestPtrRefsObjC.py", line 47, in test_ptr_refs self.expect("ptr_refs self", substrs=["malloc", "stack"]) File "/Users/buildslave/jenkins/workspace/lldb-cmake-sanitized/llvm-project/lldb/packages/Python/lldbsuite/test/lldbtest.py", line 2391, in expect if msg else EXP_MSG(str, output, exe)) AssertionError: False is not True : 'ptr_refs self' returns expected result, got '0x00007ffeee45b468: stack in frame #0 of thread #1: tid 0x2fe3b in variable at 0x7ffeee45b468: (MyClass *) self = 0x00006020000000d0 0x00007ffeee45b3e0: stack (red zone)' Config=x86_64-/Users/buildslave/jenkins/workspace/lldb-cmake-sanitized/lldb-build/bin/clang-11 ---------------------------------------------------------------------- Ran 4 tests in 22.809s

Hide Details

RESULT: FAILED (0 passes, 1 failures, 0 errors, 1 skipped, 2 expected failures, 0 unexpected successes)

Hide Details

--

Hide Details

******************** PASS: lldb-unit :: Language/Highlighting/./HighlighterTests/HighlighterTest.FallbackHighlighter (1113 of 1966) PASS: lldb-unit :: Symbol/./SymbolTests/TestClangASTImporter.CopyDeclTagDecl (1114 of 1966) PASS: lldb-unit :: ScriptInterpreter/Python/./ScriptInterpreterPythonTests/PythonDataObjectsTest.TestPythonTupleSize (1115 of 1966) PASS: lldb-api :: functionalities/thread/concurrent_events/TestConcurrentDelayedCrashWithBreakpointWatchpoint.py (1116 of 1966) PASS: lldb-api :: commands/expression/unwind_expression/TestUnwindExpression.py (1117 of 1966) PASS: lldb-shell :: SymbolFile/DWARF/DW_OP_piece-smaller-than-struct.s (1118 of 1966) PASS: lldb-unit :: Utility/./UtilityTests/StreamTest.AddressSize (1119 of 1966) PASS: lldb-unit :: Utility/./UtilityTests/ConstStringTest.format_provider (1120 of 1966) PASS: lldb-unit :: Process/gdb-remote/./ProcessGdbRemoteTests/GDBRemoteClientBaseTest.SendContinueAndWait (1121 of 1966) UNSUPPORTED: lldb-shell :: ExecControl/StopHook/stop-hook-threads.test (1122 of 1966) PASS: lldb-unit :: Language/Highlighting/./HighlighterTests/HighlighterTest.DefaultHighlighter (1123 of 1966) UNSUPPORTED: lldb-shell :: Register/x86-64-ymm16-read.test (1124 of 1966) UNSUPPORTED: lldb-shell :: ScriptInterpreter/Lua/persistent_state.test (1125 of 1966) PASS: lldb-unit :: Utility/./UtilityTests/StreamTest.PutCStringWithStringRef (1126 of 1966) PASS: lldb-shell :: SymbolFile/DWARF/debug-types-dwo-cross-reference.cpp (1127 of 1966) PASS: lldb-unit :: Process/gdb-remote/./ProcessGdbRemoteTests/GDBRemoteCommunicationClientTest.GetMemoryRegionInfo (1128 of 1966) PASS: lldb-unit :: Utility/./UtilityTests/RangeDataVector.FindEntryThatContains (1129 of 1966) PASS: lldb-unit :: Process/minidump/./LLDBMinidumpTests/MinidumpParserTest.GetThreadContext_x86_32 (1130 of 1966) PASS: lldb-shell :: ObjectFile/ELF/minidebuginfo-find-symbols.yaml (1131 of 1966) PASS: lldb-api :: functionalities/type_lookup/TestTypeLookup.py (1132 of 1966) PASS: lldb-api :: commands/expression/import-std-module/shared_ptr/TestSharedPtrFromStdModule.py (1133 of 1966) PASS: lldb-unit :: UnwindAssembly/x86/./UnwindAssemblyx86Tests/Testx86AssemblyInspectionEngine.TestPopR15 (1134 of 1966) PASS: lldb-unit :: Utility/./UtilityTests/Predicate.WaitForValueNotEqualTo (1135 of 1966) PASS: lldb-api :: commands/disassemble/basic/TestFrameDisassemble.py (1136 of 1966) UNSUPPORTED: lldb-api :: functionalities/darwin_log/filter/regex/subsystem/TestDarwinLogFilterRegexSubsystem.py (1137 of 1966) PASS: lldb-api :: functionalities/unwind/sigtramp/TestSigtrampUnwind.py (1138 of 1966) PASS: lldb-api :: functionalities/thread/concurrent_events/TestConcurrentSignalWatchBreak.py (1139 of 1966) UNSUPPORTED: lldb-api :: lang/c/typedef/Testtypedef.py (1140 of 1966) PASS: lldb-shell :: SymbolFile/Breakpad/unwind-via-stack-win.test (1141 of 1966) PASS: lldb-unit :: Utility/./UtilityTests/SubsystemRAIITest.SubsystemWithErrorFailure (1142 of 1966) PASS: lldb-api :: functionalities/thread/concurrent_events/TestConcurrentManyWatchpoints.py (1143 of 1966) PASS: lldb-api :: functionalities/data-formatter/ostypeformatting/TestFormattersOsType.py (1144 of 1966) PASS: lldb-api :: functionalities/data-formatter/data-formatter-stl/libcxx/unordered/TestDataFormatterUnordered.py (1145 of 1966) PASS: lldb-unit :: Process/gdb-remote/./ProcessGdbRemoteTests/GDBRemoteCommunicationClientTest.ReadRegister (1146 of 1966) UNSUPPORTED: lldb-api :: functionalities/tty/TestTerminal.py (1147 of 1966) UNSUPPORTED: lldb-api :: functionalities/darwin_log/format/TestDarwinLogMessageFormat.py (1148 of 1966) PASS: lldb-api :: functionalities/memory-region/TestMemoryRegion.py (1149 of 1966) PASS: lldb-unit :: Host/./HostTests/SocketTest.TCPGetConnectURI (1150 of 1966) PASS: lldb-shell :: SymbolFile/DWARF/dwp.s (1151 of 1966) PASS: lldb-api :: macosx/find-app-in-bundle/TestFindAppInBundle.py (1152 of 1966) PASS: lldb-unit :: Utility/./UtilityTests/RangeTest.ContainsRangeStartingFromZero (1153 of 1966) PASS: lldb-api :: functionalities/breakpoint/cpp/TestCPPBreakpointLocations.py (1154 of 1966) PASS: lldb-unit :: Utility/./UtilityTests/StringListTest.CopyList (1155 of 1966) PASS: lldb-unit :: ScriptInterpreter/Python/./ScriptInterpreterPythonTests/PythonDataObjectsTest.TestPythonInteger (1156 of 1966) PASS: lldb-api :: lang/objc/objc-ivar-stripped/TestObjCIvarStripped.py (1157 of 1966) PASS: lldb-unit :: Expression/./ExpressionTests/DWARFExpression.DW_OP_piece (1158 of 1966) PASS: lldb-unit :: Process/minidump/./LLDBMinidumpTests/MinidumpParserTest.GetPidWow64 (1159 of 1966) PASS: lldb-unit :: Utility/./UtilityTests/NameMatchesTest.Ignore (1160 of 1966) PASS: lldb-unit :: Symbol/./SymbolTests/TestTypeSystemClang.TemplateArguments (1161 of 1966) PASS: lldb-shell :: ObjectFile/MachO/lc_build_version.yaml (1162 of 1966) PASS: lldb-api :: functionalities/postmortem/elf-core/TestLinuxCore.py (1163 of 1966) PASS: lldb-api :: functionalities/data-formatter/data-formatter-stl/libcxx/unique_ptr/TestDataFormatterLibcxxUniquePtr.py (1164 of 1966) PASS: lldb-unit :: Utility/./UtilityTests/StreamTest.PutBytesAsRawHex8ToBigEndian (1165 of 1966) PASS: lldb-api :: lang/c/local_types/TestUseClosestType.py (1166 of 1966) PASS: lldb-api :: functionalities/gdb_remote_client/TestqOffsets.py (1167 of 1966) PASS: lldb-shell :: VSCode/TestOptions.test (1168 of 1966) PASS: lldb-api :: lang/objc/exceptions/TestObjCExceptions.py (1169 of 1966) PASS: lldb-api :: lang/c/function_types/TestFunctionTypes.py (1170 of 1966) PASS: lldb-unit :: Process/gdb-remote/./ProcessGdbRemoteTests/GDBRemoteCommunicationServerTest.SendErrorResponse_StringError (1171 of 1966) PASS: lldb-unit :: Utility/./UtilityTests/ArgsTest.GetQuotedCommandString (1172 of 1966) PASS: lldb-unit :: Expression/./ExpressionTests/CppModuleConfigurationTest.UnrelatedLibrary (1173 of 1966) PASS: lldb-shell :: SymbolFile/DWARF/debug-types-line-tables.s (1174 of 1966) PASS: lldb-unit :: Utility/./UtilityTests/StreamTeeTest.GetStreamAtIndexOutOfBounds (1175 of 1966) PASS: lldb-api :: functionalities/thread/exit_during_step/TestExitDuringStep.py (1176 of 1966) UNSUPPORTED: lldb-shell :: BuildScript/toolchain-clang-cl.test (1177 of 1966) PASS: lldb-api :: tools/lldb-server/TestGdbRemoteHostInfo.py (1178 of 1966) PASS: lldb-api :: commands/expression/call-function/TestCallUserDefinedFunction.py (1179 of 1966) PASS: lldb-unit :: Utility/./UtilityTests/UriParserTest.PortOverflow (1180 of 1966) PASS: lldb-unit :: ScriptInterpreter/Python/./ScriptInterpreterPythonTests/PythonDataObjectsTest.TestCallable (1181 of 1966) PASS: lldb-unit :: Utility/./UtilityTests/BinaryStreamTest.PutSLEB128ThreeBytes (1182 of 1966) PASS: lldb-api :: tools/lldb-vscode/breakpoint/TestVSCode_setFunctionBreakpoints.py (1183 of 1966) PASS: lldb-unit :: Expression/./ExpressionTests/DiagnosticManagerTest.AppendMessageSubsequentDiags (1184 of 1966) PASS: lldb-unit :: Utility/./UtilityTests/StringLexerTest.PutBack (1185 of 1966) PASS: lldb-unit :: Utility/./UtilityTests/Predicate.WaitForValueEqualTo (1186 of 1966) PASS: lldb-api :: python_api/process/read-mem-cstring/TestReadMemCString.py (1187 of 1966) PASS: lldb-shell :: ObjectFile/ELF/PT_LOAD-overlap-PT_INTERP.yaml (1188 of 1966) UNSUPPORTED: lldb-shell :: Register/arm-fp-read.test (1189 of 1966) PASS: lldb-api :: functionalities/gdb_remote_client/TestStopPCs.py (1190 of 1966) PASS: lldb-api :: lang/objc/modules-incomplete/TestIncompleteModules.py (1191 of 1966) PASS: lldb-unit :: Utility/./UtilityTests/StringExtractorTest.DecodeHexU8_InvalidHex2 (1192 of 1966) PASS: lldb-shell :: SymbolFile/DWARF/dwarf5-atomic.s (1193 of 1966) PASS: lldb-unit :: SymbolFile/NativePDB/./SymbolFileNativePDBTests/PDBFPOProgramToDWARFExpressionTests.SingleAssignmentRegisterRef (1194 of 1966) PASS: lldb-shell :: ObjectFile/ELF/netbsd-core-amd64.test (1195 of 1966) PASS: lldb-shell :: SymbolFile/DWARF/deterministic-build.cpp (1196 of 1966) PASS: lldb-unit :: Utility/./UtilityTests/StringListTest.LongestCommonPrefix (1197 of 1966) PASS: lldb-api :: commands/expression/unicode-in-variable/TestUnicodeInVariable.py (1198 of 1966) PASS: lldb-shell :: Reproducer/TestCaptureEnvOverride.test (1199 of 1966) PASS: lldb-api :: functionalities/data-formatter/data-formatter-stl/libcxx/set/TestDataFormatterLibcxxSet.py (1200 of 1966) PASS: lldb-api :: macosx/load-kext/TestLoadKext.py (1201 of 1966) PASS: lldb-unit :: Expression/./ExpressionTests/CppModuleConfigurationTest.IgnoreLibStdCpp (1202 of 1966) PASS: lldb-api :: lang/objc/modules/TestObjCModules.py (1203 of 1966) PASS: lldb-unit :: Target/./TargetTests/ExecutionContextTest.GetByteOrderTarget (1204 of 1966) PASS: lldb-api :: commands/expression/ir-interpreter-phi-nodes/TestIRInterpreterPHINodes.py (1205 of 1966) PASS: lldb-shell :: Driver/TestProcessAttach.test (1206 of 1966) PASS: lldb-unit :: Utility/./UtilityTests/ArgsTest.TestSingleArgWithQuotedSpace (1207 of 1966) PASS: lldb-unit :: Host/./HostTests/SocketTest.UDPConnect (1208 of 1966) PASS: lldb-api :: python_api/sblaunchinfo/TestSBLaunchInfo.py (1209 of 1966) PASS: lldb-api :: commands/expression/import-std-module/deque-dbg-info-content/TestDbgInfoContentDequeFromStdModule.py (1210 of 1966) PASS: lldb-api :: python_api/interpreter/TestCommandInterpreterAPI.py (1211 of 1966) PASS: lldb-api :: lang/objc/foundation/TestObjCMethods2.py (1212 of 1966) PASS: lldb-unit :: Interpreter/./InterpreterTests/CompletionTest.DirCompletionUsername (1213 of 1966) PASS: lldb-shell :: Breakpoint/dummy-target.test (1214 of 1966) PASS: lldb-api :: commands/platform/basic/TestPlatformPython.py (1215 of 1966) PASS: lldb-api :: commands/expression/import-std-module/weak_ptr/TestWeakPtrFromStdModule.py (1216 of 1966) PASS: lldb-shell :: SymbolFile/DWARF/debug_loclists-dwo.s (1217 of 1966) PASS: lldb-unit :: Utility/./UtilityTests/StringExtractorTest.GetHexU8_Extra (1218 of 1966) UNSUPPORTED: lldb-shell :: Expr/TestIRMemoryMapWindows.test (1219 of 1966) PASS: lldb-api :: lang/cpp/incomplete-types/TestCppIncompleteTypes.py (1220 of 1966) PASS: lldb-unit :: Target/./TargetTests/PathMappingListTest.RemapRoot (1221 of 1966) PASS: lldb-unit :: Utility/./UtilityTests/StringExtractorTest.GetHexU8_Extra_NoEof (1222 of 1966) PASS: lldb-api :: functionalities/thread/concurrent_events/TestConcurrentTwoBreakpointsOneWatchpoint.py (1223 of 1966) PASS: lldb-unit :: Host/./HostTests/MainLoopTest.UnmonitoredSignal (1224 of 1966) PASS: lldb-unit :: Utility/./UtilityTests/EventTest.DumpEventDataBytes (1225 of 1966) PASS: lldb-api :: commands/frame/diagnose/dereference-function-return/TestDiagnoseDereferenceFunctionReturn.py (1226 of 1966) PASS: lldb-api :: tools/lldb-server/TestGdbRemoteSingleStep.py (1227 of 1966) PASS: lldb-unit :: Utility/./UtilityTests/CompletionRequest.FakeLastArg (1228 of 1966) PASS: lldb-shell :: Quit/TestQuitExitCodeImplicit0.test (1229 of 1966) PASS: lldb-unit :: Utility/./UtilityTests/AnsiTerminal.Twice (1230 of 1966) PASS: lldb-api :: functionalities/data-formatter/stringprinter/TestStringPrinter.py (1231 of 1966) PASS: lldb-unit :: Utility/./UtilityTests/VMRange.Clear (1232 of 1966) PASS: lldb-unit :: Expression/./ExpressionTests/DiagnosticManagerTest.GetStringSeverityLabels (1233 of 1966) PASS: lldb-api :: lang/cpp/unicode-literals/TestUnicodeLiterals.py (1234 of 1966) PASS: lldb-api :: commands/expression/regression-access-function-template-in-record/TestRegressionAccessFunctionTemplateInRecord.py (1235 of 1966) PASS: lldb-shell :: Quit/TestQuitExitCode-30.test (1236 of 1966) PASS: lldb-unit :: UnwindAssembly/x86/./UnwindAssemblyx86Tests/Testx86AssemblyInspectionEngine.TestSimplei386ugmented (1237 of 1966) PASS: lldb-unit :: Host/./HostTests/TaskPoolTest.AddTask (1238 of 1966) PASS: lldb-shell :: ObjectFile/PECOFF/invalid-export-table.yaml (1239 of 1966) PASS: lldb-api :: python_api/hello_world/TestHelloWorld.py (1240 of 1966) PASS: lldb-unit :: Utility/./UtilityTests/StreamTest.PutRawBytesToLittleEndian (1241 of 1966) PASS: lldb-api :: commands/watchpoints/watchpoint_size/TestWatchpointSizes.py (1242 of 1966) PASS: lldb-unit :: Symbol/./SymbolTests/TestClangASTImporter.CanImportInvalidType (1243 of 1966) PASS: lldb-api :: commands/expression/dollar-in-variable/TestDollarInVariable.py (1244 of 1966) PASS: lldb-unit :: Utility/./UtilityTests/StreamTest.PutHex64ByteOrderLittle (1245 of 1966) PASS: lldb-shell :: SymbolFile/DWARF/childless-compile-unit.s (1246 of 1966) PASS: lldb-unit :: Utility/./UtilityTests/OptionsWithRawTest.LeadingSpaceArgs (1247 of 1966) PASS: lldb-unit :: Utility/./UtilityTests/FileSpecTest.EqualDotsPosixRoot (1248 of 1966) PASS: lldb-shell :: Expr/TestIRMemoryMap.test (1249 of 1966) PASS: lldb-api :: functionalities/breakpoint/scripted_bkpt/TestScriptedResolver.py (1250 of 1966) PASS: lldb-unit :: UnwindAssembly/x86/./UnwindAssemblyx86Tests/Testx86AssemblyInspectionEngine.TestCALLNextInsn (1251 of 1966) PASS: lldb-api :: commands/expression/import-std-module/empty-module/TestEmptyStdModule.py (1252 of 1966) PASS: lldb-api :: python_api/symbol-context/two-files/TestSymbolContextTwoFiles.py (1253 of 1966) PASS: lldb-unit :: Symbol/./SymbolTests/TestTypeSystemClang.TestFunctionTemplateConstruction (1254 of 1966) PASS: lldb-unit :: Utility/./UtilityTests/UriParserTest.SchemeHostSeparator4 (1255 of 1966) UNSUPPORTED: lldb-api :: functionalities/darwin_log/source/debug/TestDarwinLogSourceDebug.py (1256 of 1966) PASS: lldb-api :: lang/c/strings/TestCStrings.py (1257 of 1966) PASS: lldb-unit :: Utility/./UtilityTests/UriParserTest.MinimalPath (1258 of 1966) UNSUPPORTED: lldb-api :: api/multiple-debuggers/TestMultipleDebuggers.py (1259 of 1966) PASS: lldb-unit :: SymbolFile/NativePDB/./SymbolFileNativePDBTests/PDBFPOProgramToDWARFExpressionTests.UnresolvedCyclicRegisterAssignmentReference (1260 of 1966) PASS: lldb-api :: functionalities/gdb_remote_client/TestNoWatchpointSupportInfo.py (1261 of 1966) PASS: lldb-unit :: Language/Highlighting/./HighlighterTests/HighlighterTest.ClangIdentifiers (1262 of 1966) PASS: lldb-unit :: Utility/./UtilityTests/ArchSpecTest.TestSetTriple (1263 of 1966) PASS: lldb-unit :: Language/Highlighting/./HighlighterTests/HighlighterTest.ClangCursorPosAfterOtherToken (1264 of 1966) PASS: lldb-shell :: Minidump/Windows/find-module.test (1265 of 1966) PASS: lldb-shell :: Settings/TestModuleCacheSanity.test (1266 of 1966) PASS: lldb-api :: commands/frame/language/TestGuessLanguage.py (1267 of 1966) PASS: lldb-unit :: Utility/./UtilityTests/FileSpecTest.Equal (1268 of 1966) PASS: lldb-api :: python_api/value/empty_class/TestValueAPIEmptyClass.py (1269 of 1966) PASS: lldb-unit :: Utility/./UtilityTests/ProcessInstanceInfo.Yaml (1270 of 1966) PASS: lldb-api :: commands/watchpoints/hello_watchpoint/TestMyFirstWatchpoint.py (1271 of 1966) PASS: lldb-api :: functionalities/breakpoint/source_regexp/TestSourceRegexBreakpoints.py (1272 of 1966) PASS: lldb-api :: commands/expression/persistent_types/TestPersistentTypes.py (1273 of 1966) PASS: lldb-api :: commands/expression/call-throws/TestCallThatThrows.py (1274 of 1966) PASS: lldb-shell :: Unwind/thread-step-out-ret-addr-check.test (1275 of 1966) PASS: lldb-api :: functionalities/gdb_remote_client/TestRestartBug.py (1276 of 1966) PASS: lldb-unit :: Utility/./UtilityTests/ProcessInstanceInfoList.Yaml (1277 of 1966) PASS: lldb-api :: lang/objc/objc-property/TestObjCProperty.py (1278 of 1966) PASS: lldb-unit :: Language/CPlusPlus/./LanguageCPlusPlusTests/CPlusPlusLanguage.CPlusPlusNameParser (1279 of 1966) PASS: lldb-api :: lang/c/unicode/TestUnicodeSymbols.py (1280 of 1966) PASS: lldb-unit :: UnwindAssembly/x86/./UnwindAssemblyx86Tests/Testx86AssemblyInspectionEngine.TestSubRSP (1281 of 1966) PASS: lldb-api :: tools/lldb-server/register-reading/TestGdbRemoteGPacket.py (1282 of 1966) UNSUPPORTED: lldb-api :: lang/cpp/printf/TestPrintf.py (1283 of 1966) PASS: lldb-shell :: SymbolFile/NativePDB/s_constant.cpp (1284 of 1966) PASS: lldb-unit :: Process/gdb-remote/./ProcessGdbRemoteTests/GDBRemoteCommunicationServerTest.SendErrorResponse_ErrorNumber (1285 of 1966) PASS: lldb-unit :: Host/./HostTests/FileActionTest.Open (1286 of 1966) PASS: lldb-api :: functionalities/tail_call_frames/inlining_and_tail_calls/TestInliningAndTailCalls.py (1287 of 1966) PASS: lldb-unit :: Utility/./UtilityTests/BinaryStreamTest.PutULEB128Zero (1288 of 1966) PASS: lldb-api :: functionalities/multidebugger_commands/TestMultipleDebuggersCommands.py (1289 of 1966) PASS: lldb-api :: functionalities/data-formatter/nssetsynth/TestNSSetSynthetic.py (1290 of 1966) PASS: lldb-api :: macosx/profile_vrs_detach/TestDetachVrsProfile.py (1291 of 1966) PASS: lldb-api :: tools/lldb-server/inferior-crash/TestGdbRemoteSegFault.py (1292 of 1966) PASS: lldb-unit :: Utility/./UtilityTests/AnsiTerminal.WhiteSpace (1293 of 1966) PASS: lldb-unit :: Process/gdb-remote/./ProcessGdbRemoteTests/GDBRemoteCommunicationClientTest.SendStopTracePacket (1294 of 1966) PASS: lldb-api :: commands/expression/radar_8638051/Test8638051.py (1295 of 1966) PASS: lldb-api :: lang/cpp/thread_local/TestThreadLocal.py (1296 of 1966) PASS: lldb-unit :: Utility/./UtilityTests/TimerTest.CategoryTimes (1297 of 1966) PASS: lldb-api :: lang/cpp/bitfields/TestCppBitfields.py (1298 of 1966) PASS: lldb-api :: lang/cpp/call-function/TestCallCPPFunction.py (1299 of 1966) PASS: lldb-api :: tools/lldb-server/TestGdbRemoteExitCode.py (1300 of 1966) PASS: lldb-unit :: Expression/./ExpressionTests/ClangExpressionDeclMapTest.TestUnknownIdentifierLookup (1301 of 1966) PASS: lldb-unit :: UnwindAssembly/x86/./UnwindAssemblyx86Tests/Testx86AssemblyInspectionEngine.TestSpillRegToStackViaMOVx86_64 (1302 of 1966) PASS: lldb-api :: lang/objc/modules-update/TestClangModulesUpdate.py (1303 of 1966) PASS: lldb-api :: commands/expression/deleting-implicit-copy-constructor/TestDeletingImplicitCopyConstructor.py (1304 of 1966) PASS: lldb-unit :: Utility/./UtilityTests/StreamTest.PutHex64ByteOrderBig (1305 of 1966) PASS: lldb-unit :: Core/./LLDBCoreTests/RichManglingContextTest.FromCxxMethodName (1306 of 1966) PASS: lldb-unit :: Process/minidump/./LLDBMinidumpTests/MinidumpParserTest.FindMemoryRange (1307 of 1966) PASS: lldb-api :: lang/c/struct_types/TestStructTypes.py (1308 of 1966) PASS: lldb-unit :: ScriptInterpreter/Python/./ScriptInterpreterPythonTests/PythonDataObjectsTest.TestPythonTupleInitializerList (1309 of 1966) UNSUPPORTED: lldb-shell :: SymbolFile/PDB/pointers.test (1310 of 1966) UNSUPPORTED: lldb-api :: functionalities/thread/thread_specific_break_plus_condition/TestThreadSpecificBpPlusCondition.py (1311 of 1966) PASS: lldb-unit :: Signals/./SignalsTests/UnixSignalsTest.GetInfo (1312 of 1966) UNSUPPORTED: lldb-shell :: Unwind/unwind-plan-dwarf-dump.test (1313 of 1966) PASS: lldb-unit :: Core/./LLDBCoreTests/RichManglingContextTest.Basic (1314 of 1966) PASS: lldb-unit :: Utility/./UtilityTests/StringListTest.ShiftMove (1315 of 1966) PASS: lldb-unit :: SymbolFile/DWARF/./SymbolFileDWARFTests/DWARFASTParserClangTests.EnsureAllDIEsInDeclContextHaveBeenParsedParsesOnlyMatchingEntries (1316 of 1966) PASS: lldb-api :: functionalities/thread/concurrent_events/TestConcurrentTwoWatchpointThreads.py (1317 of 1966) PASS: lldb-unit :: Symbol/./SymbolTests/TestClangASTImporter.MetadataPropagationAfterCopying (1318 of 1966) PASS: lldb-unit :: UnwindAssembly/x86/./UnwindAssemblyx86Tests/Testx86AssemblyInspectionEngine.Test32bitFramelessSmallStackFrame (1319 of 1966) PASS: lldb-unit :: Utility/./UtilityTests/ScalarTest.ComparisonFloat (1320 of 1966) PASS: lldb-shell :: ObjectFile/ELF/short-build-id.yaml (1321 of 1966) PASS: lldb-api :: functionalities/data-formatter/boolreference/TestFormattersBoolRefPtr.py (1322 of 1966) PASS: lldb-unit :: Utility/./UtilityTests/ProcessInstanceInfoMatch.Name (1323 of 1966) PASS: lldb-api :: lang/cpp/namespace/TestNamespace.py (1324 of 1966) PASS: lldb-unit :: Utility/./UtilityTests/ScalarTest.GetBytes (1325 of 1966) PASS: lldb-api :: functionalities/thread/concurrent_events/TestConcurrentTwoWatchpointsOneDelayBreakpoint.py (1326 of 1966) UNSUPPORTED: lldb-shell :: ScriptInterpreter/Lua/nested_sessions.test (1327 of 1966) PASS: lldb-unit :: Expression/./ExpressionTests/CppModuleConfigurationTest.LinuxLocalLibCpp (1328 of 1966) PASS: lldb-api :: commands/expression/import-std-module/unique_ptr/TestUniquePtrFromStdModule.py (1329 of 1966) PASS: lldb-unit :: Utility/./UtilityTests/StreamTest.AddressSuffix (1330 of 1966) PASS: lldb-unit :: Utility/./UtilityTests/LogChannelEnabledTest.LogVerboseThread (1331 of 1966) PASS: lldb-unit :: Utility/./UtilityTests/ArgsTest.TestQuotedTrailingBackslash (1332 of 1966) PASS: lldb-unit :: Target/./TargetTests/ModuleCacheTest.GetAndPut (1333 of 1966) PASS: lldb-unit :: Expression/./ExpressionTests/DiagnosticManagerTest.AppendMessageNoDiag (1334 of 1966) PASS: lldb-api :: lang/cpp/nsimport/TestCppNsImport.py (1335 of 1966) UNSUPPORTED: lldb-api :: functionalities/darwin_log/filter/exact_match/activity-chain/TestDarwinLogFilterMatchActivityChain.py (1336 of 1966) UNSUPPORTED: lldb-shell :: SymbolFile/DWARF/debug-types-expressions.test (1337 of 1966) UNSUPPORTED: lldb-shell :: Register/x86-64-zmm-read.test (1338 of 1966) PASS: lldb-api :: commands/platform/process/list/TestProcessList.py (1339 of 1966) PASS: lldb-shell :: Settings/TestFrameFormatMangling.test (1340 of 1966) UNSUPPORTED: lldb-shell :: SymbolFile/PDB/variables-locations.test (1341 of 1966) PASS: lldb-shell :: ObjectFile/ELF/PT_LOAD-overlap.yaml (1342 of 1966) PASS: lldb-api :: lang/c/modules/TestCModules.py (1343 of 1966) PASS: lldb-unit :: Utility/./UtilityTests/BinaryStreamTest.PutSLEB128FourBytes (1344 of 1966) PASS: lldb-shell :: SymbolFile/NativePDB/function-types-calling-conv.cpp (1345 of 1966) PASS: lldb-shell :: ObjectFile/wasm/stripped-debug-sections.yaml (1346 of 1966) PASS: lldb-unit :: Host/./HostTests/SocketTest.TCPGetAddress (1347 of 1966) PASS: lldb-shell :: Reproducer/TestRelativePath.test (1348 of 1966) PASS: lldb-unit :: Utility/./UtilityTests/UriParserTest.MinimalPortPath (1349 of 1966) PASS: lldb-shell :: ObjectFile/ELF/netbsd-exec-8.99.30-amd64.yaml (1350 of 1966) PASS: lldb-api :: functionalities/gdb_remote_client/TestRecognizeBreakpoint.py (1351 of 1966) PASS: lldb-unit :: Utility/./UtilityTests/OptionsWithRawTest.UnterminatedQuote (1352 of 1966) PASS: lldb-unit :: Target/./TargetTests/MCBasedABI.MapRegisterName (1353 of 1966) PASS: lldb-api :: lang/cpp/multiple-inheritance/TestCppMultipleInheritance.py (1354 of 1966) PASS: lldb-api :: functionalities/data-formatter/data-formatter-stl/libcxx/forward_list/TestDataFormatterLibcxxForwardList.py (1355 of 1966) PASS: lldb-unit :: Symbol/./SymbolTests/TestTypeSystemClang.TestUnifyAccessSpecifiers (1356 of 1966) PASS: lldb-api :: functionalities/breakpoint/breakpoint_locations/TestBreakpointLocations.py (1357 of 1966) PASS: lldb-api :: commands/command/nested_alias/TestNestedAlias.py (1358 of 1966) PASS: lldb-shell :: SymbolFile/NativePDB/function-types-classes.cpp (1359 of 1966) PASS: lldb-unit :: Utility/./UtilityTests/BinaryStreamTest.PutULEB128SixBytes (1360 of 1966) PASS: lldb-api :: commands/frame/recognizer/TestFrameRecognizer.py (1361 of 1966) PASS: lldb-api :: lang/cpp/chained-calls/TestCppChainedCalls.py (1362 of 1966) PASS: lldb-unit :: Language/Highlighting/./HighlighterTests/HighlighterTest.ClangStringLiterals (1363 of 1966) PASS: lldb-unit :: ObjectFile/Breakpad/./ObjectFileBreakpadTests/LineRecord.parse (1364 of 1966) PASS: lldb-api :: commands/frame/diagnose/local-variable/TestLocalVariable.py (1365 of 1966) UNSUPPORTED: lldb-shell :: Register/x86-zmm-read.test (1366 of 1966) PASS: lldb-api :: lang/objc/objc-class-method/TestObjCClassMethod.py (1367 of 1966) PASS: lldb-api :: commands/expression/invalid-args/TestInvalidArgsExpression.py (1368 of 1966) PASS: lldb-unit :: Utility/./UtilityTests/ArchSpecTest.TripleComponentsWereSpecified (1369 of 1966) PASS: lldb-api :: api/check_public_api_headers/TestPublicAPIHeaders.py (1370 of 1966) PASS: lldb-unit :: Utility/./UtilityTests/CompletionRequest.TestCompletionOwnership (1371 of 1966) PASS: lldb-shell :: ObjectFile/ELF/compressed-sections.yaml (1372 of 1966) PASS: lldb-api :: functionalities/data-formatter/data-formatter-stl/libcxx/variant/TestDataFormatterLibcxxVariant.py (1373 of 1966) PASS: lldb-api :: lang/cpp/global_variables/TestCPPGlobalVariables.py (1374 of 1966) UNSUPPORTED: lldb-shell :: SymbolFile/PDB/func-symbols.test (1375 of 1966) UNSUPPORTED: lldb-api :: functionalities/longjmp/TestLongjmp.py (1376 of 1966) PASS: lldb-unit :: Utility/./UtilityTests/RegularExpression.Match (1377 of 1966) PASS: lldb-api :: python_api/sbdata/TestSBData.py (1378 of 1966) PASS: lldb-unit :: Process/minidump/./LLDBMinidumpTests/MinidumpParserTest.GetThreadContext_x86_32_wow64 (1379 of 1966) UNSUPPORTED: lldb-api :: tools/lldb-server/TestGdbRemoteModuleInfo.py (1380 of 1966) UNSUPPORTED: lldb-api :: benchmarks/libcxxmap/TestBenchmarkLibcxxMap.py (1381 of 1966) PASS: lldb-unit :: Utility/./UtilityTests/UriParserTest.BadPort2 (1382 of 1966) PASS: lldb-api :: functionalities/thread/step_until/TestStepUntil.py (1383 of 1966) PASS: lldb-api :: lang/cpp/global_operators/TestCppGlobalOperators.py (1384 of 1966) PASS: lldb-shell :: SymbolFile/DWARF/forward-declarations.s (1385 of 1966) PASS: lldb-unit :: Process/gdb-remote/./ProcessGdbRemoteTests/GDBRemoteCommunicationClientTest.SendGetDataPacket (1386 of 1966) PASS: lldb-unit :: Host/./HostTests/File.GetWaitableHandleFileno (1387 of 1966) PASS: lldb-api :: lang/cpp/frame-var-anon-unions/TestFrameVariableAnonymousUnions.py (1388 of 1966) PASS: lldb-api :: api/command-return-object/TestSBCommandReturnObject.py (1389 of 1966) PASS: lldb-api :: functionalities/thread/concurrent_events/TestConcurrentSignalWatch.py (1390 of 1966) PASS: lldb-shell :: ExecControl/StopHook/stop-hook.test (1391 of 1966) PASS: lldb-unit :: Process/gdb-remote/./ProcessGdbRemoteTests/GDBRemoteCommunicationClientTest.GetModulesInfo (1392 of 1966) PASS: lldb-unit :: Utility/./UtilityTests/DataExtractorTest.GetMaxU64_unchecked (1393 of 1966) PASS: lldb-unit :: Utility/./UtilityTests/AnsiTerminal.KnownPrefix (1394 of 1966) PASS: lldb-unit :: ScriptInterpreter/Python/./ScriptInterpreterPythonTests/PythonDataObjectsTest.TestPythonStringToStructuredString (1395 of 1966) PASS: lldb-shell :: Reproducer/Functionalities/TestStepping.test (1396 of 1966) PASS: lldb-unit :: Host/./HostTests/NativeProcessProtocolTest.SetBreakpointFailRead (1397 of 1966) PASS: lldb-unit :: Utility/./UtilityTests/ScalarTest.CastOperations (1398 of 1966) PASS: lldb-unit :: UnwindAssembly/x86/./UnwindAssemblyx86Tests/Testx86AssemblyInspectionEngine.TestPushEBX (1399 of 1966) PASS: lldb-shell :: SymbolFile/Breakpad/line-table.test (1400 of 1966) PASS: lldb-api :: functionalities/data-formatter/nsarraysynth/TestNSArraySynthetic.py (1401 of 1966) PASS: lldb-unit :: UnwindAssembly/x86/./UnwindAssemblyx86Tests/Testx86AssemblyInspectionEngine.TestPushEDI (1402 of 1966) PASS: lldb-api :: commands/expression/rdar42038760/TestScalarURem.py (1403 of 1966) PASS: lldb-unit :: SymbolFile/DWARF/./SymbolFileDWARFTests/SymbolFileDWARFTests.TestAbbrevOutOfOrder (1404 of 1966) PASS: lldb-api :: functionalities/data-formatter/var-in-aggregate-misuse/TestVarInAggregateMisuse.py (1405 of 1966) PASS: lldb-unit :: Language/Highlighting/./HighlighterTests/HighlighterTest.ClangTrailingBackslashMissingNewLine (1406 of 1966) PASS: lldb-unit :: Utility/./UtilityTests/StatusTest.ErrorConversion (1407 of 1966) PASS: lldb-api :: commands/expression/import-std-module/vector-dbg-info-content/TestDbgInfoContentVectorFromStdModule.py (1408 of 1966) PASS: lldb-unit :: Utility/./UtilityTests/StreamTest.PutRawBytesToBigEndian (1409 of 1966) PASS: lldb-unit :: Utility/./UtilityTests/SerializationRountripTest.SerializeDeserializeCStringArrayNullptr (1410 of 1966) PASS: lldb-shell :: Reproducer/TestDump.test (1411 of 1966) PASS: lldb-unit :: Utility/./UtilityTests/SerializationRountripTest.SerializeDeserializeCStringNull (1412 of 1966) PASS: lldb-unit :: Utility/./UtilityTests/StringListTest.InsertStringAtIndexEnd (1413 of 1966) UNSUPPORTED: lldb-api :: functionalities/thread/state/TestThreadStates.py (1414 of 1966) PASS: lldb-unit :: Utility/./UtilityTests/SerializationRountripTest.SerializeDeserializePod (1415 of 1966) PASS: lldb-shell :: ObjectFile/wasm/unified-debug-sections.yaml (1416 of 1966) PASS: lldb-unit :: Utility/./UtilityTests/ArchSpecTest.OperatorBool (1417 of 1966) PASS: lldb-api :: tools/lldb-server/TestGdbRemote_vCont.py (1418 of 1966) PASS: lldb-api :: commands/help/TestHelp.py (1419 of 1966) PASS: lldb-shell :: SymbolFile/DWARF/debug_ranges_and_rnglists.test (1420 of 1966) PASS: lldb-unit :: UnwindAssembly/x86/./UnwindAssemblyx86Tests/Testx86AssemblyInspectionEngine.TestPushRBPWithREX (1421 of 1966) PASS: lldb-unit :: Symbol/./SymbolTests/TestTypeSystemClang.TestRemoveFastQualifiers (1422 of 1966) XFAIL: lldb-shell :: Register/x86-64-write.test (1423 of 1966) PASS: lldb-api :: functionalities/data-formatter/summary-string-onfail/Test-rdar-9974002.py (1424 of 1966) PASS: lldb-unit :: Utility/./UtilityTests/RangeTest.Copy (1425 of 1966) UNSUPPORTED: lldb-api :: commands/watchpoints/variable_out_of_scope/TestWatchedVarHitWhenInScope.py (1426 of 1966) UNSUPPORTED: lldb-shell :: SymbolFile/PDB/class-layout.test (1427 of 1966) PASS: lldb-api :: sample_test/TestSampleInlineTest.py (1428 of 1966) PASS: lldb-unit :: Utility/./UtilityTests/RangeTest.SizeTypes (1429 of 1966) PASS: lldb-api :: commands/expression/context-object-objc/TestContextObjectObjc.py (1430 of 1966) PASS: lldb-unit :: Process/minidump/./LLDBMinidumpTests/MinidumpParserTest.GetExceptionStream (1431 of 1966) PASS: lldb-unit :: Symbol/./SymbolTests/TestClangASTImporter.ImportInvalidType (1432 of 1966) PASS: lldb-unit :: Language/Highlighting/./HighlighterTests/HighlighterTest.ClangPPDirectives (1433 of 1966) PASS: lldb-api :: lang/objc/modules-hash-mismatch/TestClangModulesHashMismatch.py (1434 of 1966) PASS: lldb-unit :: Utility/./UtilityTests/UserIDResolver.GetUserName (1435 of 1966) PASS: lldb-api :: lang/objc/objc-new-syntax/TestObjCNewSyntaxDictionary.py (1436 of 1966) PASS: lldb-unit :: Utility/./UtilityTests/ArchSpecTest.MergeFromMachOUnknown (1437 of 1966) PASS: lldb-unit :: Utility/./UtilityTests/ArgsTest.StringListConstructor (1438 of 1966) PASS: lldb-unit :: Symbol/./SymbolTests/TestTypeSystemClang.TestGetEnumIntegerTypeBasicTypes (1439 of 1966) PASS: lldb-api :: commands/expression/save_jit_objects/TestSaveJITObjects.py (1440 of 1966) PASS: lldb-unit :: Expression/./ExpressionTests/CppModuleConfigurationTest.LibCppV2 (1441 of 1966) PASS: lldb-unit :: Utility/./UtilityTests/SubsystemRAIITest.SubsystemWithErrorSuccess (1442 of 1966) PASS: lldb-api :: commands/expression/diagnostics/TestExprDiagnostics.py (1443 of 1966) PASS: lldb-api :: functionalities/data-formatter/data-formatter-objc/TestDataFormatterObjCNSContainer.py (1444 of 1966) PASS: lldb-unit :: Utility/./UtilityTests/FileSpecTest.GuessPathStyle (1445 of 1966) PASS: lldb-api :: functionalities/rerun/TestRerun.py (1446 of 1966) PASS: lldb-unit :: Utility/./UtilityTests/StringExtractorTest.GetHexBytesAvail (1447 of 1966) PASS: lldb-api :: types/TestDoubleTypes.py (1448 of 1966) PASS: lldb-unit :: Utility/./UtilityTests/StreamTest.AddressNoSuffix (1449 of 1966) PASS: lldb-unit :: Utility/./UtilityTests/StringListTest.JoinSingle (1450 of 1966) PASS: lldb-api :: lang/objc/foundation/TestObjCMethods.py (1451 of 1966) PASS: lldb-unit :: Language/Highlighting/./HighlighterTests/HighlighterTest.ClangSquareBrackets (1452 of 1966) UNSUPPORTED: lldb-api :: iohandler/unicode/TestUnicode.py (1453 of 1966) PASS: lldb-api :: commands/gui/invalid-args/TestInvalidArgsGui.py (1454 of 1966) PASS: lldb-unit :: Symbol/./SymbolTests/PostfixExpression.ParseOneExpression (1455 of 1966) PASS: lldb-unit :: Process/gdb-remote/./ProcessGdbRemoteTests/GDBRemoteCommunicationClientTest.SyncThreadState (1456 of 1966) PASS: lldb-api :: commands/target/basic/TestTargetCommand.py (1457 of 1966) PASS: lldb-api :: lang/cpp/namespace_definitions/TestNamespaceDefinitions.py (1458 of 1966) PASS: lldb-unit :: Utility/./UtilityTests/IndexToObjectTest.ObjectForIndex (1459 of 1966) PASS: lldb-unit :: Symbol/./SymbolTests/TestTypeSystemClang.TestGetTypeClassTypeOf (1460 of 1966) PASS: lldb-unit :: Process/minidump/./LLDBMinidumpTests/MinidumpParserTest.GetMemoryRegionInfoFromMemory64List (1461 of 1966) PASS: lldb-api :: functionalities/data-formatter/array_typedef/TestArrayTypedef.py (1462 of 1966) PASS: lldb-unit :: Host/./HostTests/FileSystemTest.FileAndDirectoryComponents (1463 of 1966) PASS: lldb-unit :: Utility/./UtilityTests/StreamTest.AddressRangeSize (1464 of 1966) PASS: lldb-api :: functionalities/lazy-loading/TestLazyLoading.py (1465 of 1966) PASS: lldb-api :: commands/command/delete/TestCommandDelete.py (1466 of 1966) PASS: lldb-api :: commands/register/register/register_command/TestRegisters.py (1467 of 1966) PASS: lldb-unit :: UnwindAssembly/x86/./UnwindAssemblyx86Tests/Testx86AssemblyInspectionEngine.TestPopR14 (1468 of 1966) PASS: lldb-unit :: Process/minidump/./LLDBMinidumpTests/MinidumpParserTest.GetMiscInfoWindows (1469 of 1966) PASS: lldb-api :: functionalities/postmortem/minidump/TestMiniDump.py (1470 of 1966) PASS: lldb-unit :: Expression/./ExpressionTests/CppModuleConfigurationTest.Linux (1471 of 1966) PASS: lldb-api :: functionalities/breakpoint/require_hw_breakpoints/TestRequireHWBreakpoints.py (1472 of 1966) PASS: lldb-api :: commands/expression/po_verbosity/TestPoVerbosity.py (1473 of 1966) PASS: lldb-shell :: Minidump/dump-all.test (1474 of 1966) PASS: lldb-api :: functionalities/data-formatter/data-formatter-stl/libcxx/string/TestDataFormatterLibcxxString.py (1475 of 1966) PASS: lldb-unit :: ScriptInterpreter/Python/./ScriptInterpreterPythonTests/PythonDataObjectsTest.TestPythonIntegerToStr (1476 of 1966) PASS: lldb-unit :: Language/CPlusPlus/./LanguageCPlusPlusTests/CPlusPlusLanguage.FindAlternateFunctionManglings (1477 of 1966) PASS: lldb-unit :: UnwindAssembly/x86/./UnwindAssemblyx86Tests/Testx86AssemblyInspectionEngine.TestPushR14 (1478 of 1966) PASS: lldb-unit :: Utility/./UtilityTests/StringListTest.Join (1479 of 1966) PASS: lldb-api :: functionalities/data-formatter/refpointer-recursion/TestDataFormatterRefPtrRecursion.py (1480 of 1966) PASS: lldb-api :: python_api/frame/inlines/TestInlinedFrame.py (1481 of 1966) PASS: lldb-unit :: Utility/./UtilityTests/StringLexerTest.GetUnlexed (1482 of 1966) PASS: lldb-shell :: SymbolFile/DWARF/find-variable-file.cpp (1483 of 1966) PASS: lldb-api :: python_api/process/TestProcessAPI.py (1484 of 1966) PASS: lldb-api :: functionalities/reproducers/attach/TestReproducerAttach.py (1485 of 1966) PASS: lldb-unit :: Utility/./UtilityTests/BinaryStreamTest.PutULEB128FiveBytes (1486 of 1966) PASS: lldb-api :: functionalities/data-formatter/data-formatter-objc/cmtime/TestDataFormatterCMTime.py (1487 of 1966) PASS: lldb-unit :: Symbol/./SymbolTests/TestTypeSystemClang.TestGetTypeClassDeclType (1488 of 1966) PASS: lldb-unit :: Utility/./UtilityTests/BinaryStreamTest.PutSLEB128SixBytes (1489 of 1966) PASS: lldb-unit :: Utility/./UtilityTests/StringExtractorTest.InitEmpty (1490 of 1966) PASS: lldb-unit :: Host/./HostTests/FileSystemTest.GetPermissions (1491 of 1966) PASS: lldb-shell :: Reproducer/TestVersionCheck.test (1492 of 1966) PASS: lldb-api :: commands/expression/import-std-module/sysroot/TestStdModuleSysroot.py (1493 of 1966) UNSUPPORTED: lldb-api :: linux/thread/create_during_instruction_step/TestCreateDuringInstructionStep.py (1494 of 1966) PASS: lldb-api :: python_api/watchpoint/TestWatchpointIgnoreCount.py (1495 of 1966) PASS: lldb-shell :: Settings/TestStopCommandSourceOnError.test (1496 of 1966) UNSUPPORTED: lldb-api :: benchmarks/stepping/TestSteppingSpeed.py (1497 of 1966) PASS: lldb-unit :: Utility/./UtilityTests/Flags.IsClear (1498 of 1966) PASS: lldb-api :: lang/cpp/overloaded-functions/TestOverloadedFunctions.py (1499 of 1966) PASS: lldb-shell :: Breakpoint/single-file-split-dwarf.test (1500 of 1966) PASS: lldb-unit :: ScriptInterpreter/Python/./ScriptInterpreterPythonTests/PythonDataObjectsTest.TestObjectAttributes (1501 of 1966) PASS: lldb-unit :: Utility/./UtilityTests/LogTest.Register (1502 of 1966) PASS: lldb-api :: python_api/type/TestTypeList.py (1503 of 1966) PASS: lldb-api :: commands/expression/inline-namespace/TestInlineNamespace.py (1504 of 1966) UNSUPPORTED: lldb-api :: arm/breakpoint-thumb-codesection/TestBreakpointThumbCodesection.py (1505 of 1966) PASS: lldb-api :: lang/c/enum_types/TestEnumTypes.py (1506 of 1966) PASS: lldb-api :: functionalities/data-formatter/frameformat_smallstruct/TestFrameFormatSmallStruct.py (1507 of 1966) PASS: lldb-unit :: Host/./HostTests/File.GetStreamFromDescriptor (1508 of 1966) PASS: lldb-shell :: SymbolFile/DWARF/dir-separator-no-comp-dir-relative-name.s (1509 of 1966) PASS: lldb-unit :: Process/minidump/./LLDBMinidumpTests/MinidumpParserTest.GetPid (1510 of 1966) UNSUPPORTED: lldb-shell :: Breakpoint/case-insensitive.test (1511 of 1966) PASS: lldb-api :: lang/cpp/virtual-overload/TestVirtualOverload.py (1512 of 1966) PASS: lldb-api :: lang/cpp/wchar_t/TestCxxWCharT.py (1513 of 1966) PASS: lldb-api :: functionalities/gdb_remote_client/TestGDBRemoteLoad.py (1514 of 1966) PASS: lldb-api :: functionalities/process_group/TestChangeProcessGroup.py (1515 of 1966) UNSUPPORTED: lldb-api :: tools/lldb-server/signal-filtering/TestGdbRemote_QPassSignals.py (1516 of 1966) UNSUPPORTED: lldb-api :: functionalities/data-formatter/data-formatter-stl/libstdcpp/map/TestDataFormatterStdMap.py (1517 of 1966) PASS: lldb-api :: functionalities/thread/concurrent_events/TestConcurrentTwoWatchpointsOneSignal.py (1518 of 1966) PASS: lldb-unit :: Symbol/./SymbolTests/Type.CompilerContextPattern (1519 of 1966) UNSUPPORTED: lldb-shell :: ScriptInterpreter/Lua/lua.test (1520 of 1966) PASS: lldb-unit :: Symbol/./SymbolTests/Type.GetTypeScopeAndBasename (1521 of 1966) PASS: lldb-shell :: Breakpoint/split-dwarf-5-addrbase.test (1522 of 1966) UNSUPPORTED: lldb-shell :: Register/aarch64-fp-read.test (1523 of 1966) PASS: lldb-unit :: Utility/./UtilityTests/StreamTest.PutNHex8 (1524 of 1966) PASS: lldb-unit :: UnwindAssembly/x86/./UnwindAssemblyx86Tests/Testx86AssemblyInspectionEngine.TestPushEBP (1525 of 1966) PASS: lldb-shell :: ObjectFile/ELF/section-types-edgecases.yaml (1526 of 1966) PASS: lldb-unit :: UnwindAssembly/x86/./UnwindAssemblyx86Tests/Testx86AssemblyInspectionEngine.TestSimple64bitFrameFunction (1527 of 1966) PASS: lldb-unit :: Utility/./UtilityTests/StreamTeeTest.Write (1528 of 1966) PASS: lldb-api :: functionalities/breakpoint/objc/TestObjCBreakpoints.py (1529 of 1966) PASS: lldb-unit :: Utility/./UtilityTests/TimeoutTest.Construction (1530 of 1966) UNSUPPORTED: lldb-api :: functionalities/breakpoint/breakpoint_callback_command_source/TestBreakpointCallbackCommandSource.py (1531 of 1966) PASS: lldb-shell :: BuildScript/script-args.test (1532 of 1966) PASS: lldb-shell :: Breakpoint/debug_rnglistx_rlex.test (1533 of 1966) PASS: lldb-shell :: ObjectFile/PECOFF/symbol.yaml (1534 of 1966) PASS: lldb-unit :: Utility/./UtilityTests/RangeTest.ContainsEndInclusiveInvalid (1535 of 1966) PASS: lldb-unit :: ObjectFile/Breakpad/./ObjectFileBreakpadTests/Record.classify (1536 of 1966) PASS: lldb-api :: commands/expression/dont_allow_jit/TestAllowJIT.py (1537 of 1966) PASS: lldb-api :: functionalities/fat_archives/TestFatArchives.py (1538 of 1966) PASS: lldb-api :: lang/objcxx/cxx-bridged-po/TestObjCXXBridgedPO.py (1539 of 1966) PASS: lldb-api :: commands/reproducer/invalid-args/TestInvalidArgsReproducer.py (1540 of 1966) PASS: lldb-api :: python_api/interpreter/TestRunCommandInterpreterAPI.py (1541 of 1966) PASS: lldb-shell :: ObjectFile/PECOFF/sections.yaml (1542 of 1966) PASS: lldb-unit :: Utility/./UtilityTests/BinaryStreamTest.PutSLEB128One (1543 of 1966) PASS: lldb-unit :: Utility/./UtilityTests/StringListTest.GetMaxStringLengthMixed (1544 of 1966) PASS: lldb-unit :: Utility/./UtilityTests/StringExtractorTest.GetHexBytesAvail_Partial (1545 of 1966) PASS: lldb-shell :: Commands/CommandScriptImmediateOutput/CommandScriptImmediateOutputFile.test (1546 of 1966) PASS: lldb-api :: lang/cpp/this/TestCPPThis.py (1547 of 1966) PASS: lldb-shell :: Quit/TestQuitExitCode30.test (1548 of 1966) PASS: lldb-shell :: SymbolFile/DWARF/debug_loc_and_loclists.s (1549 of 1966) PASS: lldb-api :: lang/cpp/char8_t/TestCxxChar8_t.py (1550 of 1966) PASS: lldb-api :: functionalities/data-formatter/data-formatter-objc/TestDataFormatterObjCNSError.py (1551 of 1966) PASS: lldb-unit :: Utility/./UtilityTests/FileSpecTest.RemoveLastPathComponent (1552 of 1966) PASS: lldb-unit :: Utility/./UtilityTests/RangeTest.Equal (1553 of 1966) PASS: lldb-unit :: Expression/./ExpressionTests/ClangHostTest.MacOSX (1554 of 1966) PASS: lldb-api :: commands/watchpoints/watchpoint_set_command/TestWatchLocationWithWatchSet.py (1555 of 1966) UNSUPPORTED: lldb-api :: functionalities/tsan/basic/TestTsanBasic.py (1556 of 1966) UNSUPPORTED: lldb-shell :: SymbolFile/PDB/ast-restore.test (1557 of 1966) PASS: lldb-unit :: Utility/./UtilityTests/StringExtractorTest.GetHexBytes_FullString (1558 of 1966) PASS: lldb-unit :: Utility/./UtilityTests/SerializationRountripTest.SerializeDeserializeObjectReference (1559 of 1966) PASS: lldb-unit :: Utility/./UtilityTests/TimerTest.CategoryTimesStats (1560 of 1966) PASS: lldb-unit :: Utility/./UtilityTests/ConstStringTest.FromMidOfBufferStringRef (1561 of 1966) PASS: lldb-unit :: Utility/./UtilityTests/StringExtractorTest.InitMisc (1562 of 1966) PASS: lldb-api :: commands/expression/cast_int_to_anonymous_enum/TestCastIntToAnonymousEnum.py (1563 of 1966) PASS: lldb-api :: functionalities/data-formatter/data-formatter-stl/libcxx/iterator/TestDataFormatterLibccIterator.py (1564 of 1966) UNSUPPORTED: lldb-api :: functionalities/thread/multi_break/TestMultipleBreakpoints.py (1565 of 1966) PASS: lldb-shell :: SymbolFile/DWARF/debug_loc-aslr.s (1566 of 1966) PASS: lldb-unit :: ScriptInterpreter/Python/./ScriptInterpreterPythonTests/PythonDataObjectsTest.TestPythonTupleToStructuredList (1567 of 1966) PASS: lldb-shell :: Reproducer/Functionalities/TestDataFormatter.test (1568 of 1966) PASS: lldb-api :: functionalities/thread/concurrent_events/TestConcurrentWatchBreakDelay.py (1569 of 1966) PASS: lldb-unit :: Expression/./ExpressionTests/DiagnosticManagerTest.GetStringMultiline (1570 of 1966) PASS: lldb-shell :: Breakpoint/jitbp_elf.test (1571 of 1966) PASS: lldb-unit :: Utility/./UtilityTests/FileSpecTest.EqualDotsPosix (1572 of 1966) PASS: lldb-unit :: Utility/./UtilityTests/ArgsTest.TestAppendArg (1573 of 1966) PASS: lldb-unit :: Language/Highlighting/./HighlighterTests/HighlighterTest.ClangCursorPos (1574 of 1966) PASS: lldb-api :: driver/batch_mode/TestBatchMode.py (1575 of 1966) PASS: lldb-shell :: SymbolFile/DWARF/DW_OP_piece-struct.s (1576 of 1966) PASS: lldb-unit :: ScriptInterpreter/Python/./ScriptInterpreterPythonTests/PythonDataObjectsTest.TestExceptions (1577 of 1966) PASS: lldb-api :: commands/expression/import-std-module/list/TestListFromStdModule.py (1578 of 1966) PASS: lldb-unit :: Utility/./UtilityTests/StringListTest.GetMaxStringLengthEmpty (1579 of 1966) UNSUPPORTED: lldb-api :: functionalities/darwin_log/source/info/TestDarwinLogSourceInfo.py (1580 of 1966) PASS: lldb-api :: lang/objc/direct-dispatch-step/TestObjCDirectDispatchStepping.py (1581 of 1966) PASS: lldb-api :: lang/objc/objc-builtin-types/TestObjCBuiltinTypes.py (1582 of 1966) PASS: lldb-api :: functionalities/show_location/TestShowLocationDwarf5.py (1583 of 1966) PASS: lldb-shell :: SymbolFile/DWARF/clang-ast-from-dwarf-objc-property.m (1584 of 1966) PASS: lldb-unit :: Host/./HostTests/ConnectionFileDescriptorTest.TCPGetURIv4 (1585 of 1966) PASS: lldb-unit :: Utility/./UtilityTests/StreamTest.PutCharWhitespace (1586 of 1966) PASS: lldb-api :: lang/objc/objc-static-method/TestObjCStaticMethod.py (1587 of 1966) PASS: lldb-unit :: UnwindAssembly/x86/./UnwindAssemblyx86Tests/Testx86AssemblyInspectionEngine.TestPushESI (1588 of 1966) PASS: lldb-unit :: Utility/./UtilityTests/VMRange.ContainsAddr (1589 of 1966) PASS: lldb-api :: macosx/lc-note/kern-ver-str/TestKernVerStrLCNOTE.py (1590 of 1966) PASS: lldb-unit :: Signals/./SignalsTests/UnixSignalsTest.Iteration (1591 of 1966) PASS: lldb-unit :: Utility/./UtilityTests/RangeTest.NotEqual (1592 of 1966) PASS: lldb-unit :: Core/./LLDBCoreTests/MangledTest.ResultForValidName (1593 of 1966) PASS: lldb-unit :: Utility/./UtilityTests/BinaryStreamTest.PutSLEB128OneByte (1594 of 1966) PASS: lldb-unit :: Utility/./UtilityTests/StreamTest.ChangingByteOrder (1595 of 1966) PASS: lldb-unit :: Host/./HostTests/MainLoopTest.ReadObject (1596 of 1966) PASS: lldb-api :: lang/objc/objc-super/TestObjCSuper.py (1597 of 1966) PASS: lldb-api :: functionalities/breakpoint/inlined_breakpoints/TestInlinedBreakpoints.py (1598 of 1966) PASS: lldb-api :: functionalities/thread/thread_specific_break/TestThreadSpecificBreakpoint.py (1599 of 1966) PASS: lldb-unit :: Interpreter/./InterpreterTests/OptionArgParserTest.toScriptLanguage (1600 of 1966) PASS: lldb-unit :: Editline/./EditlineTests/EditlineTestFixture.EditlineReceivesSingleLineText (1601 of 1966) PASS: lldb-unit :: ObjectFile/ELF/./ObjectFileELFTests/ObjectFileELFTest.GetSymtab_NoSymEntryPointArmAddressClass (1602 of 1966) PASS: lldb-api :: types/TestIntegerTypeExpr.py (1603 of 1966) PASS: lldb-api :: python_api/sbvalue_const_addrof/TestSBValueConstAddrOf.py (1604 of 1966) PASS: lldb-unit :: Utility/./UtilityTests/StreamTest.PutBytesAsRawHex8ToMixedEndian (1605 of 1966) PASS: lldb-unit :: Utility/./UtilityTests/StreamTest.PutCharNull (1606 of 1966) PASS: lldb-api :: commands/target/stop-hooks/TestStopHooks.py (1607 of 1966) PASS: lldb-unit :: UnwindAssembly/x86/./UnwindAssemblyx86Tests/Testx86AssemblyInspectionEngine.TestSimplex86_64Augmented (1608 of 1966) PASS: lldb-api :: functionalities/data-formatter/parray/TestPrintArray.py (1609 of 1966) PASS: lldb-api :: lang/objc/hidden-ivars/TestHiddenIvars.py (1610 of 1966) PASS: lldb-api :: functionalities/memory/cache/TestMemoryCache.py (1611 of 1966) PASS: lldb-unit :: Utility/./UtilityTests/UriParserTest.BadPort (1612 of 1966) UNSUPPORTED: lldb-api :: functionalities/darwin_log/filter/exact_match/activity/TestDarwinLogFilterMatchActivity.py (1613 of 1966) PASS: lldb-shell :: Commands/command-source.test (1614 of 1966) PASS: lldb-api :: commands/frame/diagnose/dereference-this/TestDiagnoseDereferenceThis.py (1615 of 1966) PASS: lldb-unit :: Symbol/./SymbolTests/TestClangASTImporter.MetadataPropagation (1616 of 1966) PASS: lldb-unit :: Utility/./UtilityTests/BinaryStreamTest.PutULEB128ThreeBytes (1617 of 1966) PASS: lldb-shell :: ObjectFile/Breakpad/uuid-matching-mac.test (1618 of 1966) PASS: lldb-unit :: Utility/./UtilityTests/StreamTest.PutBytesAsRawHex8ToLittleEndian (1619 of 1966) PASS: lldb-api :: commands/expression/weak_symbols/TestWeakSymbols.py (1620 of 1966) PASS: lldb-unit :: Expression/./ExpressionTests/DiagnosticManagerTest.FixedExpression (1621 of 1966) PASS: lldb-unit :: Process/minidump/./LLDBMinidumpTests/MinidumpParserTest.GetLinuxProcStatus (1622 of 1966) UNSUPPORTED: lldb-api :: functionalities/tsan/multiple/TestTsanMultiple.py (1623 of 1966) PASS: lldb-unit :: Utility/./UtilityTests/ProcessInstanceInfo.DumpTable_invalidUID (1624 of 1966) PASS: lldb-unit :: Utility/./UtilityTests/DataExtractorTest.GetCStr (1625 of 1966) PASS: lldb-api :: lang/cpp/trivial_abi/TestTrivialABI.py (1626 of 1966) PASS: lldb-shell :: Commands/command-disassemble.s (1627 of 1966) PASS: lldb-api :: python_api/lldbutil/iter/TestLLDBIterator.py (1628 of 1966) PASS: lldb-unit :: Utility/./UtilityTests/StringListTest.GetMaxStringLengthDecreasingSize (1629 of 1966) PASS: lldb-api :: api/listeners/TestListener.py (1630 of 1966) PASS: lldb-shell :: SymbolFile/Breakpad/unwind-via-stack-cfi.test (1631 of 1966) PASS: lldb-api :: commands/expression/entry-bp/TestExprEntryBP.py (1632 of 1966) PASS: lldb-unit :: Language/Highlighting/./HighlighterTests/HighlighterTest.ClangTrailingBackslashBeforeNewline (1633 of 1966) PASS: lldb-api :: functionalities/var_path/TestVarPath.py (1634 of 1966) PASS: lldb-unit :: Language/CPlusPlus/./LanguageCPlusPlusTests/CPlusPlusLanguage.MethodNameParsing (1635 of 1966) PASS: lldb-unit :: Utility/./UtilityTests/StreamTeeTest.DefaultConstructor (1636 of 1966) PASS: lldb-shell :: SymbolFile/NativePDB/nested-types.cpp (1637 of 1966) PASS: lldb-shell :: SymbolFile/NativePDB/ast-functions.cpp (1638 of 1966) PASS: lldb-api :: lang/objc/objc-foundation-dictionary-empty/TestNSDictionary0.py (1639 of 1966) PASS: lldb-unit :: Utility/./UtilityTests/BinaryStreamTest.PutULEB128EightBytes (1640 of 1966) PASS: lldb-unit :: Host/./HostTests/MainLoopTest.TerminatesImmediately (1641 of 1966) PASS: lldb-api :: functionalities/gdb_remote_client/TestRegDefinitionInParts.py (1642 of 1966) PASS: lldb-unit :: UnwindAssembly/x86/./UnwindAssemblyx86Tests/Testx86AssemblyInspectionEngine.TestStackRealign32BitDisp_x86_64 (1643 of 1966) PASS: lldb-shell :: ObjectFile/ELF/PT_LOAD-overlap-section.yaml (1644 of 1966) PASS: lldb-unit :: Utility/./UtilityTests/OptionsWithRawTest.EmptyArgsOnlySuffix (1645 of 1966) PASS: lldb-unit :: Utility/./UtilityTests/UriParserTest.BracketedHostname (1646 of 1966) PASS: lldb-unit :: UnwindAssembly/x86/./UnwindAssemblyx86Tests/Testx86AssemblyInspectionEngine.TestPushR15 (1647 of 1966) PASS: lldb-api :: commands/expression/options/TestExprOptions.py (1648 of 1966) PASS: lldb-api :: functionalities/data-formatter/data-formatter-stl/libstdcpp/unique_ptr/invalid/TestDataFormatterInvalidStdUniquePtr.py (1649 of 1966) PASS: lldb-shell :: Quit/TestQuitExitCodeTooManyArgs.test (1650 of 1966) PASS: lldb-api :: functionalities/data-formatter/data-formatter-stl/libcxx/queue/TestDataFormatterLibcxxQueue.py (1651 of 1966) PASS: lldb-api :: commands/expression/import-std-module/shared_ptr-dbg-info-content/TestSharedPtrDbgInfoContentFromStdModule.py (1652 of 1966) UNSUPPORTED: lldb-shell :: Unwind/eh-frame-small-fde.test (1653 of 1966) PASS: lldb-shell :: Minidump/Windows/Sigsegv/sigsegv.test (1654 of 1966) PASS: lldb-unit :: Utility/./UtilityTests/StringLexerTest.Next (1655 of 1966) PASS: lldb-unit :: Utility/./UtilityTests/StringExtractorTest.GetHexBytesAvail_OddPair (1656 of 1966) PASS: lldb-api :: functionalities/thread/concurrent_events/TestConcurrentManyBreakpoints.py (1657 of 1966) PASS: lldb-api :: functionalities/data-formatter/data-formatter-categories/TestDataFormatterCategories.py (1658 of 1966) PASS: lldb-api :: lang/cpp/gmodules-templates/TestGModules.py (1659 of 1966) PASS: lldb-unit :: Utility/./UtilityTests/NameMatchesTest.RegularExpression (1660 of 1966) PASS: lldb-shell :: ObjectFile/ELF/PT_TLS-overlap-PT_LOAD.yaml (1661 of 1966) PASS: lldb-api :: commands/expression/import-std-module/forward_list-dbg-info-content/TestDbgInfoContentForwardListFromStdModule.py (1662 of 1966) PASS: lldb-api :: functionalities/data-formatter/data-formatter-stl/libcxx/vector/TestDataFormatterLibcxxVector.py (1663 of 1966) PASS: lldb-shell :: Unwind/trap_frame_sym_ctx.test (1664 of 1966) PASS: lldb-api :: commands/watchpoints/watchpoint_commands/TestWatchpointCommands.py (1665 of 1966) PASS: lldb-unit :: Utility/./UtilityTests/StringLexerTest.NextIfList (1666 of 1966) PASS: lldb-api :: functionalities/gdb_remote_client/TestWriteMemory.py (1667 of 1966) PASS: lldb-api :: functionalities/thread/concurrent_events/TestConcurrentBreakpointDelayBreakpointOneSignal.py (1668 of 1966) PASS: lldb-unit :: Utility/./UtilityTests/StreamTeeTest.AppendStream (1669 of 1966) PASS: lldb-unit :: Utility/./UtilityTests/NameMatchesTest.StartsWith (1670 of 1966) PASS: lldb-unit :: Expression/./ExpressionTests/ClangHostTest.ComputeClangResourceDirectory (1671 of 1966) PASS: lldb-api :: tools/lldb-server/commandline/TestStubSetSID.py (1672 of 1966) UNSUPPORTED: lldb-shell :: ObjectFile/ELF/minidebuginfo-no-lzma.yaml (1673 of 1966) UNSUPPORTED: lldb-api :: benchmarks/turnaround/TestCompileRunToBreakpointTurnaround.py (1674 of 1966) PASS: lldb-api :: lang/mixed/TestMixedLanguages.py (1675 of 1966) PASS: lldb-api :: functionalities/data-formatter/data-formatter-stl/libcxx/multimap/TestDataFormatterLibccMultiMap.py (1676 of 1966) PASS: lldb-api :: functionalities/return-value/TestReturnValue.py (1677 of 1966) PASS: lldb-api :: python_api/sbstructureddata/TestStructuredDataAPI.py (1678 of 1966) PASS: lldb-api :: functionalities/data-formatter/data-formatter-caching/TestDataFormatterCaching.py (1679 of 1966) PASS: lldb-unit :: SymbolFile/NativePDB/./SymbolFileNativePDBTests/PDBFPOProgramToDWARFExpressionTests.UnsupportedRASearch (1680 of 1966) PASS: lldb-shell :: Host/TestCustomShell.test (1681 of 1966) PASS: lldb-unit :: ScriptInterpreter/Python/./ScriptInterpreterPythonTests/PythonDataObjectsTest.TestPythonDictionaryValueEquality (1682 of 1966) PASS: lldb-api :: functionalities/thread/concurrent_events/TestConcurrentSignalDelayWatch.py (1683 of 1966) UNSUPPORTED: lldb-api :: functionalities/tsan/global_location/TestTsanGlobalLocation.py (1684 of 1966) PASS: lldb-api :: lang/cpp/member-and-local-vars-with-same-name/TestMembersAndLocalsWithSameName.py (1685 of 1966) PASS: lldb-api :: lang/cpp/scope/TestCppScope.py (1686 of 1966) PASS: lldb-unit :: Core/./LLDBCoreTests/MangledTest.EmptyForInvalidName (1687 of 1966) UNSUPPORTED: lldb-shell :: Register/arm-gp-read.test (1688 of 1966) PASS: lldb-api :: commands/disassemble/basic/TestDisassembleBreakpoint.py (1689 of 1966) PASS: lldb-unit :: ScriptInterpreter/Python/./ScriptInterpreterPythonTests/PythonDataObjectsTest.TestPythonFile (1690 of 1966) PASS: lldb-api :: functionalities/thread/backtrace_all/TestBacktraceAll.py (1691 of 1966) PASS: lldb-unit :: Utility/./UtilityTests/StreamTest.PutSLEB128 (1692 of 1966) PASS: lldb-shell :: Register/x86-64-gp-read.test (1693 of 1966) UNSUPPORTED: lldb-api :: commands/watchpoints/hello_watchlocation/TestWatchLocation.py (1694 of 1966) PASS: lldb-api :: commands/platform/basic/TestPlatformCommand.py (1695 of 1966) PASS: lldb-unit :: ObjectFile/Breakpad/./ObjectFileBreakpadTests/InfoRecord.parse (1696 of 1966) PASS: lldb-unit :: Utility/./UtilityTests/StringExtractorTest.GetU64LittleEndian (1697 of 1966) PASS: lldb-shell :: Unwind/eh-frame-dwarf-unwind.test (1698 of 1966) PASS: lldb-api :: commands/expression/fixits/TestFixIts.py (1699 of 1966) PASS: lldb-unit :: SymbolFile/NativePDB/./SymbolFileNativePDBTests/PDBFPOProgramToDWARFExpressionTests.InvalidOpUnary (1700 of 1966) PASS: lldb-api :: macosx/find-dsym/deep-bundle/TestDeepBundle.py (1701 of 1966) PASS: lldb-unit :: UnwindAssembly/x86/./UnwindAssemblyx86Tests/Testx86AssemblyInspectionEngine.TestPushExtended (1702 of 1966) PASS: lldb-api :: commands/expression/call-function/TestCallStopAndContinue.py (1703 of 1966) PASS: lldb-api :: functionalities/data-formatter/data-formatter-objc/TestDataFormatterObjCKVO.py (1704 of 1966) PASS: lldb-unit :: Symbol/./SymbolTests/LineEntryTest.GetSameLineContiguousAddressRangeOneInline (1705 of 1966) PASS: lldb-unit :: Utility/./UtilityTests/FileSpecTest.IsRelative (1706 of 1966) PASS: lldb-api :: python_api/findvalue_duplist/TestSBFrameFindValue.py (1707 of 1966) PASS: lldb-unit :: Process/gdb-remote/./ProcessGdbRemoteTests/GDBRemoteCommunicationClientTest.SendGetTraceConfigPacket (1708 of 1966) UNSUPPORTED: lldb-api :: lang/objc/bitfield_ivars/TestBitfieldIvars.py (1709 of 1966) PASS: lldb-unit :: Utility/./UtilityTests/ReproducerTest.SetCapture (1710 of 1966) UNSUPPORTED: lldb-api :: functionalities/thread/concurrent_events/TestConcurrentManySignals.py (1711 of 1966) PASS: lldb-unit :: Utility/./UtilityTests/ScalarTest.Promotion (1712 of 1966) PASS: lldb-api :: macosx/thread-names/TestInterruptThreadNames.py (1713 of 1966) PASS: lldb-api :: functionalities/gdb_remote_client/TestNoGPacketSupported.py (1714 of 1966) PASS: lldb-unit :: Utility/./UtilityTests/StringListTest.InsertStringAtIndexOutOfBounds (1715 of 1966) PASS: lldb-api :: commands/log/invalid-args/TestInvalidArgsLog.py (1716 of 1966) PASS: lldb-api :: python_api/exprpath_synthetic/TestExprPathSynthetic.py (1717 of 1966) PASS: lldb-api :: lang/objc/foundation/TestConstStrings.py (1718 of 1966) UNSUPPORTED: lldb-shell :: SymbolFile/PDB/vbases.test (1719 of 1966) PASS: lldb-unit :: Process/gdb-remote/./ProcessGdbRemoteTests/GDBRemoteCommunicationClientTest.SendStartTracePacket (1720 of 1966) PASS: lldb-shell :: ObjectFile/MachO/lc_build_version_notools.yaml (1721 of 1966) PASS: lldb-shell :: Reproducer/TestDiscard.test (1722 of 1966) PASS: lldb-unit :: ScriptInterpreter/Python/./ScriptInterpreterPythonTests/PythonDataObjectsTest.TestScript (1723 of 1966) PASS: lldb-unit :: Utility/./UtilityTests/OptionsWithRawTest.WhitespaceInput (1724 of 1966) PASS: lldb-api :: commands/statistics/basic/TestStats.py (1725 of 1966) PASS: lldb-api :: lang/objc/objc-baseclass-sbtype/TestObjCBaseClassSBType.py (1726 of 1966) PASS: lldb-api :: lang/cpp/dynamic-value/TestCppValueCast.py (1727 of 1966) PASS: lldb-unit :: Utility/./UtilityTests/SharedCluster.ClusterManager (1728 of 1966) PASS: lldb-api :: functionalities/thread/concurrent_events/TestConcurrentDelayedCrashWithBreakpointSignal.py (1729 of 1966) PASS: lldb-unit :: Symbol/./SymbolTests/TestTypeSystemClang.TestGetBasicTypeFromName (1730 of 1966) UNSUPPORTED: lldb-api :: tools/lldb-server/platform-process-connect/TestPlatformProcessConnect.py (1731 of 1966) PASS: lldb-unit :: Language/Highlighting/./HighlighterTests/HighlighterTest.ClangCommas (1732 of 1966) UNSUPPORTED: lldb-api :: benchmarks/continue/TestBenchmarkContinue.py (1733 of 1966) PASS: lldb-api :: python_api/frame/TestFrames.py (1734 of 1966) PASS: lldb-unit :: Utility/./UtilityTests/SubsystemRAIITest.NormalSubsystem (1735 of 1966) PASS: lldb-api :: lang/objc/objc_direct-methods/TestObjCDirectMethods.py (1736 of 1966) PASS: lldb-unit :: Host/./HostTests/Host.GetEnvironment (1737 of 1966) PASS: lldb-unit :: Utility/./UtilityTests/RecordReplayTest.InstrumentedFoo (1738 of 1966) PASS: lldb-api :: lang/cpp/enum_types/TestCPP11EnumTypes.py (1739 of 1966) PASS: lldb-unit :: UnwindAssembly/x86/./UnwindAssemblyx86Tests/Testx86AssemblyInspectionEngine.TestDisassemblyMidFunctionEpilogues (1740 of 1966) PASS: lldb-api :: functionalities/tail_call_frames/thread_step_out_message/TestArtificialFrameStepOutMessage.py (1741 of 1966) PASS: lldb-unit :: Utility/./UtilityTests/ScalarTest.Equality (1742 of 1966) PASS: lldb-api :: functionalities/step_scripted/TestStepScripted.py (1743 of 1966) PASS: lldb-api :: lang/c/array_types/TestArrayTypes.py (1744 of 1966) PASS: lldb-unit :: ScriptInterpreter/Python/./ScriptInterpreterPythonTests/PythonDataObjectsTest.TestPythonTupleInitializerList2 (1745 of 1966) PASS: lldb-api :: functionalities/gdb_remote_client/TestThreadSelectionBug.py (1746 of 1966) PASS: lldb-shell :: SymbolFile/DWARF/clang-ast-from-dwarf-unamed-and-anon-structs.cpp (1747 of 1966) UNSUPPORTED: lldb-shell :: Watchpoint/netbsd-nouserdbregs.test (1748 of 1966) PASS: lldb-api :: lang/cpp/modules-import/TestCXXModulesImport.py (1749 of 1966) PASS: lldb-unit :: Interpreter/./InterpreterTests/OptionArgParserTest.toChar (1750 of 1966) PASS: lldb-api :: python_api/breakpoint/TestBreakpointAPI.py (1751 of 1966) PASS: lldb-api :: lang/cpp/namespace/TestNamespaceLookup.py (1752 of 1966) PASS: lldb-unit :: Utility/./UtilityTests/StreamTest.PutStringAsRawHex8 (1753 of 1966) PASS: lldb-unit :: Process/minidump/./LLDBMinidumpTests/RegisterContextMinidump.CheckRegisterContextMinidump_ARM (1754 of 1966) PASS: lldb-api :: functionalities/plugins/command_plugin/TestPluginCommands.py (1755 of 1966) PASS: lldb-api :: lang/cpp/type_lookup/TestCppTypeLookup.py (1756 of 1966) PASS: lldb-unit :: Utility/./UtilityTests/AnsiTerminal.AtEnd (1757 of 1966) PASS: lldb-unit :: Host/./HostTests/ConnectionFileDescriptorTest.TCPGetURIv6 (1758 of 1966) PASS: lldb-shell :: Heap/heap-cstr.test (1759 of 1966) PASS: lldb-api :: functionalities/breakpoint/step_over_breakpoint/TestStepOverBreakpoint.py (1760 of 1966) PASS: lldb-unit :: Utility/./UtilityTests/UriParserTest.SchemeHostSeparator2 (1761 of 1966) PASS: lldb-unit :: Utility/./UtilityTests/DeserializerTest.HasData (1762 of 1966) PASS: lldb-unit :: SymbolFile/DWARF/./SymbolFileDWARFTests/SymbolFileDWARFTests.TestAbbrevOrder1Start1 (1763 of 1966) PASS: lldb-api :: functionalities/thread/jump/TestThreadJump.py (1764 of 1966) PASS: lldb-shell :: SymbolFile/NativePDB/globals-bss.cpp (1765 of 1966) UNSUPPORTED: lldb-api :: benchmarks/expression/TestRepeatedExprs.py (1766 of 1966) PASS: lldb-api :: tools/lldb-server/inferior-crash/TestGdbRemoteAbort.py (1767 of 1966) UNSUPPORTED: lldb-api :: functionalities/unwind/standard/TestStandardUnwind.py (1768 of 1966) PASS: lldb-unit :: Utility/./UtilityTests/OptionsWithRawTest.ArgsButNoDelimiter (1769 of 1966) PASS: lldb-unit :: Platform/./LLDBPlatformTests/PlatformDarwinTest.TestParseVersionBuildDir (1770 of 1966) PASS: lldb-unit :: Utility/./UtilityTests/StringListTest.InsertStringAtIndexStart (1771 of 1966) PASS: lldb-unit :: Utility/./UtilityTests/UUIDTest.StringConverion (1772 of 1966) PASS: lldb-unit :: SymbolFile/NativePDB/./SymbolFileNativePDBTests/PDBFPOProgramToDWARFExpressionTests.UnknownOp (1773 of 1966) PASS: lldb-api :: commands/target/create-no-such-arch/TestNoSuchArch.py (1774 of 1966) PASS: lldb-api :: functionalities/inferior-crashing/TestInferiorCrashing.py (1775 of 1966) PASS: lldb-unit :: Utility/./UtilityTests/ArgsTest.BareSingleQuote (1776 of 1966) PASS: lldb-api :: functionalities/source-map/TestTargetSourceMap.py (1777 of 1966) UNSUPPORTED: lldb-api :: functionalities/exec/TestExec.py (1778 of 1966) PASS: lldb-shell :: ObjectFile/Breakpad/breakpad-identification.test (1779 of 1966) PASS: lldb-unit :: Utility/./UtilityTests/StringListTest.Clear (1780 of 1966) PASS: lldb-api :: macosx/version_zero/TestGetVersionZeroVersion.py (1781 of 1966) PASS: lldb-api :: commands/expression/test/TestExprs2.py (1782 of 1966) PASS: lldb-unit :: ScriptInterpreter/Python/./ScriptInterpreterPythonTests/PythonDataObjectsTest.TestTypeNameResolutionNoDot (1783 of 1966) PASS: lldb-unit :: Host/./HostTests/SocketTest.DecodeHostAndPort (1784 of 1966) PASS: lldb-unit :: Utility/./UtilityTests/OptionsWithRawTest.QuotedSuffix (1785 of 1966) UNSUPPORTED: lldb-shell :: Register/x86-ymm-read.test (1786 of 1966) PASS: lldb-unit :: UnwindAssembly/x86/./UnwindAssemblyx86Tests/Testx86AssemblyInspectionEngine.TestPushR12 (1787 of 1966) PASS: lldb-api :: lang/c/offsetof/TestOffsetof.py (1788 of 1966) UNSUPPORTED: lldb-shell :: Register/x86-ymm-write.test (1789 of 1966) PASS: lldb-api :: functionalities/data-formatter/data-formatter-objc/TestDataFormatterObjCCF.py (1790 of 1966) UNSUPPORTED: lldb-api :: functionalities/data-formatter/data-formatter-stl/libstdcpp/tuple/TestDataFormatterStdTuple.py (1791 of 1966) PASS: lldb-unit :: Host/./HostTests/SocketAddressTest.GetAddressInfo (1792 of 1966) PASS: lldb-shell :: ObjectFile/MachO/lc_version_min.yaml (1793 of 1966) PASS: lldb-unit :: Utility/./UtilityTests/BinaryStreamTest.PutULEB128MaxValue (1794 of 1966) PASS: lldb-shell :: SymbolFile/DWARF/find-basic-function.cpp (1795 of 1966) PASS: lldb-unit :: Utility/./UtilityTests/BinaryStreamTest.PutSLEB128NineBytes (1796 of 1966) PASS: lldb-api :: lang/c/const_variables/TestConstVariables.py (1797 of 1966) PASS: lldb-api :: lang/cpp/class_types/TestClassTypesDisassembly.py (1798 of 1966) PASS: lldb-unit :: Utility/./UtilityTests/ArgsTest.TestUnknownEscape (1799 of 1966) PASS: lldb-api :: functionalities/thread/concurrent_events/TestConcurrentSignalDelayBreak.py (1800 of 1966) PASS: lldb-unit :: debugserver/./debugserverTests/RNBSocket.LoopBackListenIPv4 (1801 of 1966) UNSUPPORTED: lldb-shell :: Register/x86-zmm-write.test (1802 of 1966) PASS: lldb-unit :: Utility/./UtilityTests/StringListTest.LongestCommonPrefixDuplicateElement (1803 of 1966) PASS: lldb-unit :: Utility/./UtilityTests/StatusTest.Formatv (1804 of 1966) PASS: lldb-api :: commands/frame/diagnose/array/TestArray.py (1805 of 1966) PASS: lldb-unit :: Utility/./UtilityTests/StringExtractorTest.GetNameColonValueSuccess (1806 of 1966) PASS: lldb-api :: lang/objc/print-obj/TestPrintObj.py (1807 of 1966) PASS: lldb-api :: functionalities/breakpoint/global_constructor/TestBreakpointInGlobalConstructor.py (1808 of 1966) UNSUPPORTED: lldb-api :: functionalities/data-formatter/data-formatter-stl/libstdcpp/vbool/TestDataFormatterStdVBool.py (1809 of 1966) PASS: lldb-unit :: Utility/./UtilityTests/StringExtractorTest.GetNameColonValueNoSemicolon (1810 of 1966) PASS: lldb-unit :: Utility/./UtilityTests/StreamTest.AddressEmptyPrefix (1811 of 1966) PASS: lldb-unit :: ScriptInterpreter/Python/./ScriptInterpreterPythonTests/PythonDataObjectsTest.TestDictionaryResolutionWithDot (1812 of 1966) PASS: lldb-unit :: Utility/./UtilityTests/ArgsTest.TestInsertArg (1813 of 1966) UNSUPPORTED: lldb-api :: lang/cpp/static_members/TestCPPStaticMembers.py (1814 of 1966) PASS: lldb-unit :: Utility/./UtilityTests/StringExtractorTest.GetHexBytesAvail_Underflow (1815 of 1966) PASS: lldb-shell :: ObjectFile/PECOFF/section-types.yaml (1816 of 1966) PASS: lldb-unit :: UnwindAssembly/x86/./UnwindAssemblyx86Tests/Testx86AssemblyInspectionEngine.TestDisassemblyJunkBytes (1817 of 1966) PASS: lldb-api :: functionalities/thread/backtrace_limit/TestBacktraceLimit.py (1818 of 1966) UNSUPPORTED: lldb-shell :: SymbolFile/PDB/variables.test (1819 of 1966) PASS: lldb-api :: functionalities/recursion/TestValueObjectRecursion.py (1820 of 1966) PASS: lldb-unit :: SymbolFile/NativePDB/./SymbolFileNativePDBTests/PDBFPOProgramToDWARFExpressionTests.DependencyChain (1821 of 1966) PASS: lldb-shell :: SymbolFile/Breakpad/stack-cfi-parsing.test (1822 of 1966) PASS: lldb-unit :: Utility/./UtilityTests/AnsiTerminal.AtStart (1823 of 1966) UNSUPPORTED: lldb-api :: functionalities/process_save_core/TestProcessSaveCore.py (1824 of 1966) PASS: lldb-unit :: Process/minidump/./LLDBMinidumpTests/MinidumpParserTest.FindMemoryRangeWithFullMemoryMinidump (1825 of 1966) PASS: lldb-api :: lang/objc/self/TestObjCSelf.py (1826 of 1966) PASS: lldb-unit :: Utility/./UtilityTests/AnsiTerminal.Basic (1827 of 1966) PASS: lldb-unit :: Process/minidump/./LLDBMinidumpTests/MinidumpParserTest.GetMemoryRegionInfoFromMemoryList (1828 of 1966) PASS: lldb-api :: functionalities/data-formatter/data-formatter-disabling/TestDataFormatterDisabling.py (1829 of 1966) PASS: lldb-unit :: UnwindAssembly/x86/./UnwindAssemblyx86Tests/Testx86AssemblyInspectionEngine.TestPushR13 (1830 of 1966) PASS: lldb-unit :: Symbol/./SymbolTests/TestClangASTImporter.DeportDeclTagDecl (1831 of 1966) PASS: lldb-api :: functionalities/data-formatter/compactvectors/TestCompactVectors.py (1832 of 1966) PASS: lldb-api :: functionalities/thread/thread_exit/TestThreadExit.py (1833 of 1966) PASS: lldb-shell :: BuildScript/compiler-full-path.test (1834 of 1966) PASS: lldb-api :: functionalities/breakpoint/breakpoint_by_line_and_column/TestBreakpointByLineAndColumn.py (1835 of 1966) PASS: lldb-api :: functionalities/gdb_remote_client/TestArmRegisterDefinition.py (1836 of 1966) PASS: lldb-api :: functionalities/data-formatter/user-format-vs-summary/TestUserFormatVsSummary.py (1837 of 1966) PASS: lldb-api :: tools/lldb-vscode/breakpoint/TestVSCode_setBreakpoints.py (1838 of 1966) PASS: lldb-unit :: Expression/./ExpressionTests/CppModuleConfigurationTest.AmbiguousCLib (1839 of 1966) PASS: lldb-api :: commands/expression/import-std-module/no-std-module/TestMissingStdModule.py (1840 of 1966) UNSUPPORTED: lldb-shell :: SymbolFile/PDB/typedefs.test (1841 of 1966) PASS: lldb-unit :: Utility/./UtilityTests/StringExtractorTest.GetHexU8_Exact (1842 of 1966) PASS: lldb-unit :: Utility/./UtilityTests/LogChannelEnabledTest.LogGetLogThread (1843 of 1966) PASS: lldb-api :: lang/objc/objc-struct-return/TestObjCStructReturn.py (1844 of 1966) PASS: lldb-unit :: ScriptInterpreter/Python/./ScriptInterpreterPythonTests/PythonDataObjectsTest.TestPythonDictionaryManipulation (1845 of 1966) PASS: lldb-api :: lang/objc/single-entry-dictionary/TestObjCSingleEntryDictionary.py (1846 of 1966) PASS: lldb-unit :: Host/./HostTests/HostInfoTest.GetHostname (1847 of 1966) PASS: lldb-api :: python_api/value_var_update/TestValueVarUpdate.py (1848 of 1966) PASS: lldb-api :: functionalities/unwind/noreturn/TestNoreturnUnwind.py (1849 of 1966) PASS: lldb-unit :: Utility/./UtilityTests/RangeTest.NotEqualInvalid (1850 of 1966) PASS: lldb-unit :: Symbol/./SymbolTests/TestTypeSystemClang.TestGetTypeClassTypeOfExpr (1851 of 1966) PASS: lldb-api :: python_api/frame/get-variables/TestGetVariables.py (1852 of 1966) PASS: lldb-api :: lang/objcxx/class-name-clash/TestNameClash.py (1853 of 1966) PASS: lldb-api :: functionalities/tail_call_frames/disambiguate_tail_call_seq/TestDisambiguateTailCallSeq.py (1854 of 1966) PASS: lldb-api :: commands/watchpoints/step_over_watchpoint/TestStepOverWatchpoint.py (1855 of 1966) PASS: lldb-unit :: Process/gdb-remote/./ProcessGdbRemoteTests/GDBRemoteCommunicationClientTest.GetModulesInfoInvalidResponse (1856 of 1966) PASS: lldb-api :: functionalities/postmortem/wow64_minidump/TestWow64MiniDump.py (1857 of 1966) PASS: lldb-unit :: Symbol/./SymbolTests/TestTypeSystemClang.TestGetBasicTypeFromEnum (1858 of 1966) PASS: lldb-unit :: Process/gdb-remote/./ProcessGdbRemoteTests/GDBRemoteCommunicationClientTest.GetQOffsets (1859 of 1966) PASS: lldb-shell :: Settings/TestEchoCommands.test (1860 of 1966) PASS: lldb-api :: lang/objc/radar-9691614/TestObjCMethodReturningBOOL.py (1861 of 1966) PASS: lldb-unit :: UnwindAssembly/x86/./UnwindAssemblyx86Tests/Testx86AssemblyInspectionEngine.TestReturnDetect (1862 of 1966) PASS: lldb-api :: functionalities/breakpoint/breakpoint_set_restart/TestBreakpointSetRestart.py (1863 of 1966) PASS: lldb-unit :: Symbol/./SymbolTests/PostfixExpression.ParseFPOProgram (1864 of 1966) PASS: lldb-api :: lang/cpp/virtual-functions/TestCppVirtualFunctions.py (1865 of 1966) PASS: lldb-unit :: Host/./HostTests/SocketTest.DomainListenConnectAccept (1866 of 1966) PASS: lldb-api :: lang/cpp/unique-types/TestUniqueTypes.py (1867 of 1966) UNSUPPORTED: lldb-api :: tools/lldb-server/TestGdbRemote_vContThreads.py (1868 of 1966) PASS: lldb-unit :: Symbol/./SymbolTests/TestTypeSystemClang.TestGetEnumIntegerTypeUnexpectedType (1869 of 1966) PASS: lldb-unit :: Utility/./UtilityTests/StreamTest.ShiftOperatorPtr (1870 of 1966) PASS: lldb-unit :: ObjectFile/PECOFF/./ObjectFilePECOFFTests/PECallFrameInfoTest.Chained_eh (1871 of 1966) PASS: lldb-api :: functionalities/data-formatter/data-formatter-python-synth/TestDataFormatterPythonSynth.py (1872 of 1966) PASS: lldb-api :: lang/objcxx/objcxx-ivar-vector/TestIvarVector.py (1873 of 1966) PASS: lldb-unit :: Utility/./UtilityTests/UriParserTest.LongPath (1874 of 1966) PASS: lldb-unit :: Utility/./UtilityTests/UserIDResolver.GetGroupName (1875 of 1966) UNSUPPORTED: lldb-shell :: ScriptInterpreter/Lua/watchpoint_callback.test (1876 of 1966) PASS: lldb-unit :: Expression/./ExpressionTests/DiagnosticManagerTest.GetStringBasic (1877 of 1966) PASS: lldb-api :: lang/objc/foundation/TestRuntimeTypes.py (1878 of 1966) PASS: lldb-unit :: Utility/./UtilityTests/StringLexerTest.HasAtLeast (1879 of 1966) PASS: lldb-api :: lang/c/stepping/TestStepAndBreakpoints.py (1880 of 1966) PASS: lldb-api :: tools/lldb-server/TestGdbRemoteAttach.py (1881 of 1966) UNSUPPORTED: lldb-api :: tools/lldb-server/libraries-svr4/TestGdbRemoteLibrariesSvr4Support.py (1882 of 1966) PASS: lldb-unit :: Utility/./UtilityTests/OptionsWithRawTest.SingleWhitespaceInput (1883 of 1966) PASS: lldb-unit :: Utility/./UtilityTests/StringExtractorTest.GetHexU8_Underflow2 (1884 of 1966) PASS: lldb-api :: commands/expression/completion-in-lambda-and-unnamed-class/TestCompletionInLambdaAndUnnamedClass.py (1885 of 1966) UNSUPPORTED: lldb-shell :: SymbolFile/PDB/function-level-linking.test (1886 of 1966) PASS: lldb-unit :: Utility/./UtilityTests/StreamTest.PutHex32ByteOrderLittle (1887 of 1966) PASS: lldb-unit :: Target/./TargetTests/StackFrameRecognizerTest.NullModuleRegex (1888 of 1966) PASS: lldb-unit :: Utility/./UtilityTests/StreamTeeTest.Constructor2Streams (1889 of 1966) PASS: lldb-unit :: Target/./TargetTests/MemoryRegionInfoTest.Formatv (1890 of 1966) PASS: lldb-api :: functionalities/breakpoint/comp_dir_symlink/TestCompDirSymLink.py (1891 of 1966) PASS: lldb-api :: commands/watchpoints/watchpoint_on_vectors/TestValueOfVectorVariable.py (1892 of 1966) PASS: lldb-shell :: ObjectFile/Breakpad/sections-trailing-func.test (1893 of 1966) PASS: lldb-unit :: Utility/./UtilityTests/ArgsTest.EscapeLLDBCommandArgument (1894 of 1966) PASS: lldb-api :: functionalities/postmortem/mach-core/TestMachCore.py (1895 of 1966) PASS: lldb-api :: functionalities/data-formatter/data-formatter-stl/libcxx/atomic/TestLibCxxAtomic.py (1896 of 1966) PASS: lldb-api :: lang/cpp/class_static/TestStaticVariables.py (1897 of 1966) PASS: lldb-api :: commands/command/invalid-args/TestInvalidArgsCommand.py (1898 of 1966) PASS: lldb-shell :: Register/x86-64-read.test (1899 of 1966) PASS: lldb-api :: functionalities/breakpoint/breakpoint_names/TestBreakpointNames.py (1900 of 1966) PASS: lldb-unit :: Utility/./UtilityTests/ProcessInstanceInfo.DumpTable (1901 of 1966) PASS: lldb-api :: macosx/find-dsym/bundle-with-dot-in-filename/TestBundleWithDotInFilename.py (1902 of 1966) PASS: lldb-api :: functionalities/postmortem/minidump-new/TestMiniDumpUUID.py (1903 of 1966) PASS: lldb-unit :: Utility/./UtilityTests/OptionsWithRawTest.EmptyInput (1904 of 1966) PASS: lldb-unit :: Host/./HostTests/NativeProcessProtocolTest.ReadCStringFromMemory_MaxSize (1905 of 1966) PASS: lldb-api :: commands/watchpoints/watchpoint_commands/condition/TestWatchpointConditionCmd.py (1906 of 1966) UNSUPPORTED: lldb-api :: lang/cpp/function-template-parameter-pack/TestFunctionTemplateParameterPack.py (1907 of 1966) PASS: lldb-unit :: Utility/./UtilityTests/UriParserTest.MinimalPort (1908 of 1966) PASS: lldb-shell :: Breakpoint/debug_rnglist_offset_pair.test (1909 of 1966) XFAIL: lldb-shell :: Register/x86-mm-xmm-read.test (1910 of 1966) PASS: lldb-unit :: debugserver/./debugserverTests/RNBSocket.AnyListen (1911 of 1966) PASS: lldb-api :: python_api/watchpoint/watchlocation/TestSetWatchlocation.py (1912 of 1966) UNSUPPORTED: lldb-api :: tools/lldb-vscode/completions/TestVSCode_completions.py (1913 of 1966) PASS: lldb-api :: functionalities/thread/concurrent_events/TestConcurrentCrashWithBreak.py (1914 of 1966) PASS: lldb-shell :: Process/TestEnvironment.test (1915 of 1966) PASS: lldb-api :: tools/lldb-server/TestGdbRemoteKill.py (1916 of 1966) PASS: lldb-unit :: Utility/./UtilityTests/Flags.AnyClear (1917 of 1966) PASS: lldb-unit :: Utility/./UtilityTests/EnvironmentTest.EnvpConversion (1918 of 1966) PASS: lldb-unit :: SymbolFile/DWARF/./SymbolFileDWARFTests/SymbolFileDWARFTests.TestAbbrevNullAttrValidForm (1919 of 1966) PASS: lldb-api :: functionalities/postmortem/netbsd-core/TestNetBSDCore.py (1920 of 1966) PASS: lldb-api :: lang/cpp/signed_types/TestSignedTypes.py (1921 of 1966) PASS: lldb-unit :: Utility/./UtilityTests/UUIDTest.SetFromStringRef (1922 of 1966) PASS: lldb-unit :: Utility/./UtilityTests/ArgsTest.TestTrailingBackslash (1923 of 1966) PASS: lldb-unit :: Language/Highlighting/./HighlighterTests/HighlighterTest.ClangScalarLiterals (1924 of 1966) PASS: lldb-unit :: Utility/./UtilityTests/StringListTest.CopyListEmpty (1925 of 1966) PASS: lldb-unit :: ScriptInterpreter/Python/./ScriptInterpreterPythonTests/PythonDataObjectsTest.TestPythonListToStructuredList (1926 of 1966) PASS: lldb-api :: functionalities/data-formatter/ptr_ref_typedef/TestPtrRef2Typedef.py (1927 of 1966) PASS: lldb-unit :: Utility/./UtilityTests/StreamTeeTest.Flush (1928 of 1966) PASS: lldb-shell :: SymbolFile/Breakpad/line-table-missing-file.test (1929 of 1966) PASS: lldb-shell :: Driver/TestCommands.test (1930 of 1966) PASS: lldb-api :: sanity/TestSettingSkipping.py (1931 of 1966) PASS: lldb-api :: python_api/formatters/TestFormattersSBAPI.py (1932 of 1966) PASS: lldb-unit :: Process/minidump/./LLDBMinidumpTests/MinidumpParserTest.MinidumpDuplicateModuleMinAddress (1933 of 1966) PASS: lldb-unit :: Host/./HostTests/SocketTest.DomainGetConnectURI (1934 of 1966) PASS: lldb-unit :: Host/./HostTests/NativeProcessProtocolTest.SetBreakpointFailVerify (1935 of 1966) PASS: lldb-api :: functionalities/dynamic_value_child_count/TestDynamicValueChildCount.py (1936 of 1966) PASS: lldb-unit :: Utility/./UtilityTests/StringLexerTest.AdvanceIf (1937 of 1966) UNSUPPORTED: lldb-api :: commands/register/register/intel_xtended_registers/mpx_offset_intersection/TestMPXOffsetIntersection.py (1938 of 1966) PASS: lldb-shell :: Register/x86-64-ymm-read.test (1939 of 1966) PASS: lldb-api :: tools/lldb-vscode/attach/TestVSCode_attach.py (1940 of 1966) PASS: lldb-api :: functionalities/data-formatter/data-formatter-stl/libcxx/vbool/TestDataFormatterLibcxxVBool.py (1941 of 1966) PASS: lldb-shell :: SymbolFile/DWARF/win-i386-line-table.s (1942 of 1966) PASS: lldb-unit :: Utility/./UtilityTests/StreamTest.QuotedCString (1943 of 1966) PASS: lldb-unit :: Utility/./UtilityTests/CompletionRequest.TryCompleteCurrentArgGood (1944 of 1966) PASS: lldb-api :: types/TestShortType.py (1945 of 1966) PASS: lldb-unit :: Expression/./ExpressionTests/CppModuleConfigurationTest.AmbiguousLibCpp (1946 of 1966) PASS: lldb-shell :: ObjectFile/ELF/many-sections.s (1947 of 1966) PASS: lldb-api :: functionalities/type_completion/TestTypeCompletion.py (1948 of 1966) PASS: lldb-unit :: Utility/./UtilityTests/FileSpecTest.FileAndDirectoryComponents (1949 of 1966) PASS: lldb-unit :: Utility/./UtilityTests/VASprintfTest.NoBufferResize (1950 of 1966) PASS: lldb-unit :: Utility/./UtilityTests/StringListTest.SplitIntoLinesSingleTrailingCR (1951 of 1966) PASS: lldb-unit :: SymbolFile/NativePDB/./SymbolFileNativePDBTests/PDBFPOProgramToDWARFExpressionTests.MultipleIndependentAssignments (1952 of 1966) PASS: lldb-api :: functionalities/load_using_paths/TestLoadUsingPaths.py (1953 of 1966) PASS: lldb-unit :: UnwindAssembly/x86/./UnwindAssemblyx86Tests/Testx86AssemblyInspectionEngine.Test64bitFramelessBigStackFrame (1954 of 1966) PASS: lldb-api :: functionalities/tail_call_frames/sbapi_support/TestTailCallFrameSBAPI.py (1955 of 1966) PASS: lldb-api :: python_api/disassemble-raw-data/TestDisassembleRawData.py (1956 of 1966) PASS: lldb-unit :: UnwindAssembly/x86/./UnwindAssemblyx86Tests/Testx86AssemblyInspectionEngine.Test32BitOnlyInstruction (1957 of 1966) PASS: lldb-api :: functionalities/breakpoint/breakpoint_options/TestBreakpointOptions.py (1958 of 1966) PASS: lldb-unit :: ScriptInterpreter/Python/./ScriptInterpreterPythonTests/PythonDataObjectsTest.TestPythonTupleValues (1959 of 1966) PASS: lldb-unit :: Utility/./UtilityTests/BinaryStreamTest.PutSLEB128MaxValue (1960 of 1966) PASS: lldb-api :: functionalities/data-formatter/data-formatter-named-summaries/TestDataFormatterNamedSummaries.py (1961 of 1966) PASS: lldb-api :: functionalities/breakpoint/breakpoint_conditions/TestBreakpointConditions.py (1962 of 1966) PASS: lldb-unit :: Utility/./UtilityTests/StringListTest.LongestCommonPrefixSingleElement (1963 of 1966) PASS: lldb-api :: lang/c/vla/TestVLA.py (1964 of 1966) PASS: lldb-api :: lang/c/local_variables/TestLocalVariables.py (1965 of 1966) PASS: lldb-api :: tools/lldb-server/TestLldbGdbServer.py (1966 of 1966)

Hide Details

Testing Time: 4409.58s ******************** Failing Tests (3): lldb-api :: functionalities/ptr_refs/TestPtrRefs.py lldb-api :: python_api/thread/TestThreadAPI.py lldb-api :: lang/objc/ptr_refs/TestPtrRefsObjC.py

Hide Details

Hide Details

Slowest Tests: -------------------------------------------------------------------------- 91.74s: lldb-api :: functionalities/gdb_remote_client/TestWasm.py 94.83s: lldb-api :: commands/settings/TestSettings.py 94.88s: lldb-api :: lang/objc/objc++/TestObjCXX.py 95.67s: lldb-api :: types/TestLongTypes.py 111.54s: lldb-api :: lang/objc/foundation/TestObjCMethodsNSError.py 113.18s: lldb-api :: lang/objc/objc-new-syntax/TestObjCNewSyntaxDictionary.py 114.10s: lldb-api :: lang/objc/objc-new-syntax/TestObjCNewSyntaxArray.py 114.89s: lldb-api :: lang/objc/foundation/TestObjCMethodsString.py 120.73s: lldb-api :: tools/lldb-server/TestGdbRemote_qThreadStopInfo.py 133.63s: lldb-api :: types/TestLongTypesExpr.py 138.00s: lldb-api :: lang/objc/real-definition/TestRealDefinition.py 138.73s: lldb-api :: lang/objc/exceptions/TestObjCExceptions.py 150.36s: lldb-api :: lang/objc/objc-new-syntax/TestObjCNewSyntaxLiteral.py 161.17s: lldb-api :: lang/cpp/namespace/TestNamespaceLookup.py 215.01s: lldb-api :: lang/objc/foundation/TestObjCMethods.py 216.14s: lldb-api :: lang/objc/hidden-ivars/TestHiddenIvars.py 248.70s: lldb-api :: tools/lldb-server/TestGdbRemoteThreadsInStopReply.py 256.20s: lldb-api :: api/multithreaded/TestMultithreaded.py 275.87s: lldb-api :: lang/cpp/enum_types/TestCPP11EnumTypes.py 343.40s: lldb-api :: tools/lldb-server/TestLldbGdbServer.py

Hide Details

Tests Times: -------------------------------------------------------------------------- [ Range ] :: [ Percentage ] :: [ Count ] -------------------------------------------------------------------------- [ 0s, 20s) :: [********************************** ] :: [1715/1966] [ 20s, 40s) :: [** ] :: [ 115/1966] [ 40s, 60s) :: [* ] :: [ 82/1966] [ 60s, 80s) :: [ ] :: [ 24/1966] [ 80s,100s) :: [ ] :: [ 13/1966] [100s,120s) :: [ ] :: [ 4/1966] [120s,140s) :: [ ] :: [ 2/1966] [140s,160s) :: [ ] :: [ 4/1966] [160s,180s) :: [ ] :: [ 1/1966] [180s,200s) :: [ ] :: [ 0/1966] [200s,220s) :: [ ] :: [ 0/1966] [220s,240s) :: [ ] :: [ 2/1966] [240s,260s) :: [ ] :: [ 0/1966] [260s,280s) :: [ ] :: [ 2/1966] [280s,300s) :: [ ] :: [ 1/1966] [300s,320s) :: [ ] :: [ 0/1966] [320s,340s) :: [ ] :: [ 0/1966] [340s,360s) :: [ ] :: [ 1/1966] Expected Passes : 1792 Expected Failures : 6 Unsupported Tests : 165 Unexpected Failures: 3 FAILED: tools/lldb/test/CMakeFiles/check-lldb-lit cd /Users/buildslave/jenkins/workspace/lldb-cmake-sanitized/lldb-build/tools/lldb/test && /usr/local/bin/python /Users/buildslave/jenkins/workspace/lldb-cmake-sanitized/lldb-build/./bin/llvm-lit -v --time-tests --shuffle --xunit-xml-output=/Users/buildslave/jenkins/workspace/lldb-cmake-sanitized/test/results.xml -v -j 4 --timeout 1200 /Users/buildslave/jenkins/workspace/lldb-cmake-sanitized/lldb-build/tools/lldb/test ninja: build stopped: subcommand failed. Command failed: Command '['/usr/bin/env', 'TERM=vt100', '/usr/local/bin/ninja', '-v', 'check-lldb']' returned non-zero exit status 1. Command: ['/usr/bin/env', 'TERM=vt100', '/usr/local/bin/ninja', '-v', 'check-lldb'] [Pipeline] } [Pipeline] // timeout [Pipeline] } [Pipeline] // stage [Pipeline] stage [Pipeline] { (Declarative: Post Actions) [Pipeline] scanForIssues [Clang (LLVM based)] Sleeping for 5 seconds due to JENKINS-32191... [Clang (LLVM based)] Parsing console log (workspace: '/Users/buildslave/jenkins/workspace/lldb-cmake-sanitized') [Clang (LLVM based)] Successfully parsed console log [Clang (LLVM based)] -> found 9 issues (skipped 2 duplicates) [Clang (LLVM based)] Post processing issues on 'green-dragon-23' with source code encoding 'UTF-8' [Clang (LLVM based)] Creating SCM blamer to obtain author and commit information for affected files [Clang (LLVM based)] Creating SCM miner to obtain statistics for affected repository files [Clang (LLVM based)] Resolving file names for all issues in source directory '/Users/buildslave/jenkins/workspace/lldb-cmake-sanitized' [Clang (LLVM based)] -> resolved paths in source directory (8 found, 0 not found) [Clang (LLVM based)] Resolving module names from module definitions (build.xml, pom.xml, or Manifest.mf files) [Clang (LLVM based)] -> resolved module names for 9 issues [Clang (LLVM based)] Resolving package names (or namespaces) by parsing the affected files [Clang (LLVM based)] -> resolved package names of 6 affected files [Clang (LLVM based)] No filter has been set, publishing all 7 issues [Clang (LLVM based)] Creating fingerprints for all affected code blocks to track issues over different builds [Clang (LLVM based)] -> created fingerprints for 7 issues (skipped 0 issues) [Clang (LLVM based)] Copying affected files to Jenkins' build folder '/Users/Shared/Jenkins/Home/jobs/lldb-cmake-sanitized/builds/1134/files-with-issues' [Clang (LLVM based)] -> 6 copied, 0 not in workspace, 0 not-found, 0 with I/O error [Pipeline] junit Recording test results [Pipeline] } [Pipeline] // stage [Pipeline] } [Pipeline] // withEnv [Pipeline] } [Pipeline] // node [Pipeline] End of Pipeline ERROR: script returned exit code 1 Finished: FAILURE