Console Output

Skipping 951 KB.. Full Log
output: 

Hide Details

runCmd: settings set use-color false output:

Hide Details

runCmd: setting set target.prefer-dynamic-value no-dynamic-values output:

Hide Details

runCmd: settings set target.env-vars ASAN_OPTIONS=detect_stack_use_after_return=1 DYLD_INSERT_LIBRARIES=/Users/buildslave/jenkins/workspace/lldb-cmake-sanitized/host-compiler/lib/clang/11.0.0/lib/darwin/libclang_rt.asan_osx_dynamic.dylib output:

Hide Details

runCmd: breakpoint list output: Current breakpoints: 1: file = 'main2.cpp', line = 21, exact_match = 0, locations = 1 1.1: where = test_run_to_address_dsym`b(int) + 22 at main2.cpp:21:17, address = test_run_to_address_dsym[0x0000000100000e66], unresolved, hit count = 0

Hide Details

Hide Details

Hide Details

runCmd: thread backtrace output: * thread #1, queue = 'com.apple.main-thread', stop reason = breakpoint 1.1 * frame #0: 0x0000000100b19e66 test_run_to_address_dsym`b(val=1) at main2.cpp:21:17 frame #1: 0x0000000100b19e0d test_run_to_address_dsym`a(val=1) at main2.cpp:11:16 frame #2: 0x0000000100b19ee0 test_run_to_address_dsym`main(argc=1, argv=0x00007ffeef0e6470) at main2.cpp:36:14 frame #3: 0x00007fff67d6a085 libdyld.dylib`start + 1

Hide Details

Hide Details

runCmd: breakpoint list output: Current breakpoints: 1: file = 'main2.cpp', line = 21, exact_match = 0, locations = 1 Options: disabled 1.1: where = test_run_to_address_dsym`b(int) + 22 at main2.cpp:21:17, address = 0x0000000100b19e66, unresolved, hit count = 1

Hide Details

Hide Details

Hide Details

runCmd: thread backtrace output: * thread #1, queue = 'com.apple.main-thread', stop reason = step over * frame #0: 0x0000000100b19e9d test_run_to_address_dsym`b(val=1) at main2.cpp:26:12 frame #1: 0x0000000100b19e0d test_run_to_address_dsym`a(val=1) at main2.cpp:11:16 frame #2: 0x0000000100b19ee0 test_run_to_address_dsym`main(argc=1, argv=0x00007ffeef0e6470) at main2.cpp:36:14 frame #3: 0x00007fff67d6a085 libdyld.dylib`start + 1

Hide Details

Hide Details

runCmd: process status output: Process 1750 stopped * thread #1, queue = 'com.apple.main-thread', stop reason = run to address: 0x0000000100b19e66 frame #0: 0x0000000100b19e66 test_run_to_address_dsym`b(val=2) at main2.cpp:21:17 18 int b(int val) 19 { 20 int rc = c(val); -> 21 void *ptr = malloc(1024); // thread step-out of malloc into function b. ^ 22 if (!ptr) 23 return -1; 24 else

Hide Details

Hide Details

<bound method SBProcess.Kill of <lldb.SBProcess; proxy of <Swig Object of type 'lldb::SBProcess *' at 0x106e92de0> >>: success

Hide Details

PASS: LLDB (/Users/buildslave/jenkins/workspace/lldb-cmake-sanitized/lldb-build/bin/clang-11-x86_64) :: test_run_to_address_dsym (TestThreadAPI.ThreadAPITestCase) runCmd: settings clear -all output:

Hide Details

runCmd: settings set symbols.enable-external-lookup false output:

Hide Details

runCmd: settings set target.auto-apply-fixits false output:

Hide Details

runCmd: settings set plugin.process.gdb-remote.packet-timeout 60 output:

Hide Details

runCmd: settings set symbols.clang-modules-cache-path "/Users/buildslave/jenkins/workspace/lldb-cmake-sanitized/lldb-build/lldb-test-build.noindex/module-cache-lldb/lldb-api" output:

Hide Details

runCmd: settings set use-color false output:

Hide Details

runCmd: setting set target.prefer-dynamic-value no-dynamic-values output:

Hide Details

runCmd: settings set target.env-vars ASAN_OPTIONS=detect_stack_use_after_return=1 DYLD_INSERT_LIBRARIES=/Users/buildslave/jenkins/workspace/lldb-cmake-sanitized/host-compiler/lib/clang/11.0.0/lib/darwin/libclang_rt.asan_osx_dynamic.dylib output:

Hide Details

runCmd: breakpoint list output: Current breakpoints: 1: file = 'main2.cpp', line = 21, exact_match = 0, locations = 1 1.1: where = test_run_to_address_dwarf`b(int) + 22 at main2.cpp:21:17, address = test_run_to_address_dwarf[0x0000000100000e66], unresolved, hit count = 0

Hide Details

Hide Details

Hide Details

runCmd: thread backtrace output: * thread #1, queue = 'com.apple.main-thread', stop reason = breakpoint 1.1 * frame #0: 0x0000000106082e66 test_run_to_address_dwarf`b(val=1) at main2.cpp:21:17 frame #1: 0x0000000106082e0d test_run_to_address_dwarf`a(val=1) at main2.cpp:11:16 frame #2: 0x0000000106082ee0 test_run_to_address_dwarf`main(argc=1, argv=0x00007ffee9b7d470) at main2.cpp:36:14 frame #3: 0x00007fff67d6a085 libdyld.dylib`start + 1

Hide Details

Hide Details

runCmd: breakpoint list output: Current breakpoints: 1: file = 'main2.cpp', line = 21, exact_match = 0, locations = 1 Options: disabled 1.1: where = test_run_to_address_dwarf`b(int) + 22 at main2.cpp:21:17, address = 0x0000000106082e66, unresolved, hit count = 1

Hide Details

Hide Details

Hide Details

runCmd: thread backtrace output: * thread #1, queue = 'com.apple.main-thread', stop reason = step over * frame #0: 0x0000000106082e9d test_run_to_address_dwarf`b(val=1) at main2.cpp:26:12 frame #1: 0x0000000106082e0d test_run_to_address_dwarf`a(val=1) at main2.cpp:11:16 frame #2: 0x0000000106082ee0 test_run_to_address_dwarf`main(argc=1, argv=0x00007ffee9b7d470) at main2.cpp:36:14 frame #3: 0x00007fff67d6a085 libdyld.dylib`start + 1

Hide Details

Hide Details

runCmd: process status output: Process 1905 stopped * thread #1, queue = 'com.apple.main-thread', stop reason = run to address: 0x0000000106082e66 frame #0: 0x0000000106082e66 test_run_to_address_dwarf`b(val=2) at main2.cpp:21:17 18 int b(int val) 19 { 20 int rc = c(val); -> 21 void *ptr = malloc(1024); // thread step-out of malloc into function b. ^ 22 if (!ptr) 23 return -1; 24 else

Hide Details

Hide Details

<bound method SBProcess.Kill of <lldb.SBProcess; proxy of <Swig Object of type 'lldb::SBProcess *' at 0x1069aa960> >>: success

Hide Details

PASS: LLDB (/Users/buildslave/jenkins/workspace/lldb-cmake-sanitized/lldb-build/bin/clang-11-x86_64) :: test_run_to_address_dwarf (TestThreadAPI.ThreadAPITestCase) UNSUPPORTED: LLDB (/Users/buildslave/jenkins/workspace/lldb-cmake-sanitized/lldb-build/bin/clang-11-x86_64) :: test_run_to_address_dwo (TestThreadAPI.ThreadAPITestCase) (test case does not fall in any category of interest for this run) runCmd: settings clear -all output:

Hide Details

runCmd: settings set symbols.enable-external-lookup false output:

Hide Details

runCmd: settings set target.auto-apply-fixits false output:

Hide Details

runCmd: settings set plugin.process.gdb-remote.packet-timeout 60 output:

Hide Details

runCmd: settings set symbols.clang-modules-cache-path "/Users/buildslave/jenkins/workspace/lldb-cmake-sanitized/lldb-build/lldb-test-build.noindex/module-cache-lldb/lldb-api" output:

Hide Details

runCmd: settings set use-color false output:

Hide Details

runCmd: setting set target.prefer-dynamic-value no-dynamic-values output:

Hide Details

runCmd: settings set target.env-vars ASAN_OPTIONS=detect_stack_use_after_return=1 DYLD_INSERT_LIBRARIES=/Users/buildslave/jenkins/workspace/lldb-cmake-sanitized/host-compiler/lib/clang/11.0.0/lib/darwin/libclang_rt.asan_osx_dynamic.dylib output:

Hide Details

runCmd: breakpoint list output: Current breakpoints: 1: file = 'main2.cpp', line = 21, exact_match = 0, locations = 1 1.1: where = test_run_to_address_gmodules`b(int) + 22 at main2.cpp:21:17, address = test_run_to_address_gmodules[0x0000000100000e66], unresolved, hit count = 0

Hide Details

Hide Details

Hide Details

runCmd: thread backtrace output: * thread #1, queue = 'com.apple.main-thread', stop reason = breakpoint 1.1 * frame #0: 0x0000000104b10e66 test_run_to_address_gmodules`b(val=1) at main2.cpp:21:17 frame #1: 0x0000000104b10e0d test_run_to_address_gmodules`a(val=1) at main2.cpp:11:16 frame #2: 0x0000000104b10ee0 test_run_to_address_gmodules`main(argc=1, argv=0x00007ffeeb0ef460) at main2.cpp:36:14 frame #3: 0x00007fff67d6a085 libdyld.dylib`start + 1

Hide Details

Hide Details

runCmd: breakpoint list output: Current breakpoints: 1: file = 'main2.cpp', line = 21, exact_match = 0, locations = 1 Options: disabled 1.1: where = test_run_to_address_gmodules`b(int) + 22 at main2.cpp:21:17, address = 0x0000000104b10e66, unresolved, hit count = 1

Hide Details

Hide Details

Hide Details

runCmd: thread backtrace output: * thread #1, queue = 'com.apple.main-thread', stop reason = step over * frame #0: 0x0000000104b10e9d test_run_to_address_gmodules`b(val=1) at main2.cpp:26:12 frame #1: 0x0000000104b10e0d test_run_to_address_gmodules`a(val=1) at main2.cpp:11:16 frame #2: 0x0000000104b10ee0 test_run_to_address_gmodules`main(argc=1, argv=0x00007ffeeb0ef460) at main2.cpp:36:14 frame #3: 0x00007fff67d6a085 libdyld.dylib`start + 1

Hide Details

Hide Details

runCmd: process status output: Process 1974 stopped * thread #1, queue = 'com.apple.main-thread', stop reason = run to address: 0x0000000104b10e66 frame #0: 0x0000000104b10e66 test_run_to_address_gmodules`b(val=2) at main2.cpp:21:17 18 int b(int val) 19 { 20 int rc = c(val); -> 21 void *ptr = malloc(1024); // thread step-out of malloc into function b. ^ 22 if (!ptr) 23 return -1; 24 else

Hide Details

Hide Details

<bound method SBProcess.Kill of <lldb.SBProcess; proxy of <Swig Object of type 'lldb::SBProcess *' at 0x1070922d0> >>: success

Hide Details

PASS: LLDB (/Users/buildslave/jenkins/workspace/lldb-cmake-sanitized/lldb-build/bin/clang-11-x86_64) :: test_run_to_address_gmodules (TestThreadAPI.ThreadAPITestCase) runCmd: settings clear -all output:

Hide Details

runCmd: settings set symbols.enable-external-lookup false output:

Hide Details

runCmd: settings set target.auto-apply-fixits false output:

Hide Details

runCmd: settings set plugin.process.gdb-remote.packet-timeout 60 output:

Hide Details

runCmd: settings set symbols.clang-modules-cache-path "/Users/buildslave/jenkins/workspace/lldb-cmake-sanitized/lldb-build/lldb-test-build.noindex/module-cache-lldb/lldb-api" output:

Hide Details

runCmd: settings set use-color false output:

Hide Details

runCmd: setting set target.prefer-dynamic-value no-dynamic-values output:

Hide Details

runCmd: settings set target.env-vars ASAN_OPTIONS=detect_stack_use_after_return=1 DYLD_INSERT_LIBRARIES=/Users/buildslave/jenkins/workspace/lldb-cmake-sanitized/host-compiler/lib/clang/11.0.0/lib/darwin/libclang_rt.asan_osx_dynamic.dylib output:

Hide Details

FAIL: LLDB (/Users/buildslave/jenkins/workspace/lldb-cmake-sanitized/lldb-build/bin/clang-11-x86_64) :: test_step_out_of_malloc_into_function_b_dsym (TestThreadAPI.ThreadAPITestCase) <bound method SBProcess.Kill of <lldb.SBProcess; proxy of <Swig Object of type 'lldb::SBProcess *' at 0x1069aa990> >>: success

Hide Details

runCmd: settings clear -all output:

Hide Details

runCmd: settings set symbols.enable-external-lookup false output:

Hide Details

runCmd: settings set target.auto-apply-fixits false output:

Hide Details

runCmd: settings set plugin.process.gdb-remote.packet-timeout 60 output:

Hide Details

runCmd: settings set symbols.clang-modules-cache-path "/Users/buildslave/jenkins/workspace/lldb-cmake-sanitized/lldb-build/lldb-test-build.noindex/module-cache-lldb/lldb-api" output:

Hide Details

runCmd: settings set use-color false output:

Hide Details

runCmd: setting set target.prefer-dynamic-value no-dynamic-values output:

Hide Details

runCmd: settings set target.env-vars ASAN_OPTIONS=detect_stack_use_after_return=1 DYLD_INSERT_LIBRARIES=/Users/buildslave/jenkins/workspace/lldb-cmake-sanitized/host-compiler/lib/clang/11.0.0/lib/darwin/libclang_rt.asan_osx_dynamic.dylib output:

Hide Details

FAIL: LLDB (/Users/buildslave/jenkins/workspace/lldb-cmake-sanitized/lldb-build/bin/clang-11-x86_64) :: test_step_out_of_malloc_into_function_b_dwarf (TestThreadAPI.ThreadAPITestCase) <bound method SBProcess.Kill of <lldb.SBProcess; proxy of <Swig Object of type 'lldb::SBProcess *' at 0x106e92de0> >>: success

Hide Details

UNSUPPORTED: LLDB (/Users/buildslave/jenkins/workspace/lldb-cmake-sanitized/lldb-build/bin/clang-11-x86_64) :: test_step_out_of_malloc_into_function_b_dwo (TestThreadAPI.ThreadAPITestCase) (test case does not fall in any category of interest for this run) runCmd: settings clear -all output:

Hide Details

runCmd: settings set symbols.enable-external-lookup false output:

Hide Details

runCmd: settings set target.auto-apply-fixits false output:

Hide Details

runCmd: settings set plugin.process.gdb-remote.packet-timeout 60 output:

Hide Details

runCmd: settings set symbols.clang-modules-cache-path "/Users/buildslave/jenkins/workspace/lldb-cmake-sanitized/lldb-build/lldb-test-build.noindex/module-cache-lldb/lldb-api" output:

Hide Details

runCmd: settings set use-color false output:

Hide Details

runCmd: setting set target.prefer-dynamic-value no-dynamic-values output:

Hide Details

runCmd: settings set target.env-vars ASAN_OPTIONS=detect_stack_use_after_return=1 DYLD_INSERT_LIBRARIES=/Users/buildslave/jenkins/workspace/lldb-cmake-sanitized/host-compiler/lib/clang/11.0.0/lib/darwin/libclang_rt.asan_osx_dynamic.dylib output:

Hide Details

FAIL: LLDB (/Users/buildslave/jenkins/workspace/lldb-cmake-sanitized/lldb-build/bin/clang-11-x86_64) :: test_step_out_of_malloc_into_function_b_gmodules (TestThreadAPI.ThreadAPITestCase) <bound method SBProcess.Kill of <lldb.SBProcess; proxy of <Swig Object of type 'lldb::SBProcess *' at 0x1069aa990> >>: success

Hide Details

runCmd: settings clear -all output:

Hide Details

runCmd: settings set symbols.enable-external-lookup false output:

Hide Details

runCmd: settings set target.auto-apply-fixits false output:

Hide Details

runCmd: settings set plugin.process.gdb-remote.packet-timeout 60 output:

Hide Details

runCmd: settings set symbols.clang-modules-cache-path "/Users/buildslave/jenkins/workspace/lldb-cmake-sanitized/lldb-build/lldb-test-build.noindex/module-cache-lldb/lldb-api" output:

Hide Details

runCmd: settings set use-color false output:

Hide Details

runCmd: setting set target.prefer-dynamic-value no-dynamic-values output:

Hide Details

runCmd: settings set target.env-vars ASAN_OPTIONS=detect_stack_use_after_return=1 DYLD_INSERT_LIBRARIES=/Users/buildslave/jenkins/workspace/lldb-cmake-sanitized/host-compiler/lib/clang/11.0.0/lib/darwin/libclang_rt.asan_osx_dynamic.dylib output:

Hide Details

runCmd: breakpoint list output: Current breakpoints: 1: file = 'main2.cpp', line = 21, exact_match = 0, locations = 1 1.1: where = test_step_over_3_times_dsym`b(int) + 22 at main2.cpp:21:17, address = test_step_over_3_times_dsym[0x0000000100000e66], unresolved, hit count = 0

Hide Details

Hide Details

Hide Details

runCmd: thread backtrace output: * thread #1, queue = 'com.apple.main-thread', stop reason = breakpoint 1.1 * frame #0: 0x00000001064d8e66 test_step_over_3_times_dsym`b(val=1) at main2.cpp:21:17 frame #1: 0x00000001064d8e0d test_step_over_3_times_dsym`a(val=1) at main2.cpp:11:16 frame #2: 0x00000001064d8ee0 test_step_over_3_times_dsym`main(argc=1, argv=0x00007ffee9727468) at main2.cpp:36:14 frame #3: 0x00007fff67d6a085 libdyld.dylib`start + 1 frame #4: 0x00007fff67d6a085 libdyld.dylib`start + 1

Hide Details

Hide Details

runCmd: thread backtrace output: * thread #1, queue = 'com.apple.main-thread', stop reason = step over * frame #0: 0x00000001064d8e9d test_step_over_3_times_dsym`b(val=1) at main2.cpp:26:12 frame #1: 0x00000001064d8e0d test_step_over_3_times_dsym`a(val=1) at main2.cpp:11:16 frame #2: 0x00000001064d8ee0 test_step_over_3_times_dsym`main(argc=1, argv=0x00007ffee9727468) at main2.cpp:36:14 frame #3: 0x00007fff67d6a085 libdyld.dylib`start + 1 frame #4: 0x00007fff67d6a085 libdyld.dylib`start + 1

Hide Details

Hide Details

<bound method SBProcess.Kill of <lldb.SBProcess; proxy of <Swig Object of type 'lldb::SBProcess *' at 0x106e92de0> >>: success

Hide Details

PASS: LLDB (/Users/buildslave/jenkins/workspace/lldb-cmake-sanitized/lldb-build/bin/clang-11-x86_64) :: test_step_over_3_times_dsym (TestThreadAPI.ThreadAPITestCase) runCmd: settings clear -all output:

Hide Details

runCmd: settings set symbols.enable-external-lookup false output:

Hide Details

runCmd: settings set target.auto-apply-fixits false output:

Hide Details

runCmd: settings set plugin.process.gdb-remote.packet-timeout 60 output:

Hide Details

runCmd: settings set symbols.clang-modules-cache-path "/Users/buildslave/jenkins/workspace/lldb-cmake-sanitized/lldb-build/lldb-test-build.noindex/module-cache-lldb/lldb-api" output:

Hide Details

runCmd: settings set use-color false output:

Hide Details

runCmd: setting set target.prefer-dynamic-value no-dynamic-values output:

Hide Details

runCmd: settings set target.env-vars ASAN_OPTIONS=detect_stack_use_after_return=1 DYLD_INSERT_LIBRARIES=/Users/buildslave/jenkins/workspace/lldb-cmake-sanitized/host-compiler/lib/clang/11.0.0/lib/darwin/libclang_rt.asan_osx_dynamic.dylib output:

Hide Details

runCmd: breakpoint list output: Current breakpoints: 1: file = 'main2.cpp', line = 21, exact_match = 0, locations = 1 1.1: where = test_step_over_3_times_dwarf`b(int) + 22 at main2.cpp:21:17, address = test_step_over_3_times_dwarf[0x0000000100000e66], unresolved, hit count = 0

Hide Details

Hide Details

Hide Details

runCmd: thread backtrace output: * thread #1, queue = 'com.apple.main-thread', stop reason = breakpoint 1.1 * frame #0: 0x000000010bd06e66 test_step_over_3_times_dwarf`b(val=1) at main2.cpp:21:17 frame #1: 0x000000010bd06e0d test_step_over_3_times_dwarf`a(val=1) at main2.cpp:11:16 frame #2: 0x000000010bd06ee0 test_step_over_3_times_dwarf`main(argc=1, argv=0x00007ffee3ef9460) at main2.cpp:36:14 frame #3: 0x00007fff67d6a085 libdyld.dylib`start + 1

Hide Details

Hide Details

runCmd: thread backtrace output: * thread #1, queue = 'com.apple.main-thread', stop reason = step over * frame #0: 0x000000010bd06e9d test_step_over_3_times_dwarf`b(val=1) at main2.cpp:26:12 frame #1: 0x000000010bd06e0d test_step_over_3_times_dwarf`a(val=1) at main2.cpp:11:16 frame #2: 0x000000010bd06ee0 test_step_over_3_times_dwarf`main(argc=1, argv=0x00007ffee3ef9460) at main2.cpp:36:14 frame #3: 0x00007fff67d6a085 libdyld.dylib`start + 1

Hide Details

Hide Details

<bound method SBProcess.Kill of <lldb.SBProcess; proxy of <Swig Object of type 'lldb::SBProcess *' at 0x1069aa990> >>: success

Hide Details

PASS: LLDB (/Users/buildslave/jenkins/workspace/lldb-cmake-sanitized/lldb-build/bin/clang-11-x86_64) :: test_step_over_3_times_dwarf (TestThreadAPI.ThreadAPITestCase) UNSUPPORTED: LLDB (/Users/buildslave/jenkins/workspace/lldb-cmake-sanitized/lldb-build/bin/clang-11-x86_64) :: test_step_over_3_times_dwo (TestThreadAPI.ThreadAPITestCase) (test case does not fall in any category of interest for this run) runCmd: settings clear -all output:

Hide Details

runCmd: settings set symbols.enable-external-lookup false output:

Hide Details

runCmd: settings set target.auto-apply-fixits false output:

Hide Details

runCmd: settings set plugin.process.gdb-remote.packet-timeout 60 output:

Hide Details

runCmd: settings set symbols.clang-modules-cache-path "/Users/buildslave/jenkins/workspace/lldb-cmake-sanitized/lldb-build/lldb-test-build.noindex/module-cache-lldb/lldb-api" output:

Hide Details

runCmd: settings set use-color false output:

Hide Details

runCmd: setting set target.prefer-dynamic-value no-dynamic-values output:

Hide Details

runCmd: settings set target.env-vars ASAN_OPTIONS=detect_stack_use_after_return=1 DYLD_INSERT_LIBRARIES=/Users/buildslave/jenkins/workspace/lldb-cmake-sanitized/host-compiler/lib/clang/11.0.0/lib/darwin/libclang_rt.asan_osx_dynamic.dylib output:

Hide Details

runCmd: breakpoint list output: Current breakpoints: 1: file = 'main2.cpp', line = 21, exact_match = 0, locations = 1 1.1: where = test_step_over_3_times_gmodules`b(int) + 22 at main2.cpp:21:17, address = test_step_over_3_times_gmodules[0x0000000100000e66], unresolved, hit count = 0

Hide Details

Hide Details

Hide Details

runCmd: thread backtrace output: * thread #1, queue = 'com.apple.main-thread', stop reason = breakpoint 1.1 * frame #0: 0x0000000104356e66 test_step_over_3_times_gmodules`b(val=1) at main2.cpp:21:17 frame #1: 0x0000000104356e0d test_step_over_3_times_gmodules`a(val=1) at main2.cpp:11:16 frame #2: 0x0000000104356ee0 test_step_over_3_times_gmodules`main(argc=1, argv=0x00007ffeeb8a9458) at main2.cpp:36:14 frame #3: 0x00007fff67d6a085 libdyld.dylib`start + 1 frame #4: 0x00007fff67d6a085 libdyld.dylib`start + 1

Hide Details

Hide Details

runCmd: thread backtrace output: * thread #1, queue = 'com.apple.main-thread', stop reason = step over * frame #0: 0x0000000104356e9d test_step_over_3_times_gmodules`b(val=1) at main2.cpp:26:12 frame #1: 0x0000000104356e0d test_step_over_3_times_gmodules`a(val=1) at main2.cpp:11:16 frame #2: 0x0000000104356ee0 test_step_over_3_times_gmodules`main(argc=1, argv=0x00007ffeeb8a9458) at main2.cpp:36:14 frame #3: 0x00007fff67d6a085 libdyld.dylib`start + 1 frame #4: 0x00007fff67d6a085 libdyld.dylib`start + 1

Hide Details

Hide Details

<bound method SBProcess.Kill of <lldb.SBProcess; proxy of <Swig Object of type 'lldb::SBProcess *' at 0x1070922d0> >>: success

Hide Details

PASS: LLDB (/Users/buildslave/jenkins/workspace/lldb-cmake-sanitized/lldb-build/bin/clang-11-x86_64) :: test_step_over_3_times_gmodules (TestThreadAPI.ThreadAPITestCase) Restore dir to: /Users/buildslave/jenkins/workspace/lldb-cmake-sanitized/lldb-build/tools/lldb/test ====================================================================== ERROR: test_step_out_of_malloc_into_function_b_dsym (TestThreadAPI.ThreadAPITestCase) Test Python SBThread.StepOut() API to step out of a malloc call where the call site is at function b(). ---------------------------------------------------------------------- Traceback (most recent call last): File "/Users/buildslave/jenkins/workspace/lldb-cmake-sanitized/llvm-project/lldb/packages/Python/lldbsuite/test/lldbtest.py", line 1751, in test_method return attrvalue(self) File "/Users/buildslave/jenkins/workspace/lldb-cmake-sanitized/llvm-project/lldb/packages/Python/lldbsuite/test/decorators.py", line 110, in wrapper func(*args, **kwargs) File "/Users/buildslave/jenkins/workspace/lldb-cmake-sanitized/llvm-project/lldb/packages/Python/lldbsuite/test/decorators.py", line 110, in wrapper func(*args, **kwargs) File "/Users/buildslave/jenkins/workspace/lldb-cmake-sanitized/llvm-project/lldb/packages/Python/lldbsuite/test/decorators.py", line 110, in wrapper func(*args, **kwargs) File "/Users/buildslave/jenkins/workspace/lldb-cmake-sanitized/llvm-project/lldb/test/API/python_api/thread/TestThreadAPI.py", line 50, in test_step_out_of_malloc_into_function_b self.step_out_of_malloc_into_function_b(self.exe_name) File "/Users/buildslave/jenkins/workspace/lldb-cmake-sanitized/llvm-project/lldb/test/API/python_api/thread/TestThreadAPI.py", line 157, in step_out_of_malloc_into_function_b thread.IsValid(), AttributeError: 'NoneType' object has no attribute 'IsValid' Config=x86_64-/Users/buildslave/jenkins/workspace/lldb-cmake-sanitized/lldb-build/bin/clang-11 ====================================================================== ERROR: test_step_out_of_malloc_into_function_b_dwarf (TestThreadAPI.ThreadAPITestCase) Test Python SBThread.StepOut() API to step out of a malloc call where the call site is at function b(). ---------------------------------------------------------------------- Traceback (most recent call last): File "/Users/buildslave/jenkins/workspace/lldb-cmake-sanitized/llvm-project/lldb/packages/Python/lldbsuite/test/lldbtest.py", line 1751, in test_method return attrvalue(self) File "/Users/buildslave/jenkins/workspace/lldb-cmake-sanitized/llvm-project/lldb/packages/Python/lldbsuite/test/decorators.py", line 110, in wrapper func(*args, **kwargs) File "/Users/buildslave/jenkins/workspace/lldb-cmake-sanitized/llvm-project/lldb/packages/Python/lldbsuite/test/decorators.py", line 110, in wrapper func(*args, **kwargs) File "/Users/buildslave/jenkins/workspace/lldb-cmake-sanitized/llvm-project/lldb/packages/Python/lldbsuite/test/decorators.py", line 110, in wrapper func(*args, **kwargs) File "/Users/buildslave/jenkins/workspace/lldb-cmake-sanitized/llvm-project/lldb/test/API/python_api/thread/TestThreadAPI.py", line 50, in test_step_out_of_malloc_into_function_b self.step_out_of_malloc_into_function_b(self.exe_name) File "/Users/buildslave/jenkins/workspace/lldb-cmake-sanitized/llvm-project/lldb/test/API/python_api/thread/TestThreadAPI.py", line 157, in step_out_of_malloc_into_function_b thread.IsValid(), AttributeError: 'NoneType' object has no attribute 'IsValid' Config=x86_64-/Users/buildslave/jenkins/workspace/lldb-cmake-sanitized/lldb-build/bin/clang-11 ====================================================================== ERROR: test_step_out_of_malloc_into_function_b_gmodules (TestThreadAPI.ThreadAPITestCase) Test Python SBThread.StepOut() API to step out of a malloc call where the call site is at function b(). ---------------------------------------------------------------------- Traceback (most recent call last): File "/Users/buildslave/jenkins/workspace/lldb-cmake-sanitized/llvm-project/lldb/packages/Python/lldbsuite/test/lldbtest.py", line 1751, in test_method return attrvalue(self) File "/Users/buildslave/jenkins/workspace/lldb-cmake-sanitized/llvm-project/lldb/packages/Python/lldbsuite/test/decorators.py", line 110, in wrapper func(*args, **kwargs) File "/Users/buildslave/jenkins/workspace/lldb-cmake-sanitized/llvm-project/lldb/packages/Python/lldbsuite/test/decorators.py", line 110, in wrapper func(*args, **kwargs) File "/Users/buildslave/jenkins/workspace/lldb-cmake-sanitized/llvm-project/lldb/packages/Python/lldbsuite/test/decorators.py", line 110, in wrapper func(*args, **kwargs) File "/Users/buildslave/jenkins/workspace/lldb-cmake-sanitized/llvm-project/lldb/test/API/python_api/thread/TestThreadAPI.py", line 50, in test_step_out_of_malloc_into_function_b self.step_out_of_malloc_into_function_b(self.exe_name) File "/Users/buildslave/jenkins/workspace/lldb-cmake-sanitized/llvm-project/lldb/test/API/python_api/thread/TestThreadAPI.py", line 157, in step_out_of_malloc_into_function_b thread.IsValid(), AttributeError: 'NoneType' object has no attribute 'IsValid' Config=x86_64-/Users/buildslave/jenkins/workspace/lldb-cmake-sanitized/lldb-build/bin/clang-11 ---------------------------------------------------------------------- Ran 20 tests in 40.437s

Hide Details

RESULT: FAILED (12 passes, 0 failures, 3 errors, 5 skipped, 0 expected failures, 0 unexpected successes)

Hide Details

--

Hide Details

******************** PASS: lldb-unit :: Process/minidump/./LLDBMinidumpTests/MinidumpParserTest.GetPid (931 of 1971) PASS: lldb-shell :: Reproducer/TestDiscard.test (932 of 1971) PASS: lldb-api :: types/TestDoubleTypesExpr.py (933 of 1971) PASS: lldb-api :: commands/target/create-no-such-arch/TestNoSuchArch.py (934 of 1971) PASS: lldb-api :: commands/target/dump-symtab-demangle/TestDumpSymtabDemangle.py (935 of 1971) PASS: lldb-api :: lang/cpp/stl/TestStdCXXDisassembly.py (936 of 1971) PASS: lldb-api :: functionalities/gdb_remote_client/TestThreadSelectionBug.py (937 of 1971) PASS: lldb-shell :: Reproducer/TestCaptureEnvOverride.test (938 of 1971) PASS: lldb-unit :: Language/Highlighting/./HighlighterTests/HighlighterTest.ClangPPDirectives (939 of 1971) PASS: lldb-shell :: BuildScript/modes.test (940 of 1971) PASS: lldb-unit :: Utility/./UtilityTests/StringListTest.CopyListEmpty (941 of 1971) PASS: lldb-api :: functionalities/data-formatter/data-formatter-stl/libcxx/vector/TestDataFormatterLibcxxVector.py (942 of 1971) PASS: lldb-unit :: Process/minidump/./LLDBMinidumpTests/MinidumpParserTest.GetMemoryRegionInfoLinuxMaps (943 of 1971) PASS: lldb-unit :: Utility/./UtilityTests/ListenerTest.GetEventWait (944 of 1971) PASS: lldb-api :: functionalities/data-formatter/data-formatter-python-synth/TestDataFormatterPythonSynth.py (945 of 1971) PASS: lldb-unit :: Utility/./UtilityTests/ScalarTest.GetValue (946 of 1971) PASS: lldb-unit :: Utility/./UtilityTests/UriParserTest.BadPort (947 of 1971) PASS: lldb-unit :: Utility/./UtilityTests/ArgsTest.ReplaceArgumentAtIndexOutOfRange (948 of 1971) PASS: lldb-api :: sample_test/TestSampleInlineTest.py (949 of 1971) PASS: lldb-api :: commands/expression/argument_passing_restrictions/TestArgumentPassingRestrictions.py (950 of 1971) PASS: lldb-unit :: SymbolFile/NativePDB/./SymbolFileNativePDBTests/PDBFPOProgramToDWARFExpressionTests.DependencyChain (951 of 1971) PASS: lldb-unit :: Language/Highlighting/./HighlighterTests/HighlighterTest.ClangIdentifiers (952 of 1971) PASS: lldb-api :: python_api/lldbutil/frame/TestFrameUtils.py (953 of 1971) PASS: lldb-api :: functionalities/non-overlapping-index-variable-i/TestIndexVariable.py (954 of 1971) UNSUPPORTED: lldb-api :: commands/watchpoints/hello_watchlocation/TestWatchLocation.py (955 of 1971) PASS: lldb-api :: lang/objc/foundation/TestRuntimeTypes.py (956 of 1971) PASS: lldb-unit :: Utility/./UtilityTests/StreamTest.PutHex16ByteOrderBig (957 of 1971) PASS: lldb-unit :: Utility/./UtilityTests/ScalarTest.APIntConstructor (958 of 1971) PASS: lldb-unit :: Symbol/./SymbolTests/TestTypeSystemClang.TestFunctionTemplateConstruction (959 of 1971) FAIL: lldb-api :: functionalities/ptr_refs/TestPtrRefs.py (960 of 1971) ******************** TEST 'lldb-api :: functionalities/ptr_refs/TestPtrRefs.py' FAILED ******************** Script: -- /usr/local/bin/python /Users/buildslave/jenkins/workspace/lldb-cmake-sanitized/llvm-project/lldb/test/API/dotest.py --arch x86_64 -s /Users/buildslave/jenkins/workspace/lldb-cmake-sanitized/lldb-build/lldb-test-traces -S nm -u CXXFLAGS -u CFLAGS --codesign-identity lldb_codesign --server /Users/buildslave/jenkins/workspace/lldb-cmake-sanitized/lldb-build/./bin/debugserver --arch x86_64 --build-dir /Users/buildslave/jenkins/workspace/lldb-cmake-sanitized/lldb-build/lldb-test-build.noindex -s=/Users/buildslave/jenkins/workspace/lldb-cmake-sanitized/test/logs -t --env TERM=vt100 --env LLVM_LIBS_DIR=/Users/buildslave/jenkins/workspace/lldb-cmake-sanitized/lldb-build/./lib --inferior-env ASAN_OPTIONS=detect_stack_use_after_return=1 --inferior-env DYLD_INSERT_LIBRARIES=/Users/buildslave/jenkins/workspace/lldb-cmake-sanitized/host-compiler/lib/clang/11.0.0/lib/darwin/libclang_rt.asan_osx_dynamic.dylib --build-dir /Users/buildslave/jenkins/workspace/lldb-cmake-sanitized/lldb-build/lldb-test-build.noindex --lldb-module-cache-dir /Users/buildslave/jenkins/workspace/lldb-cmake-sanitized/lldb-build/lldb-test-build.noindex/module-cache-lldb/lldb-api --clang-module-cache-dir /Users/buildslave/jenkins/workspace/lldb-cmake-sanitized/lldb-build/lldb-test-build.noindex/module-cache-clang/lldb-api --executable /Users/buildslave/jenkins/workspace/lldb-cmake-sanitized/lldb-build/./bin/lldb --compiler /Users/buildslave/jenkins/workspace/lldb-cmake-sanitized/lldb-build/./bin/clang --dsymutil /Users/buildslave/jenkins/workspace/lldb-cmake-sanitized/lldb-build/./bin/dsymutil --filecheck /Users/buildslave/jenkins/workspace/lldb-cmake-sanitized/lldb-build/./bin/FileCheck --lldb-libs-dir /Users/buildslave/jenkins/workspace/lldb-cmake-sanitized/lldb-build/./lib /Users/buildslave/jenkins/workspace/lldb-cmake-sanitized/llvm-project/lldb/test/API/functionalities/ptr_refs -p TestPtrRefs.py -- Exit Code: 1

Hide Details

Command Output (stdout): -- lldb version 11.0.99 clang revision 2c080a3f23e49edddb0799a569d7d3319fc91d86 llvm revision 2c080a3f23e49edddb0799a569d7d3319fc91d86 "crashlog" and "save_crashlog" command installed, use the "--help" option for detailed help "malloc_info", "ptr_refs", "cstr_refs", "find_variable", and "objc_refs" commands have been installed, use the "--help" options on these commands for detailed help. LLDB library dir: /Users/buildslave/jenkins/workspace/lldb-cmake-sanitized/lldb-build/bin LLDB import library dir: /Users/buildslave/jenkins/workspace/lldb-cmake-sanitized/lldb-build/./lib libstdcxx tests will not be run because: Don't know how to build with libstdcxx on macosx Skipping following debug info categories: ['dwo'] 0x00007ffee9c97478: stack in frame #0 of thread #1: tid 0x6ae5e1 in variable at 0x7ffee9c97478: (const char *) my_ptr = 0x00006020000000b0 "hello" 0x00007ffee9c97410: stack (red zone)

Hide Details

-- Command Output (stderr): -- error: 'ptr_refs' is not a valid command. error: 'ptr_refs' is not a valid command.

Hide Details

Session logs for test failures/errors/unexpected successes will go into directory '/Users/buildslave/jenkins/workspace/lldb-cmake-sanitized/test/logs' Command invoked: /Users/buildslave/jenkins/workspace/lldb-cmake-sanitized/llvm-project/lldb/test/API/dotest.py --arch x86_64 -s /Users/buildslave/jenkins/workspace/lldb-cmake-sanitized/lldb-build/lldb-test-traces -S nm -u CXXFLAGS -u CFLAGS --codesign-identity lldb_codesign --server /Users/buildslave/jenkins/workspace/lldb-cmake-sanitized/lldb-build/./bin/debugserver --arch x86_64 --build-dir /Users/buildslave/jenkins/workspace/lldb-cmake-sanitized/lldb-build/lldb-test-build.noindex -s=/Users/buildslave/jenkins/workspace/lldb-cmake-sanitized/test/logs -t --env TERM=vt100 --env LLVM_LIBS_DIR=/Users/buildslave/jenkins/workspace/lldb-cmake-sanitized/lldb-build/./lib --inferior-env ASAN_OPTIONS=detect_stack_use_after_return=1 --inferior-env DYLD_INSERT_LIBRARIES=/Users/buildslave/jenkins/workspace/lldb-cmake-sanitized/host-compiler/lib/clang/11.0.0/lib/darwin/libclang_rt.asan_osx_dynamic.dylib --build-dir /Users/buildslave/jenkins/workspace/lldb-cmake-sanitized/lldb-build/lldb-test-build.noindex --lldb-module-cache-dir /Users/buildslave/jenkins/workspace/lldb-cmake-sanitized/lldb-build/lldb-test-build.noindex/module-cache-lldb/lldb-api --clang-module-cache-dir /Users/buildslave/jenkins/workspace/lldb-cmake-sanitized/lldb-build/lldb-test-build.noindex/module-cache-clang/lldb-api --executable /Users/buildslave/jenkins/workspace/lldb-cmake-sanitized/lldb-build/./bin/lldb --compiler /Users/buildslave/jenkins/workspace/lldb-cmake-sanitized/lldb-build/./bin/clang --dsymutil /Users/buildslave/jenkins/workspace/lldb-cmake-sanitized/lldb-build/./bin/dsymutil --filecheck /Users/buildslave/jenkins/workspace/lldb-cmake-sanitized/lldb-build/./bin/FileCheck --lldb-libs-dir /Users/buildslave/jenkins/workspace/lldb-cmake-sanitized/lldb-build/./lib /Users/buildslave/jenkins/workspace/lldb-cmake-sanitized/llvm-project/lldb/test/API/functionalities/ptr_refs -p TestPtrRefs.py Change dir to: /Users/buildslave/jenkins/workspace/lldb-cmake-sanitized/llvm-project/lldb/test/API/functionalities/ptr_refs runCmd: settings clear -all output:

Hide Details

runCmd: settings set symbols.enable-external-lookup false output:

Hide Details

runCmd: settings set target.auto-apply-fixits false output:

Hide Details

runCmd: settings set plugin.process.gdb-remote.packet-timeout 60 output:

Hide Details

runCmd: settings set symbols.clang-modules-cache-path "/Users/buildslave/jenkins/workspace/lldb-cmake-sanitized/lldb-build/lldb-test-build.noindex/module-cache-lldb/lldb-api" output:

Hide Details

runCmd: settings set use-color false output:

Hide Details

runCmd: setting set target.prefer-dynamic-value no-dynamic-values output:

Hide Details

runCmd: settings set target.env-vars ASAN_OPTIONS=detect_stack_use_after_return=1 DYLD_INSERT_LIBRARIES=/Users/buildslave/jenkins/workspace/lldb-cmake-sanitized/host-compiler/lib/clang/11.0.0/lib/darwin/libclang_rt.asan_osx_dynamic.dylib output:

Hide Details

runCmd: script import lldb.macosx.heap output: "crashlog" and "save_crashlog" command installed, use the "--help" option for detailed help "malloc_info", "ptr_refs", "cstr_refs", "find_variable", and "objc_refs" commands have been installed, use the "--help" options on these commands for detailed help.

Hide Details

Hide Details

runCmd: ptr_refs my_ptr output: 0x00007ffee9c97478: stack in frame #0 of thread #1: tid 0x6ae5e1 in variable at 0x7ffee9c97478: (const char *) my_ptr = 0x00006020000000b0 "hello" 0x00007ffee9c97410: stack (red zone)

Hide Details

Hide Details

Expecting sub string: malloc Not matched

Hide Details

FAIL: LLDB (/Users/buildslave/jenkins/workspace/lldb-cmake-sanitized/lldb-build/bin/clang-11-x86_64) :: test_ptr_refs_dsym (TestPtrRefs.TestPtrRefs) <bound method SBProcess.Kill of <lldb.SBProcess; proxy of <Swig Object of type 'lldb::SBProcess *' at 0x112c0a8a0> >>: success

Hide Details

runCmd: settings clear -all output:

Hide Details

runCmd: settings set symbols.enable-external-lookup false output:

Hide Details

runCmd: settings set target.auto-apply-fixits false output:

Hide Details

runCmd: settings set plugin.process.gdb-remote.packet-timeout 60 output:

Hide Details

runCmd: settings set symbols.clang-modules-cache-path "/Users/buildslave/jenkins/workspace/lldb-cmake-sanitized/lldb-build/lldb-test-build.noindex/module-cache-lldb/lldb-api" output:

Hide Details

runCmd: settings set use-color false output:

Hide Details

runCmd: setting set target.prefer-dynamic-value no-dynamic-values output:

Hide Details

runCmd: settings set target.env-vars ASAN_OPTIONS=detect_stack_use_after_return=1 DYLD_INSERT_LIBRARIES=/Users/buildslave/jenkins/workspace/lldb-cmake-sanitized/host-compiler/lib/clang/11.0.0/lib/darwin/libclang_rt.asan_osx_dynamic.dylib output:

Hide Details

runCmd: script import lldb.macosx.heap output:

Hide Details

runCmd: ptr_refs my_ptr runCmd failed! error: 'ptr_refs' is not a valid command.

Hide Details

Hide Details

XFAIL: LLDB (/Users/buildslave/jenkins/workspace/lldb-cmake-sanitized/lldb-build/bin/clang-11-x86_64) :: test_ptr_refs_dwarf (TestPtrRefs.TestPtrRefs) <bound method SBProcess.Kill of <lldb.SBProcess; proxy of <Swig Object of type 'lldb::SBProcess *' at 0x111fc0990> >>: success

Hide Details

UNSUPPORTED: LLDB (/Users/buildslave/jenkins/workspace/lldb-cmake-sanitized/lldb-build/bin/clang-11-x86_64) :: test_ptr_refs_dwo (TestPtrRefs.TestPtrRefs) (test case does not fall in any category of interest for this run) runCmd: settings clear -all output:

Hide Details

runCmd: settings set symbols.enable-external-lookup false output:

Hide Details

runCmd: settings set target.auto-apply-fixits false output:

Hide Details

runCmd: settings set plugin.process.gdb-remote.packet-timeout 60 output:

Hide Details

runCmd: settings set symbols.clang-modules-cache-path "/Users/buildslave/jenkins/workspace/lldb-cmake-sanitized/lldb-build/lldb-test-build.noindex/module-cache-lldb/lldb-api" output:

Hide Details

runCmd: settings set use-color false output:

Hide Details

runCmd: setting set target.prefer-dynamic-value no-dynamic-values output:

Hide Details

runCmd: settings set target.env-vars ASAN_OPTIONS=detect_stack_use_after_return=1 DYLD_INSERT_LIBRARIES=/Users/buildslave/jenkins/workspace/lldb-cmake-sanitized/host-compiler/lib/clang/11.0.0/lib/darwin/libclang_rt.asan_osx_dynamic.dylib output:

Hide Details

runCmd: script import lldb.macosx.heap output:

Hide Details

runCmd: ptr_refs my_ptr runCmd failed! error: 'ptr_refs' is not a valid command.

Hide Details

Hide Details

XFAIL: LLDB (/Users/buildslave/jenkins/workspace/lldb-cmake-sanitized/lldb-build/bin/clang-11-x86_64) :: test_ptr_refs_gmodules (TestPtrRefs.TestPtrRefs) <bound method SBProcess.Kill of <lldb.SBProcess; proxy of <Swig Object of type 'lldb::SBProcess *' at 0x112c0a1e0> >>: success

Hide Details

Restore dir to: /Users/buildslave/jenkins/workspace/lldb-cmake-sanitized/lldb-build/tools/lldb/test ====================================================================== FAIL: test_ptr_refs_dsym (TestPtrRefs.TestPtrRefs) Test format string functionality. ---------------------------------------------------------------------- Traceback (most recent call last): File "/Users/buildslave/jenkins/workspace/lldb-cmake-sanitized/llvm-project/lldb/packages/Python/lldbsuite/test/lldbtest.py", line 1751, in test_method return attrvalue(self) File "/Users/buildslave/jenkins/workspace/lldb-cmake-sanitized/llvm-project/lldb/packages/Python/lldbsuite/test/decorators.py", line 110, in wrapper func(*args, **kwargs) File "/Users/buildslave/jenkins/workspace/lldb-cmake-sanitized/llvm-project/lldb/test/API/functionalities/ptr_refs/TestPtrRefs.py", line 47, in test_ptr_refs self.expect("ptr_refs my_ptr", substrs=["malloc", "stack"]) File "/Users/buildslave/jenkins/workspace/lldb-cmake-sanitized/llvm-project/lldb/packages/Python/lldbsuite/test/lldbtest.py", line 2391, in expect if msg else EXP_MSG(str, output, exe)) AssertionError: False is not True : 'ptr_refs my_ptr' returns expected result, got '0x00007ffee9c97478: stack in frame #0 of thread #1: tid 0x6ae5e1 in variable at 0x7ffee9c97478: (const char *) my_ptr = 0x00006020000000b0 "hello" 0x00007ffee9c97410: stack (red zone)' Config=x86_64-/Users/buildslave/jenkins/workspace/lldb-cmake-sanitized/lldb-build/bin/clang-11 ---------------------------------------------------------------------- Ran 4 tests in 8.305s

Hide Details

RESULT: FAILED (0 passes, 1 failures, 0 errors, 1 skipped, 2 expected failures, 0 unexpected successes)

Hide Details

--

Hide Details

******************** PASS: lldb-api :: tools/lldb-vscode/variables/TestVSCode_variables.py (961 of 1971) UNSUPPORTED: lldb-api :: functionalities/thread/create_during_step/TestCreateDuringStep.py (962 of 1971) PASS: lldb-api :: lang/objc/print-obj/TestPrintObj.py (963 of 1971) PASS: lldb-shell :: ObjectFile/ELF/build-id-case.yaml (964 of 1971) UNSUPPORTED: lldb-api :: functionalities/breakpoint/breakpoint_in_delayslot/TestAvoidBreakpointInDelaySlot.py (965 of 1971) PASS: lldb-unit :: ObjectFile/ELF/./ObjectFileELFTests/ObjectFileELFTest.SectionsResolveConsistently (966 of 1971) PASS: lldb-unit :: Host/./HostTests/NativeProcessProtocolTest.ReadMemoryWithoutTrap (967 of 1971) PASS: lldb-unit :: Expression/./ExpressionTests/DiagnosticManagerTest.HasFixits (968 of 1971) PASS: lldb-api :: functionalities/inferior-changed/TestInferiorChanged.py (969 of 1971) PASS: lldb-unit :: Utility/./UtilityTests/BinaryStreamTest.PutSLEB128FiveBytes (970 of 1971) UNSUPPORTED: lldb-shell :: SymbolFile/PDB/compilands.test (971 of 1971) PASS: lldb-shell :: SymbolFile/NativePDB/ast-methods.cpp (972 of 1971) PASS: lldb-api :: functionalities/tail_call_frames/sbapi_support/TestTailCallFrameSBAPI.py (973 of 1971) PASS: lldb-api :: functionalities/postmortem/elf-core/TestLinuxCore.py (974 of 1971) PASS: lldb-api :: functionalities/signal/handle-abrt/TestHandleAbort.py (975 of 1971) PASS: lldb-api :: python_api/value/change_values/TestChangeValueAPI.py (976 of 1971) PASS: lldb-unit :: Utility/./UtilityTests/StatusTest.Formatv (977 of 1971) PASS: lldb-shell :: SymbolFile/DWARF/forward-declarations.s (978 of 1971) PASS: lldb-unit :: Utility/./UtilityTests/AnsiTerminal.KnownPrefix (979 of 1971) PASS: lldb-unit :: Process/gdb-remote/./ProcessGdbRemoteTests/GDBRemoteCommunicationServerTest.SendErrorResponse_ErrorList (980 of 1971) UNSUPPORTED: lldb-shell :: SymbolFile/NativePDB/ast-functions-msvc.cpp (981 of 1971) PASS: lldb-unit :: Utility/./UtilityTests/RangeTest.DoesIntersect (982 of 1971) PASS: lldb-api :: functionalities/signal/raise/TestRaise.py (983 of 1971) PASS: lldb-api :: commands/quit/TestQuit.py (984 of 1971) PASS: lldb-unit :: SymbolFile/NativePDB/./SymbolFileNativePDBTests/PDBFPOProgramToDWARFExpressionTests.UnsupportedRASearch (985 of 1971) PASS: lldb-unit :: UnwindAssembly/x86/./UnwindAssemblyx86Tests/Testx86AssemblyInspectionEngine.TestPopRBPWithREX (986 of 1971) PASS: lldb-api :: functionalities/thread/concurrent_events/TestConcurrentCrashWithWatchpoint.py (987 of 1971) PASS: lldb-shell :: SymbolFile/DWARF/DW_AT_loclists_base.s (988 of 1971) PASS: lldb-api :: functionalities/data-formatter/data-formatter-stl/libcxx/initializerlist/TestInitializerList.py (989 of 1971) PASS: lldb-shell :: ObjectFile/ELF/section-addresses.yaml (990 of 1971) PASS: lldb-api :: commands/command/invalid-args/TestInvalidArgsCommand.py (991 of 1971) UNSUPPORTED: lldb-shell :: ObjectFile/PECOFF/disassemble-thumb.yaml (992 of 1971) PASS: lldb-api :: functionalities/inferior-crashing/TestInferiorCrashing.py (993 of 1971) PASS: lldb-api :: arm/emulation/TestEmulations.py (994 of 1971) PASS: lldb-api :: functionalities/data-formatter/data-formatter-objc/nsindexpath/TestDataFormatterNSIndexPath.py (995 of 1971) PASS: lldb-api :: functionalities/breakpoint/breakpoint_options/TestBreakpointOptions.py (996 of 1971) PASS: lldb-api :: commands/source/info/TestSourceInfo.py (997 of 1971) PASS: lldb-shell :: SymbolFile/DWARF/anon_class_w_and_wo_export_symbols.ll (998 of 1971) PASS: lldb-unit :: Utility/./UtilityTests/VMRange.Comparison (999 of 1971) PASS: lldb-unit :: Utility/./UtilityTests/OptionsWithRawTest.UnterminatedQuote (1000 of 1971) PASS: lldb-shell :: Register/x86-64-gp-read.test (1001 of 1971) UNSUPPORTED: lldb-api :: lang/objc/objc-dynamic-value/TestObjCDynamicValue.py (1002 of 1971) PASS: lldb-api :: commands/expression/import-std-module/no-std-module/TestMissingStdModule.py (1003 of 1971) PASS: lldb-unit :: Utility/./UtilityTests/UriParserTest.BracketedHostname (1004 of 1971) PASS: lldb-api :: tools/lldb-server/commandline/TestStubSetSID.py (1005 of 1971) PASS: lldb-api :: commands/expression/completion-in-lambda-and-unnamed-class/TestCompletionInLambdaAndUnnamedClass.py (1006 of 1971) UNSUPPORTED: lldb-api :: functionalities/data-formatter/data-formatter-stl/libstdcpp/iterator/TestDataFormatterStdIterator.py (1007 of 1971) PASS: lldb-unit :: Utility/./UtilityTests/NameMatchesTest.Contains (1008 of 1971) UNSUPPORTED: lldb-shell :: Register/x86-64-gp-write.test (1009 of 1971) PASS: lldb-unit :: Process/gdb-remote/./ProcessGdbRemoteTests/GDBRemoteCommunicationServerTest.SendErrorResponse_ErrorNumber (1010 of 1971) PASS: lldb-api :: macosx/load-kext/TestLoadKext.py (1011 of 1971) PASS: lldb-unit :: SymbolFile/NativePDB/./SymbolFileNativePDBTests/PDBFPOProgramToDWARFExpressionTests.UnresolvedRegisterAssignmentReference (1012 of 1971) PASS: lldb-api :: commands/expression/import_builtin_fileid/TestImportBuiltinFileID.py (1013 of 1971) PASS: lldb-api :: functionalities/data-formatter/data-formatter-stl/libcxx/queue/TestDataFormatterLibcxxQueue.py (1014 of 1971) PASS: lldb-api :: functionalities/paths/TestPaths.py (1015 of 1971) PASS: lldb-shell :: Driver/TestConvenienceVariables.test (1016 of 1971) PASS: lldb-unit :: Utility/./UtilityTests/StringExtractorTest.GetHexBytesAvail (1017 of 1971) PASS: lldb-unit :: Utility/./UtilityTests/StringListTest.ShiftCString (1018 of 1971) PASS: lldb-unit :: UnwindAssembly/x86/./UnwindAssemblyx86Tests/Testx86AssemblyInspectionEngine.TestPushECX (1019 of 1971) PASS: lldb-api :: python_api/function_symbol/TestSymbolAPI.py (1020 of 1971) PASS: lldb-unit :: Language/Highlighting/./HighlighterTests/HighlighterTest.ClangComments (1021 of 1971) PASS: lldb-unit :: Utility/./UtilityTests/StreamTest.AddressRange (1022 of 1971) PASS: lldb-api :: lang/cpp/accelerator-table/TestCPPAccelerator.py (1023 of 1971) PASS: lldb-unit :: SymbolFile/DWARF/./SymbolFileDWARFTests/SymbolFileDWARFTests.TestAbbrevOrder1Start5 (1024 of 1971) PASS: lldb-unit :: Interpreter/./InterpreterTests/OptionArgParserTest.toBoolean (1025 of 1971) PASS: lldb-api :: lang/cpp/class-template-parameter-pack/TestClassTemplateParameterPack.py (1026 of 1971) PASS: lldb-unit :: Core/./LLDBCoreTests/RichManglingContextTest.FromCxxMethodName (1027 of 1971) PASS: lldb-api :: functionalities/postmortem/minidump-new/TestMiniDumpNew.py (1028 of 1971) PASS: lldb-shell :: ObjectFile/ELF/PT_TLS-overlap-PT_LOAD.yaml (1029 of 1971) PASS: lldb-api :: commands/expression/import-std-module/forward_list/TestForwardListFromStdModule.py (1030 of 1971) PASS: lldb-shell :: SymbolFile/DWARF/debug_line-relative_path.s (1031 of 1971) PASS: lldb-api :: functionalities/breakpoint/breakpoint_command/TestBreakpointCommandsFromPython.py (1032 of 1971) PASS: lldb-api :: tools/lldb-vscode/breakpoint/TestVSCode_setFunctionBreakpoints.py (1033 of 1971) PASS: lldb-unit :: Utility/./UtilityTests/VMRange.IsValid (1034 of 1971) PASS: lldb-api :: lang/c/find_struct_type/TestFindStructTypes.py (1035 of 1971) PASS: lldb-unit :: Utility/./UtilityTests/SerializationRountripTest.SerializeDeserializeCString (1036 of 1971) PASS: lldb-api :: tools/lldb-server/register-reading/TestGdbRemoteGPacket.py (1037 of 1971) PASS: lldb-unit :: debugserver/./debugserverTests/RNBSocket.LoopBackListenIPv4 (1038 of 1971) PASS: lldb-unit :: Utility/./UtilityTests/StringLexerTest.NextIfList (1039 of 1971) PASS: lldb-unit :: Symbol/./SymbolTests/TestTypeSystemClang.TestConvertAccessTypeToAccessSpecifier (1040 of 1971) PASS: lldb-api :: types/TestFloatTypesExpr.py (1041 of 1971) PASS: lldb-shell :: SymbolFile/symbol-binding.test (1042 of 1971) PASS: lldb-shell :: SymbolFile/DWARF/dwp.s (1043 of 1971) PASS: lldb-unit :: Utility/./UtilityTests/SerializationRountripTest.SerializeDeserializeObjectReference (1044 of 1971) PASS: lldb-api :: functionalities/data-formatter/nsdictionarysynth/TestNSDictionarySynthetic.py (1045 of 1971) PASS: lldb-unit :: ScriptInterpreter/Python/./ScriptInterpreterPythonTests/PythonDataObjectsTest.TestPythonTupleInitializerList2 (1046 of 1971) PASS: lldb-unit :: Utility/./UtilityTests/LogChannelTest.Disable (1047 of 1971) PASS: lldb-unit :: Host/./HostTests/SocketTest.TCPGetAddress (1048 of 1971) PASS: lldb-api :: lang/cpp/constructors/TestCppConstructors.py (1049 of 1971) PASS: lldb-unit :: Core/./LLDBCoreTests/RichManglingContextTest.Basic (1050 of 1971) PASS: lldb-unit :: Platform/./LLDBPlatformTests/PlatformDarwinTest.FindXcodeContentsDirectoryInPath (1051 of 1971) PASS: lldb-api :: lang/cpp/unicode-literals/TestUnicodeLiterals.py (1052 of 1971) PASS: lldb-api :: macosx/version_zero/TestGetVersionZeroVersion.py (1053 of 1971) PASS: lldb-api :: functionalities/data-formatter/data-formatter-stl/libstdcpp/unique_ptr/invalid/TestDataFormatterInvalidStdUniquePtr.py (1054 of 1971) PASS: lldb-api :: functionalities/multiword-commands/TestMultiWordCommands.py (1055 of 1971) PASS: lldb-unit :: Utility/./UtilityTests/StringListTest.PopBack (1056 of 1971) PASS: lldb-api :: tools/lldb-server/TestGdbRemoteRegisterState.py (1057 of 1971) PASS: lldb-api :: functionalities/avoids-fd-leak/TestFdLeak.py (1058 of 1971) PASS: lldb-shell :: Commands/command-source.test (1059 of 1971) UNSUPPORTED: lldb-shell :: Register/arm-fp-read.test (1060 of 1971) PASS: lldb-unit :: Utility/./UtilityTests/Flags.Test (1061 of 1971) PASS: lldb-unit :: Utility/./UtilityTests/FileSpecTest.EqualDotsPosix (1062 of 1971) PASS: lldb-unit :: Utility/./UtilityTests/RegularExpression.CopyAssignment (1063 of 1971) PASS: lldb-shell :: Minidump/fb-dump.test (1064 of 1971) PASS: lldb-api :: python_api/value_var_update/TestValueVarUpdate.py (1065 of 1971) PASS: lldb-api :: commands/platform/basic/TestPlatformPython.py (1066 of 1971) PASS: lldb-api :: functionalities/data-formatter/user-format-vs-summary/TestUserFormatVsSummary.py (1067 of 1971) PASS: lldb-api :: functionalities/breakpoint/debugbreak/TestDebugBreak.py (1068 of 1971) PASS: lldb-unit :: Process/minidump/./LLDBMinidumpTests/MinidumpParserTest.GetMemoryRegionInfoFromMemory64List (1069 of 1971) PASS: lldb-shell :: SymbolFile/DWARF/dir-separator-windows.s (1070 of 1971) PASS: lldb-unit :: Utility/./UtilityTests/RangeTest.SetRangeBase (1071 of 1971) PASS: lldb-unit :: Utility/./UtilityTests/ConstStringTest.YAML (1072 of 1971) PASS: lldb-unit :: Utility/./UtilityTests/CompletionRequest.DuplicateFilteringWithComments (1073 of 1971) PASS: lldb-api :: functionalities/data-formatter/boolreference/TestFormattersBoolRefPtr.py (1074 of 1971) PASS: lldb-unit :: Symbol/./SymbolTests/DWARFCallFrameInfoTest.Basic_eh (1075 of 1971) PASS: lldb-unit :: Utility/./UtilityTests/VASprintfTest.NoBufferResize (1076 of 1971) PASS: lldb-unit :: UnwindAssembly/x86/./UnwindAssemblyx86Tests/Testx86AssemblyInspectionEngine.TestStackRealign8BitDisp_i386 (1077 of 1971) PASS: lldb-api :: commands/expression/expr-in-syscall/TestExpressionInSyscall.py (1078 of 1971) PASS: lldb-shell :: SymbolFile/DWARF/dwp-debug-types.s (1079 of 1971) UNSUPPORTED: lldb-api :: lang/objc/foundation/TestFoundationDisassembly.py (1080 of 1971) PASS: lldb-shell :: ObjectFile/Breakpad/sections.test (1081 of 1971) PASS: lldb-shell :: Minidump/no-process-id.yaml (1082 of 1971) PASS: lldb-unit :: Process/minidump/./LLDBMinidumpTests/MinidumpParserTest.GetMemory (1083 of 1971) PASS: lldb-shell :: SymbolFile/NativePDB/s_constant.cpp (1084 of 1971) UNSUPPORTED: lldb-api :: tools/lldb-server/TestGdbRemoteModuleInfo.py (1085 of 1971) PASS: lldb-unit :: Process/gdb-remote/./ProcessGdbRemoteTests/GDBRemoteCommunicationClientTest.TestPacketSpeedJSON (1086 of 1971) PASS: lldb-unit :: ScriptInterpreter/Python/./ScriptInterpreterPythonTests/PythonDataObjectsTest.TestPythonCallableInvoke (1087 of 1971) PASS: lldb-api :: commands/settings/TestSettings.py (1088 of 1971) PASS: lldb-unit :: Utility/./UtilityTests/StreamTest.AddressSize (1089 of 1971) PASS: lldb-unit :: Utility/./UtilityTests/ProcessInstanceInfo.DumpTable_invalidUID (1090 of 1971) PASS: lldb-api :: commands/expression/ignore-artificial-constructors/TestIgnoreArtificialConstructors.py (1091 of 1971) PASS: lldb-unit :: Expression/./ExpressionTests/DiagnosticManagerTest.FixedExpression (1092 of 1971) PASS: lldb-unit :: Utility/./UtilityTests/BinaryStreamTest.PutSLEB128FourBytes (1093 of 1971) PASS: lldb-shell :: SymbolFile/DWARF/debug-types-address-ranges.s (1094 of 1971) PASS: lldb-api :: functionalities/value_md5_crash/TestValueMD5Crash.py (1095 of 1971) PASS: lldb-unit :: Host/./HostTests/HostInfoTest.GetHostname (1096 of 1971) PASS: lldb-unit :: Process/minidump/./LLDBMinidumpTests/MinidumpParserTest.InvalidMinidump (1097 of 1971) PASS: lldb-api :: commands/log/invalid-args/TestInvalidArgsLog.py (1098 of 1971) PASS: lldb-api :: commands/expression/codegen-crash-typedefdecl-not-in_declcontext/TestCodegenCrashTypedefDeclNotInDeclContext.py (1099 of 1971) PASS: lldb-unit :: Utility/./UtilityTests/CompletionRequest.ShiftArguments (1100 of 1971) PASS: lldb-api :: python_api/lldbutil/iter/TestRegistersIterator.py (1101 of 1971) PASS: lldb-api :: functionalities/data-formatter/data-formatter-objc/TestDataFormatterObjCNSContainer.py (1102 of 1971) PASS: lldb-unit :: Utility/./UtilityTests/StringListTest.AppendStringStdString (1103 of 1971) PASS: lldb-unit :: ScriptInterpreter/Python/./ScriptInterpreterPythonTests/PythonDataObjectsTest.TestPythonBoolean (1104 of 1971) PASS: lldb-api :: tools/lldb-server/TestGdbRemoteHostInfo.py (1105 of 1971) PASS: lldb-api :: functionalities/breakpoint/breakpoint_set_restart/TestBreakpointSetRestart.py (1106 of 1971) PASS: lldb-api :: tools/lldb-vscode/breakpoint/TestVSCode_setBreakpoints.py (1107 of 1971) UNSUPPORTED: lldb-shell :: SymbolFile/PDB/type-quals.test (1108 of 1971) PASS: lldb-unit :: Utility/./UtilityTests/ReproducerTest.SetReplay (1109 of 1971) PASS: lldb-api :: functionalities/archives/TestBSDArchives.py (1110 of 1971) UNSUPPORTED: lldb-api :: benchmarks/continue/TestBenchmarkContinue.py (1111 of 1971) PASS: lldb-api :: lang/objc/objc_direct-methods/TestObjCDirectMethods.py (1112 of 1971) PASS: lldb-shell :: Settings/TestSettingsSet.test (1113 of 1971) PASS: lldb-unit :: Utility/./UtilityTests/StringLexerTest.NextIf (1114 of 1971) PASS: lldb-unit :: Utility/./UtilityTests/StreamTest.AddressRangeEmptyRange (1115 of 1971) PASS: lldb-api :: macosx/indirect_symbol/TestIndirectSymbols.py (1116 of 1971) PASS: lldb-unit :: Utility/./UtilityTests/FileSpecTest.OperatorBool (1117 of 1971) PASS: lldb-shell :: ObjectFile/PECOFF/symbol.yaml (1118 of 1971) PASS: lldb-unit :: Host/./HostTests/SocketTest.DomainListenConnectAccept (1119 of 1971) PASS: lldb-unit :: ScriptInterpreter/Python/./ScriptInterpreterPythonTests/PythonDataObjectsTest.TestPythonListManipulation (1120 of 1971) PASS: lldb-unit :: ScriptInterpreter/Python/./ScriptInterpreterPythonTests/PythonDataObjectsTest.TestPythonString (1121 of 1971) PASS: lldb-api :: commands/expression/import-std-module/empty-module/TestEmptyStdModule.py (1122 of 1971) PASS: lldb-unit :: ScriptInterpreter/Python/./ScriptInterpreterPythonTests/PythonDataObjectsTest.TestPythonBytes (1123 of 1971) PASS: lldb-unit :: Utility/./UtilityTests/BinaryStreamTest.PutULEB128SixBytes (1124 of 1971) PASS: lldb-shell :: Reproducer/TestGDBRemoteRepro.test (1125 of 1971) PASS: lldb-unit :: Utility/./UtilityTests/BroadcasterTest.BroadcastEvent (1126 of 1971) PASS: lldb-unit :: Language/Highlighting/./HighlighterTests/HighlighterTest.ClangCursorPosAfterOtherToken (1127 of 1971) PASS: lldb-api :: python_api/lldbutil/process/TestPrintStackTraces.py (1128 of 1971) PASS: lldb-api :: lang/objc/modules-hash-mismatch/TestClangModulesHashMismatch.py (1129 of 1971) PASS: lldb-unit :: Utility/./UtilityTests/StringExtractorTest.GetHexU8_Exact_NoEof (1130 of 1971) PASS: lldb-shell :: SymbolFile/Breakpad/stack-cfi-parsing.test (1131 of 1971) PASS: lldb-unit :: Utility/./UtilityTests/ArgsTest.TestSingleArgWithQuotedSpace (1132 of 1971) PASS: lldb-unit :: Platform/./LLDBPlatformTests/PlatformDarwinTest.FindComponentInPath (1133 of 1971) PASS: lldb-api :: functionalities/data-formatter/hexcaps/TestDataFormatterHexCaps.py (1134 of 1971) PASS: lldb-shell :: SymbolFile/DWARF/dwarf5-partial-index.cpp (1135 of 1971) PASS: lldb-api :: commands/frame/select/TestFrameSelect.py (1136 of 1971) PASS: lldb-unit :: Utility/./UtilityTests/ArchSpecTest.MergeFrom (1137 of 1971) PASS: lldb-unit :: Utility/./UtilityTests/RangeDataVector.FindEntryIndexesThatContain (1138 of 1971) PASS: lldb-unit :: Utility/./UtilityTests/StreamTest.PutRawBytesToMixedEndian (1139 of 1971) PASS: lldb-unit :: Signals/./SignalsTests/UnixSignalsTest.GetInfo (1140 of 1971) PASS: lldb-unit :: Utility/./UtilityTests/OptionsWithRawTest.WhitespaceInput (1141 of 1971) PASS: lldb-api :: macosx/duplicate-archive-members/TestDuplicateMembers.py (1142 of 1971) PASS: lldb-shell :: ObjectFile/ELF/netbsd-core-amd64.test (1143 of 1971) PASS: lldb-api :: lang/cpp/bool/TestCPPBool.py (1144 of 1971) PASS: lldb-unit :: Process/minidump/./LLDBMinidumpTests/MinidumpParserTest.FindMemoryRangeWithFullMemoryMinidump (1145 of 1971) PASS: lldb-unit :: Utility/./UtilityTests/StringExtractorTest.GetNameColonValueContainsColon (1146 of 1971) PASS: lldb-api :: commands/expression/import-std-module/conflicts/TestStdModuleWithConflicts.py (1147 of 1971) PASS: lldb-api :: python_api/file_handle/TestFileHandle.py (1148 of 1971) PASS: lldb-api :: commands/command/history/TestCommandHistory.py (1149 of 1971) PASS: lldb-api :: python_api/interpreter/TestRunCommandInterpreterAPI.py (1150 of 1971) PASS: lldb-unit :: SymbolFile/NativePDB/./SymbolFileNativePDBTests/PDBFPOProgramToDWARFExpressionTests.UnresolvedDependentCyclicRegisterAssignmentReference (1151 of 1971) PASS: lldb-api :: commands/platform/process/list/TestProcessList.py (1152 of 1971) PASS: lldb-unit :: Utility/./UtilityTests/StringExtractorTest.GetU32LittleEndian (1153 of 1971) UNSUPPORTED: lldb-api :: commands/gui/basic/TestGuiBasic.py (1154 of 1971) PASS: lldb-api :: functionalities/thread/concurrent_events/TestConcurrentSignalNWatchNBreak.py (1155 of 1971) UNSUPPORTED: lldb-shell :: ScriptInterpreter/Lua/persistent_state.test (1156 of 1971) PASS: lldb-unit :: Utility/./UtilityTests/SubsystemRAIITest.NormalSubsystem (1157 of 1971) PASS: lldb-api :: lang/objc/objc-ivar-stripped/TestObjCIvarStripped.py (1158 of 1971) PASS: lldb-unit :: Utility/./UtilityTests/StringListTest.DefaultConstructor (1159 of 1971) PASS: lldb-unit :: Signals/./SignalsTests/UnixSignalsTest.Iteration (1160 of 1971) PASS: lldb-api :: commands/expression/import-std-module/unique_ptr/TestUniquePtrFromStdModule.py (1161 of 1971) PASS: lldb-api :: functionalities/jitloader_gdb/TestJITLoaderGDB.py (1162 of 1971) PASS: lldb-unit :: Utility/./UtilityTests/BinaryStreamTest.PutULEB128ThreeBytes (1163 of 1971) PASS: lldb-unit :: Core/./LLDBCoreTests/RichManglingContextTest.SwitchProvider (1164 of 1971) PASS: lldb-unit :: Utility/./UtilityTests/ProcessInstanceInfoList.Yaml (1165 of 1971) PASS: lldb-shell :: ObjectFile/PECOFF/sections-names.yaml (1166 of 1971) PASS: lldb-unit :: Utility/./UtilityTests/UriParserTest.SchemeHostSeparator4 (1167 of 1971) PASS: lldb-api :: functionalities/thread/num_threads/TestNumThreads.py (1168 of 1971) PASS: lldb-api :: commands/expression/diagnostics/TestExprDiagnostics.py (1169 of 1971) PASS: lldb-unit :: Symbol/./SymbolTests/TestTypeSystemClang.TestGetEnumIntegerTypeUnexpectedType (1170 of 1971) PASS: lldb-shell :: SymbolFile/NativePDB/function-types-classes.cpp (1171 of 1971) PASS: lldb-unit :: Interpreter/./InterpreterTests/CompletionTest.FileCompletionAbsolute (1172 of 1971) PASS: lldb-shell :: ObjectFile/ELF/many-sections.s (1173 of 1971) PASS: lldb-unit :: Utility/./UtilityTests/StringExtractorTest.GetU32BigEndian (1174 of 1971) PASS: lldb-unit :: Utility/./UtilityTests/StringListTest.Clear (1175 of 1971) PASS: lldb-api :: commands/target/basic/TestTargetCommand.py (1176 of 1971) PASS: lldb-api :: driver/batch_mode/TestBatchMode.py (1177 of 1971) PASS: lldb-api :: lang/cpp/llvm-style/TestLLVMStyle.py (1178 of 1971) PASS: lldb-api :: functionalities/data-formatter/data-formatter-synthval/TestDataFormatterSynthVal.py (1179 of 1971) PASS: lldb-unit :: Utility/./UtilityTests/RangeTest.ContainsRangeStartingFromZero (1180 of 1971) PASS: lldb-api :: python_api/type/TestTypeList.py (1181 of 1971) PASS: lldb-unit :: Host/./HostTests/FileSystemTest.GetByteSize (1182 of 1971) PASS: lldb-api :: python_api/function_symbol/TestDisasmAPI.py (1183 of 1971) PASS: lldb-api :: functionalities/process_group/TestChangeProcessGroup.py (1184 of 1971) PASS: lldb-unit :: Utility/./UtilityTests/RangeDataVector.FindEntryIndexesThatContain_Overlap (1185 of 1971) PASS: lldb-api :: lang/cpp/static_methods/TestCPPStaticMethods.py (1186 of 1971) UNSUPPORTED: lldb-api :: functionalities/data-formatter/data-formatter-stl/libstdcpp/smart_ptr/TestDataFormatterStdSmartPtr.py (1187 of 1971) PASS: lldb-unit :: Utility/./UtilityTests/StringListTest.InsertStringAtIndexStart (1188 of 1971) PASS: lldb-api :: commands/expression/save_jit_objects/TestSaveJITObjects.py (1189 of 1971) PASS: lldb-unit :: UnwindAssembly/x86/./UnwindAssemblyx86Tests/Testx86AssemblyInspectionEngine.Test64bitFramelessSmallStackFrame (1190 of 1971) PASS: lldb-unit :: Utility/./UtilityTests/StreamTeeTest.Write (1191 of 1971) PASS: lldb-unit :: Utility/./UtilityTests/ProcessInfoTest.Constructor (1192 of 1971) PASS: lldb-shell :: SymbolFile/NativePDB/disassembly.cpp (1193 of 1971) PASS: lldb-unit :: Utility/./UtilityTests/ArgsTest.ReplaceArgumentAtIndexFarOutOfRange (1194 of 1971) UNSUPPORTED: lldb-shell :: SymbolFile/PDB/pointers.test (1195 of 1971) PASS: lldb-api :: lang/objc/rdar-10967107/TestRdar10967107.py (1196 of 1971) PASS: lldb-api :: functionalities/data-formatter/stringprinter/TestStringPrinter.py (1197 of 1971) PASS: lldb-api :: functionalities/data-formatter/setvaluefromcstring/TestSetValueFromCString.py (1198 of 1971) PASS: lldb-shell :: SymbolFile/DWARF/debug_ranges.s (1199 of 1971) PASS: lldb-api :: python_api/exprpath_synthetic/TestExprPathSynthetic.py (1200 of 1971) PASS: lldb-unit :: Core/./LLDBCoreTests/MangledTest.ResultForBlockInvocation (1201 of 1971) PASS: lldb-unit :: ObjectFile/Breakpad/./ObjectFileBreakpadTests/Record.classify (1202 of 1971) PASS: lldb-api :: functionalities/breakpoint/consecutive_breakpoints/TestConsecutiveBreakpoints.py (1203 of 1971) PASS: lldb-unit :: Language/CPlusPlus/./LanguageCPlusPlusTests/CPlusPlusLanguage.FindAlternateFunctionManglings (1204 of 1971) PASS: lldb-unit :: Utility/./UtilityTests/StreamTest.PutCStringWithStringRef (1205 of 1971) PASS: lldb-shell :: ObjectFile/PECOFF/export-dllfunc.yaml (1206 of 1971) PASS: lldb-unit :: Utility/./UtilityTests/AnsiTerminal.Empty (1207 of 1971) PASS: lldb-unit :: ObjectFile/Breakpad/./ObjectFileBreakpadTests/LineRecord.parse (1208 of 1971) PASS: lldb-shell :: ObjectFile/Breakpad/uuid-matching-mac.test (1209 of 1971) PASS: lldb-api :: commands/expression/ir-interpreter-phi-nodes/TestIRInterpreterPHINodes.py (1210 of 1971) PASS: lldb-api :: commands/expression/namespace_local_var_same_name_cpp_and_c/TestNamespaceLocalVarSameNameCppAndC.py (1211 of 1971) PASS: lldb-api :: functionalities/data-formatter/data-formatter-objc/TestDataFormatterObjCNSBundle.py (1212 of 1971) PASS: lldb-api :: lang/cpp/std-function-step-into-callable/TestStdFunctionStepIntoCallable.py (1213 of 1971) PASS: lldb-unit :: Expression/./ExpressionTests/ClangExpressionDeclMapTest.TestPersistentDeclLookup (1214 of 1971) PASS: lldb-unit :: Utility/./UtilityTests/StringListTest.LongestCommonPrefixNoPrefix (1215 of 1971) PASS: lldb-shell :: ObjectFile/ELF/section-overlap.yaml (1216 of 1971) PASS: lldb-unit :: Language/Highlighting/./HighlighterTests/HighlighterTest.ClangCursorPosEndOfLine (1217 of 1971) PASS: lldb-unit :: Symbol/./SymbolTests/TestTypeSystemClang.TestDisplayNameEmpty (1218 of 1971) PASS: lldb-unit :: Utility/./UtilityTests/RangeTest.DoesAdjoinOrIntersect (1219 of 1971) PASS: lldb-unit :: Expression/./ExpressionTests/DiagnosticManagerTest.AppendMessageNoDiag (1220 of 1971) PASS: lldb-unit :: Utility/./UtilityTests/LogChannelTest.EnableOptions (1221 of 1971) PASS: lldb-shell :: ObjectFile/ELF/netbsd-exec-8.99.30-amd64.yaml (1222 of 1971) PASS: lldb-shell :: Commands/CommandScriptImmediateOutput/CommandScriptImmediateOutputFile.test (1223 of 1971) PASS: lldb-api :: functionalities/data-formatter/data-formatter-smart-array/TestDataFormatterSmartArray.py (1224 of 1971) PASS: lldb-api :: lang/c/enum_types/TestEnumTypes.py (1225 of 1971) PASS: lldb-api :: macosx/DBGSourcePathRemapping/TestDSYMSourcePathRemapping.py (1226 of 1971) PASS: lldb-unit :: Symbol/./SymbolTests/TestClangASTImporter.CompleteFwdDeclWithOtherOrigin (1227 of 1971) PASS: lldb-shell :: SymbolFile/DWARF/debug_loc_and_loclists.s (1228 of 1971) PASS: lldb-unit :: Utility/./UtilityTests/FileSpecTest.EqualDotsPosixRoot (1229 of 1971) PASS: lldb-unit :: ScriptInterpreter/Python/./ScriptInterpreterPythonTests/PythonDataObjectsTest.TestPythonDictionaryManipulation (1230 of 1971) PASS: lldb-unit :: UnwindAssembly/x86/./UnwindAssemblyx86Tests/Testx86AssemblyInspectionEngine.TestPopEBP (1231 of 1971) UNSUPPORTED: lldb-api :: commands/target/auto-install-main-executable/TestAutoInstallMainExecutable.py (1232 of 1971) PASS: lldb-unit :: Utility/./UtilityTests/StringExtractorTest.DecodeHexU8_Underflow (1233 of 1971) PASS: lldb-api :: lang/cpp/chained-calls/TestCppChainedCalls.py (1234 of 1971) UNSUPPORTED: lldb-shell :: Register/x86-64-ymm16-write.test (1235 of 1971) PASS: lldb-unit :: Utility/./UtilityTests/SerializationRountripTest.SerializeDeserializeCStringArrayNullptrElem (1236 of 1971) PASS: lldb-unit :: Utility/./UtilityTests/StringListTest.SplitIntoLines (1237 of 1971) UNSUPPORTED: lldb-shell :: Register/x86-64-xmm16-write.test (1238 of 1971) PASS: lldb-unit :: Symbol/./SymbolTests/TestTypeSystemClang.TestGetTypeClassNested (1239 of 1971) PASS: lldb-unit :: UnwindAssembly/x86/./UnwindAssemblyx86Tests/Testx86AssemblyInspectionEngine.TestSpillRegToStackViaMOVi386 (1240 of 1971) UNSUPPORTED: lldb-shell :: Register/aarch64-fp-read.test (1241 of 1971) PASS: lldb-unit :: Host/./HostTests/SocketTest.TCPListen0ConnectAccept (1242 of 1971) PASS: lldb-unit :: Utility/./UtilityTests/OptionsWithRawTest.SingleWordSuffix (1243 of 1971) PASS: lldb-shell :: Settings/TestFrameFormatColor.test (1244 of 1971) PASS: lldb-unit :: Utility/./UtilityTests/UriParserTest.PortOverflow (1245 of 1971) PASS: lldb-api :: commands/watchpoints/watchpoint_on_vectors/TestValueOfVectorVariable.py (1246 of 1971) PASS: lldb-unit :: Symbol/./SymbolTests/TestTypeSystemClang.TestGetEnumIntegerTypeBasicTypes (1247 of 1971) PASS: lldb-unit :: Utility/./UtilityTests/StreamTest.PutHex16ByteOrderLittle (1248 of 1971) PASS: lldb-shell :: ObjectFile/ELF/PT_LOAD-overlap-PT_TLS.yaml (1249 of 1971) PASS: lldb-unit :: Utility/./UtilityTests/StreamTest.PutBytesAsRawHex8ToBigEndian (1250 of 1971) PASS: lldb-unit :: Process/gdb-remote/./ProcessGdbRemoteTests/GDBRemoteClientBaseTest.SendContinueDelegateStructuredDataReceipt (1251 of 1971) UNSUPPORTED: lldb-shell :: SymbolFile/PDB/func-symbols.test (1252 of 1971) UNSUPPORTED: lldb-shell :: ScriptInterpreter/Lua/watchpoint_callback.test (1253 of 1971) PASS: lldb-api :: functionalities/data-formatter/data-formatter-stl/libcxx/unordered/TestDataFormatterUnordered.py (1254 of 1971) PASS: lldb-unit :: Language/Highlighting/./HighlighterTests/HighlighterTest.Keywords (1255 of 1971) PASS: lldb-api :: lang/objc/modules-update/TestClangModulesUpdate.py (1256 of 1971) PASS: lldb-shell :: Settings/TestEchoCommands.test (1257 of 1971) PASS: lldb-api :: functionalities/breakpoint/breakpoint_hit_count/TestBreakpointHitCount.py (1258 of 1971) PASS: lldb-unit :: Symbol/./SymbolTests/TestClangASTImporter.RecordLayout (1259 of 1971) PASS: lldb-unit :: Utility/./UtilityTests/EventTest.DumpEventDataBytes (1260 of 1971) PASS: lldb-unit :: Utility/./UtilityTests/UriParserTest.MinimalPort (1261 of 1971) PASS: lldb-unit :: Utility/./UtilityTests/ArgsTest.StringListConstructor (1262 of 1971) PASS: lldb-unit :: Utility/./UtilityTests/StringLexerTest.AdvanceIf (1263 of 1971) PASS: lldb-api :: functionalities/data-formatter/array_typedef/TestArrayTypedef.py (1264 of 1971) PASS: lldb-unit :: Utility/./UtilityTests/RecordReplayTest.InstrumentedFoo (1265 of 1971) PASS: lldb-unit :: Utility/./UtilityTests/OptionsWithRawTest.ArgsButNoDelimiter (1266 of 1971) PASS: lldb-unit :: Utility/./UtilityTests/UriParserTest.MinimalPortPath (1267 of 1971) PASS: lldb-shell :: Driver/TestFile.test (1268 of 1971) PASS: lldb-api :: commands/gui/invalid-args/TestInvalidArgsGui.py (1269 of 1971) PASS: lldb-unit :: UnwindAssembly/x86/./UnwindAssemblyx86Tests/Testx86AssemblyInspectionEngine.TestPushImm (1270 of 1971) PASS: lldb-shell :: Reproducer/TestReuseDirectory.test (1271 of 1971) PASS: lldb-unit :: ScriptInterpreter/Python/./ScriptInterpreterPythonTests/PythonDataObjectsTest.TestOwnedReferences (1272 of 1971) PASS: lldb-api :: lang/c/anonymous/TestAnonymous.py (1273 of 1971) PASS: lldb-api :: python_api/debugger/TestDebuggerAPI.py (1274 of 1971) PASS: lldb-unit :: Utility/./UtilityTests/LogChannelEnabledTest.LogVerboseThread (1275 of 1971) PASS: lldb-api :: lang/c/stepping/TestThreadStepping.py (1276 of 1971) PASS: lldb-api :: lang/cpp/virtual-functions/TestCppVirtualFunctions.py (1277 of 1971) PASS: lldb-shell :: Expr/TestMultilineExpr.test (1278 of 1971) PASS: lldb-unit :: ObjectFile/Breakpad/./ObjectFileBreakpadTests/FuncRecord.parse (1279 of 1971) PASS: lldb-unit :: Utility/./UtilityTests/StringListTest.JoinMultiCharSeparator (1280 of 1971) PASS: lldb-unit :: Utility/./UtilityTests/CompletionRequest.TestCompletionOwnership (1281 of 1971) PASS: lldb-api :: functionalities/thread/concurrent_events/TestConcurrentWatchBreak.py (1282 of 1971) PASS: lldb-api :: tools/lldb-server/TestGdbRemoteKill.py (1283 of 1971) PASS: lldb-api :: commands/expression/issue_11588/Test11588.py (1284 of 1971) PASS: lldb-api :: lang/cpp/global_operators/TestCppGlobalOperators.py (1285 of 1971) PASS: lldb-shell :: SymbolFile/DWARF/inline-function-address.ll (1286 of 1971) PASS: lldb-api :: functionalities/tail_call_frames/ambiguous_tail_call_seq2/TestAmbiguousTailCallSeq2.py (1287 of 1971) PASS: lldb-unit :: Utility/./UtilityTests/StringExtractorTest.GetHexBytes_FullString (1288 of 1971) PASS: lldb-shell :: BuildScript/toolchain-clang.test (1289 of 1971) PASS: lldb-unit :: ObjectFile/Breakpad/./ObjectFileBreakpadTests/InfoRecord.parse (1290 of 1971) PASS: lldb-api :: python_api/symbol-context/TestSymbolContext.py (1291 of 1971) PASS: lldb-unit :: UnwindAssembly/x86/./UnwindAssemblyx86Tests/Testx86AssemblyInspectionEngine.TestPushR13 (1292 of 1971) PASS: lldb-unit :: Expression/./ExpressionTests/CppModuleConfigurationTest.UnrelatedLibrary (1293 of 1971) PASS: lldb-unit :: Utility/./UtilityTests/UriParserTest.LongPath (1294 of 1971) PASS: lldb-api :: functionalities/postmortem/minidump/TestMiniDump.py (1295 of 1971) PASS: lldb-shell :: Process/TestEnvironment.test (1296 of 1971) PASS: lldb-unit :: Host/./HostTests/Host.GetEnvironment (1297 of 1971) PASS: lldb-unit :: Utility/./UtilityTests/LogChannelEnabledTest.log_options (1298 of 1971) PASS: lldb-api :: commands/watchpoints/hello_watchpoint/TestMyFirstWatchpoint.py (1299 of 1971) PASS: lldb-api :: python_api/get-value-32bit-int/TestGetValue32BitInt.py (1300 of 1971) PASS: lldb-unit :: Utility/./UtilityTests/StringListTest.InsertStringAtIndexMove (1301 of 1971) PASS: lldb-unit :: Utility/./UtilityTests/Flags.AnySet (1302 of 1971) PASS: lldb-shell :: SymbolFile/DWARF/debug-types-line-tables.s (1303 of 1971) PASS: lldb-api :: functionalities/gdb_remote_client/TestGDBRemoteLoad.py (1304 of 1971) PASS: lldb-unit :: Host/./HostTests/MainLoopTest.DetectsEOF (1305 of 1971) PASS: lldb-shell :: ObjectFile/ELF/PT_LOAD-overlap-section.yaml (1306 of 1971) PASS: lldb-shell :: SymbolFile/NativePDB/bitfields.cpp (1307 of 1971) PASS: lldb-unit :: Utility/./UtilityTests/StreamTest.PutSLEB128 (1308 of 1971) PASS: lldb-unit :: Utility/./UtilityTests/RangeDataVector.CustomSort (1309 of 1971) UNSUPPORTED: lldb-api :: arm/breakpoint-thumb-codesection/TestBreakpointThumbCodesection.py (1310 of 1971) PASS: lldb-api :: lang/objc/objc-baseclass-sbtype/TestObjCBaseClassSBType.py (1311 of 1971) PASS: lldb-api :: lang/objcxx/objcxx-ivar-vector/TestIvarVector.py (1312 of 1971) PASS: lldb-api :: lang/c/conflicting-symbol/TestConflictingSymbol.py (1313 of 1971) UNSUPPORTED: lldb-shell :: SymbolFile/PDB/vbases.test (1314 of 1971) PASS: lldb-shell :: Reproducer/Functionalities/TestDataFormatter.test (1315 of 1971) PASS: lldb-api :: commands/expression/scoped_enums/TestScopedEnumType.py (1316 of 1971) PASS: lldb-unit :: ScriptInterpreter/Python/./ScriptInterpreterPythonTests/PythonDataObjectsTest.TestPythonFile (1317 of 1971) PASS: lldb-shell :: Breakpoint/debug_rnglist_basic.test (1318 of 1971) PASS: lldb-shell :: Minidump/Windows/find-module.test (1319 of 1971) PASS: lldb-unit :: Language/Highlighting/./HighlighterTests/HighlighterTest.FallbackHighlighter (1320 of 1971) PASS: lldb-api :: functionalities/tail_call_frames/inlining_and_tail_calls/TestInliningAndTailCalls.py (1321 of 1971) PASS: lldb-unit :: ScriptInterpreter/Python/./ScriptInterpreterPythonTests/PythonDataObjectsTest.TestScript (1322 of 1971) PASS: lldb-api :: lang/c/const_variables/TestConstVariables.py (1323 of 1971) PASS: lldb-api :: functionalities/thread/jump/TestThreadJump.py (1324 of 1971) UNSUPPORTED: lldb-shell :: Breakpoint/case-insensitive.test (1325 of 1971) PASS: lldb-api :: python_api/hello_world/TestHelloWorld.py (1326 of 1971) UNSUPPORTED: lldb-api :: functionalities/tsan/thread_numbers/TestTsanThreadNumbers.py (1327 of 1971) PASS: lldb-unit :: UnwindAssembly/x86/./UnwindAssemblyx86Tests/Testx86AssemblyInspectionEngine.Test32bitFramelessBigStackFrame (1328 of 1971) PASS: lldb-api :: functionalities/unwind/zeroth_frame/TestZerothFrame.py (1329 of 1971) PASS: lldb-unit :: Utility/./UtilityTests/ScalarTest.GetBytes (1330 of 1971) UNSUPPORTED: lldb-api :: functionalities/tsan/global_location/TestTsanGlobalLocation.py (1331 of 1971) PASS: lldb-unit :: Utility/./UtilityTests/OptionsWithRawTest.EmptySuffixSingleWhitespace (1332 of 1971) PASS: lldb-unit :: Utility/./UtilityTests/StreamTest.AddressEmptyPrefix (1333 of 1971) PASS: lldb-api :: functionalities/data-formatter/data-formatter-globals/TestDataFormatterGlobals.py (1334 of 1971) PASS: lldb-api :: functionalities/thread/concurrent_events/TestConcurrentManyWatchpoints.py (1335 of 1971) PASS: lldb-unit :: Utility/./UtilityTests/StringListTest.InsertStringAtIndexStdString (1336 of 1971) PASS: lldb-shell :: Reproducer/Modules/TestModuleCXX.test (1337 of 1971) PASS: lldb-api :: lang/objc/foundation/TestObjCMethodsNSArray.py (1338 of 1971) PASS: lldb-api :: tools/lldb-server/commandline/TestStubReverseConnect.py (1339 of 1971) PASS: lldb-unit :: Utility/./UtilityTests/ConstStringTest.MangledCounterpart (1340 of 1971) PASS: lldb-api :: functionalities/data-formatter/parray/TestPrintArray.py (1341 of 1971) PASS: lldb-unit :: Utility/./UtilityTests/RangeTest.DefaultConstructor (1342 of 1971) PASS: lldb-api :: lang/c/register_variables/TestRegisterVariables.py (1343 of 1971) PASS: lldb-shell :: Expr/TestTypeOfDeclTypeExpr.test (1344 of 1971) PASS: lldb-unit :: Utility/./UtilityTests/ScalarTest.RightShiftOperator (1345 of 1971) PASS: lldb-shell :: ObjectFile/ELF/short-build-id.yaml (1346 of 1971) PASS: lldb-unit :: Utility/./UtilityTests/RecordReplayTest.InstrumentedFooSameThis (1347 of 1971) PASS: lldb-unit :: Utility/./UtilityTests/StringLexerTest.Peek (1348 of 1971) PASS: lldb-unit :: Language/Highlighting/./HighlighterTests/HighlighterTest.DefaultHighlighter (1349 of 1971) PASS: lldb-api :: functionalities/mtc/simple/TestMTCSimple.py (1350 of 1971) PASS: lldb-api :: api/multiple-targets/TestMultipleTargets.py (1351 of 1971) PASS: lldb-api :: macosx/order/TestOrderFile.py (1352 of 1971) PASS: lldb-unit :: UnwindAssembly/x86/./UnwindAssemblyx86Tests/Testx86AssemblyInspectionEngine.TestSimple64bitFrameFunction (1353 of 1971) PASS: lldb-api :: functionalities/thread/concurrent_events/TestConcurrentCrashWithSignal.py (1354 of 1971) PASS: lldb-unit :: Utility/./UtilityTests/ArchSpecTest.TestParseMachCPUDashSubtypeTripleExtra (1355 of 1971) PASS: lldb-unit :: Utility/./UtilityTests/StringListTest.JoinEmpty (1356 of 1971) PASS: lldb-shell :: SymbolFile/DWARF/debug_ranges-missing-section.s (1357 of 1971) PASS: lldb-api :: functionalities/deleted-executable/TestDeletedExecutable.py (1358 of 1971) PASS: lldb-unit :: Expression/./ExpressionTests/CppModuleConfigurationTest.AmbiguousCLib (1359 of 1971) PASS: lldb-api :: lang/cpp/call-function/TestCallCPPFunction.py (1360 of 1971) PASS: lldb-api :: commands/expression/timeout/TestCallWithTimeout.py (1361 of 1971) PASS: lldb-shell :: SymbolFile/NativePDB/nested-types.cpp (1362 of 1971) PASS: lldb-shell :: ObjectFile/MachO/subsections.yaml (1363 of 1971) PASS: lldb-unit :: Language/Highlighting/./HighlighterTests/HighlighterTest.ClangTrailingBackslashWithWhitespace (1364 of 1971) PASS: lldb-unit :: Symbol/./SymbolTests/TestTypeSystemClang.TestIsClangType (1365 of 1971) PASS: lldb-unit :: Utility/./UtilityTests/StatusTest.ErrorConstructor (1366 of 1971) PASS: lldb-api :: functionalities/data-formatter/data-formatter-objc/TestDataFormatterObjCNSData.py (1367 of 1971) PASS: lldb-shell :: Minidump/dump-all.test (1368 of 1971) PASS: lldb-shell :: Reproducer/TestRelativePath.test (1369 of 1971) PASS: lldb-api :: tools/lldb-server/TestGdbRemoteExitCode.py (1370 of 1971) PASS: lldb-api :: commands/expression/radar_9673664/TestExprHelpExamples.py (1371 of 1971) PASS: lldb-shell :: SymbolFile/DWARF/find-inline-method.s (1372 of 1971) PASS: lldb-unit :: Utility/./UtilityTests/OptionsWithRawTest.LeadingSpaceArgs (1373 of 1971) PASS: lldb-unit :: Expression/./ExpressionTests/DiagnosticManagerTest.GetStringSeverityLabels (1374 of 1971) PASS: lldb-unit :: UnwindAssembly/x86/./UnwindAssemblyx86Tests/Testx86AssemblyInspectionEngine.TestPushESI (1375 of 1971) PASS: lldb-unit :: Utility/./UtilityTests/UriParserTest.BracketedHostnameWithColon (1376 of 1971) UNSUPPORTED: lldb-api :: functionalities/data-formatter/data-formatter-stl/libstdcpp/map/TestDataFormatterStdMap.py (1377 of 1971) PASS: lldb-api :: lang/cpp/lambdas/TestLambdas.py (1378 of 1971) PASS: lldb-unit :: Utility/./UtilityTests/Flags.AllClear (1379 of 1971) PASS: lldb-shell :: SymbolFile/Breakpad/line-table-missing-file.test (1380 of 1971) PASS: lldb-unit :: Utility/./UtilityTests/CompletionRequest.DuplicateFiltering (1381 of 1971) UNSUPPORTED: lldb-api :: functionalities/thread/state/TestThreadStates.py (1382 of 1971) PASS: lldb-unit :: SymbolFile/DWARF/./SymbolFileDWARFTests/SymbolFileDWARFTests.TestAbbrevInvalidNULLTag (1383 of 1971) PASS: lldb-unit :: UnwindAssembly/x86/./UnwindAssemblyx86Tests/Testx86AssemblyInspectionEngine.TestAddRSP (1384 of 1971) PASS: lldb-api :: lang/c/step-target/TestStepTarget.py (1385 of 1971) PASS: lldb-unit :: Utility/./UtilityTests/NameMatchesTest.RegularExpression (1386 of 1971) PASS: lldb-api :: functionalities/memory/read/TestMemoryRead.py (1387 of 1971) PASS: lldb-api :: lang/objc/hidden-ivars/TestHiddenIvars.py (1388 of 1971) PASS: lldb-unit :: Language/Highlighting/./HighlighterTests/HighlighterTest.Colons (1389 of 1971) PASS: lldb-unit :: Interpreter/./InterpreterTests/OptionArgParserTest.toScriptLanguage (1390 of 1971) PASS: lldb-api :: commands/watchpoints/watchpoint_events/TestWatchpointEvents.py (1391 of 1971) PASS: lldb-unit :: Utility/./UtilityTests/RangeTest.ContainsAddr (1392 of 1971) PASS: lldb-api :: functionalities/data-formatter/data-formatter-stl/libcxx/optional/TestDataFormatterLibcxxOptional.py (1393 of 1971) PASS: lldb-api :: lang/c/set_values/TestSetValues.py (1394 of 1971) PASS: lldb-unit :: Utility/./UtilityTests/SerializationRountripTest.SerializeDeserializePod (1395 of 1971) UNSUPPORTED: lldb-shell :: Register/x86-ymm-read.test (1396 of 1971) PASS: lldb-unit :: ScriptInterpreter/Python/./ScriptInterpreterPythonTests/PythonDataObjectsTest.TestBorrowedReferences (1397 of 1971) PASS: lldb-api :: commands/expression/call-function/TestCallStdStringFunction.py (1398 of 1971) PASS: lldb-api :: functionalities/memory/find/TestMemoryFind.py (1399 of 1971) PASS: lldb-unit :: Process/gdb-remote/./ProcessGdbRemoteTests/GDBRemoteCommunicationClientTest.SendSignalsToIgnore (1400 of 1971) PASS: lldb-shell :: SymbolFile/DWARF/dir-separator-posix.s (1401 of 1971) PASS: lldb-unit :: Utility/./UtilityTests/LogChannelTest.Enable (1402 of 1971) PASS: lldb-api :: tools/lldb-vscode/stackTrace/TestVSCode_stackTrace.py (1403 of 1971) PASS: lldb-unit :: UnwindAssembly/x86/./UnwindAssemblyx86Tests/Testx86AssemblyInspectionEngine.TestPushExtended (1404 of 1971) PASS: lldb-api :: functionalities/data-formatter/data-formatter-objc/cmtime/TestDataFormatterCMTime.py (1405 of 1971) PASS: lldb-unit :: Utility/./UtilityTests/FileSpecTest.FormatFileSpec (1406 of 1971) PASS: lldb-unit :: Utility/./UtilityTests/SerializationRountripTest.SerializeDeserializePodPointers (1407 of 1971) PASS: lldb-api :: sample_test/TestSampleTest.py (1408 of 1971) PASS: lldb-shell :: SymbolFile/NativePDB/ast-types.cpp (1409 of 1971) PASS: lldb-unit :: Utility/./UtilityTests/StreamTest.AddressRangeInvalidRange (1410 of 1971) PASS: lldb-unit :: Utility/./UtilityTests/StringExtractorTest.DecodeHexU8_Exact (1411 of 1971) PASS: lldb-shell :: SymbolFile/DWARF/DW_AT_low_pc-addrx.s (1412 of 1971) PASS: lldb-unit :: Utility/./UtilityTests/ConstStringTest.FromMidOfBufferStringRef (1413 of 1971) UNSUPPORTED: lldb-shell :: ScriptInterpreter/Lua/command_script_import.test (1414 of 1971) PASS: lldb-unit :: Host/./HostTests/FileSystemTest.MakeAbsolute (1415 of 1971) PASS: lldb-unit :: Expression/./ExpressionTests/DWARFExpression.DW_OP_convert (1416 of 1971) PASS: lldb-unit :: Process/minidump/./LLDBMinidumpTests/MinidumpParserTest.GetExceptionStream (1417 of 1971) PASS: lldb-unit :: Language/Highlighting/./HighlighterTests/HighlighterTest.ClangTrailingBackslashMissingNewLine (1418 of 1971) PASS: lldb-unit :: Utility/./UtilityTests/LogTest.Unregister (1419 of 1971) PASS: lldb-unit :: Host/./HostTests/FileSystemTest.FileAndDirectoryComponents (1420 of 1971) PASS: lldb-api :: lang/c/function_types/TestFunctionTypes.py (1421 of 1971) PASS: lldb-shell :: SymbolFile/DWARF/debug_rnglists.s (1422 of 1971) PASS: lldb-api :: functionalities/load_unload/TestLoadUnload.py (1423 of 1971) PASS: lldb-api :: commands/expression/weak_symbols/TestWeakSymbols.py (1424 of 1971) PASS: lldb-shell :: Unwind/trap_frame_sym_ctx.test (1425 of 1971) UNSUPPORTED: lldb-api :: linux/sepdebugsymlink/TestTargetSymbolsSepDebugSymlink.py (1426 of 1971) PASS: lldb-unit :: Utility/./UtilityTests/FileSpecTest.GetPath (1427 of 1971) PASS: lldb-unit :: Utility/./UtilityTests/VMRange.Ordering (1428 of 1971) PASS: lldb-api :: lang/cpp/virtual-overload/TestVirtualOverload.py (1429 of 1971) PASS: lldb-api :: lang/objc/objc++/TestObjCXX.py (1430 of 1971) PASS: lldb-unit :: Utility/./UtilityTests/FileSpecTest.Match (1431 of 1971) PASS: lldb-unit :: Utility/./UtilityTests/ScalarTest.ExtractBitfield (1432 of 1971) PASS: lldb-unit :: Expression/./ExpressionTests/ClangExpressionDeclMapTest.TestUnknownIdentifierLookup (1433 of 1971) PASS: lldb-unit :: Utility/./UtilityTests/BinaryStreamTest.PutSLEB128One (1434 of 1971) PASS: lldb-unit :: Host/./HostTests/SocketTest.TCPGetConnectURI (1435 of 1971) PASS: lldb-shell :: ObjectFile/Breakpad/discontiguous-sections.test (1436 of 1971) PASS: lldb-unit :: Process/minidump/./LLDBMinidumpTests/MinidumpParserTest.GetMemoryRegionInfo (1437 of 1971) PASS: lldb-api :: lang/cpp/global_variables/TestCPPGlobalVariables.py (1438 of 1971) UNSUPPORTED: lldb-api :: benchmarks/turnaround/TestCompileRunToBreakpointTurnaround.py (1439 of 1971) PASS: lldb-unit :: Expression/./ExpressionTests/CppModuleConfigurationTest.IgnoreLibStdCpp (1440 of 1971) PASS: lldb-unit :: ScriptInterpreter/Python/./ScriptInterpreterPythonTests/PythonDataObjectsTest.TestPythonByteArray (1441 of 1971) PASS: lldb-api :: functionalities/data-formatter/data-formatter-objc/TestDataFormatterObjCNSError.py (1442 of 1971) PASS: lldb-api :: functionalities/gdb_remote_client/TestGDBRemoteClient.py (1443 of 1971) PASS: lldb-api :: commands/command/source/TestCommandSource.py (1444 of 1971) UNSUPPORTED: lldb-api :: macosx/macabi/TestMacABImacOSFramework.py (1445 of 1971) PASS: lldb-api :: types/TestShortTypeExpr.py (1446 of 1971) PASS: lldb-api :: functionalities/target_var/TestTargetVar.py (1447 of 1971) PASS: lldb-unit :: Utility/./UtilityTests/RangeTest.Clear (1448 of 1971) PASS: lldb-api :: lang/cpp/member-and-local-vars-with-same-name/TestMembersAndLocalsWithSameName.py (1449 of 1971) PASS: lldb-unit :: Process/gdb-remote/./ProcessGdbRemoteTests/GDBRemoteClientBaseTest.SendContinueAndLateInterrupt (1450 of 1971) PASS: lldb-api :: functionalities/thread/concurrent_events/TestConcurrentDelaySignalWatch.py (1451 of 1971) PASS: lldb-unit :: Utility/./UtilityTests/RangeTest.EqualInvalid (1452 of 1971) PASS: lldb-unit :: Utility/./UtilityTests/StringListTest.AppendListCStringArrayEmpty (1453 of 1971) PASS: lldb-unit :: Symbol/./SymbolTests/SymbolsTest.TerminateLocateExecutableSymbolFileForUnknownExecutableAndUnknownSymbolFile (1454 of 1971) PASS: lldb-unit :: Host/./HostTests/FileActionTest.Open (1455 of 1971) PASS: lldb-api :: functionalities/thread/concurrent_events/TestConcurrentSignalDelayWatch.py (1456 of 1971) PASS: lldb-api :: functionalities/tail_call_frames/unambiguous_sequence/TestUnambiguousTailCalls.py (1457 of 1971) PASS: lldb-unit :: Utility/./UtilityTests/UriParserTest.BracketedHostnamePort (1458 of 1971) PASS: lldb-api :: functionalities/thread/concurrent_events/TestConcurrentWatchpointDelayWatchpointOneBreakpoint.py (1459 of 1971) XFAIL: lldb-shell :: Register/x86-64-write.test (1460 of 1971) PASS: lldb-api :: functionalities/breakpoint/breakpoint_language/TestBreakpointLanguage.py (1461 of 1971) PASS: lldb-api :: python_api/objc_type/TestObjCType.py (1462 of 1971) PASS: lldb-api :: lang/cpp/nsimport/TestCppNsImport.py (1463 of 1971) PASS: lldb-unit :: ScriptInterpreter/Python/./ScriptInterpreterPythonTests/PythonDataObjectsTest.TestPythonTupleInitializerList (1464 of 1971) UNSUPPORTED: lldb-api :: python_api/disassemble-raw-data/TestDisassemble_VST1_64.py (1465 of 1971) UNSUPPORTED: lldb-shell :: Register/x86-zmm-read.test (1466 of 1971) PASS: lldb-unit :: Host/./HostTests/NativeProcessProtocolTest.ReadCStringFromMemory_CrossPageBoundary (1467 of 1971) PASS: lldb-unit :: Utility/./UtilityTests/ScalarTest.Promotion (1468 of 1971) PASS: lldb-api :: macosx/profile_vrs_detach/TestDetachVrsProfile.py (1469 of 1971) PASS: lldb-unit :: Utility/./UtilityTests/ArgsTest.AppendArguments (1470 of 1971) PASS: lldb-unit :: Process/gdb-remote/./ProcessGdbRemoteTests/GDBRemoteCommunicationServerTest.SendErrorResponse_Status (1471 of 1971) PASS: lldb-api :: lang/objc/objc-ivar-protocols/TestIvarProtocols.py (1472 of 1971) PASS: lldb-api :: functionalities/gdb_remote_client/TestRegDefinitionInParts.py (1473 of 1971) PASS: lldb-shell :: ObjectFile/wasm/embedded-debug-sections.yaml (1474 of 1971) PASS: lldb-api :: functionalities/postmortem/wow64_minidump/TestWow64MiniDump.py (1475 of 1971) PASS: lldb-unit :: UnwindAssembly/x86/./UnwindAssemblyx86Tests/Testx86AssemblyInspectionEngine.Testi386IgnoredRegisters (1476 of 1971) PASS: lldb-unit :: Symbol/./SymbolTests/TestClangASTImporter.ImportInvalidType (1477 of 1971) PASS: lldb-api :: lang/c/tls_globals/TestTlsGlobals.py (1478 of 1971) PASS: lldb-api :: functionalities/data-formatter/data-formatter-stl/libcxx/vbool/TestDataFormatterLibcxxVBool.py (1479 of 1971) PASS: lldb-api :: lang/c/inlines/TestRedefinitionsInInlines.py (1480 of 1971) PASS: lldb-api :: lang/cpp/operator-overload/TestOperatorOverload.py (1481 of 1971) PASS: lldb-api :: lang/cpp/inlines/TestInlines.py (1482 of 1971) PASS: lldb-api :: lang/c/forward/TestForwardDeclaration.py (1483 of 1971) PASS: lldb-api :: functionalities/lazy-loading/TestLazyLoading.py (1484 of 1971) PASS: lldb-unit :: Utility/./UtilityTests/StringExtractorTest.GetHexU8_InvalidHex_NoEof (1485 of 1971) PASS: lldb-unit :: Host/./HostTests/FileSystemTest.Exists (1486 of 1971) PASS: lldb-shell :: Breakpoint/debug_rnglist_offset_pair.test (1487 of 1971) PASS: lldb-unit :: Process/gdb-remote/./ProcessGdbRemoteTests/GDBRemoteClientBaseTest.InterruptNoResponse (1488 of 1971) PASS: lldb-api :: functionalities/data-formatter/frameformat_smallstruct/TestFrameFormatSmallStruct.py (1489 of 1971) PASS: lldb-api :: functionalities/data-formatter/data-formatter-stl/libcxx/bitset/TestDataFormatterLibcxxBitset.py (1490 of 1971) PASS: lldb-unit :: Process/gdb-remote/./ProcessGdbRemoteTests/GDBRemoteCommunicationServerTest.SendErrorResponse_UnimplementedError (1491 of 1971) PASS: lldb-api :: lang/objc/objc-class-method/TestObjCClassMethod.py (1492 of 1971) PASS: lldb-unit :: Symbol/./SymbolTests/TestTypeSystemClang.TestUnifyAccessSpecifiers (1493 of 1971) UNSUPPORTED: lldb-api :: benchmarks/frame_variable/TestFrameVariableResponse.py (1494 of 1971) PASS: lldb-shell :: SymbolFile/Breakpad/line-table-edgecases.test (1495 of 1971) PASS: lldb-shell :: ObjectFile/PECOFF/invalid-export-table.yaml (1496 of 1971) PASS: lldb-api :: commands/expression/unicode-in-variable/TestUnicodeInVariable.py (1497 of 1971) PASS: lldb-shell :: SymbolFile/DWARF/dwp-separate-debug-file.cpp (1498 of 1971) PASS: lldb-unit :: Process/minidump/./LLDBMinidumpTests/MinidumpParserTest.GetThreadsAndGetThreadContext (1499 of 1971) PASS: lldb-api :: commands/platform/basic/TestPlatformCommand.py (1500 of 1971) PASS: lldb-api :: lang/objc/modules-app-update/TestClangModulesAppUpdate.py (1501 of 1971) PASS: lldb-unit :: Language/Highlighting/./HighlighterTests/HighlighterTest.DefaultHighlighterWithCursor (1502 of 1971) PASS: lldb-api :: commands/expression/no-deadlock/TestExprDoesntBlock.py (1503 of 1971) PASS: lldb-unit :: Symbol/./SymbolTests/TestClangASTImporter.MetadataPropagationIndirectImport (1504 of 1971) PASS: lldb-unit :: Utility/./UtilityTests/RegularExpression.Empty (1505 of 1971) PASS: lldb-unit :: Host/./HostTests/NativeProcessProtocolTest.SetBreakpointFailWrite (1506 of 1971) PASS: lldb-unit :: Symbol/./SymbolTests/TestTypeSystemClang.TestRemoveFastQualifiers (1507 of 1971) PASS: lldb-api :: functionalities/thread/create_after_attach/TestCreateAfterAttach.py (1508 of 1971) PASS: lldb-shell :: ObjectFile/PECOFF/uuid.yaml (1509 of 1971) PASS: lldb-api :: functionalities/breakpoint/breakpoint_ignore_count/TestBreakpointIgnoreCount.py (1510 of 1971) UNSUPPORTED: lldb-api :: tools/lldb-server/TestGdbRemote_vContThreads.py (1511 of 1971) PASS: lldb-api :: functionalities/breakpoint/hardware_breakpoints/hardware_breakpoint_on_multiple_threads/TestHWBreakMultiThread.py (1512 of 1971) PASS: lldb-unit :: Expression/./ExpressionTests/DiagnosticManagerTest.GetStringMultiline (1513 of 1971) PASS: lldb-unit :: ScriptInterpreter/Python/./ScriptInterpreterPythonTests/PythonDataObjectsTest.TestPythonListValueEquality (1514 of 1971) PASS: lldb-unit :: Utility/./UtilityTests/StringListTest.JoinNonSpace (1515 of 1971) PASS: lldb-unit :: Symbol/./SymbolTests/TestTypeSystemClang.TestDisplayName (1516 of 1971) PASS: lldb-unit :: Utility/./UtilityTests/RecordReplayTest.InstrumentedBar (1517 of 1971) PASS: lldb-unit :: Utility/./UtilityTests/ScalarTest.Scalar_512 (1518 of 1971) PASS: lldb-unit :: Utility/./UtilityTests/FileSpecTest.RemoveLastPathComponent (1519 of 1971) PASS: lldb-api :: functionalities/unwind/sigtramp/TestSigtrampUnwind.py (1520 of 1971) PASS: lldb-shell :: ObjectFile/ELF/PT_LOAD-overlap.yaml (1521 of 1971) PASS: lldb-unit :: SymbolFile/NativePDB/./SymbolFileNativePDBTests/PDBFPOProgramToDWARFExpressionTests.UnresolvedCyclicRegisterAssignmentReference (1522 of 1971) PASS: lldb-unit :: Utility/./UtilityTests/VASprintfTest.BufferResize (1523 of 1971) PASS: lldb-api :: commands/expression/import-std-module/forward_list-dbg-info-content/TestDbgInfoContentForwardListFromStdModule.py (1524 of 1971) PASS: lldb-unit :: Utility/./UtilityTests/StringListTest.InsertStringAtIndexEnd (1525 of 1971) PASS: lldb-api :: functionalities/thread/concurrent_events/TestConcurrentSignalWatch.py (1526 of 1971) PASS: lldb-shell :: Breakpoint/single-file-split-dwarf.test (1527 of 1971) PASS: lldb-api :: functionalities/data-formatter/data-formatter-ptr-to-array/TestPtrToArrayFormatting.py (1528 of 1971) PASS: lldb-api :: commands/expression/namespace_local_var_same_name_obj_c/TestNamespaceLocalVarSameNameObjC.py (1529 of 1971) PASS: lldb-api :: python_api/formatters/TestFormattersSBAPI.py (1530 of 1971) PASS: lldb-unit :: tools/lldb-server/tests/./LLDBServerTests/TestBase.DebugserverEnv (1531 of 1971) PASS: lldb-unit :: ObjectFile/ELF/./ObjectFileELFTests/ObjectFileELFTest.GetSymtab_NoSymEntryPointArmThumbAddressClass (1532 of 1971) PASS: lldb-unit :: Symbol/./SymbolTests/LineEntryTest.GetSameLineContiguousAddressRangeNestedInline (1533 of 1971) PASS: lldb-api :: functionalities/step-avoids-no-debug/TestStepNoDebug.py (1534 of 1971) PASS: lldb-unit :: UnwindAssembly/x86/./UnwindAssemblyx86Tests/Testx86AssemblyInspectionEngine.TestPopR12 (1535 of 1971) PASS: lldb-unit :: Utility/./UtilityTests/ScalarTest.Division (1536 of 1971) PASS: lldb-shell :: Driver/TestSingleQuote.test (1537 of 1971) PASS: lldb-unit :: Expression/./ExpressionTests/CppModuleConfigurationTest.UnknownLibCppFile (1538 of 1971) PASS: lldb-unit :: Utility/./UtilityTests/RangeTest.ContainsEndInclusiveInvalid (1539 of 1971) PASS: lldb-shell :: ObjectFile/Breakpad/breakpad-identification.test (1540 of 1971) PASS: lldb-api :: lang/cpp/frame-var-anon-unions/TestFrameVariableAnonymousUnions.py (1541 of 1971) PASS: lldb-unit :: Expression/./ExpressionTests/DiagnosticManagerTest.PutString (1542 of 1971) PASS: lldb-unit :: Utility/./UtilityTests/BinaryStreamTest.PutSLEB128ThreeBytes (1543 of 1971) PASS: lldb-unit :: Utility/./UtilityTests/AnsiTerminal.Twice (1544 of 1971) PASS: lldb-api :: functionalities/data-formatter/data-formatter-objc/TestDataFormatterObjCNSDate.py (1545 of 1971) PASS: lldb-unit :: Process/gdb-remote/./ProcessGdbRemoteTests/GDBRemoteCommunicationClientTest.GetQOffsets (1546 of 1971) PASS: lldb-unit :: Target/./TargetTests/ModuleCacheTest.GetAndPutStrangeHostname (1547 of 1971) PASS: lldb-unit :: Utility/./UtilityTests/AnsiTerminal.Unknown (1548 of 1971) PASS: lldb-api :: functionalities/breakpoint/breakpoint_locations/TestBreakpointLocations.py (1549 of 1971) PASS: lldb-api :: macosx/universal/TestUniversal.py (1550 of 1971) PASS: lldb-api :: commands/expression/deleting-implicit-copy-constructor/TestDeletingImplicitCopyConstructor.py (1551 of 1971) PASS: lldb-unit :: Utility/./UtilityTests/DeserializerTest.HasData (1552 of 1971) UNSUPPORTED: lldb-api :: functionalities/ubsan/user-expression/TestUbsanUserExpression.py (1553 of 1971) UNSUPPORTED: lldb-api :: lang/objc/bitfield_ivars/TestBitfieldIvars.py (1554 of 1971) PASS: lldb-unit :: ScriptInterpreter/Python/./ScriptInterpreterPythonTests/PythonDataObjectsTest.TestPythonTupleToStructuredList (1555 of 1971) PASS: lldb-unit :: Utility/./UtilityTests/DataExtractorTest.GetCStrUnterminated (1556 of 1971) PASS: lldb-api :: lang/objc/objc-optimized/TestObjcOptimized.py (1557 of 1971) PASS: lldb-shell :: Quit/TestQuitExitCodeHex0.test (1558 of 1971) PASS: lldb-api :: commands/expression/inline-namespace/TestInlineNamespace.py (1559 of 1971) PASS: lldb-shell :: SymbolFile/DWARF/array-sizes.s (1560 of 1971) PASS: lldb-unit :: Host/./HostTests/ConnectionFileDescriptorTest.TCPGetURIv4 (1561 of 1971) PASS: lldb-shell :: Minidump/Windows/Sigsegv/sigsegv.test (1562 of 1971) PASS: lldb-api :: python_api/findvalue_duplist/TestSBFrameFindValue.py (1563 of 1971) UNSUPPORTED: lldb-shell :: Reproducer/TestLuaImport.test (1564 of 1971) PASS: lldb-api :: python_api/process/TestProcessAPI.py (1565 of 1971) UNSUPPORTED: lldb-shell :: SymbolFile/dissassemble-entry-point.s (1566 of 1971) PASS: lldb-api :: lang/cpp/class_static/TestStaticVariables.py (1567 of 1971) PASS: lldb-api :: python_api/sbstructureddata/TestStructuredDataAPI.py (1568 of 1971) PASS: lldb-shell :: ObjectFile/ELF/section-types-edgecases.yaml (1569 of 1971) PASS: lldb-api :: functionalities/show_location/TestShowLocationDwarf5.py (1570 of 1971) PASS: lldb-unit :: Process/gdb-remote/./ProcessGdbRemoteTests/GDBRemoteCommunicationClientTest.SendGetMetaDataPacket (1571 of 1971) PASS: lldb-api :: functionalities/inferior-crashing/recursive-inferior/TestRecursiveInferior.py (1572 of 1971) PASS: lldb-unit :: Host/./HostTests/SocketTest.TCPListen0GetPort (1573 of 1971) PASS: lldb-api :: functionalities/thread/concurrent_events/TestConcurrentManyBreakpoints.py (1574 of 1971) PASS: lldb-shell :: Driver/LocalLLDBInit.test (1575 of 1971) PASS: lldb-api :: linux/builtin_trap/TestBuiltinTrap.py (1576 of 1971) PASS: lldb-unit :: Utility/./UtilityTests/Predicate.WaitForValueNotEqualTo (1577 of 1971) PASS: lldb-shell :: VSCode/TestOptions.test (1578 of 1971) PASS: lldb-unit :: ScriptInterpreter/Python/./ScriptInterpreterPythonTests/PythonDataObjectsTest.TestDictionaryResolutionWithDot (1579 of 1971) PASS: lldb-unit :: Utility/./UtilityTests/AnsiTerminal.AtStart (1580 of 1971) PASS: lldb-api :: commands/register/register/register_command/TestRegisters.py (1581 of 1971) PASS: lldb-unit :: Utility/./UtilityTests/SerializationRountripTest.SerializeDeserializeCStringArrayNullptr (1582 of 1971) PASS: lldb-api :: python_api/target/TestTargetAPI.py (1583 of 1971) PASS: lldb-api :: functionalities/tail_call_frames/ambiguous_tail_call_seq1/TestAmbiguousTailCallSeq1.py (1584 of 1971) PASS: lldb-unit :: Utility/./UtilityTests/SubsystemRAIITest.SubsystemWithErrorSuccess (1585 of 1971) PASS: lldb-unit :: Symbol/./SymbolTests/TestTypeSystemClang.TestFunctionTemplateInRecordConstruction (1586 of 1971) PASS: lldb-shell :: SymbolFile/Breakpad/symtab-macho.test (1587 of 1971) PASS: lldb-unit :: Utility/./UtilityTests/LogChannelEnabledTest.LogThread (1588 of 1971) PASS: lldb-unit :: Language/CPlusPlus/./LanguageCPlusPlusTests/CPlusPlusLanguage.MethodNameParsing (1589 of 1971) PASS: lldb-unit :: Utility/./UtilityTests/ScalarTest.SetValueFromCString (1590 of 1971) UNSUPPORTED: lldb-api :: functionalities/asan/TestReportData.py (1591 of 1971) PASS: lldb-api :: lang/cpp/gmodules/TestWithModuleDebugging.py (1592 of 1971) PASS: lldb-api :: sanity/TestModuleCacheSanity.py (1593 of 1971) PASS: lldb-shell :: SymbolFile/DWARF/find-basic-function.cpp (1594 of 1971) PASS: lldb-api :: commands/expression/import-std-module/vector-of-vectors/TestVectorOfVectorsFromStdModule.py (1595 of 1971) PASS: lldb-unit :: Utility/./UtilityTests/StringLexerTest.Next (1596 of 1971) PASS: lldb-api :: lang/cpp/dynamic-value-same-basename/TestDynamicValueSameBase.py (1597 of 1971) PASS: lldb-shell :: Settings/TestModuleCacheSanity.test (1598 of 1971) PASS: lldb-api :: python_api/watchpoint/TestWatchpointIter.py (1599 of 1971) PASS: lldb-unit :: Utility/./UtilityTests/StringExtractorTest.GetHexU8_Underflow2_NoEof (1600 of 1971) PASS: lldb-api :: functionalities/thread/thread_exit/TestThreadExit.py (1601 of 1971) PASS: lldb-api :: functionalities/breakpoint/dummy_target_breakpoints/TestBreakpointsWithNoTargets.py (1602 of 1971) PASS: lldb-api :: python_api/watchpoint/condition/TestWatchpointConditionAPI.py (1603 of 1971) PASS: lldb-api :: functionalities/data-formatter/data-formatter-stl/libcxx/variant/TestDataFormatterLibcxxVariant.py (1604 of 1971) PASS: lldb-unit :: Utility/./UtilityTests/Flags.GetBitSize (1605 of 1971) PASS: lldb-unit :: SymbolFile/NativePDB/./SymbolFileNativePDBTests/PDBFPOProgramToDWARFExpressionTests.InvalidAssignmentSingle (1606 of 1971) PASS: lldb-unit :: Utility/./UtilityTests/RangeTest.ContainsAddrInvalid (1607 of 1971) PASS: lldb-api :: functionalities/data-formatter/ptr_ref_typedef/TestPtrRef2Typedef.py (1608 of 1971) PASS: lldb-unit :: Core/./LLDBCoreTests/StreamCallbackTest.Callback (1609 of 1971) PASS: lldb-unit :: Utility/./UtilityTests/StringListTest.SetSize (1610 of 1971) PASS: lldb-unit :: SymbolFile/NativePDB/./SymbolFileNativePDBTests/PDBFPOProgramToDWARFExpressionTests.MultipleIndependentAssignments (1611 of 1971) PASS: lldb-unit :: Utility/./UtilityTests/BinaryStreamTest.PutULEB128EightBytes (1612 of 1971) PASS: lldb-shell :: SymbolFile/DWARF/find-basic-variable.cpp (1613 of 1971) PASS: lldb-shell :: SymbolFile/Breakpad/line-table-discontinuous-file-ids.test (1614 of 1971) PASS: lldb-api :: functionalities/breakpoint/step_over_breakpoint/TestStepOverBreakpoint.py (1615 of 1971) PASS: lldb-api :: lang/mixed/TestMixedLanguages.py (1616 of 1971) PASS: lldb-unit :: Utility/./UtilityTests/StringExtractorTest.DecodeHexU8_InvalidHex (1617 of 1971) UNSUPPORTED: lldb-shell :: Minidump/Windows/arm-fp-unwind.test (1618 of 1971) PASS: lldb-api :: commands/apropos/with-process/TestAproposWithProcess.py (1619 of 1971) UNSUPPORTED: lldb-shell :: SymbolFile/NativePDB/local-variables.cpp (1620 of 1971) PASS: lldb-unit :: Utility/./UtilityTests/UriParserTest.SchemeHostSeparator2 (1621 of 1971) PASS: lldb-unit :: UnwindAssembly/x86/./UnwindAssemblyx86Tests/Testx86AssemblyInspectionEngine.TestDisassemblyMidFunctionEpilogues (1622 of 1971) PASS: lldb-api :: python_api/sbenvironment/TestSBEnvironment.py (1623 of 1971) PASS: lldb-unit :: Utility/./UtilityTests/StreamTest.PutMaxHex64ByteOrderBig (1624 of 1971) PASS: lldb-unit :: Utility/./UtilityTests/SerializationRountripTest.SerializeDeserializeObjectPointer (1625 of 1971) PASS: lldb-api :: commands/expression/char/TestExprsChar.py (1626 of 1971) PASS: lldb-unit :: Utility/./UtilityTests/FileSpecTest.CopyByAppendingPathComponent (1627 of 1971) PASS: lldb-shell :: BuildScript/script-args.test (1628 of 1971) PASS: lldb-shell :: SymbolFile/DWARF/apple-index-is-used.cpp (1629 of 1971) PASS: lldb-unit :: Utility/./UtilityTests/StringExtractorTest.GetHexBytes_OddPair (1630 of 1971) PASS: lldb-unit :: ScriptInterpreter/Python/./ScriptInterpreterPythonTests/PythonDataObjectsTest.TestPythonIntegerToStr (1631 of 1971) PASS: lldb-unit :: Utility/./UtilityTests/BinaryStreamTest.PutULEB128TwoBytes (1632 of 1971) PASS: lldb-unit :: Utility/./UtilityTests/ArchSpecTest.Compatibility (1633 of 1971) PASS: lldb-unit :: Expression/./ExpressionTests/CppModuleConfigurationTest.AmbiguousLibCpp (1634 of 1971) PASS: lldb-api :: lang/cpp/offsetof/TestOffsetofCpp.py (1635 of 1971) PASS: lldb-unit :: Symbol/./SymbolTests/TestClangASTImporter.CopyTypeTagDecl (1636 of 1971) PASS: lldb-unit :: Process/minidump/./LLDBMinidumpTests/MinidumpParserTest.GetThreadContext_x86_32_wow64 (1637 of 1971) PASS: lldb-api :: functionalities/reproducers/attach/TestReproducerAttach.py (1638 of 1971) PASS: lldb-unit :: Utility/./UtilityTests/AnsiTerminal.AtEnd (1639 of 1971) UNSUPPORTED: lldb-api :: functionalities/darwin_log/filter/regex/subsystem/TestDarwinLogFilterRegexSubsystem.py (1640 of 1971) UNSUPPORTED: lldb-api :: commands/watchpoints/variable_out_of_scope/TestWatchedVarHitWhenInScope.py (1641 of 1971) UNSUPPORTED: lldb-shell :: ScriptInterpreter/Lua/breakpoint_callback.test (1642 of 1971) UNSUPPORTED: lldb-shell :: SymbolFile/DWARF/debug-types-expressions.test (1643 of 1971) PASS: lldb-api :: functionalities/data-formatter/data-formatter-objc/TestDataFormatterObjCExpr.py (1644 of 1971) PASS: lldb-unit :: Utility/./UtilityTests/StringExtractorTest.GetHexBytesAvail_OddPair2 (1645 of 1971) PASS: lldb-api :: api/multithreaded/TestMultithreaded.py (1646 of 1971) PASS: lldb-api :: commands/watchpoints/watchpoint_disable/TestWatchpointDisable.py (1647 of 1971) PASS: lldb-unit :: Utility/./UtilityTests/StringLexerTest.GetUnlexed (1648 of 1971) PASS: lldb-api :: functionalities/plugins/python_os_plugin/TestPythonOSPlugin.py (1649 of 1971) PASS: lldb-shell :: Register/x86-64-read.test (1650 of 1971) PASS: lldb-api :: lang/objc/foundation/TestObjCMethods.py (1651 of 1971) PASS: lldb-unit :: Utility/./UtilityTests/BinaryStreamTest.PutSLEB128TwoBytes (1652 of 1971) UNSUPPORTED: lldb-api :: functionalities/tsan/multiple/TestTsanMultiple.py (1653 of 1971) PASS: lldb-api :: functionalities/memory-region/TestMemoryRegion.py (1654 of 1971) PASS: lldb-api :: functionalities/gdb_remote_client/TestStopPCs.py (1655 of 1971) PASS: lldb-unit :: Utility/./UtilityTests/RangeTest.ContainsEndInclusive (1656 of 1971) PASS: lldb-unit :: Utility/./UtilityTests/StreamTeeTest.Constructor1Stream (1657 of 1971) PASS: lldb-api :: lang/objc/ivar-IMP/TestObjCiVarIMP.py (1658 of 1971) PASS: lldb-shell :: Minidump/disassemble-no-module.yaml (1659 of 1971) PASS: lldb-unit :: tools/lldb-server/tests/./LLDBServerTests/StandardStartupTest.TestStopReplyContainsThreadPcs (1660 of 1971) PASS: lldb-unit :: Utility/./UtilityTests/StringExtractorTest.GetHexBytesAvail_Partial (1661 of 1971) PASS: lldb-unit :: ScriptInterpreter/Python/./ScriptInterpreterPythonTests/PythonDataObjectsTest.TestCallable (1662 of 1971) UNSUPPORTED: lldb-api :: commands/expression/completion-crash-invalid-iterator/TestInvalidIteratorCompletionCrash.py (1663 of 1971) PASS: lldb-api :: python_api/name_lookup/TestNameLookup.py (1664 of 1971) PASS: lldb-unit :: Process/gdb-remote/./ProcessGdbRemoteTests/GDBRemoteCommunicationClientTest.WriteRegister (1665 of 1971) PASS: lldb-unit :: debugserver/./debugserverTests/RNBSocket.AnyListen (1666 of 1971) PASS: lldb-unit :: Utility/./UtilityTests/StringExtractorTest.GetHexBytes_OddPair2 (1667 of 1971) PASS: lldb-api :: lang/cpp/extern_c/TestExternCSymbols.py (1668 of 1971) PASS: lldb-unit :: debugserver/./debugserverTests/JSON.Parse (1669 of 1971) PASS: lldb-api :: functionalities/thread/exit_during_step/TestExitDuringStep.py (1670 of 1971) PASS: lldb-api :: lang/objc/objc-new-syntax/TestObjCNewSyntaxDictionary.py (1671 of 1971) PASS: lldb-api :: lang/objc/unicode-string/TestUnicodeString.py (1672 of 1971) PASS: lldb-unit :: Utility/./UtilityTests/ScalarTest.ComparisonFloat (1673 of 1971) PASS: lldb-unit :: Utility/./UtilityTests/CompletionRequest.TryCompleteCurrentArgMode (1674 of 1971) PASS: lldb-unit :: Utility/./UtilityTests/StreamTest.PutHex64ByteOrderLittle (1675 of 1971) PASS: lldb-api :: functionalities/signal/TestSendSignal.py (1676 of 1971) UNSUPPORTED: lldb-api :: lang/objc/rdar-12408181/TestRdar12408181.py (1677 of 1971) PASS: lldb-unit :: ScriptInterpreter/Python/./ScriptInterpreterPythonTests/PythonDataObjectsTest.TestGlobalNameResolutionNoDot (1678 of 1971) PASS: lldb-unit :: Utility/./UtilityTests/StringListTest.AppendStringCString (1679 of 1971) PASS: lldb-unit :: Utility/./UtilityTests/TimeoutTest.Construction (1680 of 1971) PASS: lldb-shell :: Commands/command-disassemble.s (1681 of 1971) PASS: lldb-unit :: Process/gdb-remote/./ProcessGdbRemoteTests/GDBRemoteCommunicationClientTest.SendGetTraceConfigPacket (1682 of 1971) PASS: lldb-unit :: Utility/./UtilityTests/RegularExpression.Match (1683 of 1971) PASS: lldb-unit :: ScriptInterpreter/Python/./ScriptInterpreterPythonTests/PythonDataObjectsTest.TestPythonDictionaryValueEquality (1684 of 1971) UNSUPPORTED: lldb-api :: functionalities/data-formatter/data-formatter-stl/libstdcpp/tuple/TestDataFormatterStdTuple.py (1685 of 1971) PASS: lldb-api :: lang/objc/orderedset/TestOrderedSet.py (1686 of 1971) UNSUPPORTED: lldb-api :: tools/lldb-server/libraries-svr4/TestGdbRemoteLibrariesSvr4Support.py (1687 of 1971) PASS: lldb-unit :: Utility/./UtilityTests/OptionsWithRawTest.MultiWordSuffix (1688 of 1971) PASS: lldb-shell :: SymbolFile/DWARF/debug_loc.s (1689 of 1971) UNSUPPORTED: lldb-api :: linux/mix-dwo-and-regular-objects/TestMixedDwarfBinary.py (1690 of 1971) PASS: lldb-unit :: Utility/./UtilityTests/StreamTest.PutNHex8 (1691 of 1971) UNSUPPORTED: lldb-shell :: SymbolFile/PDB/typedefs.test (1692 of 1971) PASS: lldb-api :: types/TestDoubleTypes.py (1693 of 1971) PASS: lldb-unit :: Utility/./UtilityTests/StreamTest.PutHex8 (1694 of 1971) PASS: lldb-api :: functionalities/gdb_remote_client/TestNoWatchpointSupportInfo.py (1695 of 1971) PASS: lldb-unit :: ObjectFile/Breakpad/./ObjectFileBreakpadTests/ModuleRecord.parse (1696 of 1971) PASS: lldb-unit :: Utility/./UtilityTests/SerializationRountripTest.SerializeDeserializeCStringArray (1697 of 1971) PASS: lldb-api :: functionalities/thread/concurrent_events/TestConcurrentSignalWatchBreak.py (1698 of 1971) PASS: lldb-unit :: Utility/./UtilityTests/StreamTest.PutStringAsRawHex8 (1699 of 1971) PASS: lldb-api :: lang/cpp/enum_types/TestCPP11EnumTypes.py (1700 of 1971) PASS: lldb-unit :: Utility/./UtilityTests/StringLexerTest.HasAtLeast (1701 of 1971) PASS: lldb-api :: functionalities/testid/TestTestId.py (1702 of 1971) PASS: lldb-unit :: Process/gdb-remote/./ProcessGdbRemoteTests/GDBRemoteCommunicationClientTest.ReadRegister (1703 of 1971) PASS: lldb-api :: commands/expression/call-function/TestCallStopAndContinue.py (1704 of 1971) PASS: lldb-api :: functionalities/data-formatter/data-formatter-stl/libcxx/string/TestDataFormatterLibcxxString.py (1705 of 1971) PASS: lldb-api :: commands/expression/vector_of_enums/TestVectorOfEnums.py (1706 of 1971) XFAIL: lldb-shell :: Register/x86-mm-xmm-write.test (1707 of 1971) PASS: lldb-unit :: Target/./TargetTests/ModuleCacheTest.GetAndPutUuidExists (1708 of 1971) PASS: lldb-api :: commands/watchpoints/watchpoint_set_command/TestWatchLocationWithWatchSet.py (1709 of 1971) PASS: lldb-api :: lang/c/shared_lib/TestSharedLib.py (1710 of 1971) UNSUPPORTED: lldb-api :: functionalities/darwin_log/filter/exact_match/activity/TestDarwinLogFilterMatchActivity.py (1711 of 1971) PASS: lldb-api :: commands/expression/import-std-module/basic/TestImportStdModule.py (1712 of 1971) PASS: lldb-unit :: Utility/./UtilityTests/ArgsTest.TestQuotedTrailingBackslash (1713 of 1971) PASS: lldb-unit :: UnwindAssembly/x86/./UnwindAssemblyx86Tests/Testx86AssemblyInspectionEngine.TestPushEBP (1714 of 1971) PASS: lldb-unit :: ScriptInterpreter/Python/./ScriptInterpreterPythonTests/PythonDataObjectsTest.TestGlobalNameResolutionWithDot (1715 of 1971) PASS: lldb-unit :: Utility/./UtilityTests/UriParserTest.MinimalPath (1716 of 1971) PASS: lldb-api :: functionalities/data-formatter/data-formatter-caching/TestDataFormatterCaching.py (1717 of 1971) PASS: lldb-api :: functionalities/gdb_remote_client/TestNoGPacketSupported.py (1718 of 1971) PASS: lldb-unit :: Expression/./ExpressionTests/DiagnosticManagerTest.AppendMessageAttachToLastDiag (1719 of 1971) PASS: lldb-shell :: ObjectFile/MachO/symtab.yaml (1720 of 1971) PASS: lldb-unit :: Language/Highlighting/./HighlighterTests/HighlighterTest.ClangCommas (1721 of 1971) PASS: lldb-api :: functionalities/breakpoint/require_hw_breakpoints/TestRequireHWBreakpoints.py (1722 of 1971) PASS: lldb-api :: lang/objc/modules-cache/TestClangModulesCache.py (1723 of 1971) PASS: lldb-api :: macosx/queues/TestQueues.py (1724 of 1971) PASS: lldb-unit :: Utility/./UtilityTests/SerializationRountripTest.SerializeDeserializePodReferences (1725 of 1971) PASS: lldb-shell :: SymbolFile/Breakpad/unwind-via-stack-cfi.test (1726 of 1971) PASS: lldb-unit :: Utility/./UtilityTests/UUIDTest.StringConverion (1727 of 1971) PASS: lldb-unit :: Process/minidump/./LLDBMinidumpTests/MinidumpParserTest.GetThreadContext_x86_64 (1728 of 1971) PASS: lldb-api :: functionalities/thread/concurrent_events/TestConcurrentTwoBreakpointsOneDelaySignal.py (1729 of 1971) UNSUPPORTED: lldb-api :: functionalities/gdb_remote_client/TestWasm.py (1730 of 1971) PASS: lldb-unit :: Utility/./UtilityTests/StreamTest.Indent (1731 of 1971) UNSUPPORTED: lldb-api :: functionalities/darwin_log/filter/exact_match/message/TestDarwinLogFilterMatchMessage.py (1732 of 1971) PASS: lldb-shell :: ObjectFile/ELF/section-permissions.yaml (1733 of 1971) PASS: lldb-unit :: Utility/./UtilityTests/StreamTeeTest.SetStreamAtIndexOutOfBounds (1734 of 1971) PASS: lldb-shell :: SymbolFile/DWARF/dwarf5_locations.s (1735 of 1971) PASS: lldb-shell :: Commands/command-backtrace.test (1736 of 1971) UNSUPPORTED: lldb-shell :: ScriptInterpreter/Lua/nested_sessions.test (1737 of 1971) FAIL: lldb-api :: lang/objc/ptr_refs/TestPtrRefsObjC.py (1738 of 1971) ******************** TEST 'lldb-api :: lang/objc/ptr_refs/TestPtrRefsObjC.py' FAILED ******************** Script: -- /usr/local/bin/python /Users/buildslave/jenkins/workspace/lldb-cmake-sanitized/llvm-project/lldb/test/API/dotest.py --arch x86_64 -s /Users/buildslave/jenkins/workspace/lldb-cmake-sanitized/lldb-build/lldb-test-traces -S nm -u CXXFLAGS -u CFLAGS --codesign-identity lldb_codesign --server /Users/buildslave/jenkins/workspace/lldb-cmake-sanitized/lldb-build/./bin/debugserver --arch x86_64 --build-dir /Users/buildslave/jenkins/workspace/lldb-cmake-sanitized/lldb-build/lldb-test-build.noindex -s=/Users/buildslave/jenkins/workspace/lldb-cmake-sanitized/test/logs -t --env TERM=vt100 --env LLVM_LIBS_DIR=/Users/buildslave/jenkins/workspace/lldb-cmake-sanitized/lldb-build/./lib --inferior-env ASAN_OPTIONS=detect_stack_use_after_return=1 --inferior-env DYLD_INSERT_LIBRARIES=/Users/buildslave/jenkins/workspace/lldb-cmake-sanitized/host-compiler/lib/clang/11.0.0/lib/darwin/libclang_rt.asan_osx_dynamic.dylib --build-dir /Users/buildslave/jenkins/workspace/lldb-cmake-sanitized/lldb-build/lldb-test-build.noindex --lldb-module-cache-dir /Users/buildslave/jenkins/workspace/lldb-cmake-sanitized/lldb-build/lldb-test-build.noindex/module-cache-lldb/lldb-api --clang-module-cache-dir /Users/buildslave/jenkins/workspace/lldb-cmake-sanitized/lldb-build/lldb-test-build.noindex/module-cache-clang/lldb-api --executable /Users/buildslave/jenkins/workspace/lldb-cmake-sanitized/lldb-build/./bin/lldb --compiler /Users/buildslave/jenkins/workspace/lldb-cmake-sanitized/lldb-build/./bin/clang --dsymutil /Users/buildslave/jenkins/workspace/lldb-cmake-sanitized/lldb-build/./bin/dsymutil --filecheck /Users/buildslave/jenkins/workspace/lldb-cmake-sanitized/lldb-build/./bin/FileCheck --lldb-libs-dir /Users/buildslave/jenkins/workspace/lldb-cmake-sanitized/lldb-build/./lib /Users/buildslave/jenkins/workspace/lldb-cmake-sanitized/llvm-project/lldb/test/API/lang/objc/ptr_refs -p TestPtrRefsObjC.py -- Exit Code: 1

Hide Details

Command Output (stdout): -- lldb version 11.0.99 clang revision 2c080a3f23e49edddb0799a569d7d3319fc91d86 llvm revision 2c080a3f23e49edddb0799a569d7d3319fc91d86 "crashlog" and "save_crashlog" command installed, use the "--help" option for detailed help "malloc_info", "ptr_refs", "cstr_refs", "find_variable", and "objc_refs" commands have been installed, use the "--help" options on these commands for detailed help. LLDB library dir: /Users/buildslave/jenkins/workspace/lldb-cmake-sanitized/lldb-build/bin LLDB import library dir: /Users/buildslave/jenkins/workspace/lldb-cmake-sanitized/lldb-build/./lib libstdcxx tests will not be run because: Don't know how to build with libstdcxx on macosx Skipping following debug info categories: ['dwo'] 0x00007ffee3733468: stack in frame #0 of thread #1: tid 0x6c7f69 in variable at 0x7ffee3733468: (MyClass *) self = 0x00006020000000d0 0x00007ffee37333e0: stack (red zone)

Hide Details

-- Command Output (stderr): -- error: 'ptr_refs' is not a valid command. error: 'ptr_refs' is not a valid command.

Hide Details

Session logs for test failures/errors/unexpected successes will go into directory '/Users/buildslave/jenkins/workspace/lldb-cmake-sanitized/test/logs' Command invoked: /Users/buildslave/jenkins/workspace/lldb-cmake-sanitized/llvm-project/lldb/test/API/dotest.py --arch x86_64 -s /Users/buildslave/jenkins/workspace/lldb-cmake-sanitized/lldb-build/lldb-test-traces -S nm -u CXXFLAGS -u CFLAGS --codesign-identity lldb_codesign --server /Users/buildslave/jenkins/workspace/lldb-cmake-sanitized/lldb-build/./bin/debugserver --arch x86_64 --build-dir /Users/buildslave/jenkins/workspace/lldb-cmake-sanitized/lldb-build/lldb-test-build.noindex -s=/Users/buildslave/jenkins/workspace/lldb-cmake-sanitized/test/logs -t --env TERM=vt100 --env LLVM_LIBS_DIR=/Users/buildslave/jenkins/workspace/lldb-cmake-sanitized/lldb-build/./lib --inferior-env ASAN_OPTIONS=detect_stack_use_after_return=1 --inferior-env DYLD_INSERT_LIBRARIES=/Users/buildslave/jenkins/workspace/lldb-cmake-sanitized/host-compiler/lib/clang/11.0.0/lib/darwin/libclang_rt.asan_osx_dynamic.dylib --build-dir /Users/buildslave/jenkins/workspace/lldb-cmake-sanitized/lldb-build/lldb-test-build.noindex --lldb-module-cache-dir /Users/buildslave/jenkins/workspace/lldb-cmake-sanitized/lldb-build/lldb-test-build.noindex/module-cache-lldb/lldb-api --clang-module-cache-dir /Users/buildslave/jenkins/workspace/lldb-cmake-sanitized/lldb-build/lldb-test-build.noindex/module-cache-clang/lldb-api --executable /Users/buildslave/jenkins/workspace/lldb-cmake-sanitized/lldb-build/./bin/lldb --compiler /Users/buildslave/jenkins/workspace/lldb-cmake-sanitized/lldb-build/./bin/clang --dsymutil /Users/buildslave/jenkins/workspace/lldb-cmake-sanitized/lldb-build/./bin/dsymutil --filecheck /Users/buildslave/jenkins/workspace/lldb-cmake-sanitized/lldb-build/./bin/FileCheck --lldb-libs-dir /Users/buildslave/jenkins/workspace/lldb-cmake-sanitized/lldb-build/./lib /Users/buildslave/jenkins/workspace/lldb-cmake-sanitized/llvm-project/lldb/test/API/lang/objc/ptr_refs -p TestPtrRefsObjC.py Change dir to: /Users/buildslave/jenkins/workspace/lldb-cmake-sanitized/llvm-project/lldb/test/API/lang/objc/ptr_refs runCmd: settings clear -all output:

Hide Details

runCmd: settings set symbols.enable-external-lookup false output:

Hide Details

runCmd: settings set target.auto-apply-fixits false output:

Hide Details

runCmd: settings set plugin.process.gdb-remote.packet-timeout 60 output:

Hide Details

runCmd: settings set symbols.clang-modules-cache-path "/Users/buildslave/jenkins/workspace/lldb-cmake-sanitized/lldb-build/lldb-test-build.noindex/module-cache-lldb/lldb-api" output:

Hide Details

runCmd: settings set use-color false output:

Hide Details

runCmd: setting set target.prefer-dynamic-value no-dynamic-values output:

Hide Details

runCmd: settings set target.env-vars ASAN_OPTIONS=detect_stack_use_after_return=1 DYLD_INSERT_LIBRARIES=/Users/buildslave/jenkins/workspace/lldb-cmake-sanitized/host-compiler/lib/clang/11.0.0/lib/darwin/libclang_rt.asan_osx_dynamic.dylib output:

Hide Details

runCmd: script import lldb.macosx.heap output: "crashlog" and "save_crashlog" command installed, use the "--help" option for detailed help "malloc_info", "ptr_refs", "cstr_refs", "find_variable", and "objc_refs" commands have been installed, use the "--help" options on these commands for detailed help.

Hide Details

Hide Details

runCmd: ptr_refs self output: 0x00007ffee3733468: stack in frame #0 of thread #1: tid 0x6c7f69 in variable at 0x7ffee3733468: (MyClass *) self = 0x00006020000000d0 0x00007ffee37333e0: stack (red zone)

Hide Details

Hide Details

Expecting sub string: malloc Not matched

Hide Details

FAIL: LLDB (/Users/buildslave/jenkins/workspace/lldb-cmake-sanitized/lldb-build/bin/clang-11-x86_64) :: test_ptr_refs_dsym (TestPtrRefsObjC.TestPtrRefsObjC) <bound method SBProcess.Kill of <lldb.SBProcess; proxy of <Swig Object of type 'lldb::SBProcess *' at 0x1200ba8a0> >>: success

Hide Details

runCmd: settings clear -all output:

Hide Details

runCmd: settings set symbols.enable-external-lookup false output:

Hide Details

runCmd: settings set target.auto-apply-fixits false output:

Hide Details

runCmd: settings set plugin.process.gdb-remote.packet-timeout 60 output:

Hide Details

runCmd: settings set symbols.clang-modules-cache-path "/Users/buildslave/jenkins/workspace/lldb-cmake-sanitized/lldb-build/lldb-test-build.noindex/module-cache-lldb/lldb-api" output:

Hide Details

runCmd: settings set use-color false output:

Hide Details

runCmd: setting set target.prefer-dynamic-value no-dynamic-values output:

Hide Details

runCmd: settings set target.env-vars ASAN_OPTIONS=detect_stack_use_after_return=1 DYLD_INSERT_LIBRARIES=/Users/buildslave/jenkins/workspace/lldb-cmake-sanitized/host-compiler/lib/clang/11.0.0/lib/darwin/libclang_rt.asan_osx_dynamic.dylib output:

Hide Details

runCmd: script import lldb.macosx.heap output:

Hide Details

runCmd: ptr_refs self runCmd failed! error: 'ptr_refs' is not a valid command.

Hide Details

Hide Details

XFAIL: LLDB (/Users/buildslave/jenkins/workspace/lldb-cmake-sanitized/lldb-build/bin/clang-11-x86_64) :: test_ptr_refs_dwarf (TestPtrRefsObjC.TestPtrRefsObjC) <bound method SBProcess.Kill of <lldb.SBProcess; proxy of <Swig Object of type 'lldb::SBProcess *' at 0x108e03990> >>: success

Hide Details

UNSUPPORTED: LLDB (/Users/buildslave/jenkins/workspace/lldb-cmake-sanitized/lldb-build/bin/clang-11-x86_64) :: test_ptr_refs_dwo (TestPtrRefsObjC.TestPtrRefsObjC) (test case does not fall in any category of interest for this run) runCmd: settings clear -all output:

Hide Details

runCmd: settings set symbols.enable-external-lookup false output:

Hide Details

runCmd: settings set target.auto-apply-fixits false output:

Hide Details

runCmd: settings set plugin.process.gdb-remote.packet-timeout 60 output:

Hide Details

runCmd: settings set symbols.clang-modules-cache-path "/Users/buildslave/jenkins/workspace/lldb-cmake-sanitized/lldb-build/lldb-test-build.noindex/module-cache-lldb/lldb-api" output:

Hide Details

runCmd: settings set use-color false output:

Hide Details

runCmd: setting set target.prefer-dynamic-value no-dynamic-values output:

Hide Details

runCmd: settings set target.env-vars ASAN_OPTIONS=detect_stack_use_after_return=1 DYLD_INSERT_LIBRARIES=/Users/buildslave/jenkins/workspace/lldb-cmake-sanitized/host-compiler/lib/clang/11.0.0/lib/darwin/libclang_rt.asan_osx_dynamic.dylib output:

Hide Details

runCmd: script import lldb.macosx.heap output:

Hide Details

runCmd: ptr_refs self runCmd failed! error: 'ptr_refs' is not a valid command.

Hide Details

Hide Details

XFAIL: LLDB (/Users/buildslave/jenkins/workspace/lldb-cmake-sanitized/lldb-build/bin/clang-11-x86_64) :: test_ptr_refs_gmodules (TestPtrRefsObjC.TestPtrRefsObjC) <bound method SBProcess.Kill of <lldb.SBProcess; proxy of <Swig Object of type 'lldb::SBProcess *' at 0x1200ba1e0> >>: success

Hide Details

Restore dir to: /Users/buildslave/jenkins/workspace/lldb-cmake-sanitized/lldb-build/tools/lldb/test ====================================================================== FAIL: test_ptr_refs_dsym (TestPtrRefsObjC.TestPtrRefsObjC) Test the ptr_refs tool on Darwin with Objective-C ---------------------------------------------------------------------- Traceback (most recent call last): File "/Users/buildslave/jenkins/workspace/lldb-cmake-sanitized/llvm-project/lldb/packages/Python/lldbsuite/test/lldbtest.py", line 1751, in test_method return attrvalue(self) File "/Users/buildslave/jenkins/workspace/lldb-cmake-sanitized/llvm-project/lldb/packages/Python/lldbsuite/test/decorators.py", line 110, in wrapper func(*args, **kwargs) File "/Users/buildslave/jenkins/workspace/lldb-cmake-sanitized/llvm-project/lldb/test/API/lang/objc/ptr_refs/TestPtrRefsObjC.py", line 47, in test_ptr_refs self.expect("ptr_refs self", substrs=["malloc", "stack"]) File "/Users/buildslave/jenkins/workspace/lldb-cmake-sanitized/llvm-project/lldb/packages/Python/lldbsuite/test/lldbtest.py", line 2391, in expect if msg else EXP_MSG(str, output, exe)) AssertionError: False is not True : 'ptr_refs self' returns expected result, got '0x00007ffee3733468: stack in frame #0 of thread #1: tid 0x6c7f69 in variable at 0x7ffee3733468: (MyClass *) self = 0x00006020000000d0 0x00007ffee37333e0: stack (red zone)' Config=x86_64-/Users/buildslave/jenkins/workspace/lldb-cmake-sanitized/lldb-build/bin/clang-11 ---------------------------------------------------------------------- Ran 4 tests in 22.365s

Hide Details

RESULT: FAILED (0 passes, 1 failures, 0 errors, 1 skipped, 2 expected failures, 0 unexpected successes)

Hide Details

--

Hide Details

******************** PASS: lldb-shell :: SymbolFile/DWARF/debug-line-basic.s (1739 of 1971) PASS: lldb-unit :: Language/Highlighting/./HighlighterTests/HighlighterTest.ClangSquareBrackets (1740 of 1971) UNSUPPORTED: lldb-shell :: ScriptInterpreter/Lua/lua.test (1741 of 1971) PASS: lldb-api :: functionalities/memory/cache/TestMemoryCache.py (1742 of 1971) PASS: lldb-api :: commands/disassemble/basic/TestFrameDisassemble.py (1743 of 1971) UNSUPPORTED: lldb-shell :: Register/x86-64-zmm-write.test (1744 of 1971) PASS: lldb-unit :: Utility/./UtilityTests/Flags.IsClear (1745 of 1971) PASS: lldb-api :: commands/expression/radar_9531204/TestPrintfAfterUp.py (1746 of 1971) PASS: lldb-shell :: Reproducer/TestVersionCheck.test (1747 of 1971) PASS: lldb-unit :: Utility/./UtilityTests/TimerTest.CategoryTimes (1748 of 1971) PASS: lldb-shell :: ObjectFile/ELF/PT_LOAD-overlap-PT_INTERP.yaml (1749 of 1971) PASS: lldb-unit :: Utility/./UtilityTests/TimerTest.CategoryTimes2 (1750 of 1971) PASS: lldb-shell :: Commands/command-regex-unalias.test (1751 of 1971) PASS: lldb-unit :: Process/gdb-remote/./ProcessGdbRemoteTests/GDBRemoteClientBaseTest.SendContinueAndAsyncSignal (1752 of 1971) PASS: lldb-api :: commands/expression/top-level/TestTopLevelExprs.py (1753 of 1971) PASS: lldb-api :: commands/expression/completion-crash-incomplete-record/TestCompletionCrashIncompleteRecord.py (1754 of 1971) UNSUPPORTED: lldb-api :: functionalities/tsan/cpp_global_location/TestTsanCPPGlobalLocation.py (1755 of 1971) UNSUPPORTED: lldb-api :: commands/expression/multiline-navigation/TestMultilineNavigation.py (1756 of 1971) PASS: lldb-unit :: Utility/./UtilityTests/StringListTest.GetMaxStringLengthEmpty (1757 of 1971) PASS: lldb-unit :: Utility/./UtilityTests/StreamTeeTest.SetStreamAtIndexOverwrite (1758 of 1971) PASS: lldb-unit :: Utility/./UtilityTests/StringExtractorTest.GetNameColonValueNoSemicolon (1759 of 1971) PASS: lldb-unit :: Utility/./UtilityTests/RecordReplayTest.InstrumentedBarPtr (1760 of 1971) PASS: lldb-shell :: ObjectFile/ELF/avr-basic-info.yaml (1761 of 1971) PASS: lldb-unit :: Process/minidump/./LLDBMinidumpTests/RegisterContextMinidump.CheckRegisterContextMinidump_ARM (1762 of 1971) PASS: lldb-unit :: Utility/./UtilityTests/StringListTest.ShiftMove (1763 of 1971) PASS: lldb-shell :: Reproducer/TestMultipleTargets.test (1764 of 1971) PASS: lldb-shell :: Settings/TestStopCommandSourceOnError.test (1765 of 1971) UNSUPPORTED: lldb-shell :: Process/Windows/exception_access_violation.cpp (1766 of 1971) UNSUPPORTED: lldb-api :: functionalities/darwin_log/source/info/TestDarwinLogSourceInfo.py (1767 of 1971) UNSUPPORTED: lldb-api :: functionalities/data-formatter/data-formatter-stl/libstdcpp/vector/TestDataFormatterStdVector.py (1768 of 1971) PASS: lldb-api :: lang/objc/objc-static-method/TestObjCStaticMethod.py (1769 of 1971) PASS: lldb-api :: functionalities/postmortem/elf-core/thread_crash/TestLinuxCoreThreads.py (1770 of 1971) PASS: lldb-api :: lang/cpp/rvalue-references/TestRvalueReferences.py (1771 of 1971) PASS: lldb-unit :: Host/./HostTests/FileSystemTest.GetPermissions (1772 of 1971) PASS: lldb-unit :: Utility/./UtilityTests/CompletionRequest.FakeLastArg (1773 of 1971) PASS: lldb-api :: lang/objc/objc-runtime-ivars/TestRuntimeIvars.py (1774 of 1971) PASS: lldb-api :: commands/expression/po_verbosity/TestPoVerbosity.py (1775 of 1971) UNSUPPORTED: lldb-shell :: Expr/TestIRMemoryMapWindows.test (1776 of 1971) PASS: lldb-unit :: Expression/./ExpressionTests/DiagnosticManagerTest.PutStringSeverities (1777 of 1971) PASS: lldb-unit :: Utility/./UtilityTests/ArchSpecTest.TripleComponentsWereSpecified (1778 of 1971) PASS: lldb-api :: commands/expression/calculator_mode/TestCalculatorMode.py (1779 of 1971) PASS: lldb-shell :: SymbolFile/NativePDB/break-by-line.cpp (1780 of 1971) PASS: lldb-unit :: Utility/./UtilityTests/BinaryStreamTest.PutSLEB128NineBytes (1781 of 1971) PASS: lldb-api :: lang/cpp/overloaded-functions/TestOverloadedFunctions.py (1782 of 1971) PASS: lldb-shell :: ObjectFile/PECOFF/basic-info-arm64.yaml (1783 of 1971) PASS: lldb-unit :: UnwindAssembly/x86/./UnwindAssemblyx86Tests/Testx86AssemblyInspectionEngine.TestSpArithx86_64Augmented (1784 of 1971) PASS: lldb-shell :: SymbolFile/NativePDB/global-classes.cpp (1785 of 1971) PASS: lldb-api :: lang/cpp/template/TestTemplateArgs.py (1786 of 1971) PASS: lldb-unit :: Symbol/./SymbolTests/TestClangASTImporter.CanImportInvalidType (1787 of 1971) PASS: lldb-api :: functionalities/fat_archives/TestFatArchives.py (1788 of 1971) PASS: lldb-api :: functionalities/gdb_remote_client/TestIOSSimulator.py (1789 of 1971) PASS: lldb-api :: functionalities/gdb_remote_client/TestRestartBug.py (1790 of 1971) PASS: lldb-shell :: SymbolFile/DWARF/debug_rnglists-dwo.s (1791 of 1971) PASS: lldb-unit :: Host/./HostTests/SocketTest.UDPGetConnectURI (1792 of 1971) PASS: lldb-shell :: SymbolFile/DWARF/debug_loclists-dwo.s (1793 of 1971) PASS: lldb-api :: functionalities/data-formatter/typedef_array/TestTypedefArray.py (1794 of 1971) UNSUPPORTED: lldb-api :: functionalities/ubsan/basic/TestUbsanBasic.py (1795 of 1971) PASS: lldb-unit :: Utility/./UtilityTests/UserIDResolver.GetGroupName (1796 of 1971) PASS: lldb-api :: lang/cpp/template-function/TestTemplateFunctions.py (1797 of 1971) PASS: lldb-api :: commands/expression/static-initializers/TestStaticInitializers.py (1798 of 1971) PASS: lldb-api :: python_api/frame/TestFrames.py (1799 of 1971) UNSUPPORTED: lldb-api :: functionalities/asan/TestMemoryHistory.py (1800 of 1971) PASS: lldb-api :: python_api/disassemble-raw-data/TestDisassembleRawData.py (1801 of 1971) PASS: lldb-api :: commands/settings/quoting/TestQuoting.py (1802 of 1971) PASS: lldb-unit :: Utility/./UtilityTests/FileSpecTest.Equal (1803 of 1971) PASS: lldb-api :: commands/command/script/import/rdar-12586188/TestRdar12586188.py (1804 of 1971) PASS: lldb-unit :: Platform/./LLDBPlatformTests/PlatformDarwinTest.TestParseVersionBuildDir (1805 of 1971) UNSUPPORTED: lldb-api :: commands/expression/call-restarts/TestCallThatRestarts.py (1806 of 1971) PASS: lldb-unit :: Language/Highlighting/./HighlighterTests/HighlighterTest.ClangTrailingBackslashBeforeNewline (1807 of 1971) PASS: lldb-unit :: Utility/./UtilityTests/ArgsTest.TestQuotedUnknownEscape (1808 of 1971) PASS: lldb-shell :: SymbolFile/NativePDB/ast-functions.cpp (1809 of 1971) PASS: lldb-api :: lang/objc/radar-9691614/TestObjCMethodReturningBOOL.py (1810 of 1971) PASS: lldb-api :: functionalities/data-formatter/data-formatter-stl/libcxx/tuple/TestDataFormatterLibcxxTuple.py (1811 of 1971) PASS: lldb-unit :: Utility/./UtilityTests/FileSpecTest.Yaml (1812 of 1971) PASS: lldb-api :: lang/cpp/namespace_definitions/TestNamespaceDefinitions.py (1813 of 1971) PASS: lldb-unit :: Utility/./UtilityTests/ScalarTest.Equality (1814 of 1971) PASS: lldb-unit :: ScriptInterpreter/Python/./ScriptInterpreterPythonTests/PythonDataObjectsTest.TestPythonTupleSize (1815 of 1971) PASS: lldb-api :: lang/objc/objc-super/TestObjCSuper.py (1816 of 1971) PASS: lldb-api :: functionalities/data-formatter/data-formatter-objc/TestDataFormatterObjCNSURL.py (1817 of 1971) PASS: lldb-unit :: Symbol/./SymbolTests/PostfixExpression.ParseFPOProgram (1818 of 1971) PASS: lldb-unit :: Utility/./UtilityTests/DataExtractorTest.GetCStrAtEnd (1819 of 1971) PASS: lldb-api :: functionalities/breakpoint/cpp/TestCPPBreakpointLocations.py (1820 of 1971) UNSUPPORTED: lldb-api :: functionalities/exec/TestExec.py (1821 of 1971) PASS: lldb-unit :: Utility/./UtilityTests/StringExtractorTest.GetNameColonValueSuccess (1822 of 1971) PASS: lldb-api :: functionalities/data-formatter/varscript_formatting/TestDataFormatterVarScriptFormatting.py (1823 of 1971) PASS: lldb-unit :: Utility/./UtilityTests/CompletionRequest.TryCompleteCurrentArgGood (1824 of 1971) PASS: lldb-api :: tools/lldb-server/TestGdbRemote_qThreadStopInfo.py (1825 of 1971) PASS: lldb-unit :: Utility/./UtilityTests/AnsiTerminal.WhiteSpace (1826 of 1971) PASS: lldb-shell :: Quit/TestQuitExitCode0.test (1827 of 1971) PASS: lldb-unit :: Utility/./UtilityTests/RangeTest.LessThan (1828 of 1971) PASS: lldb-shell :: Breakpoint/dummy-target.test (1829 of 1971) PASS: lldb-shell :: ObjectFile/wasm/stripped-debug-sections.yaml (1830 of 1971) PASS: lldb-unit :: Expression/./ExpressionTests/DWARFExpression.DW_OP_piece (1831 of 1971) PASS: lldb-api :: lang/c/global_variables/TestGlobalVariables.py (1832 of 1971) PASS: lldb-unit :: Utility/./UtilityTests/TimerTest.CategoryTimesNested (1833 of 1971) PASS: lldb-unit :: Utility/./UtilityTests/UserIDResolver.GetUserName (1834 of 1971) PASS: lldb-api :: commands/command/delete/TestCommandDelete.py (1835 of 1971) PASS: lldb-api :: commands/watchpoints/watchpoint_commands/condition/TestWatchpointConditionCmd.py (1836 of 1971) PASS: lldb-unit :: Utility/./UtilityTests/OptionsWithRawTest.EmptyInput (1837 of 1971) PASS: lldb-shell :: ObjectFile/wasm/unified-debug-sections.yaml (1838 of 1971) PASS: lldb-unit :: UnwindAssembly/x86/./UnwindAssemblyx86Tests/Testx86AssemblyInspectionEngine.TestPushEBX (1839 of 1971) PASS: lldb-api :: lang/c/blocks/TestBlocks.py (1840 of 1971) PASS: lldb-unit :: Utility/./UtilityTests/BinaryStreamTest.PutULEB128OneByte (1841 of 1971) PASS: lldb-unit :: Utility/./UtilityTests/FileSpecTest.EqualDotsWindows (1842 of 1971) PASS: lldb-unit :: Expression/./ExpressionTests/DiagnosticManagerTest.GetStringMultipleDiags (1843 of 1971) PASS: lldb-unit :: Utility/./UtilityTests/ArgsTest.ReplaceArgumentAtIndexShort (1844 of 1971) PASS: lldb-unit :: Utility/./UtilityTests/TildeExpressionResolver.ResolveFullPath (1845 of 1971) PASS: lldb-api :: commands/apropos/basic/TestApropos.py (1846 of 1971) PASS: lldb-shell :: ObjectFile/PECOFF/section-types.yaml (1847 of 1971) PASS: lldb-unit :: Symbol/./SymbolTests/LineEntryTest.GetSameLineContiguousAddressRangeOneInline (1848 of 1971) PASS: lldb-unit :: Utility/./UtilityTests/RangeTest.ClearWithStarAddress (1849 of 1971) PASS: lldb-api :: functionalities/data-formatter/data-formatter-objc/TestDataFormatterObjCKVO.py (1850 of 1971) PASS: lldb-unit :: Utility/./UtilityTests/StateTest.Formatv (1851 of 1971) PASS: lldb-unit :: Utility/./UtilityTests/UUIDTest.RelationalOperators (1852 of 1971) PASS: lldb-unit :: Symbol/./SymbolTests/Type.GetTypeScopeAndBasename (1853 of 1971) PASS: lldb-unit :: Utility/./UtilityTests/StringExtractorTest.GetHexBytes_Partial (1854 of 1971) PASS: lldb-unit :: Utility/./UtilityTests/StringListTest.LongestCommonPrefixDuplicateElement (1855 of 1971) PASS: lldb-unit :: Utility/./UtilityTests/ArgsTest.ReplaceArgumentAtIndexLonger (1856 of 1971) PASS: lldb-api :: functionalities/thread/concurrent_events/TestConcurrentBreakpointsDelayedBreakpointOneWatchpoint.py (1857 of 1971) PASS: lldb-api :: lang/objc/objc-property/TestObjCProperty.py (1858 of 1971) PASS: lldb-unit :: UnwindAssembly/x86/./UnwindAssemblyx86Tests/Testx86AssemblyInspectionEngine.TestAddESP (1859 of 1971) PASS: lldb-unit :: ScriptInterpreter/Python/./ScriptInterpreterPythonTests/PythonDataObjectsTest.TestTypeNameResolutionNoDot (1860 of 1971) PASS: lldb-unit :: Process/gdb-remote/./ProcessGdbRemoteTests/GDBRemoteCommunicationClientTest.GetModulesInfo (1861 of 1971) PASS: lldb-unit :: Utility/./UtilityTests/StringListTest.CopyListSingle (1862 of 1971) PASS: lldb-api :: python_api/value/linked_list/TestValueAPILinkedList.py (1863 of 1971) PASS: lldb-shell :: SymbolFile/NativePDB/globals-fundamental.cpp (1864 of 1971) PASS: lldb-unit :: UnwindAssembly/x86/./UnwindAssemblyx86Tests/Testx86AssemblyInspectionEngine.TestSimplex86_64Augmented (1865 of 1971) PASS: lldb-unit :: UnwindAssembly/x86/./UnwindAssemblyx86Tests/Testx86AssemblyInspectionEngine.TestSimple32bitFrameFunction (1866 of 1971) PASS: lldb-api :: commands/frame/diagnose/array/TestArray.py (1867 of 1971) PASS: lldb-unit :: Utility/./UtilityTests/BinaryStreamTest.PutULEB128One (1868 of 1971) PASS: lldb-api :: functionalities/thread/thread_specific_break/TestThreadSpecificBreakpoint.py (1869 of 1971) PASS: lldb-unit :: Process/minidump/./LLDBMinidumpTests/MinidumpParserTest.GetPidWow64 (1870 of 1971) PASS: lldb-unit :: Utility/./UtilityTests/UriParserTest.Empty (1871 of 1971) PASS: lldb-shell :: Commands/CommandScriptImmediateOutput/CommandScriptImmediateOutputConsole.test (1872 of 1971) PASS: lldb-unit :: Utility/./UtilityTests/UriParserTest.Minimal (1873 of 1971) PASS: lldb-api :: lang/objc/blocks/TestObjCIvarsInBlocks.py (1874 of 1971) PASS: lldb-unit :: Utility/./UtilityTests/StreamTest.PutRawBytesToLittleEndian (1875 of 1971) PASS: lldb-api :: commands/expression/regression-access-function-template-in-record/TestRegressionAccessFunctionTemplateInRecord.py (1876 of 1971) PASS: lldb-api :: functionalities/gdb_remote_client/TestqOffsets.py (1877 of 1971) PASS: lldb-unit :: Utility/./UtilityTests/IndexToObjectTest.ObjectForIndex (1878 of 1971) UNSUPPORTED: lldb-shell :: SymbolFile/PDB/ast-restore.test (1879 of 1971) PASS: lldb-unit :: Utility/./UtilityTests/ArgsTest.TestInsertArg (1880 of 1971) PASS: lldb-api :: commands/expression/completion/TestExprCompletion.py (1881 of 1971) PASS: lldb-api :: lang/cpp/function-qualifiers/TestCppFunctionQualifiers.py (1882 of 1971) PASS: lldb-api :: commands/expression/dont_allow_jit/TestAllowJIT.py (1883 of 1971) PASS: lldb-unit :: UnwindAssembly/x86/./UnwindAssemblyx86Tests/Testx86AssemblyInspectionEngine.TestPopESI (1884 of 1971) PASS: lldb-unit :: Process/gdb-remote/./ProcessGdbRemoteTests/GDBRemoteCommunicationClientTest.GetModulesInfo_UUID20 (1885 of 1971) PASS: lldb-api :: commands/frame/diagnose/bad-reference/TestBadReference.py (1886 of 1971) PASS: lldb-unit :: Utility/./UtilityTests/StringListTest.SplitIntoLinesSingleTrailingCR (1887 of 1971) PASS: lldb-api :: lang/c/local_types/TestUseClosestType.py (1888 of 1971) PASS: lldb-api :: lang/objcxx/hide-runtime-values/TestObjCXXHideRuntimeValues.py (1889 of 1971) PASS: lldb-unit :: Utility/./UtilityTests/ArgsTest.DoubleQuotedItem (1890 of 1971) PASS: lldb-api :: commands/frame/var/TestFrameVar.py (1891 of 1971) PASS: lldb-api :: functionalities/float-display/TestFloatDisplay.py (1892 of 1971) PASS: lldb-unit :: Utility/./UtilityTests/ReproducerTest.SetCapture (1893 of 1971) PASS: lldb-api :: commands/watchpoints/watchpoint_commands/command/TestWatchpointCommandLLDB.py (1894 of 1971) UNSUPPORTED: lldb-shell :: SymbolFile/PDB/expressions.test (1895 of 1971) PASS: lldb-api :: lang/objc/objc-struct-return/TestObjCStructReturn.py (1896 of 1971) PASS: lldb-unit :: ObjectFile/PECOFF/./ObjectFilePECOFFTests/PECallFrameInfoTest.Basic_eh (1897 of 1971) PASS: lldb-unit :: Expression/./ExpressionTests/CppModuleConfigurationTest.MissingLibCpp (1898 of 1971) XFAIL: lldb-shell :: Unwind/prefer-debug-over-eh-frame.test (1899 of 1971) PASS: lldb-unit :: Host/./HostTests/FileSystemTest.Readable (1900 of 1971) PASS: lldb-unit :: Target/./TargetTests/ExecutionContextTest.GetByteOrder (1901 of 1971) UNSUPPORTED: lldb-api :: commands/register/register/intel_xtended_registers/mpx_bound_violation/TestBoundViolation.py (1902 of 1971) PASS: lldb-unit :: Utility/./UtilityTests/FileSpecTest.GuessPathStyle (1903 of 1971) PASS: lldb-unit :: Utility/./UtilityTests/OptionsWithRawTest.TerminatedQuote (1904 of 1971) PASS: lldb-api :: lang/objc/rdar-11355592/TestRdar11355592.py (1905 of 1971) PASS: lldb-unit :: Utility/./UtilityTests/NameMatchesTest.Equals (1906 of 1971) PASS: lldb-unit :: Utility/./UtilityTests/StringListTest.ForRange (1907 of 1971) PASS: lldb-unit :: Utility/./UtilityTests/DataExtractorTest.GetMaxU64 (1908 of 1971) UNSUPPORTED: lldb-api :: python_api/event/TestEvents.py (1909 of 1971) PASS: lldb-api :: functionalities/var_path/TestVarPath.py (1910 of 1971) PASS: lldb-unit :: Utility/./UtilityTests/VMRange.Clear (1911 of 1971) PASS: lldb-api :: lang/objc/objc-new-syntax/TestObjCNewSyntaxArray.py (1912 of 1971) PASS: lldb-api :: functionalities/postmortem/minidump-new/TestMiniDumpUUID.py (1913 of 1971) UNSUPPORTED: lldb-shell :: Register/x86-gp-write.test (1914 of 1971) PASS: lldb-shell :: SymbolFile/DWARF/DW_OP_piece-struct.s (1915 of 1971) PASS: lldb-unit :: UnwindAssembly/x86/./UnwindAssemblyx86Tests/Testx86AssemblyInspectionEngine.TestStackRealign32BitDisp_x86_64 (1916 of 1971) PASS: lldb-api :: functionalities/data-formatter/data-formatter-stl/libcxx/forward_list/TestDataFormatterLibcxxForwardList.py (1917 of 1971) PASS: lldb-shell :: ScriptInterpreter/None/none.test (1918 of 1971) PASS: lldb-shell :: SymbolFile/DWARF/gnu-style-compression.cpp (1919 of 1971) PASS: lldb-unit :: Utility/./UtilityTests/StreamTest.PutULEB128 (1920 of 1971) UNSUPPORTED: lldb-shell :: Register/x86-zmm-write.test (1921 of 1971) PASS: lldb-unit :: Utility/./UtilityTests/UUIDTest.Validity (1922 of 1971) PASS: lldb-api :: functionalities/thread/backtrace_limit/TestBacktraceLimit.py (1923 of 1971) PASS: lldb-unit :: SymbolFile/DWARF/./SymbolFileDWARFTests/DWARFASTParserClangTests.EnsureAllDIEsInDeclContextHaveBeenParsedParsesOnlyMatchingEntries (1924 of 1971) PASS: lldb-api :: python_api/signals/TestSignalsAPI.py (1925 of 1971) PASS: lldb-api :: commands/expression/import-std-module/vector/TestVectorFromStdModule.py (1926 of 1971) PASS: lldb-api :: functionalities/breakpoint/comp_dir_symlink/TestCompDirSymLink.py (1927 of 1971) PASS: lldb-unit :: Utility/./UtilityTests/StringExtractorTest.GetHexU8_Underflow (1928 of 1971) PASS: lldb-unit :: Utility/./UtilityTests/Flags.AnyClear (1929 of 1971) PASS: lldb-api :: functionalities/optimized_code/TestNoASanExceptionAfterEvalOP_piece.py (1930 of 1971) PASS: lldb-api :: commands/process/attach-resume/TestAttachResume.py (1931 of 1971) XFAIL: lldb-shell :: Register/x86-mm-xmm-read.test (1932 of 1971) PASS: lldb-api :: functionalities/load_using_paths/TestLoadUsingPaths.py (1933 of 1971) PASS: lldb-unit :: tools/lldb-server/tests/./LLDBServerTests/TestBase.LaunchModePreservesEnvironment (1934 of 1971) PASS: lldb-unit :: Language/CPlusPlus/./LanguageCPlusPlusTests/CPlusPlusLanguage.ExtractContextAndIdentifier (1935 of 1971) PASS: lldb-unit :: Symbol/./SymbolTests/TestTypeSystemClang.TestRecordHasFields (1936 of 1971) PASS: lldb-api :: commands/expression/cast_int_to_anonymous_enum/TestCastIntToAnonymousEnum.py (1937 of 1971) PASS: lldb-api :: tools/lldb-vscode/step/TestVSCode_step.py (1938 of 1971) PASS: lldb-api :: functionalities/data-formatter/data-formatter-stl/libcxx/unique_ptr/TestDataFormatterLibcxxUniquePtr.py (1939 of 1971) PASS: lldb-unit :: SymbolFile/DWARF/./SymbolFileDWARFTests/SymbolFileDWARFTests.TestAbbrevMissingTerminator (1940 of 1971) PASS: lldb-shell :: ExecControl/StopHook/stop-hook.test (1941 of 1971) PASS: lldb-api :: functionalities/unwind/noreturn/module-end/TestNoReturnModuleEnd.py (1942 of 1971) PASS: lldb-api :: api/command-return-object/TestSBCommandReturnObject.py (1943 of 1971) PASS: lldb-api :: functionalities/data-formatter/summary-string-onfail/Test-rdar-9974002.py (1944 of 1971) PASS: lldb-unit :: Process/minidump/./LLDBMinidumpTests/RegisterContextMinidump.ConvertMinidumpContext_x86_64 (1945 of 1971) PASS: lldb-api :: commands/frame/diagnose/complicated-expression/TestComplicatedExpression.py (1946 of 1971) PASS: lldb-api :: commands/expression/import-std-module/list/TestListFromStdModule.py (1947 of 1971) PASS: lldb-unit :: Utility/./UtilityTests/StreamTest.AddressSuffix (1948 of 1971) PASS: lldb-api :: python_api/module_section/TestModuleAndSection.py (1949 of 1971) PASS: lldb-shell :: Host/TestCustomShell.test (1950 of 1971) UNSUPPORTED: lldb-api :: functionalities/data-formatter/data-formatter-stl/libstdcpp/string/TestDataFormatterStdString.py (1951 of 1971) PASS: lldb-shell :: Quit/TestQuitExitCodeImplicit0.test (1952 of 1971) PASS: lldb-unit :: Utility/./UtilityTests/ArgsTest.TestSingleQuotedArgWithSpace (1953 of 1971) PASS: lldb-api :: commands/watchpoints/watchpoint_commands/command/TestWatchpointCommandPython.py (1954 of 1971) PASS: lldb-api :: lang/objc/objc-struct-argument/TestObjCStructArgument.py (1955 of 1971) UNSUPPORTED: lldb-shell :: Unwind/eh-frame-small-fde.test (1956 of 1971) PASS: lldb-api :: python_api/sbtype_typeclass/TestSBTypeTypeClass.py (1957 of 1971) PASS: lldb-api :: python_api/sbvalue_const_addrof/TestSBValueConstAddrOf.py (1958 of 1971) PASS: lldb-api :: commands/watchpoints/step_over_watchpoint/TestStepOverWatchpoint.py (1959 of 1971) PASS: lldb-unit :: Expression/./ExpressionTests/CppModuleConfigurationTest.Linux (1960 of 1971) PASS: lldb-api :: functionalities/breakpoint/breakpoint_names/TestBreakpointNames.py (1961 of 1971) PASS: lldb-api :: functionalities/thread/crash_during_step/TestCrashDuringStep.py (1962 of 1971) PASS: lldb-api :: commands/expression/anonymous-struct/TestCallUserAnonTypedef.py (1963 of 1971) PASS: lldb-api :: commands/command/nested_alias/TestNestedAlias.py (1964 of 1971) UNSUPPORTED: lldb-shell :: ScriptInterpreter/Lua/independent_state.test (1965 of 1971) PASS: lldb-api :: commands/expression/entry-bp/TestExprEntryBP.py (1966 of 1971) PASS: lldb-shell :: Expr/TestIRMemoryMap.test (1967 of 1971) PASS: lldb-api :: lang/objc/variadic_methods/TestVariadicMethods.py (1968 of 1971) PASS: lldb-api :: tools/lldb-vscode/attach/TestVSCode_attach.py (1969 of 1971) PASS: lldb-api :: lang/objc/global_ptrs/TestGlobalObjects.py (1970 of 1971) PASS: lldb-api :: functionalities/data-formatter/data-formatter-stl/libcxx/multimap/TestDataFormatterLibccMultiMap.py (1971 of 1971)

Hide Details

Testing Time: 4353.71s ******************** Failing Tests (3): lldb-api :: python_api/thread/TestThreadAPI.py lldb-api :: functionalities/ptr_refs/TestPtrRefs.py lldb-api :: lang/objc/ptr_refs/TestPtrRefsObjC.py

Hide Details

Hide Details

Slowest Tests: -------------------------------------------------------------------------- 95.79s: lldb-api :: types/TestLongTypes.py 109.08s: lldb-api :: python_api/lldbutil/iter/TestLLDBIterator.py 112.12s: lldb-api :: lang/objc/foundation/TestObjCMethodsNSError.py 114.25s: lldb-api :: lang/objc/objc-new-syntax/TestObjCNewSyntaxDictionary.py 114.49s: lldb-api :: lang/objc/objc-new-syntax/TestObjCNewSyntaxArray.py 114.71s: lldb-api :: lang/objc/foundation/TestObjCMethodsString.py 117.14s: lldb-api :: types/TestCharTypeExpr.py 118.84s: lldb-api :: commands/expression/import-std-module/queue/TestQueueFromStdModule.py 120.86s: lldb-api :: tools/lldb-server/TestGdbRemote_qThreadStopInfo.py 131.04s: lldb-api :: types/TestLongTypesExpr.py 138.11s: lldb-api :: lang/objc/exceptions/TestObjCExceptions.py 139.90s: lldb-api :: lang/objc/real-definition/TestRealDefinition.py 153.13s: lldb-api :: lang/objc/objc-new-syntax/TestObjCNewSyntaxLiteral.py 163.66s: lldb-api :: lang/cpp/namespace/TestNamespaceLookup.py 215.17s: lldb-api :: lang/objc/foundation/TestObjCMethods.py 221.07s: lldb-api :: lang/objc/hidden-ivars/TestHiddenIvars.py 249.01s: lldb-api :: tools/lldb-server/TestGdbRemoteThreadsInStopReply.py 258.11s: lldb-api :: api/multithreaded/TestMultithreaded.py 272.54s: lldb-api :: lang/cpp/enum_types/TestCPP11EnumTypes.py 368.58s: lldb-api :: tools/lldb-server/TestLldbGdbServer.py

Hide Details

Tests Times: -------------------------------------------------------------------------- [ Range ] :: [ Percentage ] :: [ Count ] -------------------------------------------------------------------------- [ 0s, 20s) :: [********************************** ] :: [1720/1971] [ 20s, 40s) :: [** ] :: [ 126/1971] [ 40s, 60s) :: [* ] :: [ 73/1971] [ 60s, 80s) :: [ ] :: [ 23/1971] [ 80s,100s) :: [ ] :: [ 10/1971] [100s,120s) :: [ ] :: [ 5/1971] [120s,140s) :: [ ] :: [ 4/1971] [140s,160s) :: [ ] :: [ 3/1971] [160s,180s) :: [ ] :: [ 1/1971] [180s,200s) :: [ ] :: [ 0/1971] [200s,220s) :: [ ] :: [ 0/1971] [220s,240s) :: [ ] :: [ 2/1971] [240s,260s) :: [ ] :: [ 1/1971] [260s,280s) :: [ ] :: [ 1/1971] [280s,300s) :: [ ] :: [ 1/1971] [300s,320s) :: [ ] :: [ 0/1971] [320s,340s) :: [ ] :: [ 0/1971] [340s,360s) :: [ ] :: [ 0/1971] [360s,380s) :: [ ] :: [ 1/1971] Expected Passes : 1796 Expected Failures : 6 Unsupported Tests : 166 Unexpected Failures: 3 FAILED: tools/lldb/test/CMakeFiles/check-lldb-lit cd /Users/buildslave/jenkins/workspace/lldb-cmake-sanitized/lldb-build/tools/lldb/test && /usr/local/bin/python /Users/buildslave/jenkins/workspace/lldb-cmake-sanitized/lldb-build/./bin/llvm-lit -v --time-tests --shuffle --xunit-xml-output=/Users/buildslave/jenkins/workspace/lldb-cmake-sanitized/test/results.xml -v -j 4 --timeout 1200 /Users/buildslave/jenkins/workspace/lldb-cmake-sanitized/lldb-build/tools/lldb/test ninja: build stopped: subcommand failed. Command failed: Command '['/usr/bin/env', 'TERM=vt100', '/usr/local/bin/ninja', '-v', 'check-lldb']' returned non-zero exit status 1. Command: ['/usr/bin/env', 'TERM=vt100', '/usr/local/bin/ninja', '-v', 'check-lldb'] [Pipeline] } [Pipeline] // timeout [Pipeline] } [Pipeline] // stage [Pipeline] stage [Pipeline] { (Declarative: Post Actions) [Pipeline] scanForIssues [Clang (LLVM based)] Sleeping for 5 seconds due to JENKINS-32191... [Clang (LLVM based)] Parsing console log (workspace: '/Users/buildslave/jenkins/workspace/lldb-cmake-sanitized') [Clang (LLVM based)] Successfully parsed console log [Clang (LLVM based)] -> found 0 issues (skipped 0 duplicates) [Clang (LLVM based)] Skipping post processing [Clang (LLVM based)] No filter has been set, publishing all 0 issues [Pipeline] junit Recording test results [Pipeline] } [Pipeline] // stage [Pipeline] } [Pipeline] // withEnv [Pipeline] } [Pipeline] // node [Pipeline] End of Pipeline ERROR: script returned exit code 1 Finished: FAILURE