Console Output

Skipping 956 KB.. Full Log
PASS: lldb-api :: functionalities/fat_archives/TestFatArchives.py (652 of 1971)
PASS: lldb-shell :: BuildScript/toolchain-clang.test (653 of 1971)
PASS: lldb-api :: python_api/process/TestProcessAPI.py (654 of 1971)
PASS: lldb-api :: functionalities/thread/concurrent_events/TestConcurrentCrashWithWatchpoint.py (655 of 1971)
PASS: lldb-api :: functionalities/thread/concurrent_events/TestConcurrentSignalWatchBreak.py (656 of 1971)
PASS: lldb-unit :: Utility/./UtilityTests/StreamTeeTest.CopyConstructor (657 of 1971)
PASS: lldb-api :: tools/lldb-server/inferior-crash/TestGdbRemoteAbort.py (658 of 1971)
PASS: lldb-api :: lang/objcxx/hide-runtime-values/TestObjCXXHideRuntimeValues.py (659 of 1971)
PASS: lldb-api :: functionalities/thread/step_until/TestStepUntil.py (660 of 1971)
PASS: lldb-api :: functionalities/data-formatter/user-format-vs-summary/TestUserFormatVsSummary.py (661 of 1971)
PASS: lldb-api :: api/multithreaded/TestMultithreaded.py (662 of 1971)
PASS: lldb-api :: commands/expression/rdar44436068/Test128BitsInteger.py (663 of 1971)
UNSUPPORTED: lldb-shell :: Register/x86-64-ymm16-write.test (664 of 1971)
PASS: lldb-shell :: ObjectFile/ELF/netbsd-exec-8.99.30-amd64.yaml (665 of 1971)
PASS: lldb-api :: functionalities/data-formatter/data-formatter-objc/TestDataFormatterObjCNSData.py (666 of 1971)
PASS: lldb-unit :: Utility/./UtilityTests/UriParserTest.TypicalPortPath (667 of 1971)
PASS: lldb-api :: commands/watchpoints/watchpoint_on_vectors/TestValueOfVectorVariable.py (668 of 1971)
PASS: lldb-api :: macosx/find-dsym/deep-bundle/TestDeepBundle.py (669 of 1971)
PASS: lldb-shell :: Register/x86-64-read.test (670 of 1971)
PASS: lldb-unit :: Process/minidump/./LLDBMinidumpTests/MinidumpParserTest.GetArchitectureWindows (671 of 1971)
PASS: lldb-api :: python_api/value_var_update/TestValueVarUpdate.py (672 of 1971)
UNSUPPORTED: lldb-shell :: ScriptInterpreter/Lua/bindings.test (673 of 1971)
PASS: lldb-unit :: Utility/./UtilityTests/RangeDataVector.FindEntryIndexesThatContain (674 of 1971)
PASS: lldb-unit :: Utility/./UtilityTests/FileSpecTest.IsRelative (675 of 1971)
PASS: lldb-api :: functionalities/data-formatter/typedef_array/TestTypedefArray.py (676 of 1971)
PASS: lldb-unit :: UnwindAssembly/x86/./UnwindAssemblyx86Tests/Testx86AssemblyInspectionEngine.TestPushR15 (677 of 1971)
UNSUPPORTED: lldb-api :: macosx/macabi/TestMacABImacOSFramework.py (678 of 1971)
PASS: lldb-api :: lang/cpp/dynamic-value-same-basename/TestDynamicValueSameBase.py (679 of 1971)
PASS: lldb-unit :: Symbol/./SymbolTests/DWARFCallFrameInfoTest.Basic_eh (680 of 1971)
PASS: lldb-api :: functionalities/thread/concurrent_events/TestConcurrentManyCrash.py (681 of 1971)
PASS: lldb-unit :: Utility/./UtilityTests/VASprintfTest.NoBufferResize (682 of 1971)
UNSUPPORTED: lldb-shell :: Register/x86-gp-read.test (683 of 1971)
PASS: lldb-unit :: Utility/./UtilityTests/BinaryStreamTest.PutULEB128TwoBytes (684 of 1971)
UNSUPPORTED: lldb-shell :: ScriptInterpreter/Lua/command_script_import.test (685 of 1971)
PASS: lldb-shell :: SymbolFile/Breakpad/line-table-edgecases.test (686 of 1971)
PASS: lldb-unit :: Language/Highlighting/./HighlighterTests/HighlighterTest.ClangCommas (687 of 1971)
PASS: lldb-shell :: ExecControl/StopHook/stop-hook.test (688 of 1971)
PASS: lldb-unit :: Host/./HostTests/FileSystemTest.Exists (689 of 1971)
PASS: lldb-shell :: Settings/TestSettingsWrite.test (690 of 1971)
PASS: lldb-unit :: Utility/./UtilityTests/ProcessInstanceInfoMatch.Name (691 of 1971)
PASS: lldb-unit :: Utility/./UtilityTests/StringListTest.DefaultConstructor (692 of 1971)
PASS: lldb-api :: commands/expression/call-function/TestCallBuiltinFunction.py (693 of 1971)
PASS: lldb-api :: functionalities/breakpoint/inlined_breakpoints/TestInlinedBreakpoints.py (694 of 1971)
PASS: lldb-api :: lang/objc/rdar-11355592/TestRdar11355592.py (695 of 1971)
PASS: lldb-unit :: Symbol/./SymbolTests/SymbolsTest.TerminateLocateExecutableSymbolFileForUnknownExecutableAndUnknownSymbolFile (696 of 1971)
PASS: lldb-unit :: Utility/./UtilityTests/StructuredDataTest.StringDump (697 of 1971)
PASS: lldb-shell :: SymbolFile/DWARF/debug-types-signature-loop.s (698 of 1971)
PASS: lldb-api :: python_api/watchpoint/TestWatchpointIgnoreCount.py (699 of 1971)
PASS: lldb-api :: functionalities/tail_call_frames/disambiguate_tail_call_seq/TestDisambiguateTailCallSeq.py (700 of 1971)
PASS: lldb-api :: lang/c/const_variables/TestConstVariables.py (701 of 1971)
PASS: lldb-unit :: Utility/./UtilityTests/StreamTest.PutStringAsRawHex8 (702 of 1971)
PASS: lldb-shell :: SymbolFile/NativePDB/globals-fundamental.cpp (703 of 1971)
PASS: lldb-unit :: Utility/./UtilityTests/DeserializerTest.HasData (704 of 1971)
PASS: lldb-api :: lang/objc/objc-static-method/TestObjCStaticMethod.py (705 of 1971)
PASS: lldb-unit :: UnwindAssembly/x86/./UnwindAssemblyx86Tests/Testx86AssemblyInspectionEngine.TestSimple32bitFrameFunction (706 of 1971)
PASS: lldb-api :: commands/command/script/import/rdar-12586188/TestRdar12586188.py (707 of 1971)
PASS: lldb-shell :: Driver/TestCommands.test (708 of 1971)
PASS: lldb-unit :: ObjectFile/Breakpad/./ObjectFileBreakpadTests/Record.classify (709 of 1971)
PASS: lldb-api :: functionalities/data-formatter/ostypeformatting/TestFormattersOsType.py (710 of 1971)
PASS: lldb-shell :: Commands/command-script-import.test (711 of 1971)
PASS: lldb-unit :: Utility/./UtilityTests/CompletionRequest.ShiftArguments (712 of 1971)
UNSUPPORTED: lldb-shell :: SymbolFile/PDB/compilands.test (713 of 1971)
PASS: lldb-unit :: Utility/./UtilityTests/ScalarTest.Comparison (714 of 1971)
PASS: lldb-api :: lang/objc/foundation/TestObjCMethodsString.py (715 of 1971)
PASS: lldb-shell :: SymbolFile/DWARF/debug_ranges_and_rnglists.test (716 of 1971)
PASS: lldb-unit :: UnwindAssembly/x86/./UnwindAssemblyx86Tests/Testx86AssemblyInspectionEngine.TestStackRealign32BitDisp_x86_64 (717 of 1971)
PASS: lldb-api :: functionalities/memory/cache/TestMemoryCache.py (718 of 1971)
PASS: lldb-api :: functionalities/data-formatter/data-formatter-objc/TestDataFormatterObjNSException.py (719 of 1971)
PASS: lldb-unit :: Utility/./UtilityTests/RecordReplayTest.InstrumentedBarPtr (720 of 1971)
PASS: lldb-unit :: Utility/./UtilityTests/TimerTest.CategoryTimes (721 of 1971)
PASS: lldb-api :: commands/expression/completion/TestExprCompletion.py (722 of 1971)
PASS: lldb-unit :: Utility/./UtilityTests/StringLexerTest.NextIf (723 of 1971)
PASS: lldb-shell :: ObjectFile/ELF/minidebuginfo-find-symbols.yaml (724 of 1971)
PASS: lldb-unit :: Host/./HostTests/File.GetStreamFromDescriptor (725 of 1971)
PASS: lldb-api :: commands/expression/import-std-module/stack/TestStackFromStdModule.py (726 of 1971)
PASS: lldb-api :: lang/c/anonymous/TestAnonymous.py (727 of 1971)
PASS: lldb-shell :: SymbolFile/DWARF/split-dwarf-multiple-cu.ll (728 of 1971)
PASS: lldb-unit :: Expression/./ExpressionTests/CppModuleConfigurationTest.IgnoreLibStdCpp (729 of 1971)
UNSUPPORTED: lldb-api :: commands/register/register/intel_xtended_registers/TestMPXRegisters.py (730 of 1971)
UNSUPPORTED: lldb-api :: lang/objc/foundation/TestFoundationDisassembly.py (731 of 1971)
PASS: lldb-api :: functionalities/deleted-executable/TestDeletedExecutable.py (732 of 1971)
PASS: lldb-unit :: Process/minidump/./LLDBMinidumpTests/RegisterContextMinidump.ConvertMinidumpContext_x86_32 (733 of 1971)
PASS: lldb-api :: python_api/debugger/TestDebuggerAPI.py (734 of 1971)
PASS: lldb-shell :: Breakpoint/dummy-target.test (735 of 1971)
PASS: lldb-shell :: Unwind/trap_frame_sym_ctx.test (736 of 1971)
PASS: lldb-shell :: Reproducer/TestDump.test (737 of 1971)
PASS: lldb-unit :: Utility/./UtilityTests/StringLexerTest.HasAtLeast (738 of 1971)
PASS: lldb-api :: functionalities/breakpoint/move_nearest/TestMoveNearest.py (739 of 1971)
UNSUPPORTED: lldb-shell :: ExecControl/StopHook/stop-hook-threads.test (740 of 1971)
PASS: lldb-shell :: Breakpoint/split-dwarf5-debug-stroffsets.test (741 of 1971)
PASS: lldb-api :: functionalities/thread/jump/TestThreadJump.py (742 of 1971)
PASS: lldb-api :: functionalities/data-formatter/poarray/TestPrintObjectArray.py (743 of 1971)
PASS: lldb-shell :: SymbolFile/DWARF/find-method.cpp (744 of 1971)
PASS: lldb-unit :: Utility/./UtilityTests/Flags.AllSet (745 of 1971)
PASS: lldb-unit :: Process/minidump/./LLDBMinidumpTests/MinidumpParserTest.GetMemoryRegionInfoFromMemoryList (746 of 1971)
PASS: lldb-unit :: Utility/./UtilityTests/SharedCluster.ClusterManager (747 of 1971)
PASS: lldb-api :: commands/expression/import_builtin_fileid/TestImportBuiltinFileID.py (748 of 1971)
PASS: lldb-shell :: Settings/TestFrameFormatNoColor.test (749 of 1971)
PASS: lldb-api :: types/TestIntegerTypeExpr.py (750 of 1971)
PASS: lldb-api :: functionalities/thread/concurrent_events/TestConcurrentTwoWatchpointThreads.py (751 of 1971)
UNSUPPORTED: lldb-api :: benchmarks/libcxxmap/TestBenchmarkLibcxxMap.py (752 of 1971)
PASS: lldb-api :: functionalities/gdb_remote_client/TestArmRegisterDefinition.py (753 of 1971)
PASS: lldb-unit :: UnwindAssembly/x86/./UnwindAssemblyx86Tests/Testx86AssemblyInspectionEngine.TestPushRBPWithREX (754 of 1971)
PASS: lldb-unit :: tools/lldb-server/tests/./LLDBServerTests/TestBase.DebugserverEnv (755 of 1971)
PASS: lldb-unit :: Utility/./UtilityTests/FileSpecTest.Equal (756 of 1971)
PASS: lldb-api :: lang/cpp/multiple-inheritance/TestCppMultipleInheritance.py (757 of 1971)
PASS: lldb-api :: functionalities/data-formatter/data-formatter-stl/libcxx/multiset/TestDataFormatterLibcxxMultiSet.py (758 of 1971)
PASS: lldb-unit :: Utility/./UtilityTests/BroadcasterTest.BroadcastEvent (759 of 1971)
PASS: lldb-api :: commands/expression/call-function/TestCallStdStringFunction.py (760 of 1971)
PASS: lldb-api :: commands/target/create-no-such-arch/TestNoSuchArch.py (761 of 1971)
PASS: lldb-api :: functionalities/multiword-commands/TestMultiWordCommands.py (762 of 1971)
PASS: lldb-api :: functionalities/pre_run_dylibs/TestPreRunDylibs.py (763 of 1971)
PASS: lldb-unit :: UnwindAssembly/x86/./UnwindAssemblyx86Tests/Testx86AssemblyInspectionEngine.TestPushEAX (764 of 1971)
PASS: lldb-unit :: Utility/./UtilityTests/StringExtractorTest.GetHexU8_Exact (765 of 1971)
PASS: lldb-unit :: Utility/./UtilityTests/NameMatchesTest.Contains (766 of 1971)
PASS: lldb-unit :: Symbol/./SymbolTests/TestClangASTImporter.CompleteFwdDeclWithOtherOrigin (767 of 1971)
PASS: lldb-unit :: ScriptInterpreter/Python/./ScriptInterpreterPythonTests/PythonDataObjectsTest.TestPythonFile (768 of 1971)
PASS: lldb-api :: lang/objc/exceptions/TestObjCExceptions.py (769 of 1971)
PASS: lldb-unit :: Utility/./UtilityTests/RangeDataVector.FindEntryThatContains_Overlap (770 of 1971)
PASS: lldb-unit :: Utility/./UtilityTests/StringExtractorTest.GetU32LittleEndian (771 of 1971)
UNSUPPORTED: lldb-api :: functionalities/tsan/global_location/TestTsanGlobalLocation.py (772 of 1971)
PASS: lldb-api :: lang/objc/objc-foundation-dictionary-empty/TestNSDictionary0.py (773 of 1971)
PASS: lldb-api :: lang/cpp/bool/TestCPPBool.py (774 of 1971)
PASS: lldb-api :: functionalities/data-formatter/data-formatter-stl/libcxx/unique_ptr/TestDataFormatterLibcxxUniquePtr.py (775 of 1971)
UNSUPPORTED: lldb-api :: commands/gui/basic/TestGuiBasic.py (776 of 1971)
PASS: lldb-api :: lang/objc/foundation/TestRuntimeTypes.py (777 of 1971)
PASS: lldb-unit :: UnwindAssembly/x86/./UnwindAssemblyx86Tests/Testx86AssemblyInspectionEngine.TestPushESI (778 of 1971)
PASS: lldb-api :: python_api/process/read-mem-cstring/TestReadMemCString.py (779 of 1971)
PASS: lldb-unit :: Utility/./UtilityTests/SerializationRountripTest.SerializeDeserializePodPointers (780 of 1971)
PASS: lldb-api :: commands/expression/import-std-module/vector-dbg-info-content/TestDbgInfoContentVectorFromStdModule.py (781 of 1971)
PASS: lldb-unit :: Process/minidump/./LLDBMinidumpTests/MinidumpParserTest.GetPid (782 of 1971)
PASS: lldb-unit :: Utility/./UtilityTests/ProcessInstanceInfo.Yaml (783 of 1971)
PASS: lldb-shell :: SymbolFile/DWARF/find-qualified-variable.cpp (784 of 1971)
PASS: lldb-unit :: Utility/./UtilityTests/OptionsWithRawTest.EmptySuffixSingleWhitespace (785 of 1971)
PASS: lldb-api :: commands/platform/basic/TestPlatformCommand.py (786 of 1971)
PASS: lldb-api :: functionalities/thread/thread_exit/TestThreadExit.py (787 of 1971)
PASS: lldb-shell :: Driver/LocalLLDBInit.test (788 of 1971)
PASS: lldb-api :: lang/cpp/covariant-return-types/TestCovariantReturnTypes.py (789 of 1971)
PASS: lldb-shell :: Quit/TestQuitExitCodeTooManyArgs.test (790 of 1971)
PASS: lldb-shell :: ObjectFile/PECOFF/dep-modules.yaml (791 of 1971)
PASS: lldb-unit :: Utility/./UtilityTests/RecordReplayTest.InstrumentedFoo (792 of 1971)
PASS: lldb-shell :: SymbolFile/DWARF/clang-ast-from-dwarf-objc-property.m (793 of 1971)
UNSUPPORTED: lldb-api :: functionalities/param_entry_vals/basic_entry_values_x86_64/TestBasicEntryValuesX86_64.py (794 of 1971)
PASS: lldb-api :: types/TestCharTypeExpr.py (795 of 1971)
PASS: lldb-api :: functionalities/postmortem/netbsd-core/TestNetBSDCore.py (796 of 1971)
PASS: lldb-api :: commands/command/script/import/TestImport.py (797 of 1971)
PASS: lldb-unit :: UnwindAssembly/x86/./UnwindAssemblyx86Tests/Testx86AssemblyInspectionEngine.TestPopEBX (798 of 1971)
PASS: lldb-api :: commands/log/invalid-args/TestInvalidArgsLog.py (799 of 1971)
PASS: lldb-unit :: ObjectFile/Breakpad/./ObjectFileBreakpadTests/StackCFIRecord.parse (800 of 1971)
PASS: lldb-unit :: Utility/./UtilityTests/RangeTest.Slide (801 of 1971)
PASS: lldb-unit :: Utility/./UtilityTests/LogChannelTest.Disable (802 of 1971)
PASS: lldb-shell :: ObjectFile/ELF/build-id-case.yaml (803 of 1971)
PASS: lldb-unit :: Utility/./UtilityTests/BinaryStreamTest.PutSLEB128NineBytes (804 of 1971)
PASS: lldb-unit :: Utility/./UtilityTests/ArchSpecTest.TestParseMachCPUDashSubtypeTripleSimple (805 of 1971)
PASS: lldb-shell :: SymbolFile/DWARF/dwarf5-partial-index.cpp (806 of 1971)
PASS: lldb-api :: commands/process/attach/TestProcessAttach.py (807 of 1971)
PASS: lldb-shell :: SymbolFile/DWARF/dir-separator-no-comp-dir-relative-name.s (808 of 1971)
PASS: lldb-api :: lang/c/shared_lib_stripped_symbols/TestSharedLibStrippedSymbols.py (809 of 1971)
PASS: lldb-api :: commands/command/source/TestCommandSource.py (810 of 1971)
PASS: lldb-unit :: UnwindAssembly/x86/./UnwindAssemblyx86Tests/Testx86AssemblyInspectionEngine.Test64bitFramelessBigStackFrame (811 of 1971)
PASS: lldb-unit :: Signals/./SignalsTests/UnixSignalsTest.GetInfo (812 of 1971)
PASS: lldb-unit :: ScriptInterpreter/Python/./ScriptInterpreterPythonTests/PythonDataObjectsTest.TestPythonDictionaryManipulation (813 of 1971)
PASS: lldb-unit :: Utility/./UtilityTests/StringExtractorTest.GetHexBytes_FullString (814 of 1971)
PASS: lldb-api :: python_api/function_symbol/TestSymbolAPI.py (815 of 1971)
PASS: lldb-unit :: Symbol/./SymbolTests/LineEntryTest.GetSameLineContiguousAddressRangeOneInline (816 of 1971)
PASS: lldb-unit :: SymbolFile/DWARF/./SymbolFileDWARFTests/SymbolFileDWARFTests.TestAbbrevOrder1Start1 (817 of 1971)
PASS: lldb-unit :: Utility/./UtilityTests/RecordReplayTest.InstrumentedFooSameThis (818 of 1971)
PASS: lldb-api :: macosx/profile_vrs_detach/TestDetachVrsProfile.py (819 of 1971)
XFAIL: lldb-shell :: Unwind/prefer-debug-over-eh-frame.test (820 of 1971)
PASS: lldb-unit :: Utility/./UtilityTests/StringListTest.ShiftStdString (821 of 1971)
UNSUPPORTED: lldb-api :: functionalities/darwin_log/filter/regex/activity/TestDarwinLogFilterRegexActivity.py (822 of 1971)
PASS: lldb-unit :: Host/./HostTests/SocketTest.UDPGetConnectURI (823 of 1971)
PASS: lldb-unit :: Utility/./UtilityTests/StreamTest.AddressSuffix (824 of 1971)
PASS: lldb-unit :: Breakpoint/./LLDBBreakpointTests/BreakpointIDTest.StringIsBreakpointName (825 of 1971)
PASS: lldb-unit :: Utility/./UtilityTests/ProcessInstanceInfo.Dump (826 of 1971)
PASS: lldb-api :: functionalities/thread/concurrent_events/TestConcurrentTwoBreakpointsOneWatchpoint.py (827 of 1971)
PASS: lldb-api :: commands/expression/dont_allow_jit/TestAllowJIT.py (828 of 1971)
PASS: lldb-unit :: Platform/./LLDBPlatformTests/PlatformDarwinTest.FindXcodeContentsDirectoryInPath (829 of 1971)
PASS: lldb-unit :: Target/./TargetTests/MemoryRegionInfoTest.Formatv (830 of 1971)
PASS: lldb-unit :: Process/minidump/./LLDBMinidumpTests/MinidumpParserTest.GetMiscInfo_no_stream (831 of 1971)
PASS: lldb-api :: lang/cpp/scope/TestCppScope.py (832 of 1971)
PASS: lldb-unit :: Utility/./UtilityTests/DataExtractorTest.GetMaxU64 (833 of 1971)
PASS: lldb-api :: commands/expression/unicode-in-variable/TestUnicodeInVariable.py (834 of 1971)
PASS: lldb-unit :: Utility/./UtilityTests/StringListTest.LongestCommonPrefixNoPrefix (835 of 1971)
PASS: lldb-unit :: ScriptInterpreter/Python/./ScriptInterpreterPythonTests/PythonDataObjectsTest.TestRun (836 of 1971)
PASS: lldb-shell :: SymbolFile/DWARF/childless-compile-unit.s (837 of 1971)
PASS: lldb-shell :: SymbolFile/DWARF/split-dwarf-inlining.cpp (838 of 1971)
PASS: lldb-unit :: Utility/./UtilityTests/EnvironmentTest.EnvpConversion (839 of 1971)
PASS: lldb-unit :: Utility/./UtilityTests/StreamTest.AddressRangeSize (840 of 1971)
PASS: lldb-unit :: Utility/./UtilityTests/BinaryStreamTest.PutULEB128SixBytes (841 of 1971)
PASS: lldb-unit :: UnwindAssembly/x86/./UnwindAssemblyx86Tests/Testx86AssemblyInspectionEngine.TestSubESP (842 of 1971)
PASS: lldb-api :: functionalities/jitloader_gdb/TestJITLoaderGDB.py (843 of 1971)
PASS: lldb-unit :: Utility/./UtilityTests/OptionsWithRawTest.LeadingSpaceArgs (844 of 1971)
PASS: lldb-api :: lang/cpp/dynamic-value/TestCppValueCast.py (845 of 1971)
PASS: lldb-api :: commands/command/script/TestCommandScript.py (846 of 1971)
PASS: lldb-api :: functionalities/inferior-crashing/recursive-inferior/TestRecursiveInferiorStep.py (847 of 1971)
PASS: lldb-unit :: Host/./HostTests/HostInfoTest.GetHostname (848 of 1971)
PASS: lldb-api :: functionalities/data-formatter/data-formatter-globals/TestDataFormatterGlobals.py (849 of 1971)
PASS: lldb-api :: macosx/version_zero/TestGetVersionZeroVersion.py (850 of 1971)
PASS: lldb-unit :: Target/./TargetTests/ExecutionContextTest.GetByteOrderTarget (851 of 1971)
UNSUPPORTED: lldb-api :: tools/lldb-server/signal-filtering/TestGdbRemote_QPassSignals.py (852 of 1971)
PASS: lldb-api :: commands/command/delete/TestCommandDelete.py (853 of 1971)
PASS: lldb-unit :: Utility/./UtilityTests/StringListTest.AppendList (854 of 1971)
PASS: lldb-unit :: Utility/./UtilityTests/StreamTeeTest.Write (855 of 1971)
PASS: lldb-api :: tools/lldb-vscode/breakpoint-events/TestVSCode_breakpointEvents.py (856 of 1971)
PASS: lldb-shell :: Reproducer/TestWorkingDir.test (857 of 1971)
PASS: lldb-api :: functionalities/data-formatter/nssetsynth/TestNSSetSynthetic.py (858 of 1971)
PASS: lldb-api :: commands/settings/quoting/TestQuoting.py (859 of 1971)
UNSUPPORTED: lldb-api :: linux/sepdebugsymlink/TestTargetSymbolsSepDebugSymlink.py (860 of 1971)
PASS: lldb-api :: python_api/sbtype_typeclass/TestSBTypeTypeClass.py (861 of 1971)
PASS: lldb-unit :: ScriptInterpreter/Python/./ScriptInterpreterPythonTests/PythonDataObjectsTest.TestDictionaryResolutionWithDot (862 of 1971)
PASS: lldb-unit :: Target/./TargetTests/ExecutionContextTest.GetByteOrder (863 of 1971)
PASS: lldb-api :: functionalities/process_crash_info/TestProcessCrashInfo.py (864 of 1971)
PASS: lldb-unit :: Utility/./UtilityTests/BinaryStreamTest.PutULEB128OneByte (865 of 1971)
PASS: lldb-unit :: Process/minidump/./LLDBMinidumpTests/MinidumpParserTest.GetArchitecture (866 of 1971)
PASS: lldb-unit :: UnwindAssembly/x86/./UnwindAssemblyx86Tests/Testx86AssemblyInspectionEngine.TestPushExtended (867 of 1971)
PASS: lldb-unit :: Utility/./UtilityTests/StringListTest.Join (868 of 1971)
PASS: lldb-unit :: Utility/./UtilityTests/RangeTest.Constructor (869 of 1971)
UNSUPPORTED: lldb-shell :: ScriptInterpreter/Lua/watchpoint_callback.test (870 of 1971)
PASS: lldb-unit :: Interpreter/./InterpreterTests/CompletionTest.DirCompletionUsername (871 of 1971)
PASS: lldb-unit :: Process/gdb-remote/./ProcessGdbRemoteTests/GDBRemoteCommunicationClientTest.SendStartTracePacket (872 of 1971)
PASS: lldb-api :: commands/expression/result_numbering/TestResultNumbering.py (873 of 1971)
PASS: lldb-api :: commands/frame/diagnose/complicated-expression/TestComplicatedExpression.py (874 of 1971)
PASS: lldb-unit :: Core/./LLDBCoreTests/MangledTest.EmptyForInvalidName (875 of 1971)
PASS: lldb-unit :: Utility/./UtilityTests/ProcessInstanceInfoList.Yaml (876 of 1971)
PASS: lldb-unit :: Process/gdb-remote/./ProcessGdbRemoteTests/GDBRemoteClientBaseTest.SendContinueAndInterrupt2PacketBug (877 of 1971)
PASS: lldb-api :: lang/c/offsetof/TestOffsetof.py (878 of 1971)
PASS: lldb-api :: commands/target/stop-hooks/TestStopHooks.py (879 of 1971)
PASS: lldb-api :: functionalities/data-formatter/data-formatter-stl/libcxx/set/TestDataFormatterLibcxxSet.py (880 of 1971)
PASS: lldb-unit :: Utility/./UtilityTests/NameMatchesTest.EndsWith (881 of 1971)
PASS: lldb-unit :: UnwindAssembly/x86/./UnwindAssemblyx86Tests/Testx86AssemblyInspectionEngine.TestPopEDI (882 of 1971)
PASS: lldb-api :: functionalities/data-formatter/hexcaps/TestDataFormatterHexCaps.py (883 of 1971)
PASS: lldb-api :: lang/cpp/unique-types/TestUniqueTypes.py (884 of 1971)
PASS: lldb-shell :: ObjectFile/ELF/section-addresses.yaml (885 of 1971)
PASS: lldb-unit :: ScriptInterpreter/Python/./ScriptInterpreterPythonTests/PythonDataObjectsTest.TestCallable (886 of 1971)
PASS: lldb-api :: python_api/default-constructor/TestDefaultConstructorForAPIObjects.py (887 of 1971)
PASS: lldb-unit :: Utility/./UtilityTests/StreamTest.PutCharWhitespace (888 of 1971)
PASS: lldb-api :: functionalities/data-formatter/varscript_formatting/TestDataFormatterVarScriptFormatting.py (889 of 1971)
PASS: lldb-api :: python_api/breakpoint/TestBreakpointAPI.py (890 of 1971)
PASS: lldb-api :: commands/frame/var/TestFrameVar.py (891 of 1971)
PASS: lldb-api :: functionalities/breakpoint/auto_continue/TestBreakpointAutoContinue.py (892 of 1971)
PASS: lldb-unit :: Utility/./UtilityTests/CompletionRequest.Constructor (893 of 1971)
PASS: lldb-api :: functionalities/completion/TestCompletion.py (894 of 1971)
PASS: lldb-api :: functionalities/data-formatter/var-in-aggregate-misuse/TestVarInAggregateMisuse.py (895 of 1971)
PASS: lldb-api :: lang/mixed/TestMixedLanguages.py (896 of 1971)
PASS: lldb-unit :: Utility/./UtilityTests/StringListTest.InsertStringAtIndexEnd (897 of 1971)
PASS: lldb-unit :: Utility/./UtilityTests/AnsiTerminal.AtStart (898 of 1971)
PASS: lldb-shell :: Reproducer/TestPythonImport.test (899 of 1971)
PASS: lldb-unit :: Expression/./ExpressionTests/DiagnosticManagerTest.FixedExpression (900 of 1971)
UNSUPPORTED: lldb-shell :: Minidump/Windows/arm-fp-unwind.test (901 of 1971)
PASS: lldb-api :: functionalities/postmortem/elf-core/gcore/TestGCore.py (902 of 1971)
PASS: lldb-api :: python_api/sblaunchinfo/TestSBLaunchInfo.py (903 of 1971)
PASS: lldb-unit :: ScriptInterpreter/Python/./ScriptInterpreterPythonTests/PythonDataObjectsTest.TestGlobalNameResolutionWithDot (904 of 1971)
PASS: lldb-unit :: Utility/./UtilityTests/ProcessInfoTest.Constructor (905 of 1971)
PASS: lldb-unit :: ScriptInterpreter/Python/./ScriptInterpreterPythonTests/PythonDataObjectsTest.TestExtractingUInt64ThroughStructuredData (906 of 1971)
PASS: lldb-api :: functionalities/data-formatter/data-formatter-stl/libcxx/bitset/TestDataFormatterLibcxxBitset.py (907 of 1971)
PASS: lldb-api :: commands/help/TestHelp.py (908 of 1971)
UNSUPPORTED: lldb-shell :: Unwind/unwind-plan-dwarf-dump.test (909 of 1971)
PASS: lldb-api :: lang/cpp/member-and-local-vars-with-same-name/TestMembersAndLocalsWithSameName.py (910 of 1971)
PASS: lldb-api :: commands/command/invalid-args/TestInvalidArgsCommand.py (911 of 1971)
PASS: lldb-unit :: Utility/./UtilityTests/BroadcasterTest.EventTypeHasListeners (912 of 1971)
PASS: lldb-api :: macosx/function-starts/TestFunctionStarts.py (913 of 1971)
PASS: lldb-api :: lang/objc/radar-9691614/TestObjCMethodReturningBOOL.py (914 of 1971)
PASS: lldb-unit :: Utility/./UtilityTests/UriParserTest.PortOverflow (915 of 1971)
UNSUPPORTED: lldb-api :: functionalities/ubsan/user-expression/TestUbsanUserExpression.py (916 of 1971)
PASS: lldb-shell :: SymbolFile/symbol-binding.test (917 of 1971)
PASS: lldb-api :: functionalities/plugins/command_plugin/TestPluginCommands.py (918 of 1971)
PASS: lldb-unit :: Utility/./UtilityTests/ArchSpecTest.MergeFrom (919 of 1971)
PASS: lldb-unit :: Symbol/./SymbolTests/DWARFCallFrameInfoTest.Basic_dwarf4 (920 of 1971)
PASS: lldb-shell :: SymbolFile/NativePDB/globals-bss.cpp (921 of 1971)
PASS: lldb-api :: lang/objc/ivar-IMP/TestObjCiVarIMP.py (922 of 1971)
PASS: lldb-unit :: UnwindAssembly/x86/./UnwindAssemblyx86Tests/Testx86AssemblyInspectionEngine.TestPushR13 (923 of 1971)
PASS: lldb-unit :: Utility/./UtilityTests/StringListTest.JoinEmpty (924 of 1971)
PASS: lldb-api :: lang/objc/objc-stepping/TestObjCStepping.py (925 of 1971)
PASS: lldb-shell :: Minidump/fb-dump.test (926 of 1971)
PASS: lldb-api :: lang/cpp/breakpoint_in_member_func_w_non_primitive_params/TestBreakpointInMemberFuncWNonPrimitiveParams.py (927 of 1971)
PASS: lldb-api :: macosx/find-dsym/bundle-with-dot-in-filename/TestBundleWithDotInFilename.py (928 of 1971)
PASS: lldb-shell :: ObjectFile/MachO/subsections.yaml (929 of 1971)
PASS: lldb-api :: functionalities/breakpoint/hardware_breakpoints/hardware_breakpoint_on_multiple_threads/TestHWBreakMultiThread.py (930 of 1971)
PASS: lldb-unit :: Symbol/./SymbolTests/TestClangASTImporter.MetadataPropagationIndirectImport (931 of 1971)
PASS: lldb-shell :: Commands/command-disassemble-process.yaml (932 of 1971)
UNSUPPORTED: lldb-shell :: SymbolFile/PDB/function-level-linking.test (933 of 1971)
PASS: lldb-api :: python_api/signals/TestSignalsAPI.py (934 of 1971)
PASS: lldb-unit :: Core/./LLDBCoreTests/RichManglingContextTest.Basic (935 of 1971)
PASS: lldb-api :: functionalities/source-map/TestTargetSourceMap.py (936 of 1971)
PASS: lldb-unit :: Host/./HostTests/MainLoopTest.Signal (937 of 1971)
PASS: lldb-unit :: Utility/./UtilityTests/LogChannelTest.Enable (938 of 1971)
PASS: lldb-unit :: ScriptInterpreter/Python/./ScriptInterpreterPythonTests/PythonDataObjectsTest.TestPythonDictionaryValueEquality (939 of 1971)
PASS: lldb-unit :: Process/gdb-remote/./ProcessGdbRemoteTests/GDBRemoteClientBaseTest.SendContinueAndAsyncSignal (940 of 1971)
PASS: lldb-unit :: Utility/./UtilityTests/StreamTest.PutHex16ByteOrderLittle (941 of 1971)
PASS: lldb-shell :: ObjectFile/ELF/short-build-id.yaml (942 of 1971)
PASS: lldb-unit :: Platform/./LLDBPlatformTests/PlatformDarwinTest.GetSDKNameForType (943 of 1971)
PASS: lldb-unit :: SymbolFile/NativePDB/./SymbolFileNativePDBTests/PDBFPOProgramToDWARFExpressionTests.UnresolvedDependentCyclicRegisterAssignmentReference (944 of 1971)
PASS: lldb-unit :: ObjectFile/Breakpad/./ObjectFileBreakpadTests/LineRecord.parse (945 of 1971)
PASS: lldb-unit :: UnwindAssembly/x86/./UnwindAssemblyx86Tests/Testx86AssemblyInspectionEngine.TestPushEBX (946 of 1971)
PASS: lldb-shell :: Settings/TestDisableColor.test (947 of 1971)
PASS: lldb-api :: types/TestLongTypesExpr.py (948 of 1971)
PASS: lldb-api :: tools/lldb-vscode/breakpoint/TestVSCode_setFunctionBreakpoints.py (949 of 1971)
PASS: lldb-unit :: Utility/./UtilityTests/StringExtractorTest.GetHexU8_Underflow2_NoEof (950 of 1971)
PASS: lldb-shell :: SymbolFile/NativePDB/nested-types.cpp (951 of 1971)
PASS: lldb-unit :: Utility/./UtilityTests/StreamTeeTest.Constructor1Stream (952 of 1971)
PASS: lldb-unit :: Process/minidump/./LLDBMinidumpTests/MinidumpParserTest.InvalidMinidump (953 of 1971)
PASS: lldb-unit :: SymbolFile/NativePDB/./SymbolFileNativePDBTests/PDBFPOProgramToDWARFExpressionTests.InvalidOpBinary (954 of 1971)
PASS: lldb-api :: lang/objc/foundation/TestObjCMethods2.py (955 of 1971)
UNSUPPORTED: lldb-api :: functionalities/breakpoint/breakpoint_in_delayslot/TestAvoidBreakpointInDelaySlot.py (956 of 1971)
PASS: lldb-unit :: Utility/./UtilityTests/StringExtractorTest.GetNameColonValueContainsColon (957 of 1971)
PASS: lldb-unit :: Utility/./UtilityTests/ReproducerTest.SetCapture (958 of 1971)
PASS: lldb-api :: tools/lldb-server/TestGdbRemoteExitCode.py (959 of 1971)
PASS: lldb-unit :: UnwindAssembly/x86/./UnwindAssemblyx86Tests/Testx86AssemblyInspectionEngine.TestAddRSP (960 of 1971)
UNSUPPORTED: lldb-api :: functionalities/darwin_log/filter/exact_match/category/TestDarwinLogFilterMatchCategory.py (961 of 1971)
PASS: lldb-unit :: Process/gdb-remote/./ProcessGdbRemoteTests/GDBRemoteCommunicationServerTest.SendErrorResponse_Status (962 of 1971)
PASS: lldb-api :: functionalities/unwind/noreturn/TestNoreturnUnwind.py (963 of 1971)
PASS: lldb-unit :: Utility/./UtilityTests/FileSpecTest.EqualDotsWindows (964 of 1971)
PASS: lldb-api :: types/TestRecursiveTypes.py (965 of 1971)
PASS: lldb-unit :: Host/./HostTests/FileSystemTest.Resolve (966 of 1971)
PASS: lldb-api :: lang/objc/unicode-string/TestUnicodeString.py (967 of 1971)
PASS: lldb-unit :: Core/./LLDBCoreTests/RichManglingContextTest.IPDRealloc (968 of 1971)
PASS: lldb-shell :: ObjectFile/PECOFF/basic-info-arm.yaml (969 of 1971)
PASS: lldb-api :: commands/expression/call-function/TestCallStopAndContinue.py (970 of 1971)
PASS: lldb-unit :: Utility/./UtilityTests/ListenerTest.GetEventWait (971 of 1971)
PASS: lldb-shell :: Settings/TestEchoCommands.test (972 of 1971)
PASS: lldb-api :: lang/objc/objc-struct-return/TestObjCStructReturn.py (973 of 1971)
PASS: lldb-unit :: Utility/./UtilityTests/StringListTest.SplitIntoLinesEmpty (974 of 1971)
PASS: lldb-unit :: Symbol/./SymbolTests/TestTypeSystemClang.TestFunctionTemplateConstruction (975 of 1971)
PASS: lldb-api :: python_api/hello_world/TestHelloWorld.py (976 of 1971)
UNSUPPORTED: lldb-api :: terminal/TestEditline.py (977 of 1971)
PASS: lldb-api :: commands/watchpoints/watchpoint_commands/condition/TestWatchpointConditionCmd.py (978 of 1971)
PASS: lldb-unit :: Utility/./UtilityTests/StreamTest.PutNHex8 (979 of 1971)
PASS: lldb-unit :: Signals/./SignalsTests/UnixSignalsTest.GetFilteredSignals (980 of 1971)
PASS: lldb-shell :: ScriptInterpreter/Python/crashlog.test (981 of 1971)
PASS: lldb-unit :: Utility/./UtilityTests/RangeTest.Union (982 of 1971)
PASS: lldb-unit :: Utility/./UtilityTests/StringListTest.LongestCommonPrefix (983 of 1971)
PASS: lldb-unit :: UnwindAssembly/x86/./UnwindAssemblyx86Tests/Testx86AssemblyInspectionEngine.Test64bitFramelessSmallStackFrame (984 of 1971)
PASS: lldb-api :: commands/frame/var-scope/TestFrameVariableScope.py (985 of 1971)
UNSUPPORTED: lldb-shell :: SymbolFile/PDB/type-quals.test (986 of 1971)
PASS: lldb-api :: functionalities/unwind/sigtramp/TestSigtrampUnwind.py (987 of 1971)
PASS: lldb-api :: lang/cpp/std-function-step-into-callable/TestStdFunctionStepIntoCallable.py (988 of 1971)
PASS: lldb-api :: commands/expression/options/TestExprOptions.py (989 of 1971)
PASS: lldb-unit :: Utility/./UtilityTests/UriParserTest.BadPort (990 of 1971)
PASS: lldb-api :: functionalities/thread/concurrent_events/TestConcurrentSignalWatch.py (991 of 1971)
PASS: lldb-shell :: SymbolFile/NativePDB/break-by-line.cpp (992 of 1971)
PASS: lldb-api :: tools/lldb-server/TestGdbRemoteHostInfo.py (993 of 1971)
PASS: lldb-unit :: Utility/./UtilityTests/StringLexerTest.PutBack (994 of 1971)
UNSUPPORTED: lldb-api :: functionalities/data-formatter/data-formatter-stl/libstdcpp/list/TestDataFormatterStdList.py (995 of 1971)
PASS: lldb-api :: commands/target/basic/TestTargetCommand.py (996 of 1971)
PASS: lldb-api :: sample_test/TestSampleInlineTest.py (997 of 1971)
PASS: lldb-unit :: Editline/./EditlineTests/EditlineTestFixture.EditlineReceivesSingleLineText (998 of 1971)
PASS: lldb-unit :: Expression/./ExpressionTests/ClangExpressionDeclMapTest.TestPersistentDeclLookup (999 of 1971)
PASS: lldb-unit :: Utility/./UtilityTests/ArgsTest.TestArgv (1000 of 1971)
PASS: lldb-api :: functionalities/data-formatter/cstring-utf8-summary/TestCstringUnicode.py (1001 of 1971)
PASS: lldb-api :: lang/cpp/thread_local/TestThreadLocal.py (1002 of 1971)
PASS: lldb-api :: functionalities/data-formatter/data-formatter-named-summaries/TestDataFormatterNamedSummaries.py (1003 of 1971)
PASS: lldb-api :: api/multiple-targets/TestMultipleTargets.py (1004 of 1971)
PASS: lldb-unit :: Expression/./ExpressionTests/CppModuleConfigurationTest.AmbiguousLibCpp (1005 of 1971)
PASS: lldb-shell :: SymbolFile/DWARF/debug_aranges-empty-section.s (1006 of 1971)
PASS: lldb-unit :: Host/./HostTests/SocketAddressTest.GetAddressInfo (1007 of 1971)
PASS: lldb-api :: commands/quit/TestQuit.py (1008 of 1971)
PASS: lldb-api :: commands/expression/import-std-module/deque-basic/TestDequeFromStdModule.py (1009 of 1971)
UNSUPPORTED: lldb-shell :: SymbolFile/dissassemble-entry-point.s (1010 of 1971)
PASS: lldb-shell :: Process/TestEnvironment.test (1011 of 1971)
PASS: lldb-unit :: Process/gdb-remote/./ProcessGdbRemoteTests/GDBRemoteCommunicationClientTest.GetModulesInfoInvalidResponse (1012 of 1971)
PASS: lldb-shell :: Commands/CommandScriptImmediateOutput/CommandScriptImmediateOutputConsole.test (1013 of 1971)
UNSUPPORTED: lldb-api :: functionalities/data-formatter/data-formatter-stl/libstdcpp/vbool/TestDataFormatterStdVBool.py (1014 of 1971)
PASS: lldb-api :: macosx/thread_suspend/TestInternalThreadSuspension.py (1015 of 1971)
PASS: lldb-shell :: ObjectFile/ELF/PT_LOAD.yaml (1016 of 1971)
PASS: lldb-api :: commands/disassemble/basic/TestFrameDisassemble.py (1017 of 1971)
PASS: lldb-api :: functionalities/abbreviation/TestCommonShortSpellings.py (1018 of 1971)
PASS: lldb-api :: functionalities/unwind/noreturn/module-end/TestNoReturnModuleEnd.py (1019 of 1971)
PASS: lldb-api :: tools/lldb-server/TestGdbRemoteSingleStep.py (1020 of 1971)
PASS: lldb-api :: python_api/lldbutil/iter/TestLLDBIterator.py (1021 of 1971)
PASS: lldb-shell :: SymbolFile/DWARF/debug-types-dwo-cross-reference.cpp (1022 of 1971)
PASS: lldb-unit :: Utility/./UtilityTests/StringListTest.InsertStringAtIndexOutOfBounds (1023 of 1971)
PASS: lldb-api :: lang/c/blocks/TestBlocks.py (1024 of 1971)
PASS: lldb-api :: functionalities/data-formatter/data-formatter-enum-format/TestDataFormatterEnumFormat.py (1025 of 1971)
PASS: lldb-shell :: Breakpoint/jitbp_elf.test (1026 of 1971)
PASS: lldb-api :: python_api/interpreter/TestRunCommandInterpreterAPI.py (1027 of 1971)
PASS: lldb-unit :: Language/Highlighting/./HighlighterTests/HighlighterTest.ClangBraces (1028 of 1971)
PASS: lldb-api :: functionalities/thread/concurrent_events/TestConcurrentTwoWatchpointsOneDelayBreakpoint.py (1029 of 1971)
PASS: lldb-unit :: Utility/./UtilityTests/StringExtractorTest.GetHexBytes_OddPair2 (1030 of 1971)
PASS: lldb-unit :: Process/gdb-remote/./ProcessGdbRemoteTests/GDBRemoteClientBaseTest.SendPacketAndReceiveResponseWithOutputSupport (1031 of 1971)
PASS: lldb-api :: lang/cpp/function-qualifiers/TestCppFunctionQualifiers.py (1032 of 1971)
PASS: lldb-unit :: Utility/./UtilityTests/StringLexerTest.Next (1033 of 1971)
PASS: lldb-unit :: Symbol/./SymbolTests/TestClangASTImporter.CanImportInvalidType (1034 of 1971)
PASS: lldb-shell :: SymbolFile/DWARF/DW_AT_loclists_base.s (1035 of 1971)
PASS: lldb-api :: tools/lldb-vscode/step/TestVSCode_step.py (1036 of 1971)
PASS: lldb-api :: lang/c/set_values/TestSetValues.py (1037 of 1971)
PASS: lldb-unit :: Utility/./UtilityTests/StringListTest.AppendStringStdString (1038 of 1971)
PASS: lldb-api :: commands/expression/import-std-module/vector-bool/TestVectorBoolFromStdModule.py (1039 of 1971)
PASS: lldb-api :: functionalities/tail_call_frames/thread_step_out_message/TestArtificialFrameStepOutMessage.py (1040 of 1971)
PASS: lldb-api :: commands/expression/context-object-objc/TestContextObjectObjc.py (1041 of 1971)
UNSUPPORTED: lldb-api :: lang/cpp/function-template-parameter-pack/TestFunctionTemplateParameterPack.py (1042 of 1971)
PASS: lldb-unit :: debugserver/./debugserverTests/RNBSocket.LoopBackConnectIPv4 (1043 of 1971)
PASS: lldb-api :: functionalities/data-formatter/data-formatter-stl/libcxx/initializerlist/TestInitializerList.py (1044 of 1971)
PASS: lldb-api :: lang/cpp/global_variables/TestCPPGlobalVariables.py (1045 of 1971)
PASS: lldb-unit :: Process/minidump/./LLDBMinidumpTests/MinidumpParserTest.GetMemoryRegionInfo (1046 of 1971)
PASS: lldb-shell :: SymbolFile/Breakpad/line-table-mixed-path-styles.test (1047 of 1971)
PASS: lldb-shell :: ObjectFile/wasm/basic.yaml (1048 of 1971)
PASS: lldb-api :: lang/cpp/limit-debug-info/TestWithLimitDebugInfo.py (1049 of 1971)
PASS: lldb-shell :: ObjectFile/MachO/symtab.yaml (1050 of 1971)
PASS: lldb-api :: lang/cpp/namespace_conflicts/TestNamespaceConflicts.py (1051 of 1971)
PASS: lldb-unit :: Language/Highlighting/./HighlighterTests/HighlighterTest.ClangSquareBrackets (1052 of 1971)
UNSUPPORTED: lldb-api :: functionalities/thread/create_during_step/TestCreateDuringStep.py (1053 of 1971)
PASS: lldb-api :: commands/expression/import-std-module/queue/TestQueueFromStdModule.py (1054 of 1971)
PASS: lldb-unit :: Utility/./UtilityTests/StringExtractorTest.GetU32BigEndian (1055 of 1971)
PASS: lldb-unit :: Utility/./UtilityTests/StreamTest.PutMaxHex64ByteOrderLittle (1056 of 1971)
PASS: lldb-api :: lang/objc/foundation/TestObjectDescriptionAPI.py (1057 of 1971)
PASS: lldb-api :: lang/c/array_types/TestArrayTypes.py (1058 of 1971)
PASS: lldb-api :: lang/objc/objc-static-method-stripped/TestObjCStaticMethodStripped.py (1059 of 1971)
PASS: lldb-unit :: Host/./HostTests/NativeProcessProtocolTest.ReadMemoryWithoutTrap (1060 of 1971)
UNSUPPORTED: lldb-api :: functionalities/tsan/thread_numbers/TestTsanThreadNumbers.py (1061 of 1971)
PASS: lldb-api :: python_api/findvalue_duplist/TestSBFrameFindValue.py (1062 of 1971)
PASS: lldb-api :: commands/expression/completion-crash-incomplete-record/TestCompletionCrashIncompleteRecord.py (1063 of 1971)
PASS: lldb-api :: functionalities/thread/concurrent_events/TestConcurrentBreakpointOneDelayBreakpointThreads.py (1064 of 1971)
UNSUPPORTED: lldb-shell :: BuildScript/toolchain-clang-cl.test (1065 of 1971)
PASS: lldb-shell :: ObjectFile/ELF/many-sections.s (1066 of 1971)
UNSUPPORTED: lldb-shell :: ScriptInterpreter/Lua/convenience_variables.test (1067 of 1971)
PASS: lldb-shell :: ObjectFile/Breakpad/sections.test (1068 of 1971)
PASS: lldb-unit :: Utility/./UtilityTests/StringExtractorTest.GetU64BigEndian (1069 of 1971)
PASS: lldb-unit :: SymbolFile/NativePDB/./SymbolFileNativePDBTests/PDBFPOProgramToDWARFExpressionTests.UnresolvedRegisterAssignmentReference (1070 of 1971)
PASS: lldb-api :: functionalities/thread/thread_specific_break/TestThreadSpecificBreakpoint.py (1071 of 1971)
PASS: lldb-api :: commands/apropos/basic/TestApropos.py (1072 of 1971)
UNSUPPORTED: lldb-shell :: SymbolFile/PDB/func-symbols.test (1073 of 1971)
UNSUPPORTED: lldb-api :: linux/thread/create_during_instruction_step/TestCreateDuringInstructionStep.py (1074 of 1971)
PASS: lldb-unit :: ScriptInterpreter/Python/./ScriptInterpreterPythonTests/PythonDataObjectsTest.TestPythonTupleToStructuredList (1075 of 1971)
PASS: lldb-api :: lang/cpp/static_methods/TestCPPStaticMethods.py (1076 of 1971)
PASS: lldb-unit :: SymbolFile/NativePDB/./SymbolFileNativePDBTests/PDBFPOProgramToDWARFExpressionTests.MissingTargetRegister (1077 of 1971)
FAIL: lldb-api :: lang/objc/ptr_refs/TestPtrRefsObjC.py (1078 of 1971)
******************** TEST 'lldb-api :: lang/objc/ptr_refs/TestPtrRefsObjC.py' FAILED ********************
Script:
--
/usr/local/bin/python /Users/buildslave/jenkins/workspace/lldb-cmake-sanitized/llvm-project/lldb/test/API/dotest.py --arch x86_64 -s /Users/buildslave/jenkins/workspace/lldb-cmake-sanitized/lldb-build/lldb-test-traces -S nm -u CXXFLAGS -u CFLAGS --codesign-identity lldb_codesign --server /Users/buildslave/jenkins/workspace/lldb-cmake-sanitized/lldb-build/./bin/debugserver --arch x86_64 --build-dir /Users/buildslave/jenkins/workspace/lldb-cmake-sanitized/lldb-build/lldb-test-build.noindex -s=/Users/buildslave/jenkins/workspace/lldb-cmake-sanitized/test/logs -t --env TERM=vt100 --env LLVM_LIBS_DIR=/Users/buildslave/jenkins/workspace/lldb-cmake-sanitized/lldb-build/./lib --inferior-env ASAN_OPTIONS=detect_stack_use_after_return=1 --inferior-env DYLD_INSERT_LIBRARIES=/Users/buildslave/jenkins/workspace/lldb-cmake-sanitized/host-compiler/lib/clang/11.0.0/lib/darwin/libclang_rt.asan_osx_dynamic.dylib --build-dir /Users/buildslave/jenkins/workspace/lldb-cmake-sanitized/lldb-build/lldb-test-build.noindex --lldb-module-cache-dir /Users/buildslave/jenkins/workspace/lldb-cmake-sanitized/lldb-build/lldb-test-build.noindex/module-cache-lldb/lldb-api --clang-module-cache-dir /Users/buildslave/jenkins/workspace/lldb-cmake-sanitized/lldb-build/lldb-test-build.noindex/module-cache-clang/lldb-api --executable /Users/buildslave/jenkins/workspace/lldb-cmake-sanitized/lldb-build/./bin/lldb --compiler /Users/buildslave/jenkins/workspace/lldb-cmake-sanitized/lldb-build/./bin/clang --dsymutil /Users/buildslave/jenkins/workspace/lldb-cmake-sanitized/lldb-build/./bin/dsymutil --filecheck /Users/buildslave/jenkins/workspace/lldb-cmake-sanitized/lldb-build/./bin/FileCheck --lldb-libs-dir /Users/buildslave/jenkins/workspace/lldb-cmake-sanitized/lldb-build/./lib /Users/buildslave/jenkins/workspace/lldb-cmake-sanitized/llvm-project/lldb/test/API/lang/objc/ptr_refs -p TestPtrRefsObjC.py
--
Exit Code: 1

Hide Details

Command Output (stdout): -- lldb version 11.0.99 clang revision 1e65209e045598c3ca5833331215606a02267229 llvm revision 1e65209e045598c3ca5833331215606a02267229 "crashlog" and "save_crashlog" command installed, use the "--help" option for detailed help "malloc_info", "ptr_refs", "cstr_refs", "find_variable", and "objc_refs" commands have been installed, use the "--help" options on these commands for detailed help. LLDB library dir: /Users/buildslave/jenkins/workspace/lldb-cmake-sanitized/lldb-build/bin LLDB import library dir: /Users/buildslave/jenkins/workspace/lldb-cmake-sanitized/lldb-build/./lib libstdcxx tests will not be run because: Don't know how to build with libstdcxx on macosx Skipping following debug info categories: ['dwo'] 0x00007ffeea903468: stack in frame #0 of thread #1: tid 0x811166 in variable at 0x7ffeea903468: (MyClass *) self = 0x00006020000000d0 0x00007ffeea9033e0: stack (red zone)

Hide Details

-- Command Output (stderr): -- error: 'ptr_refs' is not a valid command. error: 'ptr_refs' is not a valid command.

Hide Details

Session logs for test failures/errors/unexpected successes will go into directory '/Users/buildslave/jenkins/workspace/lldb-cmake-sanitized/test/logs' Command invoked: /Users/buildslave/jenkins/workspace/lldb-cmake-sanitized/llvm-project/lldb/test/API/dotest.py --arch x86_64 -s /Users/buildslave/jenkins/workspace/lldb-cmake-sanitized/lldb-build/lldb-test-traces -S nm -u CXXFLAGS -u CFLAGS --codesign-identity lldb_codesign --server /Users/buildslave/jenkins/workspace/lldb-cmake-sanitized/lldb-build/./bin/debugserver --arch x86_64 --build-dir /Users/buildslave/jenkins/workspace/lldb-cmake-sanitized/lldb-build/lldb-test-build.noindex -s=/Users/buildslave/jenkins/workspace/lldb-cmake-sanitized/test/logs -t --env TERM=vt100 --env LLVM_LIBS_DIR=/Users/buildslave/jenkins/workspace/lldb-cmake-sanitized/lldb-build/./lib --inferior-env ASAN_OPTIONS=detect_stack_use_after_return=1 --inferior-env DYLD_INSERT_LIBRARIES=/Users/buildslave/jenkins/workspace/lldb-cmake-sanitized/host-compiler/lib/clang/11.0.0/lib/darwin/libclang_rt.asan_osx_dynamic.dylib --build-dir /Users/buildslave/jenkins/workspace/lldb-cmake-sanitized/lldb-build/lldb-test-build.noindex --lldb-module-cache-dir /Users/buildslave/jenkins/workspace/lldb-cmake-sanitized/lldb-build/lldb-test-build.noindex/module-cache-lldb/lldb-api --clang-module-cache-dir /Users/buildslave/jenkins/workspace/lldb-cmake-sanitized/lldb-build/lldb-test-build.noindex/module-cache-clang/lldb-api --executable /Users/buildslave/jenkins/workspace/lldb-cmake-sanitized/lldb-build/./bin/lldb --compiler /Users/buildslave/jenkins/workspace/lldb-cmake-sanitized/lldb-build/./bin/clang --dsymutil /Users/buildslave/jenkins/workspace/lldb-cmake-sanitized/lldb-build/./bin/dsymutil --filecheck /Users/buildslave/jenkins/workspace/lldb-cmake-sanitized/lldb-build/./bin/FileCheck --lldb-libs-dir /Users/buildslave/jenkins/workspace/lldb-cmake-sanitized/lldb-build/./lib /Users/buildslave/jenkins/workspace/lldb-cmake-sanitized/llvm-project/lldb/test/API/lang/objc/ptr_refs -p TestPtrRefsObjC.py Change dir to: /Users/buildslave/jenkins/workspace/lldb-cmake-sanitized/llvm-project/lldb/test/API/lang/objc/ptr_refs runCmd: settings clear -all output:

Hide Details

runCmd: settings set symbols.enable-external-lookup false output:

Hide Details

runCmd: settings set target.auto-apply-fixits false output:

Hide Details

runCmd: settings set plugin.process.gdb-remote.packet-timeout 60 output:

Hide Details

runCmd: settings set symbols.clang-modules-cache-path "/Users/buildslave/jenkins/workspace/lldb-cmake-sanitized/lldb-build/lldb-test-build.noindex/module-cache-lldb/lldb-api" output:

Hide Details

runCmd: settings set use-color false output:

Hide Details

runCmd: setting set target.prefer-dynamic-value no-dynamic-values output:

Hide Details

runCmd: settings set target.env-vars ASAN_OPTIONS=detect_stack_use_after_return=1 DYLD_INSERT_LIBRARIES=/Users/buildslave/jenkins/workspace/lldb-cmake-sanitized/host-compiler/lib/clang/11.0.0/lib/darwin/libclang_rt.asan_osx_dynamic.dylib output:

Hide Details

runCmd: script import lldb.macosx.heap output: "crashlog" and "save_crashlog" command installed, use the "--help" option for detailed help "malloc_info", "ptr_refs", "cstr_refs", "find_variable", and "objc_refs" commands have been installed, use the "--help" options on these commands for detailed help.

Hide Details

Hide Details

runCmd: ptr_refs self output: 0x00007ffeea903468: stack in frame #0 of thread #1: tid 0x811166 in variable at 0x7ffeea903468: (MyClass *) self = 0x00006020000000d0 0x00007ffeea9033e0: stack (red zone)

Hide Details

Hide Details

Expecting sub string: malloc Not matched

Hide Details

FAIL: LLDB (/Users/buildslave/jenkins/workspace/lldb-cmake-sanitized/lldb-build/bin/clang-11-x86_64) :: test_ptr_refs_dsym (TestPtrRefsObjC.TestPtrRefsObjC) <bound method SBProcess.Kill of <lldb.SBProcess; proxy of <Swig Object of type 'lldb::SBProcess *' at 0x11eefd8a0> >>: success

Hide Details

runCmd: settings clear -all output:

Hide Details

runCmd: settings set symbols.enable-external-lookup false output:

Hide Details

runCmd: settings set target.auto-apply-fixits false output:

Hide Details

runCmd: settings set plugin.process.gdb-remote.packet-timeout 60 output:

Hide Details

runCmd: settings set symbols.clang-modules-cache-path "/Users/buildslave/jenkins/workspace/lldb-cmake-sanitized/lldb-build/lldb-test-build.noindex/module-cache-lldb/lldb-api" output:

Hide Details

runCmd: settings set use-color false output:

Hide Details

runCmd: setting set target.prefer-dynamic-value no-dynamic-values output:

Hide Details

runCmd: settings set target.env-vars ASAN_OPTIONS=detect_stack_use_after_return=1 DYLD_INSERT_LIBRARIES=/Users/buildslave/jenkins/workspace/lldb-cmake-sanitized/host-compiler/lib/clang/11.0.0/lib/darwin/libclang_rt.asan_osx_dynamic.dylib output:

Hide Details

runCmd: script import lldb.macosx.heap output:

Hide Details

runCmd: ptr_refs self runCmd failed! error: 'ptr_refs' is not a valid command.

Hide Details

Hide Details

XFAIL: LLDB (/Users/buildslave/jenkins/workspace/lldb-cmake-sanitized/lldb-build/bin/clang-11-x86_64) :: test_ptr_refs_dwarf (TestPtrRefsObjC.TestPtrRefsObjC) <bound method SBProcess.Kill of <lldb.SBProcess; proxy of <Swig Object of type 'lldb::SBProcess *' at 0x107b34990> >>: success

Hide Details

UNSUPPORTED: LLDB (/Users/buildslave/jenkins/workspace/lldb-cmake-sanitized/lldb-build/bin/clang-11-x86_64) :: test_ptr_refs_dwo (TestPtrRefsObjC.TestPtrRefsObjC) (test case does not fall in any category of interest for this run) runCmd: settings clear -all output:

Hide Details

runCmd: settings set symbols.enable-external-lookup false output:

Hide Details

runCmd: settings set target.auto-apply-fixits false output:

Hide Details

runCmd: settings set plugin.process.gdb-remote.packet-timeout 60 output:

Hide Details

runCmd: settings set symbols.clang-modules-cache-path "/Users/buildslave/jenkins/workspace/lldb-cmake-sanitized/lldb-build/lldb-test-build.noindex/module-cache-lldb/lldb-api" output:

Hide Details

runCmd: settings set use-color false output:

Hide Details

runCmd: setting set target.prefer-dynamic-value no-dynamic-values output:

Hide Details

runCmd: settings set target.env-vars ASAN_OPTIONS=detect_stack_use_after_return=1 DYLD_INSERT_LIBRARIES=/Users/buildslave/jenkins/workspace/lldb-cmake-sanitized/host-compiler/lib/clang/11.0.0/lib/darwin/libclang_rt.asan_osx_dynamic.dylib output:

Hide Details

runCmd: script import lldb.macosx.heap output:

Hide Details

runCmd: ptr_refs self runCmd failed! error: 'ptr_refs' is not a valid command.

Hide Details

Hide Details

XFAIL: LLDB (/Users/buildslave/jenkins/workspace/lldb-cmake-sanitized/lldb-build/bin/clang-11-x86_64) :: test_ptr_refs_gmodules (TestPtrRefsObjC.TestPtrRefsObjC) <bound method SBProcess.Kill of <lldb.SBProcess; proxy of <Swig Object of type 'lldb::SBProcess *' at 0x11eefd1e0> >>: success

Hide Details

Restore dir to: /Users/buildslave/jenkins/workspace/lldb-cmake-sanitized/lldb-build/tools/lldb/test ====================================================================== FAIL: test_ptr_refs_dsym (TestPtrRefsObjC.TestPtrRefsObjC) Test the ptr_refs tool on Darwin with Objective-C ---------------------------------------------------------------------- Traceback (most recent call last): File "/Users/buildslave/jenkins/workspace/lldb-cmake-sanitized/llvm-project/lldb/packages/Python/lldbsuite/test/lldbtest.py", line 1751, in test_method return attrvalue(self) File "/Users/buildslave/jenkins/workspace/lldb-cmake-sanitized/llvm-project/lldb/packages/Python/lldbsuite/test/decorators.py", line 110, in wrapper func(*args, **kwargs) File "/Users/buildslave/jenkins/workspace/lldb-cmake-sanitized/llvm-project/lldb/test/API/lang/objc/ptr_refs/TestPtrRefsObjC.py", line 47, in test_ptr_refs self.expect("ptr_refs self", substrs=["malloc", "stack"]) File "/Users/buildslave/jenkins/workspace/lldb-cmake-sanitized/llvm-project/lldb/packages/Python/lldbsuite/test/lldbtest.py", line 2391, in expect if msg else EXP_MSG(str, output, exe)) AssertionError: False is not True : 'ptr_refs self' returns expected result, got '0x00007ffeea903468: stack in frame #0 of thread #1: tid 0x811166 in variable at 0x7ffeea903468: (MyClass *) self = 0x00006020000000d0 0x00007ffeea9033e0: stack (red zone)' Config=x86_64-/Users/buildslave/jenkins/workspace/lldb-cmake-sanitized/lldb-build/bin/clang-11 ---------------------------------------------------------------------- Ran 4 tests in 23.423s

Hide Details

RESULT: FAILED (0 passes, 1 failures, 0 errors, 1 skipped, 2 expected failures, 0 unexpected successes)

Hide Details

--

Hide Details

******************** UNSUPPORTED: lldb-api :: benchmarks/expression/TestRepeatedExprs.py (1079 of 1971) PASS: lldb-unit :: Utility/./UtilityTests/RangeTest.ContainsEndInclusive (1080 of 1971) PASS: lldb-api :: commands/expression/import-std-module/unique_ptr/TestUniquePtrFromStdModule.py (1081 of 1971) PASS: lldb-api :: functionalities/breakpoint/require_hw_breakpoints/TestRequireHWBreakpoints.py (1082 of 1971) PASS: lldb-unit :: Utility/./UtilityTests/RangeTest.Copy (1083 of 1971) PASS: lldb-api :: functionalities/breakpoint/breakpoint_names/TestBreakpointNames.py (1084 of 1971) PASS: lldb-unit :: Utility/./UtilityTests/StringExtractorTest.GetHexBytes_Partial (1085 of 1971) PASS: lldb-shell :: ObjectFile/PECOFF/basic-info.yaml (1086 of 1971) PASS: lldb-unit :: Host/./HostTests/NativeProcessProtocolTest.SetBreakpointFailRead (1087 of 1971) UNSUPPORTED: lldb-shell :: Watchpoint/netbsd-nouserdbregs.test (1088 of 1971) PASS: lldb-shell :: Reproducer/Functionalities/TestDataFormatter.test (1089 of 1971) PASS: lldb-unit :: Symbol/./SymbolTests/TestClangASTImporter.DeportTypeTagDecl (1090 of 1971) PASS: lldb-unit :: Expression/./ExpressionTests/DiagnosticManagerTest.AppendMessageNoDiag (1091 of 1971) PASS: lldb-unit :: Host/./HostTests/MainLoopTest.TerminatesImmediately (1092 of 1971) PASS: lldb-unit :: Utility/./UtilityTests/AnsiTerminal.Incomplete (1093 of 1971) PASS: lldb-unit :: Process/gdb-remote/./ProcessGdbRemoteTests/GDBRemoteClientBaseTest.SendContinueAndAsyncPacket (1094 of 1971) PASS: lldb-api :: commands/frame/diagnose/bad-reference/TestBadReference.py (1095 of 1971) PASS: lldb-api :: commands/process/attach/attach_denied/TestAttachDenied.py (1096 of 1971) UNSUPPORTED: lldb-api :: functionalities/darwin_log/basic/TestDarwinLogBasic.py (1097 of 1971) UNSUPPORTED: lldb-api :: functionalities/unwind/standard/TestStandardUnwind.py (1098 of 1971) PASS: lldb-unit :: Symbol/./SymbolTests/TestTypeSystemClang.TestDisplayName (1099 of 1971) PASS: lldb-api :: lang/objc/objc-new-syntax/TestObjCNewSyntaxDictionary.py (1100 of 1971) PASS: lldb-unit :: Utility/./UtilityTests/ArgsTest.ReplaceArgumentAtIndexEqual (1101 of 1971) PASS: lldb-unit :: Utility/./UtilityTests/StringListTest.JoinThree (1102 of 1971) PASS: lldb-unit :: Utility/./UtilityTests/LogChannelTest.EnableOptions (1103 of 1971) PASS: lldb-unit :: UnwindAssembly/x86/./UnwindAssemblyx86Tests/Testx86AssemblyInspectionEngine.TestPush0 (1104 of 1971) PASS: lldb-api :: commands/frame/diagnose/virtual-method-call/TestDiagnoseDereferenceVirtualMethodCall.py (1105 of 1971) PASS: lldb-api :: functionalities/step_scripted/TestStepScripted.py (1106 of 1971) PASS: lldb-unit :: Utility/./UtilityTests/LogTest.LLDB_LOG_nullptr (1107 of 1971) PASS: lldb-api :: lang/objc/foundation/TestConstStrings.py (1108 of 1971) PASS: lldb-api :: functionalities/thread/concurrent_events/TestConcurrentDelaySignalBreak.py (1109 of 1971) PASS: lldb-api :: functionalities/postmortem/wow64_minidump/TestWow64MiniDump.py (1110 of 1971) UNSUPPORTED: lldb-shell :: Register/x86-64-ymm16-read.test (1111 of 1971) UNSUPPORTED: lldb-shell :: ObjectFile/ELF/minidebuginfo-no-lzma.yaml (1112 of 1971) PASS: lldb-shell :: Driver/TestNoUseColor.test (1113 of 1971) PASS: lldb-unit :: Utility/./UtilityTests/StatusTest.ErrorConversion (1114 of 1971) PASS: lldb-shell :: Quit/TestQuitExitCodeHex0.test (1115 of 1971) PASS: lldb-shell :: ObjectFile/ELF/basic-info.yaml (1116 of 1971) PASS: lldb-unit :: Utility/./UtilityTests/StreamTest.PutBytesAsRawHex8ToBigEndian (1117 of 1971) PASS: lldb-unit :: Utility/./UtilityTests/OptionsWithRawTest.SingleWhitespaceInput (1118 of 1971) PASS: lldb-unit :: SymbolFile/NativePDB/./SymbolFileNativePDBTests/PDBFPOProgramToDWARFExpressionTests.UnresolvedCyclicRegisterAssignmentReference (1119 of 1971) UNSUPPORTED: lldb-api :: functionalities/data-formatter/data-formatter-stl/libstdcpp/iterator/TestDataFormatterStdIterator.py (1120 of 1971) PASS: lldb-api :: functionalities/data-formatter/data-formatter-objc/TestDataFormatterObjCNSError.py (1121 of 1971) PASS: lldb-api :: python_api/get-value-32bit-int/TestGetValue32BitInt.py (1122 of 1971) PASS: lldb-unit :: Utility/./UtilityTests/UriParserTest.LongPath (1123 of 1971) PASS: lldb-unit :: Process/minidump/./LLDBMinidumpTests/MinidumpParserTest.GetMemoryRegionInfoFromMemory64List (1124 of 1971) PASS: lldb-unit :: ObjectFile/Breakpad/./ObjectFileBreakpadTests/InfoRecord.parse (1125 of 1971) PASS: lldb-unit :: Utility/./UtilityTests/FileSpecTest.EqualDotsPosix (1126 of 1971) PASS: lldb-shell :: SymbolFile/DWARF/DW_OP_piece-struct.s (1127 of 1971) PASS: lldb-api :: python_api/value/TestValueAPI.py (1128 of 1971) PASS: lldb-unit :: Host/./HostTests/HostInfoTest.GetAugmentedArchSpec (1129 of 1971) PASS: lldb-unit :: Utility/./UtilityTests/ProcessInstanceInfo.DumpTable_invalidUID (1130 of 1971) PASS: lldb-api :: lang/objc/objc-ivar-stripped/TestObjCIvarStripped.py (1131 of 1971) PASS: lldb-unit :: Utility/./UtilityTests/StreamTest.PutHex8 (1132 of 1971) PASS: lldb-unit :: Utility/./UtilityTests/StreamTest.PutRawBytesToLittleEndian (1133 of 1971) PASS: lldb-api :: commands/expression/import-std-module/no-std-module/TestMissingStdModule.py (1134 of 1971) PASS: lldb-unit :: Utility/./UtilityTests/RangeTest.DoesIntersect (1135 of 1971) PASS: lldb-api :: functionalities/thread/step_out/TestThreadStepOut.py (1136 of 1971) PASS: lldb-shell :: ObjectFile/Breakpad/uuid-matching-mac.test (1137 of 1971) PASS: lldb-api :: lang/cpp/dynamic-value/TestDynamicValue.py (1138 of 1971) PASS: lldb-api :: commands/watchpoints/watchpoint_size/TestWatchpointSizes.py (1139 of 1971) PASS: lldb-shell :: ObjectFile/MachO/lc_version_min.yaml (1140 of 1971) PASS: lldb-unit :: UnwindAssembly/x86/./UnwindAssemblyx86Tests/Testx86AssemblyInspectionEngine.Testi386IgnoredRegisters (1141 of 1971) PASS: lldb-unit :: Utility/./UtilityTests/StringLexerTest.NextIfList (1142 of 1971) PASS: lldb-unit :: Utility/./UtilityTests/UriParserTest.BracketedHostnamePort (1143 of 1971) PASS: lldb-api :: commands/expression/ir-interpreter-phi-nodes/TestIRInterpreterPHINodes.py (1144 of 1971) PASS: lldb-unit :: Core/./LLDBCoreTests/StreamCallbackTest.Callback (1145 of 1971) PASS: lldb-unit :: Utility/./UtilityTests/BinaryStreamTest.PutSLEB128Zero (1146 of 1971) PASS: lldb-api :: tools/lldb-server/inferior-crash/TestGdbRemoteSegFault.py (1147 of 1971) PASS: lldb-unit :: UnwindAssembly/x86/./UnwindAssemblyx86Tests/Testx86AssemblyInspectionEngine.TestPopRBX (1148 of 1971) PASS: lldb-api :: functionalities/postmortem/elf-core/thread_crash/TestLinuxCoreThreads.py (1149 of 1971) PASS: lldb-unit :: Utility/./UtilityTests/StreamTest.PutHex16ByteOrderBig (1150 of 1971) PASS: lldb-api :: functionalities/thread/exit_during_step/TestExitDuringStep.py (1151 of 1971) PASS: lldb-unit :: tools/lldb-server/tests/./LLDBServerTests/TestBase.LaunchModePreservesEnvironment (1152 of 1971) PASS: lldb-api :: functionalities/data-formatter/data-formatter-stl/libcxx/function/TestLibCxxFunction.py (1153 of 1971) PASS: lldb-api :: commands/expression/ignore-artificial-constructors/TestIgnoreArtificialConstructors.py (1154 of 1971) PASS: lldb-unit :: Utility/./UtilityTests/RegularExpression.Valid (1155 of 1971) PASS: lldb-unit :: Utility/./UtilityTests/StringExtractorTest.GetHexU8_InvalidHex_NoEof (1156 of 1971) PASS: lldb-api :: commands/expression/timeout/TestCallWithTimeout.py (1157 of 1971) PASS: lldb-unit :: Utility/./UtilityTests/ArgsTest.TestSingleArgWithQuotedSpace (1158 of 1971) PASS: lldb-shell :: Quit/TestQuitExitCodeNonInt.test (1159 of 1971) UNSUPPORTED: lldb-api :: functionalities/thread/thread_specific_break_plus_condition/TestThreadSpecificBpPlusCondition.py (1160 of 1971) PASS: lldb-api :: commands/expression/import-std-module/vector/TestVectorFromStdModule.py (1161 of 1971) PASS: lldb-api :: functionalities/gdb_remote_client/TestRegDefinitionInParts.py (1162 of 1971) XFAIL: lldb-shell :: SymbolFile/DWARF/find-type-in-function.cpp (1163 of 1971) PASS: lldb-unit :: Language/Highlighting/./HighlighterTests/HighlighterTest.Keywords (1164 of 1971) PASS: lldb-unit :: Utility/./UtilityTests/StreamTest.QuotedCString (1165 of 1971) PASS: lldb-shell :: SymbolFile/DWARF/deterministic-build.cpp (1166 of 1971) PASS: lldb-unit :: SymbolFile/DWARF/./SymbolFileDWARFTests/SymbolFileDWARFTests.TestAbbrevMissingTerminator (1167 of 1971) UNSUPPORTED: lldb-api :: arm/breakpoint-thumb-codesection/TestBreakpointThumbCodesection.py (1168 of 1971) PASS: lldb-unit :: Utility/./UtilityTests/ArgsTest.TestMultipleArgs (1169 of 1971) PASS: lldb-unit :: Process/minidump/./LLDBMinidumpTests/MinidumpParserTest.GetMemory (1170 of 1971) PASS: lldb-api :: functionalities/thread/concurrent_events/TestConcurrentSignalBreak.py (1171 of 1971) PASS: lldb-api :: lang/cpp/type_lookup/TestCppTypeLookup.py (1172 of 1971) UNSUPPORTED: lldb-api :: functionalities/data-formatter/data-formatter-stl/libstdcpp/vector/TestDataFormatterStdVector.py (1173 of 1971) PASS: lldb-api :: functionalities/breakpoint/consecutive_breakpoints/TestConsecutiveBreakpoints.py (1174 of 1971) PASS: lldb-api :: functionalities/data-formatter/boolreference/TestFormattersBoolRefPtr.py (1175 of 1971) PASS: lldb-api :: functionalities/gdb_remote_client/TestNoWatchpointSupportInfo.py (1176 of 1971) PASS: lldb-api :: lang/c/local_variables/TestLocalVariables.py (1177 of 1971) PASS: lldb-api :: functionalities/data-formatter/data-formatter-categories/TestDataFormatterCategories.py (1178 of 1971) PASS: lldb-unit :: Utility/./UtilityTests/OptionsWithRawTest.TerminatedQuote (1179 of 1971) PASS: lldb-unit :: Utility/./UtilityTests/UUIDTest.RelationalOperators (1180 of 1971) PASS: lldb-unit :: Utility/./UtilityTests/Flags.Reset (1181 of 1971) UNSUPPORTED: lldb-shell :: Register/x86-64-zmm-write.test (1182 of 1971) PASS: lldb-api :: functionalities/data-formatter/data-formatter-caching/TestDataFormatterCaching.py (1183 of 1971) PASS: lldb-unit :: Expression/./ExpressionTests/DiagnosticManagerTest.GetStringMultiline (1184 of 1971) UNSUPPORTED: lldb-shell :: SymbolFile/NativePDB/stack_unwinding01.cpp (1185 of 1971) PASS: lldb-unit :: Utility/./UtilityTests/StringListTest.LongestCommonPrefixDuplicateElement (1186 of 1971) PASS: lldb-shell :: Recognizer/assert.test (1187 of 1971) PASS: lldb-unit :: Utility/./UtilityTests/StreamTest.PutHex64ByteOrderBig (1188 of 1971) UNSUPPORTED: lldb-shell :: Breakpoint/case-insensitive.test (1189 of 1971) PASS: lldb-shell :: Minidump/Windows/Sigsegv/sigsegv.test (1190 of 1971) FAIL: lldb-api :: functionalities/ptr_refs/TestPtrRefs.py (1191 of 1971) ******************** TEST 'lldb-api :: functionalities/ptr_refs/TestPtrRefs.py' FAILED ******************** Script: -- /usr/local/bin/python /Users/buildslave/jenkins/workspace/lldb-cmake-sanitized/llvm-project/lldb/test/API/dotest.py --arch x86_64 -s /Users/buildslave/jenkins/workspace/lldb-cmake-sanitized/lldb-build/lldb-test-traces -S nm -u CXXFLAGS -u CFLAGS --codesign-identity lldb_codesign --server /Users/buildslave/jenkins/workspace/lldb-cmake-sanitized/lldb-build/./bin/debugserver --arch x86_64 --build-dir /Users/buildslave/jenkins/workspace/lldb-cmake-sanitized/lldb-build/lldb-test-build.noindex -s=/Users/buildslave/jenkins/workspace/lldb-cmake-sanitized/test/logs -t --env TERM=vt100 --env LLVM_LIBS_DIR=/Users/buildslave/jenkins/workspace/lldb-cmake-sanitized/lldb-build/./lib --inferior-env ASAN_OPTIONS=detect_stack_use_after_return=1 --inferior-env DYLD_INSERT_LIBRARIES=/Users/buildslave/jenkins/workspace/lldb-cmake-sanitized/host-compiler/lib/clang/11.0.0/lib/darwin/libclang_rt.asan_osx_dynamic.dylib --build-dir /Users/buildslave/jenkins/workspace/lldb-cmake-sanitized/lldb-build/lldb-test-build.noindex --lldb-module-cache-dir /Users/buildslave/jenkins/workspace/lldb-cmake-sanitized/lldb-build/lldb-test-build.noindex/module-cache-lldb/lldb-api --clang-module-cache-dir /Users/buildslave/jenkins/workspace/lldb-cmake-sanitized/lldb-build/lldb-test-build.noindex/module-cache-clang/lldb-api --executable /Users/buildslave/jenkins/workspace/lldb-cmake-sanitized/lldb-build/./bin/lldb --compiler /Users/buildslave/jenkins/workspace/lldb-cmake-sanitized/lldb-build/./bin/clang --dsymutil /Users/buildslave/jenkins/workspace/lldb-cmake-sanitized/lldb-build/./bin/dsymutil --filecheck /Users/buildslave/jenkins/workspace/lldb-cmake-sanitized/lldb-build/./bin/FileCheck --lldb-libs-dir /Users/buildslave/jenkins/workspace/lldb-cmake-sanitized/lldb-build/./lib /Users/buildslave/jenkins/workspace/lldb-cmake-sanitized/llvm-project/lldb/test/API/functionalities/ptr_refs -p TestPtrRefs.py -- Exit Code: 1

Hide Details

Command Output (stdout): -- lldb version 11.0.99 clang revision 1e65209e045598c3ca5833331215606a02267229 llvm revision 1e65209e045598c3ca5833331215606a02267229 "crashlog" and "save_crashlog" command installed, use the "--help" option for detailed help "malloc_info", "ptr_refs", "cstr_refs", "find_variable", and "objc_refs" commands have been installed, use the "--help" options on these commands for detailed help. LLDB library dir: /Users/buildslave/jenkins/workspace/lldb-cmake-sanitized/lldb-build/bin LLDB import library dir: /Users/buildslave/jenkins/workspace/lldb-cmake-sanitized/lldb-build/./lib libstdcxx tests will not be run because: Don't know how to build with libstdcxx on macosx Skipping following debug info categories: ['dwo'] 0x00007ffeecd36478: stack in frame #0 of thread #1: tid 0x814443 in variable at 0x7ffeecd36478: (const char *) my_ptr = 0x00006020000000b0 "hello" 0x00007ffeecd36410: stack (red zone)

Hide Details

-- Command Output (stderr): -- error: 'ptr_refs' is not a valid command. error: 'ptr_refs' is not a valid command.

Hide Details

Session logs for test failures/errors/unexpected successes will go into directory '/Users/buildslave/jenkins/workspace/lldb-cmake-sanitized/test/logs' Command invoked: /Users/buildslave/jenkins/workspace/lldb-cmake-sanitized/llvm-project/lldb/test/API/dotest.py --arch x86_64 -s /Users/buildslave/jenkins/workspace/lldb-cmake-sanitized/lldb-build/lldb-test-traces -S nm -u CXXFLAGS -u CFLAGS --codesign-identity lldb_codesign --server /Users/buildslave/jenkins/workspace/lldb-cmake-sanitized/lldb-build/./bin/debugserver --arch x86_64 --build-dir /Users/buildslave/jenkins/workspace/lldb-cmake-sanitized/lldb-build/lldb-test-build.noindex -s=/Users/buildslave/jenkins/workspace/lldb-cmake-sanitized/test/logs -t --env TERM=vt100 --env LLVM_LIBS_DIR=/Users/buildslave/jenkins/workspace/lldb-cmake-sanitized/lldb-build/./lib --inferior-env ASAN_OPTIONS=detect_stack_use_after_return=1 --inferior-env DYLD_INSERT_LIBRARIES=/Users/buildslave/jenkins/workspace/lldb-cmake-sanitized/host-compiler/lib/clang/11.0.0/lib/darwin/libclang_rt.asan_osx_dynamic.dylib --build-dir /Users/buildslave/jenkins/workspace/lldb-cmake-sanitized/lldb-build/lldb-test-build.noindex --lldb-module-cache-dir /Users/buildslave/jenkins/workspace/lldb-cmake-sanitized/lldb-build/lldb-test-build.noindex/module-cache-lldb/lldb-api --clang-module-cache-dir /Users/buildslave/jenkins/workspace/lldb-cmake-sanitized/lldb-build/lldb-test-build.noindex/module-cache-clang/lldb-api --executable /Users/buildslave/jenkins/workspace/lldb-cmake-sanitized/lldb-build/./bin/lldb --compiler /Users/buildslave/jenkins/workspace/lldb-cmake-sanitized/lldb-build/./bin/clang --dsymutil /Users/buildslave/jenkins/workspace/lldb-cmake-sanitized/lldb-build/./bin/dsymutil --filecheck /Users/buildslave/jenkins/workspace/lldb-cmake-sanitized/lldb-build/./bin/FileCheck --lldb-libs-dir /Users/buildslave/jenkins/workspace/lldb-cmake-sanitized/lldb-build/./lib /Users/buildslave/jenkins/workspace/lldb-cmake-sanitized/llvm-project/lldb/test/API/functionalities/ptr_refs -p TestPtrRefs.py Change dir to: /Users/buildslave/jenkins/workspace/lldb-cmake-sanitized/llvm-project/lldb/test/API/functionalities/ptr_refs runCmd: settings clear -all output:

Hide Details

runCmd: settings set symbols.enable-external-lookup false output:

Hide Details

runCmd: settings set target.auto-apply-fixits false output:

Hide Details

runCmd: settings set plugin.process.gdb-remote.packet-timeout 60 output:

Hide Details

runCmd: settings set symbols.clang-modules-cache-path "/Users/buildslave/jenkins/workspace/lldb-cmake-sanitized/lldb-build/lldb-test-build.noindex/module-cache-lldb/lldb-api" output:

Hide Details

runCmd: settings set use-color false output:

Hide Details

runCmd: setting set target.prefer-dynamic-value no-dynamic-values output:

Hide Details

runCmd: settings set target.env-vars ASAN_OPTIONS=detect_stack_use_after_return=1 DYLD_INSERT_LIBRARIES=/Users/buildslave/jenkins/workspace/lldb-cmake-sanitized/host-compiler/lib/clang/11.0.0/lib/darwin/libclang_rt.asan_osx_dynamic.dylib output:

Hide Details

runCmd: script import lldb.macosx.heap output: "crashlog" and "save_crashlog" command installed, use the "--help" option for detailed help "malloc_info", "ptr_refs", "cstr_refs", "find_variable", and "objc_refs" commands have been installed, use the "--help" options on these commands for detailed help.

Hide Details

Hide Details

runCmd: ptr_refs my_ptr output: 0x00007ffeecd36478: stack in frame #0 of thread #1: tid 0x814443 in variable at 0x7ffeecd36478: (const char *) my_ptr = 0x00006020000000b0 "hello" 0x00007ffeecd36410: stack (red zone)

Hide Details

Hide Details

Expecting sub string: malloc Not matched

Hide Details

FAIL: LLDB (/Users/buildslave/jenkins/workspace/lldb-cmake-sanitized/lldb-build/bin/clang-11-x86_64) :: test_ptr_refs_dsym (TestPtrRefs.TestPtrRefs) <bound method SBProcess.Kill of <lldb.SBProcess; proxy of <Swig Object of type 'lldb::SBProcess *' at 0x109e1d8a0> >>: success

Hide Details

runCmd: settings clear -all output:

Hide Details

runCmd: settings set symbols.enable-external-lookup false output:

Hide Details

runCmd: settings set target.auto-apply-fixits false output:

Hide Details

runCmd: settings set plugin.process.gdb-remote.packet-timeout 60 output:

Hide Details

runCmd: settings set symbols.clang-modules-cache-path "/Users/buildslave/jenkins/workspace/lldb-cmake-sanitized/lldb-build/lldb-test-build.noindex/module-cache-lldb/lldb-api" output:

Hide Details

runCmd: settings set use-color false output:

Hide Details

runCmd: setting set target.prefer-dynamic-value no-dynamic-values output:

Hide Details

runCmd: settings set target.env-vars ASAN_OPTIONS=detect_stack_use_after_return=1 DYLD_INSERT_LIBRARIES=/Users/buildslave/jenkins/workspace/lldb-cmake-sanitized/host-compiler/lib/clang/11.0.0/lib/darwin/libclang_rt.asan_osx_dynamic.dylib output:

Hide Details

runCmd: script import lldb.macosx.heap output:

Hide Details

runCmd: ptr_refs my_ptr runCmd failed! error: 'ptr_refs' is not a valid command.

Hide Details

Hide Details

XFAIL: LLDB (/Users/buildslave/jenkins/workspace/lldb-cmake-sanitized/lldb-build/bin/clang-11-x86_64) :: test_ptr_refs_dwarf (TestPtrRefs.TestPtrRefs) <bound method SBProcess.Kill of <lldb.SBProcess; proxy of <Swig Object of type 'lldb::SBProcess *' at 0x1091d2990> >>: success

Hide Details

UNSUPPORTED: LLDB (/Users/buildslave/jenkins/workspace/lldb-cmake-sanitized/lldb-build/bin/clang-11-x86_64) :: test_ptr_refs_dwo (TestPtrRefs.TestPtrRefs) (test case does not fall in any category of interest for this run) runCmd: settings clear -all output:

Hide Details

runCmd: settings set symbols.enable-external-lookup false output:

Hide Details

runCmd: settings set target.auto-apply-fixits false output:

Hide Details

runCmd: settings set plugin.process.gdb-remote.packet-timeout 60 output:

Hide Details

runCmd: settings set symbols.clang-modules-cache-path "/Users/buildslave/jenkins/workspace/lldb-cmake-sanitized/lldb-build/lldb-test-build.noindex/module-cache-lldb/lldb-api" output:

Hide Details

runCmd: settings set use-color false output:

Hide Details

runCmd: setting set target.prefer-dynamic-value no-dynamic-values output:

Hide Details

runCmd: settings set target.env-vars ASAN_OPTIONS=detect_stack_use_after_return=1 DYLD_INSERT_LIBRARIES=/Users/buildslave/jenkins/workspace/lldb-cmake-sanitized/host-compiler/lib/clang/11.0.0/lib/darwin/libclang_rt.asan_osx_dynamic.dylib output:

Hide Details

runCmd: script import lldb.macosx.heap output:

Hide Details

runCmd: ptr_refs my_ptr runCmd failed! error: 'ptr_refs' is not a valid command.

Hide Details

Hide Details

XFAIL: LLDB (/Users/buildslave/jenkins/workspace/lldb-cmake-sanitized/lldb-build/bin/clang-11-x86_64) :: test_ptr_refs_gmodules (TestPtrRefs.TestPtrRefs) <bound method SBProcess.Kill of <lldb.SBProcess; proxy of <Swig Object of type 'lldb::SBProcess *' at 0x109e1d1e0> >>: success

Hide Details

Restore dir to: /Users/buildslave/jenkins/workspace/lldb-cmake-sanitized/lldb-build/tools/lldb/test ====================================================================== FAIL: test_ptr_refs_dsym (TestPtrRefs.TestPtrRefs) Test format string functionality. ---------------------------------------------------------------------- Traceback (most recent call last): File "/Users/buildslave/jenkins/workspace/lldb-cmake-sanitized/llvm-project/lldb/packages/Python/lldbsuite/test/lldbtest.py", line 1751, in test_method return attrvalue(self) File "/Users/buildslave/jenkins/workspace/lldb-cmake-sanitized/llvm-project/lldb/packages/Python/lldbsuite/test/decorators.py", line 110, in wrapper func(*args, **kwargs) File "/Users/buildslave/jenkins/workspace/lldb-cmake-sanitized/llvm-project/lldb/test/API/functionalities/ptr_refs/TestPtrRefs.py", line 47, in test_ptr_refs self.expect("ptr_refs my_ptr", substrs=["malloc", "stack"]) File "/Users/buildslave/jenkins/workspace/lldb-cmake-sanitized/llvm-project/lldb/packages/Python/lldbsuite/test/lldbtest.py", line 2391, in expect if msg else EXP_MSG(str, output, exe)) AssertionError: False is not True : 'ptr_refs my_ptr' returns expected result, got '0x00007ffeecd36478: stack in frame #0 of thread #1: tid 0x814443 in variable at 0x7ffeecd36478: (const char *) my_ptr = 0x00006020000000b0 "hello" 0x00007ffeecd36410: stack (red zone)' Config=x86_64-/Users/buildslave/jenkins/workspace/lldb-cmake-sanitized/lldb-build/bin/clang-11 ---------------------------------------------------------------------- Ran 4 tests in 8.878s

Hide Details

RESULT: FAILED (0 passes, 1 failures, 0 errors, 1 skipped, 2 expected failures, 0 unexpected successes)

Hide Details

--

Hide Details

******************** PASS: lldb-api :: lang/objc/objc-dyn-sbtype/TestObjCDynamicSBType.py (1192 of 1971) PASS: lldb-unit :: ScriptInterpreter/Python/./ScriptInterpreterPythonTests/PythonDataObjectsTest.TestPythonBytes (1193 of 1971) PASS: lldb-unit :: Utility/./UtilityTests/RangeTest.SizeTypes (1194 of 1971) PASS: lldb-unit :: UnwindAssembly/x86/./UnwindAssemblyx86Tests/Testx86AssemblyInspectionEngine.TestPushEBP (1195 of 1971) PASS: lldb-unit :: UnwindAssembly/x86/./UnwindAssemblyx86Tests/Testx86AssemblyInspectionEngine.TestPopR14 (1196 of 1971) PASS: lldb-unit :: Utility/./UtilityTests/StringExtractorTest.DecodeHexU8_InvalidHex (1197 of 1971) PASS: lldb-unit :: Utility/./UtilityTests/StreamTeeTest.GetStreamAtIndexOutOfBoundsEmpty (1198 of 1971) PASS: lldb-unit :: Utility/./UtilityTests/VASprintfTest.BufferResize (1199 of 1971) PASS: lldb-unit :: Target/./TargetTests/ModuleCacheTest.GetAndPut (1200 of 1971) PASS: lldb-api :: functionalities/tail_call_frames/cross_object/TestCrossObjectTailCalls.py (1201 of 1971) PASS: lldb-unit :: Host/./HostTests/Host.GetEnvironment (1202 of 1971) PASS: lldb-api :: functionalities/data-formatter/data-formatter-stl/libcxx/multimap/TestDataFormatterLibccMultiMap.py (1203 of 1971) PASS: lldb-shell :: Minidump/no-process-id.yaml (1204 of 1971) PASS: lldb-shell :: Commands/command-disassemble.s (1205 of 1971) PASS: lldb-unit :: Utility/./UtilityTests/StringListTest.CopyList (1206 of 1971) PASS: lldb-api :: lang/cpp/symbols/TestSymbols.py (1207 of 1971) PASS: lldb-api :: commands/expression/import-std-module/weak_ptr/TestWeakPtrFromStdModule.py (1208 of 1971) PASS: lldb-unit :: Utility/./UtilityTests/StringExtractorTest.GetNameColonValueSuccess (1209 of 1971) PASS: lldb-unit :: Process/gdb-remote/./ProcessGdbRemoteTests/GDBRemoteCommunicationClientTest.GetModulesInfo_UUID20 (1210 of 1971) PASS: lldb-api :: commands/expression/import-std-module/conflicts/TestStdModuleWithConflicts.py (1211 of 1971) PASS: lldb-api :: commands/expression/import-std-module/deque-dbg-info-content/TestDbgInfoContentDequeFromStdModule.py (1212 of 1971) PASS: lldb-unit :: Utility/./UtilityTests/UriParserTest.MinimalPortPath (1213 of 1971) PASS: lldb-unit :: Host/./HostTests/NativeProcessProtocolTest.ReadCStringFromMemory (1214 of 1971) PASS: lldb-unit :: Interpreter/./InterpreterTests/OptionArgParserTest.toChar (1215 of 1971) PASS: lldb-api :: commands/statistics/basic/TestStats.py (1216 of 1971) UNSUPPORTED: lldb-api :: tools/lldb-server/libraries-svr4/TestGdbRemoteLibrariesSvr4Support.py (1217 of 1971) PASS: lldb-api :: lang/cpp/trivial_abi/TestTrivialABI.py (1218 of 1971) PASS: lldb-unit :: Language/Highlighting/./HighlighterTests/HighlighterTest.ClangEmptyInput (1219 of 1971) PASS: lldb-api :: lang/cpp/namespace_definitions/TestNamespaceDefinitions.py (1220 of 1971) PASS: lldb-api :: commands/watchpoints/watchpoint_commands/command/TestWatchpointCommandPython.py (1221 of 1971) PASS: lldb-api :: commands/expression/formatters/TestFormatters.py (1222 of 1971) PASS: lldb-unit :: Utility/./UtilityTests/ArgsTest.TestOverwriteArgs (1223 of 1971) PASS: lldb-unit :: Symbol/./SymbolTests/TestClangASTImporter.MetadataPropagation (1224 of 1971) PASS: lldb-unit :: Expression/./ExpressionTests/CppModuleConfigurationTest.LibCppV2 (1225 of 1971) PASS: lldb-unit :: Process/minidump/./LLDBMinidumpTests/MinidumpParserTest.GetLinuxProcStatus_no_stream (1226 of 1971) UNSUPPORTED: lldb-api :: benchmarks/libcxxlist/TestBenchmarkLibcxxList.py (1227 of 1971) PASS: lldb-unit :: Utility/./UtilityTests/ArgsTest.TestSingleArg (1228 of 1971) PASS: lldb-unit :: Host/./HostTests/Host.WaitStatusFormat (1229 of 1971) UNSUPPORTED: lldb-api :: commands/expression/completion-crash-invalid-iterator/TestInvalidIteratorCompletionCrash.py (1230 of 1971) PASS: lldb-unit :: ScriptInterpreter/Python/./ScriptInterpreterPythonTests/PythonDataObjectsTest.TestModuleNameResolutionNoDot (1231 of 1971) PASS: lldb-unit :: Utility/./UtilityTests/StreamTest.PutRawBytesToMixedEndian (1232 of 1971) PASS: lldb-unit :: Symbol/./SymbolTests/PostfixExpression.ToDWARF (1233 of 1971) PASS: lldb-api :: macosx/universal/TestUniversal.py (1234 of 1971) PASS: lldb-unit :: UnwindAssembly/x86/./UnwindAssemblyx86Tests/Testx86AssemblyInspectionEngine.TestPushR12 (1235 of 1971) PASS: lldb-unit :: ScriptInterpreter/Python/./ScriptInterpreterPythonTests/PythonDataObjectsTest.TestPythonListManipulation (1236 of 1971) PASS: lldb-unit :: Utility/./UtilityTests/UriParserTest.MinimalPort (1237 of 1971) PASS: lldb-unit :: ScriptInterpreter/Python/./ScriptInterpreterPythonTests/PythonDataObjectsTest.TestResetting (1238 of 1971) PASS: lldb-api :: lang/cpp/namespace/TestNamespaceLookup.py (1239 of 1971) PASS: lldb-api :: commands/frame/diagnose/dereference-function-return/TestDiagnoseDereferenceFunctionReturn.py (1240 of 1971) PASS: lldb-unit :: Utility/./UtilityTests/StringExtractorTest.DecodeHexU8_Underflow2 (1241 of 1971) PASS: lldb-api :: commands/expression/pr35310/TestExprsBug35310.py (1242 of 1971) PASS: lldb-shell :: Reproducer/TestVersionCheck.test (1243 of 1971) PASS: lldb-api :: lang/cpp/class_types/TestClassTypes.py (1244 of 1971) PASS: lldb-shell :: SymbolFile/NativePDB/source-list.cpp (1245 of 1971) PASS: lldb-api :: commands/watchpoints/watchpoint_set_command/TestWatchLocationWithWatchSet.py (1246 of 1971) PASS: lldb-unit :: Utility/./UtilityTests/RangeTest.ClearWithStarAddress (1247 of 1971) PASS: lldb-api :: python_api/sbvalue_persist/TestSBValuePersist.py (1248 of 1971) PASS: lldb-unit :: Host/./HostTests/SocketTest.TCPGetConnectURI (1249 of 1971) PASS: lldb-shell :: SymbolFile/DWARF/debug-types-basic.test (1250 of 1971) PASS: lldb-unit :: Host/./HostTests/NativeProcessProtocolTest.SetBreakpointFailWrite (1251 of 1971) UNSUPPORTED: lldb-shell :: Process/Windows/exception_access_violation.cpp (1252 of 1971) PASS: lldb-unit :: Utility/./UtilityTests/OptionsWithRawTest.WhitespaceSuffix (1253 of 1971) PASS: lldb-shell :: SymbolFile/DWARF/dwarf5-debug_line.s (1254 of 1971) PASS: lldb-api :: lang/cpp/frame-var-anon-unions/TestFrameVariableAnonymousUnions.py (1255 of 1971) PASS: lldb-api :: lang/objc/objc-struct-argument/TestObjCStructArgument.py (1256 of 1971) PASS: lldb-unit :: Utility/./UtilityTests/AnsiTerminal.KnownPrefix (1257 of 1971) PASS: lldb-unit :: Utility/./UtilityTests/SerializationRountripTest.SerializeDeserializeCString (1258 of 1971) PASS: lldb-api :: functionalities/tail_call_frames/inlining_and_tail_calls/TestInliningAndTailCalls.py (1259 of 1971) UNSUPPORTED: lldb-shell :: SymbolFile/PDB/calling-conventions.test (1260 of 1971) PASS: lldb-unit :: Utility/./UtilityTests/ArgsTest.StringListConstructor (1261 of 1971) PASS: lldb-shell :: Reproducer/TestSynchronous.test (1262 of 1971) PASS: lldb-api :: functionalities/type_completion/TestTypeCompletion.py (1263 of 1971) PASS: lldb-api :: lang/objc/objc-baseclass-sbtype/TestObjCBaseClassSBType.py (1264 of 1971) PASS: lldb-api :: commands/expression/inline-namespace/TestInlineNamespace.py (1265 of 1971) PASS: lldb-unit :: Utility/./UtilityTests/UriParserTest.SchemeHostSeparator4 (1266 of 1971) PASS: lldb-api :: functionalities/thread/backtrace_all/TestBacktraceAll.py (1267 of 1971) PASS: lldb-api :: functionalities/type_lookup/TestTypeLookup.py (1268 of 1971) PASS: lldb-unit :: UnwindAssembly/x86/./UnwindAssemblyx86Tests/Testx86AssemblyInspectionEngine.TestLEAVE (1269 of 1971) PASS: lldb-api :: commands/frame/diagnose/local-variable/TestLocalVariable.py (1270 of 1971) PASS: lldb-unit :: Symbol/./SymbolTests/TestTypeSystemClang.TestRemoveFastQualifiers (1271 of 1971) PASS: lldb-api :: lang/cpp/unicode-literals/TestUnicodeLiterals.py (1272 of 1971) PASS: lldb-unit :: Expression/./ExpressionTests/DiagnosticManagerTest.GetStringBasic (1273 of 1971) PASS: lldb-unit :: Utility/./UtilityTests/StreamTest.PutCString (1274 of 1971) PASS: lldb-api :: lang/cpp/wchar_t/TestCxxWCharT.py (1275 of 1971) PASS: lldb-shell :: ScriptInterpreter/None/import_module.test (1276 of 1971) PASS: lldb-shell :: Settings/TestSettingsSet.test (1277 of 1971) UNSUPPORTED: lldb-api :: commands/expression/call-restarts/TestCallThatRestarts.py (1278 of 1971) PASS: lldb-unit :: SymbolFile/NativePDB/./SymbolFileNativePDBTests/PDBFPOProgramToDWARFExpressionTests.InvalidAssignmentMultiple (1279 of 1971) PASS: lldb-shell :: Driver/TestProcessAttach.test (1280 of 1971) PASS: lldb-api :: functionalities/thread/backtrace_limit/TestBacktraceLimit.py (1281 of 1971) UNSUPPORTED: lldb-shell :: Register/x86-64-zmm-read.test (1282 of 1971) PASS: lldb-unit :: UnwindAssembly/x86/./UnwindAssemblyx86Tests/Testx86AssemblyInspectionEngine.TestStackRealignMSVC_i386 (1283 of 1971) PASS: lldb-api :: commands/command/history/TestCommandHistory.py (1284 of 1971) PASS: lldb-api :: commands/expression/regression-access-function-template-in-record/TestRegressionAccessFunctionTemplateInRecord.py (1285 of 1971) PASS: lldb-unit :: Utility/./UtilityTests/LogChannelEnabledTest.LogVerboseThread (1286 of 1971) PASS: lldb-api :: tools/lldb-vscode/launch/TestVSCode_launch.py (1287 of 1971) PASS: lldb-api :: lang/cpp/accelerator-table/TestCPPAccelerator.py (1288 of 1971) PASS: lldb-shell :: Driver/TestRepl.test (1289 of 1971) PASS: lldb-api :: commands/expression/import-std-module/basic/TestImportStdModule.py (1290 of 1971) PASS: lldb-shell :: Quit/TestQuitExitCode0.test (1291 of 1971) UNSUPPORTED: lldb-api :: functionalities/darwin_log/filter/exact_match/activity-chain/TestDarwinLogFilterMatchActivityChain.py (1292 of 1971) PASS: lldb-api :: lang/objc/objc-ivar-offsets/TestObjCIvarOffsets.py (1293 of 1971) PASS: lldb-unit :: ObjectFile/PECOFF/./ObjectFilePECOFFTests/PECallFrameInfoTest.Frame_reg_eh (1294 of 1971) PASS: lldb-unit :: Utility/./UtilityTests/BinaryStreamTest.PutULEB128FiveBytes (1295 of 1971) PASS: lldb-api :: types/TestCharType.py (1296 of 1971) PASS: lldb-unit :: Utility/./UtilityTests/DataExtractorTest.PeekData (1297 of 1971) PASS: lldb-unit :: Utility/./UtilityTests/RangeTest.LessThanInvalid (1298 of 1971) PASS: lldb-unit :: Process/gdb-remote/./ProcessGdbRemoteTests/GDBRemoteCommunicationClientTest.WriteRegisterNoSuffix (1299 of 1971) PASS: lldb-api :: commands/expression/weak_symbols/TestWeakSymbols.py (1300 of 1971) PASS: lldb-unit :: Utility/./UtilityTests/StringExtractorTest.GetHexU8_Underflow (1301 of 1971) PASS: lldb-unit :: UnwindAssembly/x86/./UnwindAssemblyx86Tests/Testx86AssemblyInspectionEngine.TestMovRSPtoRBP (1302 of 1971) PASS: lldb-shell :: SymbolFile/DWARF/find-variable-file.cpp (1303 of 1971) PASS: lldb-api :: python_api/watchpoint/TestSetWatchpoint.py (1304 of 1971) PASS: lldb-shell :: SymbolFile/NativePDB/function-types-calling-conv.cpp (1305 of 1971) PASS: lldb-shell :: Minidump/disassemble-no-module.yaml (1306 of 1971) PASS: lldb-shell :: SymbolFile/DWARF/debug-names-compressed.cpp (1307 of 1971) PASS: lldb-api :: api/log/TestAPILog.py (1308 of 1971) PASS: lldb-unit :: Language/CPlusPlus/./LanguageCPlusPlusTests/CPlusPlusLanguage.ExtractContextAndIdentifier (1309 of 1971) UNSUPPORTED: lldb-api :: lang/c/typedef/Testtypedef.py (1310 of 1971) PASS: lldb-api :: functionalities/data-formatter/data-formatter-skip-summary/TestDataFormatterSkipSummary.py (1311 of 1971) PASS: lldb-unit :: Utility/./UtilityTests/StringListTest.GetSize (1312 of 1971) PASS: lldb-api :: tools/lldb-vscode/breakpoint/TestVSCode_setExceptionBreakpoints.py (1313 of 1971) PASS: lldb-shell :: Settings/TestFrameFormatMangling.test (1314 of 1971) PASS: lldb-api :: commands/expression/save_jit_objects/TestSaveJITObjects.py (1315 of 1971) PASS: lldb-api :: tools/lldb-server/TestLldbGdbServer.py (1316 of 1971) UNSUPPORTED: lldb-shell :: SymbolFile/PDB/pointers.test (1317 of 1971) UNSUPPORTED: lldb-shell :: Register/arm-gp-read.test (1318 of 1971) PASS: lldb-api :: commands/expression/rdar42038760/TestScalarURem.py (1319 of 1971) PASS: lldb-api :: commands/expression/dollar-in-variable/TestDollarInVariable.py (1320 of 1971) PASS: lldb-unit :: ScriptInterpreter/Python/./ScriptInterpreterPythonTests/PythonDataObjectsTest.TestPythonTupleSize (1321 of 1971) PASS: lldb-api :: functionalities/data-formatter/data-formatter-objc/TestDataFormatterObjCNSURL.py (1322 of 1971) PASS: lldb-api :: lang/objc/objc-checker/TestObjCCheckers.py (1323 of 1971) PASS: lldb-api :: commands/expression/persist_objc_pointeetype/TestPersistObjCPointeeType.py (1324 of 1971) PASS: lldb-unit :: Utility/./UtilityTests/StringExtractorTest.GetHexBytesAvail_OddPair (1325 of 1971) PASS: lldb-shell :: ObjectFile/MachO/lc_build_version.yaml (1326 of 1971) PASS: lldb-unit :: Utility/./UtilityTests/RangeTest.ContainsRange (1327 of 1971) PASS: lldb-api :: functionalities/thread/concurrent_events/TestConcurrentBreakpointsDelayedBreakpointOneWatchpoint.py (1328 of 1971) PASS: lldb-api :: commands/expression/expr-in-syscall/TestExpressionInSyscall.py (1329 of 1971) PASS: lldb-api :: functionalities/thread/concurrent_events/TestConcurrentTwoWatchpointsOneBreakpoint.py (1330 of 1971) PASS: lldb-unit :: Utility/./UtilityTests/ArchSpecTest.YAML (1331 of 1971) PASS: lldb-api :: commands/expression/persistent_types/TestNestedPersistentTypes.py (1332 of 1971) PASS: lldb-api :: functionalities/tail_call_frames/cross_dso/TestCrossDSOTailCalls.py (1333 of 1971) PASS: lldb-api :: python_api/lldbutil/frame/TestFrameUtils.py (1334 of 1971) PASS: lldb-unit :: Utility/./UtilityTests/RegularExpression.Match (1335 of 1971) PASS: lldb-unit :: Language/Highlighting/./HighlighterTests/HighlighterTest.DefaultHighlighter (1336 of 1971) PASS: lldb-unit :: Utility/./UtilityTests/UUIDTest.Validity (1337 of 1971) PASS: lldb-unit :: Expression/./ExpressionTests/DiagnosticManagerTest.GetStringPreserveOrder (1338 of 1971) PASS: lldb-unit :: Language/Highlighting/./HighlighterTests/HighlighterTest.DefaultHighlighterWithCursor (1339 of 1971) PASS: lldb-shell :: BuildScript/script-args.test (1340 of 1971) PASS: lldb-shell :: Breakpoint/debug_addrx.test (1341 of 1971) PASS: lldb-api :: commands/expression/namespace_local_var_same_name_obj_c/TestNamespaceLocalVarSameNameObjC.py (1342 of 1971) PASS: lldb-unit :: Target/./TargetTests/PathMappingListTest.RelativeTests (1343 of 1971) PASS: lldb-shell :: SymbolFile/DWARF/dir-separator-no-comp-dir.s (1344 of 1971) UNSUPPORTED: lldb-api :: benchmarks/continue/TestBenchmarkContinue.py (1345 of 1971) PASS: lldb-api :: commands/frame/diagnose/inheritance/TestDiagnoseInheritance.py (1346 of 1971) PASS: lldb-api :: lang/objc/objc-new-syntax/TestObjCNewSyntaxArray.py (1347 of 1971) PASS: lldb-api :: macosx/queues/TestQueues.py (1348 of 1971) PASS: lldb-unit :: Core/./LLDBCoreTests/MangledTest.ResultForValidName (1349 of 1971) PASS: lldb-unit :: Host/./HostTests/TaskPoolTest.RunTasks (1350 of 1971) PASS: lldb-api :: functionalities/thread/exit_during_break/TestExitDuringBreak.py (1351 of 1971) PASS: lldb-api :: lang/cpp/incomplete-types/TestCppIncompleteTypes.py (1352 of 1971) PASS: lldb-unit :: Utility/./UtilityTests/StringListTest.AppendListCStringArray (1353 of 1971) PASS: lldb-unit :: Utility/./UtilityTests/ConstStringTest.CompareStringRef (1354 of 1971) PASS: lldb-api :: functionalities/thread/concurrent_events/TestConcurrentWatchBreakDelay.py (1355 of 1971) PASS: lldb-api :: functionalities/data-formatter/data-formatter-objc/TestDataFormatterObjCCF.py (1356 of 1971) PASS: lldb-unit :: Process/minidump/./LLDBMinidumpTests/MinidumpParserTest.MinidumpModuleOrder (1357 of 1971) PASS: lldb-unit :: UnwindAssembly/x86/./UnwindAssemblyx86Tests/Testx86AssemblyInspectionEngine.TestPushRBP (1358 of 1971) PASS: lldb-unit :: Utility/./UtilityTests/VMRange.IsValid (1359 of 1971) PASS: lldb-unit :: Language/CPlusPlus/./LanguageCPlusPlusTests/CPlusPlusLanguage.FindAlternateFunctionManglings (1360 of 1971) PASS: lldb-shell :: Breakpoint/debug_rnglist_offset_pair.test (1361 of 1971) PASS: lldb-unit :: Utility/./UtilityTests/UriParserTest.BracketedHostnameWithColon (1362 of 1971) UNSUPPORTED: lldb-api :: functionalities/darwin_log/source/debug/TestDarwinLogSourceDebug.py (1363 of 1971) PASS: lldb-shell :: Minidump/dump-all.test (1364 of 1971) UNSUPPORTED: lldb-api :: functionalities/tty/TestTerminal.py (1365 of 1971) PASS: lldb-unit :: Utility/./UtilityTests/ArgsTest.TestQuotedUnknownEscape (1366 of 1971) PASS: lldb-api :: functionalities/data-formatter/nsdictionarysynth/TestNSDictionarySynthetic.py (1367 of 1971) PASS: lldb-unit :: Utility/./UtilityTests/FileSpecTest.RemoveLastPathComponent (1368 of 1971) PASS: lldb-unit :: Utility/./UtilityTests/StreamTeeTest.DefaultConstructor (1369 of 1971) PASS: lldb-unit :: Utility/./UtilityTests/StreamTest.PutRawBytesToBigEndian (1370 of 1971) UNSUPPORTED: lldb-api :: functionalities/thread/state/TestThreadStates.py (1371 of 1971) PASS: lldb-unit :: Utility/./UtilityTests/StringExtractorTest.GetHexBytes_OddPair (1372 of 1971) PASS: lldb-api :: functionalities/gdb_remote_client/TestGDBRemoteClient.py (1373 of 1971) PASS: lldb-shell :: SymbolFile/Breakpad/line-table-discontinuous-file-ids.test (1374 of 1971) PASS: lldb-unit :: Utility/./UtilityTests/SerializationRountripTest.SerializeDeserializeCStringNull (1375 of 1971) PASS: lldb-unit :: Symbol/./SymbolTests/TestTypeSystemClang.TestGetBasicTypeFromEnum (1376 of 1971) PASS: lldb-api :: commands/watchpoints/watchpoint_commands/TestWatchpointCommands.py (1377 of 1971) PASS: lldb-shell :: ObjectFile/MachO/lc_build_version_notools.yaml (1378 of 1971) PASS: lldb-unit :: Utility/./UtilityTests/ScalarTest.GetValue (1379 of 1971) PASS: lldb-api :: functionalities/history/TestHistoryRecall.py (1380 of 1971) PASS: lldb-unit :: ScriptInterpreter/Python/./ScriptInterpreterPythonTests/PythonDataObjectsTest.TestPythonStringToStructuredString (1381 of 1971) PASS: lldb-shell :: SymbolFile/NativePDB/tag-types.cpp (1382 of 1971) PASS: lldb-api :: commands/settings/TestSettings.py (1383 of 1971) PASS: lldb-shell :: Breakpoint/debug_rnglistx_rlex.test (1384 of 1971) PASS: lldb-unit :: Utility/./UtilityTests/StreamTest.PutPtr (1385 of 1971) PASS: lldb-shell :: SymbolFile/DWARF/anon_class_w_and_wo_export_symbols.ll (1386 of 1971) PASS: lldb-shell :: ObjectFile/ELF/base-address.yaml (1387 of 1971) PASS: lldb-unit :: Utility/./UtilityTests/DataExtractorTest.GetCStrEmpty (1388 of 1971) PASS: lldb-unit :: Utility/./UtilityTests/RegularExpression.CopyAssignment (1389 of 1971) PASS: lldb-unit :: Utility/./UtilityTests/ArgsTest.ReplaceArgumentAtIndexLonger (1390 of 1971) PASS: lldb-shell :: ObjectFile/Breakpad/discontiguous-sections.test (1391 of 1971) PASS: lldb-api :: python_api/frame/inlines/TestInlinedFrame.py (1392 of 1971) PASS: lldb-unit :: Language/Highlighting/./HighlighterTests/HighlighterTest.ClangIdentifiers (1393 of 1971) PASS: lldb-api :: functionalities/memory-region/TestMemoryRegion.py (1394 of 1971) PASS: lldb-api :: lang/cpp/breakpoint-commands/TestCPPBreakpointCommands.py (1395 of 1971) PASS: lldb-unit :: Utility/./UtilityTests/RangeTest.EqualInvalid (1396 of 1971) PASS: lldb-unit :: Utility/./UtilityTests/CompletionRequest.DuplicateFiltering (1397 of 1971) PASS: lldb-unit :: Utility/./UtilityTests/ConstStringTest.MangledCounterpart (1398 of 1971) PASS: lldb-unit :: Process/gdb-remote/./ProcessGdbRemoteTests/GDBRemoteCommunicationClientTest.SendSignalsToIgnore (1399 of 1971) PASS: lldb-api :: lang/objc/objc-ivar-protocols/TestIvarProtocols.py (1400 of 1971) PASS: lldb-unit :: Utility/./UtilityTests/ArchSpecTest.Compatibility (1401 of 1971) PASS: lldb-unit :: Utility/./UtilityTests/Predicate.WaitForValueEqualTo (1402 of 1971) PASS: lldb-unit :: Utility/./UtilityTests/RangeTest.ContainsRangeStartingFromZero (1403 of 1971) PASS: lldb-api :: functionalities/thread/concurrent_events/TestConcurrentTwoBreakpointsOneSignal.py (1404 of 1971) UNSUPPORTED: lldb-api :: functionalities/tsan/cpp_global_location/TestTsanCPPGlobalLocation.py (1405 of 1971) PASS: lldb-shell :: ObjectFile/PECOFF/sections-names.yaml (1406 of 1971) UNSUPPORTED: lldb-api :: linux/add-symbols/TestTargetSymbolsAddCommand.py (1407 of 1971) PASS: lldb-unit :: Utility/./UtilityTests/ArgsTest.GetArgumentArrayRef (1408 of 1971) PASS: lldb-unit :: Host/./HostTests/MainLoopTest.UnmonitoredSignal (1409 of 1971) PASS: lldb-unit :: Utility/./UtilityTests/StateTest.Formatv (1410 of 1971) PASS: lldb-api :: functionalities/breakpoint/source_regexp/TestSourceRegexBreakpoints.py (1411 of 1971) PASS: lldb-api :: lang/cpp/llvm-style/TestLLVMStyle.py (1412 of 1971) PASS: lldb-api :: functionalities/thread/concurrent_events/TestConcurrentDelayedCrashWithBreakpointSignal.py (1413 of 1971) PASS: lldb-unit :: Language/Highlighting/./HighlighterTests/HighlighterTest.ClangTrailingBackslashWithWhitespace (1414 of 1971) PASS: lldb-api :: types/TestDoubleTypes.py (1415 of 1971) PASS: lldb-unit :: Utility/./UtilityTests/RangeTest.SlideZero (1416 of 1971) PASS: lldb-unit :: Symbol/./SymbolTests/Type.CompilerContextPattern (1417 of 1971) PASS: lldb-shell :: Settings/TestStopCommandSourceOnError.test (1418 of 1971) PASS: lldb-unit :: Symbol/./SymbolTests/TestClangASTImporter.ImportInvalidType (1419 of 1971) PASS: lldb-unit :: Expression/./ExpressionTests/CppModuleConfigurationTest.UnrelatedLibrary (1420 of 1971) UNSUPPORTED: lldb-api :: api/multiple-debuggers/TestMultipleDebuggers.py (1421 of 1971) PASS: lldb-unit :: Utility/./UtilityTests/StructuredDataTest.ParseJSONFromFile (1422 of 1971) PASS: lldb-api :: commands/expression/persistent_ptr_update/TestPersistentPtrUpdate.py (1423 of 1971) PASS: lldb-shell :: Breakpoint/case-sensitive.test (1424 of 1971) PASS: lldb-api :: lang/objc/modules-auto-import/TestModulesAutoImport.py (1425 of 1971) PASS: lldb-api :: functionalities/thread/concurrent_events/TestConcurrentWatchBreak.py (1426 of 1971) PASS: lldb-unit :: Utility/./UtilityTests/DataExtractorTest.GetMaxU64_unchecked (1427 of 1971) PASS: lldb-unit :: Host/./HostTests/FileSystemTest.MakeAbsolute (1428 of 1971) PASS: lldb-unit :: Utility/./UtilityTests/StringListTest.Assignment (1429 of 1971) PASS: lldb-unit :: Utility/./UtilityTests/StringExtractorTest.GetHexU8_Exact_NoEof (1430 of 1971) PASS: lldb-api :: commands/expression/deleting-implicit-copy-constructor/TestDeletingImplicitCopyConstructor.py (1431 of 1971) PASS: lldb-unit :: Utility/./UtilityTests/ArgsTest.DoubleQuotedItem (1432 of 1971) PASS: lldb-api :: commands/gui/invalid-args/TestInvalidArgsGui.py (1433 of 1971) PASS: lldb-api :: lang/c/vla/TestVLA.py (1434 of 1971) PASS: lldb-unit :: Language/Highlighting/./HighlighterTests/HighlighterTest.ClangCursorPosBeforeOtherToken (1435 of 1971) PASS: lldb-api :: lang/objcxx/cxx-bridged-po/TestObjCXXBridgedPO.py (1436 of 1971) PASS: lldb-unit :: ScriptInterpreter/Python/./ScriptInterpreterPythonTests/PythonDataObjectsTest.TestPythonTupleValues (1437 of 1971) PASS: lldb-shell :: ObjectFile/PECOFF/basic-info-arm64.yaml (1438 of 1971) PASS: lldb-api :: functionalities/thread/concurrent_events/TestConcurrentTwoBreakpointsOneDelaySignal.py (1439 of 1971) PASS: lldb-api :: commands/expression/test/TestExprs.py (1440 of 1971) PASS: lldb-unit :: Utility/./UtilityTests/BinaryStreamTest.PutSLEB128OneByte (1441 of 1971) PASS: lldb-api :: functionalities/breakpoint/scripted_bkpt/TestScriptedResolver.py (1442 of 1971) PASS: lldb-api :: lang/c/step_over_no_deadlock/TestStepOverDoesntBlock.py (1443 of 1971) PASS: lldb-unit :: debugserver/./debugserverTests/RNBSocket.LoopBackListenIPv6 (1444 of 1971) PASS: lldb-shell :: SymbolFile/NativePDB/s_constant.cpp (1445 of 1971) PASS: lldb-shell :: Register/x86-64-gp-read.test (1446 of 1971) PASS: lldb-api :: functionalities/inline-stepping/TestInlineStepping.py (1447 of 1971) PASS: lldb-api :: functionalities/gdb_remote_client/TestPlatformClient.py (1448 of 1971) PASS: lldb-api :: commands/expression/call-function/TestCallUserDefinedFunction.py (1449 of 1971) PASS: lldb-unit :: UnwindAssembly/x86/./UnwindAssemblyx86Tests/Testx86AssemblyInspectionEngine.TestPopRBP (1450 of 1971) PASS: lldb-api :: commands/expression/completion-in-lambda-and-unnamed-class/TestCompletionInLambdaAndUnnamedClass.py (1451 of 1971) PASS: lldb-unit :: Utility/./UtilityTests/VMRange.SetEndAddress (1452 of 1971) PASS: lldb-api :: lang/objc/hidden-ivars/TestHiddenIvars.py (1453 of 1971) PASS: lldb-api :: sanity/TestModuleCacheSanity.py (1454 of 1971) PASS: lldb-unit :: Utility/./UtilityTests/SerializationRountripTest.SerializeDeserializeCStringArray (1455 of 1971) UNSUPPORTED: lldb-api :: functionalities/darwin_log/filter/regex/message/TestDarwinLogFilterRegexMessage.py (1456 of 1971) PASS: lldb-shell :: Driver/TestCore.test (1457 of 1971) PASS: lldb-shell :: Minidump/memory-region.yaml (1458 of 1971) PASS: lldb-unit :: Utility/./UtilityTests/StringListTest.CopyListSingle (1459 of 1971) PASS: lldb-shell :: SymbolFile/DWARF/debug_loc.s (1460 of 1971) PASS: lldb-shell :: ObjectFile/ELF/PT_LOAD-overlap-PT_TLS.yaml (1461 of 1971) PASS: lldb-unit :: Editline/./EditlineTests/EditlineTestFixture.EditlineReceivesMultiLineText (1462 of 1971) PASS: lldb-api :: commands/register/register/register_command/TestRegisters.py (1463 of 1971) PASS: lldb-shell :: Quit/TestQuitExitCodeHexA.test (1464 of 1971) PASS: lldb-api :: commands/frame/recognizer/TestFrameRecognizer.py (1465 of 1971) PASS: lldb-api :: functionalities/data-formatter/pyobjsynthprovider/TestPyObjSynthProvider.py (1466 of 1971) PASS: lldb-api :: lang/cpp/enum_types/TestCPP11EnumTypes.py (1467 of 1971) PASS: lldb-unit :: Symbol/./SymbolTests/TestTypeSystemClang.TestGetEnumIntegerTypeInvalid (1468 of 1971) PASS: lldb-api :: functionalities/postmortem/minidump-new/TestMiniDumpUUID.py (1469 of 1971) PASS: lldb-unit :: debugserver/./debugserverTests/RNBSocket.AnyListen (1470 of 1971) PASS: lldb-unit :: Utility/./UtilityTests/VMRange.Reset (1471 of 1971) PASS: lldb-api :: commands/expression/import-std-module/forward_list-dbg-info-content/TestDbgInfoContentForwardListFromStdModule.py (1472 of 1971) PASS: lldb-unit :: Utility/./UtilityTests/ScalarTest.Scalar_512 (1473 of 1971) PASS: lldb-shell :: Settings/TestFrameFormatColor.test (1474 of 1971) PASS: lldb-unit :: ScriptInterpreter/Python/./ScriptInterpreterPythonTests/PythonDataObjectsTest.TestPythonStringToStr (1475 of 1971) PASS: lldb-api :: functionalities/return-value/TestReturnValue.py (1476 of 1971) PASS: lldb-unit :: UnwindAssembly/x86/./UnwindAssemblyx86Tests/Testx86AssemblyInspectionEngine.TestAddESP (1477 of 1971) PASS: lldb-api :: functionalities/data-formatter/data-formatter-stl/libcxx/forward_list/TestDataFormatterLibcxxForwardList.py (1478 of 1971) PASS: lldb-api :: commands/platform/process/list/TestProcessList.py (1479 of 1971) PASS: lldb-api :: functionalities/data-formatter/data-formatter-stl/libcxx/vbool/TestDataFormatterLibcxxVBool.py (1480 of 1971) PASS: lldb-shell :: Settings/TestLineMarkerColor.test (1481 of 1971) PASS: lldb-unit :: Utility/./UtilityTests/StringExtractorTest.GetHexBytes_Underflow (1482 of 1971) PASS: lldb-shell :: SymbolFile/DWARF/find-variable-dwo.cpp (1483 of 1971) PASS: lldb-shell :: ObjectFile/PECOFF/sections.yaml (1484 of 1971) PASS: lldb-shell :: Driver/TestTarget.test (1485 of 1971) PASS: lldb-unit :: Process/minidump/./LLDBMinidumpTests/MinidumpParserTest.FindMemoryRangeWithFullMemoryMinidump (1486 of 1971) PASS: lldb-api :: lang/c/function_types/TestFunctionTypes.py (1487 of 1971) PASS: lldb-unit :: Utility/./UtilityTests/ArgsTest.ReplaceArgumentAtIndexFarOutOfRange (1488 of 1971) PASS: lldb-api :: lang/objc/objc-optimized/TestObjcOptimized.py (1489 of 1971) PASS: lldb-unit :: UnwindAssembly/x86/./UnwindAssemblyx86Tests/Testx86AssemblyInspectionEngine.TestPushECX (1490 of 1971) PASS: lldb-api :: functionalities/thread/concurrent_events/TestConcurrentManyWatchpoints.py (1491 of 1971) PASS: lldb-unit :: ScriptInterpreter/Python/./ScriptInterpreterPythonTests/PythonDataObjectsTest.TestPythonCallableCheck (1492 of 1971) PASS: lldb-api :: functionalities/thread/concurrent_events/TestConcurrentDelayWatchBreak.py (1493 of 1971) PASS: lldb-api :: lang/c/struct_types/TestStructTypes.py (1494 of 1971) UNSUPPORTED: lldb-api :: commands/watchpoints/hello_watchlocation/TestWatchLocation.py (1495 of 1971) PASS: lldb-unit :: Utility/./UtilityTests/FileSpecTest.Match (1496 of 1971) PASS: lldb-unit :: Utility/./UtilityTests/ConstStringTest.FromMidOfBufferStringRef (1497 of 1971) PASS: lldb-unit :: ObjectFile/ELF/./ObjectFileELFTests/ObjectFileELFTest.SectionsResolveConsistently (1498 of 1971) PASS: lldb-api :: lang/objc/forward-decl/TestForwardDecl.py (1499 of 1971) PASS: lldb-unit :: UnwindAssembly/x86/./UnwindAssemblyx86Tests/Testx86AssemblyInspectionEngine.TestPushRBX (1500 of 1971) PASS: lldb-unit :: Utility/./UtilityTests/StringListTest.GetMaxStringLengthEqualSize (1501 of 1971) PASS: lldb-shell :: ObjectFile/ELF/avr-basic-info.yaml (1502 of 1971) PASS: lldb-api :: python_api/file_handle/TestFileHandle.py (1503 of 1971) PASS: lldb-unit :: Expression/./ExpressionTests/DiagnosticManagerTest.PutStringSeverities (1504 of 1971) PASS: lldb-shell :: ObjectFile/wasm/embedded-debug-sections.yaml (1505 of 1971) PASS: lldb-shell :: SymbolFile/Breakpad/line-table.test (1506 of 1971) PASS: lldb-api :: functionalities/breakpoint/objc/TestObjCBreakpoints.py (1507 of 1971) PASS: lldb-api :: python_api/frame/get-variables/TestGetVariables.py (1508 of 1971) PASS: lldb-api :: linux/builtin_trap/TestBuiltinTrap.py (1509 of 1971) PASS: lldb-unit :: Utility/./UtilityTests/UriParserTest.BracketedHostname (1510 of 1971) PASS: lldb-unit :: Utility/./UtilityTests/StringListTest.InsertStringAtIndexStdString (1511 of 1971) PASS: lldb-api :: python_api/section/TestSectionAPI.py (1512 of 1971) PASS: lldb-api :: functionalities/dynamic_value_child_count/TestDynamicValueChildCount.py (1513 of 1971) PASS: lldb-api :: commands/expression/calculator_mode/TestCalculatorMode.py (1514 of 1971) PASS: lldb-api :: functionalities/data-formatter/data-formatter-objc/TestDataFormatterObjCPlain.py (1515 of 1971) PASS: lldb-unit :: Utility/./UtilityTests/ArgsTest.TestInsertArg (1516 of 1971) PASS: lldb-unit :: Utility/./UtilityTests/FileSpecTest.FileAndDirectoryComponents (1517 of 1971) PASS: lldb-shell :: SymbolFile/DWARF/debug_loc-aslr.s (1518 of 1971) PASS: lldb-unit :: ScriptInterpreter/Python/./ScriptInterpreterPythonTests/PythonDataObjectsTest.TestPythonDictionaryToStructuredDictionary (1519 of 1971) PASS: lldb-unit :: Utility/./UtilityTests/ArgsTest.ReplaceArgumentAtIndexOutOfRange (1520 of 1971) PASS: lldb-unit :: Process/gdb-remote/./ProcessGdbRemoteTests/GDBRemoteCommunicationServerTest.SendErrorResponse_ErrorList (1521 of 1971) PASS: lldb-api :: functionalities/rerun/TestRerun.py (1522 of 1971) PASS: lldb-api :: commands/expression/import-std-module/list/TestListFromStdModule.py (1523 of 1971) PASS: lldb-unit :: Symbol/./SymbolTests/SymbolsTest.LocateExecutableSymbolFileForUnknownExecutableAndMissingSymbolFile (1524 of 1971) PASS: lldb-shell :: Reproducer/TestGDBRemoteRepro.test (1525 of 1971) PASS: lldb-api :: commands/expression/import-std-module/shared_ptr/TestSharedPtrFromStdModule.py (1526 of 1971) PASS: lldb-unit :: Utility/./UtilityTests/ConstStringTest.NullAndEmptyStates (1527 of 1971) PASS: lldb-api :: functionalities/data-formatter/ptr_ref_typedef/TestPtrRef2Typedef.py (1528 of 1971) PASS: lldb-unit :: UnwindAssembly/x86/./UnwindAssemblyx86Tests/Testx86AssemblyInspectionEngine.TestSpArithx86_64Augmented (1529 of 1971) PASS: lldb-unit :: Utility/./UtilityTests/StreamTest.PutCStringWithStringRef (1530 of 1971) PASS: lldb-api :: lang/c/forward/TestForwardDeclaration.py (1531 of 1971) PASS: lldb-unit :: Utility/./UtilityTests/ScalarTest.GetBytes (1532 of 1971) PASS: lldb-unit :: Host/./HostTests/NativeProcessProtocolTest.ReadCStringFromMemory_CrossPageBoundary (1533 of 1971) PASS: lldb-unit :: Utility/./UtilityTests/ArgsTest.TestQuotedTrailingBackslash (1534 of 1971) PASS: lldb-unit :: Language/Highlighting/./HighlighterTests/HighlighterTest.ClangCursorPosAfterOtherToken (1535 of 1971) PASS: lldb-unit :: UnwindAssembly/x86/./UnwindAssemblyx86Tests/Testx86AssemblyInspectionEngine.TestPushEDX (1536 of 1971) PASS: lldb-api :: python_api/frame/TestFrames.py (1537 of 1971) UNSUPPORTED: lldb-api :: tools/lldb-server/platform-process-connect/TestPlatformProcessConnect.py (1538 of 1971) PASS: lldb-unit :: Utility/./UtilityTests/UserIDResolver.GetGroupName (1539 of 1971) PASS: lldb-api :: functionalities/testid/TestTestId.py (1540 of 1971) PASS: lldb-api :: functionalities/breakpoint/breakpoint_language/TestBreakpointLanguage.py (1541 of 1971) PASS: lldb-api :: commands/add-dsym/uuid/TestAddDsymCommand.py (1542 of 1971) PASS: lldb-unit :: Expression/./ExpressionTests/DiagnosticManagerTest.PutStringMultiple (1543 of 1971) PASS: lldb-unit :: Utility/./UtilityTests/OptionsWithRawTest.ArgsButNoLeadingDash (1544 of 1971) PASS: lldb-unit :: ObjectFile/Breakpad/./ObjectFileBreakpadTests/StackWinRecord.parse (1545 of 1971) PASS: lldb-api :: functionalities/data-formatter/setvaluefromcstring/TestSetValueFromCString.py (1546 of 1971) PASS: lldb-unit :: UnwindAssembly/x86/./UnwindAssemblyx86Tests/Testx86AssemblyInspectionEngine.TestPushImm (1547 of 1971) PASS: lldb-shell :: Reproducer/Functionalities/TestStepping.test (1548 of 1971) PASS: lldb-shell :: SymbolFile/DWARF/debug_rnglists.s (1549 of 1971) PASS: lldb-api :: functionalities/breakpoint/cpp/TestCPPBreakpointLocations.py (1550 of 1971) PASS: lldb-api :: macosx/lc-note/kern-ver-str/TestKernVerStrLCNOTE.py (1551 of 1971) UNSUPPORTED: lldb-api :: functionalities/signal/handle-segv/TestHandleSegv.py (1552 of 1971) PASS: lldb-unit :: Host/./HostTests/ProcessLaunchInfoTest.Constructor (1553 of 1971) PASS: lldb-unit :: ObjectFile/PECOFF/./ObjectFilePECOFFTests/PECallFrameInfoTest.Basic_eh (1554 of 1971) UNSUPPORTED: lldb-shell :: ObjectFile/PECOFF/disassemble-thumb.yaml (1555 of 1971) PASS: lldb-unit :: Symbol/./SymbolTests/TestClangASTImporter.RecordLayout (1556 of 1971) PASS: lldb-shell :: SymbolFile/DWARF/debug_ranges-missing-section.s (1557 of 1971) PASS: lldb-unit :: Utility/./UtilityTests/StringExtractorTest.GetHexU8_Extra_NoEof (1558 of 1971) PASS: lldb-unit :: Utility/./UtilityTests/NameMatchesTest.RegularExpression (1559 of 1971) PASS: lldb-unit :: Utility/./UtilityTests/BinaryStreamTest.PutSLEB128FiveBytes (1560 of 1971) PASS: lldb-api :: lang/cpp/rvalue-references/TestRvalueReferences.py (1561 of 1971) PASS: lldb-unit :: Utility/./UtilityTests/StreamTest.ShiftOperatorStrings (1562 of 1971) UNSUPPORTED: lldb-api :: linux/mix-dwo-and-regular-objects/TestMixedDwarfBinary.py (1563 of 1971) PASS: lldb-api :: tools/lldb-server/TestGdbRemote_qThreadStopInfo.py (1564 of 1971) PASS: lldb-shell :: SymbolFile/DWARF/debug-types-missing-signature.test (1565 of 1971) PASS: lldb-api :: commands/expression/argument_passing_restrictions/TestArgumentPassingRestrictions.py (1566 of 1971) PASS: lldb-api :: functionalities/memory/read/TestMemoryRead.py (1567 of 1971) PASS: lldb-api :: functionalities/non-overlapping-index-variable-i/TestIndexVariable.py (1568 of 1971) PASS: lldb-shell :: SymbolFile/Breakpad/symtab.test (1569 of 1971) PASS: lldb-api :: functionalities/conditional_break/TestConditionalBreak.py (1570 of 1971) PASS: lldb-api :: lang/cpp/gmodules-templates/TestGModules.py (1571 of 1971) PASS: lldb-unit :: Core/./LLDBCoreTests/MangledTest.ResultForBlockInvocation (1572 of 1971) PASS: lldb-shell :: SymbolFile/DWARF/dwp-debug-types.s (1573 of 1971) PASS: lldb-shell :: Reproducer/Functionalities/TestImageList.test (1574 of 1971) PASS: lldb-shell :: Expr/TestTypeOfDeclTypeExpr.test (1575 of 1971) PASS: lldb-unit :: Language/Highlighting/./HighlighterTests/HighlighterTest.ClangComments (1576 of 1971) PASS: lldb-api :: lang/c/conflicting-symbol/TestConflictingSymbol.py (1577 of 1971) PASS: lldb-api :: python_api/sbvalue_const_addrof/TestSBValueConstAddrOf.py (1578 of 1971) PASS: lldb-unit :: ScriptInterpreter/Python/./ScriptInterpreterPythonTests/PythonDataObjectsTest.TestPythonIntegerToStructuredInteger (1579 of 1971) PASS: lldb-api :: functionalities/signal/raise/TestRaise.py (1580 of 1971) PASS: lldb-api :: functionalities/postmortem/minidump-new/TestMiniDumpNew.py (1581 of 1971) PASS: lldb-unit :: Interpreter/./InterpreterTests/OptionArgParserTest.toScriptLanguage (1582 of 1971) PASS: lldb-unit :: Utility/./UtilityTests/StringListTest.RemoveBlankLines (1583 of 1971) PASS: lldb-shell :: SymbolFile/DWARF/dwo-type-in-main-file.s (1584 of 1971) PASS: lldb-unit :: Utility/./UtilityTests/StreamTeeTest.Flush (1585 of 1971) PASS: lldb-api :: functionalities/gdb_remote_client/TestqOffsets.py (1586 of 1971) PASS: lldb-unit :: Utility/./UtilityTests/FileSpecTest.Yaml (1587 of 1971) PASS: lldb-api :: functionalities/breakpoint/step_over_breakpoint/TestStepOverBreakpoint.py (1588 of 1971) UNSUPPORTED: lldb-shell :: SymbolFile/PDB/function-nested-block.test (1589 of 1971) PASS: lldb-api :: lang/cpp/class_static/TestStaticVariables.py (1590 of 1971) PASS: lldb-unit :: Utility/./UtilityTests/StringExtractorTest.DecodeHexU8_Underflow (1591 of 1971) PASS: lldb-api :: functionalities/data-formatter/data-formatter-objc/TestDataFormatterObjCExpr.py (1592 of 1971) UNSUPPORTED: lldb-shell :: SymbolFile/PDB/expressions.test (1593 of 1971) PASS: lldb-api :: commands/watchpoints/multiple_hits/TestMultipleHits.py (1594 of 1971) PASS: lldb-unit :: Utility/./UtilityTests/StreamTest.AddressPrefix (1595 of 1971) PASS: lldb-unit :: Utility/./UtilityTests/ArgsTest.ReplaceArgumentAtIndexShort (1596 of 1971) UNSUPPORTED: lldb-api :: iohandler/unicode/TestUnicode.py (1597 of 1971) PASS: lldb-api :: functionalities/breakpoint/breakpoint_ignore_count/TestBreakpointIgnoreCount.py (1598 of 1971) PASS: lldb-api :: lang/objc/real-definition/TestRealDefinition.py (1599 of 1971) PASS: lldb-unit :: UnwindAssembly/x86/./UnwindAssemblyx86Tests/Testx86AssemblyInspectionEngine.TestCALLNextInsn (1600 of 1971) UNSUPPORTED: lldb-api :: commands/watchpoints/variable_out_of_scope/TestWatchedVarHitWhenInScope.py (1601 of 1971) PASS: lldb-api :: commands/expression/scoped_enums/TestScopedEnumType.py (1602 of 1971) PASS: lldb-api :: commands/expression/context-object/TestContextObject.py (1603 of 1971) PASS: lldb-unit :: Utility/./UtilityTests/VMRange.CollectionContains (1604 of 1971) PASS: lldb-api :: lang/c/register_variables/TestRegisterVariables.py (1605 of 1971) PASS: lldb-unit :: Utility/./UtilityTests/StringExtractorTest.GetHexBytesAvail_Underflow (1606 of 1971) PASS: lldb-unit :: Expression/./ExpressionTests/CppModuleConfigurationTest.MissingUsrInclude (1607 of 1971) PASS: lldb-api :: api/listeners/TestListener.py (1608 of 1971) PASS: lldb-unit :: Utility/./UtilityTests/StreamTest.SetIndentLevel (1609 of 1971) UNSUPPORTED: lldb-shell :: SymbolFile/PDB/ast-restore.test (1610 of 1971) PASS: lldb-unit :: Host/./HostTests/MainLoopTest.ReadObject (1611 of 1971) PASS: lldb-unit :: Utility/./UtilityTests/StringListTest.GetMaxStringLengthIncreasingSize (1612 of 1971) PASS: lldb-unit :: Process/gdb-remote/./ProcessGdbRemoteTests/GDBRemoteCommunicationClientTest.SaveRestoreRegistersNoSuffix (1613 of 1971) UNSUPPORTED: lldb-api :: functionalities/darwin_log/filter/regex/subsystem/TestDarwinLogFilterRegexSubsystem.py (1614 of 1971) PASS: lldb-api :: commands/target/dump-symtab-demangle/TestDumpSymtabDemangle.py (1615 of 1971) PASS: lldb-unit :: Process/gdb-remote/./ProcessGdbRemoteTests/GDBRemoteCommunicationClientTest.GetMemoryRegionInfoInvalidResponse (1616 of 1971) PASS: lldb-shell :: SymbolFile/NativePDB/ast-methods.cpp (1617 of 1971) PASS: lldb-unit :: Symbol/./SymbolTests/TestTypeSystemClang.TestGetTypeClassTypeOf (1618 of 1971) PASS: lldb-unit :: Symbol/./SymbolTests/PostfixExpression.ParseFPOProgram (1619 of 1971) PASS: lldb-api :: lang/cpp/lambdas/TestLambdas.py (1620 of 1971) PASS: lldb-api :: commands/expression/ir-interpreter/TestIRInterpreter.py (1621 of 1971) PASS: lldb-unit :: ScriptInterpreter/Python/./ScriptInterpreterPythonTests/PythonDataObjectsTest.TestPythonString (1622 of 1971) PASS: lldb-shell :: ObjectFile/PECOFF/symbol.yaml (1623 of 1971) PASS: lldb-unit :: Utility/./UtilityTests/LogChannelEnabledTest.LogThread (1624 of 1971) PASS: lldb-api :: commands/expression/test/TestExprs2.py (1625 of 1971) PASS: lldb-api :: commands/expression/invalid-args/TestInvalidArgsExpression.py (1626 of 1971) PASS: lldb-api :: functionalities/data-formatter/data-formatter-python-synth/TestDataFormatterPythonSynth.py (1627 of 1971) PASS: lldb-unit :: Host/./HostTests/SocketTest.UDPConnect (1628 of 1971) PASS: lldb-unit :: UnwindAssembly/x86/./UnwindAssemblyx86Tests/Testx86AssemblyInspectionEngine.TestPopR12 (1629 of 1971) PASS: lldb-unit :: Utility/./UtilityTests/StringListTest.ShiftMove (1630 of 1971) PASS: lldb-unit :: Utility/./UtilityTests/ScalarTest.Promotion (1631 of 1971) PASS: lldb-api :: python_api/watchpoint/watchlocation/TestSetWatchlocation.py (1632 of 1971) PASS: lldb-api :: lang/c/step-target/TestStepTarget.py (1633 of 1971) PASS: lldb-unit :: UnwindAssembly/x86/./UnwindAssemblyx86Tests/Testx86AssemblyInspectionEngine.TestSubRSP (1634 of 1971) PASS: lldb-unit :: SymbolFile/NativePDB/./SymbolFileNativePDBTests/PDBFPOProgramToDWARFExpressionTests.UnknownOp (1635 of 1971) PASS: lldb-shell :: SymbolFile/Breakpad/unwind-via-raSearch.test (1636 of 1971) PASS: lldb-shell :: VSCode/TestOptions.test (1637 of 1971) PASS: lldb-unit :: Utility/./UtilityTests/ProcessInstanceInfo.DumpTable (1638 of 1971) PASS: lldb-unit :: Utility/./UtilityTests/StreamTeeTest.Assignment (1639 of 1971) PASS: lldb-api :: lang/objc/objc-class-method/TestObjCClassMethod.py (1640 of 1971) PASS: lldb-unit :: Utility/./UtilityTests/StreamTest.AddressRange (1641 of 1971) PASS: lldb-api :: functionalities/breakpoint/serialize/TestBreakpointSerialization.py (1642 of 1971) PASS: lldb-shell :: SymbolFile/NativePDB/disassembly.cpp (1643 of 1971) PASS: lldb-unit :: Utility/./UtilityTests/ListenerTest.GetEventImmediate (1644 of 1971) UNSUPPORTED: lldb-shell :: SymbolFile/NativePDB/local-variables.cpp (1645 of 1971) PASS: lldb-api :: functionalities/process_group/TestChangeProcessGroup.py (1646 of 1971) UNSUPPORTED: lldb-shell :: SymbolFile/PDB/vbases.test (1647 of 1971) PASS: lldb-api :: lang/objc/orderedset/TestOrderedSet.py (1648 of 1971) PASS: lldb-api :: functionalities/breakpoint/dummy_target_breakpoints/TestBreakpointsWithNoTargets.py (1649 of 1971) PASS: lldb-api :: commands/expression/radar_9673664/TestExprHelpExamples.py (1650 of 1971) PASS: lldb-api :: lang/cpp/signed_types/TestSignedTypes.py (1651 of 1971) PASS: lldb-api :: types/TestShortType.py (1652 of 1971) PASS: lldb-unit :: ObjectFile/ELF/./ObjectFileELFTests/ObjectFileELFTest.GetModuleSpecifications_EarlySectionHeaders (1653 of 1971) PASS: lldb-api :: functionalities/thread/concurrent_events/TestConcurrentCrashWithSignal.py (1654 of 1971) PASS: lldb-unit :: Utility/./UtilityTests/StringExtractorTest.GetHexU8_Extra (1655 of 1971) PASS: lldb-api :: commands/expression/persistent_types/TestPersistentTypes.py (1656 of 1971) PASS: lldb-api :: functionalities/thread/concurrent_events/TestConcurrentCrashWithWatchpointBreakpointSignal.py (1657 of 1971) UNSUPPORTED: lldb-api :: tools/lldb-server/TestGdbRemote_vContThreads.py (1658 of 1971) PASS: lldb-shell :: ObjectFile/PECOFF/export-dllfunc.yaml (1659 of 1971) PASS: lldb-unit :: Utility/./UtilityTests/RangeDataVector.FindEntryThatContains (1660 of 1971) PASS: lldb-api :: commands/expression/import-std-module/weak_ptr-dbg-info-content/TestDbgInfoContentWeakPtrFromStdModule.py (1661 of 1971) PASS: lldb-api :: functionalities/float-display/TestFloatDisplay.py (1662 of 1971) PASS: lldb-shell :: ObjectFile/ELF/PT_LOAD-overlap.yaml (1663 of 1971) PASS: lldb-unit :: Utility/./UtilityTests/RangeTest.ContainsAddr (1664 of 1971) PASS: lldb-api :: functionalities/mtc/simple/TestMTCSimple.py (1665 of 1971) PASS: lldb-api :: commands/expression/static-initializers/TestStaticInitializers.py (1666 of 1971) PASS: lldb-unit :: Utility/./UtilityTests/AnsiTerminal.Unknown (1667 of 1971) PASS: lldb-unit :: Host/./HostTests/ConnectionFileDescriptorTest.TCPGetURIv4 (1668 of 1971) PASS: lldb-unit :: Utility/./UtilityTests/RangeTest.DoesAdjoinOrIntersect (1669 of 1971) PASS: lldb-unit :: Utility/./UtilityTests/TimeoutTest.Construction (1670 of 1971) PASS: lldb-api :: lang/cpp/char1632_t/TestChar1632T.py (1671 of 1971) PASS: lldb-unit :: Utility/./UtilityTests/OptionsWithRawTest.SingleWordSuffix (1672 of 1971) PASS: lldb-api :: functionalities/thread/concurrent_events/TestConcurrentDelaySignalWatch.py (1673 of 1971) PASS: lldb-unit :: Utility/./UtilityTests/ScalarTest.CastOperations (1674 of 1971) PASS: lldb-unit :: Utility/./UtilityTests/ScalarTest.SetValueFromCString (1675 of 1971) PASS: lldb-unit :: Utility/./UtilityTests/ArchSpecTest.TestParseMachCPUDashSubtypeTripleExtra (1676 of 1971) PASS: lldb-api :: functionalities/thread/concurrent_events/TestConcurrentSignalDelayWatch.py (1677 of 1971) UNSUPPORTED: lldb-shell :: Register/arm-fp-read.test (1678 of 1971) UNSUPPORTED: lldb-shell :: SymbolFile/PDB/udt-layout.test (1679 of 1971) PASS: lldb-api :: functionalities/tail_call_frames/sbapi_support/TestTailCallFrameSBAPI.py (1680 of 1971) PASS: lldb-shell :: Quit/TestQuitExitCode-30.test (1681 of 1971) PASS: lldb-unit :: Utility/./UtilityTests/ArchSpecTest.TestSetTriple (1682 of 1971) PASS: lldb-api :: functionalities/gdb_remote_client/TestStopPCs.py (1683 of 1971) PASS: lldb-api :: commands/platform/basic/TestPlatformPython.py (1684 of 1971) PASS: lldb-api :: tools/lldb-server/register-reading/TestGdbRemoteGPacket.py (1685 of 1971) PASS: lldb-unit :: Utility/./UtilityTests/FileSpecTest.GuessPathStyle (1686 of 1971) PASS: lldb-unit :: Utility/./UtilityTests/DataExtractorTest.GetBitfield (1687 of 1971) UNSUPPORTED: lldb-api :: commands/expression/multiline-navigation/TestMultilineNavigation.py (1688 of 1971) PASS: lldb-api :: lang/cpp/global_operators/TestCppGlobalOperators.py (1689 of 1971) PASS: lldb-api :: python_api/disassemble-raw-data/TestDisassembleRawData.py (1690 of 1971) PASS: lldb-api :: functionalities/optimized_code/TestNoASanExceptionAfterEvalOP_piece.py (1691 of 1971) PASS: lldb-api :: functionalities/object-file/TestImageListMultiArchitecture.py (1692 of 1971) PASS: lldb-unit :: Utility/./UtilityTests/StreamTest.AddressSize (1693 of 1971) PASS: lldb-unit :: Utility/./UtilityTests/LogChannelEnabledTest.LLDB_LOG_ERROR (1694 of 1971) PASS: lldb-api :: commands/expression/function_template_specialization_temp_args/TestFunctionTemplateSpecializationTempArgs.py (1695 of 1971) PASS: lldb-unit :: Expression/./ExpressionTests/CppModuleConfigurationTest.LinuxLocalLibCpp (1696 of 1971) PASS: lldb-unit :: Utility/./UtilityTests/StreamTeeTest.Constructor2Streams (1697 of 1971) PASS: lldb-unit :: Process/gdb-remote/./ProcessGdbRemoteTests/GDBRemoteCommunicationClientTest.SendGetMetaDataPacket (1698 of 1971) PASS: lldb-shell :: SymbolFile/DWARF/find-basic-function.cpp (1699 of 1971) PASS: lldb-unit :: Signals/./SignalsTests/UnixSignalsTest.VersionChange (1700 of 1971) PASS: lldb-shell :: Breakpoint/implicit_const_form_support.test (1701 of 1971) PASS: lldb-api :: lang/c/global_variables/TestGlobalVariables.py (1702 of 1971) PASS: lldb-api :: tools/lldb-server/TestGdbRemote_vCont.py (1703 of 1971) PASS: lldb-unit :: UnwindAssembly/x86/./UnwindAssemblyx86Tests/Testx86AssemblyInspectionEngine.TestSimplei386ugmented (1704 of 1971) PASS: lldb-unit :: Utility/./UtilityTests/GeneratorTest.Create (1705 of 1971) PASS: lldb-unit :: DataFormatter/./LLDBFormatterTests/FormatManagerTests.CompatibleLangs (1706 of 1971) PASS: lldb-shell :: SymbolFile/DWARF/find-inline-method.s (1707 of 1971) PASS: lldb-api :: lang/objc/variadic_methods/TestVariadicMethods.py (1708 of 1971) PASS: lldb-unit :: SymbolFile/NativePDB/./SymbolFileNativePDBTests/PDBFPOProgramToDWARFExpressionTests.InvalidOpUnary (1709 of 1971) PASS: lldb-shell :: Driver/TestSingleQuote.test (1710 of 1971) PASS: lldb-unit :: Utility/./UtilityTests/StringExtractorTest.GetNameColonValueNoColon (1711 of 1971) PASS: lldb-api :: lang/c/enum_types/TestEnumTypes.py (1712 of 1971) PASS: lldb-unit :: Utility/./UtilityTests/ArchSpecTest.TripleComponentsWereSpecified (1713 of 1971) PASS: lldb-unit :: Utility/./UtilityTests/Flags.Clear (1714 of 1971) PASS: lldb-api :: functionalities/data-formatter/data-formatter-ptr-to-array/TestPtrToArrayFormatting.py (1715 of 1971) UNSUPPORTED: lldb-api :: benchmarks/startup/TestStartupDelays.py (1716 of 1971) PASS: lldb-unit :: Utility/./UtilityTests/UriParserTest.Minimal (1717 of 1971) PASS: lldb-api :: lang/objc/single-entry-dictionary/TestObjCSingleEntryDictionary.py (1718 of 1971) PASS: lldb-unit :: Utility/./UtilityTests/TimeoutTest.Format (1719 of 1971) PASS: lldb-unit :: Target/./TargetTests/PathMappingListTest.AbsoluteTests (1720 of 1971) PASS: lldb-unit :: Utility/./UtilityTests/ArgsTest.EscapeLLDBCommandArgument (1721 of 1971) PASS: lldb-unit :: Utility/./UtilityTests/TildeExpressionResolver.ResolveFullPath (1722 of 1971) PASS: lldb-shell :: Unwind/eh-frame-dwarf-unwind.test (1723 of 1971) UNSUPPORTED: lldb-shell :: Register/x86-ymm-read.test (1724 of 1971) PASS: lldb-unit :: Symbol/./SymbolTests/TestClangASTImporter.DeportDeclTagDecl (1725 of 1971) PASS: lldb-unit :: Host/./HostTests/ConnectionFileDescriptorTest.TCPGetURIv6 (1726 of 1971) PASS: lldb-unit :: Host/./HostTests/FileActionTest.Open (1727 of 1971) PASS: lldb-api :: functionalities/multidebugger_commands/TestMultipleDebuggersCommands.py (1728 of 1971) PASS: lldb-api :: commands/expression/radar_9531204/TestPrintfAfterUp.py (1729 of 1971) UNSUPPORTED: lldb-api :: functionalities/data-formatter/data-formatter-stl/libstdcpp/map/TestDataFormatterStdMap.py (1730 of 1971) PASS: lldb-unit :: Utility/./UtilityTests/ConstStringTest.UpdateMangledCounterpart (1731 of 1971) PASS: lldb-shell :: SymbolFile/DWARF/find-function-regex.cpp (1732 of 1971) PASS: lldb-api :: functionalities/data-formatter/data-formatter-stl/libcxx/list/loop/TestDataFormatterLibcxxListLoop.py (1733 of 1971) PASS: lldb-unit :: Utility/./UtilityTests/Flags.Test (1734 of 1971) PASS: lldb-api :: lang/objc/blocks/TestObjCIvarsInBlocks.py (1735 of 1971) PASS: lldb-api :: functionalities/data-formatter/data-formatter-stl/libcxx/optional/TestDataFormatterLibcxxOptional.py (1736 of 1971) PASS: lldb-unit :: Utility/./UtilityTests/StreamTest.Indent (1737 of 1971) PASS: lldb-unit :: Utility/./UtilityTests/OptionsWithRawTest.UnterminatedQuote (1738 of 1971) PASS: lldb-api :: source-manager/TestSourceManager.py (1739 of 1971) PASS: lldb-api :: functionalities/breakpoint/breakpoint_conditions/TestBreakpointConditions.py (1740 of 1971) PASS: lldb-api :: functionalities/data-formatter/data-formatter-stl/libcxx/unordered/TestDataFormatterUnordered.py (1741 of 1971) PASS: lldb-unit :: Core/./LLDBCoreTests/RichManglingContextTest.SwitchProvider (1742 of 1971) PASS: lldb-api :: tools/lldb-server/commandline/TestStubReverseConnect.py (1743 of 1971) PASS: lldb-api :: functionalities/data-formatter/data-formatter-synthval/TestDataFormatterSynthVal.py (1744 of 1971) PASS: lldb-unit :: SymbolFile/DWARF/./SymbolFileDWARFTests/SymbolFileDWARFTests.TestAbbrevOutOfOrder (1745 of 1971) PASS: lldb-unit :: Language/Highlighting/./HighlighterTests/HighlighterTest.ClangStringLiterals (1746 of 1971) PASS: lldb-api :: api/check_public_api_headers/TestPublicAPIHeaders.py (1747 of 1971) PASS: lldb-shell :: SymbolFile/DWARF/array-sizes.s (1748 of 1971) PASS: lldb-shell :: SymbolFile/DWARF/DW_AT_low_pc-addrx.s (1749 of 1971) PASS: lldb-unit :: Process/gdb-remote/./ProcessGdbRemoteTests/GDBRemoteCommunicationClientTest.ReadRegister (1750 of 1971) PASS: lldb-shell :: Driver/TestFile.test (1751 of 1971) UNSUPPORTED: lldb-shell :: Register/x86-ymm-write.test (1752 of 1971) PASS: lldb-shell :: SymbolFile/DWARF/apple-index-is-used.cpp (1753 of 1971) PASS: lldb-api :: functionalities/data-formatter/summary-string-onfail/Test-rdar-9974002.py (1754 of 1971) PASS: lldb-api :: commands/expression/call-throws/TestCallThatThrows.py (1755 of 1971) PASS: lldb-api :: driver/batch_mode/TestBatchMode.py (1756 of 1971) PASS: lldb-unit :: Utility/./UtilityTests/ReproducerTest.SetReplay (1757 of 1971) PASS: lldb-shell :: SymbolFile/DWARF/debug_line-relative_path.s (1758 of 1971) PASS: lldb-api :: functionalities/tail_call_frames/ambiguous_tail_call_seq2/TestAmbiguousTailCallSeq2.py (1759 of 1971) PASS: lldb-unit :: Process/gdb-remote/./ProcessGdbRemoteTests/GDBRemoteCommunicationTest.ReadPacket_checksum (1760 of 1971) PASS: lldb-api :: api/command-return-object/TestSBCommandReturnObject.py (1761 of 1971) PASS: lldb-unit :: Utility/./UtilityTests/RangeTest.LessThan (1762 of 1971) PASS: lldb-unit :: Utility/./UtilityTests/OptionsWithRawTest.QuotedSuffix (1763 of 1971) PASS: lldb-api :: lang/objcxx/objcxx-ivar-vector/TestIvarVector.py (1764 of 1971) PASS: lldb-api :: functionalities/data-formatter/data-formatter-objc/cmtime/TestDataFormatterCMTime.py (1765 of 1971) PASS: lldb-unit :: Language/Highlighting/./HighlighterTests/HighlighterTest.ClangOperators (1766 of 1971) PASS: lldb-unit :: Process/gdb-remote/./ProcessGdbRemoteTests/GDBRemoteClientBaseTest.SendContinueAndWait (1767 of 1971) PASS: lldb-api :: functionalities/var_path/TestVarPath.py (1768 of 1971) PASS: lldb-unit :: Utility/./UtilityTests/StreamTest.ShiftOperatorPtr (1769 of 1971) PASS: lldb-unit :: Utility/./UtilityTests/GeneratorTest.GetOrCreate (1770 of 1971) PASS: lldb-unit :: Utility/./UtilityTests/AnsiTerminal.WhiteSpace (1771 of 1971) PASS: lldb-unit :: Utility/./UtilityTests/StringListTest.GetMaxStringLengthEmpty (1772 of 1971) PASS: lldb-unit :: Utility/./UtilityTests/ArgsTest.TestSingleQuotedArgWithSpace (1773 of 1971) PASS: lldb-shell :: SymbolFile/NativePDB/global-classes.cpp (1774 of 1971) PASS: lldb-api :: functionalities/plugins/python_os_plugin/TestPythonOSPlugin.py (1775 of 1971) PASS: lldb-unit :: Utility/./UtilityTests/StreamTeeTest.AppendStream (1776 of 1971) PASS: lldb-unit :: Utility/./UtilityTests/StringExtractorTest.GetHexBytesAvail (1777 of 1971) PASS: lldb-api :: commands/apropos/with-process/TestAproposWithProcess.py (1778 of 1971) PASS: lldb-api :: functionalities/set-data/TestSetData.py (1779 of 1971) PASS: lldb-unit :: Host/./HostTests/SocketTest.DomainGetConnectURI (1780 of 1971) PASS: lldb-unit :: Utility/./UtilityTests/DataExtractorTest.GetCStrAtEnd (1781 of 1971) PASS: lldb-shell :: SymbolFile/NativePDB/function-types-classes.cpp (1782 of 1971) PASS: lldb-api :: tools/lldb-server/TestGdbRemoteThreadsInStopReply.py (1783 of 1971) PASS: lldb-unit :: Utility/./UtilityTests/RegisterValueTest.GetSet8 (1784 of 1971) PASS: lldb-api :: python_api/name_lookup/TestNameLookup.py (1785 of 1971) PASS: lldb-unit :: Host/./HostTests/MainLoopTest.DetectsEOF (1786 of 1971) UNSUPPORTED: lldb-shell :: Register/x86-zmm-write.test (1787 of 1971) PASS: lldb-api :: functionalities/thread/concurrent_events/TestConcurrentTwoBreakpointThreads.py (1788 of 1971) PASS: lldb-api :: functionalities/gdb_remote_client/TestRestartBug.py (1789 of 1971) PASS: lldb-unit :: Utility/./UtilityTests/OptionsWithRawTest.EmptyInput (1790 of 1971) PASS: lldb-unit :: Expression/./ExpressionTests/DiagnosticManagerTest.GetStringSeverityLabels (1791 of 1971) PASS: lldb-unit :: Platform/./LLDBPlatformTests/PlatformDarwinTest.TestParseVersionBuildDir (1792 of 1971) PASS: lldb-api :: functionalities/signal/handle-abrt/TestHandleAbort.py (1793 of 1971) PASS: lldb-unit :: ObjectFile/ELF/./ObjectFileELFTests/ObjectFileELFTest.GetSymtab_NoSymEntryPointArmThumbAddressClass (1794 of 1971) PASS: lldb-api :: functionalities/gdb_remote_client/TestNestedRegDefinitions.py (1795 of 1971) PASS: lldb-api :: functionalities/recursion/TestValueObjectRecursion.py (1796 of 1971) PASS: lldb-unit :: Process/gdb-remote/./ProcessGdbRemoteTests/GDBRemoteCommunicationClientTest.SendGetDataPacket (1797 of 1971) PASS: lldb-unit :: Symbol/./SymbolTests/Type.GetTypeScopeAndBasename (1798 of 1971) PASS: lldb-unit :: Process/gdb-remote/./ProcessGdbRemoteTests/GDBRemoteCommunicationServerTest.SendErrorResponse_ErrorNumber (1799 of 1971) PASS: lldb-api :: functionalities/gdb_remote_client/TestThreadSelectionBug.py (1800 of 1971) PASS: lldb-shell :: SymbolFile/DWARF/find-basic-variable.cpp (1801 of 1971) PASS: lldb-unit :: Utility/./UtilityTests/BinaryStreamTest.PutULEB128ThreeBytes (1802 of 1971) PASS: lldb-shell :: SymbolFile/DWARF/find-basic-namespace.cpp (1803 of 1971) PASS: lldb-unit :: Utility/./UtilityTests/ArgsTest.TestTrailingBackslash (1804 of 1971) PASS: lldb-unit :: Process/gdb-remote/./ProcessGdbRemoteTests/GDBRemoteCommunicationClientTest.SendStopTracePacket (1805 of 1971) PASS: lldb-unit :: Host/./HostTests/NativeProcessProtocolTest.ReadCStringFromMemory_MaxSize (1806 of 1971) PASS: lldb-api :: commands/expression/entry-bp/TestExprEntryBP.py (1807 of 1971) PASS: lldb-api :: functionalities/data-formatter/data-formatter-stl/libcxx/vector/TestDataFormatterLibcxxVector.py (1808 of 1971) PASS: lldb-unit :: Interpreter/./InterpreterTests/OptionArgParserTest.toBoolean (1809 of 1971) PASS: lldb-unit :: ScriptInterpreter/Python/./ScriptInterpreterPythonTests/PythonDataObjectsTest.TestPythonListToStructuredList (1810 of 1971) PASS: lldb-unit :: Utility/./UtilityTests/Predicate.WaitForValueNotEqualTo (1811 of 1971) UNSUPPORTED: lldb-shell :: Register/x86-gp-write.test (1812 of 1971) PASS: lldb-unit :: Utility/./UtilityTests/StringListTest.AppendListCStringArrayEmpty (1813 of 1971) PASS: lldb-api :: lang/objc/print-obj/TestPrintObj.py (1814 of 1971) UNSUPPORTED: lldb-api :: functionalities/exec/TestExec.py (1815 of 1971) PASS: lldb-unit :: Utility/./UtilityTests/FileSpecTest.OperatorBool (1816 of 1971) PASS: lldb-unit :: Process/minidump/./LLDBMinidumpTests/MinidumpParserTest.GetPidWindows (1817 of 1971) UNSUPPORTED: lldb-api :: functionalities/gdb_remote_client/TestWasm.py (1818 of 1971) PASS: lldb-unit :: Process/gdb-remote/./ProcessGdbRemoteTests/GDBRemoteCommunicationClientTest.GetMemoryRegionInfo (1819 of 1971) PASS: lldb-shell :: SymbolFile/DWARF/dwp-separate-debug-file.cpp (1820 of 1971) PASS: lldb-unit :: Utility/./UtilityTests/StreamTest.PutCharNull (1821 of 1971) PASS: lldb-unit :: Utility/./UtilityTests/StringListTest.JoinMultiCharSeparator (1822 of 1971) PASS: lldb-api :: python_api/formatters/TestFormattersSBAPI.py (1823 of 1971) PASS: lldb-api :: commands/expression/namespace_local_var_same_name_cpp_and_c/TestNamespaceLocalVarSameNameCppAndC.py (1824 of 1971) PASS: lldb-unit :: Utility/./UtilityTests/FileSpecTest.EqualSeparator (1825 of 1971) PASS: lldb-api :: lang/cpp/bitfields/TestCppBitfields.py (1826 of 1971) PASS: lldb-api :: lang/objc/modules-non-objc-target/TestObjCModulesNonObjCTarget.py (1827 of 1971) PASS: lldb-unit :: Utility/./UtilityTests/StreamTeeTest.SetStreamAtIndexOverwrite (1828 of 1971) PASS: lldb-api :: functionalities/data-formatter/data-formatter-disabling/TestDataFormatterDisabling.py (1829 of 1971) PASS: lldb-api :: functionalities/breakpoint/breakpoint_command/TestRegexpBreakCommand.py (1830 of 1971) PASS: lldb-unit :: Utility/./UtilityTests/RegularExpression.Invalid (1831 of 1971) PASS: lldb-unit :: ObjectFile/Breakpad/./ObjectFileBreakpadTests/FileRecord.parse (1832 of 1971) PASS: lldb-api :: lang/cpp/operators/TestCppOperators.py (1833 of 1971) PASS: lldb-unit :: UnwindAssembly/x86/./UnwindAssemblyx86Tests/Testx86AssemblyInspectionEngine.TestReturnDetect (1834 of 1971) PASS: lldb-unit :: Utility/./UtilityTests/StringListTest.Clear (1835 of 1971) PASS: lldb-api :: commands/expression/codegen-crash-typedefdecl-not-in_declcontext/TestCodegenCrashTypedefDeclNotInDeclContext.py (1836 of 1971) PASS: lldb-shell :: Reproducer/TestMultipleTargets.test (1837 of 1971) PASS: lldb-api :: types/TestDoubleTypesExpr.py (1838 of 1971) PASS: lldb-api :: lang/objc/objc-runtime-ivars/TestRuntimeIvars.py (1839 of 1971) PASS: lldb-unit :: Utility/./UtilityTests/OptionsWithRawTest.ArgsButNoDelimiter (1840 of 1971) PASS: lldb-unit :: Utility/./UtilityTests/Flags.AnySet (1841 of 1971) PASS: lldb-api :: lang/cpp/chained-calls/TestCppChainedCalls.py (1842 of 1971) PASS: lldb-shell :: ScriptInterpreter/Python/scripted_breakpoint.test (1843 of 1971) PASS: lldb-unit :: Utility/./UtilityTests/StringLexerTest.AdvanceIf (1844 of 1971) PASS: lldb-shell :: ObjectFile/PECOFF/invalid-export-table.yaml (1845 of 1971) PASS: lldb-shell :: ObjectFile/ELF/netbsd-core-amd64.test (1846 of 1971) PASS: lldb-api :: functionalities/data-formatter/data-formatter-synthtype/TestDataFormatterSynthType.py (1847 of 1971) PASS: lldb-api :: lang/objc/objc++/TestObjCXX.py (1848 of 1971) PASS: lldb-unit :: Utility/./UtilityTests/CompletionRequest.FakeLastArg (1849 of 1971) UNSUPPORTED: lldb-api :: functionalities/asan/TestReportData.py (1850 of 1971) PASS: lldb-unit :: Utility/./UtilityTests/CompletionRequest.TryCompleteCurrentArgGood (1851 of 1971) PASS: lldb-unit :: Utility/./UtilityTests/UriParserTest.SchemeHostSeparator (1852 of 1971) PASS: lldb-api :: functionalities/data-formatter/format-propagation/TestFormatPropagation.py (1853 of 1971) PASS: lldb-api :: functionalities/gdb_remote_client/TestGDBRemoteLoad.py (1854 of 1971) PASS: lldb-shell :: ObjectFile/ELF/PT_LOAD-overlap-section.yaml (1855 of 1971) PASS: lldb-api :: functionalities/gdb_remote_client/TestNoGPacketSupported.py (1856 of 1971) XFAIL: lldb-shell :: Register/x86-64-write.test (1857 of 1971) PASS: lldb-api :: functionalities/inferior-crashing/TestInferiorCrashingStep.py (1858 of 1971) PASS: lldb-unit :: ObjectFile/Breakpad/./ObjectFileBreakpadTests/PublicRecord.parse (1859 of 1971) PASS: lldb-api :: python_api/sbstructureddata/TestStructuredDataAPI.py (1860 of 1971) PASS: lldb-unit :: Utility/./UtilityTests/BinaryStreamTest.PutULEB128EightBytes (1861 of 1971) PASS: lldb-unit :: Utility/./UtilityTests/LogChannelEnabledTest.log_options (1862 of 1971) PASS: lldb-api :: macosx/DBGSourcePathRemapping/TestDSYMSourcePathRemapping.py (1863 of 1971) PASS: lldb-shell :: ObjectFile/ELF/section-overlap.yaml (1864 of 1971) PASS: lldb-unit :: Symbol/./SymbolTests/TestTypeSystemClang.TestGetTypeClassDeclType (1865 of 1971) PASS: lldb-api :: lang/objc/objc_direct-methods/TestObjCDirectMethods.py (1866 of 1971) PASS: lldb-unit :: Process/gdb-remote/./ProcessGdbRemoteTests/GDBRemoteClientBaseTest.SendContinueDelegateStructuredDataReceipt (1867 of 1971) PASS: lldb-unit :: Utility/./UtilityTests/SubsystemRAIITest.NormalSubsystem (1868 of 1971) PASS: lldb-unit :: Language/Highlighting/./HighlighterTests/HighlighterTest.ClangCursorPos (1869 of 1971) PASS: lldb-api :: functionalities/archives/TestBSDArchives.py (1870 of 1971) PASS: lldb-unit :: Symbol/./SymbolTests/TestTypeSystemClang.TestDisplayNameEmpty (1871 of 1971) PASS: lldb-unit :: ObjectFile/Breakpad/./ObjectFileBreakpadTests/ModuleRecord.parse (1872 of 1971) PASS: lldb-unit :: Utility/./UtilityTests/NameMatchesTest.Ignore (1873 of 1971) PASS: lldb-unit :: Utility/./UtilityTests/BinaryStreamTest.PutSLEB128SixBytes (1874 of 1971) UNSUPPORTED: lldb-shell :: SymbolFile/PDB/typedefs.test (1875 of 1971) PASS: lldb-unit :: UnwindAssembly/x86/./UnwindAssemblyx86Tests/Testx86AssemblyInspectionEngine.TestPopESI (1876 of 1971) PASS: lldb-unit :: Utility/./UtilityTests/StringExtractorTest.GetHexU8_InvalidHex (1877 of 1971) PASS: lldb-unit :: Process/minidump/./LLDBMinidumpTests/MinidumpParserTest.GetThreadContext_x86_32_wow64 (1878 of 1971) PASS: lldb-api :: tools/lldb-vscode/stackTrace/TestVSCode_stackTrace.py (1879 of 1971) PASS: lldb-api :: functionalities/stats_api/TestStatisticsAPI.py (1880 of 1971) PASS: lldb-shell :: SymbolFile/NativePDB/function-types-builtins.cpp (1881 of 1971) PASS: lldb-unit :: Process/minidump/./LLDBMinidumpTests/MinidumpParserTest.GetThreadContext_x86_32 (1882 of 1971) PASS: lldb-unit :: Utility/./UtilityTests/StreamTest.PutHex64ByteOrderLittle (1883 of 1971) PASS: lldb-api :: functionalities/data-formatter/nsarraysynth/TestNSArraySynthetic.py (1884 of 1971) PASS: lldb-api :: functionalities/data-formatter/data-formatter-objc/nsindexpath/TestDataFormatterNSIndexPath.py (1885 of 1971) UNSUPPORTED: lldb-api :: functionalities/longjmp/TestLongjmp.py (1886 of 1971) PASS: lldb-api :: python_api/value/empty_class/TestValueAPIEmptyClass.py (1887 of 1971) UNSUPPORTED: lldb-api :: functionalities/data-formatter/data-formatter-stl/libstdcpp/smart_ptr/TestDataFormatterStdSmartPtr.py (1888 of 1971) PASS: lldb-api :: lang/objc/objc-super/TestObjCSuper.py (1889 of 1971) PASS: lldb-api :: python_api/class_members/TestSBTypeClassMembers.py (1890 of 1971) PASS: lldb-unit :: Process/gdb-remote/./ProcessGdbRemoteTests/GDBRemoteClientBaseTest.InterruptNoResponse (1891 of 1971) PASS: lldb-api :: functionalities/data-formatter/data-formatter-advanced/TestDataFormatterAdv.py (1892 of 1971) PASS: lldb-unit :: Symbol/./SymbolTests/TestTypeSystemClang.TestUnifyAccessSpecifiers (1893 of 1971) PASS: lldb-unit :: Utility/./UtilityTests/StringListTest.ForRangeEmpty (1894 of 1971) PASS: lldb-api :: commands/expression/po_verbosity/TestPoVerbosity.py (1895 of 1971) PASS: lldb-api :: lang/c/modules/TestCModules.py (1896 of 1971) PASS: lldb-unit :: Utility/./UtilityTests/StringListTest.CopyListEmpty (1897 of 1971) PASS: lldb-api :: functionalities/gdb_remote_client/TestTargetXMLArch.py (1898 of 1971) PASS: lldb-unit :: Utility/./UtilityTests/UUIDTest.SetFromStringRef (1899 of 1971) PASS: lldb-unit :: Utility/./UtilityTests/RecordReplayTest.InstrumentedBar (1900 of 1971) PASS: lldb-api :: lang/cpp/inlines/TestInlines.py (1901 of 1971) PASS: lldb-unit :: Target/./TargetTests/StackFrameRecognizerTest.NullModuleRegex (1902 of 1971) PASS: lldb-unit :: Utility/./UtilityTests/Flags.IsClear (1903 of 1971) PASS: lldb-api :: functionalities/memory/find/TestMemoryFind.py (1904 of 1971) PASS: lldb-unit :: Expression/./ExpressionTests/DiagnosticManagerTest.GetStringMultipleDiags (1905 of 1971) PASS: lldb-unit :: Expression/./ExpressionTests/DiagnosticManagerTest.AppendMessageSubsequentDiags (1906 of 1971) UNSUPPORTED: lldb-api :: functionalities/data-formatter/data-formatter-stl/libstdcpp/string/TestDataFormatterStdString.py (1907 of 1971) PASS: lldb-unit :: Utility/./UtilityTests/StringExtractorTest.GetHexU8_Underflow2 (1908 of 1971) PASS: lldb-unit :: Utility/./UtilityTests/OptionsWithRawTest.EmptySuffix (1909 of 1971) PASS: lldb-api :: functionalities/thread/concurrent_events/TestConcurrentCrashWithBreak.py (1910 of 1971) PASS: lldb-api :: lang/c/strings/TestCStrings.py (1911 of 1971) PASS: lldb-api :: lang/cpp/char8_t/TestCxxChar8_t.py (1912 of 1971) PASS: lldb-api :: lang/cpp/auto/TestCPPAuto.py (1913 of 1971) PASS: lldb-unit :: Process/gdb-remote/./ProcessGdbRemoteTests/GDBRemoteCommunicationClientTest.GetQOffsets (1914 of 1971) PASS: lldb-unit :: Process/gdb-remote/./ProcessGdbRemoteTests/GDBRemoteCommunicationClientTest.TestPacketSpeedJSON (1915 of 1971) PASS: lldb-unit :: Host/./HostTests/FileSystemTest.EnumerateDirectory (1916 of 1971) PASS: lldb-unit :: Symbol/./SymbolTests/TestTypeSystemClang.TestGetTypeClassTypeOfExpr (1917 of 1971) PASS: lldb-unit :: Utility/./UtilityTests/StringListTest.AppendStringCString (1918 of 1971) PASS: lldb-unit :: Expression/./ExpressionTests/ClangExpressionDeclMapTest.TestUnknownIdentifierLookup (1919 of 1971) UNSUPPORTED: lldb-api :: functionalities/data-formatter/data-formatter-stl/libstdcpp/unique_ptr/TestDataFormatterStdUniquePtr.py (1920 of 1971) UNSUPPORTED: lldb-shell :: Register/x86-64-gp-write.test (1921 of 1971) PASS: lldb-api :: python_api/watchpoint/condition/TestWatchpointConditionAPI.py (1922 of 1971) UNSUPPORTED: lldb-api :: commands/expression/multiline-completion/TestMultilineCompletion.py (1923 of 1971) PASS: lldb-shell :: Reproducer/TestCrash.test (1924 of 1971) PASS: lldb-api :: python_api/symbol-context/two-files/TestSymbolContextTwoFiles.py (1925 of 1971) UNSUPPORTED: lldb-api :: python_api/event/TestEvents.py (1926 of 1971) PASS: lldb-unit :: Symbol/./SymbolTests/PostfixExpression.ParseOneExpression (1927 of 1971) PASS: lldb-unit :: Symbol/./SymbolTests/TestTypeSystemClang.TestGetBasicTypeFromName (1928 of 1971) PASS: lldb-api :: commands/frame/diagnose/array/TestArray.py (1929 of 1971) PASS: lldb-api :: tools/lldb-server/TestGdbRemoteAttach.py (1930 of 1971) PASS: lldb-api :: functionalities/data-formatter/parray/TestPrintArray.py (1931 of 1971) PASS: lldb-api :: commands/expression/class_template_specialization_empty_pack/TestClassTemplateSpecializationParametersHandling.py (1932 of 1971) UNSUPPORTED: lldb-api :: lang/cpp/printf/TestPrintf.py (1933 of 1971) PASS: lldb-shell :: Breakpoint/debug_rnglist_basic.test (1934 of 1971) PASS: lldb-shell :: Quit/TestQuitExitCode30.test (1935 of 1971) PASS: lldb-api :: functionalities/thread/concurrent_events/TestConcurrentSignalNWatchNBreak.py (1936 of 1971) PASS: lldb-api :: commands/expression/two-files/TestObjCTypeQueryFromOtherCompileUnit.py (1937 of 1971) PASS: lldb-unit :: Utility/./UtilityTests/ScalarTest.Division (1938 of 1971) PASS: lldb-unit :: Language/Highlighting/./HighlighterTests/HighlighterTest.ClangScalarLiterals (1939 of 1971) PASS: lldb-unit :: Symbol/./SymbolTests/TestTypeSystemClang.TestConvertAccessTypeToAccessSpecifier (1940 of 1971) PASS: lldb-shell :: Breakpoint/debug_rnglist_rlestartend.test (1941 of 1971) PASS: lldb-shell :: Heap/heap-cstr.test (1942 of 1971) PASS: lldb-api :: lang/objc/foundation/TestSymbolTable.py (1943 of 1971) PASS: lldb-unit :: UnwindAssembly/x86/./UnwindAssemblyx86Tests/Testx86AssemblyInspectionEngine.TestPopR15 (1944 of 1971) PASS: lldb-api :: tools/lldb-server/commandline/TestStubSetSID.py (1945 of 1971) PASS: lldb-shell :: SymbolFile/DWARF/dir-separator-windows.s (1946 of 1971) PASS: lldb-api :: python_api/process/io/TestProcessIO.py (1947 of 1971) PASS: lldb-unit :: Utility/./UtilityTests/ScalarTest.ComparisonFloat (1948 of 1971) PASS: lldb-unit :: SymbolFile/NativePDB/./SymbolFileNativePDBTests/PDBFPOProgramToDWARFExpressionTests.DependencyChain (1949 of 1971) PASS: lldb-api :: commands/command/nested_alias/TestNestedAlias.py (1950 of 1971) PASS: lldb-unit :: Utility/./UtilityTests/StreamTest.PutHex32ByteOrderLittle (1951 of 1971) PASS: lldb-unit :: Core/./LLDBCoreTests/RichManglingContextTest.FromCxxMethodName (1952 of 1971) PASS: lldb-unit :: Utility/./UtilityTests/RangeTest.ContainsAddrInvalid (1953 of 1971) PASS: lldb-api :: python_api/exprpath_synthetic/TestExprPathSynthetic.py (1954 of 1971) PASS: lldb-api :: functionalities/thread/concurrent_events/TestConcurrentBreakpointDelayBreakpointOneSignal.py (1955 of 1971) PASS: lldb-unit :: Process/minidump/./LLDBMinidumpTests/MinidumpParserTest.GetExceptionStream (1956 of 1971) PASS: lldb-shell :: Reproducer/TestCaptureEnvOverride.test (1957 of 1971) PASS: lldb-api :: functionalities/breakpoint/address_breakpoints/TestAddressBreakpoints.py (1958 of 1971) PASS: lldb-api :: functionalities/data-formatter/dump_dynamic/TestDumpDynamic.py (1959 of 1971) PASS: lldb-api :: commands/expression/diagnostics/TestExprDiagnostics.py (1960 of 1971) PASS: lldb-shell :: ObjectFile/ELF/duplicate-section.yaml (1961 of 1971) PASS: lldb-unit :: Utility/./UtilityTests/BinaryStreamTest.PutULEB128Zero (1962 of 1971) PASS: lldb-unit :: Utility/./UtilityTests/RangeTest.Equal (1963 of 1971) PASS: lldb-api :: lang/cpp/exceptions/TestCPPExceptionBreakpoints.py (1964 of 1971) PASS: lldb-api :: python_api/lldbutil/process/TestPrintStackTraces.py (1965 of 1971) UNSUPPORTED: lldb-shell :: Register/x86-64-xmm16-write.test (1966 of 1971) PASS: lldb-unit :: Host/./HostTests/FileSystemTest.GetByteSize (1967 of 1971) PASS: lldb-api :: lang/cpp/stl/TestSTL.py (1968 of 1971) PASS: lldb-api :: commands/expression/fixits/TestFixIts.py (1969 of 1971) PASS: lldb-api :: types/TestFloatTypesExpr.py (1970 of 1971) PASS: lldb-api :: lang/cpp/namespace/TestNamespace.py (1971 of 1971)

Hide Details

Testing Time: 4374.85s ******************** Failing Tests (3): lldb-api :: python_api/thread/TestThreadAPI.py lldb-api :: lang/objc/ptr_refs/TestPtrRefsObjC.py lldb-api :: functionalities/ptr_refs/TestPtrRefs.py

Hide Details

Hide Details

Slowest Tests: -------------------------------------------------------------------------- 91.66s: lldb-api :: functionalities/gdb_remote_client/TestWasm.py 96.25s: lldb-api :: commands/settings/TestSettings.py 99.01s: lldb-api :: types/TestLongTypes.py 107.89s: lldb-api :: lang/objcxx/class-name-clash/TestNameClash.py 112.73s: lldb-api :: lang/objc/foundation/TestObjCMethodsNSError.py 113.80s: lldb-api :: lang/objc/objc-new-syntax/TestObjCNewSyntaxArray.py 114.74s: lldb-api :: lang/objc/objc-new-syntax/TestObjCNewSyntaxDictionary.py 115.63s: lldb-api :: lang/objc/foundation/TestObjCMethodsString.py 120.72s: lldb-api :: tools/lldb-server/TestGdbRemote_qThreadStopInfo.py 131.03s: lldb-api :: types/TestLongTypesExpr.py 136.65s: lldb-api :: lang/objc/exceptions/TestObjCExceptions.py 137.71s: lldb-api :: lang/objc/real-definition/TestRealDefinition.py 151.26s: lldb-api :: lang/objc/objc-new-syntax/TestObjCNewSyntaxLiteral.py 164.37s: lldb-api :: lang/cpp/namespace/TestNamespaceLookup.py 219.00s: lldb-api :: lang/objc/hidden-ivars/TestHiddenIvars.py 227.67s: lldb-api :: lang/objc/foundation/TestObjCMethods.py 248.89s: lldb-api :: tools/lldb-server/TestGdbRemoteThreadsInStopReply.py 254.04s: lldb-api :: api/multithreaded/TestMultithreaded.py 274.61s: lldb-api :: lang/cpp/enum_types/TestCPP11EnumTypes.py 370.63s: lldb-api :: tools/lldb-server/TestLldbGdbServer.py

Hide Details

Tests Times: -------------------------------------------------------------------------- [ Range ] :: [ Percentage ] :: [ Count ] -------------------------------------------------------------------------- [ 0s, 20s) :: [********************************** ] :: [1720/1971] [ 20s, 40s) :: [** ] :: [ 122/1971] [ 40s, 60s) :: [* ] :: [ 79/1971] [ 60s, 80s) :: [ ] :: [ 22/1971] [ 80s,100s) :: [ ] :: [ 10/1971] [100s,120s) :: [ ] :: [ 6/1971] [120s,140s) :: [ ] :: [ 2/1971] [140s,160s) :: [ ] :: [ 3/1971] [160s,180s) :: [ ] :: [ 1/1971] [180s,200s) :: [ ] :: [ 0/1971] [200s,220s) :: [ ] :: [ 0/1971] [220s,240s) :: [ ] :: [ 2/1971] [240s,260s) :: [ ] :: [ 1/1971] [260s,280s) :: [ ] :: [ 1/1971] [280s,300s) :: [ ] :: [ 1/1971] [300s,320s) :: [ ] :: [ 0/1971] [320s,340s) :: [ ] :: [ 0/1971] [340s,360s) :: [ ] :: [ 0/1971] [360s,380s) :: [ ] :: [ 1/1971] Expected Passes : 1796 Expected Failures : 6 Unsupported Tests : 166 Unexpected Failures: 3 FAILED: tools/lldb/test/CMakeFiles/check-lldb-lit cd /Users/buildslave/jenkins/workspace/lldb-cmake-sanitized/lldb-build/tools/lldb/test && /usr/local/bin/python /Users/buildslave/jenkins/workspace/lldb-cmake-sanitized/lldb-build/./bin/llvm-lit -v --time-tests --shuffle --xunit-xml-output=/Users/buildslave/jenkins/workspace/lldb-cmake-sanitized/test/results.xml -v -j 4 --timeout 1200 /Users/buildslave/jenkins/workspace/lldb-cmake-sanitized/lldb-build/tools/lldb/test ninja: build stopped: subcommand failed. Command failed: Command '['/usr/bin/env', 'TERM=vt100', '/usr/local/bin/ninja', '-v', 'check-lldb']' returned non-zero exit status 1. Command: ['/usr/bin/env', 'TERM=vt100', '/usr/local/bin/ninja', '-v', 'check-lldb'] [Pipeline] } [Pipeline] // timeout [Pipeline] } [Pipeline] // stage [Pipeline] stage [Pipeline] { (Declarative: Post Actions) [Pipeline] scanForIssues [Clang (LLVM based)] Sleeping for 5 seconds due to JENKINS-32191... [Clang (LLVM based)] Parsing console log (workspace: '/Users/buildslave/jenkins/workspace/lldb-cmake-sanitized') [Clang (LLVM based)] Successfully parsed console log [Clang (LLVM based)] -> found 0 issues (skipped 0 duplicates) [Clang (LLVM based)] Skipping post processing [Clang (LLVM based)] No filter has been set, publishing all 0 issues [Pipeline] junit Recording test results [Pipeline] } [Pipeline] // stage [Pipeline] } [Pipeline] // withEnv [Pipeline] } [Pipeline] // node [Pipeline] End of Pipeline ERROR: script returned exit code 1 Finished: FAILURE